##TITLE=1H_DE-92k2_d6
 200.13MHz, DMSO-d6,
 8 sc
 
 6.5.2025
##JCAMPDX= 6.0         $$ Bruker NMR JCAMP-DX V2.0
##DATA TYPE= NMR FID
##DATA CLASS= NTUPLES
##ORIGIN= UXNMR, Bruker Analytische Messtechnik GmbH
##OWNER= pz
$$ XWIN-NMR		Version 3.5
$$ Tue May  6 13:48:53 2025 Russian Standard Time (UT+4h)  she@DPX200
##.OBSERVE FREQUENCY= 200.1313
##.OBSERVE NUCLEUS= ^1H
##.DELAY= (6, 6)
##.ACQUISITION MODE= SIMULTANEOUS
##.ACQUISITION SCHEME= undefined
##.AVERAGES= 8
##.DIGITISER RES= 18
##SPECTROMETER/DATA SYSTEM= spect
##.PULSE SEQUENCE= zg30
##.SOLVENT NAME= DMSO
##.SHIFT REFERENCE= (INTERNAL, DMSO, 0, 14.3821)
##AUDIT TRAIL= $$ (NUMBER, WHEN, WHO, WHERE, WHAT)
$$ ##TITLE= Audit trail, XWIN-NMR		Version 3.5
$$ ##JCAMPDX= 5.01
$$ ##ORIGIN= Bruker BioSpin GmbH
$$ ##OWNER= she
$$ F:/spectra/data/she/nmr/H-C/1/audita.txt
$$ ##AUDIT TRAIL=  $$ (NUMBER, WHEN, WHO, WHERE, WHAT)
(   1,<2025-05-06 13:47:42.12 +0400>,<she>,<DPX200>,
      <created by zg, POWCHK disabled, PULCHK disabled
       configuration hash MD5:
       00 E9 B6 7A A2 85 ED C7 34 08 36 98 17 FE 4E 26
       data hash MD5: 16K
       F8 04 C9 D8 23 8C 63 08 91 7A 94 27 F6 56 3D 28>)
$$ ##END=
$$ 
$$ hash MD5
$$ 59 3C BB E5 A6 68 14 91 D7 7A 89 19 9B E3 7E 07
##$RELAX= 
##$RELAX= 
##$RELAX= 
##$RELAX= 
##$RELAX= 
##$RELAX= 
$$ Bruker specific parameters
$$ --------------------------
##$DU= <F:/spectra>
##$EXPNO= 1
##$NAME= <H-C>
##$PROCNO= 1
##$TYPE= <nmr>
##$USER= <she>
##$AMP= (0..31)
100 100 100 100 100 100 100 100 100 100 100 100 100 100 100 100 100 100 
100 100 100 100 100 100 100 100 100 100 100 100 100 100 
##$AQSEQ= 0
##$AQ_mod= 1
##$AUNM= <au_zg>
##$AUTOPOS= <>
##$BF1= 200.13
##$BF2= 200.13
##$BF3= 200.13
##$BF4= 200.13
##$BF5= 200.13
##$BF6= 200.13
##$BF7= 200.13
##$BF8= 200.13
##$BYTORDA= 1
##$CFDGTYP= 0
##$CFRGTYP= 5
##$CHEMSTR= <none>
##$CNST= (0..31)
1 1 145 1 1 1 1 1 1 1 1 1 1 1 1 1 1 1 1 1 1 1 1 1 1 1 1 1 1 1 1 1 
##$CPDPRG= <>
##$CPDPRG1= <>
##$CPDPRG2= <>
##$CPDPRG3= <>
##$CPDPRG4= <mlev>
##$CPDPRG5= <mlev>
##$CPDPRG6= <mlev>
##$CPDPRG7= <mlev>
##$CPDPRG8= <mlev>
##$CPDPRGB= <>
##$CPDPRGT= <>
##$D= (0..31)
0 0.7 0 0 0 0 0 0 0 0 0 0.03 0 0 0 0 0 0 0 0 0 0 0 0 0 0 0 0 0 0 0 0 
##$DATE= 1746524861
##$DBL= (0..7)
120 120 120 120 120 120 120 120 
##$DBP= (0..7)
150 150 150 150 150 150 150 150 
##$DBP07= 0
##$DBPNAM0= <>
##$DBPNAM1= <>
##$DBPNAM2= <>
##$DBPNAM3= <>
##$DBPNAM4= <>
##$DBPNAM5= <>
##$DBPNAM6= <>
##$DBPNAM7= <>
##$DBPOAL= (0..7)
0.5 0.5 0.5 0.5 0.5 0.5 0.5 0.5 
##$DBPOFFS= (0..7)
0 0 0 0 0 0 0 0 
##$DE= 6
##$DECBNUC= <off>
##$DECIM= 32
##$DECNUC= <off>
##$DECSTAT= 4
##$DIGMOD= 1
##$DIGTYP= 9
##$DL= (0..7)
0 120 120 120 120 120 120 120 
##$DP= (0..7)
150 150 150 150 150 150 150 150 
##$DP07= 0
##$DPNAME0= <>
##$DPNAME1= <>
##$DPNAME2= <>
##$DPNAME3= <>
##$DPNAME4= <>
##$DPNAME5= <>
##$DPNAME6= <>
##$DPNAME7= <>
##$DPOAL= (0..7)
0.5 0.5 0.5 0.5 0.5 0.5 0.5 0.5 
##$DPOFFS= (0..7)
0 0 0 0 0 0 0 0 
##$DQDMODE= 0
##$DR= 18
##$DS= 0
##$DSLIST= <SSSSSSSSSSSSSSS>
$$ [...]
##$SUBNAM0= <"">
##$SUBNAM1= <"">
##$SUBNAM2= <"">
##$SUBNAM3= <"">
##$SUBNAM4= <"">
##$SUBNAM5= <"">
##$SUBNAM6= <"">
##$SUBNAM7= <"">
##$SUBNAM8= <"">
##$SUBNAM9= <"">
##$SW= 18.0517328524113
##$SWIBOX= (0..15)
0 0 2 0 0 0 0 0 0 0 0 0 0 0 0 0 
##$SW_h= 3612.71676300578
##$TD= 16384
##$TD0= 1
##$TE= 0
##$TE2= 300
##$TE3= 300
##$TEG= 300
##$TL= (0..7)
0 120 120 120 120 120 120 120 
##$TP= (0..7)
150 150 150 150 150 150 150 150 
##$TP07= 0
##$TPNAME0= <>
##$TPNAME1= <>
##$TPNAME2= <>
##$TPNAME3= <>
##$TPNAME4= <>
##$TPNAME5= <>
##$TPNAME6= <>
##$TPNAME7= <>
##$TPOAL= (0..7)
0.5 0.5 0.5 0.5 0.5 0.5 0.5 0.5 
##$TPOFFS= (0..7)
0 0 0 0 0 0 0 0 
##$TUNHIN= 0
##$TUNHOUT= 0
##$TUNXOUT= 0
##$USERA1= <user>
##$USERA2= <user>
##$USERA3= <user>
##$USERA4= <user>
##$USERA5= <user>
##$V9= 5
##$VALIST= <valist>
##$VCLIST= <CCCCCCCCCCCCCCC>
##$VD= 0
##$VDLIST= <DDDDDDDDDDDDDDD>
##$VPLIST= <PPPPPPPPPPPPPPP>
##$VTLIST= <TTTTTTTTTTTTTTT>
##$WBST= 1024
##$WBSW= 4
##$XGAIN= (0..3)
0 0 0 0 
##$XL= 0
##$YL= 0
##$YMAX_a= 107952
##$YMIN_a= -219957
##$ZGOPTNS= <>
##$ZL1= 120
##$ZL2= 120
##$ZL3= 120
##$ZL4= 120
##$ABSF1= 10
##$ABSF2= 0
##$ABSG= 5
##$ABSL= 3
##$ALPHA= 0
##$AQORDER= 0
##$ASSFAC= 0
##$ASSFACI= 0
##$ASSFACX= 0
##$ASSWID= 0
##$AUNMP= <proc_1d>
##$AZFE= 0.1
##$AZFW= 0.1
##$BCFW= 1
##$BC_mod= 2
##$BYTORDP= 1
##$COROFFS= 0
##$CY= -3
##$DATMOD= 1
##$DC= 2
##$DFILT= <>
##$DTYPP= 0
##$F1P= 0
##$F2P= 0
##$FCOR= 0.5
##$FTSIZE= 0
##$FT_mod= 4
##$GAMMA= 1
##$GB= 0.15
##$INTBC= 1
##$INTSCL= 1
##$ISEN= 128
##$LB= 0.25
##$LEV0= 0
##$LPBIN= 0
##$MAXI= 10000
##$MC2= 0
##$MEAN= 0
##$ME_mod= 0
##$MI= 1.114404
##$NCOEF= 0
##$NC_proc= 0
##$NLEV= 6
##$NOISF1= 3.799351
##$NOISF2= 2.8
##$NSP= 1
##$NTH_PI= 0
##$NZP= 0
##$OFFSET= 14.38212
##$PC= 1
##$PHC0= -1556.064
##$PHC1= 18.39221
##$PH_mod= 1
##$PKNL= yes
##$PPARMOD= 0
##$PSCAL= 0
##$PSIGN= 0
##$REVERSE= no
##$SF= 200.129724274929
##$SI= 16384
##$SIGF1= 3
##$SIGF2= 2
##$SINO= 400
##$SIOLD= 16384
##$SREGLST= <1H.CDCl3>
##$SSB= 0
##$STSI= 0
##$STSR= 0
##$SW_p= 3205.1282051282
##$SYMM= 0
##$S_DEV= 0
##$TDeff= 0
##$TDoff= 0
##$TI= <>
##$TILT= no
##$TM1= 0
##$TM2= 0
##$TOPLEV= 0
##$USERP1= <user>
##$USERP2= <user>
##$USERP3= <user>
##$USERP4= <user>
##$USERP5= <user>
##$WDW= 1
##$XDIM= 8192
##$YMAX_p= 0
##$YMIN_p= 0
$$ End of Bruker specific parameters
$$ ---------------------------------
##NTUPLES= NMR FID
##VAR_NAME=  TIME,          FID/REAL,        FID/IMAG
##SYMBOL=    X,             R,               I
##VAR_TYPE=  INDEPENDENT,   DEPENDENT,       DEPENDENT
##VAR_FORM=  AFFN,          ASDF,            ASDF
##VAR_DIM=   8192,          8192,            8192
##UNITS=     SECONDS,       ARBITRARY UNITS, ARBITRARY UNITS
##FACTOR=    0.0002768,     1,               1
##FIRST=     0,             0,               0
##LAST=      2.2672688,     0,               0
##MIN=       0,             -219957,         0
##MAX=       2.2672688,     107952,          0
$$ Real data points
##PAGE= N=1
##DATA TABLE= (X++(R..R)), XYDATA
$$ plain form
0 0 0 0 0 0 0 0 0 0 0 0 0 0 0 0 0 0 6 -8 8 -8 8 -8 12 -16 16 -17 24 -24 28 -32 38 -43 49 -54 60 -68 76 -85
38 -85 96 -105 117 -131 145 -159 175 -194 214 -236 260 -285 314 -348 383 -424 469 -520 581 -650
58 -650 732 -833 953 -1107 1307 -1580 1971 -2576 3625 -5775 11879 -65328 -219957 4570
72 4570 98358 -25179 7737 88836 34983 50821 75135 -17697 -23595 45739 -32334 -91287
84 -91287 -16935 -22515 -73982 -17387 -6942 -52103 19418 69963 -15116 -12689 85091 66341 -8902
97 -8902 -8234 9820 24767 30751 -20882 -45288 13208 17074 -42167 -34338 -11120 -37254 -25752
110 -25752 2199 -24972 -21265 35355 37828 12182 33213 46951 28792 19174 3909 -9826 5522
123 5522 -5228 -51436 -41799 8030 1661 -30946 -23516 -483 8895 8724 -6528 -16710 5719
$$ packed form
0@%%%%%%%%%%%%%%%%Oj4J6j6J6j6K0k8L2l3M1m8N2o0P0q1R2j03J14j28J44j61
38h5J81k01K22k48K76l04L34l69M08m50M96n45N99o62P31q07Q93r89J101j231
58f50J382j565J786k060K414k887L551m547O201r400J7654p7207j54629K24527
72D570R3788j23537L2916Q1099n3853J5838K4314r2832n898O9334p8073n8953
84i1287P4352n580n1467N6595J0445m5161P1521N0545q5079K427R7780j8750p5243
97h902O68J8054J4947N984n1633k4406N8496L866n9241P829K3218k6134J1502
110b5752K7951k7171L707N6620K473k5646K1031J3738j8159r618j5265j3735J5348
123E522j0750m6208R637M9829o369l2607P430K3033R378j71j5252j0182K2429
$$ plain form
136 5719 32216 24666 2034 3786 28035 35625 11659 -9625 -7574 -3431 -15831 -32837 -33084 -13652
150 -13652 -6396 -26269 -23875 16044 29702 6553 4026 20217 23518 25114 14641 -12341 -2892
163 -2892 28443 5907 -34039 -17368 7338 -4800 -16142 -20864 -24440 -3239 9165 -16064 -15990
176 -15990 20439 21052 3749 16780 25004 15868 19433 11024 -13199 -4669 8912 -19992 -37171
189 -37171 -14147 -3506 -10573 -10638 -12653 -2728 23855 17322 -13128 -1188 27360 15451 -1769
202 -1769 3213 6061 9534 14158 -3894 -16268 2707 3917 -24515 -25946 -6909 -7270 -12072 -6353
216 -6353 -2965 10166 25972 12450 -3133 16191 27656 4029 -10450 -2775 670 -250 -3982
229 -3982 -16528 -14597 5038 3596 -16468 -14246 1131 2760 -1758 -2556 -687 10087 18114 7220
$$ packed form
136E719K6497p550k2632J752K4249P590k3966k1284K051M143j2400j7006k47J9432
150a3652P256j9873K394L9919J3658k3149k527J6191L301J596j0473k6982R449
163b892L1335k2536l9946J6671K4706j2138j1342m722l576K1201J2404k5229P4
176a5990L6429O13j7303J3031Q224r136L565q409k4223Q530J3581k8904j7179
189c7171K3024J0641p067o5k015R925K6583o533l0450J1940K8548j1909j7220
202a769M982K848L473M624j8052j2374J8975J210k8432j431J9037l61m802N719
216f353L388J3131J5806j3522j5583J9324J1465k3627j4479P675L445r20l732
229c982j2546J931J9635j442k0064K222J5377J629m518p98J869J0774Q027j0894
$$ plain form
243 7220 365 14601 18832 1141 -8934 -2800 -704 -7019 -16419 -20382 -9316 3542 -2629 -11647
257 -11647 -163 13953 11510 2757 1044 5174 11806 9341 -3296 -4241 7674 7971 -4290 -8716
271 -8716 -3007 -1163 -5795 -12388 -13087 -4260 1456 -4427 -5874 5598 14877 11438 5191 5412 10157
286 10157 11171 1632 -9901 -7296 2000 -1431 -12272 -12060 -1636 3182 -2268 -7229 -2970 4933
300 4933 4676 -2455 -2266 6744 9947 4673 1775 4811 7855 5318 -2246 -7646 -4294 -1743 -7331 -12774
316 -12774 -8739 -47 1988 -2109 -3055 4441 10870 7692 467 688 6403 6383 -212 -3863 -707 2869
332 2869 245 -5188 -5748 -1473 400 -4693 -8594 -4553 1550 1253 -2682 -405 6687 8977 4166 859
348 859 3797 7131 4010 -3900 -5994 -1430 -224 -4831 -7415 -4388 -258 9 -2541 -3035 1274 4952
$$ packed form
243G220o855J4236M231j7691j0075O134K096o315r400l963J1066J2858o171r018
257a1647J1484J4116k443q753j713M130O632k465j2637r45J1915K97j2261m426
271h716N709J844m632o593o99Q827N716n883j447J1472R279l439o247K21M745
286A0157J014r539j1533K605R296l431j0841K12J0424M818n450m961M259P903
300D933k57p131J89R010L203n274k898L036L044k537p564n400L352K551n588n443
316a2774M035Q692K035m097r46P496O429l178p225K21N715k0o595l651L156L576
332B869k624n433n60M275J873n093l901M041O103k97l935K277P092K290m811l307
348H59K938L334l121p910k094M564J206m607k584L027M130K67k550m94M309L678
$$ plain form
364 4952 2907 -819 532 5144 5635 1921 -372 2634 4902 793 -4883 -4152 -388 -2046 -6908 -7823
380 -7823 -3159 862 383 -1700 505 5660 5997 2892 1150 3320 4616 2637 -1686 -3284 -182 975
396 975 -3005 -5104 -2927 -428 -1925 -3876 -3239 582 1912 221 -654 2337 5478 4769 2671 1577
412 1577 2069 3000 478 -3687 -3401 -1216 -2315 -4695 -4799 -2236 1270 1519 -2192 -1145 4277 3914 -468
429 -468 35 3533 3066 1606 764 -555 1260 2336 -2133 -4252 -1147 -926 -3256 -3636 -2325 -1406 1356
446 1356 1315 -1139 1377 5643 3356 141 1699 2697 1418 260 -1531 -2370 -233 -412 -3227 -2941 -679
463 -679 -800 -1389 -1672 -1705 1306 2186 61 289 3913 3980 1493 1349 965 875 1647 -1622 -4340 -1490 -303
482 -303 -3777 -2931 142 -1417 -890 1621 -97 -163 4425 2586 -1357 1153 3343 610 26 1185 -1427
$$ packed form
364D952k045l726J351M612M91l714k293L006K268m109n676P31L764j658m862r15
380g823M664M021m79k083K205N155L37l105j742K170J296j979m323j598L102J157
396I75l980k099K177K499j497j951O37L821J330j691q75K991L141p09k098j094
412A577M92R31k522m165K86K185j099k380j04K563L506K49l711J047N422l63m382
429d68N03L498m67j460q42j319J815J076m469k119L105K21k330l80J311R19K762
446A356m1k454K516M266k287l215J558R98j279j158j791q39K137j79k815K86K262
463f79j21n89k83l3L011Q80k125K28L624O7k487j44l84r0P72l269k718K850J187
482c03l474Q46L073j559N27K511j718o6M588j839l943K510K190k733n84J159k612
$$ plain form
499 -1427 -896 1073 -2595 -4247 88 -676 -3699 -1473 681 -362 1082 2001 63 1938 4033 923
515 923 -676 1668 636 -932 -178 -1108 -2127 -107 -1320 -2897 -487 880 -1463 -1136 877 58
531 58 1057 1870 78 249 2553 1644 153 672 565 -881 216 -351 -2897 -1306 -360 -2295 -2009 659
549 659 241 -180 1325 709 501 2283 1465 -684 1208 2064 144 -540 145 -879 -819 -321 -1790 -1709 -418
568 -418 -668 -2047 -484 1105 698 698 1047 1098 1876 2104 797 242 326 -112 -897 -608 -1481 -1420 -859 -1023 -1360
589 -1360 -552 159 -352 -239 238 1325 1028 849 641 1393 1373 1008 135 -140 -479 -609 -1036 -1281 -860 -765
609 -765 -1541 -638 350 393 410 1439 696 453 1819 1375 76 741 982 -558 23 754 -1110 -1358 -219
628 -219 -498 -1770 -555 -165 -1445 -119 831 355 862 1504 661 420 1935 1223 -543 -160 237 -898
$$ packed form
499a427N31J969l668j652M335p64l023K226K154j043J444R19j938J875K095l110
515I23j599K344j032j568P54r30j019K020j213j577K410J367k343L27K013q19
531E8R99Q13j792J71K304r09j491N19j07j446J097n67k546J591R46j935K86K668
549F59m18m21J505o16k08J782q18k149J892Q56j920o84O85j024O0M98j469Q1J291
568d18k50j379J563J589m07%L49N1P78K28j307n55Q4m38p85K89q73O1N61j64l37
589a360Q08P11n11J13M77J087k97j79k08P52k0l65q73k75l39j30m27k45M21R5
609g65p76R03R88M3J7J029p43k43J366m44j299O65K41j540N81P31j864k48J139
628b19k79j272J215L90j280J326R50m76N07O42q43k41J515p12j766L83L97j135
$$ plain form
646 -898 -638 -176 -1161 -1348 -285 -834 -603 406 328 -255 595 1331 379 670 1229 648 123 809 380 -579
666 -579 -395 -359 -1057 -1191 -776 -928 -797 -410 -389 -63 584 722 720 1020 738 694 825 444 -26 72 -68 -645
688 -645 -583 -563 -892 -692 -534 -458 -542 231 197 -188 625 1055 223 497 1404 553 132 540 58 -523 -347 -434
710 -434 -858 -942 -475 -1098 -572 270 -155 -198 614 1082 283 786 876 154 302 608 178 -295 104 -420 -695
731 -695 -203 -152 -1153 -293 141 -642 -374 186 60 236 978 674 213 808 649 -36 -7 354 -387 -599 -414
752 -414 -720 -776 -341 -231 -400 110 -96 -43 190 269 95 294 651 208 168 408 607 240 121 -334 -208 -275
774 -275 -544 -807 -647 -406 -380 -365 239 470 367 430 775 430 112 405 182 0 161 -115 -129 -239 -351 -531
796 -531 -323 -269 -363 -499 -72 -177 204 276 442 384 592 860 227 45 302 -128 -452 -233 -624 -713 -270 -314
$$ packed form
646h98K60M62r85j87J063n49K31J009p8n83Q50P36r52K91N59n81n25O86m29r59
666e79J84L6o98j34M15j52J31L87K1L26O47J38kL00k82m4J31l81m70R8j40n77
688f45O2K0l29K00J58P6q4P73l4l85Q13M30q32K74R07q51m21M08m82n81J76q7
710d34m24q4M67o23N26Q42m25m3Q12M68p99N03R0p22J48L06m30m73L99n24k75
731f95M92N1j001Q60M34p83K68N60j26J76P42l04m61N95j59o85K9L61p41k12J85
752d14l06n6M35J10j69N10k06N3K33P9j74J99L57m43m0K40J99l67j19m55J26o7
774b75k69k63J60K41K6J5O04K31j03O3L45l45l18K93k23j82J61k76j4j10j12j80
796e31K08N4r4j36M27j05L81P2J66n8K08K68o33j82K57m30l24K19l91q9M43m4
$$ plain form
818 -314 -389 -187 -187 39 209 249 389 305 829 852 205 150 375 11 -256 -301 -271 -346 -224 -230 -612 -272 -419 -189
842 -189 94 193 285 193 305 333 309 191 331 26 -50 -277 -432 -234 -252 -533 -476 -163 -318 -146 -196 82 88 187
866 187 328 212 555 279 49 205 87 -133 -47 6 -376 -393 -126 -388 -228 -432 -42 67 49 175 310 167
888 167 198 -70 594 425 -15 102 350 20 -78 123 -328 -266 -311 -211 -172 -15 -201 -3 166 -66 17 515
910 515 513 78 337 464 -133 -326 157 -395 16 -146 -238 -499 -351 -304 -69 107 -10 -147 146 237 60 68 44
933 44 -141 70 118 194 -203 -123 -160 -321 -115 0 -193 -240 -171 -41 -86 -68 324 351 166 335 100 115 101 -30
957 -30 -65 -175 -275 -157 -22 -241 -131 -192 -99 -375 19 -1 121 278 289 341 134 183 226 412 -64 402 -123
980 -123 -344 -190 -388 -407 -241 -210 88 442 392 7 157 248 469 138 149 223 38 -26 189 257 -253 28 -142
$$ packed form
818c14p5K02%K26J70M0J40q4N24K3o47n5K25l64k67m5L0p5J22ol82L40j47K30
842a89K83R9R2r2J12K8k4j18J40l05p6k27j55J98j8k81N7L13j55J72n0K78OR9
866A87J41j16L43k76k30J56j18k20Q6N3l82j7K67k62J60k04L90J09j8J26J35j43
888A67L1k68O64j69m40J17K48l30r8K01m51O2m5J00L9J57j86J98J69k32Q3M98
910E15km35K59J27n97j93M83n52M11j62r2k61J48M7K35J76j17j37K93R1j77Qk4
933D4j85K11M8P6l97Q0l7j61K06J15j93m7O9J30m5J8L92K7j85J69k35J5j4j31
957c0l5j10j00J18J35k19J10o1R3k76L94k0J22J57J1N2k07M9M3J86m76M66n25
980a23k21J54j98j9J66L1K98L54n0l85J50R1K21l31J1P4j85o4K15O8n10K81j70
$$ plain form
1003 -142 -549 -169 222 -350 -242 4 116 10 312 50 -6 -2 439 102 -31 -35 22 -157 -44 -195 -117 -357
1025 -357 -5 -33 49 -68 93 53 43 135 41 232 -62 -12 48 204 108 187 123 -154 -181 -432 -246 -113 -143 -55 26
1050 26 -125 7 356 266 42 83 291 100 -137 -185 101 -43 -168 26 -72 -245 -107 -163 -234 -87 64 219
1072 219 -38 344 104 -324 618 -49 76 263 274 -279 243 -195 -118 -223 24 41 -484 -165 100 -141 90
1093 90 43 -165 -42 345 105 245 212 -106 -253 -124 180 -165 -134 -22 -65 -287 21 -73 -9 93 170 -98 -257
1116 -257 -27 161 153 104 97 212 142 -88 196 86 -43 -109 -272 31 -116 -85 -238 -9 109 126 -22 -126 62
1139 62 91 -1 180 261 188 -159 31 -83 83 94 -106 -305 54 5 -154 -35 -147 -116 -4 -61 -198 -243 124
1162 124 -58 -103 3 -129 22 -174 -144 112 -86 -134 -3 184 -65 19 56 19 78 -25 -18 87 102 7 -78 -42
$$ packed form
1003a42m07L80L91n72J08K46J12j06L02k62n6MM41l37j33mN7j79J13j51P8k40
1025c57L52k8Q2j17J61m0j0R2r4J91k94N0O0J56r6P9o4k77k7k51J86J33l0Q8Q1
1050B6j51J32L49r0k24M1K08j91k37m8K86j44j25J94r8j73J38n6p1J47J51J55
1072B19k57L82k40m28R42o67J25J87J1n53N22m38P7j05K47J7n25L19K65k41K31
1093I0m7k08J23L87k40J40l3l18j47J29L04l45L1J12m3k22L08r4O4J02P7k68j59
1116b57K30J88qm9pJ15p0k30K84j10j29o6j63L03j47L1j53K29J18J7j48j04J88
1139F2K9r2J81Q1p3l47J90j14J66J1k00j99L59m9j59J19j12L1J12n7j37m5L67
1162A24j82m5J06j32J51j96L0K56j98m8J31J87k49Q4L7l7N9j03PJ05J5r5q5L6
$$ plain form
1186 -42 -200 -287 -35 105 -34 -314 -99 -168 77 110 -227 45 100 86 14 191 26 65 11 30 40 -103 -242 -71
1210 -71 -151 178 20 204 12 -90 99 -180 6 -67 -128 -37 261 14 -61 -133 290 154 46 -307 140 -163
1232 -163 -168 -72 -134 -120 52 -79 90 197 -49 321 -53 50 -261 -125 62 221 163 -4 38 59 82 86 76 155
1256 155 75 -43 -144 18 111 10 273 133 176 -49 115 -55 -339 18 116 193 -140 -83 -83 163 -201 -11 61
1279 61 122 321 -175 -23 -170 206 -358 31 -233 5 13 -409 -6 -176 -106 179 -15 115 18 88 208 -162
1301 -162 -131 125 -48 -153 135 122 -80 -151 202 75 -14 -240 -170 -62 323 173 54 89 79 -63 -14 145 83
1324 83 85 87 168 -78 -300 105 -38 165 15 -32 -102 333 -137 -198 -36 184 -27 55 -139 -459 -136 -209 -34 -56
1348 -56 -124 -186 -41 -137 156 93 212 -182 42 56 -84 -61 86 77 -63 158 -41 -61 -71 -132 24 94 -128 -124 34
$$ packed form
1186d2j58q7K52J40j39k80K15o9K45L3l37K72N5j4p2J77j65L9n4J9J0j43j39J71
1210g1q0L29j58J84j92j02J89k79J86p3o1R1K98k47p5p2M23j36j08l53M47l03
1232a63nR6o2J4J72j31J69J07k46L70l74J03l11J36J87J59n8j67M2K1K3Mj0P9
1256A55q0j18j01J62R3j01K63j40M3k25J64j70k84L57R8P7l33N7%K46l64J90P2
1279F1O1J99m96J52j47L76n64L89k64K38Qm22M03j70P0K85j94J30r7P0J20l70
1301a62L1K56j73j05K88j3k02p1L53j27q9k26P0J08L85j50j19L5j0j42M9J59o2
1324H3KKQ1k46k22M05j43K03j50m7p0M35m70o1J62K20k11Q2j94l20L23p3J75k2
1348e6o8o2J45r6K93o3J19l94K24J4j40K3J47rj40K21j99k0j0o1J56P0k22MJ58
$$ plain form
1373 34 42 -66 -62 192 -86 -169 -221 -156 30 -64 98 -55 65 -26 -13 -100 282 -17 -182 78 -15 -2 -248 -128 385
1398 385 -103 138 -39 -23 214 40 111 -201 50 -12 105 -164 55 180 62 99 29 -82 78 -148 -71 329
1420 329 94 -46 48 2 67 89 -63 97 111 22 -71 -39 -76 342 -199 -337 33 198 57 90 81 -90 123 -55
1444 -55 7 -71 -235 -36 -198 -23 -193 176 239 -119 -213 -68 31 44 -6 34 -191 -47 -53 25 22 -122 95 -16 -80
1469 -80 -69 52 -72 34 121 -56 15 97 -170 -14 -89 -134 138 245 -3 -60 52 -95 287 -209 246 -2 221
1492 221 15 -183 289 -68 218 -86 133 8 172 87 -145 5 166 -76 -379 -131 243 101 53 270 153
1513 153 -42 25 68 -195 -66 290 -100 113 322 -63 65 155 -169 167 -43 -107 49 81 97 48 61 -38 94
1536 94 -112 -161 145 94 -30 -184 347 -88 159 210 40 -210 -75 -41 112 -98 6 -72 7 -125 84 157 -262
$$ packed form
1373C4Qj08MK54k78q3n2O5J86r4J62j53J20r1J3q7L82k99j65K60r3J3k46J20N13
1398C85m88K41j77J6K37j74P1l12K51o2J17k69K19J25j18L7p0j11J60k26P7M00
1420C29k35j40R4m6O5K2j52J60J4q9r3L2l7M18n41j38L70J65j41L3rj71K13j78
1444e5O2p8j64J99j62J75j70L69O3l58r4J45R9J3n0M0k25J44oP8lj44K17j11o4
1469h0J1J21j24J06Q7j77P1Q2k67J56p5m5K72J07k48n7J12j47L82m96M55k48K23
1492B21k06j98M72l57K86l04K19j25J64q5k32J50J61k42l03K48L74j42m8K17j17
1513A53j95O7M3k63J29L56l90K13K09l85J28R0l24L36k10o4J56L2J6m9J3r9J32
1536I4k06m9L06n1j24j54N31m35K47N1j70k50J35L4J53k10J04p8P9j32K09P3m19
$$ plain form
1559 -262 320 -117 -116 89 -69 -117 156 -322 72 -49 193 17 25 204 -31 44 -44 213 -94 -141 -87 -90 -38 -40 -105
1584 -105 56 202 83 296 -180 133 84 73 18 -257 244 15 124 -46 14 -125 6 302 103 -130 382
1605 382 -237 32 -12 19 21 302 8 163 5 -22 -263 154 -249 -70 -64 -252 -330 -113 -149 74 -299 -186 311
1628 311 -56 100 -155 -209 -104 286 -281 -186 -281 -51 -174 145 -50 -20 87 65 135 93 3 275 145 136 -89
1651 -89 252 -7 122 25 120 166 -30 52 -249 58 298 19 -119 13 30 -170 53 -280 -46 -139 -64 67 171
1674 171 3 -61 211 18 -93 -250 -65 -250 -181 -220 -89 -46 -40 118 79 109 0 20 82 -208 385 24 4 77
1698 77 48 -16 -116 120 -36 -116 247 -98 -146 -43 -258 -198 -107 -271 267 164 15 -173 43 -35 159 -186 -53
1721 -53 61 -132 -369 68 100 -137 -107 -4 -78 18 -8 237 80 -191 -81 -223 258 84 -131 -108 148 99 -207
$$ packed form
1559b62N82m37JK05j58m8K73m78L94j21K42j76QJ79k35P5q8K57l07m7N4lN2ko5
1584a05J61J46j19K13m76L13m9j1n5k75N01k29J09j70O0j39J31K96j99k33N12
1605C82o19K69m4L1KK81k94J55j58k7k41M17m03J79Oj88p8K17l6K23l73J13M97
1628C11l67J56k55n4J05L90n67R5r5K30j23L19j95L0J07k2P0m2r0K72j30rk25
1651h9L41k59J29r7R5M6j96Q2l01L07K40k79j38J32J7k00K23l33K34r3P5J31J04
1674A71j68o4K72j93j11j57J85j85O9l9J31M3OJ58l9L0j09K0O2k90N93l61k0P3
1698G7k9o4j00K36j56q0L63l45m8J03k15O0R1j64N38j03j49j88K16p8J94l45J33
1721e3J14j93k37M37L2k37L0J03p4R6k6K45j57k71J10j42M81j74k15K3K56m9l06
$$ plain form
1744 -207 -224 34 18 -96 -247 42 85 217 15 -29 -130 302 -41 -56 36 -58 -10 -192 -238 -32 -36 -71 -81 -30 47
1769 47 -127 -218 -142 111 -321 296 10 -347 130 130 -96 -122 193 -178 16 202 22 -45 -50 -249 -188 27 55 163
1793 163 -206 7 -14 106 19 43 -97 -3 -257 108 12 359 50 173 67 -141 -51 140 -155 -65 166 -30
1815 -30 116 -29 7 244 62 26 -106 57 199 20 -183 7 -57 116 10 -226 -248 -159 146 -91 -121 -83 257
1838 257 32 75 104 76 26 -29 -50 45 65 -101 -119 48 299 157 -187 -26 362 -8 117 -50 18 -67 -71 -252
1862 -252 -275 -66 16 40 135 -112 -88 -118 86 162 169 -34 94 84 170 -20 -266 -155 -36 -5 30 16 -299 -221 -369
1887 -369 -19 176 -230 -26 48 40 70 223 -22 -286 172 -186 23 9 -198 -178 -202 110 -12 -218 -268 -289 4
1910 4 -61 -219 92 -90 -186 -216 -236 -122 36 113 -201 -298 368 -154 -87 6 -139 -93 -211 71 -290 -137 60 -160
$$ packed form
1744b07j7K58j6j14j51K89M3J32k02m4j01M32l43j5R2r4M8j82m6K06ml5j0N1P7
1769D7j74r1P6K53m32O17k86l57M77%k26k6L15l71J94J86j80o7nj99O1K15K8J08
1793A63l69K13k1J20q7K4j40R4k54L65r6L47l09J23j06k08R0J91k95R0K31j96
1815c0J46j45L6K37j82l6j32J63J42j79k03J90o4J73j06k36k2Q9L05k37l0L8L40
1838B57k25M3K9k8n0n5k1R5K0j66j8J67K51j42l44J61L88l70J25j67O8q5mj81
1862b52k3K09Q2K4R5k47K4l0K04P6Pk03J28j0Q6j90k46J11J19L1L5j4l15P8j48
1887c69L50J95m06K04P4qL0J53k45k64M58l58K09j4k07K0k4L12j22k06n0k1K93
1910Do5j58L11j82r6l0k0J14J58P7l14r7O66n22O7R3j45M6j18K82l61J53J97k20
$$ plain form
1934 -160 -324 271 -62 28 93 -4 38 11 45 -99 -36 -31 -120 47 -112 -141 79 56 38 -10 340 186 239 -74 -143
1959 -143 272 212 -24 -81 155 22 -205 21 286 101 31 -11 -182 -88 5 64 -252 -344 361 -94 77 2 -266
1982 -266 233 -170 56 -49 -119 141 -54 349 270 -12 -120 -237 48 40 133 -65 -167 -25 -116 50 -223 199
2004 199 173 -13 79 -37 -239 326 -107 78 -34 23 95 84 -19 -49 231 -28 -85 52 -81 164 -28 -175
2026 -175 77 -62 234 40 -91 -272 135 217 -75 123 -75 -100 -77 -45 16 121 67 -58 -45 110 -53 -129 177
2049 177 -44 -36 -242 -153 60 -73 -93 18 27 30 114 169 -26 22 208 54 -136 75 126 -63 -49 90 252 -21
2073 -21 144 154 -21 75 36 235 167 50 -154 317 103 -181 -113 154 -2 -90 209 212 -179 46 -203 -1 -29
2096 -29 -131 -161 -84 -8 -166 -197 -32 -68 191 -208 55 211 -94 146 -4 -33 -234 54 -187 -338 -202 108
$$ packed form
1934a60j64N95l33R0O5r7M2k7L4j44O3Nq9J67j59k9K20k3j8m8L50j54N3l13o9
1959a43M15o0k36n7K36j33k27K26K65j85p0m2j71R4R3N9l16r2P05m55J71p5k68
1982b66M99m03K26j05p0K60j95M03p9k82j08j17K85qR3j98j02J42r1J66k73M22
2004A99k6j86R2j16k02N65m33J85j12N7P2j1j03l0K80k59n7J37j33K45j92j47
2026a75K52j39K96j94j31j81M07Q2k92J98j98k5K3L2O1J05n4j25J3J55j63p6L06
2049A77k21Qk06Q9K13j33k0J11RLQ4N5j95M8J86j54j90K11N1j89J4J39J62k73
2073b1J65J0j75R6l9J99o8j17k04M71k14k84O8K67j56q8K99Ll91K25k49K02k8
2096b9j02l0P7P6j58l1J65l6K59l99K63J56l05K40j50k9k01K88k41j51J36L10
$$ plain form
2118 108 173 -81 -106 -313 132 148 -2 174 15 181 -139 -294 -97 -152 162 36 -66 -25 34 -146 185 -23
2140 -23 13 56 -9 -253 128 -315 20 177 -113 41 -30 183 -93 -120 97 -64 -66 124 134 109 -161 -84 178 136
2164 136 -206 221 274 29 55 -146 -154 -124 32 275 145 -225 -9 -59 -141 23 215 -198 -8 48 105 2 77
2187 77 -180 105 -18 -101 268 56 72 359 247 123 -137 -55 -182 157 50 51 -220 121 -22 -15 -135 -103 -108 198
2211 198 90 -89 -4 -14 -221 118 -42 -109 154 82 -213 0 239 -242 26 -175 1 -202 143 257 108
2232 108 -186 231 26 86 128 -160 59 -96 231 178 -30 -85 -117 -59 -241 225 90 27 41 -66 218 158 301
2255 301 290 -7 -117 68 -234 241 174 -168 45 28 158 -278 -23 -22 113 -41 -68 -58 158 38 -113 78
2277 78 59 -52 -140 -110 387 -47 -105 112 14 195 68 -7 79 -122 -181 -159 146 106 19 -137 101 -392 19 -8
$$ packed form
2118A08O5k54k5k07M45J6j50J76j59J66l20j55J97n5L14j26j02M1N9j80L31k08
2140b3L6M3o5k44L81m43L35J57k90J54p1K13k76k7K17j61kJ90J0k5k70P7K62m2
2164A36l42M27N3k45K6k01qL0J56K43j30l70K16n0q2J64J92m13J90N6N7j03P5
2187G7k57K85j23q3L69k12J6K87j12j24k60Q2j27L39j07Jk71L41j43Pj20L2nL06
2211A98j08j79Q5j0k07L39j60o7K63p2k95K13K39m81K68k01J76k03L45J14j49
2232A08k94M17k05O0M2k88K19j55L27n3k08n5l2N8j82M66j35o3J4j07K84o0J43
2255C01j1k97j10J85l02M75o7l42K13j7J30m36K55JJ35j54k7J0K16j20j51J91
2277G8j9j11q8L0M97m34n8K17r8J81j27p5Q6k01n9K2L05m0q7j56K38m93M11k7
$$ plain form
2301 -8 71 -51 -52 97 -45 -60 -190 -281 250 126 -173 106 43 -4 243 -119 165 -99 8 64 -22 147 -189 -2
2325 -2 -69 45 -109 -296 28 131 28 131 -235 38 -19 -13 -156 13 -317 -224 -46 -190 -144 160 -30 184 -148
2348 -148 218 -85 47 262 259 29 -52 -118 -128 30 276 355 -85 -18 -193 42 116 3 -36 -110 155 -186 115
2371 115 131 153 -95 103 92 97 -50 -237 -52 -15 -168 -109 -27 -104 -14 -92 49 12 -93 -129 -12 155 -54 122
2395 122 -106 -79 111 -4 -45 75 -11 -137 -64 163 -106 222 -200 168 68 -131 -159 106 -8 -122 76 -114
2417 -114 54 11 -130 -78 2 115 -62 -167 199 -173 69 -378 -171 -141 -125 35 -93 281 -92 1 7 -116 301
2440 301 -13 152 -154 215 437 109 43 40 -172 -85 -236 -258 -60 172 41 -46 155 -29 33 -143 262 -37
2462 -37 -15 -22 203 233 -205 143 265 116 99 -197 -33 -136 101 123 87 -36 -300 -159 -51 -162 207 14 -234
$$ packed form
2301hP9j22jJ49j42j5j30r1N31j24k99K79o3m7K47l62K84k64J07N6q6J69l36J87
2325bo7J14j54j87L24J03j03J03l66K73n7Oj43J69l30R3J78j44M6L04j90K14l32
2348a48L66l03J32K15lk30q1o6j0J58K46P9m40O7j75K35P4j13l9p4K65l41L01
2371A15J6K2k48J98j1Nj47j87J85L7j53N9Q2p7R0p8J41l7j05l6J17J67k09J76
2395A22k28K7J90j15m1J20q6j26P3K27k69L28m22L68j00j99k8K65j14j14J98j90
2417a14J68m3j41N2Q0J13j77j05L66l72K42m47K07L0J6J60j28L74l73R3Oj23M17
2440C01l14J65l06L69K22l28o6lk12Q7j51k2J98K32j31q7K01j84O2j76M05k99
2462c7K2pK25L0m38L48J22j49j7k96J64j03K37K2l6j23k64J41J08j11L69j93k48
$$ plain form
2485 -234 21 35 23 -12 207 85 286 -22 -83 7 -103 241 144 -55 57 118 -269 -149 11 236 -47 -77 -118
2508 -118 -31 -80 -145 -42 99 -117 -249 41 6 -4 -16 161 86 -63 5 202 141 -103 49 -192 71 -178 15
2531 15 170 23 29 -233 -116 132 130 41 -83 153 146 -462 265 256 -87 150 19 -124 -335 2 -212 -6 -21 -213
2555 -213 217 -177 -222 175 -76 210 -158 -117 -16 284 20 42 -46 -105 81 -65 -62 19 -115 245 152 43 -52
2578 -52 84 -165 20 188 50 199 -132 -351 -157 44 43 160 -356 -94 -90 101 164 -209 -104 -201 -112 -226 119
2601 119 339 -172 -242 82 108 -50 -52 -131 -131 259 -57 130 -194 43 -5 -76 -19 92 131 -124 -104 203 -203 98
2625 98 57 -29 166 103 328 -124 -192 152 -114 214 162 -16 105 107 -85 -16 194 -28 -111 -211 111 -201 3
2648 3 -7 186 -43 -136 -413 144 -334 3 -205 -119 -93 -86 -10 282 129 129 -138 158 -153 116 259 104 -68 156
$$ packed form
2485b34K55J4j2l5K19j22K01l08o1R0j10L44r7j99J12O1l87J20J60K25k83l0m1
2508a18Q7m9o5J03J41k16j32K90l5j0j2J77p5j49O8J97o1k44J52k41K63k49J93
2531A5J55j47Ok62J17K48kq9j24K36po08P27rl43K37j31j43k11L37k14K06j5j92
2555b13M30l94m5L97k51K86l68M1J01L00k64K2q8n9J86j46LQ1j34L60r3j09r5
2578e2J36k49J85J68j38J49l31k19J94K01jJ17n16K62MJ91O3l73J05r7Q9j14L45
2601A19K20n11p0L24K6j58kp9%L90l16J87l24K37m8p1N7J11L9k55K0L07m06L01
2625I8m1q6J95o3K25m52o8L44k66L28n2j78J21Kj92O9K10k22q3j00L22l12K04
2648Cj0J93k29r3k77N57m78L37k08Q6K6PP6K92j53%k67K96l11K69J43j55j72K24
$$ plain form
2672 156 -254 -50 2 -199 67 -186 -146 258 -58 29 337 200 -26 263 196 -147 -111 3 -22 -196 128 -104
2694 -104 -162 110 -104 335 141 84 -65 136 190 -194 -134 -171 247 120 -88 -148 -373 -135 84 120 -27 31 178
2717 178 20 -75 -325 111 -242 -128 120 -25 77 25 59 -15 -153 -14 -59 16 68 49 -127 -132 53 -125 -136 -14
2741 -14 296 -152 -64 -281 -59 82 165 105 -71 198 18 170 172 -110 60 290 -311 185 54 -104 8 -34
2763 -34 -46 138 27 164 84 2 -141 -71 -56 -10 -39 180 41 72 20 52 -68 101 18 -23 6 58 -124 32 -70
2788 -70 86 -39 184 -208 -94 -5 92 -129 -291 -169 -289 116 159 -116 178 -107 214 -119 -106 -131 6 17
2810 17 3 11 50 -49 108 -170 102 -102 369 -91 71 -57 29 -55 -175 -49 -242 -31 200 24 -176 -14 -113
2833 -113 246 -325 124 -3 131 -41 -107 -132 33 -180 -31 92 9 70 -34 8 -90 134 58 28 -171 220 50
$$ packed form
2672A56m10K04N2k01K66k53M0M04l16Q7L08j37k26K89o7l43L6J14k5j74L24k32
2694a04n8K72k14M39j94n7j49K01N4l84O0l7M18j27k08o0k25K38K19L6j47N8J47
2717A78j58r5k50M36l53J14K48j45J02n2L4p4j38J39m5P5N2j9j76nJ85j78j1J22
2741a4L10m48Q8k17K22J41Q3o0j76K69j80J52Kk82J70K30o01M96j31j58J12m2
2763c4j2J84j11J37q0q2j43P0J5M6k9K19j39L1n2L2j20J69q3m1K9N2j82J56j02
2788g0J56j25K23l92J14Q9R7k21j62J22j20M05M3k75K94k85L21l33J3k5J37J1
2810A7j4QL9r9J57k78K72k04M71m60J62j28Q6q4j20J26j93K11K31j76k00J62r9
2833a13L59n71M49j27J34j72o6k5J65k13J49J23q3O1j04M2r8K24p6l0j99L91j70
$$ plain form
2856 50 -67 160 -101 109 52 -55 92 148 130 144 16 -27 110 59 10 -215 -234 -128 71 226 157 -56 262
2879 262 152 -53 0 96 220 -179 -112 37 120 -137 117 70 27 -111 -109 148 5 166 148 134 -57 -144 185 112
2903 112 303 -278 -74 -164 15 175 137 -63 -105 48 -2 -50 30 87 142 -39 118 31 143 -77 -200 -187 -109 -53
2927 -53 79 75 -283 199 -173 -43 -149 -73 175 325 -35 -219 68 -44 -105 25 -116 103 -25 -31 127 -253
2949 -253 16 -177 -145 159 -23 -46 -65 -11 94 -31 -55 8 21 63 209 59 1 -108 -196 124 -128 100 42 -7
2973 -7 -149 -255 39 -74 -241 55 85 59 58 142 -98 -250 78 -200 159 82 68 -301 39 78 -89 91 81 -1
2997 -1 -95 139 -83 107 -228 193 326 112 227 -20 110 -320 -150 138 170 133 85 -88 -62 215 -48 -71 236
3020 236 -58 -125 -147 -62 6 -110 28 -48 27 45 19 -76 -167 -7 -24 -244 -52 -126 83 182 159 143 93 -13 -65 -35
$$ packed form
2856E0j17K27k61K10n7j07J47N6j8J4j28m3J37n1m9k25j9J06J99J55o9k13L18
2879B62j10k05N3R6J24l99O7J49Q3k57K54m7m3j38KK57j43J61j8j4j91q7L29p3
2903A12J91n81K04r0J79J60l8k00m2J53n0m8Q0N7N5j81J57q7J12k20j23J3P8N6
2927e3J32ml58M82l72J30j06P6K48J50l60j84K87j12o1J30j41K19j28oJ58l80
2949b53K69j93L2L04j82k3j9N4J05j25k4O3J3M2J46j50n8j09q8L20k52K28n8m9
2973gj42j06K94j13j67K96L0k6jQ4k40j52L28k78L59p7j4l69L40L9j67J80j0q2
2997ar4K34k22J90l35M21J33k14J15k47J30m30J70K88L2l7m8j73K6K77k63k3L07
3020B36k94o7k2Q5O8j16J38p6P5J8k6r5r1J60j7k20J92p4K09R9k3j6n0j06n2L0
$$ plain form
3046 -35 -247 41 -40 -121 -72 274 -41 -38 31 -78 93 -139 100 -17 45 -150 51 264 276 -48 -62 60 -155
3069 -155 -150 -87 -223 82 -78 80 162 170 129 158 200 4 -179 -437 -75 70 -19 -3 289 178 -32 30 81 -1 189
3094 189 -134 -118 89 248 30 119 15 -18 110 240 -160 447 133 -3 265 305 167 75 36 -287 24 -60
3116 -60 67 -40 -8 -17 -204 75 -13 147 238 -62 -122 -196 29 186 -59 -161 162 22 96 -147 -56 -419 19
3139 19 -2 213 168 -48 -189 135 314 25 115 71 171 90 129 -17 -28 -45 -206 -41 54 -288 -34 -234 -48
3162 -48 -19 23 -120 280 -343 -1 345 -30 0 -223 -48 97 156 -118 -149 -90 29 1 14 -62 55 -136 83
3185 83 85 -153 91 -103 33 48 113 155 2 12 -36 172 0 -56 -108 -13 -149 -118 57 0 -8 -85 -175 44 200 217
3211 217 -133 -188 210 234 -189 -21 15 106 11 96 140 -32 19 136 378 48 511 -92 59 112 -93 62 -330
$$ packed form
3046c5k12K88q1q1M9L46l15LO9j09J71k32K39j17O2j95K01K13J2l24j4J22k15
3069a55NO3j36L05j60J58Q2Qm1K9M2j96j83k58L62J45q9J6K92j11k10O2N1q2J90
3094A89l23J6K07J59k18Q9j04l3J28J30m00O07l14j36K68M0j38r2l9l23L11q4
3116f0J27j07L2rj87K79q8J60R1l00o0p4K25J57k45j02L23j40P4k43R1l63M38
3139A9k1K15m5k16j41L24J79k89R0m4J00q1L9j46j1j7j61J65R5l42K54k00J86
3162d8K9M2j43M00o23L42L46l75L0k23J75J45N9k74l1N9J19k8J3p6J17j91K19
3185H3Kk38K44j94J36J5O5M2j53J0m8K08j72n6n2R5j36L1J75n7qp7r0K19J56J7
3211B17l50n5L98K4m23J68L6R1r5Q5M4j72N1J17K42l30M63o03J51N3k05J55l92
$$ plain form
3234 -330 -239 -34 -96 37 5 96 -133 -47 -31 74 108 -104 110 112 -123 -156 -94 167 -150 -219 242 -46 126 131 148
3259 148 120 132 99 60 -51 77 -21 35 77 46 -86 269 17 -224 395 -7 18 51 5 145 374 218 -392 212
3283 212 78 -7 60 154 29 65 -155 -151 139 -14 131 154 133 -181 -66 -229 2 -93 260 -98 -224 -245 7
3306 7 72 -116 -33 32 31 186 -202 69 222 -101 179 33 -75 193 -14 -124 75 -186 25 -27 -128 118 142
3329 142 41 -180 271 230 -153 -56 -61 171 184 55 -45 168 -143 -81 -225 176 -187 71 -91 -14 166 -242
3351 -242 173 74 -331 -440 -22 -171 -46 -68 -248 53 66 84 -75 -71 35 29 237 -438 42 142 12 105 65
3374 65 6 212 -37 -440 4 289 167 154 -121 89 -94 -175 -51 -168 138 -145 41 -13 19 -76 -15 -91 75
3397 75 -92 -13 -35 -197 8 -267 185 -136 -162 196 -33 -40 -47 152 -43 -169 -33 -86 -233 -46 109 42 -8 -18
$$ packed form
3234c30R1K05o2J33l2R1k29Q6J6J05L4k12K14Kk35l3O2K61l17o9M61k88J72NJ7
3259A48k8J2l3l9j11J28r8N6M2l1j32L55k52k41O19m02K5L3m6J40K29j56o10O04
3283B12j34q5O7R4j25L6k20MK90j53J45K3k1l14J15j63K31r5L53l58j26k1K52
3306GO5j88Q3O5jJ55l88K71J53l23K80j46j08K68k07j10J99k61K11n2j01K46K4
3329A42j01k21M51m1l83R7nK32J3j29j00K13l11O2j44M01l63K58j62P7J80m08
3351b42M15r9m05j09M18j49J25k2j80L01J3J8j59MJ06oK08o75M80J00j30R3m0
3374F5n9K06k49m03M44K85j22j3k75K10j83q1J24j17L06k83J86n4L2r5O1p6J66
3397G5j67P9k2j62K05k75M52l21k6L58k29ppJ99j95j26J36n3j47J87J55o7n0j0
$$ plain form
3421 -18 139 17 166 178 153 -127 155 151 -100 -123 -74 148 4 206 -140 -176 -115 -23 93 -194 -287 -156 -205 263
3445 263 -105 48 45 109 79 -68 1 -21 217 27 192 239 -102 -149 -233 -367 -174 106 45 108 -91 6 -48 -244
3469 -244 -239 209 209 96 -7 153 91 70 35 10 -79 89 59 55 -212 -208 34 224 110 171 -16 -11 100 37 41 0 -190
3496 -190 -267 -230 -197 360 -24 95 9 297 81 -98 124 -22 161 89 -91 285 141 -23 18 132 236 -216
3518 -216 -274 -222 205 100 -154 52 121 -146 -43 9 44 44 -21 -267 66 -1 -22 165 199 129 43 -122 43 -168
3542 -168 145 -107 25 -114 55 -30 -38 56 -301 -50 38 180 -4 -265 -228 -167 -240 -91 -104 -107 -320 115 59 -24
3566 -24 -82 4 -37 42 165 22 136 183 -91 371 110 214 82 -15 71 -3 255 106 290 138 -153 137 231
3589 231 -3 20 28 -122 -46 -349 -75 -98 173 296 -77 298 103 -107 -81 -42 26 80 -159 -76 141 211 -33 87
$$ packed form
3421a8J57j22J49J2k5k80K82mk51k3M9K22j44K02l46l6O1R2J16k87r3J31m9M68
3445B63l68J53lO4l0j47O9k2K38j90J65M7l41m7q4j34J93K80o1O3j99R7n4j96
3469b44NM48%j13j03J60o2k1l5k5q9J68l0mk67MK42J90j14O1j87NJ11o3Mm1j90
3496a90p7L7L3N57l84J19q6K88k16j79K22j46J83p2j80L76j44j64M1J14J04m52
3518b16n8N2M27j05k54K06O9k67J03N2L5%o5k46L33o7k1J87L4p0q6j65J65k11
3542a68L13k52J32j39J69q5qR4l57K51Q8J42j84k61L7O1p3J49j3lk13M35n6q3
3566b4n8Q6m1P9J23j43J14M7k74M62k61J04j32r7Q6p4K58j49J84j52k91K90R4
3589B31k34K3Qj50P6l03K74k3K71J23l73L75j95k10K6L9O8N4k39Q3K17P0k44J20
$$ plain form
3613 87 -119 -31 181 -16 -229 71 -2 -124 -68 124 -89 14 -78 132 261 -118 -50 -129 16 -163 42 52 -149
3636 -149 -140 51 107 -29 293 26 14 36 -224 4 -112 104 35 113 -55 -26 -236 61 -106 -70 -96 66 34 -41
3660 -41 68 9 -8 54 -24 -289 278 -262 296 73 62 46 2 -12 187 -77 115 -117 15 -56 -68 -27 -168 44
3684 44 115 202 -76 -187 89 254 -164 136 -96 148 208 -81 55 -45 173 -50 155 -57 -166 170 74 3
3706 3 -92 -291 -213 -48 -61 11 -14 8 -8 -147 40 36 113 -171 -74 -111 192 47 -53 -306 -227 132 -127 103 -284
3731 -284 -48 90 -190 97 0 142 80 -115 -26 -209 60 48 12 -129 -226 -125 -187 -113 -80 -110 53 59 51 -52 -24
3756 -24 -87 -250 -311 -194 -140 45 -229 -51 27 -104 156 -51 -271 121 154 -127 -10 70 -282 -69 -10 -148 -182
3779 -182 98 141 74 102 -158 -173 35 43 -196 -246 240 104 -50 -55 -145 96 -275 -75 297 -249 71 -116 -112 238
$$ packed form
3613H7k06Q8K12j97k13L00p3j22N6J92k13J03r2K10J29l79O8p9J45j79K05J0k01
3636a49RJ91N6j36L22k67j2K2k60K28j16K16o9P8j68K9k10K97j67L6k6J62l2p5
3660d1J09n9j7O2p8k65N67n40N58k23j1j6m4j4J99k64J92k32J32p1j2M1j41K12
3684D4P1Q7k78j11K76J65m18L00k32K44O0k89J36j00K18k23K05k12j09L36r6p1
3706Cr5j99P8J65j3P2k5K2j6j39J87mP7k84R7l7L03j45j00k53P9L59k59K30l87
3731b84K36J38k80K87r7J42o2j95Q9j83K69j2l6j41r7J01o2P4L3l0J63Oqj03K8
3756b4o3j63o1J17N4J85k74J78P8j31K60k07k20L92L3k81J17Q0l52K13N9j38l4
3779a82K80M3o7K8k60j5K08Qk39n0M86j36j54nr0K41l71K00L72n46L20j87ML50
$$ plain form
3803 238 -55 408 -3 332 61 -128 73 83 90 -108 80 216 -104 -213 6 279 146 -246 4 -139 8
3824 8 303 -59 -27 6 227 -52 -57 -39 197 106 -4 102 -107 39 97 -6 -65 89 -91 114 60 -235 -88 56
3848 56 81 -58 169 85 56 -2 -51 129 -308 -2 272 239 -12 65 54 93 275 -213 116 -192 -162 -163 231 7
3872 7 -48 -77 209 -158 77 -158 -139 67 61 -54 99 120 128 -156 149 389 308 -226 -55 -7 -151 -55 2 144 -63
3897 -63 -91 -42 -81 73 56 -89 18 -110 89 -109 -91 -48 -298 167 100 172 -112 270 -122 143 -12 -435 2
3920 2 -112 165 -48 -124 30 -82 59 -7 58 157 -139 -9 -1 98 255 -139 149 -55 -118 -208 131 -108 -154 340
3944 340 14 49 -184 -187 57 -11 -400 -75 -131 65 174 134 16 -95 -47 374 -117 207 -324 -227 38 -31 96
3967 96 -52 241 64 230 -56 18 48 -48 -333 -213 101 65 290 320 -99 -199 57 -9 -53 49 98 103 139 11
$$ packed form
3803B38k93M63m11L35k71j89K01J0Pj98J88J36l20j09K19K73j33l92K50j43J47
3824HK95l62L2L3K21k79nJ8K36r1j10J06k09J46N8j03n9J54j80K05n4k95J47J44
3848E6K5j39K27q4k9n8m9J80m37L06K74l3k51P7j1L9J82m88L29l08L0jL94k24
3872Gn5k9K86l67K35k35J9K06oj15J53K1Qk84L05K40q1n34J71M8j44R6N7J42k07
3897f3k8M9l9J54j7j45J07j28J99j98J8M3k50M65o7P2k84L82l92K65j55m23M37
3920Bj14K77k13p6J54j12J41o6O5R9k96J30QR9J57l94K88k04o3r0L39k39m6M94
3944C40l26L5k33lK44o8l89L25n6J96J09m0j18j11M8M21m91L24n31R7K65o9J27
3967I6j48K93j77J66k86P4L0r6k85J20L14l6K25L0m19j00K56o6m4J02M9NL6j28
$$ plain form
3991 11 -62 259 88 -40 -129 77 47 203 -191 -160 -50 -43 -61 -228 -44 38 175 -40 -59 274 157 -73 -281
4014 -281 -6 105 -235 24 70 -34 52 494 173 53 76 -108 139 51 75 51 25 28 3 68 105 93 79 176 256
4039 256 -98 -75 -55 -164 117 120 -228 -200 226 8 -92 69 -37 -275 77 -154 -103 111 -50 -23 259 -317
4061 -317 146 -43 -134 -87 38 39 112 -10 -141 -231 -58 198 -49 125 -265 -13 -8 231 414 296 -191 26 109
4084 109 316 -152 -59 -22 122 114 -118 101 -9 100 -86 -210 -166 -69 -184 199 -125 203 98 74 -80 -122 -156
4107 -156 115 -23 -76 197 22 -240 13 -186 99 58 -80 43 134 -119 63 31 -71 137 -65 301 -153
4128 -153 -44 -244 103 -94 235 -34 28 -22 -211 64 -209 0 18 -3 -98 -97 -80 206 70 -108 -47 104 -142
4151 -142 -116 39 -68 -260 -121 90 -113 282 18 -248 55 -293 -160 37 -166 39 -14 189 -75 -35 -152
$$ packed form
3991A1p3L21j71j28q9K06l0J56l94L1J10Pj8j67J84Q2J37k15j9L33j17k30k08
4014b81K75J11l40K59M6j04Q6M42l21j20K3j84K47q8K4k4k6Lk5O5L7j2j4R7Q0
4039B56l54K3K0j09K81Ll48K8M26k18j00J61j06k38L52k31N1K14j61K7K82n76
4061c17M63j89r1M7J25JP3j22j31r0J73K56k47J74l90K52NK39J83j18m87K17Q3
4084A09K07m68R3L7J44qk32K19j10J09j86j24M4R7j15L83l24L28j05k4j54m2l4
4107a56K71j38n3K73j75k62K53j99K85m1j38J23R1k53J82l2j02K08k02L66m54
4128a53J09k00L47j97L29k69O2n0j89K75k73K09J8k1r5JJ7K86j36j78O1J51k46
4151a42K6J55j07j92J39K11k03L95k64k66L03l48J33J97k03K05n3K03k64M0j17
$$ plain form
4172 -152 -69 19 140 281 -149 75 321 93 58 -158 88 -198 62 -292 7 -242 -9 -213 -71 -43 -13 -102
4194 -102 234 51 92 -217 -58 -80 -60 120 136 -54 10 57 4 3 210 142 28 76 -159 11 183 189 33 141
4218 141 179 112 -119 -132 83 36 8 -89 -364 142 239 -124 -135 -69 17 -219 -197 178 -26 203 148 96 86 119 38
4243 38 333 -134 -14 -67 -103 -89 61 19 -99 297 -35 -100 -66 -78 -126 -40 -197 -172 -102 85 249 -182 -36 -243
4267 -243 73 56 50 265 -199 -48 299 -42 -224 -78 -8 175 -128 -112 134 32 21 -221 -101 -148 -195 177 114
4290 114 -116 29 -44 29 -192 99 59 -119 -75 19 105 -57 -325 -132 91 67 -175 108 73 -108 -40 187 -3
4313 -3 -431 -3 -158 6 183 225 -164 13 -54 -86 202 -29 155 -97 126 -381 -108 293 -294 42 180 -22
4335 -22 -7 177 30 147 263 11 -11 -7 -168 254 80 -135 -57 35 -97 -151 133 48 -217 -14 -86 124 20
$$ packed form
4172a52Q3Q8J21J41m30K24K46k28l5k16K46k86K60l54K99k49K33k04J42K8L0q9
4194a02L36j83M1l09J59k2K0J80J6j90O4M7n3jK07o8j14M8k35J70J72Oj56J08
4218A41L8o7k31j3K15m7k8r7k75N06R7l63j1O6Q6k36K2L75k04K29n5n2j0L3q1
4243C8K95m67J20n3l6J4J50m2j18L96l32o5L4j2m8Q6j57K5P0J87J64m31J46k07
4267b43L16j7oK15m64J51L47l41j82J46P0J83l03J6K46j02j1k42J20m7m7L72o3
4290A14k30J45p3P3k21K91m0j78M4R4Q6j62k68J93K23k4k42K83l5j81O8K27j90
4313cm28M28j55J64J77M2l89J77o7l2K88k31J84k52K23n07K73M01n87L36J38k02
4335b2J5J84j47J17J16k52k2Mj61M22j74k15P8R2j32n4K84q5k65K03p2K10j04
$$ plain form
4358 20 -214 -190 33 92 -109 81 86 -117 165 9 153 29 96 -27 -235 -71 55 9 109 -64 -89 110 7
4381 7 224 87 -80 -88 -24 304 -115 -62 -10 -112 65 245 -88 -143 116 -94 -121 -143 -8 171 187 36 114 5
4405 5 99 -31 -324 30 -101 128 24 139 21 153 383 32 8 404 194 -110 -2 9 83 -151 -64 -348
4427 -348 -59 -149 32 -217 42 18 62 -96 393 -29 146 -304 -357 -242 -234 26 77 12 152 226 -90 -108 -106 -44
4451 -44 126 20 265 165 -38 -235 172 505 -81 -208 -65 -134 224 -245 66 213 103 -104 166 151 -146
4472 -146 93 220 -184 246 30 39 202 -139 -77 146 66 0 -6 65 81 248 -143 -30 -66 -121 378 -85 -168 173
4496 173 -103 31 -15 -149 78 0 27 -138 -122 17 -202 -6 185 38 152 120 220 1 -59 254 -144 -9
4518 -9 -263 -173 88 -83 -183 159 -100 41 111 -321 77 422 97 37 195 -168 46 -35 -310 311 29 85
$$ packed form
4358B0k34K4K23N9k01J90Nk03K82j56J44j24O7j23k08J64J26m6J00j73k5J99j03
4381GK17j37j67qO4L28m19N3N2j02J77J80l33n5K59k10k7k2J35J79J6j51P8j09
4405ER4j30k93L54j31K29j04J15j18J32K30l51k4L96k10l04J08J1P4k34Q7k84
4427c48K89r0J81k49K59k4M4j58M89m22J75m50n3J15QK60N1o5J40P4l16j8KO2
4451d4J70j06K45j00k03j97M07L33n86j27J43o9L58m69L11J47j10k07K70j5k97
4472a46K39J27m04M30k16RJ63l41O2K23q0o6oP1J6J67l91J13l6n5M99m63q3L41
4496A73k76J34m6j34K27p8K7j65J6J39k19J96J91j47J14l2J00k19o0L13l98J35
4518ik54R0K61j71j00L42k59J41P0m32L98L45l25o0J58l63K14q1k75O21k82N6
$$ plain form
4540 85 -136 -109 214 417 74 26 2 32 218 -45 17 193 -66 -313 -188 -151 -50 198 -24 13 142 36 -119
4563 -119 70 161 48 131 -202 272 86 274 213 -158 -36 -93 61 -76 -20 -221 -106 38 -241 6 3 91 -279
4586 -279 186 -94 -365 105 -68 -15 -147 28 53 -96 -131 0 114 139 -190 139 14 -52 212 -23 -81 -213
4608 -213 -66 245 -54 -101 95 21 -35 -60 50 209 -48 105 80 130 119 180 49 1 117 -389 -48 374 9
4631 9 -320 195 -169 -70 -189 250 112 -136 -66 -22 -127 -85 83 233 -54 -69 -228 -5 -92 -222 355 -106 -89
4654 -89 198 122 189 -300 89 44 -61 190 154 273 131 -107 22 -102 77 156 175 -83 -169 -101 40 -473 180
4677 180 -37 -148 -99 -168 31 110 103 -229 214 -73 -269 -85 -213 92 -329 68 -43 -165 82 -108 62 174
4699 174 11 -23 57 -104 343 67 43 -29 -107 153 -22 -140 -301 -301 133 118 130 57 132 -218 -209 232 167 85 -124
$$ packed form
4540H5k21K7L23K03l43m8k4L0J86k63O2J76k59k47J25L7J01K48k22L7J29j06j55
4563a19J89R1j13Q3l33M74j86J88o1l71J22n7J54j37N6k01J15J44k79K47lQ8l70
4586b79M65k80k71M70j73N3j32J75K5j49l5J31J14K5l29L29j25o6K64k35n8j32
4608b13J47L11k99m7J96p4n6k5J10J59k57J53k5N0j1O1j31m8J16n06L41M22l65
4631Il29N15l64R9j19M39j38k48P0M4j05M2J68J50k87j5j59K23q7j30N77m61J7
4654h9K87p6O7m89L89m5j05K51l6J19j42k38J29j24J79P9J9k58q6O8J41n13O53
4677A80k17j11M9o9J99P9pl32M43k87j96J84j28L05m21L97j11j22K47j90J70J12
4699A74j63l4Q0j61M47k76k4p2p8K60j75j18j61%M34j5J2p3P5l50RM41o5q2k09
$$ plain form
4724 -124 -125 66 -1 -120 -140 -129 -312 -44 -30 68 96 40 -44 -288 70 232 69 -16 230 -102 -71 249 -38 -152
4748 -152 154 -1 -119 29 -25 31 65 39 -314 283 121 106 -66 18 -248 104 246 -228 -103 76 -185 -204
4770 -204 136 181 -16 -17 90 144 5 77 117 -22 188 8 -29 -256 -167 -32 104 -72 -103 -169 45 -4 41 241
4794 241 254 146 -116 226 -371 152 64 100 314 -326 -115 144 35 -193 -236 -159 -136 -201 -48 -21 53 21 66 30
4818 30 -302 -259 15 112 -78 -393 -17 33 -105 -163 -74 -119 63 74 -167 256 50 167 -113 -59 -9 20 130 233
4842 233 22 2 -56 -145 -43 162 -64 27 -158 -46 74 -191 -1 -17 -578 -133 244 171 -235 -189 -61 -203
4864 -203 -46 127 -44 -131 57 90 -36 256 -15 -255 -37 6 -153 -116 -180 -145 172 119 -122 164 445 -131
4886 -131 -323 -139 -132 -109 -269 3 -25 105 -62 14 -57 106 163 -24 13 184 2 133 241 -95 -213 36 89
$$ packed form
4724a24jJ91o7j19k0J1j83K68J4R8K8n6q4k44L58J62j63q5K46l32L1L20k87j14
4748a52L06j55j18J48n4N6L4k6l53N97j62j5j72Q4k66L52J42m74J25J79k61j9
4770b04L40M5j97jJ07N4j39P2M0j39K10j80l7k27Q9J35J36j76l1o6K14m9M5K00
4794B41J3j08k62L42n97N23q8L6K14o40K11K59j09k28m3P7K3o5J53K7P4l2M5l6
4818C0l32M3K74R7j90l15L76N0j38n8Q9m5J82J1k41M23k06J17k80N4N0K9J10J03
4842B33k11k0n8q9J02K05k26R1j85J12J20k65J90j6n61M45L77p3m06M6J28j42
4864b03J57J73j71q7J88L3j26K92k71k40K18M3j59L7o4L5L17n3k41K86K81n76
4886a31j92J84PK3j60K72k8J30j67P6p1J63N7j87L7J71j82J31J08l36j18K49N3
$$ plain form
4909 89 -334 -32 58 170 234 43 -25 -97 -299 -112 -38 155 212 -123 63 -76 -102 -30 39 -255 -11 -204 -218 11
4933 11 87 278 103 -103 42 260 14 156 195 57 116 -8 -25 -44 -255 -152 -167 358 69 142 -8 80 96
4956 96 -156 141 92 -55 -150 -5 -117 -6 93 81 -12 -61 -51 98 119 63 228 -104 -335 73 -65 -19 369 228
4980 228 43 -77 144 208 -84 -83 -60 -94 102 -30 286 148 -114 -343 73 78 194 -166 75 108 127 -89 -98 0
5004 0 -2 58 -44 150 240 -51 177 -105 -222 38 -43 -67 60 9 -108 58 21 66 84 145 17 -80 387 183 -21
5029 -21 -145 -141 169 -109 -100 -42 -175 -80 -195 -246 -52 116 -175 82 178 -126 105 100 -148 44 -303 110 -93 -98
5053 -98 90 100 -101 -42 -89 27 -101 -178 -235 -195 119 299 260 91 -70 -24 84 -351 -98 -75 275 -48 -114 255
5077 255 70 -210 -53 45 -149 252 -121 113 -339 87 -88 -295 8 -133 205 -80 83 230 203 -42 -3
$$ packed form
4909H9m23L02R0J12O4j91o8p2k02J87P4J93N7l35J86j39k6P2O9k94K44j93j4K29
4933A1P6J91j75k06J45K18k46J42L9j38N9j24j7j9k11J03j5N25k89P3j50Q8J6
4956I6k52K97m9j47r5J45j12J11R9j2r3m9J0J49K1n6J65l32k31M08j38M6L88j41
4980B28j85j20K21O4k92JK3l4J96j32L16j38k62k29M16NJ16l60K41L3J9k16rR8
5004@kO0j02J94R0k91K28k82j17K60q1k4J27n1j17J66l7M5J8O1j28r7M67k04k04
5029b1j24ML10k78RN8j33R5j15n1J94J68k91K57R6l04K31nk48J92l47M13k03n
5053i8J88J0k01N9m7J16j28p7n7M0L14J80l9j69j61M6J08m35K53K3L50l23o6L69
5077B55j85k80J57R8j94M01l73K34m52M26j75k07L03j41L38k85J63J47k7k45L9
$$ plain form
5098 -3 66 -323 -14 2 -95 30 -81 -72 -226 61 244 59 81 85 -12 -11 40 42 -270 52 -184 149 120 -149 122 -42
5124 -42 105 161 190 96 80 13 -73 388 109 140 -15 -87 -168 21 -346 -223 387 -45 10 -1 -6 -88 158 27 -86
5149 -86 249 -70 -164 142 -130 49 -123 44 -1 95 -110 -120 -21 -316 3 22 198 363 -7 123 12 143
5171 143 175 25 198 116 -54 -155 -195 -364 120 206 -69 -213 -100 -100 -34 109 118 -142 -146 74 -420 -169 -55 72
5195 72 -8 -176 154 -16 150 146 196 -127 -346 35 -27 -2 -128 107 -44 143 195 -37 330 -33 158 116 61
5218 61 -38 -52 262 90 -219 -144 127 184 3 8 -64 57 3 -29 -172 396 239 212 -196 -182 151 71 -132 -19
5242 -19 202 -263 264 -35 102 -45 -57 -105 11 -37 0 -17 -161 -47 174 -108 -270 22 52 75 82 126 62 129
5266 129 12 191 -113 77 -99 -100 181 274 -7 -32 -151 -181 -64 7 316 -27 -75 -263 -14 -13 7 -74 -212 -78
$$ packed form
5098cO9l89L09J6r7J25j11Rj54K87J83j85K2Mr7JN1Kl12L22k36L33k9k69K71j64
5124d2J47N6K9r4j6o7q6M61k79L1j55p2q1J89l67J23O10m32N5j1nq2K46j31j13
5149h6L35l19r4L06k72J79j72J67m5R6k05j0R9k95L19J9J76J65l70J30j11J31
5171A43L2j50J73q2j70j01m0j69M84Q6k75j44J13%O6J43Rk60mK20m94K51J14J27
5195G2q0j68L30j70J66mN0l23k19L81o2K5j26K35j51J87N2k32L67l63J91m2n5
5218F1r9j4L14j72l09P5K71N7j81Np2J21n4l2j43N68j57k7m08J4L33q0k03J13
5242a9K21m65N27k99J37j47j2m8J16m8L7j7j44J14K21k82j62K92L0K3PM4o4O7
5266A29j17J79l04J90j76jK81R3k81k5j19l0J17P1L09l43m8j88K49JK0q1j38J34
$$ plain form
5290 -78 -209 -141 74 39 -96 -158 -53 139 144 -132 124 -120 172 43 120 -42 -35 -22 -176 -65 -244 68 84 77
5314 77 -194 -64 27 -26 -185 -145 6 -195 -119 -29 36 -37 -168 80 -27 -124 -179 69 -218 -130 111 -75 15 -209
5338 -209 -56 11 -88 -20 -25 168 -5 103 -11 49 -118 151 72 4 -66 -16 -106 90 -347 -282 -88 264 224 193 210
5363 210 -187 106 2 -186 -113 33 164 -254 41 -84 88 233 -75 -160 -142 -112 52 91 -53 111 -45 -195
5385 -195 122 -82 -71 103 107 -40 213 46 77 185 -218 -95 -67 -14 43 140 -140 -261 142 196 206 -105 -71 105
5409 105 35 -64 40 98 -464 289 -274 -94 75 37 59 0 76 -105 15 -120 -152 321 -71 -74 -42 -326 209 43
5433 43 -238 -373 -197 85 211 -250 2 -100 -323 13 -22 114 47 -172 264 111 54 47 113 -173 -36 82
5455 82 302 -132 38 140 121 93 21 -70 -244 29 -228 32 -65 -187 -36 158 -7 35 157 119 -134 -124 -157
$$ packed form
5290g8j31O8K15l5j35o2J05J92Nk76K56k44K92j29P7j62PJ3j54J11j79L12J6p
5314G7k71J30R1n3j59M0J51k01P6R0O5p3j31K48j07r7n5K48k87Q8K41j86R0k24
5338b09J53O7r9O8nJ93j73J08j14O0j67K69p9o8p0N0r0J96m37O5J94L52m0l1J7
5363B10l97K93j04j88P3J46J31m18K95j25J72J45l08q5J8L0J64L9j44J64j56j50
5385a95L17k04J1J74Mj47K53j67L1J08m03J23K8N3N7R7k80j21M03N4J0l11L4J76
5409A05p0r9J04N8n62P53n63J80J69l8K2n9P6j81J20j35l2M73l92lL2k84N35j66
5433D3k81j35J76K82J26m61K52j02k23L36l5J36o7k19M36j53n7pO6k86J37J18
5455H2K20m34J70J02j9k8p2r1j74K73k57K60r7j22J51J94j65M2J22l8k53J0l3
$$ plain form
5478 -157 -158 -100 10 298 -31 -255 -113 115 8 -43 -54 -185 -48 -242 -210 165 -16 99 -159 236 161 -134
5500 -134 221 145 -86 31 -40 92 -2 23 -5 -270 -122 -12 -117 -112 223 -48 -29 -34 68 20 164 110 95 183 50
5525 50 -251 -156 161 -110 39 8 72 14 -58 313 -89 -223 104 121 -86 227 -157 -337 -40 -45 26 479 1
5548 1 299 -5 -13 186 -67 -60 -58 94 -68 106 -38 44 -166 -66 -39 118 -46 85 -53 -142 17 -29 -9 -22 -15
5573 -15 -53 -11 90 -219 -87 -24 48 160 -101 18 80 238 -242 -22 -20 280 123 147 -30 124 35 -295 186
5596 186 180 193 -145 -324 -70 -7 105 99 -174 194 69 177 -53 139 -91 -20 174 126 18 96 2 139 -206
5619 -206 111 145 52 -73 -90 63 245 -291 123 28 -24 267 141 -264 139 78 -30 72 -134 -106 75 244
5641 244 -154 -102 242 -102 -141 24 -128 -153 88 105 11 149 -41 -49 29 -23 37 68 -17 223 -178 -147 3 -57 29
$$ packed form
5478a57jN8J10K88l29k24J42K28j07n1j1j31J37j94L2L75j81J15k58L95p5k95
5500a34L55p6k31J17p1J32r4K5k8k65J48J10j05NL35k71J9nJ02m8J44n4j5Q8j33
5525E0l01R5L17k71J49l1O4n8p2L71m02j34L27J7k07L13l84j80K97nP1M53m78
5548AK98l04qJ99k53PKJ52j62J74j44Q2k10J00K7J57j64J31j38q9J59m6K0j3P
5573a5l8M2J01l09J32O3P2J12k61J19O2J58m80K20KL00j57K4j77J54q9l30M81
5596A86oJ3l38j79K54O3J12ok73L68j25J08k30J92k30P1J94m8j08P8r4J37l45
5619b06L17L4r3j25j7J53J82n36M14r5n2K91j26m05M03o1j08J02k06K8J81J69
5641B44l98N2L44l44l9J65j52k5K41J7r4J38j90qP8n2O0L1q5K40m01L1J50o0Q6
$$ plain form
5666 29 40 151 121 19 186 91 48 130 -92 -235 40 29 -21 14 215 116 -3 -42 33 -92 -114 -31 38 106 -65
5691 -65 17 -105 -94 -2 -147 -89 -53 179 -175 -147 104 -22 -68 -193 -87 62 88 -99 -40 -109 2 12 52 257
5715 257 38 100 38 -261 17 167 11 17 -125 129 -150 -20 -93 76 135 -156 -64 -474 90 259 -36 -172
5737 -172 43 -12 129 -201 -19 8 -73 -140 -90 -1 36 25 -147 -19 35 187 25 106 64 -319 36 58 103 -13
5761 -13 87 -274 95 -22 -175 73 102 -171 121 -102 -1 56 -147 81 95 135 33 107 -34 2 23 -191 -27
5784 -27 87 -250 117 205 -115 -167 61 -89 -101 -261 -1 -266 -129 101 80 17 61 72 -41 58 149 -91 156
5807 156 -127 -33 177 -58 242 -115 -373 112 62 -170 -81 -127 -180 60 34 -162 -171 -101 113 -41 -212 32 -110
5830 -110 197 -352 -30 269 -212 -15 -82 78 9 231 395 84 18 134 -19 -67 163 0 -181 -322 -223 -101
$$ packed form
5666B9J1J11l0j02J67r5m3Q2k22j43K75j1n0L5K01r9j19l9P5j25k2Q3O9O8j71
5691f5Q2j22J1R2j45N8L6K32l54K8K51j26m6j25J06J49K6j87N9o9J11J0M0K05
5715B57k19O2o2k99K78J50j56Oj42K54k79J30p3J69N9k91R2m10N64J69k95j36
5737a72K15n5J41l30J82K7q1o7N0Q9L7j1j72J28N4J52j62Q1m2l83L55K2M5j16
5761a3J00l61L69j17j53K48K9k73K92k23J01N7k03K28J4M0j02P4j41L6K1k14J64
5784b7J14l37L67Q8l20n2K28j50j2j60K60k65J37K30k1o3M4J1j13R9R1k40K47
5807A56k83R4K10k35L00l57k58M85n0k32Q9m6n3K40k6j96rP0K14j54j71K44j42
5830a10L07n49L22K99m81J97o7J60o9K22J64l11o6J16j53m8K30j63j81j41R9J22
$$ plain form
5852 -101 -57 35 28 -240 69 98 -88 -182 -108 60 41 -123 -153 -52 -90 -87 -174 212 239 -84 -35 -14 209 130 -57 -61
5878 -61 190 -14 -329 230 66 -145 43 210 -55 190 42 97 235 84 61 152 223 -152 -61 131 50 77 281
5901 281 -50 -13 44 -50 196 229 73 204 -212 152 -245 111 47 18 -73 34 3 -52 102 296 69 -161 42
5924 42 33 -54 2 68 63 -67 13 -192 99 -221 117 3 94 -17 280 -203 -103 52 23 -319 -9 -97 -9 186
5948 186 156 97 -111 -346 148 129 -108 -94 -209 -156 -24 -45 -31 163 -143 101 -16 -107 -268 33 226 89 -161
5971 -161 -78 302 -72 -27 -63 61 63 -34 -165 -140 -124 248 272 143 122 -114 16 -19 -522 39 -131 -51 -183 -21
5995 -21 -14 164 -161 -169 149 151 104 100 91 239 124 -179 129 163 52 -115 -6 -213 -73 115 -270 97 57 -157 -56
6020 -56 -20 120 98 109 29 -185 -203 -53 60 -59 -228 -247 -35 181 -149 -266 -152 187 -36 95 -77 47
$$ packed form
5852a01M4R2pk68L09K9j86r4P4J68j9j64l0J01l8Lq7L86K7l23M9K1K23p9j87m
5878f1K51k04l15N59j64k11J88J67k65K45j48N5J38j51k3R1P1l75R1J92q1K7K04
5901B81l31L7N7r4K46L3j56J31m16L64l97L56o4k9r1J07l1n5J54J94k27k30K03
5924D2rq7N6O6nj30Q0k05K91l20L38j14R1j11K97m83J00J55k9l42L10q8Q8J95
5948A86l0n9k08k35M94j9k37J4j15N3J32k1J4J94l06K44j17r1j61L01J93j37k50
5971a61Q3L80l74M5l6J24Kr7j31K5J6L72K4j29k1k36J30l5n03N61j70Q0j32J62
5995b1PJ78l25qL18Km7mrJ48j15l03L08L4j11j67J09k07J40J88l85L67m0k14J01
6020e6L6J40k2J1q0k14j8J50J13j19j69j9K12K16l30j17J14L39k23J31j72J24
$$ plain form
6042 47 -60 -8 7 -46 -135 78 -39 64 -53 -21 102 38 -102 -1 141 -310 -286 -133 136 253 24 77 -20
6065 -20 -45 93 88 93 -137 27 -317 471 -504 27 117 -144 230 60 213 56 33 296 -117 -9 -171 222 126
6088 126 117 67 -35 -38 -155 -209 28 -95 -270 -79 -91 144 67 36 19 -245 -269 85 208 -185 -102 313 151 -209
6112 -209 191 -367 -115 -366 65 538 -89 -168 190 -57 -48 -211 129 -147 232 30 105 -42 16 -202 -61 81
6134 81 -172 120 13 -97 -176 146 -61 22 69 -13 -147 320 -55 178 -33 -1 -340 -76 88 -63 21 91 -74
6157 -74 7 -41 16 57 153 -75 -266 -293 94 -50 -114 68 -264 124 184 55 -100 183 -169 -39 -45 -27 25 -150
6181 -150 114 261 70 114 -40 -98 5 -7 -117 -1 203 3 -194 273 228 46 -109 -204 21 95 111 247
6203 247 14 -19 54 -130 -15 108 97 -231 -364 62 -241 16 44 22 -252 -298 120 81 109 70 231 47 124
$$ packed form
6042D7j07N2J5n3q9K13j17J03j17L2J23o4j40J01J42m51K4J53K69J17k29N3r7
6065b0k5J38nNk30J64l44P88r75N31R0k61L74j70J53j57k3K63m13J08j62L93r6
6088A26rn0j02lj17n4K37j23j75J91j2K35p7l1j7k64k4L54J23l93Q3M15j62l60
6112b09M00n58K52k51M31M73o27p9L58k47Rj63L40k76L79k02P5j47N8k18J41J42
6134H1k53K92j07j10p9L22k07Q3M7q2j34M67l75K33k11L2l39K64J64j51Q4P0j65
6157g4Q1m8N7M1R6k28j91k7L87j44o4J82l32L88O0j29j55K83l52J30oJ8N2j75
6181a50K64J47j91M4j54n8J03j2j10J16K04k00j97M67m5j82j55r5K25P4J6J36
6203B47k33l3P3j84J15J23j1l28j33M26l03K57K8k2k74m6M18l9K8l9J61j84P7
$$ plain form
6226 124 -10 -145 56 -93 -89 -46 -51 342 -77 263 260 -156 -156 319 -219 -40 216 125 65 -111 98 133 -331 -122
6250 -122 -242 27 -38 127 56 -81 -58 87 178 -202 -229 80 20 -113 -131 0 -91 -100 156 62 51 -189 226 -33
6274 -33 -102 -124 37 204 -162 93 10 -49 -68 75 -56 -179 -66 -19 80 158 83 -24 -125 -153 112 -77 98 113
6298 113 150 -195 -38 4 28 267 50 11 48 -52 16 59 18 -197 121 50 -20 134 -169 -214 47 -29 -305 120
6322 120 -109 -2 28 -109 166 -123 -228 -45 -112 -140 241 -179 27 -118 -45 227 -49 -98 -49 -280 -144 156
6344 156 114 -112 -273 58 56 5 -64 161 77 -13 62 196 125 327 109 35 17 -257 10 -169 411 -72 -228 13
6368 13 -102 81 -93 -325 90 -14 -59 138 49 -183 72 -83 -169 -119 -126 210 153 169 57 -161 -37 54 -111
6391 -111 26 -176 -111 80 -102 -125 158 59 -46 -110 29 -63 -140 -227 -20 -32 1 -37 143 324 174 101 -12 -105
$$ packed form
6226A24j34j35K01j49MM3nL93m19L40lm16%M75n38J79K56r1o0j76K09L5m64K09
6250a22j20K69o5J65p1j37K3J45R1l80k7L09o0j33j8J31r1rK56r4j1k40M15k59
6274c3o9k2J61J67l66K55q3n9j9J43j31j23J13M7R9P8p5j07j01k8K65j89J75J5
6298A13L7l45J57M2K4K39k17l9L7j00O8M3m1k15L18p1p0J54l03m5K61p6k76M25
6322A20k29J07L0j37K75k89j05J83o7k8L81m20K06j45P3K72k76m9M9k31J36L00
6344A56m2k26j61L31kn1o9K25q4r0P5J34p1K02k18p4j8k74K67j79N80m83j56K41
6368A3j15J83j74k32M15j04m5J97q9k32K55j55q6N0pL36n7J6j12k18J24R1j65
6391a11J37k02O5J91j82k3K83r9j05o4J39r2p7q7K07j2L3l8J80J81j50p3j13r3
$$ plain form
6415 -105 -143 180 -61 -197 -315 -98 -5 166 12 -348 -178 -190 309 -9 199 33 117 -79 83 -70 1 -66
6437 -66 -20 -43 129 -87 113 23 -21 137 60 167 90 252 -154 -239 163 -2 48 334 150 -111 -14 189 89
6460 89 -216 -207 -158 -6 19 161 -208 80 -13 -254 -272 67 -144 -29 92 -166 13 -67 88 257 -9 176 40
6483 40 -59 17 -285 -103 -81 170 143 -246 241 184 167 -85 -189 93 279 -51 128 66 41 136 -220 80 143 -112
6507 -112 9 -122 -207 112 -198 105 -10 -82 -115 -82 109 9 -253 -302 -232 -150 73 181 105 83 219 190 65
6530 65 -148 195 -140 88 47 0 39 -245 46 237 65 69 55 -13 -88 106 15 -134 226 118 105 -168 -45 13
6554 13 -54 32 57 -143 211 143 -102 -76 242 54 174 128 74 31 -25 -176 -257 -335 -26 90 129 51 -233 51 -129
6579 -129 169 169 176 -192 -86 -204 138 -40 133 185 -53 136 -220 139 195 33 -56 145 89 -96 252 175 162
$$ packed form
6415a05l8L23k41j36j18K17R3J71j54l60J70j2M99l18K08j66Q4j96J62j53P1o7
6437f6M6k3J72k16K00r0m4J58p7J07p7J62m06q5M02j65N0K86j84k61R7K03j00
6460H9l05RM9J52K5J42l69K88r3k41j8L39k11J15J21k58J79q0J55J69k66J85j36
6483D0r9P6l02J82K2K51k7l89M87n7j7k52j04K82J86l30J79o2k5R5l56L00O3k55
6507a12J21j31q5L19l10L03j15p2l3L3J91j00k62m9P0Q2K23J08p6k2J36k9j25
6530F5k13L43l35K28m1m7L9k84K91J91j72Mj4o8p5J94r1j49L60j08j3k73J23N8
6554A3o7Q6K5k00L54o8k45K6L18j88J20m6n4m3n6j51q1p8L09J16L9p8k84K84j80
6579a29K98%Pl68J06j18L42j78J73N2k38J89l56L59N6j62q9K01n6j85L48p7j3
$$ plain form
6602 162 -222 57 -145 217 -75 -12 -52 -95 -84 -397 -17 122 132 -259 285 -34 -16 25 35 -149 -15 286 -29
6625 -29 -150 -239 -43 46 160 -363 -38 -88 -27 -132 -239 24 -173 8 161 35 140 -185 142 -213 6 16
6647 16 64 310 -140 148 -42 128 -2 339 198 -67 55 72 -110 -74 151 -123 87 197 -248 89 259
6668 259 186 -144 39 -136 -159 -26 144 26 153 -182 262 100 132 -123 -16 -62 -26 -24 9 42 33 194 -335 99
6692 99 84 125 -202 -104 61 66 31 259 -11 227 -296 110 212 -58 -227 -79 -52 145 -62 -64 61 -51 285
6715 285 17 12 56 194 -258 -88 205 6 28 100 265 93 8 96 -331 322 195 -374 -68 133 21 -132
6737 -132 33 -77 5 183 -7 130 105 -44 7 126 -114 -108 170 97 180 25 54 40 -12 -8 30 -80 -54 -104 8
6762 8 -43 113 -139 -206 1 -53 64 -79 170 63 -91 -229 258 -23 -189 80 55 74 195 -41 275 229 235
$$ packed form
6602A62l84K79k02L62k92O3m0m3J1l13L80J39J0l91N44l19J8M1J0j84J34L01l15
6625b9j21q9J96Q9J14n23L25n0O1j05j07K63j97J81J53j26J05l25L27l55K19J0
6647A6M8K46m50K88j90J70j30L41j41k65J22J7j82L6K25k74K10J10m45L37J70
6668B59p3l30J83j75k3J33J70j18J27l35M44j62L2k55J07m6L6KL3L3rJ61n29M34
6692I9j5M1l27R8J65Nl5K28k70K38n23M06J02k70j69J48K7J97k07kJ25j12L36
6715B85k68nM4J38m52J70K93j99K2P2J65j72q5Q8m27O53j27n69L06K01j12j53
6737a32J65j10Q2J78j90J37k5j49N1J19k40OK78p3Q3j55K9j4n2ML8j10K6n0J12
6762Hn1J56k52o7K07n4J17j43K49j07j54j38M87k81j66K69k5J9J21k36L16m6O
$$ plain form
6785 235 103 3 -39 256 -9 -222 -16 28 -78 -30 -16 -42 -126 46 30 -254 158 -42 -231 206 157 -56 108
6808 108 254 122 -144 179 140 94 -77 -106 231 -77 -1 -4 45 -8 -283 -148 148 97 49 9 34 90 -20 -252
6832 -252 -201 -105 47 -220 156 -146 -77 66 43 89 59 47 21 -249 10 -236 -121 123 -165 15 209 -128 -31
6855 -31 -215 -51 -16 -107 236 -125 -10 12 13 -16 -52 20 -29 -71 141 137 26 -47 66 -132 218 -99 279 -44 -107
6880 -107 27 102 -166 -115 31 -383 -28 -126 -171 85 87 -148 -83 -337 -46 -32 136 -46 57 -339 119 -97 -69
6903 -69 -25 197 109 -30 -94 17 -168 40 95 -155 75 94 -264 -236 83 -33 -193 -78 -1 46 -55 57 -96
6926 -96 13 41 154 -244 -33 -114 5 -330 -75 279 38 -145 41 175 -191 217 -221 261 -28 145 79
6947 79 -51 -129 36 159 216 -90 0 -173 -91 85 211 -70 -58 -102 -97 -1 -129 11 -128 -26 115 57 -23 165
$$ packed form
6785B35j32j00m2K95k65k13K06M4j06M8J4k6q4J72j6k84M12k00j89M37m9k13J64
6808A08J46j32k66L23l9m6j71k9L37l08P6lM9n3k75J35K96n1m8m0K5N6j10k32
6832b52N1R6J52k67L76l02O9J43k3M6l0j2k6k70K59k46J15K44k88J80J94l37R7
6855c1j84J64L5r1L43l61J15K2Jk9l6P2m9m2K12mj11p3J13j98L50l17L78l23o3
6880a07J34P5k68N1J46m14L55r8m5K56Kk35O5k54K91J4J68j82J03l96M58k16K8
6903f9M4K22q8j39o4J11j85K08N5k50K30J9l58K8L19j16j60J15P7M7j01J12j53
6926i6J09K8J13l98K11q1J19l35K55L54k41j83J86J34l66M08m38M82k89J73o6
6947G9j30p8J65J23N7l06R0j73Q2J76J26k81J2m4NR6j28J40j39J02J41n8q0J88
$$ plain form
6971 165 35 144 -151 71 -54 -139 163 186 -154 153 53 26 -87 -195 -99 54 -138 88 -19 -80 89 -87
6993 -87 -65 -68 19 -117 -403 44 -190 -2 166 67 -125 141 111 -115 314 83 -57 -89 -116 -280 -117 -113 220 -172
7017 -172 -127 34 19 103 124 101 65 -12 162 274 108 -67 -18 117 -132 -79 62 -107 -6 -107 -15 85 -54
7040 -54 68 87 -90 3 144 -122 -172 -142 -1 148 53 -163 -69 -66 121 110 -77 12 -269 19 -105 101 -198 48
7064 48 474 35 150 94 -51 269 -34 -34 54 93 141 -153 66 216 14 -147 274 85 -189 -17 -337 24
7086 24 -9 -67 -63 -125 176 -200 -6 -226 -167 -360 169 -90 -134 -71 71 329 -127 41 18 30 -86 -72 -16 115
7110 115 -148 -297 10 230 -180 43 141 -92 -223 -144 -27 -208 4 -61 64 51 -127 -281 20 -81 -178 159
7132 159 -291 -139 -133 -116 76 -187 168 -157 -4 167 -25 -221 -112 -101 -119 -65 44 -90 47 162 -160 111
$$ packed form
6971A65j30J09k95K22j25q5L02K3l40L07j00k7j13j08R6J53j92K26j07o1J69j76
6993h7K2lQ7j36k86M47k34J88J68r9j92K66l0k26M29k31j40l2k7j64J63ML33l92
7017a72M5J61j5Q4K1k3l6p7J74J12j66j75M9J35k49N3J41j69J01j01R2J00j39
7040e4J22J9j77R3J41k66n0L0J41J49r5k16R4LJ87j1j87Q9k81K88j24K06k99K46
7064D8M26m39J15n6j45L20l03%Q8L9M8k94K19J50k02j61M21j89k74J72l20L61
7086B4l3n8Mo2L01l76J94k20N9j93N29k59m4O3J42K58m56J68k3J2j16J4N6J31
7110A15k63j49L07K20m10K23R8k33j31P9J17j81K12o5J25j3j78j54L01j01r7L37
7132A59m50J52OJ7J92k63L55l25J53J71j92j96J09J1j8N4J09j34J37J15l22K71
$$ plain form
7154 111 300 -124 -73 -152 -65 166 -228 63 86 68 380 -152 17 110 -147 72 112 -79 64 -406 -168 -98 298
7177 298 -113 236 347 143 -18 94 203 -165 -82 -73 -225 48 201 -147 35 -134 307 -361 -41 20 -114
7198 -114 115 -101 -160 31 -45 221 84 -71 127 -144 266 -26 -136 -107 -99 -73 -252 -22 78 -25 -182 -24
7220 -24 114 142 93 -334 -42 64 -137 -121 -156 109 -93 -175 51 -82 83 -15 65 -180 152 -102 -170 12 18 -51
7244 -51 10 -141 -117 -197 15 51 -129 221 -23 23 -294 64 -217 -143 -97 -44 8 106 -250 -32 19 -317 84 139
7268 139 67 -91 -18 151 -18 -107 -227 -12 -39 57 -85 6 -236 -32 212 -107 -149 191 65 -177 2 -143
7290 -143 202 94 6 -86 -59 -162 229 -31 135 -50 57 34 37 25 -4 -39 111 -98 23 -116 144 -17 -24 306
7314 306 154 -130 -136 -125 34 -271 -19 -14 166 297 -135 -20 104 -290 119 -106 -27 -196 111 -146 121 -109
$$ packed form
7154A11J89m24N1p9Q7K31l94K91K3j8L12n32J69R3k57K19M0j91J43m70K38P0L96
7177B98m11L49J11k04j61J12J09l68Q3Rj52K73J53l48J82j69M41o68L20O1j34
7198a14K29k16n9J91p6K66j37j55J98k71M10k92j10K9QK6j79K30J00j03j57J58
7220b4J38K8m9m27K92J06k01J6l5K65k02q2K26j33J65r8Q0k45L32k54o8J82Oo9
7244e1O1j51K4q0K12L6j80L50k44M6l17L58k81P4M6N3N2R8l56K18N1l36M01N5
7268A39p2j58P3J69j69q9j20K15k7R6j42R1k42K04K44l19m2L40j26k42J79j45
7290a43L45j08q8r2K7j03L91k60J66j85J07k3Lj2k9l5J50k09J21j39K60j61pL30
7314C06j52k84oJ1J59l05K52NJ80J31m32J15J24l94M09k25P9j69L07k57K67k30
$$ plain form
7336 -109 40 372 158 157 23 -230 -11 225 96 133 14 -204 207 -35 2 204 36 -131 -211 17 40 -34
7358 -34 3 124 189 73 79 60 83 -121 -196 -113 165 -59 145 314 -216 39 25 -204 -75 16 78 -106 -123 2
7382 2 -53 -12 251 14 -327 10 -87 134 -52 -342 36 -170 -178 -48 -364 225 -27 237 -115 -35 47 33 184
7405 184 158 22 180 167 46 -288 -83 -142 -126 -66 -91 110 182 -4 165 82 148 -110 -8 -81 -25 69 -101 66
7429 66 -6 -2 -25 -168 -77 -252 -148 72 76 -104 -200 190 -111 105 79 -243 -89 -156 -98 262 -329 280 66 -154
7453 -154 -167 12 47 -224 -297 -159 -192 144 58 -82 -289 -208 -85 -9 155 17 -145 -230 15 -38 233 -75 -5
7476 -5 75 -47 177 148 -60 28 228 19 -125 -42 63 292 -97 -188 79 85 47 -443 318 259 -81 -301 74 3
7500 3 -229 -103 -214 -17 11 139 70 100 -202 206 176 -157 -146 124 176 142 41 -108 117 25 -25 -121 111 9
$$ packed form
7336a09J49L32k14jj34k53K19K36j29L7j19k18M11k42L7K02j68j67q0K28K3p4
7358c4L7J21O5j16Oj9K3k04p5Q3K78k24K04J69n30K55j4k29J29R1O2j84j7J25
7382Bn5M1K63k37l41L37r7K21j86k90L78k06qJ30l16N89k52K64l52Q0Q2j4J51
7405A84k6j36J58j3j21l34K05n9J6O0k5K01P2j86J69q3O6k58J02p3N6R4j70J67
7429F6p2Mk3j43R1j75J04K20Mj80r6L90l01K16k6l22J54o7N8L60n91O09k14k20
7453a54j3J79L5k71p3J38l3L36q6j40k07Q1J23P6J64j38j62q5K45n3K71l08P0
7476eQ0j22K24k9k08Q8K00k09j44Q3J05K29l89r1K67Ol8m90P61n9l40k20L75p1
7500Ck32J26j11J97K8J28o9L0l02M08l0l33J1K70N2l4j01j49K25r2n0r6K32j02
$$ plain form
7524 9 -39 157 -105 290 -19 10 -114 -230 82 -16 -294 8 -158 -140 1 -40 89 -461 19 -127 117 74 127
7547 127 -280 -17 159 52 17 67 125 52 -226 55 164 104 179 -25 -9 134 -41 34 90 -68 54 -12 50 75
7571 75 211 -63 81 42 -97 148 174 -15 -111 57 108 -12 311 -31 -34 381 25 88 22 21 -51 103 -13 216
7595 216 20 83 186 -23 132 325 -119 62 -189 -33 28 171 49 -61 95 223 -61 -112 54 -20 76 91
7617 91 103 -11 70 263 62 138 -109 18 59 -237 81 -153 -13 144 -61 24 -104 111 103 -94 15 204 -201
7640 -201 -153 -38 -35 -12 -107 -205 50 147 -39 22 205 83 -128 -27 186 233 98 98 76 92 -82 139 -244 -243 -81
7665 -81 -193 195 -315 2 -97 -120 -241 -20 -13 -138 -44 -9 -81 -70 118 -222 250 144 -86 -4 81 -119 32 -117
7689 -117 -3 133 -61 -169 -73 -89 107 94 6 84 -229 19 168 236 95 216 20 -81 207 -28 124 -19
$$ packed form
7524Im8J96k62L95l09K9j24j16L12r8k78L02j66J8J41m1J29n50M80j46K44m3N3
7547A27m07K63J76j07l5N0N8p3k78K81J09o0P5k04J6J43j75P5N6j58J22o6O2K5
7571G5J36k74J44l9j39K45K6j89r6J68N1j20L23l42lM15l56O3o6jp2J54j16K29
7595B16j96O3J03k09J55J93m44J81k51J56O1J43j22j10J56J28k84n1J66p4R6J5
7617I1J2j14Q1J93k01P6k47J27M1k96L18k34J40J57k05Q5j28K15qj97J09J89m05
7640b01M8J15LK3r5r8K55R7j86O1J83j22k11J01K13M7j35%k2J6j74K21l83JJ62
7665h1j12L88n10L17r9k3j21K21Pj25R4L5p2J1J88l40M72j06k30Q2Q5k00J51j49
7689a17J14J36j94j08R6j6J96j3q8P8l13K48J49O8j41J21j96j01K88k35J52j43
$$ plain form
7711 -19 -75 56 -69 295 -101 -19 -133 292 182 43 38 259 194 -25 6 157 121 -79 -118 62 215 318 -173
7734 -173 109 158 369 319 88 -51 -28 -188 341 -129 -214 139 189 112 -192 64 -407 -44 244 -70 230 56
7756 56 78 248 -101 239 -117 -105 -78 -79 303 181 -89 -91 53 141 -62 51 -66 -35 273 -63 47 168 48
7779 48 57 -138 -109 13 -181 53 145 54 -78 236 90 104 -152 227 -129 -131 285 -75 -215 -93 363 -19 29
7802 29 -238 99 19 0 169 -34 318 170 3 76 34 -1 -20 17 -115 120 240 82 -203 -239 328 74 -233
7825 -233 -159 27 231 -207 -104 120 -20 80 219 -84 -60 -262 -150 237 -293 45 -74 -167 -57 24 -211
7846 -211 9 311 -20 -132 -243 -22 211 -124 -90 91 -113 -209 202 30 -41 24 67 14 225 226 16 -300 47
7869 47 -257 -46 -92 -36 -29 170 377 12 97 4 -147 -176 86 95 17 -385 -158 177 228 95 -68 -183 130 -3
$$ packed form
7711a9n6J31j25L64l96Q2j14M25j10j39nK21o5k19L1J51l6k00l9J80J53J03m91
7734a73K82M9K11n0k31j39K3j60N29m70q5L53N0p7l04K56m71L63K88l14L00j74
7756E6K2J70l49L40l56J2K7jL82j22k70kJ44Q8k03J13j17L1L08l36J10J21j20
7779D8Rj95K9J22j94K34R2r1j32L14j46J4k56L79l56kM16l60j40J22M56l82M8
7802B9k67L37q0j9J69k03L52j48j67P3m2l5j9L7j32K35J20j58k85l6N67k54l07
7825b33P4J86K04m38J03K24j40J00J39l03K4k02J12L87n30L38j19r3J10Q1k35
7846b11K20L02l31j12j11K21K33l35L4J81k04r6M11j72p1O5M3n3K11Jk10l16L47
7869D7l04K11m6N6PJ99K07l65Q5r3j51k9K62Rp8m02K27L35N1j33j63j15L13j33
$$ plain form
7893 -3 27 83 -45 166 117 293 23 60 -78 264 -43 138 -11 -160 -82 -7 215 -85 82 -203 -71 -66 37
7916 37 25 211 -48 -43 -69 150 30 -315 125 95 -27 -149 77 -63 -303 156 -48 62 44 -125 218 -221
7938 -221 148 144 -30 -31 -56 -70 -182 25 -197 -99 48 -24 7 -100 -60 256 193 92 15 34 -251 289 350 -125 145
7963 145 32 -208 -138 50 -256 -78 -106 150 -29 216 38 -42 -94 58 82 -88 -263 -51 60 65 129 -102 4
7986 4 58 -63 222 24 226 8 120 222 -60 143 30 102 112 -273 -125 176 -99 278 1 0 -18 -52 -244
8009 -244 -134 -236 -23 -78 94 17 -184 49 -196 158 18 -130 -148 -205 101 -43 117 -137 -71 47 152 105
8031 105 32 -20 40 51 -239 53 -155 13 -260 -72 -26 110 279 -212 -149 110 -10 66 128 -168 -42 -3 249
8054 249 -304 -84 113 66 130 -53 -103 -198 135 -46 -273 138 -195 -243 222 -15 38 269 -45 -53 -100 -219 226
$$ packed form
7893cL0N6j28K11m9J76k70L7j38L42l07J81j49j49P8P5K22l00J67k85J32NJ03
7916C7j2J86k59Nk6K19j20l45M40l0j22j22K26j40k40M59k04J10j8j69L43m39
7938b21L69mj74jk5j4j12K07k22R8J47p2L1j07M0L16o3j01p7J9k85N40O1m75K70
7963A45j13k40P0J88l06J78k8K56j79K45j78q0n2J52K4j70j75K12J11NO4k31J06
7986DN4j21K85j98K02k18J12J02k82K03j13P2J0l85J48L01k75L77k77jj8l4j92
8009b44J10j02K13n5J72p7k01K33k45L54j40j48j8n7L06j44J60k54O6J18J05m7
8031A05p3n2O0J1k90K92k08J68k73J88M6J36J69m91O3K59j20P6O2k96J26L9K52
8054B49n53K20J97m7O4j83n0r5L33j81k27M11l33m8M65k37N3K31l14qm7j19M45
$$ plain form
8077 226 129 -176 47 -113 360 98 -18 142 -51 -333 -187 -87 75 3 -70 -41 -286 -41 -76 57 125 136
8099 136 -105 -17 90 281 117 130 90 -102 148 -255 -58 95 356 74 209 61 179 -141 -54 116 -316
8120 -316 -91 -26 -96 112 242 11 294 331 -71 -75 322 -8 -12 -82 -215 137 -259 121 135 -119 177 -90 91
8143 91 121 59 85 27 109 -63 -214 -255 -83 -95 -70 -380 -35 -44 89 -168 -23 -28 -308 -39 -83 188 -219 -45 -61
8168 -61 -39 77 37 -108 -67 59 29 196 -65 107 118 173 174 -74 26 154 -186 -266 15 221 288 58 151
$$ packed form
8077B26r7l05K23j60M73k62j16J60j93k82J46J00J62p2p3K9k45K45l5J33O8J1
8099A36k41Q8J07J91j64J3m0j92K50m03J97J53K61k82J35j48J18l20Q7J70m32
8120c16K25O5p0K08J30k31K83L7m02mL97l30mp0j33L52l96L80J4k54K96k67J81
8143I1L0o2K6n8Q2j72j51m1J72j2K5l10L45rJ33k57J45nk80K69m4K71m07J74j6
8168f1K2J16m0j45M1J26l0J67k61J72J1N5Jk48J00J28l40q0K81K06O7k30R3
8191A51
$$ Imaginary data points
##PAGE= N=2
##DATA TABLE= (X++(I..I)), XYDATA
$$ plain form
0 0 0 0 0 0 0 0 0 0 0 0 0 -8 8 -8 8 -16 16 -18 24 -32 32 -40 48 -56 70 -80 94 -107 126 -142 163 -186 211
33 211 -238 270 -304 343 -384 428 -479 533 -590 656 -727 802 -888 980 -1080 1191 -1312
50 -1312 1445 -1591 1754 -1935 2139 -2367 2629 -2926 3273 -3684 4172 -4774 5530 -6515 7854
65 7854 -9799 12882 -18554 32473 -145713 -106452 107952 -73200 -48249 62754 44388 12891
77 12891 73143 4571 -8750 66217 29160 -49231 33700 50862 -21552 -1479 23183 -47129
89 -47129 -22742 18070 -65622 -89544 15768 12754 -59604 -30963 32852 50014 55277 23247
101 23247 4300 55145 61812 -12876 -22020 9312 -19068 -33367 -9696 -33419 -46248 936
113 936 5431 -30662 -12163 15768 2860 579 9905 10425 28171 30593 -3131 4067 48249 32384
$$ packed form
0@%%%%%%%%%%%qJ6j6J6k4L2l4M2n6O4p2Q8j04J26j50J74k01K33k68L05l49L97
33B11m49N08n74O47p27Q12r07J012j123J246j383J529j690J868k060K271k503
50a312K757l036L345l689M074m506M996n555O199o957P856q946J0304j2045J4369
65G854j7653K2681l1436N1027j78186L9261K14404j81152K4951J11003j8366l1497
77A2891O0252o8572j3321P4967l7057p8391Q2931J7162p2414K0073K4662p0312
89d7129K4387M0812q3692k3922J05312l014p2358K8641O3815J7162N263l2030
101B3247j8947N0845O667p4688r144L1332k8380j4299K3671k3723j2829M7184
113I36M495l6093J8499K7931j2908k281R326N20J7746K422l3724P198M4182j5865
$$ plain form
127 32384 -17789 -18823 1565 -4247 -21309 -36781 -43108 -20987 3751 -4334 -20589 -5488 27585
140 27585 38166 18866 5035 16628 25916 12612 -4178 -5205 6207 4412 -19590 -25807 2557
153 2557 7370 -25813 -33540 -10334 -3640 -5077 -4568 -11228 6732 43382 30813 -5265 13458 42080
167 42080 19591 -6986 -11500 -15933 -8351 -3382 -28708 -34631 -242 3839 -18870 -6660 12228
180 12228 4589 6705 11566 -62 9634 29341 8958 -9624 13844 22334 169 -10950 -13198
193 -13198 -13496 -1281 -9163 -37373 -24537 10976 4228 -13016 1173 15224 17781 21034 10340
206 10340 -270 16193 20188 -8598 -14612 5022 947 -14341 -12731 -10229 -6122 2390 -8196
219 -8196 -21294 -846 16396 -1922 -12060 6873 17827 14925 11581 4355 4743 17736 11699
$$ packed form
127C2384n0173j034K0388n812j7062j5472o327K2121K4738q085j6255J5101L3073
140B7585J0581j9300j3831J1593R288j3304j6790j027J1412j795k4002o217K8364
153B557M813l3183p727K3206O694j437N09o660J7960L6650j2569l6078J8723K8622
167D2080k2489k6577m514m433P582M969k5326n923L4389M081k2709J2210J8888
180A2228p639K116M861j1628R696J9707k0383j8582K3468Q490k2165j1119k248
193a3198k98J2215p882k8210J2836L5513o748j7244J4189J4051K557L253j0694
206A0340j0610J6463L995k8786o014J9634m075j5288J610K502M107Q512j0586
219h196j3098K0448J7242j8318j0138J8933J0954k902l344p226L88J2993o037
$$ plain form
232 11699 -14414 -17158 -2800 -5786 -16805 -16542 -11115 -1978 5945 -1051 -5145 10673 18581 2890
246 2890 -4012 7953 13249 5526 -1757 -2665 5087 10745 -1453 -15643 -8785 1529 -6022 -16968
260 -16968 -14584 -4980 3330 3983 -1645 2100 16712 18671 5647 1612 8295 7775 -816 -8256 -8575
275 -8575 -3198 -870 -8721 -12236 -2660 3905 -2571 -7962 -3920 3769 6291 2033 -2750 4164 15207
290 15207 11868 -394 -469 7757 6889 -4168 -11441 -8635 -3254 -4924 -12032 -10503 -137 4346 315
305 315 -746 5567 10340 8100 2310 202 4221 6617 731 -5370 -2365 3770 1279 -6612 -8286
320 -8286 -2592 1009 -3765 -9602 -6356 2734 5072 314 106 6585 10842 7388 1854 1237 4236 3362
336 3362 -3259 -8260 -5273 -222 -3020 -7924 -5370 1522 2833 -2201 -3557 1413 6261 3707 -1812
$$ packed form
232A1699k6113k744J4358k986j1019K63N427R137P923o996m094J5818P908j5691
246B890o902J1965N296p723p283r08P752N658j2198j4190O858J0314p551j0946
260a6968K384R604Q310O53n628L745J4612J959j3024m035O683n20q591p440l19
275h575N377K328p851l515R576O565o476n391M042P689K522m258m783O914J1043
290A5207l339j2262p5Q226q68j1057p273K806N381j670p108J529J0366M483m031
305C15j061O313M773k240n790k108M019K396n886o101L005O135k491p891j674
320h286N694L601m774n837L246R090K338m758k08O479M257l454n534o17K999q74
336C362o621n001K987N051k798m904K554O892J311n034j356M970M848k554n519
$$ plain form
351 -1812 -633 6048 7386 2110 -365 1853 3777 718 -4309 -6445 -3962 -1807 -4622 -7477 -4275
366 -4275 1839 3188 790 667 4859 7632 4116 -437 1118 5069 3001 -2926 -4065 -368 1236
381 1236 -1758 -5626 -4067 -226 -716 -4255 -3571 188 2884 2426 550 937 5637 7408 3087 95
397 95 1941 2440 -818 -4382 -4435 -2371 -2229 -4288 -5326 -1656 1824 1069 -223 -251 2055 3698 2767 22
415 22 1373 4103 3074 -411 -985 68 1170 -967 -4924 -4746 -528 -477 -5161 -3804 1398 2164 636
432 636 1197 2222 4078 5121 1545 -1016 1809 2460 -1601 -2264 -984 -1080 -1022 -1466 -4018 -2573 1419
449 1419 -588 -3605 -700 2710 1494 1370 1715 2108 4225 3746 556 -292 1330 100 -2426 -2799 -3077
466 -3077 -2055 -1332 -3024 -3080 1209 1709 -551 419 1842 2241 3166 1486 -677 1797 3470 -707 -1235
$$ packed form
351a812J179O681J338n276k475K218J924l059n027k136K483K155k815k855L202
366d275O114J349k398j23M192K773l516m553J555L951k068n927j139L697J604
381A236k994l868J559L841m90l539O84L759K696m58j876L87M700J771m321k992
397I5J846M99l258l564n3K064J42k059j038L670L480p55j292k8K306J643r31k745
415B2J351K730j029l485n74J053J102k137l957J78M218N1m684J357N202P66j528
432F36N61J025J856J043l576k561K825O51m061o63J280r6N8m44k552J445L992
449A419k007l017K905L410j216j24L45L93K117m79l190q48J622j230k526l73k78
466c077J022P23j692n6M289N00k260R70J423L99R25j680k163K474J673m177n28
$$ plain form
483 -1235 1331 -702 -2343 -903 -2430 -3689 22 -40 -3888 -704 3266 870 527 3125 1789 1538
499 1538 3439 930 -1876 1504 1225 -3036 -2442 375 -1654 -2004 -796 -2193 -836 1702 -356 -1714
515 -1714 1763 2404 431 1201 1722 833 2106 1402 -1084 112 941 -2037 -2532 -479 -1404 -1789 -640
532 -640 -1035 -1340 1586 1428 -416 986 1751 763 1481 1644 -232 401 1693 -761 -1565 209 -629 -2370
550 -2370 -1002 -929 -1852 -121 -116 -1771 267 2156 692 376 1900 1526 1140 1626 202 -665 438 -584
568 -584 -2161 -1304 -211 -1219 -1672 -1053 -700 -27 306 -255 -63 1031 1509 1406 1627 1246 553 1133 491
587 491 -632 -562 -621 -1428 -1784 -975 -631 -458 -807 -557 566 1280 1020 846 987 1104 1204 541 1 675
607 675 119 -912 -943 -381 -940 -1162 -779 -1140 -1510 -87 -33 -586 285 1255 516 1050 1836 751 -133 1243
$$ packed form
483a235K566k033j641J440j527j259L711o2l848L184L970k396l43K598j336k51
499A538J901k509k806L380k79m261N94K817k029l50J208j397J357K538k058j358
515a714L477O41j973P70N21q89J273p04k486J196Q29k978m95K053r25l85J149
532f40l95l05K926j58j844J402P65r88P18J63j876O33J292k454q04J774q38j741
550b370J368P3r23J731Nj655K038J889j464l16J524l74l86M86j424q67J103j022
568e84j577Q57J093j008m53O19L53O73L33n61J92J094M78j03K21l81o93N80o42
587D91j123P0n9q07l56Q09L44J73l49K50J123P14k60j74J41J17J00o63n40O74
607F75n56j031l1N62n59k22L83l61l70J423N4n53Q71R70p39N34P86j085q84J376
$$ plain form
627 1243 604 -667 -29 -247 -1703 -1111 68 -1033 -1107 -89 -760 -843 1128 890 -421 541 1624 773
645 773 446 1066 528 -256 599 127 -968 -348 -594 -2002 -1215 -33 -688 -823 698 320 290 912 987 615
665 615 902 877 339 334 349 -252 -322 -544 -905 -1052 -526 -703 -765 -510 -124 -114 423 603 429 550 781 975 733
688 733 911 377 -132 -96 -438 -933 -455 -811 -1208 -429 -314 -875 -520 416 401 142 1124 935 13 628 909
709 909 460 223 444 -434 -530 48 -500 -1124 -421 -86 -869 -678 464 -284 -204 569 485 813 829 642 281
730 281 735 451 -460 -393 109 -752 -584 -326 -155 -330 54 -97 -559 243 724 -184 511 758 286 192 408
751 408 358 -82 90 -125 -378 -132 -219 -735 -557 -585 -423 -594 -192 6 -307 468 848 373 461 680 372 198
773 198 421 105 114 -285 -435 -480 -103 -264 -523 -647 -143 -183 -193 205 -229 482 666 828 393 400 459 110 -256
$$ packed form
627A243o39j271O38k18j456N92J179j101p4J018o71q3J971k38j311R62J083q51
645G73l27O20n38p84Q55m72j095O20k46j408P87J182o55j35J521l78l0O22P5l72
665F15K87k5n38nJ5o01p0k22l61j47N26j77o2K55L86J0N37J80j74J21K31J94k42
688G33J78n34n09L6l42m95M78l56l97P79J15n61L55R36j5k59R82j89r22O15K81
709I09m49k37K21q78r6N78n48o24P03L35p83J91J142p48Q0P73q4L28J6j87l61
730B81M54k84r11O7N02q61J68K58J71j75L84j51m62Q02M81r08O95K47m72r4K16
751D08n0m40J72k15k53K46q7n16J78k8J62j71M02J98l13P75L80m75Q8K19l08j74
773A98K23l16Rl99j50m5L77j61k59j24N04m0j0L98m34P11J84J62m35PN9l49l66
$$ plain form
796 -256 -43 -433 -586 -576 -631 -563 -558 -337 -244 86 287 255 299 539 463 386 365 550 -90 23 112 -30 -360 -470
820 -470 -588 -397 -321 -323 -272 57 117 -6 84 399 470 417 536 423 288 184 -70 76 -305 -305 -527 -355 -245 -575
844 -575 -253 -265 -78 -80 287 449 120 738 438 266 264 308 429 -227 -127 -132 -64 -500 -331 -362 -67 -166 -211 173
868 173 -135 123 408 388 236 419 185 216 113 493 -104 -16 -148 -176 -367 -296 -346 -67 -141 -110 -507 137 282
891 282 250 360 274 390 281 390 201 126 93 -434 -269 -216 -165 -488 -475 -25 -217 165 175 -52 392 24 180
914 180 143 393 293 99 144 -9 234 180 39 -591 -413 -307 -389 -672 -147 -197 -171 -55 276 4 422 291
936 291 84 61 17 123 275 -150 -209 -140 -16 -139 -294 -155 -157 -120 222 25 -3 122 112 47 193 516 345 -144
960 -144 -34 -5 -81 236 -390 -613 -220 -343 -219 -206 236 386 -155 -165 36 392 -19 63 75 257 179 262 122
$$ packed form
796b56K13l90j53J0n5O8NK21R3L30K01l2M4K40p6p7k1J85o40J13Q9j42l30j10
820d70j18J91P6kN1L29O0j23R0L15P1n3J19j13j35j04k54J46l81%k22J72J10l30
844e75L22j2J87kL67J62l29O18l00j72kM4J21o56J00nO8m36J69l1K95r9m5L84
868A73l08K58K85k0j52J83k34L1j03L80n97Q8j32k8j91P1n0K79p4L1l97O44J45
891B82l2J10q6J16j09J09j89p5l3n27J65N3N1l23J3M50j92L82J0k27M44l68J56
914A80l7K50j00j94M5j53K43n4j41o30J78J06q2k83N25n0K6J16L31k72M18j31
936B91k07k3m4J06J52m25n9O9J24j23j55J39kL7L42j97k8J25j0o5J46L23j71m89
960a44J10K9p6L17o26k23L93j23J24J3M42J50n41j0K01L56m11Q2J2J82p8Q3j40
$$ plain form
983 122 111 -120 -317 -175 -573 -312 -423 -288 106 -215 -58 -99 326 170 432 279 174 153 166 -24 -74 60
1005 60 -145 -176 -186 -211 -392 -276 -209 173 -150 -106 -163 100 298 176 165 191 386 -148 228 442 -147 -113 -175 -160
1029 -160 153 -290 -149 -75 132 -88 142 157 -107 178 60 -26 68 269 -220 111 -25 -424 -180 -93 -86 -11 -225
1052 -225 -204 -359 -71 84 306 -205 -207 293 233 131 214 97 -32 19 -72 -175 124 -226 -385 -25 -144 -207 -12
1075 -12 106 -266 -238 163 149 -253 -96 204 22 -169 154 -250 -15 133 131 -129 -137 -205 -297 -361 92 -246 -88
1098 -88 6 35 14 237 14 148 -19 -27 21 98 161 132 76 0 88 -40 -247 -105 41 -309 117 -33 -171 -40
1122 -40 131 -196 16 174 170 5 148 -187 -58 -78 54 -358 -30 -83 -313 57 216 -41 34 -28 201 222 194
1145 194 -9 -235 19 241 269 -165 192 256 -4 -47 290 -92 44 -177 22 37 150 -2 73 68 128 54 52 366
$$ packed form
983A22j1k31j97J42l98K61j11J35L94l21J57m1M25j56K62j53j05k1J3j90n0J34
1005F0k05l1j0k5j81J16O7L82l23M4n7K63J98j22j1K6J95n34L76K14n89L4o2J5
1029a60L13m43J41P4K07k20K30J5k64K85j18q6R4K01m89L31j36l99K44Q7PP5k14
1052b25K1j55K88J55K22n11kN00o0j02Q3j17j29N1r1j03K99l50j59L60j19o3J95
1075a2J18l72K8M01j4m02J57L00j82j91L23m04K35J48kk60qo8r2o4M53l38J58
1098h8R4K9k1K23k23J34j67qM8P7O3k9n6p6Q8j28k07J42J46l50M26j50j38J31
1122d0J71l27K12J58mj65J43l35J29k0J32m12L28n3k30L70J59k57P5o2K29K1k8
1145A94k03k26K54K22K8m34L57O4k60m3L37l82J36k21J99J5J13j52P5nO0p4kL14
$$ plain form
1169 366 -73 95 -146 -178 -51 -120 -59 -44 103 15 -12 5 -306 170 67 99 318 -35 -259 200 -37 92 54
1192 54 -112 -39 -73 163 90 -83 90 83 114 -16 119 -40 -91 -24 -28 129 18 10 17 71 153 -45 -114 -233 -137 23
1218 23 23 -83 -56 122 84 -60 -234 125 86 -22 163 -88 42 -295 129 287 186 183 -158 -42 175 -10 -5
1241 -5 -176 103 74 -47 269 46 -25 340 140 -29 173 -83 228 139 -107 -23 69 -380 24 -141 -61 82 -124
1264 -124 -126 201 9 37 39 142 -69 14 51 16 139 -214 57 45 -69 -74 252 -197 10 18 -33 -105 -34 12 76 -10
1290 -10 -51 282 -75 62 150 12 223 -88 -117 38 109 -143 -66 -163 -105 -85 169 158 -37 397 198 -9 -119
1313 -119 151 -142 -164 33 -252 -190 -110 88 38 -30 -39 -36 -60 82 -174 -183 -369 -110 97 -133 151 169 -224 421
1337 421 83 -120 -31 -281 159 -18 16 10 77 8 137 39 -83 152 50 -137 99 -11 95 -232 101 138 187
$$ packed form
1169C66m39J68k41l2J27o9O1J5J47q8k7J7l11M76j03L2K19l53k24M59k37J29l8
1192E4j66P3l4K36p3j73J73pL1j30J35j59n1O7mJ57j11qPN4Q2j98o9j19R6J60
1218B3%j06K7J78l8j44j74L59l9j08J85k51J30l37M24J58j01ll41J16K17j85N
1241ej71K79k9j21L16k23p1L65k00j69K02k56L11q9k46Q4R2m49M04j65Q0J43k06
1264a24kL27j92K8KJ03k11Q3L7l5J23l53K71j2j14nL26m49K07Qn1p2P1M6O4q6
1290a0m1L33l57J37Q8j38K11l11k9J55P1k52P7r7N8K0K54j1j95M34j99k07j10
1313a19K70k93k2J97k85O2Q0J98n0o8rLk4J42k56rj86K59K07k30K84J8l93O45
1337D21l38k03Q9k50M40j77L4oO7o9J29r8j22K35j02j87K36j10J06l27L33L7M9
$$ plain form
1360 187 -41 -96 -43 105 -12 123 -27 -168 137 130 114 12 -36 194 -150 -100 -16 44 -151 -81 -18 150 -86 93
1384 93 199 -167 73 -298 170 111 -7 227 312 -137 -13 98 221 27 -9 41 -127 -325 -193 57 -57 242
1406 242 -240 -137 102 24 -49 -11 101 194 151 82 67 74 -45 171 14 137 -91 20 50 75 356 -208 -169 90
1430 90 57 -18 193 -90 239 163 243 204 118 80 -65 7 -313 77 -87 122 73 156 -86 -10 -58 -134 109 7 171
1455 171 -224 69 -13 279 141 1 -7 97 142 -91 152 -211 246 116 -21 -45 241 -421 -94 20 10 144
1477 144 -57 -33 200 -116 -270 -110 124 190 -137 -118 -114 -16 67 -57 191 -149 6 69 -35 62 -69 -114 194
1500 194 83 31 -191 -43 -13 -92 -48 13 240 -59 58 -134 -137 19 -3 -5 2 -27 126 88 48 138 -97 -249 -85
1525 -85 7 105 -53 269 -154 410 -69 -195 46 53 164 -6 -37 -17 114 212 -3 -120 76 -38 -20 -154 22
$$ packed form
1360A87k28n5N3J48j17J35j50j41L05pj6j02m8K30l44N0Q4O0j95P0O3J68k36J79
1384I3J06l66K40l71M68n9j18K34Q5m49J24J11J23j94l6N0j68j98J32K50j14K99
1406B42m82J03K39p8p3L8J12R3m3o9j5Pj19K16j57J23k28J11L0K5K81n64L9K59
1430I0l3p5K11k83L29p6Q0l9q6l8j45P2l20L90j64K09m9Q3k42P6m8p6K43j02J64
1455A71l95K93q2K92j38j40qJ04M5k33K43l63M57j30j37k4K86o62L27J14j0J34
1477A44k01K4K33l16j54J60K34O6l27J9MR8Q3j24K48l40J55O3j04R7j31m5L08
1500A94j11n2k22J48L0p9M4O1K27k99J17j92lJ56k2kPk9J53l8m0R0k35j52J64
1525h5R2R8j58L22m23N64m79j26K41PJ11j70l1K0J31R8k15j17J96j14J8j34J76
$$ plain form
1548 22 -250 7 -129 100 -233 62 107 -9 212 -54 51 44 139 241 106 -207 213 65 173 139 205 -26
1570 -26 7 23 22 -12 6 -52 19 196 -16 195 -160 -257 -17 43 -92 -151 133 51 -178 -256 303 203 46 337 -249
1595 -249 135 -87 28 129 -77 29 -76 -168 418 -357 123 -54 -8 -156 167 86 -37 -118 -113 177 -44 -151
1617 -151 -181 -231 -81 -194 61 223 -281 -43 -82 60 20 -161 -4 26 -143 -84 -23 -103 6 132 84 100 -15
1640 -15 146 -171 -77 300 -407 -12 37 -5 -92 -103 199 119 -198 -224 -234 273 -63 113 34 153 6 -97 -10 98
1664 98 44 -8 260 26 102 -23 57 -161 243 -249 88 -20 67 -106 19 55 41 6 320 -66 131 149 -347
1687 -347 265 -9 278 -20 195 -138 69 57 4 223 9 258 310 200 -70 -137 57 107 -75 -373 -96 199
1709 199 74 192 -36 -173 -69 132 -142 9 227 75 238 -11 -240 19 112 117 -7 157 -78 -193 22
$$ packed form
1548B2k72K57j36K29l33K95M5j16K21k66J05pR5J02j35l13M20j48J08l4O6k31
1570b6L3J6jl4J8n8P1J77k12K11l55r7K40O0j35n9K84q2k29p8N59j00j57K91n86
1595b49L84k22J15J01k06J06j05r2N86p75M80j77M6j48L23q1j23q1NK90k21j07
1617a51l0n0J50j13K55J62n04K38l9J42m0j81J57L0j69N9O1q0J09J26m8J6j15
1640a5J61l17R4L77p07L95M9m2q7j1L02q0l17k6j0N07l36J76p9J19j47j03Q7J08
1664I8n4n2K68k34P6j25Q0k18M04m92L37j08Q7j73J25L6j4l5L14l86J97J8m96
1687c47O12k74K87k98K15l33K07j2n3K19k14K49N2j10k70o7J94N0j82k98K77K95
1709A99j25J18k28j37J04K01k74J51K18j52J63k49k29K59R3Nj24J64k35j15K15
$$ plain form
1730 22 110 113 177 -262 0 -194 7 160 -83 152 42 -31 -80 92 -7 132 -97 -113 258 -82 98 139 -214
1753 -214 17 -91 72 -72 158 75 77 36 89 155 -12 220 52 -24 146 -69 -12 -48 -58 57 -76 -103 -45 304
1777 304 -2 -42 -28 103 -60 -230 -35 -42 -35 96 -185 -11 153 -43 -44 90 134 8 20 26 154 14 22 32 -42
1802 -42 94 45 -9 -276 -131 178 283 -49 -337 -6 -189 180 -26 -28 -15 -38 -76 -148 49 -123 94 68 -118
1825 -118 85 -10 200 -90 -132 -10 126 -212 -72 205 78 -71 -169 -96 94 -347 240 -43 -105 15 36 67
1847 67 346 -84 35 -20 80 -84 180 -45 111 -237 -111 274 74 182 81 -115 -184 4 -32 -103 221 12
1869 12 -145 -155 151 -146 -104 197 -266 133 248 -61 -113 -21 0 103 -166 132 -172 173 28 21 -99 4 100
1892 100 -204 139 -198 -135 201 128 -30 -231 318 -276 -221 16 188 103 -32 -31 -127 103 12 -93 41 19 -57
$$ packed form
1730B2Q8LO4m39K62j94K01J53k43K35j10p3m9J72r9J39k29j6L71l40J80M1l53
1753b14K31j08J63j44K30q3Km1N3O6j67K32j68p6J70k15N7l6j0J15j33k7N8L49
1777C04l06m0J4J31j63j70J95pPJ31k81J74J64j96jJ34M4j26J2OJ28j40QJ0p4
1802d2J36m9n4k67J45L09J05l32k88L31j83L69k06kJ3k3l8p2J97j72K17k6j86
1825a18K03r5K10k90m2J22J36l38J40K77j27j49r8P3J90m41N87k83o2J20K1L1
1847F7K79m30J19n5J00j64K64k25J56l48J26L85k00J08j01j96o9J88l6p1L24k09
1869A2j57j0L06k97M2L01m63L99J15l09n2R2K1J03k69K98l04L45j45pj20J03R6
1892A00l04L43l37O3L36p3j58k01N49n94N5K37J72q5j35Jr6K30r1j05J34k2p6
$$ plain form
1915 -57 -50 52 4 1 86 148 89 199 153 245 132 -59 94 -255 136 -118 113 49 28 -149 -46 92 114 -96 -71
1940 -71 96 84 -107 -92 137 -195 -206 -19 108 -112 49 157 20 238 -142 160 -63 105 292 -9 -293
1961 -293 -73 -64 37 -127 -288 156 122 -215 -174 119 -117 155 -61 -147 -487 -92 63 -275 326 88 -282 124
1983 124 -84 -266 235 24 41 30 -26 73 115 -22 50 -222 -148 89 105 98 2 50 -141 -70 -2 144 58 31 -192
2008 -192 117 22 -6 -97 -25 71 -253 -56 -182 26 221 108 -161 -152 -289 -121 83 -36 -30 -150 -141 84 -94 181
2032 181 89 -161 288 -5 35 126 -89 324 -114 201 -241 293 325 48 98 45 351 95 -47 -266 41 -274
2054 -274 -187 241 -33 -219 159 -2 -202 -102 -3 -89 33 47 -20 -38 -84 -150 137 411 -189 -210 -70 -76 -86 75
2078 75 -270 -24 69 236 -43 -225 161 -123 45 -218 -204 408 -224 34 -9 -58 -57 210 -127 -346 2 31 28
$$ packed form
1915e7PJ02m8lQ5O2n9J10m6R2j13j91J53l49L91k54K31o4k1j77J03J38K2k10K5
1940g1J67j2j91J5K29l32j1J87J27k20J61J08j37K18l80L02k23J68J87l01k84
1961b93K20RJ01j64j61M44l4l37M1K93k36K72k16q6l40L95J55l38O01k38l70M06
1983A24k08j82N01k11J7j1n6R9M2j37P2k72P4K37J6pr6M8j91P1O8J46q6k7k23
2008a92L09r5k8r1P2R6l24J97j26K08J95j13k69Rj37J68K04j19Oj20RK25j78K75
2032A81r2k50M49k93M0R1k15M13m38L15m42N34L2k77N0n3L06k56j42k19L07l15
2054b74Q7M28k74j86L78j61k00J00R9q6J22J4o7j8m6o6K87K74o00k1J40oj0J61
2078G5l45K46R3J67k79j82L86k84J68k63J4O12o32K58m3m9JK67l37k19L48K9l
$$ plain form
2101 28 -176 110 -287 22 -23 -38 -65 327 -324 -239 -223 -140 248 -151 -42 48 -63 227 -57 -258 177 -333 -133
2124 -133 108 190 -180 477 -122 -97 196 71 77 -78 137 220 -139 -277 -59 149 45 -219 160 -170 120 324
2146 324 148 -181 -20 105 -282 -151 11 91 -67 9 50 -119 83 160 86 -1 -142 -15 -137 -42 66 -83
2168 -83 -124 202 -12 -26 -114 84 147 -83 258 72 -70 -143 4 85 -178 -33 -151 81 160 -112 75 -9 157
2191 157 -241 -235 -152 99 334 -129 -218 -25 234 3 -53 -213 61 53 -450 -98 28 7 -8 -229 54 94 -47
2214 -47 -219 17 -131 -10 -103 -125 -229 67 -52 102 92 -224 29 57 -37 130 213 -19 -107 2 -285 -95 129
2237 129 -2 -306 -16 34 46 -150 105 175 96 95 68 279 286 31 94 211 145 135 0 -86 44 211 47 193
2261 193 210 74 -164 -40 -83 -10 -12 158 -180 -48 129 -171 -180 -214 115 316 -126 -164 -118 287 -11 41 76 -8
$$ packed form
2101B8k04K86l97L09m5j5k7L92o51Q5J6Q3L88l99J09R0j11K90k84k01M35n10K00
2124a33K41Q2l70O57n99K5K93j25Oj55K15Q3l59j38K18K08j04k64L79l30K90K04
2146C24j76l29J61J25l87J31J62Q0j58P6M1j69K02P7p4q7j41J27j22R5J08j49
2168h3m1L26k14j4q8J98O3k30L41j86j42p3J47Q1k63J45j18K32P9k72J87q4J66
2191A57l98OQ3K51K35m63q9J93K59k31n6j60K74qn03L52J26k1j5k21K83M0j41
2214d7j72K36j48J21r3k2j04K96j19J54j0l16K53K8r4J67Q3k32q8J09k87J90K24
2237A29j31l04K90N0J2j96K55P0p9jk7K11Pk55O3J17o6j0j35q6J30J67j64J46
2261A93J7j36k38J24m3P3kJ70l38J32J77l00rl4L29K01m42l8M6M05k98N2L5q4
$$ plain form
2285 -8 -56 73 -56 -181 -16 27 -48 -40 -50 -40 84 -70 91 20 1 7 134 -194 -68 -11 346 -235 -117 -386 -5
2310 -5 317 -5 48 226 117 118 -58 9 34 27 -145 -132 -163 176 -66 270 -74 -156 96 140 357 12 -81 -61 -288
2335 -288 156 -182 72 69 -19 -134 408 -95 -63 106 113 207 253 -50 23 -160 211 274 157 -37 -33 -152 -9 -275
2359 -275 -17 -8 69 -202 8 194 170 113 101 31 62 183 165 -65 -203 119 73 -70 267 150 -343 -161 260
2382 260 260 214 51 71 -89 -68 48 -43 -20 87 -99 -58 154 -84 316 60 -82 87 -85 -142 28 -64 -247
2405 -247 87 106 -52 168 144 -15 -144 1 90 -324 -212 203 -50 -97 216 -113 -119 -25 -77 -236 -39 -59 -71
2428 -71 -33 -60 198 82 -128 28 70 -71 56 -19 76 -142 -4 -264 3 -133 -18 15 114 438 -184 -209 3
2451 3 -166 -128 -162 56 48 -110 112 132 -203 -51 38 139 -50 127 300 -305 144 -139 13 33 100 85 -39 178
$$ packed form
2285hm8J29j29j25J65M3p5Qj0J0J24j54J61p1j9OJ27l28J26N7L57n81J18k69L81
2310eL22l22N3J78j09Jj76O7K5pj72J3l1L39k42L36l44q2K52M4K17l45r3K0k27
2335b88M44l38K54lq8j15N42n03L2J69PR4M6l03P3j83L71O3j17j94Mj19J43k66
2359b75K58RP7k71K10J86k4n7j2p0L1J21j8k30j38L22m6j43L37j17m93J82M21
2382B60%m6j63K0j60K1J16r1K3J07j86M1K12k38M00k56j42J69j72n7J70r2j83
2405b47L34J9j58K20k4j59j29J45Q9m14J12M15k53m7L13l29oR4n2j59J97k0j2
2428g1L8k7K58j16k10J56M2j41J27p5R5k18J38k60K67j36J15L3R9L24o22k5K12
2451Cj69L8l4K18qj58K22K0l35J52Q9J01j89J77J73o05M49k83J52K0O7j5j24K17
$$ plain form
2475 178 -184 100 -356 -84 -66 -289 23 259 -64 58 393 140 113 -58 -157 -207 -196 -163 2 -158 -189 -96 116
2498 116 -55 88 105 -18 -16 -59 3 -123 -195 -82 -79 37 143 193 -73 167 -164 413 23 80 212 141 -339 6
2522 6 -325 -43 260 -8 171 133 94 9 -23 -144 -80 130 38 84 -99 46 89 158 211 90 211 -123 -55 118
2546 118 -333 5 171 138 -63 125 95 -84 -43 68 -59 77 -5 -38 13 -213 6 26 114 71 -235 -40 -17
2569 -17 -180 -17 -38 -75 -136 91 -110 -66 -74 -120 8 -149 -159 -116 -106 -200 -296 222 12 -63 -39 -35 -230 45 -75 -266
2595 -266 -105 39 97 189 0 -186 35 178 127 -42 23 231 32 101 96 290 84 -115 74 152 121 -148 275
2618 275 -164 45 49 -180 -95 78 -4 52 -102 10 192 51 -227 -83 -212 -236 10 8 -122 -33 178 107 259
2641 259 -264 -42 146 -35 151 84 -128 243 -13 -52 -182 -44 -93 26 -61 -169 17 -156 -128 -100 7 79
$$ packed form
2475A78l62K84m56K72J8k23L12K36l23J22L35k53k7j71r9n0J1L3J65j60l1R3K12
2498A16j71J43J7j23Km3O2j26p2J13LJ16J06N0k66K40l31N77l90N7J32p1m80L45
2522Fl31K82L03k68J79l8l9q5l2j21O4K10r2M6j83J45M3O9N3j21J21l34O8J73
2546A18m51L38J66l3k01J88l0j79M1J11j27J36q2l3N1k26K19K0Q8m3l06J95K3
2569a7j63J63k1l7o1K27k01M4qm6J28j57j0M3J0r4r6N18k10p5K4Mj95K75j20j91
2595b66J61J44N8R2j89j86K21J43n1j69O5K08j99O9nJ94k06j99J89P8l1k69M23
2618B75m39K09Mk29Q5J73q2N6j54J12J82j41k78J44j29k4K46kj30Q9K11p1J52
2641B59n23K22J88j81J86o7k12L71k56l9j30J38m9J19q7j08J86j73K8K8J07P2
$$ plain form
2663 79 -172 63 -329 45 113 113 -51 166 -57 131 101 105 -246 57 -177 -78 -150 14 68 127 167 -448 47 -383
2687 -383 -143 -177 -34 -147 111 -24 213 114 -13 -48 -150 169 7 -84 -39 -252 103 -285 -77 162 -19 119
2709 119 105 -60 -154 159 67 45 221 89 -145 277 -157 -18 -11 37 31 -122 60 -181 131 61 -91 7 296 -7
2733 -7 -9 90 -238 -16 333 -183 -27 -17 179 50 -208 -66 -142 -141 -153 288 82 -132 71 154 -63 4 -67 -99 -26
2758 -26 -179 -337 39 -3 57 49 110 214 -67 284 23 -153 -195 -176 179 -33 -117 -155 -140 69 168 47 96 78 -82
2783 -82 -177 57 53 20 -75 -91 -128 62 -18 179 -307 -103 -26 -193 -332 193 -156 70 113 -16 -181 -67 -111 -10
2807 -10 -67 76 302 97 23 -109 -382 -75 -116 -270 1 -321 135 2 216 125 514 250 111 -93 42 5
2829 5 -162 61 -223 -33 5 -177 -291 -241 -73 -89 126 -59 -41 -81 130 30 25 -239 -105 -34 -162 123 66 37
$$ packed form
2663G9k51K35l92L74O8%j64K17k23J88l0Ml51L03k34R9p2J64N4N9M0o15M95m30
2687c83K40l4J43j13K58j35K37r9j27l5j02L19j62r1M5k13L55l88K08K39j81J38
2709A19j4j65r4L13r2k2J76j32k34M22m34J39PM8oj53J82k41L12p0j52R8K89l03
2733gkR9l28K22L49n16J56J0J96j29k58J42p6Jj2M41k06k14K03Q3k17O7p1l2P3
2758b6j53j58L76m2O0qO1J04k81L51k61j76m2J9L55k12q4l8J5K09R9j21M9j8j60
2783h2r5K34ml3r5j6l7J90q0J97m86K04P7j67j39N25l49K26M3j29j65J14m4J01
2807a0n7J43K26k05p4j32k73L07m1j54K71l22M56j33K14r1L89k64j39k04J35l7
2829Ej67K23k84J90L8j82j14N0J68j6K15j85J8m0K11j00nk64J34P1j28K85n7k9
$$ plain form
2853 37 -112 -31 106 77 -133 53 -41 -118 236 -22 -279 83 239 173 -165 93 -50 191 -156 -145 144 -187
2875 -187 -106 -134 -33 -217 -154 -147 107 99 -75 32 123 -175 -140 -100 23 -175 224 -102 0 179 -128 255 337 19
2899 19 356 -50 164 -73 218 61 -213 -5 -193 69 -260 -146 61 -82 -132 -26 -64 -2 -105 144 -2
2920 -2 -76 -163 124 110 44 21 228 -90 -80 20 74 -207 -79 49 -30 -98 -159 -165 21 -15 98 -19 223 -71 -42
2945 -42 305 48 222 91 34 190 -71 19 -5 -13 264 99 -145 -5 -151 -33 370 148 -64 -13 -31 258 -65
2968 -65 -121 148 82 165 170 81 -6 -230 117 -15 179 7 -20 -181 -10 100 59 -141 -20 -5 -81 -4 -30 -123 66
2993 66 -75 188 -28 73 -215 226 -164 -46 -163 -75 74 114 124 -22 -121 -139 49 -152 267 10 127 19
3015 19 125 -2 -39 170 6 -62 -135 -35 -18 -236 32 63 87 -170 70 236 35 59 43 58 -96 -89 -48 -55 82
$$ packed form
2853C7j49Q1J37k9k10J86r4p7L54k58k57L62J56o6l38K58j43K41l47J1K89l31
2875a87Q1k8J01j84O3PK54qj74J07R1k98L5M0J23j98L99l26J02J79l07L83Q2l18
2899A9L37m06K14k37K91j57k74K08j88K62l29J14K07j43n0J06l8O2j03K49j46
2920bp4q7K87j4o6k3K07l18J0J00N4k81J28J28p9o8o1oJ86l6J13j17K42k94K9
2945d2L47k57J74j31n7J56k61R0k4qK77j65k44J40j46J18M03k22k12N1j8K89l23
2968f5n6K69o6Q3Nq9q7k24L47j32J94j72k7j61J71J10m1k00J21J5p6P7k6r3J89
2993F6j41K63k16J01k88M41l90J18j17Q8J49M0J0j46r9j8J88k01M19k57J17j08
3015A9J06j27l7K09j64o8p3J00J7k18K68L1K4k57K40J66k01K4j6J5j54PM1pJ37
$$ plain form
3040 82 107 36 187 -83 146 23 -215 -74 -3 -44 -123 25 -77 -172 -195 -41 -77 -293 96 -59 179 -240 259
3063 259 28 196 -33 -23 -156 -113 148 115 98 -253 -99 163 -73 39 -13 -156 -47 -59 15 159 100 -174 353
3086 353 -144 164 43 -86 108 204 79 18 17 47 292 150 -22 -137 -170 1 -12 -52 95 -25 73 -165 15
3109 15 -61 -103 -280 130 101 169 -3 225 -7 -61 -161 7 341 -162 16 -72 -213 -162 -22 -184 126 171 93
3132 93 -119 -24 32 -329 256 -196 -69 -287 -89 115 25 198 51 106 -46 -129 44 -183 61 159 144 34 55
3155 55 -163 73 25 -250 76 -53 -69 68 93 85 236 -68 217 -220 -49 -109 -55 -73 5 -39 55 -101 51 75
3179 75 -68 -128 -97 143 49 -43 -11 -41 202 27 250 -58 -67 17 -76 -90 -258 -238 285 -27 -150 -22 0 -156 134
3204 134 -28 -53 39 51 128 -30 -68 -115 -27 -139 -21 59 143 98 -54 -53 -76 25 -5 3 293 -108 -357 -156 -54
$$ packed form
3040H2K5p1J51k70K29j23k38J41P1m1p9J48j02r5k3J54l6k16L89j55K38m19M99
3063B59k31J68k29J0j33M3K61l3j7l51J54K62k36J12n2j43J09j2P4J44n9k74N27
3086C53m97L08j21j29J94R6j25o1jL0K45j42j72j15l3J71j3m0J47j20R8k38J80
3109A5p6m2j77M10k9O8j72K28k32n4j00J68L34n03J78q8j41N1J40j62L10M5p8
3132I3k12R5N6l61N85m52J27k18J98K04r0J73j47N5j52q3J73k27K44R8j5j10K1
3155E5k18K36m8k75L26j29j6J37K5qJ51l04K85m37J71o0N4j8P8m4R4j56J52K4
3179G5j43o0L1K40r4r2L2l0K43j75K23l08rQ4r3j4j68K0N23l12j23J28K2j56K90
3204A34j62k5R2J2P7j58l8m7Q8j12J18Q0Q4m5j52Jk3J01l0QK90m01k49K01J02
$$ plain form
3229 -54 28 -89 106 -140 94 17 -100 22 4 -103 111 16 -182 136 467 188 -8 176 46 -119 106 -77
3251 -77 45 -124 51 -171 98 -287 238 208 -63 -72 -95 102 61 -478 58 47 -85 -37 -37 63 96 188 9 175
3275 175 -223 54 21 100 46 -175 49 194 -196 -179 150 66 -45 -83 229 -165 24 151 170 145 209 -167 171
3298 171 124 59 77 -165 -3 199 -182 232 62 -145 -10 -235 -115 112 217 -27 -75 -250 -45 -39 193 -30
3320 -30 128 34 278 81 264 -68 -105 125 -64 -13 -67 -80 82 -145 3 -136 -23 117 207 -45 86 -15
3342 -15 -73 147 204 54 34 199 -192 10 -35 37 193 -183 -12 -106 76 450 30 202 -120 -143 -183 74 -173
3365 -173 -233 310 -64 92 -96 -149 63 -77 129 235 -52 -237 173 10 -60 52 -46 129 30 -235 -216 -185
3387 -185 94 83 -176 69 340 -4 -8 25 168 112 -80 43 37 -60 -100 4 63 81 -75 228 188 -173 17 26 -129
$$ packed form
3229e4Q2j17J95k46K34p7j17J22j8j07K14r5j98L18L31k79j96J84j30j65K25j83
3251g7J22j69J75k22K69l85N25l0k71rk3J97m1n39N36j1j32M8%J00L3R2j79J66
3275A75l98K77l3P9n4k21K24J45l90J7L29q4j11l8L12l94J89J27J9k5O4l76L38
3298A71m7o5J8k42J62K02l81M14j70k07J35k25J20K27J05k44m8j75K05OK32k23
3320c0J58r4K44j97J83l32l7K30j89N1n4j3J62k27J48j39J13J40R0k52J31j01
3342a5n8K20N7j50k0J65l91K02m5P2J56l76J71r4J82L74m20J72l22k3m0K57k47
3365a73o0N43l74J56j88n3K12j40K06J06k87j85M10j63p0J12r8J75r9k65J9L1
3387a85K79j1k59K45K71l44mL3J43n6j92J23or7m0J04N9J8j56L03m0l61J90Rj55
$$ plain form
3412 -129 129 -9 -114 -144 -233 154 -178 -103 52 313 -19 -252 -171 22 -130 158 -9 53 8 -50 -200 -107 -260
3435 -260 122 -9 -137 69 11 0 -46 81 -185 -4 23 -43 45 73 -136 64 -98 -110 -35 169 92 -74 -195
3458 -195 -48 0 -114 -208 -89 167 320 -163 -139 17 -108 -68 -248 122 -286 172 231 60 -100 -32 -11 84 -165
3481 -165 242 -31 69 64 -164 -57 -51 92 -25 -37 3 69 58 -134 -162 -299 -96 -390 -40 -80 -99 -8 45 -96
3505 -96 184 209 -40 183 -206 10 -173 -45 208 34 254 -23 -149 93 -176 -13 -18 199 434 266 -46
3526 -46 -133 96 -70 -16 44 182 24 263 -9 -22 -140 -175 57 -137 -155 -139 68 -48 -53 223 -283 32 170
3549 170 28 109 262 -19 28 17 -78 125 282 28 81 -49 -103 -259 -51 305 16 380 90 -269 -33 50
3571 50 144 115 30 -234 108 -20 -56 -113 -96 103 88 31 -111 -218 115 -130 -39 276 -108 -164 86 -342 6 134
$$ packed form
3412a29K58j38j05l0q9L87l32P5J55K61l32k33Q1J93j52K88j67O2m5n8j50R3j53
3435b60L82j31j28K06n8j1m6J27k66J81K7o6Q8K8k09K00j62j2P5K04p7j66j21
3458a95J47M8j14r4J19K56J53m83K4J56j25M0j80L70m08M58N9j71j60O8K1R5k49
3481a65M07k73J00nk28J07OJ43j17j2M0O6j1j92k8j37K03k94L50m0j9R1N3j41
3505i6K80K5k49K23l89K16j83J28K53j74K20k77j26K42k69J63nK17K35j68l12
3526d6q7K29j66N4O0J38j58K39k72j3j18l5K32j94j8J6K07j16nK76n06L15J38
3549A70j42Q1J53k81M7j1r5K03J57k54N3j30n4j56K08L56k89L64k90l59K36Q3
3571E0R4k9q5k64L42j28l6n7J7J99j5n7j42j07L33k45R1L15l84n6K50m28L48J28
$$ plain form
3595 134 -47 -72 5 -183 65 191 -45 -145 -417 -33 -16 -214 -41 129 66 -134 -16 -271 102 94 51 -68
3617 -68 -128 26 -6 234 23 -234 -287 55 -192 -47 -86 198 153 40 48 -7 29 -276 182 28 131 -124 19
3640 19 -5 -26 175 197 -103 104 4 -99 60 255 98 55 43 -181 -157 -98 -104 -134 -132 -175 117 9 179 278 -59
3665 -59 -149 146 -22 -247 -62 -56 277 157 -98 -97 287 52 -104 262 -132 -170 -87 3 -113 61 156 -54 -81 73
3689 73 -157 78 156 28 -263 -145 173 151 221 111 -146 -96 27 -143 147 -21 86 -212 -80 238 -123 62
3711 62 -156 -24 263 -270 247 317 -46 -52 -89 172 79 -5 327 30 266 -44 -122 -110 157 -7 -177 -132 -112 -56
3735 -56 88 115 -18 -97 -146 23 -90 -201 -46 12 -59 -36 133 -68 158 -174 0 219 -10 140 -111 1
3757 1 -138 -193 -163 23 72 -35 53 55 128 58 -19 57 9 -232 -40 -138 -127 92 43 -86 -255 -98 -35 -57 152 -76
$$ packed form
3595A34j81k5P7j88K48J26k36j00k72L84J7j98J73J70o3k00J18k55L73qm3j19
3617f8o0J54l2K40k11k57n3L42k47J45l9K84m5j13Qn5L6l05M58j54J03k55J43
3640A9k4k1K01K2l00K07j00j03J59J95j57m3j2k24K4N9ol0Km3K92j08J70R9l37
3665e9r0K95j68k25J85OL33j20k55JL84k35j56L66l94l8Q3R0j16J74R5k10k7J54
3689G3k30K35P8j28k91J18L18k2P0j10k57N0J23j70K90j68J07k98J32L18l61J85
3711F2k18J32K87n33N17P0l63ol7K61r3q4L32k97K36l10p8J2K67j64j70M5K0N6
3735e6J44K7j33p9m9J69j13j11J55N8p1K3J69k01K26l32J74K19k29J50k51J12
3757Aj39n5L0J86M9j07Q8KP3p0p7P6m8k41J92r8J1K19m9j29j69J57O3k2K09k28
$$ plain form
3783 -76 -89 -219 193 -166 129 104 127 62 -129 24 12 35 171 -213 74 163 87 -353 -52 145 49 15 -38 -2
3807 -2 107 -55 -62 -154 -155 68 196 -240 182 78 -38 152 37 255 -45 30 124 45 -90 85 -215 96 70 -160
3831 -160 -45 30 97 48 217 48 -59 -112 169 -226 -302 -7 -161 314 -288 86 -141 12 -62 93 -84 68
3853 68 -73 -90 188 -175 130 -233 -152 54 206 24 -357 151 -23 -54 34 -171 -164 70 -90 -118 191 -137 -161
3876 -161 23 -141 -176 -138 56 -237 3 116 53 343 -111 -172 -73 -18 50 8 -25 112 353 42 -275 -130 -40
3899 -40 -134 -236 277 -149 -229 -169 82 -145 75 249 -21 382 -48 174 49 -88 -25 305 90 -117 9 208
3921 208 -124 -194 -6 -75 150 58 -15 155 224 309 10 -25 207 -156 150 388 -18 338 -156 -28 139 -159
3943 -159 -163 263 -78 -132 139 -74 -238 -1 -13 -117 148 269 24 -15 -14 -137 -267 -338 -202 -42 -220 199 -91
$$ packed form
3783g6j3j30M12l59K95k5K3o5j91J53j2K3J36l84K87Q9p6m40L01J97r6l4n3L6
3807bJ09j62pr2jK23J28m36M22j04j16J90j15K18l00P5R4p9j35J75l00L11k6k30
3831a60J15P5O7m9J69j69j07n3K81l95p6K95j54M75o02L74k27J53p4J55j77J52
3853F8j41j7K78l63L05l63Q1K06J52j82l81N08j74l1Q8k05PK34j60k8L09l28k4
3876a61J84j64l5L8J94k93K40J13o3K90m54o1R9N5O8m2l3J37K41l11l17J45R0
3899d0r4j02N13m26q0O0K51k27K20J74k70M03m30K22j25j37O3L30k15k07J26J99
3921B08l32p0J88o9K25r2p3J70O9Q5k99l5K32l63L06K38m06L56m94J28J67k98
3943a59mM26l41n4K71k13j64K37j2j04K65J21k45l9Jj23j30p1J36J60j78M19k90
$$ plain form
3966 -91 -52 -190 73 -179 -114 2 -165 -152 -25 22 -293 277 -58 -148 -94 -24 -129 -45 363 289 42 47 -5 165
3990 165 -22 -93 -17 71 239 -11 -72 199 -129 48 -72 -14 -95 -65 21 153 -193 -176 14 -277 -36 7 -147
4013 -147 -297 -37 -20 -14 111 176 65 -20 -265 -322 127 -85 10 10 149 -160 -73 137 132 10 -148 -117 -143 -70 -43
4038 -43 30 18 221 -56 9 -162 -11 152 33 142 318 0 -130 -47 -58 195 179 49 163 104 136 191 357
4061 357 -68 -193 10 78 -167 -49 210 -35 160 -19 225 134 121 -105 -199 -8 93 -81 231 -4 14 155
4083 155 -62 -6 122 177 -70 -115 -118 -248 -44 -163 -89 -16 120 -95 -176 145 153 133 -4 50 91 3 -84 137 -95
4108 -95 147 3 -175 -68 319 107 200 -61 -92 20 -148 -46 18 -81 -42 213 -45 -182 -65 51 120 -191
4130 -191 9 -43 -182 98 284 298 -307 95 -81 -98 41 -9 126 -46 105 170 275 -129 -186 57 -77 -54
$$ packed form
3966i1L9j38K63k52O5J16j67J3J27M7l15N70l35r0N4P0j05Q4M08p4k47Nn2J70
3990A65j87p1P6Q8J68k50o1K71l28J77j20N8q1L0Q6J32l46J7J90k91K41M3j54
4013a47j50K60J7OJ25O5j11q5k45n7M49k12R5%J39l09Q7K10nj22j58L1k6P3K7
4038d3P3j2K03k77O5j71J51J63j19J09J76l18j30Q3j1K53j6j30J14n9L2N5J66
4061C57m25j25K03O8k45J18K59k45J95j79K44r1j3k26r4J91J01j74L12k35J8J41
4083A55k17N6J28N5k47m5lj30K04j19P4P3J36k15q1L21Qk0j37N4M1q8q7K21k32
4108i5K42j44j78J07L87k12R3k61l1J12j68J02O4r9L9K55k58j37J17J16O9l11
4130a91K00n2j39K80J86J4o05M02j76j7J39n0J35j72J51O5J05m04n7K43j34K3
$$ plain form
4152 -54 7 228 -236 -137 98 -63 -96 -48 -137 185 18 -138 -53 225 264 68 -192 88 97 206 47 240 -16
4175 -16 196 79 -7 115 -107 101 112 45 81 -265 277 43 123 258 138 139 -113 81 30 -68 136 -56 -103 114
$$ packed form
4152e4O1K21m64R9K35j61l3M8q9L22j67j56Q5K78L9j96k60K80RJ09j59J93k56
4175a6K12j17q6J22k22K08J1o7L6l46N42k34Q0J35j20Jk52J94n1r8K04j92m7K17
$$ [...]
8191c3
##END NTUPLES=NMR FID
##END=
