##TITLE=1H_DE--92K2_TFA
 200.13MHz, CDCl3,
 8 sc
 
 5.5.2025
##JCAMPDX= 6.0         $$ Bruker NMR JCAMP-DX V2.0
##DATA TYPE= NMR FID
##DATA CLASS= NTUPLES
##ORIGIN= UXNMR, Bruker Analytische Messtechnik GmbH
##OWNER= pz
$$ XWIN-NMR		Version 3.5
$$ Mon May  5 15:53:40 2025 Russian Standard Time (UT+4h)  she@DPX200
##.OBSERVE FREQUENCY= 200.1313
##.OBSERVE NUCLEUS= ^1H
##.DELAY= (6, 6)
##.ACQUISITION MODE= SIMULTANEOUS
##.ACQUISITION SCHEME= undefined
##.AVERAGES= 8
##.DIGITISER RES= 18
##SPECTROMETER/DATA SYSTEM= spect
##.PULSE SEQUENCE= zg30
##.SOLVENT NAME= CDCl3
##.SHIFT REFERENCE= (INTERNAL, CDCl3, 0, 14.3821)
##AUDIT TRAIL= $$ (NUMBER, WHEN, WHO, WHERE, WHAT)
$$ ##TITLE= Audit trail, XWIN-NMR		Version 3.5
$$ ##JCAMPDX= 5.01
$$ ##ORIGIN= Bruker BioSpin GmbH
$$ ##OWNER= she
$$ F:/spectra/data/she/nmr/H-C/1/audita.txt
$$ ##AUDIT TRAIL=  $$ (NUMBER, WHEN, WHO, WHERE, WHAT)
(   1,<2025-05-05 15:51:18.10 +0400>,<she>,<DPX200>,
      <created by zg, POWCHK disabled, PULCHK disabled
       configuration hash MD5:
       00 E9 B6 7A A2 85 ED C7 34 08 36 98 17 FE 4E 26
       data hash MD5: 16K
       62 5D 31 19 4F 46 80 D3 E9 63 E8 8F CD C1 13 A0>)
$$ ##END=
$$ 
$$ hash MD5
$$ AC 3E AF A0 3F 02 2E 3E 6A 82 6C 8C 29 64 BC C6
##$RELAX= 
##$RELAX= 
##$RELAX= 
##$RELAX= 
##$RELAX= 
##$RELAX= 
$$ Bruker specific parameters
$$ --------------------------
##$DU= <F:/spectra>
##$EXPNO= 1
##$NAME= <H-C>
##$PROCNO= 1
##$TYPE= <nmr>
##$USER= <she>
##$AMP= (0..31)
100 100 100 100 100 100 100 100 100 100 100 100 100 100 100 100 100 100 
100 100 100 100 100 100 100 100 100 100 100 100 100 100 
##$AQSEQ= 0
##$AQ_mod= 1
##$AUNM= <au_zg>
##$AUTOPOS= <>
##$BF1= 200.13
##$BF2= 200.13
##$BF3= 200.13
##$BF4= 200.13
##$BF5= 200.13
##$BF6= 200.13
##$BF7= 200.13
##$BF8= 200.13
##$BYTORDA= 1
##$CFDGTYP= 0
##$CFRGTYP= 5
##$CHEMSTR= <none>
##$CNST= (0..31)
1 1 145 1 1 1 1 1 1 1 1 1 1 1 1 1 1 1 1 1 1 1 1 1 1 1 1 1 1 1 1 1 
##$CPDPRG= <>
##$CPDPRG1= <>
##$CPDPRG2= <>
##$CPDPRG3= <>
##$CPDPRG4= <mlev>
##$CPDPRG5= <mlev>
##$CPDPRG6= <mlev>
##$CPDPRG7= <mlev>
##$CPDPRG8= <mlev>
##$CPDPRGB= <>
##$CPDPRGT= <>
##$D= (0..31)
0 0.7 0 0 0 0 0 0 0 0 0 0.03 0 0 0 0 0 0 0 0 0 0 0 0 0 0 0 0 0 0 0 0 
##$DATE= 1746445877
##$DBL= (0..7)
120 120 120 120 120 120 120 120 
##$DBP= (0..7)
150 150 150 150 150 150 150 150 
##$DBP07= 0
##$DBPNAM0= <>
##$DBPNAM1= <>
##$DBPNAM2= <>
##$DBPNAM3= <>
##$DBPNAM4= <>
##$DBPNAM5= <>
##$DBPNAM6= <>
##$DBPNAM7= <>
##$DBPOAL= (0..7)
0.5 0.5 0.5 0.5 0.5 0.5 0.5 0.5 
##$DBPOFFS= (0..7)
0 0 0 0 0 0 0 0 
##$DE= 6
##$DECBNUC= <off>
##$DECIM= 32
##$DECNUC= <off>
##$DECSTAT= 4
##$DIGMOD= 1
##$DIGTYP= 9
##$DL= (0..7)
0 120 120 120 120 120 120 120 
##$DP= (0..7)
150 150 150 150 150 150 150 150 
##$DP07= 0
##$DPNAME0= <>
##$DPNAME1= <>
##$DPNAME2= <>
##$DPNAME3= <>
##$DPNAME4= <>
##$DPNAME5= <>
##$DPNAME6= <>
##$DPNAME7= <>
##$DPOAL= (0..7)
0.5 0.5 0.5 0.5 0.5 0.5 0.5 0.5 
##$DPOFFS= (0..7)
0 0 0 0 0 0 0 0 
##$DQDMODE= 0
##$DR= 18
##$DS= 0
##$DSLIST= <SSSSSSSSSSSSSSS>
$$ [...]
##$SUBNAM0= <"">
##$SUBNAM1= <"">
##$SUBNAM2= <"">
##$SUBNAM3= <"">
##$SUBNAM4= <"">
##$SUBNAM5= <"">
##$SUBNAM6= <"">
##$SUBNAM7= <"">
##$SUBNAM8= <"">
##$SUBNAM9= <"">
##$SW= 18.0517328524113
##$SWIBOX= (0..15)
0 0 2 0 0 0 0 0 0 0 0 0 0 0 0 0 
##$SW_h= 3612.71676300578
##$TD= 16384
##$TD0= 1
##$TE= 0
##$TE2= 300
##$TE3= 300
##$TEG= 300
##$TL= (0..7)
0 120 120 120 120 120 120 120 
##$TP= (0..7)
150 150 150 150 150 150 150 150 
##$TP07= 0
##$TPNAME0= <>
##$TPNAME1= <>
##$TPNAME2= <>
##$TPNAME3= <>
##$TPNAME4= <>
##$TPNAME5= <>
##$TPNAME6= <>
##$TPNAME7= <>
##$TPOAL= (0..7)
0.5 0.5 0.5 0.5 0.5 0.5 0.5 0.5 
##$TPOFFS= (0..7)
0 0 0 0 0 0 0 0 
##$TUNHIN= 0
##$TUNHOUT= 0
##$TUNXOUT= 0
##$USERA1= <user>
##$USERA2= <user>
##$USERA3= <user>
##$USERA4= <user>
##$USERA5= <user>
##$V9= 5
##$VALIST= <valist>
##$VCLIST= <CCCCCCCCCCCCCCC>
##$VD= 0
##$VDLIST= <DDDDDDDDDDDDDDD>
##$VPLIST= <PPPPPPPPPPPPPPP>
##$VTLIST= <TTTTTTTTTTTTTTT>
##$WBST= 1024
##$WBSW= 4
##$XGAIN= (0..3)
0 0 0 0 
##$XL= 0
##$YL= 0
##$YMAX_a= 236852
##$YMIN_a= -247670
##$ZGOPTNS= <>
##$ZL1= 120
##$ZL2= 120
##$ZL3= 120
##$ZL4= 120
##$ABSF1= 10
##$ABSF2= 0
##$ABSG= 5
##$ABSL= 3
##$ALPHA= 0
##$AQORDER= 0
##$ASSFAC= 0
##$ASSFACI= 0
##$ASSFACX= 0
##$ASSWID= 0
##$AUNMP= <proc_1d>
##$AZFE= 0.1
##$AZFW= 0.1
##$BCFW= 1
##$BC_mod= 2
##$BYTORDP= 1
##$COROFFS= 0
##$CY= -3
##$DATMOD= 1
##$DC= 2
##$DFILT= <>
##$DTYPP= 0
##$F1P= 0
##$F2P= 0
##$FCOR= 0.5
##$FTSIZE= 0
##$FT_mod= 4
##$GAMMA= 1
##$GB= 0.15
##$INTBC= 1
##$INTSCL= 1
##$ISEN= 128
##$LB= 0.25
##$LEV0= 0
##$LPBIN= 0
##$MAXI= 10000
##$MC2= 0
##$MEAN= 0
##$ME_mod= 0
##$MI= 1.114404
##$NCOEF= 0
##$NC_proc= 0
##$NLEV= 6
##$NOISF1= 3.799351
##$NOISF2= 2.8
##$NSP= 1
##$NTH_PI= 0
##$NZP= 0
##$OFFSET= 14.38212
##$PC= 1
##$PHC0= -1588.699
##$PHC1= 28.79221
##$PH_mod= 1
##$PKNL= yes
##$PPARMOD= 0
##$PSCAL= 0
##$PSIGN= 0
##$REVERSE= no
##$SF= 200.129724274929
##$SI= 16384
##$SIGF1= 3
##$SIGF2= 2
##$SINO= 400
##$SIOLD= 16384
##$SREGLST= <1H.CDCl3>
##$SSB= 0
##$STSI= 0
##$STSR= 0
##$SW_p= 3205.1282051282
##$SYMM= 0
##$S_DEV= 0
##$TDeff= 0
##$TDoff= 0
##$TI= <>
##$TILT= no
##$TM1= 0
##$TM2= 0
##$TOPLEV= 0
##$USERP1= <user>
##$USERP2= <user>
##$USERP3= <user>
##$USERP4= <user>
##$USERP5= <user>
##$WDW= 1
##$XDIM= 8192
##$YMAX_p= 0
##$YMIN_p= 0
$$ End of Bruker specific parameters
$$ ---------------------------------
##NTUPLES= NMR FID
##VAR_NAME=  TIME,          FID/REAL,        FID/IMAG
##SYMBOL=    X,             R,               I
##VAR_TYPE=  INDEPENDENT,   DEPENDENT,       DEPENDENT
##VAR_FORM=  AFFN,          ASDF,            ASDF
##VAR_DIM=   8192,          8192,            8192
##UNITS=     SECONDS,       ARBITRARY UNITS, ARBITRARY UNITS
##FACTOR=    0.0002768,     1,               1
##FIRST=     0,             0,               0
##LAST=      2.2672688,     0,               0
##MIN=       0,             -247670,         0
##MAX=       2.2672688,     236852,          0
$$ Real data points
##PAGE= N=1
##DATA TABLE= (X++(R..R)), XYDATA
0 0 0 0 0 0 0 0 0 0 0 0 0 -8 8 -8 8 -16 16 -20 24 -32 32 -40 48 -56 69 -80 93 -108 125 -142 164 -188 212
33 212 -237 269 -304 340 -382 426 -477 531 -591 654 -724 800 -885 977 -1077 1186 -1308
50 -1308 1439 -1587 1749 -1929 2131 -2359 2619 -2915 3262 -3670 4159 -4756 5508 -6488 7817
65 7817 -9731 12743 -18174 30932 -113992 -51234 236852 -71352 -129232 -66550 18849 80960
77 80960 -29936 -123673 -33769 15765 53696 -11667 -94575 -24978 41468 11635 -14046 -55560
89 -55560 -10651 49048 13781 -40400 -42839 8105 49754 8400 -27338 -18156 8426 36513 14904
102 14904 -32393 -12948 24904 36264 7586 -31925 -7569 31202 25937 4331 -21130 -4372
114 -4372 31411 20665 -7003 -14403 1379 30622 22689 -15939 -19017 4133 22444 16389 -15667
127 -15667 -17676 10088 18270 2539 -16805 -14607 7049 17151 -801 -18627 -11629 6473 12215
140 12215 -3804 -16265 -7008 6298 5882 -6463 -14562 -5879 9157 5617 -8714 -12281 -4523 7824
154 7824 5132 -7191 -9159 -1253 7441 3904 -7262 -7279 1901 6325 2380 -5345 -5636 3042 5921
169 5921 443 -3959 -2984 4571 5519 -459 -3480 -1156 3968 4665 -1091 -3731 105 4415 3496 -917
185 -917 -3052 1186 3821 2339 -1010 -2991 981 3140 1615 -1331 -2434 255 2564 1180 -1202
200 -1202 -1915 -10 1839 653 -1549 -1744 -627 1101 688 -987 -1088 -50 832 442 -1216 -1308 -206
217 -206 783 787 -372 -1273 -346 884 589 -261 -1020 345 1228 1023 -328 -1039 80 1184 1078 -76 -1059
236 -1059 -88 989 603 -102 -217 2 863 248 -518 -499 310 1091 167 -1006 -1170 589 1123 -27 -1158
255 -1158 -719 771 784 -747 -1425 -469 1090 645 -936 -1732 -884 989 709 -665 -1380 -108 1042 473
273 473 -1511 -1721 244 1445 631 -886 -1642 206 1569 584 -935 -756 522 1486 511 -884 -793 713
291 713 1313 670 -864 -340 667 1026 370 -517 -366 766 791 -300 -961 2 708 596 -417 -665 248
310 248 661 690 -542 -654 275 850 503 -958 -576 161 516 387 -520 -640 98 359 74 -381 -275 66
330 66 426 -138 -701 -253 197 526 -73 -185 -375 113 231 -95 -149 -384 392 210 -10 -368 -51 25 419
351 419 224 -66 -155 229 306 -102 -35 -124 355 173 80 -224 -210 -9 608 188 -271 -176 91 221 117 -222 -98
374 -98 -50 165 -38 -206 -127 -41 304 110 6 -233 119 232 42 138 11 -43 81 -243 119 -140 382 100
396 100 4 -143 -112 95 85 106 -101 372 225 329 -103 -172 164 142 -116 -169 -229 205 179 -92 -65 -147 -25 585
420 585 -82 -60 -100 234 -16 29 -156 59 230 232 -137 -33 -227 505 91 -25 -181 -179 251 -223 -190 -222 -41
443 -41 3 -154 -114 4 -56 36 -258 -232 -121 -51 306 114 93 -149 -72 -148 -90 -148 -128 236 59 39 46 371 145 257
469 257 -185 57 109 259 105 61 -135 11 98 88 -100 65 46 -67 97 18 -14 110 -68 52 -108 -63 -107
492 -107 -164 199 -359 -267 39 -154 -239 -164 -83 301 -67 14 -45 -192 -216 120 52 100 46 -112 45 -170 -206 -90
516 -90 -108 26 -282 -222 -7 224 47 -162 155 71 25 167 14 -40 -163 67 118 -88 -180 189 -84 171 -63
539 -63 -211 -55 -79 65 -130 181 244 228 -76 77 -213 178 173 184 16 -152 122 18 104 -219 23 202 70
562 70 110 30 74 -137 46 -213 -354 5 -183 103 89 -100 240 166 31 144 -267 34 -97 -46 19 -31 -144
585 -144 224 220 13 50 -6 -145 40 -262 150 100 -158 12 21 113 181 -386 -256 -50 -11 117 23 34 355 151
609 151 276 -22 -160 162 270 77 247 127 70 69 -88 -18 71 72 -135 165 3 78 1 176 22 213 148 167
633 167 -63 -189 -105 -124 129 -59 18 -109 -118 125 13 -3 -268 -15 -70 51 68 396 161 -93 -51 -165 12
656 12 240 -129 248 -131 -111 10 1 -76 134 26 -107 -97 -195 186 -91 138 -9 81 28 158 17 56 31 4
680 4 143 156 -49 120 106 -106 54 30 -342 -62 108 -127 55 -48 -78 -76 -50 -134 308 9 10 121 13 157
704 157 72 201 -185 -42 109 16 283 6 -224 -100 -78 160 118 45 -38 -209 115 -5 6 88 207 140 -40
727 -40 31 256 -114 -68 -26 -75 190 56 280 324 8 115 -123 -237 106 -228 -15 184 -95 -245 121 25 87
750 87 209 -223 99 9 60 -148 -91 57 -31 120 286 -103 -45 -49 -1 -165 -76 -152 62 -200 200 -58 149 355
774 355 307 16 299 24 75 -39 -91 172 -48 -315 -16 79 -172 -46 -177 -62 36 137 201 -163 300 -156
796 -156 -88 -135 -28 24 -394 120 40 26 26 236 -98 -37 411 110 -14 7 -52 -20 -151 -90 -46 251 84 -89 13
821 13 96 -123 -66 297 218 -160 -18 45 -11 53 54 5 46 -52 -48 -93 71 25 -46 47 -27 -14 -242 -3 154 -48 5
848 5 31 -44 -127 166 -79 -141 84 -45 213 31 2 -111 99 63 -328 347 6 175 -238 39 -110 -84 39
871 39 125 8 121 172 54 45 52 -87 60 187 -124 -236 -262 -22 91 317 -28 27 177 71 207 61 -172
894 -172 84 -36 -2 -167 21 -287 -80 103 -79 -287 85 -171 -114 310 64 -6 -22 97 -109 97 -23 -243
916 -243 -32 81 92 175 -113 -182 97 291 -22 -116 -299 -56 35 -57 66 -16 19 -46 8 -79 -46 -67 -110 147 91
941 91 -119 10 137 -81 -196 82 28 -104 115 -24 97 -71 -185 169 -141 -27 256 119 -227 113 149
962 149 -82 277 71 139 306 -83 -14 3 3 34 -28 93 -124 -366 47 -170 -43 38 -321 -20 -40 53 204 301
986 301 -33 -33 -60 -146 90 -29 -4 -268 18 133 -172 100 -57 45 61 -40 14 -59 98 15 92 66 -160 123
1010 123 175 -106 278 -15 93 -9 -28 -6 -127 160 -221 -353 1 3 -57 57 71 111 -55 -73 193 -113 -302
1033 -302 95 -102 331 215 51 164 183 294 -31 -99 -27 -9 -37 216 -39 14 110 -50 -169 -19 -178 -23
1055 -23 -82 61 175 -82 202 321 91 24 55 -54 97 -95 -83 123 -26 226 -117 39 243 343 -113 -153
1077 -153 149 235 63 108 201 19 -203 149 -7 71 -39 4 79 156 2 1 102 -229 64 -185 187 119 -84
1100 -84 192 -135 111 214 73 222 -37 16 117 36 65 161 282 101 130 -64 -4 85 -222 247 -158 23 46
1123 46 -29 -6 95 -203 -136 -205 -179 -125 104 20 90 77 13 -321 77 -87 -103 223 -62 30 6 213 -30 21 -87
1148 -87 338 -180 62 -236 -38 172 142 52 -139 157 294 -53 93 163 -8 -150 -89 -289 -210 -19 173 164 182
1171 182 -6 20 -25 -62 -184 -51 11 -254 92 58 162 -94 -27 -43 -238 -25 -96 103 -173 5 -98 227 -273
1194 -273 -121 -73 -163 168 73 39 -175 -144 -70 -93 143 77 -184 -85 -254 -57 -196 90 223 177 -111 133 -112
1217 -112 -10 176 102 -350 187 11 -72 -32 -39 75 63 87 75 142 -107 118 185 21 6 -60 -130 -114 -226 145 21
1242 21 57 44 -117 49 5 -193 -71 241 -133 -20 273 -160 -3 57 59 -139 207 33 -102 -74 0 -231 317
1265 317 -6 -247 -78 -49 -62 -7 23 156 -13 -27 145 2 -113 11 79 52 411 -63 65 -87 244 -44
1287 -44 -190 -122 -2 87 -36 -35 293 126 13 -9 -121 35 -85 87 37 56 -327 -73 -143 88 -15 -225 -57
1310 -57 -178 11 2 251 -14 -197 -96 135 63 0 87 -70 0 -152 197 -16 -103 -192 -190 -124 -187 -18 -166 -200 87
1335 87 -101 141 63 -13 216 -86 296 -50 -312 206 -172 88 -130 7 -100 122 138 -213 -59 356 -80
1356 -80 -92 -199 -31 -94 -213 147 65 -42 154 131 -22 64 -55 73 -241 -327 7 63 -97 -90 134 -33 -179
1379 -179 -36 -1 42 11 92 -54 -190 115 -105 -56 21 81 -13 70 -122 236 61 -269 -187 108 130 -201 -114 -31
1403 -31 -43 51 148 -69 -85 -20 15 -107 209 226 167 196 -112 28 -421 -34 -105 111 -91 156 117 -67 118 147
1427 147 48 57 -173 -158 -135 66 54 106 -288 -121 -35 135 109 -73 173 218 60 209 66 87 13 105 45 -67 234
1452 234 114 -45 -199 -124 -11 13 -146 -339 123 -67 59 83 225 130 211 -227 85 -102 -56 -234 -25 93
1474 93 -106 -409 118 28 -129 -97 -166 101 25 26 94 212 32 66 -104 11 119 -133 172 -12 -48 -50 -25 -16 -146
1499 -146 32 -67 -111 -279 258 -25 -35 -85 129 -110 -97 -354 243 45 -161 -100 29 -79 -171 -133 -36 21 -170
1522 -170 181 127 47 131 24 241 119 58 121 185 15 -469 -83 -354 -58 14 262 191 -265 73 -203 86 -31
1545 -31 -74 -24 -75 -44 -121 7 -316 -11 -89 -87 156 -76 63 8 -130 -189 1 84 -179 178 -101 -6 114 -77
1569 -77 55 -39 -127 -25 -86 122 -67 -8 102 -9 84 21 -323 226 7 -118 -138 -326 -144 -40 30 -37 188
1592 188 267 -11 -83 68 -211 -59 21 98 -168 129 15 -134 26 -55 284 281 -146 -18 415 -10 -189 -55
1614 -55 146 78 -54 214 -159 71 -8 149 338 11 58 -41 -82 242 202 -29 -100 -30 37 116 21 77 -59 -102 95
1639 95 -283 -74 -18 199 -40 172 -41 149 -33 -25 341 -34 165 17 -143 122 -109 -83 -101 65 83 -73
1661 -73 191 302 -90 -133 -89 -219 -386 17 -202 75 -5 -300 114 -59 4 -36 334 -121 27 -270 -31 162
1683 162 -194 -245 116 -284 86 84 40 170 34 -232 -50 69 71 202 -214 -9 -46 14 -163 -22 -65 -138 -155 -50
1707 -50 170 -42 -43 171 -183 175 37 46 334 111 273 156 -194 108 -57 13 173 45 197 -122 174 -187
1729 -187 -177 -22 -29 -91 205 198 95 158 -33 72 13 -263 -181 -135 -18 44 89 9 -156 77 81 -19 -194 31 -22
1754 -22 -17 -122 75 -57 108 -148 -166 -202 -44 29 -44 -66 216 63 8 -173 28 -81 -35 -99 31 -148 349 62
1778 62 -29 -121 -85 -180 -32 -242 -150 -70 -85 39 -146 -222 -74 7 -205 -6 126 -93 -127 -116 -170 -39 96 -128
1802 -128 -107 265 71 159 71 74 -7 57 -51 -193 -37 34 -61 -41 288 -6 -158 7 97 -362 129 -25 124 57
1826 57 114 -6 159 66 86 192 -167 385 -35 122 4 190 39 -75 214 4 54 143 203 -203 31 241
1848 241 184 -93 45 167 -52 140 -140 -109 20 -154 -61 -91 274 -28 105 39 62 -271 -163 12 180 34
1870 34 -58 -329 260 67 -137 -170 44 -102 -306 -54 -33 -278 -49 -113 2 153 200 -353 -127 133 -111 139
1892 139 75 -230 -3 -112 -347 -151 -310 180 227 37 79 -223 104 112 21 -109 129 240 157 29 -16 -48 134
1915 134 48 94 111 -111 206 -205 205 202 -38 -172 -2 293 -63 22 77 215 175 36 -161 -19 196 -249 -72
1938 -72 26 27 407 139 153 66 221 54 113 300 -167 40 17 13 179 -65 55 -55 -128 114 -61 -54 -304 -315 -256
1963 -256 14 155 -94 137 58 137 -129 -143 -142 378 88 -190 135 -37 -100 -154 -16 95 -32 261 -430 34
1985 34 154 -43 -349 137 170 -89 31 133 91 -29 35 -374 34 -77 -170 -23 -125 189 -33 -62 71 -86
2007 -86 42 87 219 188 52 -219 282 175 207 -59 152 81 -47 50 -91 200 96 170 16 319 245 129 39
2030 39 201 49 -43 -135 -114 245 -38 -85 -17 151 13 57 -151 67 -101 -226 8 -54 34 38 -104 -2 -151 -90
2054 -90 -59 16 95 -138 41 102 -173 115 251 -92 137 -192 32 112 120 118 -23 108 -250 -179 -186 334 114 77 142
2079 142 -7 -259 98 -244 117 69 163 118 -27 14 -40 -96 -211 -47 82 146 -194 117 103 76 -338 -173 -193
2102 -193 -178 22 116 206 167 16 198 193 -99 -61 -92 -130 87 124 -137 188 -212 151 -314 -226 -109 -216 4 -47
2126 -47 -263 34 -208 190 56 207 154 -13 -129 16 -157 -52 -7 63 -215 83 -305 -266 -188 -29 -105 21
2148 21 -152 -75 -58 -40 -283 19 330 253 -22 18 7 21 -215 -166 -61 -31 -86 77 101 -121 229 -77 -101 247
2172 247 239 -58 -191 201 -84 93 52 -280 305 -216 -80 -35 137 92 154 43 176 -7 -97 -148 -101 205 -81
2195 -81 -79 52 184 131 93 65 -55 125 113 -157 29 183 22 -52 112 -71 28 -2 -124 230 -261 167 -27
2218 -27 206 -52 77 108 -198 -136 -148 -2 -224 -94 -345 108 -230 48 361 -167 -120 -111 -55 -189 6 -31 36
2241 36 23 -43 -12 -293 -24 15 -12 67 249 68 51 -23 43 132 105 -207 233 -159 -8 -14 65 96 -47 92 56 -104
2267 -104 31 261 118 -141 -144 48 -66 -230 -116 -2 -92 45 1 77 -14 -204 28 39 25 94 -167 -145 -106 63
2291 63 95 -143 55 9 42 11 -187 -126 40 100 91 -171 -41 130 -261 122 206 276 -170 -193 -159 -109 -44 76 96
2316 96 35 33 99 75 -85 -185 -210 6 69 163 175 112 -6 63 223 112 35 135 -183 -196 -18 -173 173 -20 -70
2341 -70 -133 -106 52 54 -22 35 -272 24 2 146 100 24 123 9 -154 -185 -99 140 48 -80 -125 121 -29 257 221
2366 221 -36 169 -356 -80 39 133 106 279 90 -204 -53 199 -330 -95 14 239 99 -51 84 -47 -232
2387 -232 -149 -3 -241 -141 -38 236 -24 90 -120 19 -165 -94 22 -40 104 289 -66 -113 -81 13 -359 91
2409 91 157 58 31 -42 15 -29 41 -31 139 250 250 4 -85 19 -50 -17 148 75 -64 131 -187 214 -104 -41 305
2434 305 -34 -276 -194 -64 -51 -62 20 -189 -48 -51 38 189 124 -160 149 93 -17 30 -76 109 -174 -89 304 34
2458 34 -173 238 188 -3 61 32 56 116 122 -59 -19 71 -265 45 176 145 265 -47 -4 108 66 55 -82 -36 152
2483 152 290 63 -63 75 71 180 -2 33 -170 101 -83 -98 165 407 -100 -69 -16 106 -46 168 -18 308
2505 308 111 292 -184 55 -40 8 -175 58 -24 -57 184 140 27 109 23 39 0 5 -46 -96 200 130 29 14 39
2530 39 -22 105 -189 54 -8 31 58 192 -64 107 15 -107 -101 63 -132 -112 -41 -286 35 0 22 2 39 -188 19
2555 19 -216 80 63 -23 -129 104 -111 148 128 102 -9 -133 88 87 -40 209 141 19 288 -4 50 -131 -80
2578 -80 -29 -132 62 98 7 45 120 -118 -96 45 -93 -224 -23 -41 195 -16 146 0 152 42 -37 -173 -100
2601 -100 236 7 81 -98 -102 38 -140 67 5 210 -159 -27 15 180 -52 -35 372 -31 -5 18 -143 -86 -14
2624 -14 -58 -27 -67 -27 -64 65 -102 -48 417 41 67 171 -170 -12 122 -215 3 95 -62 -40 112 -21 -42 -35
2648 -35 131 -257 167 71 88 -173 178 172 -8 136 -16 16 215 -306 -214 -122 -134 82 60 -7 -209 36 45 129 -292
2673 -292 140 -66 45 12 126 112 133 120 195 -247 -287 -128 -193 142 72 -200 170 111 -135 49 -113 -2 -153
2696 -153 -132 -7 -17 -4 -111 -211 13 50 56 110 70 180 -122 -96 -20 269 46 -174 -18 142 -145 269 105
2719 105 52 91 38 -13 6 -86 221 132 -11 -69 118 -52 172 90 51 -44 -61 -87 37 282 -4 -170 25 167
2743 167 263 41 -59 82 -67 379 29 -57 54 -2 -143 80 -42 60 94 85 145 134 -78 -62 145 58 -6 90
2767 90 80 150 43 -104 -23 218 -57 -116 -110 112 145 -4 17 -171 0 237 27 66 10 91 362 68 493 181
2791 181 70 -15 199 -86 34 -72 122 127 -89 117 57 -118 -15 212 133 -132 -11 33 13 -6 -94 182 -20
2814 -20 55 -265 119 -125 -155 -33 40 -172 85 118 -16 167 9 50 -79 113 -61 11 -246 37 29 -211 -3
2837 -3 66 73 -99 34 98 -76 -54 43 75 48 -212 97 246 -46 18 -300 108 119 -260 -168 66 -102 -261 -305 -68
2862 -68 245 12 -86 130 51 73 -138 68 218 439 20 71 17 106 130 47 -60 3 190 83 70 27 35 36 -115
2887 -115 -229 94 -43 259 35 -156 191 -149 -241 -176 20 119 -131 -101 5 -200 50 18 289 -113 -141 118
2909 118 315 180 -144 -117 -72 -167 -167 -99 -101 189 -64 53 -64 154 -249 -134 -124 -49 -392 111 43 -197 -73 235
2933 235 -19 -42 24 250 -103 -33 156 11 -98 70 -2 -2 85 -24 122 -40 397 -38 58 -258 31 37 87 -43
2957 -43 -119 -38 -86 -100 -89 17 -29 -129 -135 127 148 -134 80 -113 -126 -86 1 -89 -38 151 41 -35 174 3 -122
2982 -122 142 -175 174 39 167 31 78 5 73 29 77 -98 -138 -157 170 107 -54 -22 33 -199 213 -5 -150
3005 -150 -181 -124 62 266 57 89 8 -108 24 -38 35 -175 85 -21 -271 -54 2 -11 -9 11 250 -407 107 85
3029 85 139 14 -116 -64 -31 94 -102 -82 121 -320 24 193 -182 149 32 297 -309 -108 -191 35 -27 -61 -62
3052 -62 87 -21 -5 -116 -32 -42 177 50 -133 130 -5 240 -278 25 -16 -128 231 183 318 29 44 -246
3074 -246 125 -137 -35 97 -166 7 167 68 -28 -364 -6 157 -29 -64 107 4 178 -132 157 218 8
3095 8 -61 -124 -23 -81 -50 73 162 216 -211 51 159 -117 94 198 82 -82 51 126 -108 127 191 -13 177
3118 177 75 173 15 -79 -14 -42 -132 17 17 459 -28 -8 33 31 -173 97 -224 266 -309 -259 -102 -142 62 54 -57
3143 -57 -174 40 -42 -103 -159 -87 -331 241 55 65 143 44 -188 -129 -51 -20 -70 181 250 24 38 -92 -107 167 133
3168 133 350 64 6 183 -71 -137 -33 -70 104 -62 65 88 -218 117 -89 126 103 -105 -33 5 299 251 73
3191 73 -217 -369 32 99 13 -65 164 272 -161 92 125 63 -143 11 -48 218 -105 33 281 -10 28 -41 -99
3214 -99 -258 168 144 -289 28 324 132 -66 -14 -62 74 112 82 -67 165 -24 -153 -42 21 316 43 182
3236 182 50 -20 16 -115 193 -207 -77 76 -161 -163 117 -10 274 -40 -107 88 162 -19 125 -15 82 27 79
3259 79 -25 -39 -11 15 -189 -30 117 185 34 217 -38 183 210 91 199 -234 -218 -99 -53 17 -148 143 176
3282 176 180 8 42 -94 81 12 30 9 101 -271 123 -11 -153 -187 189 210 -266 -95 -109 178 86 -15 -170 33
3306 33 246 75 92 169 -78 -49 137 199 -46 61 32 -138 -139 228 -264 -432 204 101 21 -16 -6 -131 59 265
3330 265 -129 -156 272 152 -404 -209 -24 7 -34 -35 -58 -31 -245 -4 72 -1 -144 -319 280 -316 -115 101 -119
3353 -119 -122 127 169 109 -329 -100 8 -57 -91 53 -81 206 -55 389 170 -266 104 27 -70 -141 99 -18 62
3376 62 76 44 -301 -67 -148 121 145 -241 28 241 261 146 4 -55 -200 -94 244 -10 -114 20 63 -96 169
3399 169 12 -248 126 86 246 -150 119 251 -87 34 93 73 -189 -309 78 4 -77 -221 -203 -32 205 -158
3421 -158 -59 258 59 -36 167 -58 137 -7 83 57 -174 9 164 -133 132 -81 -100 -89 225 8 -70 149
3443 149 -125 12 300 15 -203 -121 105 -83 -130 -25 -66 164 71 -248 68 195 -44 176 -3 109 174 1
3465 1 -59 60 -6 -184 201 202 -121 396 -36 -45 -135 294 75 -137 -20 -169 -268 -228 161 236 -309 97 -45 -43 -74
3490 -74 267 -133 95 44 -88 157 76 70 -48 291 -251 328 161 138 232 -307 155 137 209 -32 8 227 210 -18
3514 -18 -19 -217 -29 292 54 -51 -75 -31 -276 -173 164 -87 -101 341 149 28 -212 -224 50 -77 -40 -88 -312
3537 -312 12 100 -91 -111 -171 -251 -214 -28 -58 -14 -78 31 -113 169 -138 -151 -266 77 364 30 161 -127 41
3560 41 51 -170 -9 121 147 174 86 -158 64 -146 40 205 -300 67 -22 -76 111 103 1 9 -122 130 -52 86
3584 86 69 -47 131 46 245 -2 -492 2 161 63 -48 57 37 -84 -341 136 -306 -50 -86 -162 -95 -106 -115 -324
3608 -324 115 -116 77 128 44 -168 2 32 120 -260 -5 13 154 -45 1 82 37 -160 -274 179 -185 11 -255
3631 -255 -16 53 -96 -112 201 -255 27 -273 174 -146 13 196 122 101 -456 82 102 27 -3 48 251 -103 32
3654 32 61 -90 261 -136 -150 115 -142 251 231 200 49 177 -131 -39 -99 148 35 -169 -113 -31 -30 -62 -219 -137
3678 -137 11 240 -16 -30 9 -240 161 -4 -205 -80 -69 -217 -162 -30 -26 212 -108 14 -96 -273 -136 109
3700 109 -119 107 290 -392 -262 -79 31 0 -53 -131 -375 31 158 102 225 -180 116 -50 235 3 -104
3721 -104 161 -225 139 119 133 354 -94 -147 -190 112 -128 42 -58 70 -5 56 61 -55 -63 -2 84 203 297 41
3745 41 -110 -148 -57 -194 59 47 -128 232 42 -27 -32 147 -100 -161 -299 -95 51 -33 28 -205 -5 100 111 -338
3769 -338 155 359 -287 100 22 126 -239 -33 -199 -281 1 7 176 11 -64 131 -16 -154 182 207 95 -87
3791 -87 -50 127 11 -154 -182 47 -8 -280 14 -276 -32 153 -101 162 -161 21 -93 -98 -168 32 85 -219 -2
3814 -2 -94 -65 -21 -256 44 12 162 -91 -263 145 -303 -95 -74 56 -183 96 89 -43 -68 -120 -166 -58 53 14
3838 14 138 -46 -99 -162 -144 -203 148 -46 95 -49 50 -103 -131 20 116 -98 -94 -262 106 216 -1 4 48 -18 46
3863 46 -202 96 313 -309 -348 164 -117 -179 173 -98 -230 115 -178 -124 -161 -120 401 -42 -29 21 19 -76 -141 263
3887 263 -61 -37 -99 -19 107 -8 112 32 69 -68 -185 -217 -166 -92 -71 187 35 23 -263 145 -34 -74 -80 43
3911 43 168 172 114 200 -218 -87 -232 -95 8 -398 -129 75 -169 -168 -136 -153 -89 189 -204 -103 5 -50 -304 319
3935 319 -119 5 -3 76 -191 -106 24 -222 33 -303 318 -36 -29 -178 315 117 31 -152 211 212 -58 54 -36
3958 -36 83 -19 -40 -80 -303 230 -83 22 -161 71 -268 329 -59 58 247 -36 -170 -40 -51 -25 -216 -215
3980 -215 -173 122 17 -40 -15 -121 -7 -236 -137 44 96 -215 -118 -62 -10 237 146 84 -111 121 -69 -26 139 240
4004 240 -54 -10 63 112 -173 -87 33 27 296 185 -9 -69 -133 -95 -82 121 74 7 -89 96 10 62 99 116 64 -172
4030 -172 -33 -48 187 -315 45 -231 -168 -116 93 82 189 -204 -147 218 -7 -17 58 130 -288 -71 62 -65 310
4053 310 -114 -19 -372 -223 -8 302 322 71 -42 -76 336 78 -94 71 101 18 131 34 -275 -141 50 38
4075 38 218 -92 68 -24 115 264 -171 -24 -173 39 -52 72 -141 -70 -54 38 117 70 207 318 3 -136 238
4098 238 266 43 83 35 -202 138 -154 15 -21 -12 36 3 -304 -41 58 59 -170 399 -44 14 -298 56 258 116
4122 116 -41 163 47 -216 -42 -188 160 162 41 78 140 238 134 -72 200 -157 -213 -15 72 273 -83 31
4144 31 -127 -103 226 36 -211 4 8 -94 93 -308 90 -95 16 -281 -14 68 -21 -54 42 83 145 -11 -26 -301
4168 -301 -203 44 155 229 -18 -51 256 -38 10 -47 -191 -76 -111 -59 -76 -47 -204 220 -138 -314 201 -114 -77
4191 -77 68 309 -85 192 -94 -21 -78 -158 -46 -338 -37 345 165 -7 -104 152 18 -109 0 -80 176 -39
4213 -39 -68 100 -136 24 42 -183 47 -143 -77 -65 -16 130 26 50 82 401 146 118 71 53 65 59 29 123 -85
4238 -85 -129 -191 6 179 -92 17 -63 49 30 -58 -168 81 21 77 22 71 -105 -249 129 181 46 -342 33 99
4262 99 -3 106 -120 -144 0 -68 69 13 -56 -104 -94 297 60 4 315 61 82 -308 -59 -142 -82 316 -236 228
4286 228 -18 105 117 163 79 -63 95 -54 47 -193 1 -124 -190 -69 169 -110 -174 -187 -117 83 19 35 167
4309 167 160 113 -29 144 -29 -117 108 115 49 -129 -81 66 -42 -159 -131 -185 -187 135 20 -72 -191 -24 193 -33
4333 -33 -20 86 -40 -71 83 89 -72 -23 -184 89 -42 -4 -310 -48 -37 188 -182 25 -231 59 264 -321 -191
4356 -191 -41 104 243 73 95 81 -148 -85 159 42 -82 -185 -59 -157 122 -127 -76 69 -68 -103 143 -105
4378 -105 -5 -57 -21 42 -34 -94 100 144 -110 -31 -80 -170 150 -43 7 -60 297 44 21 -26 -143 12 -20 8 4 75
4404 75 -345 -68 -33 -77 -22 30 5 14 -41 -119 349 -185 -233 73 -133 -90 -53 131 102 -174 247 -150 -24 82 -244
4429 -244 71 -130 -57 92 -102 -193 -147 79 -31 -33 -53 83 155 -315 -287 215 367 37 -190 94 87 48 -235 -171
4453 -171 54 8 -102 101 -182 -126 24 -100 201 102 -118 -16 -16 248 -245 22 154 133 -181 -193 120 284
4475 284 -150 67 13 21 132 40 -120 76 -144 -4 3 -216 254 325 -25 -83 31 -5 -43 -161 -121 -58 -94 -173 51
4500 51 -205 -90 141 -202 -37 32 5 73 -268 -21 191 -183 -14 279 144 50 -205 -14 22 48 111 -10 -302
4523 -302 100 -146 -2 152 134 120 223 -192 130 -250 -29 -122 97 -321 -222 -151 190 279 124 -37 -91 -128 -254
4546 -254 263 62 -92 -88 -284 47 26 160 56 39 184 125 -129 -148 -233 27 -264 144 67 -216 223 -3 26
4569 26 6 -55 -10 -153 84 65 54 -260 132 -154 -37 172 26 -67 -111 249 -79 47 161 300 39 -107 80
4592 80 62 -53 140 -311 66 -46 -165 7 33 -142 133 180 173 -17 -83 -74 33 12 -46 -97 48 131 -84 322
4616 322 -62 137 117 31 -16 62 50 141 -16 122 -190 -12 -262 -43 -89 -347 212 74 -33 -86 -197 18 70
4639 70 149 105 -212 -46 23 222 -16 -142 145 71 -71 -168 187 138 25 -245 173 -58 173 36 -91 18
4661 18 74 -352 6 -20 -78 -58 -107 -90 -101 -54 120 -57 -15 167 202 328 36 11 -113 -1 19 203 -169 -88 180
4686 180 -99 223 77 237 209 -116 161 -341 -279 -216 -46 150 -98 -111 -136 189 77 -16 -20 -206 -276 -280 -167 -273
4710 -273 -15 -63 7 81 288 -99 -172 -147 289 98 -126 12 -244 -37 -177 29 -39 33 131 225 -118 87 51
4733 51 -215 -77 269 131 -47 124 -95 -90 51 -46 2 -53 -50 151 106 -144 80 -115 19 36 -137 -90 113 -344
4757 -344 191 -171 153 139 2 149 -186 13 91 -18 19 -5 98 250 189 96 -85 -376 128 13 -46 54
4779 54 284 -36 310 37 -80 110 169 199 -102 -154 -33 -73 46 -37 115 41 113 44 21 44 202 278 -293 -22
4803 -22 -153 25 159 228 88 227 175 -203 117 -77 244 43 167 14 -108 79 -163 193 230 -20 -196
4824 -196 91 290 -40 -48 274 -149 -61 -38 43 -47 39 45 -315 -81 32 -10 -91 -75 293 129 181 130 -245 12 -71
4849 -71 -137 269 197 17 -15 -73 185 222 -115 203 -69 -139 -85 -85 59 7 -31 -107 161 21 47 98 -92 79 -2
4874 -2 91 9 -44 -268 -138 44 -48 120 -118 72 97 -60 -40 178 63 -58 -79 -262 156 141 -14 181 0
4897 0 114 4 -18 -239 -59 140 -65 251 106 -74 -137 74 -81 204 133 136 219 -319 52 160 62 -20 354
4920 354 -106 -212 -27 86 -26 130 -89 3 -253 156 -1 25 -161 -73 -47 41 -1 -84 -109 -184 -19 7 31 56
4944 56 -92 119 205 -211 22 -171 -133 1 107 91 -190 124 59 -51 65 -67 12 105 -161 91 -35 -99 -227
4967 -227 46 4 132 219 70 2 -323 1 -64 121 -137 -61 -41 23 28 -42 -135 -31 38 -188 37 207 -37 79
4991 79 197 -94 98 -33 -84 92 27 -45 81 163 -169 173 160 -137 33 -18 -10 16 236 -201 146 -32 -135
5014 -135 188 -116 -262 17 -181 -81 4 -139 185 13 53 -214 -345 -135 -148 91 88 -277 -42 143 -75 -204
5036 -204 63 190 37 29 112 -164 51 -95 101 231 -307 -107 130 -199 -110 -245 -170 -58 -270 16 112 86
5058 86 -121 -297 -166 -100 122 181 117 287 188 183 248 -128 47 -8 13 118 223 -79 -75 151 73 -1 322 59 38
5083 38 -63 55 19 -47 1 139 -127 -454 94 -208 -28 134 216 -72 66 -35 140 -109 -60 48 -195 -78
5105 -78 -37 67 -245 -414 102 5 -176 -98 -85 -84 320 -169 126 46 -11 147 -146 -39 -181 -54 10 -67 46 -44
5129 -44 -290 -72 -270 -393 -4 31 37 -196 -167 -9 86 383 51 141 17 -220 18 44 -230 38 -253 -108 24
5152 24 -172 83 258 10 -12 116 269 224 -12 -62 17 -93 -165 -66 -263 -148 61 -224 -144 -2 -163 -77 -76 -66
5176 -66 -186 -164 -2 36 112 -22 46 -175 -13 -187 137 103 7 -45 54 -51 -274 -82 -247 -66 30 -39 -70 96
5200 96 91 105 -422 -61 -189 -78 -356 97 -123 -166 26 55 146 -256 -403 -4 421 -47 144 -85 3 -141 181
5223 181 -162 138 234 4 54 154 177 204 -184 -99 -17 -35 -7 75 -126 131 30 -86 69 -90 -197 -265 -68
5246 -68 -133 -18 -54 13 15 -151 -68 -11 33 -169 -80 2 -36 11 146 22 112 -4 -88 -95 31 255 -191 45 4 129
5272 129 142 -164 -116 -147 46 34 -21 -146 0 275 131 -34 36 -176 -150 103 -31 45 37 36 -133 -64 -13 95 -142
5297 -142 91 109 39 -9 -83 -96 -209 -303 -61 -163 -244 -287 112 -32 16 190 -28 68 19 -7 -123 193 59 -205
5321 -205 -169 -240 84 118 37 166 53 204 71 -81 1 -72 52 144 -148 -155 -197 191 -7 -85 -61 47 -140 -84
5345 -84 -201 -283 -122 419 178 7 157 160 15 227 -40 220 -59 -166 33 -83 5 -167 -140 -21 324 -131
5367 -131 -235 -12 -196 -89 -55 36 -6 296 165 -130 -155 -105 -4 -72 124 152 -42 108 145 -118 -115 -79 -49 -55 -258
5392 -258 96 10 -28 -233 97 138 58 -128 -268 92 -298 -80 -116 114 109 -243 -271 70 -45 -74 -166 -86 -147 106
5416 106 -12 154 -34 86 -66 -59 19 -37 99 -257 -258 77 -158 -64 140 5 -79 -91 -23 -168 163 252 72 -146
5440 -146 -73 -16 15 118 -53 -26 -111 65 168 91 -15 136 260 12 156 -226 -151 157 -41 -246 -30 23 92
5463 92 -32 -118 35 -243 1 15 149 -14 -66 170 293 -281 167 -155 146 108 141 78 -231 -152 252 356 -143
5486 -143 31 67 157 -120 -29 134 -38 170 90 -18 18 -293 25 -161 -18 433 96 -147 130 -77 132 92
5508 92 -84 73 83 70 -23 -78 9 171 151 -72 150 36 -55 30 92 117 -247 166 -6 96 -102 146 -81 -281
5532 -281 166 126 36 -184 89 12 -33 135 -29 -97 168 -115 70 194 -9 199 114 -8 -30 178 321 -77
5554 -77 -59 264 -181 -202 172 -134 -54 -231 -173 115 207 -42 -278 237 -29 153 -131 153 54 263 168 -66 -42
5577 -42 71 14 184 -203 -181 6 -99 -243 -232 31 -106 -135 -115 135 7 21 45 -81 -56 -269 187 189 58 150
5601 150 -151 178 286 -294 -217 -175 -117 -133 117 76 299 -3 -18 -157 267 -87 183 -22 -302 30 65 142 153
5624 153 21 -173 258 116 -108 -31 95 132 109 -24 -74 121 84 70 27 239 -137 -188 -8 70 289 107 11
5647 11 45 -9 -12 206 42 -104 -7 96 -262 106 67 81 -20 -137 -98 72 147 -51 68 80 -40 -362 107 -352
5671 -352 91 -332 154 49 8 262 116 -173 -106 13 31 -53 -4 14 -61 251 -89 -26 -115 172 -257 16 88
5694 88 -178 -279 -5 30 -1 61 34 46 -128 -34 240 -45 -66 49 38 -25 -142 -219 -122 -270 78 107 -78 -155 -60
5719 -60 -119 -37 -83 -14 -78 -213 13 -20 41 -53 170 197 -223 144 111 -11 79 -60 -111 4 76 -244 -56 108 270
5744 270 191 -1 169 -112 -175 -160 224 -35 43 96 153 58 -29 25 -133 130 15 109 142 -32 104 120 -68 -89
5768 -89 69 31 -48 -61 67 33 137 -87 -17 152 13 -122 -199 -9 78 -154 246 32 138 176 -186 -51 48
5791 48 -84 29 189 -140 14 68 -244 -182 144 -93 228 44 -80 39 -62 177 110 172 -67 -30 133 -66
5813 -66 -190 274 239 -181 -132 28 -148 2 93 20 -40 70 243 89 -87 -41 124 101 -99 -1 -70 52 125 81
5837 81 -119 -96 -51 285 -68 -336 -6 -49 169 122 43 -16 447 98 78 -18 176 106 -59 -73 28 187 -254 -269
5861 -269 110 -151 -161 -3 -17 -25 77 165 -19 54 -210 251 67 -225 -137 86 57 341 -228 137 -195 137 89
5884 89 84 -119 -157 91 175 113 113 205 -201 48 69 69 6 45 -267 115 88 -20 -110 292 205 110 257 231 23 -233
5910 -233 -21 120 -79 -275 -42 -60 40 -46 20 220 26 180 152 -118 -101 45 -104 -451 -21 -54 279 122
5932 122 -69 82 -137 39 -155 -15 68 -283 -32 166 -211 -178 147 13 23 -163 128 92 -150 -72 -25 84
5954 84 -27 209 11 157 24 -170 -13 111 -6 -44 253 118 70 222 -10 81 137 150 126 -265 10 201
5976 201 85 19 -14 66 -297 -177 -39 -66 -3 -89 16 -47 -27 -27 174 3 51 28 -151 -21 25 7 -35 -6 -12 165
6002 165 87 206 -107 -10 -288 -176 134 211 11 -9 288 84 -37 67 138 -58 127 89 256 -85 -140 325
6024 325 -136 49 11 -137 27 -166 -100 -120 -27 299 68 -21 -127 11 -226 192 -93 17 -131 110 -89 -228
6046 -228 30 210 175 -107 -75 -148 -101 91 397 -59 -106 -40 93 -328 -11 -32 186 -18 112 -106 91 -428
6068 -428 -31 -148 -173 155 72 -10 42 -42 -284 -188 -205 12 9 65 16 -176 -339 -2 199 201 83 -77 23 142
6092 142 2 -103 -11 -175 387 -164 -62 -105 111 -216 -58 -288 -101 54 192 -138 -170 224 -147 -266 -283
6113 -283 -74 21 170 4 36 -60 170 188 -146 130 -389 -19 215 -140 -56 -29 -57 1 -23 -30 60 -72 104 -134
6137 -134 0 74 97 91 130 36 -54 -164 -51 310 -108 238 -225 -27 7 -147 129 -134 83 116 -192 129 106
6160 106 -57 -288 73 -307 -118 -162 -69 47 178 -25 -19 -60 84 19 -122 60 -107 -152 -112 194 42 194 -210
6183 -210 133 -212 -72 -274 -106 106 -169 52 -69 -33 -59 -133 -34 30 -52 14 -55 40 -25 306 76 53 295 -214
6207 -214 -110 -306 81 8 -60 7 -107 -145 270 -176 -43 -178 -128 25 -162 -33 -20 -87 130 -73 -210 15
6229 15 101 131 -9 128 122 328 121 -95 3 189 -30 -106 -64 118 134 -55 222 1 -41 -64 -261 11 39 -83
6253 -83 -175 -184 -174 78 115 -198 -85 140 -275 70 286 16 -39 178 202 53 73 260 85 142 71 -188 -235 281
6277 281 -35 -120 86 135 222 -213 -90 -231 -48 79 -51 -169 -318 -200 -51 78 45 136 -231 6 -50 0
6299 0 -101 -240 -22 39 111 174 -185 202 105 113 7 -93 196 -249 -19 93 -15 -178 214 -25 -162 12 -168
6322 -168 -8 -127 143 30 -267 78 -74 -19 -56 -47 -78 8 -69 31 -5 -223 -35 -32 33 -125 -26 -203 192 -53
6346 -53 -22 150 -136 -100 -215 -78 83 109 124 -107 -68 -92 -215 -67 -153 -53 -37 90 -109 -95 -1 -14 294 29
6370 29 -101 -57 -62 -126 -228 214 54 -214 -114 -161 279 32 -105 -116 -1 -42 -57 93 -59 118 118 -229 -11 170
6394 170 54 15 -108 21 102 -165 87 14 -8 -142 -35 -182 3 0 73 -60 203 52 -209 -122 123 -130 -409
6417 -409 11 -80 -217 166 -19 -32 250 73 -35 140 238 -12 -4 -4 -163 41 16 -28 98 204 14 -108 222
6440 222 80 243 -144 44 7 -47 -62 149 51 152 -193 9 25 31 89 -93 -286 28 121 40 112 181 -331 -117
6464 -117 -1 243 213 -101 154 -76 -33 -64 51 -88 -1 -77 -10 19 -54 38 -54 -118 -29 157 -110 206 162 -213
6488 -213 73 -20 101 -106 79 108 170 -121 33 109 -215 -92 338 40 56 -87 241 103 135 369 -143 -29
6510 -29 -6 157 -15 86 -137 -280 -12 131 -1 -82 238 -219 -108 -355 -223 32 -15 -38 -148 225 -13 94
6532 94 29 -4 -35 -132 65 103 -357 270 61 -15 -213 -295 -5 -236 33 52 74 -216 -4 326 11 185 -142
6555 -142 -180 142 -126 -133 -277 -45 171 -207 -98 -118 185 -26 58 103 -342 -190 -297 371 145 181 81 58 30
6578 30 -67 -139 -33 72 52 36 257 59 -178 -243 85 -58 -40 -15 -185 -17 -116 -8 22 -91 -75 189 -115 50
6602 50 -110 84 -85 -10 54 111 154 -123 -114 80 225 -65 -56 -142 -166 -45 60 -47 -40 -37 -20 61 21 2 -345 -192
6628 -192 -81 71 -194 75 -160 -327 -36 -71 -49 103 25 -104 -26 46 61 -23 6 79 76 54 -11 -146 -149 41 -108
6653 -108 -312 -162 4 163 219 84 80 119 -102 -226 78 124 392 -130 82 134 82 6 -144 -170 -273 56 -25
6676 -25 -191 -82 184 -104 97 -190 -95 81 -48 157 47 163 -58 329 -357 -33 -145 15 -19 198 0
6697 0 35 185 120 161 36 68 -27 -97 190 336 47 -88 50 447 82 302 46 -163 133 -3 134 -51 -5
6720 -5 28 64 13 -169 -84 66 -4 -61 70 -46 -20 61 -357 35 149 67 -85 227 -133 160 95 -182 -96 218
6744 218 -13 -94 7 8 105 186 -91 -127 139 279 156 -52 -379 229 -59 41 232 7 -47 3 -235 -13 -176
6767 -176 126 101 87 61 -173 -221 11 51 -48 38 -190 85 -86 -27 169 372 -256 -165 86 92 39 108 40 -15 -22 226
6793 226 -217 72 -110 8 175 26 138 -337 -197 -224 72 -144 171 -82 78 18 278 -37 -229 340 238
6814 238 -251 -215 -167 179 273 -233 -10 166 -230 -58 82 59 153 -69 -1 -147 -149 417 43 79 -39 4 194
6837 194 192 47 -97 -95 -270 139 -33 -46 -191 -29 210 -220 -33 -61 177 -83 146 -214 -62 66 151 146 103
6860 103 163 257 -140 35 -93 -202 85 -52 -6 -41 126 147 -1 194 -55 -86 -249 -93 12 32 -38 141 36
6883 36 0 44 16 -46 -14 38 -21 44 -79 124 -141 -64 157 229 333 -82 -301 -246 -8 -42 -232 62 -224 208
6907 208 5 -149 129 40 159 -162 29 139 188 -15 -44 35 -185 -97 -333 104 -115 74 258 128 271 190
6929 190 17 -91 -80 -198 -71 -52 -43 21 -108 149 -124 209 -138 71 -26 187 73 17 125 559 -60 -47 64
6952 64 -81 207 -11 89 -126 321 20 -39 267 173 -225 -61 -529 187 131 -123 115 -61 109 87 28 -233
6974 -233 42 -38 -143 -284 -120 182 148 -232 40 -62 -197 56 -65 -266 79 -132 -113 102 50 39 -183 44
6996 44 249 -91 -96 31 -105 102 -139 -501 102 -29 -105 141 -58 214 82 36 96 -80 97 -71 29 -175
7018 -175 96 -72 44 -390 19 102 -50 -106 -46 66 70 46 -140 -28 32 156 -282 131 -41 179 -86 -382
7040 -382 5 96 189 174 73 150 -169 9 -161 26 286 -19 63 -32 -2 -156 257 142 -250 139 -118 74
7062 74 27 56 -2 11 57 353 -93 11 171 -56 30 -113 55 279 184 -122 19 -111 20 -163 105 -176 -53
7085 -53 183 -50 -29 -271 -249 130 -46 -77 -145 -106 -221 155 71 55 30 -124 -25 -200 32 282 4 84 176 -36
7109 -36 -88 -18 -16 30 -158 180 2 -274 -92 -93 170 79 73 -21 15 -182 -96 8 149 -94 -98 -64 173 -191 363 15
7135 15 12 -69 -356 6 81 -162 -59 89 77 79 -59 80 57 -126 289 -42 -67 68 365 -436 194 -26 168
7158 168 -167 116 303 -236 -12 -157 -24 -86 -168 -144 141 50 -100 -66 -255 -85 60 -78 -17 119 146 -94
7180 -94 288 -45 139 60 258 -28 466 -5 -121 -42 17 60 307 -81 -53 10 57 97 -37 226 425 144 -37
7203 -37 -105 -117 250 -24 -181 41 -102 -266 180 233 -87 -106 61 125 -108 -137 94 -21 -48 -220 108 -10 38
7226 38 347 292 -220 134 245 50 -43 28 61 172 -29 -176 32 -189 -16 -26 -34 27 -48 -24 78 35 -68 -9
7250 -9 -74 -224 -26 26 111 164 30 110 110 -216 52 -200 -105 74 -75 -37 109 90 163 -160 88 23 173 135 -61
7275 -61 47 -232 -77 422 8 -23 16 297 125 97 -79 -93 202 146 -27 -90 -86 -429 -4 -46 -236 -280 -92 -295
7299 -295 13 68 -289 -182 -290 179 -55 -261 -147 -8 -98 143 65 -46 66 -162 -139 -172 -174 -134 -139 90 28 -67
7323 -67 218 19 -139 122 -23 207 -241 -142 -309 178 30 25 -91 -16 163 213 -59 17 128 -117 207 64
7345 64 102 -71 5 62 -88 190 -64 45 86 -300 -117 280 -100 -50 -116 -47 80 -34 -247 72 97 36 -53 -82
7369 -82 286 -43 -230 -329 -66 -100 -16 -186 55 69 -119 -247 127 -90 -29 -144 -130 -66 217 263 -135 -106 124
7392 124 -198 21 -118 -10 -299 52 103 -91 -12 -125 -181 -43 -61 108 -62 -116 291 -28 19 100 -25 -128
7414 -128 -151 -141 -56 -24 -118 -35 -50 127 76 -128 107 -25 50 -156 -22 -42 -43 -30 114 85 22 -254 -2 -44 80
7439 80 84 -300 -127 -177 28 216 -75 -189 48 115 -103 -67 -115 -274 271 221 -88 22 -206 -198 71 151 35 195
7463 195 -60 -66 -218 231 -226 206 -62 -88 24 -41 134 -103 150 371 13 -30 -66 171 35 -96 -427 -41
7485 -41 -276 -128 35 136 200 45 151 31 173 9 27 114 42 -205 108 -104 154 0 33 -150 -7 -70
7507 -70 149 -50 -72 -33 245 4 -198 102 -219 -303 287 -85 -153 9 224 95 -66 57 -17 178 -74 -49
7529 -49 -43 -109 19 32 -111 165 211 44 -167 -24 18 256 31 16 -126 65 -67 83 28 87 68 107 66 -106
7553 -106 40 -122 324 -97 74 -104 24 -2 -400 209 49 -12 179 13 23 75 -27 69 133 -151 242 282
7575 282 -89 -85 -275 83 17 48 -115 77 134 160 -31 -92 248 -175 -61 -96 48 102 -196 152 -13 173 -13
7598 -13 22 -153 102 -163 -106 -154 123 -122 24 38 -89 -154 -208 364 64 -34 -207 113 -47 -114 -147 -353 223
7621 223 -78 82 -29 88 -288 -270 31 129 118 -167 -79 -137 -101 -48 -210 142 70 -181 326 -117 -30 -16 -162
7644 -162 28 -109 -57 46 66 -64 41 191 70 -142 94 157 19 65 36 -60 -81 190 16 -82 -190 71 45
7667 45 -205 56 47 -38 332 115 76 -38 -39 182 -116 -130 170 -84 -67 43 -33 -50 -89 189 106 38 -212 43 24
7692 24 120 6 -9 -46 150 24 -272 -2 -29 -118 -186 61 291 197 -24 99 -73 125 -141 46 216 51 164
7715 164 140 -123 -22 -244 -25 -182 212 43 148 -70 -30 -19 -31 -49 -288 20 30 118 132 19 18 -51 -78 -128
7739 -128 105 9 -227 -26 -257 136 380 -214 47 205 -146 -31 -55 20 -69 283 92 -19 82 -38 190
7760 190 -26 197 -87 204 157 -133 -34 43 -65 179 -139 -159 143 146 -156 -191 67 -150 -118 -171 -91 -116 99 -235
7784 -235 135 40 -220 28 -200 -121 41 -42 79 12 -192 -40 -5 95 -87 -187 198 0 198 194 213 -55 -222
7807 -222 -24 18 59 39 73 -284 -238 235 185 4 124 -151 12 0 126 -16 -22 -74 -211 -131 203 -51 227 -90
7831 -90 -89 33 -38 -118 -337 -39 -264 208 -278 -180 142 -23 -230 19 31 -65 -58 7 101 -102 19 -69 -41 -46 -174
7856 -174 185 18 -4 -202 -283 -107 143 -134 100 61 -17 69 143 22 -160 129 32 -144 67 -129 26 -3 -147
7879 -147 -107 44 135 341 -4 -124 222 -294 136 55 12 -215 144 -7 -143 -41 -80 -66 134 9 -129 -122 -209
7902 -209 62 270 359 -161 303 -100 59 86 -35 41 -24 19 -118 -220 191 -289 -14 -125 -158 -66 -2 80 -130
7925 -130 -22 150 76 -165 -180 264 207 -101 114 95 -13 118 -34 -27 -63 310 30 -89 112 -80 -20 -147 84
7948 84 257 20 75 86 72 29 -35 209 12 -150 -196 142 -123 -169 -96 102 -73 -6 196 -178 -71 216 -115
7971 -115 22 194 240 -45 -180 -114 -165 -170 59 -145 140 -3 -231 -100 29 -245 -273 111 227 -19 -125 314
7993 314 -213 99 -278 150 133 149 33 -40 43 -253 38 -22 -20 -2 105 74 -18 159 217 56 13 7 74 -115 50
8018 50 -125 69 -166 -141 -16 217 51 -277 265 232 239 104 87 65 134 248 -51 -33 67 92 284 183 158 -60
8042 -60 50 167 129 103 26 43 -31 16 192 -75 -91 -236 -92 163 62 -60 90 -93 212 102 158 111 -307
8065 -307 -89 -364 -226 74 -67 93 110 -173 -55 180 305 -70 -178 -8 167 -6 179 144 -212 186 -95
8086 -95 80 -25 -132 -35 60 -230 -72 -49 121 -115 -43 -220 103 258 154 55 205 -148 85 -262 -133 -9
8108 -9 -38 200 136 52 8 51 -53 -181 147 -74 -41 27 204 -122 45 114 99 -192 -101 -115 -68 125 308 157 -12
8133 -12 -19 202 -105 -104 -15 -68 -105 -157 -249 -150 30 103 -88 -124 194 54 57 17 -36 48 191 30 -191 -356 -178 150
8159 150 -185 -66 -53 -220 -28 66 -191 -121 98 -52 -174 -14 232 186 -215 346 -7 51 87 -320 -135 -211
8181 -211 293 -208 -201 -137 159 -36 -10 -289 55 20
8191B0
$$ Imaginary data points
##PAGE= N=2
##DATA TABLE= (X++(I..I)), XYDATA
0 0 0 0 0 0 0 0 0 0 0 -8 8 -8 8 -16 16 -24 32 -37 43 -56 64 -78 91 -109 128 -149 174 -200 230 -267 303 -348
32 -348 395 -449 505 -569 641 -719 806 -897 1000 -1112 1235 -1367 1513 -1673 1847 -2035
48 -2035 2245 -2473 2725 -3001 3309 -3651 4029 -4458 4947 -5501 6148 -6904 7807 -8906
62 -8906 10282 -12060 14459 -17898 23282 -33027 56580 -247670 -165466 61463 39214 95022
74 95022 -138237 -75168 27651 68493 29038 -56246 -62657 68069 45405 6015 -37389 -35985
86 -35985 49687 68980 -16363 -29222 -13486 38691 45311 -3966 -26387 4150 42725 43603 -24859
99 -24859 -36597 18116 42309 22563 -14188 -27523 15858 30104 8676 -16378 -22438 17265
111 17265 31174 -6282 -24816 -15229 15283 27555 -8007 -29465 -7374 11619 11827 -10681 -28856
124 -28856 -3803 16532 6358 -13298 -25730 -7073 16480 7704 -16569 -20027 -1213 12208
136 12208 3983 -15319 -14857 3683 12240 2090 -14108 -11736 6893 13032 -727 -11152 -5312
149 -5312 7106 11079 -2572 -11047 -1009 9239 9693 -2795 -8843 813 8585 7282 -1551 -6273
163 -6273 1124 8406 3841 -2966 -3632 2279 7503 2121 -4035 -2828 2388 6061 1466 -3932 -1329
178 -1329 2969 3938 165 -3677 -1474 3383 2985 -1022 -3679 -2057 2780 2410 -1315 -3037 -1831 1924
194 1924 1704 -1512 -2777 -1459 1511 1068 -1314 -2130 -456 1002 1167 -1025 -1838 -349 852 1075 -506
211 -506 -1283 -65 745 884 -121 -1375 61 1236 1061 163 -789 -248 991 1001 344 -841 -800 1260
229 1260 1253 -51 -976 -863 512 858 -382 -1120 -390 330 619 -296 -1161 -379 456 332 -375 -1127 173
248 173 546 174 -1215 -1138 93 1025 58 -1308 -1250 172 875 16 -1232 -827 469 1260 -138 -1468
266 -1468 -542 1159 1449 56 -1205 -340 1217 1342 -325 -1028 -14 1763 977 -626 -867 -40 1512
283 1512 1191 -485 -1350 133 1508 658 -466 -1077 127 991 313 -819 -885 224 888 119 -675 -625
301 -625 131 475 -260 -933 -354 673 530 -476 -901 -530 581 594 -388 -891 -71 413 648 -421 -573
320 -573 398 475 342 -546 -725 166 358 272 -149 -444 69 408 225 -60 -280 31 474 141 -306 -124 19
341 19 382 201 -378 -390 144 454 81 -136 -2 182 79 178 -163 -131 -36 418 69 -262 -190 207 144 -160 -466
364 -466 152 259 45 94 -435 -495 20 455 185 -228 -317 -69 355 400 -12 -231 -263 235 135 -188 -212 29
386 29 374 27 70 -24 43 224 238 9 72 216 -23 5 -178 116 -304 285 178 -175 -53 196 114 37 43 -151
410 -151 246 -20 -143 -154 -15 503 90 -157 -186 20 -93 -18 -183 -289 165 169 26 -362 -45 17 -121 -21
432 -21 -257 -348 123 -104 183 -13 17 141 229 27 -185 -164 95 433 -199 -36 92 152 31 49 -118 -127 173
455 173 312 -106 -296 -56 -180 -91 -245 94 164 -91 -141 -243 6 211 119 -75 -5 43 -241 -156 -116 -131 -39 -104
479 -104 194 -32 -289 19 293 99 86 -117 85 33 -97 -312 54 157 118 170 181 -49 138 283 133 -235
501 -235 -15 144 -60 200 -189 138 -199 231 106 64 161 -110 -144 369 -240 28 -121 -97 -210 136 -130 -182
523 -182 139 -127 65 -80 124 334 78 -143 213 78 76 75 -182 -151 102 469 -253 21 -163 -252 -131 19
545 19 -153 137 143 -29 57 75 -136 -90 -70 145 -72 -88 222 51 -83 -75 -73 219 -102 11 268 100 -16 -19 28
570 28 -7 120 88 -54 54 144 95 -184 -85 -133 139 -152 218 90 -197 -100 81 14 235 5 -323 380 -57
593 -57 4 -29 -39 116 -118 -186 -100 106 164 -110 159 -234 115 -27 143 -159 -76 -112 -107 -53 -145 181 372 -167 213
618 213 -116 -27 -21 133 -13 -66 127 99 79 -180 205 88 -232 -95 137 39 55 175 127 76 -110 140 -18 70
642 70 22 -70 -203 164 181 -198 112 143 87 94 247 -5 -71 212 131 -85 -307 199 85 131 -71 -2 -38 -20 191
667 191 -181 -11 -141 -47 262 -87 104 -24 151 -127 119 58 -72 -28 195 77 -227 -57 191 99 -113 13
689 13 -157 -265 30 5 -192 5 162 43 48 35 48 -179 9 166 118 218 258 -87 385 -77 332 23 108
712 108 -27 97 9 64 -33 113 -44 -163 86 48 -4 -98 57 11 183 219 -17 65 159 -89 181 -203 -50 161
736 161 -51 -41 38 -34 -45 -63 -177 -98 102 55 287 -115 -80 18 -110 -93 129 -113 -178 -200 -215 -72 34 143 97
761 97 -277 192 -299 -186 -24 -32 -25 -151 -20 -20 -25 61 -9 -218 -16 155 198 155 124 -39 0 -64 274 -1 230 -210
787 -210 157 -102 -154 105 97 111 -33 50 38 114 -6 274 148 -322 -91 -92 -27 -154 -107 394 1 -9 41 74 -98
812 -98 -239 -85 0 281 244 -199 -25 1 -216 163 52 167 62 58 128 -213 65 -63 119 205 -13 145 -201
835 -201 68 -114 10 -87 33 342 101 199 96 -156 21 -71 -40 -45 -106 -14 -112 70 352 118 28 172 68 -68
859 -68 -296 -15 -212 128 -151 -37 -173 -28 51 85 -210 -117 43 68 -5 -129 -246 80 -148 -162 209 -13 -61
882 -61 57 51 -111 -90 120 -66 5 -159 60 271 -167 -386 -68 -27 -180 -227 74 317 108 -313 -138 20 -237
905 -237 -79 36 -64 139 145 76 -38 42 36 138 -75 -91 1 -106 -299 298 79 146 -34 -82 -8 -129 55 -202
929 -202 120 4 -290 34 -439 225 -84 6 69 -198 -59 -125 -36 275 -122 -42 -218 249 169 -105 -88 -34 25
952 25 64 113 -179 53 -7 -125 125 96 95 121 34 142 -86 306 100 91 -20 104 -39 29 -8 -261 -68 157 7
977 7 -196 12 -348 97 31 46 -197 33 174 127 93 -7 67 53 222 -37 260 -244 -169 139 -100 85 60 30
1001 30 138 -78 -298 -32 -222 176 -249 109 182 -83 -17 -65 89 119 270 -7 130 -322 284 60 69 -298
1023 -298 -17 47 -137 -21 43 138 31 -105 -206 -88 -130 -103 -158 -5 129 -89 -74 173 -54 -37 204 -58 269
1046 269 119 156 103 -29 -22 213 -261 -180 81 110 73 121 -42 -51 -44 -210 -161 175 85 126 140 -122 176 51 79 168
1072 168 -6 -53 -313 -25 81 235 79 -80 69 1 270 171 -181 -3 -189 91 -86 33 -92 -189 155
1093 155 -36 28 -66 69 167 141 -24 -168 -54 -38 26 33 109 -18 -17 58 189 -163 -119 64 -197 -59 143 1
1117 1 57 64 -41 182 -154 5 157 96 -65 170 -132 -165 42 54 -97 -127 254 138 30 119 -7 -31 -119 2
1141 2 277 -121 -1 74 64 -73 160 199 -101 23 10 79 152 295 -181 70 225 62 109 -231 62 236 216
1164 216 280 -83 -61 -117 232 108 65 -84 -41 18 -234 -102 -247 132 -84 218 -66 106 24 289 251 -87 -337
1187 -337 -96 136 60 -298 144 -213 92 75 124 83 -265 -233 305 275 117 70 -209 239 11 -229 204 103
1209 103 -50 -153 -267 -150 -131 36 213 -16 56 -92 25 -164 -142 -119 -139 155 216 -27 -185 151 -21 -210
1231 -210 -101 -33 -43 -48 194 -387 -169 94 -197 -79 -68 -118 55 67 184 -180 -105 -106 34 142 109 255 -1 -126
1255 -126 64 5 -206 207 -211 -197 215 -101 -265 295 75 116 -57 -198 -22 -33 -29 187 249 -163 101 174 -10
1278 -10 -189 -61 103 -279 -103 -17 14 23 -4 174 168 194 227 -155 -128 -172 -70 119 -64 131 -350 184 -245 -61
1302 -61 125 -89 158 -164 6 -123 158 -52 287 92 29 151 -90 -148 -31 -83 43 61 223 -161 9 -63
1324 -63 -26 -243 172 234 -51 -223 -164 -20 277 200 23 -220 -92 -38 167 31 -111 99 89 -177 54 9 -212
1347 -212 99 -14 269 -22 383 -104 58 -195 69 -87 -63 -29 221 162 -84 70 -241 22 -97 -133 69
1368 69 24 -155 -9 180 -157 251 27 -73 89 -121 -317 11 -152 -85 75 11 298 -15 169 75 -74 -119
1390 -119 -124 -52 -354 39 154 122 -143 -61 41 274 -262 -43 62 88 -31 -77 216 202 -52 76 22 -30 23 44
1414 44 -86 -96 85 282 -41 -105 -30 340 -83 -5 84 3 174 23 204 -110 -79 282 266 79 -49 134 60
1437 60 53 -116 16 260 168 -152 -278 99 62 249 86 46 -210 -132 264 -463 139 -127 -12 261 125 100 -184
1460 -184 360 -109 -36 111 -126 -359 -82 -43 -78 48 32 267 134 102 71 -343 -127 34 83 52 -71 22 -40
1483 -40 -167 134 -99 242 -26 -158 159 -207 25 171 169 -142 345 88 242 -281 -67 83 -59 -173 -527
1504 -527 -14 253 -217 -48 10 222 -135 159 222 -76 215 -124 -88 21 1 -117 -153 -63 351 -198 -126 272
1526 272 111 -42 -144 108 -159 13 -6 -136 129 -124 102 -58 65 -13 -73 -40 70 20 86 -106 97 -335
1548 -335 218 76 50 121 -12 -224 262 93 62 -64 53 -93 -108 189 315 117 -255 86 -63 243 -119
1569 -119 -10 45 -124 32 -127 85 -47 180 42 8 -64 304 29 33 -70 -17 -158 -166 214 -110 -44 -20 55 19
1593 19 -148 -208 112 75 145 22 -120 -103 -142 -168 -44 -113 -7 -5 31 76 -134 -251 0 118 227 -95 -83 -187
1617 -187 -10 31 -50 -77 165 -161 258 -170 -45 -122 -32 -108 51 84 129 71 64 12 125 -39 154 -11 42 97 17
1642 17 -161 60 240 61 -123 -3 -2 34 -94 0 -2 -82 6 -111 103 -248 -7 31 -89 9 -334 225 -227 159
1666 159 179 -48 -28 -48 295 -71 30 -203 23 182 -35 30 15 313 163 40 -115 -12 -2 -191 37 -17
1688 -17 -23 58 -37 -26 -77 51 338 -174 197 -116 -90 107 -99 6 -156 123 31 -77 -120 144 -45 -94 -103 21
1712 21 -85 147 -300 137 36 183 104 -190 327 -101 -134 73 -23 -169 39 204 -72 -502 -144 -193 -6 -186
1734 -186 -94 -21 -189 83 73 77 30 -164 -103 -115 44 -31 -106 -161 -306 54 -113 -143 -186 27 94 139 122 205 171 161
1760 161 -38 235 -64 74 63 59 -228 -178 50 -24 -9 -225 -88 -153 -12 133 -92 -211 45 -68 -60 -141 180
1783 180 -78 73 -64 123 -2 -97 -84 319 -55 -50 19 24 370 148 -95 -114 -70 24 -150 16 -35 -28 -110 -136 325
1808 325 -221 52 93 -92 -105 109 332 116 -125 47 106 -66 -81 -230 -65 90 280 103 -180 -225 49 277
1830 277 35 40 -65 -231 -166 27 47 -79 -38 206 -193 44 8 53 289 24 -259 198 239 49 -175 -6 -121
1853 -121 -58 -198 -130 58 146 122 -302 9 105 -207 10 52 33 -37 -60 -227 -83 -333 -287 -63 -6 325 -74 -43
1877 -43 349 126 55 -56 -118 47 -45 90 -29 -45 -265 -18 -111 -50 -18 32 128 361 95 -28 100 -57 282
1900 282 -364 -89 -56 -94 79 -324 -34 129 -49 160 112 -31 150 -113 -65 25 9 182 317 17 113 59 103
1923 103 254 62 -40 -83 136 252 69 169 -75 13 22 96 25 80 -133 -31 39 29 261 14 -55 42 -56 -84
1947 -84 -18 184 93 45 -118 27 112 -127 -182 -12 12 45 -424 -105 -64 -94 41 -10 148 -25 -47 195 33 -261
1971 -261 189 82 -40 74 -31 29 139 23 102 -30 296 -157 120 -82 -200 -58 53 3 163 121 -28
1992 -28 56 8 -31 120 215 236 179 40 -241 -26 140 79 51 -73 9 1 -125 -36 -53 -40 130 -37 -199 122 -97
2017 -97 50 103 -101 40 101 134 -16 -102 30 -32 48 72 -1 210 116 32 -115 -216 63 56 -139 182 -219 -59
2041 -59 -148 -164 200 65 94 1 356 50 38 -394 -40 -125 174 86 40 140 42 65 32 -31 74 -11 84 -44 -137
2066 -137 -83 84 207 37 237 51 60 94 -103 56 -12 171 85 -71 218 -38 -175 -62 3 41 -43 15 -153
2089 -153 -44 -146 146 -15 39 -208 62 -47 80 144 113 152 15 35 44 -180 -192 -173 49 -127 -158 131 198 59
2113 59 -27 -38 80 72 -1 303 34 -15 -202 -29 -47 162 318 -100 -87 -169 -249 -10 149 -216 149 -113 -4 191
2137 191 -107 -67 -248 37 14 167 -92 -90 94 -380 108 16 4 -56 40 -46 89 -45 32 -280 -301 -95 135 -172
2161 -172 113 130 17 60 170 21 -208 -88 -112 113 179 -49 -285 172 -153 153 -140 133 271 -26 -166
2182 -166 -71 -87 -122 -180 273 -11 -90 -12 312 80 -192 -98 -9 -233 -314 -15 -132 -236 -94 23 -54 76 -42
2205 -42 28 -29 98 19 -55 -77 -123 99 272 72 81 80 -225 -217 -14 -3 -89 -77 -45 91 45 127 -88 72 45 -303 -136
2232 -136 -51 -116 -35 -183 335 -121 64 98 44 133 288 -5 114 13 2 -32 102 230 185 220 34 262 216 158
2256 158 -47 -245 -67 -13 -31 93 79 367 -147 265 117 19 109 80 239 -8 -20 -19 -160 79 254 10 100
2279 100 -162 465 -123 -76 -83 66 64 156 18 -261 -104 -16 229 -41 106 216 -43 -160 331 -491 103 -58
2301 -58 -245 -168 -131 68 -67 -359 -120 102 -96 24 30 249 -5 -415 -126 108 -71 34 -201 105 -115 -231
2323 -231 -105 146 -348 -85 -86 -94 -269 10 22 76 150 -36 -217 -244 132 166 -45 33 -289 107 -38 -177 37
2346 37 -160 -33 -248 -158 -120 -26 -69 196 -35 -8 65 44 -103 74 52 114 39 103 34 145 274 248 161 159 145 227
2372 227 11 -86 -44 222 43 -15 -20 -48 138 -131 -126 -45 -42 35 -317 -24 -244 -93 178 5 104 -111 -69 -207 90
2397 90 71 -124 171 210 -84 -100 81 273 3 -140 -17 -34 222 46 217 -74 137 134 -136 136 -71 -69 -12
2420 -12 -187 239 58 188 83 299 -61 -387 -91 -71 -213 108 135 250 -49 304 165 213 59 -169 125
2441 125 259 -185 115 234 -104 106 -2 -177 -73 352 -93 118 -28 -23 -388 185 81 -223 125 178 -248
2462 -248 -121 -22 24 -42 -78 -266 154 65 164 51 6 -22 -312 92 -62 147 187 29 142 64 -204 -86 198
2485 198 -76 -24 -183 -315 76 -53 -87 -330 7 -1 61 -300 28 -184 -42 125 -22 80 233 -30 106 -71
2507 -71 -280 -182 35 -207 122 -89 79 -218 -145 134 85 -102 -30 -3 -211 -51 -118 -37 -85 -74 -62 61 187 23
2531 23 141 -303 -112 -285 200 -248 -3 97 -159 -92 -207 -185 234 257 21 241 111 -30 180 290 33
2552 33 68 13 -73 -10 -126 30 -63 -12 -67 45 -30 123 120 -55 -30 -134 37 -506 158 35 41 3 -27 216 109
2577 109 32 35 53 -154 -42 18 83 -72 -149 -100 -4 105 -247 33 128 110 -53 143 33 -7 21 -78 71 283 -133
2602 -133 134 58 27 -2 151 -96 216 -117 86 -53 140 -228 196 -163 -46 184 5 -110 -57 -136 -270 -9
2624 -9 -136 -110 -97 23 241 84 -117 187 204 -128 127 -189 125 217 2 26 30 -8 -50 38 -5 107 -97 -210
2648 -210 10 199 65 -192 24 174 117 -80 67 50 -54 263 -52 109 150 10 62 -140 -160 80 -68 -410
2670 -410 -1 313 -22 41 -47 -5 -138 -76 11 274 -71 135 53 -244 -20 108 -183 43 26 -281 65 250
2692 250 -17 216 -91 50 -14 -93 -28 -59 -55 208 122 -100 174 197 59 -43 46 67 -147 369 -77 -78 -127 -50 224
2717 224 -188 -14 403 -101 -241 -73 -175 250 195 177 41 24 -182 222 -105 37 125 84 -134 72 10 168
2739 168 344 -52 -156 48 -104 56 54 237 -25 168 191 -100 -311 -156 144 -122 74 -38 -129 16 61 31
2761 31 131 49 -56 66 -52 160 -65 -140 -178 18 124 -67 111 -24 -139 105 -31 93 -97 61 164
2782 164 -104 24 -5 -12 83 132 201 248 -31 130 37 -248 194 -88 -132 -1 -118 -132 66 -51 -166 32 116 -24
2806 -24 -35 -161 16 167 -10 -107 -16 -276 -183 117 -281 31 -16 -54 332 -51 -11 187 -123 -46 -180 64 -75
2829 -75 56 33 7 244 -28 147 -12 -312 -168 -75 -15 154 -19 373 -61 -164 121 408 -179 125 -76 42
2851 42 -120 12 277 194 46 204 3 259 88 107 59 -278 174 201 -161 144 192 30 -32 -121 61 -97 -111
2874 -111 145 -44 17 66 -45 15 47 -65 -78 -113 -70 -10 3 38 -182 121 27 271 296 -23 -443 288 -89 171
2898 171 -229 136 110 133 180 142 137 123 5 -102 297 -101 -43 153 -110 -13 15 87 -55 -62 -34 -126 -94 -197 44
2923 44 -65 -95 -89 -124 -168 -130 94 -302 -108 179 165 -58 120 154 -36 105 -85 -54 -9 -28 -171 43 93 -186
2947 -186 223 -87 175 210 -48 74 -15 140 109 204 -99 198 219 -15 -165 -24 -186 157 -22 -40 -215 -157
2969 -157 176 -53 101 197 83 -187 134 -30 -20 134 -1 -134 -159 -82 63 -65 -23 -8 -45 -144 20 52 250
2992 250 201 179 61 -161 -95 66 -84 38 88 116 218 25 -44 -146 -80 -106 -22 -25 108 -86 -54 -48 -109 19 24 -252
3018 -252 -60 -67 -18 -21 89 -274 -223 45 39 73 -16 98 320 13 28 133 -98 -272 -131 -124 418 118 216 51 159
3043 159 -154 107 224 89 -9 -102 17 33 51 -83 -76 -17 22 16 18 -127 67 -99 15 -14 129 -166 -98 -38 -91
3068 -91 79 44 -91 134 41 -112 78 101 24 87 105 94 -45 -47 95 202 -82 79 -1 -137 11 -256 37 69
3092 69 -135 176 47 -207 -18 53 113 -32 -3 224 -124 55 13 37 13 -223 177 51 -3 -115 -177 -88 -13 -70
3116 -70 -190 -31 114 259 -94 134 0 146 19 31 87 -151 -9 -153 -111 178 291 70 -50 55 443
3137 443 1 13 145 92 -35 127 19 -203 0 -81 11 -13 148 183 281 138 -42 -573 -1 -50 -194 -186 -238 -31
3161 -31 -63 -64 -62 -25 -115 -211 33 176 -97 -177 -82 -17 -130 225 97 0 -10 90 -87 -102 -60 -57 197 227 -43 -28 198
3188 198 -78 -162 94 -122 129 -6 -227 53 143 260 65 70 170 158 33 21 -82 -216 -27 229 -8 -386
3210 -386 51 -73 -155 -73 -132 -154 -136 332 194 -98 108 67 116 17 -332 -7 -59 -78 63 -115 -170 222 335 219
3234 219 -35 -12 16 -96 -138 97 509 122 137 48 1 164 79 133 62 -68 -133 244 -265 -124 189 -159 102
3257 102 -56 -17 -5 -194 -295 80 61 200 149 -118 168 106 -27 -182 117 45 -32 -72 37 -196 -81 134 -63
3280 -63 64 -28 80 55 -122 -199 -239 -43 45 -133 -99 -73 -166 -60 64 205 179 -196 12 -92 -27 2 -186 -295
3304 -295 -149 -24 382 285 -23 -287 95 -107 -10 -100 -92 -130 -34 -308 -32 56 64 129 -68 -338 48 -227 131 1
3328 1 -53 58 323 -128 7 -37 -17 53 -189 -42 -4 50 227 -79 125 -31 -165 -24 -300 -81 -216 338 26
3351 26 145 -153 -76 13 92 29 -192 195 0 95 -221 56 26 59 -87 -18 -169 -104 16 -187 216 -129 -100 -180
3375 -180 163 -83 -124 -220 156 179 -13 106 -9 26 13 122 -285 167 142 -75 96 78 125 -80 -56 37 -131
3398 -131 -154 -48 -58 22 267 -249 -83 332 -59 -69 -138 -132 -9 -5 169 160 15 120 402 132 107 -146 16 62
3422 62 -10 27 -201 -166 -144 -144 4 -151 20 -119 -7 151 10 208 108 2 285 42 -79 135 115 -239 -75
3445 -75 -33 -8 208 -52 183 83 -368 -52 34 38 62 -16 -109 -171 -4 -118 78 19 14 -43 13 -40 36 -92 137 15
3471 15 153 -36 334 -43 -11 -59 -124 -131 -63 195 -81 32 6 -45 84 130 166 78 -206 -42 12 -15 410 21 -140
3496 -140 47 36 170 -294 180 289 -155 -203 64 -22 -176 41 -238 237 8 88 73 -49 290 -7 -119 48
3518 48 136 51 51 -81 -270 22 -250 -26 -44 -144 -84 93 -198 -6 73 105 -80 -115 -43 83 -197 -35 157 -234
3542 -234 35 -72 -121 95 299 40 88 76 -158 53 -203 40 161 41 -77 -24 146 481 -130 26 151
3563 151 -109 247 162 -135 -123 -45 -23 -37 74 -232 -275 -106 -126 -139 -103 63 77 -102 69 57 -63 38 58 -378
3587 -378 -92 156 -3 137 184 -58 44 -80 100 46 46 69 20 99 50 38 114 40 -21 -89 99 16 76 177 157
3612 157 62 85 155 -21 158 126 98 80 -13 -219 -165 -67 11 -186 117 27 8 117 -6 12 -46 145 -63 158 7
3637 7 -72 129 -54 133 82 -220 101 261 79 -106 269 149 -58 181 -123 -21 -91 375 -79 197 -75 -251
3659 -251 39 144 248 -85 -99 -140 -145 -28 -5 -38 -356 -25 -10 -113 107 2 126 -310 -136 -15 -45 101 -25
3682 -25 -107 196 193 -176 -112 -19 -374 -31 -2 100 -22 -10 63 20 80 121 197 263 219 132 247 -247 1 -4 53 119 201
3709 201 -78 -163 -113 169 -107 116 2 16 -80 134 -174 -164 87 -117 63 -10 -6 143 -181 160 28 -70 -246
3732 -246 -78 -68 -103 206 36 171 169 143 -8 45 -24 106 -72 -33 32 -202 101 -246 -214 -34 46 -283 -154 -27
3756 -27 -19 12 36 -3 107 -77 207 101 -212 298 -276 -57 155 -56 9 85 -71 -168 -91 138 -156 -8 61 173
3780 173 -25 199 15 -13 2 -23 461 75 -26 88 240 -256 -68 124 9 -8 -50 21 275 -235 68 92
3802 92 -168 201 10 101 -71 87 156 227 168 -102 -293 -180 30 42 34 -251 183 -68 162 45 -67 60 -10
3825 -10 -132 -1 52 20 -181 175 290 -79 -24 -79 -189 153 -142 81 196 -64 0 7 184 -95 -87 119 -8
3848 -8 172 327 96 -90 150 -166 -310 -40 -164 -155 -254 141 -101 -105 41 -62 34 -33 -98 -160 306 266 -23 -194
3872 -194 -160 20 -76 302 -162 262 34 153 78 22 206 131 -84 187 131 159 -76 -109 8 15 -118 -37 45 -61
3896 -61 2 116 249 23 -239 -2 -86 115 77 -273 61 179 -1 -33 19 83 45 132 -43 -315 9 129 -7
3919 -7 31 -20 53 380 12 -198 190 82 -85 -334 -154 116 95 47 -36 6 42 -74 -220 -205 83 156 319 -64
3943 -64 -155 370 50 0 92 65 60 -250 -40 -93 -30 368 16 -82 27 185 -119 -90 -46 -22 73 60 -136 -133 -61 147
3969 147 16 -270 -132 57 -36 188 70 -31 -119 -57 -91 49 -8 -80 36 93 161 -93 0 143 221 60 -127
3992 -127 -102 -89 -108 75 -114 209 68 193 -149 -31 22 211 5 -277 -101 -4 126 -59 -96 -83 -65 -208 11
4015 11 -40 0 -108 97 127 184 44 50 12 19 -178 51 322 138 152 49 -196 -61 142 -293 17 -20 -27 26 154
4040 154 21 35 35 208 31 -4 -168 -199 -4 -21 287 -51 340 61 47 167 -244 -259 78 139 -18 -232 -29
4063 -29 208 12 -7 213 294 98 68 -9 105 275 35 181 -116 239 -197 89 8 8 7 -221 51 -22 -93 105
4087 105 -46 32 108 -109 -189 159 -38 116 -135 95 -49 183 124 -234 131 151 8 127 166 52 -88 -13
4109 -13 -60 -162 -231 -110 103 -120 9 -149 -18 13 -244 -86 -119 -72 -30 129 265 0 -167 239 -84 -94 129
4132 129 227 311 45 -33 -111 46 66 24 -130 -35 -98 -48 44 -76 292 31 182 -132 38 54 -37 -149 -65 27 335
4157 335 86 -25 81 223 -151 78 -279 248 -167 -95 -116 -4 -75 7 80 -26 145 -127 238 162 -90 -64
4179 -64 184 17 77 70 156 184 111 -111 54 -150 -67 -115 -53 38 166 117 120 -45 -35 123 -99 -9 -156 145 161 137
4205 137 -192 137 -223 -8 27 -18 -191 -71 -70 -198 103 -46 172 280 -173 -26 174 90 -28 -185 126 29
4227 29 88 85 67 104 -154 202 -369 66 199 -75 93 314 -304 165 65 325 -131 -234 -198 16 230 -84
4249 -84 -132 239 133 96 54 -114 -53 0 -303 -192 -12 -174 -167 -34 178 35 -56 201 -49 81 -166 12 142
4272 142 -78 225 -11 -61 -77 32 -6 -26 -10 -164 119 109 -10 -24 -163 -60 -26 79 -138 60 -98 -63 233
4295 233 150 -29 -59 -183 -130 131 118 -181 41 -172 170 27 206 -97 26 161 5 -172 -18 342 74
4316 74 -116 105 75 -52 -236 -162 277 56 -80 -131 42 10 -174 11 -210 -262 -75 -83 -121 25 96 120 -72 4
4340 4 257 39 -61 197 -67 -49 -166 -13 52 118 18 77 -95 229 211 104 11 283 -324 -75 -31 -69 -34 231
4364 231 -226 -157 -72 27 28 24 126 25 114 195 -159 75 32 164 -116 -261 77 -224 -270 204 -221 55 -93 -66
4388 -66 -28 -106 7 14 272 -88 -59 130 90 42 -107 -136 -14 88 180 -63 7 -435 -73 85 -140 340 -50 -35
4412 -35 147 -22 88 76 19 21 -97 52 99 260 142 -19 -243 111 -167 220 205 101 -279 -83 -9 178 -74
4435 -74 100 -2 -20 -157 370 231 -397 141 -94 -117 227 236 -51 130 -87 -171 1 44 174 -92 -230 38
4457 38 -77 -43 -20 -83 96 111 13 86 35 -193 -5 341 -82 157 322 -3 -32 6 -49 118 -55 -51 30 -113 -27
4482 -27 -148 -4 -96 -231 157 -97 9 198 -8 -175 -216 314 213 -91 12 -102 -46 73 -66 -249 75
4503 75 -94 214 4 -170 -11 -225 -160 -367 25 46 -249 28 -17 -71 -187 -10 8 -169 -116 47 191 -155
4525 -155 29 -67 -351 -220 -193 -50 -65 208 201 -15 70 53 -196 -3 -128 -41 207 -203 106 -84 223 -23 -138
4548 -138 -254 5 -29 121 23 143 236 -305 -313 -47 151 81 -43 -103 41 165 83 -4 -186 200 -209 137 93
4571 93 -120 8 85 -246 242 -65 98 -72 50 -12 91 61 -111 167 10 92 129 -28 -93 -78 -75 -122 52 -91
4595 -91 -94 28 249 147 173 59 140 -123 100 109 182 290 65 59 113 131 118 -66 -31 87 264 69 101 -118 -121 151
4621 151 -338 35 393 160 2 -161 -118 -346 199 -87 7 73 92 -120 -234 -49 393 -112 -19 -94 102 -180
4643 -180 373 74 -175 -117 -97 287 82 39 -270 32 -10 -303 253 153 -65 367 -24 28 -21 44 67 80 107
4666 107 28 -21 -42 201 281 -43 118 31 189 149 144 83 -58 4 101 43 3 -202 93 73 93 45 123 44 -244 44
4692 44 387 236 32 -161 -108 67 72 -192 -109 42 -277 50 59 -124 94 -90 -35 98 -25 -173 -41 -43 19 -10
4716 -10 -20 216 60 -11 -236 -135 393 -94 102 385 -56 -117 -204 122 -89 -161 -64 159 -17 168 -21 -347
4738 -347 -6 -3 -101 139 107 -230 -66 -183 116 45 74 214 -73 190 -119 -183 -268 52 -105 -2 -12 -24 -210
4761 -210 113 -105 95 -63 -214 51 115 202 24 165 229 -65 -25 126 -24 -242 150 21 -139 204 157 94
4783 94 -99 -246 162 -124 -238 82 54 120 -123 -284 215 30 78 276 -129 -79 65 132 -157 -174 -1 11 10
4806 10 19 77 133 -18 -33 228 190 33 212 54 -119 -209 -77 -52 255 42 188 -36 183 -171 80 118 -67
4829 -67 173 -206 120 44 57 205 92 127 194 68 -43 169 63 -117 75 58 5 235 236 -263 -10 -262 25
4852 25 84 -45 -85 -99 -114 138 -40 147 285 -101 -132 -101 -134 -101 96 -112 -6 2 7 -102 -20 -259 -26 22 -48
4877 -48 203 -61 169 -27 206 -108 -7 13 -154 154 -71 154 314 106 -79 97 256 -117 -80 36 -118
4898 -118 -94 35 -184 118 162 179 249 -167 -133 -211 -250 -45 170 172 -87 27 37 96 -6 41 -225 6 -45 -39 -62
4923 -62 -129 144 238 -93 120 -284 41 -43 -11 368 32 -184 -32 281 -15 -24 5 378 42 -331 109 42 111
4946 111 229 74 -41 -118 188 237 103 -114 -38 121 287 -177 23 -176 133 -170 -153 -36 -286 -59 137
4967 137 -35 -115 -7 40 -38 69 -19 0 -264 83 -154 -183 0 -218 262 -79 305 32 -120 73 21 13 3
4990 3 -71 -18 -54 -235 176 105 -78 2 37 47 126 100 90 -374 70 67 131 285 -93 53 217 -62 -199 165 -140
5015 -140 4 130 50 41 -17 134 45 -37 107 -100 161 64 -117 -59 17 226 16 -214 121 -267 219 210 79 -54
5039 -54 27 490 28 159 87 -49 -67 -91 85 78 -103 96 -82 36 25 35 -10 60 64 95 60 146 126 -59 75 93
5065 93 -86 -12 168 -300 166 -78 30 -168 -48 -150 135 128 0 35 207 165 -124 359 -232 -44 229 356
5087 356 74 208 -79 -62 66 -31 190 32 142 -133 19 -193 -121 88 17 -73 -233 -129 3 158 -110 -51
5109 -51 -125 87 -187 5 -57 20 -23 -62 -209 -253 39 -62 59 227 -156 -190 -163 -218 -90 -41 153 90 -179 26
5133 26 76 -241 -477 -108 -95 14 -83 -115 -19 165 211 -124 13 47 -27 45 73 -77 180 70 -405 -26 23 -30
5157 -30 -100 111 -216 -147 62 107 131 45 -65 -107 -195 10 40 234 111 -68 -214 -82 68 324 120 203 -59
5180 -59 -73 39 253 21 146 -99 43 7 -152 300 258 -186 325 -50 44 136 150 75 -43 98 35 32 20 -13
5204 -13 -27 122 63 -39 62 -82 -93 -101 54 131 -22 28 -63 7 144 -58 85 74 -72 307 23 -51 171 153
5228 153 -127 -39 -177 164 167 99 -12 16 -6 17 -14 46 257 65 70 -71 -146 61 85 114 -207 -158 243 -124 164
5253 164 -166 278 -316 -361 -65 7 -202 58 -8 43 27 -6 -68 -86 -121 -10 160 -147 -224 -71 277 21 14 -203
5277 -203 130 218 -206 138 -82 217 41 18 -81 140 168 -4 123 54 -6 -119 182 -12 59 141 -76 -38 -211
5300 -211 -168 -25 10 -195 -133 -170 -143 5 283 -86 94 -65 33 116 -233 67 -79 -42 195 -28 -146 -58 -181
5323 -181 -311 109 134 -179 73 78 -49 -10 57 149 -76 -72 247 118 -44 -186 -275 -96 142 -45 321 84 142
5346 142 -50 53 23 -288 21 -123 125 50 -264 -203 -54 89 -1 266 -29 137 133 32 -45 90 -41 110
5368 110 47 49 -89 190 189 126 -230 -32 -149 -250 -234 -234 86 -83 -143 -142 19 112 272 -124 82 177 -24 163 34
5393 34 -320 99 18 59 125 -209 -7 -83 -59 -133 -342 -38 -185 111 -1 126 82 72 -66 95 -284 -101 -226
5416 -226 -11 -36 -83 359 57 41 -155 17 121 215 45 -94 6 42 28 -121 83 102 -109 67 -52 322
5438 322 125 -104 -14 -105 -59 71 -147 -95 -121 -254 18 245 175 -266 -74 74 37 228 -182 79 104 155 3
5461 3 -2 84 -106 -201 -138 177 230 160 -2 101 -156 -32 181 -320 50 126 39 92 111 -81 90 104 45 70 -34
5486 -34 -102 188 132 -498 -139 137 -129 -121 -285 85 -16 271 97 0 220 93 62 178 -36 6 -101 40 -93
5509 -93 144 37 41 73 58 -147 -32 -21 -152 -421 112 -94 -83 291 -59 266 139 58 20 -59 -95 41 61 26
5533 26 -234 111 190 -54 -129 77 77 103 165 -81 214 71 -20 42 -86 -65 -51 -99 147 163 223 -60 19 -6 28 235
5559 235 213 -39 135 -83 186 3 -118 123 66 -104 73 -122 122 80 -40 -76 219 86 -239 25 8 105
5581 105 205 -6 5 176 105 115 -224 -36 -61 212 26 -18 165 -105 301 91 102 3 169 38 -77 -255
5603 -255 28 -33 66 267 26 -20 -56 -160 -151 40 209 223 -12 227 -168 -240 -30 -28 173 -259 -159 -24 39 -239
5627 -239 53 -197 -103 -28 -239 -8 -120 -55 -218 31 -124 152 63 -69 33 147 75 339 -141 -15 -66 86
5649 86 2 -44 -137 -169 116 -161 -14 -253 131 34 81 -228 -242 -85 92 -66 96 -28 222 -14 81 -223 160
5672 160 75 -109 144 -84 125 -225 102 41 -79 427 -10 -99 -46 -76 -62 -90 175 -81 4 -18 -92 -101 39 180
5696 180 281 101 58 81 194 -89 -101 162 -21 237 126 113 83 161 -448 144 -114 10 -237 74 11 151
5718 151 37 -85 -10 25 -5 278 -15 -2 40 -136 -83 -147 -269 -176 160 49 80 156 -40 -181 204 128 155 -17
5742 -17 121 -324 -171 -11 253 -83 355 -10 -86 146 -95 1 115 91 147 28 -229 -124 -84 134 146 -25
5764 -25 195 -66 -177 -45 -248 30 -179 -148 -151 -167 -124 62 -82 97 34 -192 -147 206 -219 28 -37 -214 87
5787 87 26 -63 131 -182 -108 5 -191 72 -2 62 -20 -204 -32 -154 68 102 -129 217 165 34 -55 69 56 14
5811 14 214 -118 121 35 -14 -27 39 -83 -39 -20 6 -149 58 -140 -21 -32 -112 0 151 128 200 -3 65 -44
5835 -44 -33 -25 54 -171 -203 56 -140 186 212 -23 170 313 19 24 162 -12 -182 -206 -47 -126 79 -66 -53 -49 -347
5860 -347 -211 18 -116 114 -139 -86 128 -134 -75 53 -36 99 -74 95 -205 -187 -5 -48 118 -84 -88 59
5882 59 -50 391 -88 194 2 65 -105 -109 -186 -70 103 -350 -60 -68 123 80 -92 -213 127 64 -133 -55 67
5905 67 -419 6 -324 157 236 45 -191 219 -145 242 6 103 -60 -189 64 -175 250 33 245 34 13
5926 13 31 104 164 32 -120 215 66 -126 147 -128 -75 3 -105 247 58 -211 51 -126 -28 -174 -133 -196 -16
5949 -16 100 60 -69 -320 -100 -36 150 -116 68 132 -51 -22 -32 182 163 33 -32 -265 24 -103 -70 152 95
5972 95 155 86 170 53 -118 -93 49 82 -25 -116 35 -69 -49 -117 55 24 120 35 129 -126 -83 -221 107 -162 -184
5997 -184 137 273 175 17 33 -41 32 64 -2 13 184 -34 -79 -191 102 92 88 63 -39 58 -199 -126 -79 -142 -12
6022 -12 51 -46 94 102 146 -196 73 -112 -11 -60 71 -141 -15 30 -43 -90 235 -18 161 77 -82 234 49 119
6046 119 -21 84 115 102 -249 -251 -53 -13 -177 38 92 -17 -12 33 59 -80 34 31 82 -165 -10 -31 -30 49 266 -120
6072 -120 -251 -117 92 133 -90 -4 -25 74 -219 -274 -157 -116 -9 -98 -79 4 173 -156 -89 51 -80 233 97
6095 97 -164 -38 277 325 -177 26 -243 -61 257 -255 105 91 -96 -46 -84 -185 -83 136 -247 -54 25 -6
6117 -6 30 30 -44 -139 14 49 -28 -99 100 -34 25 125 140 253 -20 6 -281 165 -11 17 -27 3 -91 -9 7 -136
6143 -136 -170 21 107 134 15 -59 -29 -92 136 -208 -48 24 -99 240 -163 232 -64 140 10 99 -33 153 -266
6166 -266 -95 -57 -153 -184 -75 193 -148 55 260 69 34 76 -377 -11 28 -78 -64 -67 -121 -110 64 -7 255 -95
6190 -95 -133 124 50 -321 -73 -248 162 59 -243 77 65 -32 35 27 -48 -41 -293 16 23 -14 95 12 -142 -159 -296
6215 -296 -91 31 6 -14 87 -4 -41 -154 284 122 162 16 -165 37 -217 -55 62 122 136 132 50 164 4
6238 4 -124 -188 154 -205 56 -32 -248 145 -50 123 -18 61 -96 32 165 238 -49 -43 -108 -7 65 -32 -181 -46
6262 -46 -79 -47 -43 -295 24 -43 -86 104 177 -162 53 -103 105 202 -83 -75 -253 105 -120 -100 46 -132 98 27
6286 27 203 385 251 128 101 107 -33 170 -62 240 124 207 160 7 -222 -112 -105 -128 -152 97 -81 -173 -111 -79
6310 -79 148 -233 -64 -257 -16 -48 -132 43 -15 107 -160 190 -44 -77 53 -207 -161 149 144 14 -118 156 68
6333 68 -16 -119 68 -125 45 128 148 -56 33 -141 211 -53 154 -139 -15 -215 -2 -71 189 61 -49 -22
6355 -22 6 198 33 -28 180 -67 62 111 52 115 56 -372 -372 -8 102 46 -82 -41 195 -107 177 39 -125 278
6379 278 150 45 202 51 -51 294 -134 16 -207 64 -75 -240 78 -194 -139 39 142 8 -246 14
6399 14 -28 86 159 -129 10 8 -104 -185 -39 -176 -165 50 62 24 22 5 164 -240 36 -80 -132 -37 -69 -126 172
6424 172 -15 100 85 68 84 -37 -4 -115 -7 -194 13 141 -106 82 72 -65 115 40 214 151 -355 -175
6446 -175 68 169 -104 -149 -76 -135 -11 -163 -241 -69 46 -127 -45 -73 21 372 42 -150 37 -115 7 -221
6468 -221 -82 15 -249 273 138 73 -37 -231 -69 -72 -139 -193 -62 -57 251 -199 219 -7 -37 289 55 -207 -152
6491 -152 -60 -82 185 311 -153 -132 -48 -121 -176 -329 -46 -196 -254 -200 80 -13 -51 -73 -123 -171 -259 46 -201 -81 123
6516 123 67 68 -79 -88 60 16 0 68 174 -98 -103 148 18 153 -32 -128 -150 116 -27 16 139 -192 145 14
6540 14 60 18 -34 71 170 44 23 -132 52 -58 49 -87 54 77 131 -28 226 9 -67 -40 57 -236 -134 205
6564 205 -21 -113 -228 2 -222 -3 -93 116 84 -74 136 -1 -35 260 63 -79 -250 -295 -101 46 -89 116
6586 116 -164 -76 93 -28 200 -187 33 153 60 8 61 -209 -121 -205 -136 237 156 -299 104 113 -52 168 -141
6609 -141 105 165 58 -127 -71 -207 -38 81 -33 -79 -8 -164 -138 121 114 -44 -214 91 -59 -182 134 47 -119
6632 -119 -171 142 -47 1 13 -147 225 121 301 158 238 -78 209 410 -27 -192 54 -50 189 123 -63 52
6654 52 412 -60 -22 69 170 -146 50 61 -179 30 123 -55 -17 142 45 209 -32 -30 -166 68 -44 98 -79
6677 -79 -107 144 1 239 125 -25 -102 77 104 2 -154 -108 -131 196 -97 -62 -26 -171 117 259 -157 198 176
6700 176 -31 -20 -13 14 19 192 10 -186 25 18 -261 -146 -72 38 -63 -105 166 5 -156 -211 74 -185 50 128
6724 128 -233 -318 -223 -202 34 183 137 -86 146 104 -48 196 30 -125 -118 -195 -157 -107 -48 37 2 57 134 -31 196
6749 196 -88 -141 -21 -39 -105 106 -77 89 -26 -110 -142 239 -18 131 -152 63 361 -236 79 89 2 55 -113
6772 -113 -46 -140 -161 -111 -29 218 4 -50 137 30 64 96 87 193 5 76 -9 129 -130 30 0 61 41 102 -26
6797 -26 75 -123 103 37 158 -51 -102 60 271 -130 140 -257 85 40 -90 34 -50 -9 153 7 -229 290
6819 290 95 -51 -84 152 55 -134 -94 214 -62 102 141 -202 101 -202 48 365 361 -21 9 -16 -384 -77 -12
6842 -12 -24 -213 -82 -24 -22 143 -89 -12 101 153 -401 36 -16 224 -132 -52 69 194 -180 103 -136 -105 27
6865 27 32 10 68 123 -106 7 182 -435 45 -167 199 -177 -117 -281 210 -96 -173 -59 -85 91 24 29 -209 -117
6889 -117 142 245 -100 15 3 -194 -128 362 244 -35 -41 -3 -111 -128 -95 -239 -165 -165 -44 -216 -217 76 -43 38
6913 38 80 165 40 163 -35 87 -57 -178 -137 102 22 -259 53 -259 -36 21 250 -93 -166 189 -28 -65 -238
6936 -238 97 220 69 -278 -21 -63 276 189 285 58 -113 4 22 -90 65 179 -25 -165 -133 -292 -232 92
6958 92 -21 29 -114 38 -48 26 184 3 -191 460 5 146 -38 -125 204 146 261 -1 -33 118 -130 -25
6980 -25 -151 -149 -21 -4 -172 -58 73 -303 -133 -146 75 48 -374 -90 263 -232 50 84 236 -236 75 114 93
7003 93 -94 111 -236 -169 318 139 -4 65 64 28 -218 -139 -103 99 224 38 81 -97 -288 83 -112 49 -136
7026 -136 3 -243 164 316 -65 -64 18 250 61 3 129 -99 204 24 -25 123 -6 20 299 62 338 277
7048 277 147 -114 -41 159 309 -99 -130 -149 -213 169 42 74 166 79 -97 -124 -120 110 29 -25 136 91 66 86 -15
7073 -15 54 89 189 99 132 -49 82 203 -138 487 -63 -5 -256 35 -177 194 -49 -271 -327 -148 203 -14
7095 -14 -200 109 -213 60 -57 -43 -137 13 103 -160 80 -24 159 -126 -36 141 48 -166 -145 -202 41 107 -197
7118 -197 -185 52 -8 72 -104 120 53 -119 140 28 97 -123 75 -146 -5 -50 -55 -224 75 62 -104 -114 -128 -78
7142 -78 22 244 -203 -316 93 10 95 -222 -9 -235 -132 65 -132 -18 115 155 0 -45 106 9 169 1
7164 1 96 -163 74 74 52 71 -160 57 71 -302 71 -377 -116 35 223 152 -41 -106 -191 -130 256 -123 52 -94
7188 -94 -56 -22 14 120 107 155 -173 -10 -33 148 130 -198 152 18 -61 -283 111 13 -38 -32 -55 -284 135 74 174
7213 174 15 171 -24 -305 -137 133 -224 -209 158 54 119 -195 9 68 57 232 8 -89 -10 56 184 233 66
7236 66 -294 12 -28 312 -109 -118 18 -192 -55 -104 -21 -7 132 1 126 235 -335 -67 -41 -55 60 -78 -71 226
7260 226 97 -14 21 -133 -46 171 -349 49 -2 -23 86 -35 46 -104 26 -188 13 75 -33 -107 74 -41
7282 -41 -35 24 221 160 44 -147 171 -81 -220 -177 -112 -100 4 -78 -157 -76 120 -26 114 -80 70 119 -143 -40
7306 -40 116 64 -51 64 83 87 148 -145 111 -133 -126 137 225 -167 -13 -94 -77 242 -264 -34 -167 61 -119 -110
7330 -110 32 93 256 28 -147 -57 177 164 -66 92 -255 66 58 -38 36 -70 -13 49 55 103 109 17 -73 24 91 173
7356 173 202 -176 -462 -12 -131 -154 -253 -51 -39 274 243 -166 24 133 253 -129 -58 -138 -31 113 157 -49 251
7379 251 -68 -18 78 -75 95 -8 43 -164 242 55 353 126 -116 -246 -70 144 -144 -7 64 169 109 -84
7401 -84 -208 23 -103 -39 -39 -190 -122 212 -51 43 124 168 -56 -57 -77 234 -400 336 148 -171 228 121 -5 315
7425 315 -139 -72 -106 -201 -452 -139 345 152 99 11 -112 29 -181 72 196 125 83 -101 46 91 12 -75 -108 -91
7449 -91 -98 -4 244 154 66 17 -206 84 220 -22 232 178 170 25 142 193 -78 133 20 -112 -219 -78 -152 -75
7473 -75 -231 41 3 3 -153 96 -10 -88 61 -311 156 148 103 171 -64 270 -43 123 -364 81 7 211 101
7496 101 67 104 110 -240 -103 100 95 145 -36 46 25 79 -58 -75 292 -120 22 96 100 -79 42 -50 152 227 78
7521 78 7 39 129 -142 -84 17 -287 -6 342 289 -214 -19 -107 -103 -115 -1 -48 -52 117 -25 -78 13 -140 67 -14
7546 -14 -42 341 120 -89 353 -9 53 -71 -218 57 -56 -153 -369 122 -4 -34 -241 -162 129 -49 -122 139
7568 139 -9 131 34 -152 -347 384 243 68 -366 15 3 -75 -23 -31 -36 184 166 268 15 228 136 -389 169
7591 169 31 -38 45 192 -117 109 -80 1 52 -233 -19 -178 -100 -18 -319 -133 173 -79 154 -267 -8 148
7613 148 -90 -62 -16 276 114 248 22 -52 -30 -43 -148 -67 197 6 -92 34 196 33 47 177 33 -67 17
7636 17 -32 -299 200 -37 -83 -49 117 182 114 89 -122 -90 -219 189 -119 45 -313 -74 175 22 34 173 12
7659 12 -210 72 60 -5 244 -205 -133 285 -44 10 -36 -248 -32 -182 104 237 -111 -68 57 153 -102 -71 82
7682 82 8 -286 227 261 94 19 3 67 -80 -117 62 -147 -188 114 -231 78 168 -194 -147 -262 155 97 20 298
7706 298 -13 171 -180 35 -139 -30 -289 330 -432 -385 17 -102 343 -16 -137 -164 149 131 57 39 265 57
7728 57 24 -183 257 -132 37 -67 65 -259 -54 -99 -151 36 98 -124 -16 269 240 91 -68 161 -150 164
7750 164 -58 165 -52 -131 -35 33 5 3 -23 271 218 7 -40 -271 -170 214 34 181 -54 242 61 -186 -121
7773 -121 74 14 64 155 -139 61 90 -136 39 31 432 -129 -110 162 -356 7 215 -114 -100 62 -228 81 -94
7796 -94 -242 -70 0 -3 20 -56 -188 64 314 62 -80 8 8 278 144 -68 4 -137 -109 117 -253 -184 53 246
7820 246 -118 76 290 83 47 -60 -88 -123 -87 417 269 50 206 21 -81 -241 -4 145 83 -5 151 57
7842 57 -53 181 -49 -166 61 367 90 47 124 -5 98 209 -46 151 -189 68 17 133 28 -143 -244
7863 -244 -153 114 -55 -33 -239 142 220 226 -20 -256 318 93 -255 92 -26 -216 4 -87 -102 -168 -265 -100 -102 376
7887 376 -140 -92 216 -204 -5 -101 -249 41 11 -143 0 74 -92 -15 141 -43 -46 0 25 -160 -83 39 -37 40
7911 40 57 -73 305 -48 194 70 -72 155 -146 -53 -140 -241 183 32 -4 -57 1 -83 281 -135 224 185 113
7934 113 49 -289 -144 -93 99 34 54 -277 264 101 123 36 -50 -190 38 -25 -128 85 -99 -111 183 148 -296
7957 -296 -168 -57 -165 -140 46 -181 -28 -69 -145 31 258 241 130 238 -33 -67 -304 16 -32 50 -38 167 117
7980 117 -8 303 123 -28 -51 93 97 132 92 -111 -169 -167 45 -5 -51 190 150 68 56 -221 -14 -51 35 238 -273
8005 -273 64 205 -160 137 -25 115 -220 -39 130 110 -139 18 -22 -21 -44 37 -380 -8 97 -72 150 -162
8027 -162 30 108 37 17 179 216 159 -70 89 45 -37 218 341 57 70 -29 12 179 -507 -26 -88 -33 -32 154 86
8052 86 153 -162 -188 65 -54 -72 61 -99 -149 137 173 -141 32 3 -114 -124 -76 0 -67 -52 75 136 109 82 -148
8077 -148 -110 -13 136 140 -2 -37 225 -28 94 -280 65 94 -69 -200 248 90 -121 -57 170 162 64 -73 65
8100 65 -15 122 139 147 367 -12 -8 -127 -270 48 -57 -147 -118 -38 41 10 12 32 32 107 -52 -102 -80 70 292 60 -71
8127 -71 131 149 -112 -102 68 120 -37 43 12 -139 224 -150 -42 -242 51 -167 -213 -139 -59 113 -28 139 358
8150 358 36 -71 35 -264 -4 -205 259 -30 43 -24 32 -128 -14 34 152 10 -41 80 324 62 -64 -51
8172 -51 60 215 157 239 -88 -10 -101 -26 35 91 -48 5 -62 152 127 74 105 4 -196
8191a96
##END NTUPLES=NMR FID
##END=
