##TITLE=1H_DE-92K
 200.13MHz,CDCl3,
 8 sc
 
 29.4.2025
##JCAMPDX= 6.0         $$ Bruker NMR JCAMP-DX V2.0
##DATA TYPE= NMR FID
##DATA CLASS= NTUPLES
##ORIGIN= UXNMR, Bruker Analytische Messtechnik GmbH
##OWNER= pz
$$ XWIN-NMR		Version 3.5
$$ Tue Apr 29 13:53:00 2025 Russian Standard Time (UT+4h)  she@DPX200
##.OBSERVE FREQUENCY= 200.1313
##.OBSERVE NUCLEUS= ^1H
##.DELAY= (6, 6)
##.ACQUISITION MODE= SIMULTANEOUS
##.ACQUISITION SCHEME= undefined
##.AVERAGES= 8
##.DIGITISER RES= 18
##SPECTROMETER/DATA SYSTEM= spect
##.PULSE SEQUENCE= zg30
##.SOLVENT NAME= CDCl3
##.SHIFT REFERENCE= (INTERNAL, CDCl3, 0, 14.3821)
##AUDIT TRAIL= $$ (NUMBER, WHEN, WHO, WHERE, WHAT)
$$ ##TITLE= Audit trail, XWIN-NMR		Version 3.5
$$ ##JCAMPDX= 5.01
$$ ##ORIGIN= Bruker BioSpin GmbH
$$ ##OWNER= she
$$ F:/spectra/data/she/nmr/H-C/1/audita.txt
$$ ##AUDIT TRAIL=  $$ (NUMBER, WHEN, WHO, WHERE, WHAT)
(   1,<2025-04-29 13:51:32.87 +0400>,<she>,<DPX200>,
      <created by zg, POWCHK disabled, PULCHK disabled
       configuration hash MD5:
       00 E9 B6 7A A2 85 ED C7 34 08 36 98 17 FE 4E 26
       data hash MD5: 16K
       11 C9 97 2B 0E 87 FB 51 6A 38 43 2D 2F B2 8A AD>)
$$ ##END=
$$ 
$$ hash MD5
$$ F5 88 50 F1 A3 0D C8 D6 77 54 4B 9F 04 1A 1E 44
##$RELAX= 
##$RELAX= 
##$RELAX= 
##$RELAX= 
##$RELAX= 
##$RELAX= 
$$ Bruker specific parameters
$$ --------------------------
##$DU= <F:/spectra>
##$EXPNO= 1
##$NAME= <H-C>
##$PROCNO= 1
##$TYPE= <nmr>
##$USER= <she>
##$AMP= (0..31)
100 100 100 100 100 100 100 100 100 100 100 100 100 100 100 100 100 100 
100 100 100 100 100 100 100 100 100 100 100 100 100 100 
##$AQSEQ= 0
##$AQ_mod= 1
##$AUNM= <au_zg>
##$AUTOPOS= <>
##$BF1= 200.13
##$BF2= 200.13
##$BF3= 200.13
##$BF4= 200.13
##$BF5= 200.13
##$BF6= 200.13
##$BF7= 200.13
##$BF8= 200.13
##$BYTORDA= 1
##$CFDGTYP= 0
##$CFRGTYP= 5
##$CHEMSTR= <none>
##$CNST= (0..31)
1 1 145 1 1 1 1 1 1 1 1 1 1 1 1 1 1 1 1 1 1 1 1 1 1 1 1 1 1 1 1 1 
##$CPDPRG= <>
##$CPDPRG1= <>
##$CPDPRG2= <>
##$CPDPRG3= <>
##$CPDPRG4= <mlev>
##$CPDPRG5= <mlev>
##$CPDPRG6= <mlev>
##$CPDPRG7= <mlev>
##$CPDPRG8= <mlev>
##$CPDPRGB= <>
##$CPDPRGT= <>
##$D= (0..31)
0 0.7 0 0 0 0 0 0 0 0 0 0.03 0 0 0 0 0 0 0 0 0 0 0 0 0 0 0 0 0 0 0 0 
##$DATE= 1745920292
##$DBL= (0..7)
120 120 120 120 120 120 120 120 
##$DBP= (0..7)
150 150 150 150 150 150 150 150 
##$DBP07= 0
##$DBPNAM0= <>
##$DBPNAM1= <>
##$DBPNAM2= <>
##$DBPNAM3= <>
##$DBPNAM4= <>
##$DBPNAM5= <>
##$DBPNAM6= <>
##$DBPNAM7= <>
##$DBPOAL= (0..7)
0.5 0.5 0.5 0.5 0.5 0.5 0.5 0.5 
##$DBPOFFS= (0..7)
0 0 0 0 0 0 0 0 
##$DE= 6
##$DECBNUC= <off>
##$DECIM= 32
##$DECNUC= <off>
##$DECSTAT= 4
##$DIGMOD= 1
##$DIGTYP= 9
##$DL= (0..7)
0 120 120 120 120 120 120 120 
##$DP= (0..7)
150 150 150 150 150 150 150 150 
##$DP07= 0
##$DPNAME0= <>
##$DPNAME1= <>
##$DPNAME2= <>
##$DPNAME3= <>
##$DPNAME4= <>
##$DPNAME5= <>
##$DPNAME6= <>
##$DPNAME7= <>
##$DPOAL= (0..7)
0.5 0.5 0.5 0.5 0.5 0.5 0.5 0.5 
##$DPOFFS= (0..7)
0 0 0 0 0 0 0 0 
##$DQDMODE= 0
##$DR= 18
##$DS= 0
##$DSLIST= <SSSSSSSSSSSSSSS>
$$ [...]
##$SUBNAM0= <"">
##$SUBNAM1= <"">
##$SUBNAM2= <"">
##$SUBNAM3= <"">
##$SUBNAM4= <"">
##$SUBNAM5= <"">
##$SUBNAM6= <"">
##$SUBNAM7= <"">
##$SUBNAM8= <"">
##$SUBNAM9= <"">
##$SW= 18.0517328524113
##$SWIBOX= (0..15)
0 0 2 0 0 0 0 0 0 0 0 0 0 0 0 0 
##$SW_h= 3612.71676300578
##$TD= 16384
##$TD0= 1
##$TE= 0
##$TE2= 300
##$TE3= 300
##$TEG= 300
##$TL= (0..7)
0 120 120 120 120 120 120 120 
##$TP= (0..7)
150 150 150 150 150 150 150 150 
##$TP07= 0
##$TPNAME0= <>
##$TPNAME1= <>
##$TPNAME2= <>
##$TPNAME3= <>
##$TPNAME4= <>
##$TPNAME5= <>
##$TPNAME6= <>
##$TPNAME7= <>
##$TPOAL= (0..7)
0.5 0.5 0.5 0.5 0.5 0.5 0.5 0.5 
##$TPOFFS= (0..7)
0 0 0 0 0 0 0 0 
##$TUNHIN= 0
##$TUNHOUT= 0
##$TUNXOUT= 0
##$USERA1= <user>
##$USERA2= <user>
##$USERA3= <user>
##$USERA4= <user>
##$USERA5= <user>
##$V9= 5
##$VALIST= <valist>
##$VCLIST= <CCCCCCCCCCCCCCC>
##$VD= 0
##$VDLIST= <DDDDDDDDDDDDDDD>
##$VPLIST= <PPPPPPPPPPPPPPP>
##$VTLIST= <TTTTTTTTTTTTTTT>
##$WBST= 1024
##$WBSW= 4
##$XGAIN= (0..3)
0 0 0 0 
##$XL= 0
##$YL= 0
##$YMAX_a= 128903
##$YMIN_a= -178664
##$ZGOPTNS= <>
##$ZL1= 120
##$ZL2= 120
##$ZL3= 120
##$ZL4= 120
##$ABSF1= 10
##$ABSF2= 0
##$ABSG= 5
##$ABSL= 3
##$ALPHA= 0
##$AQORDER= 0
##$ASSFAC= 0
##$ASSFACI= 0
##$ASSFACX= 0
##$ASSWID= 0
##$AUNMP= <proc_1d>
##$AZFE= 0.1
##$AZFW= 0.1
##$BCFW= 1
##$BC_mod= 2
##$BYTORDP= 1
##$COROFFS= 0
##$CY= -3
##$DATMOD= 1
##$DC= 2
##$DFILT= <>
##$DTYPP= 0
##$F1P= 0
##$F2P= 0
##$FCOR= 0.5
##$FTSIZE= 0
##$FT_mod= 4
##$GAMMA= 1
##$GB= 0.15
##$INTBC= 1
##$INTSCL= 1
##$ISEN= 128
##$LB= 0.25
##$LEV0= 0
##$LPBIN= 0
##$MAXI= 10000
##$MC2= 0
##$MEAN= 0
##$ME_mod= 0
##$MI= 1.114404
##$NCOEF= 0
##$NC_proc= 0
##$NLEV= 6
##$NOISF1= 3.799351
##$NOISF2= 2.8
##$NSP= 1
##$NTH_PI= 0
##$NZP= 0
##$OFFSET= 14.38212
##$PC= 1
##$PHC0= -1186.207
##$PHC1= 9.592211
##$PH_mod= 1
##$PKNL= yes
##$PPARMOD= 0
##$PSCAL= 0
##$PSIGN= 0
##$REVERSE= no
##$SF= 200.129724274929
##$SI= 16384
##$SIGF1= 3
##$SIGF2= 2
##$SINO= 400
##$SIOLD= 16384
##$SREGLST= <1H.CDCl3>
##$SSB= 0
##$STSI= 0
##$STSR= 0
##$SW_p= 3205.1282051282
##$SYMM= 0
##$S_DEV= 0
##$TDeff= 0
##$TDoff= 0
##$TI= <>
##$TILT= no
##$TM1= 0
##$TM2= 0
##$TOPLEV= 0
##$USERP1= <user>
##$USERP2= <user>
##$USERP3= <user>
##$USERP4= <user>
##$USERP5= <user>
##$WDW= 1
##$XDIM= 8192
##$YMAX_p= 0
##$YMIN_p= 0
$$ End of Bruker specific parameters
$$ ---------------------------------
##NTUPLES= NMR FID
##VAR_NAME=  TIME,          FID/REAL,        FID/IMAG
##SYMBOL=    X,             R,               I
##VAR_TYPE=  INDEPENDENT,   DEPENDENT,       DEPENDENT
##VAR_FORM=  AFFN,          ASDF,            ASDF
##VAR_DIM=   8192,          8192,            8192
##UNITS=     SECONDS,       ARBITRARY UNITS, ARBITRARY UNITS
##FACTOR=    0.0002768,     1,               1
##FIRST=     0,             0,               0
##LAST=      2.2672688,     0,               0
##MIN=       0,             -178664,         0
##MAX=       2.2672688,     128903,          0
$$ Real data points
##PAGE= N=1
##DATA TABLE= (X++(R..R)), XYDATA
0@%%%%%%%%%%%%%%%%%%Nj3J6j6J6j6J7k2K9l2L7m4M7n3O0o8P7q5R7j09J20j33
$$ 0 0 0 0 0 0 0 0 0 0 0 0 0 0 0 0 0 0 0 5 -8 8 -8 8 -8 9 -13 16 -16 21 -23 24 -29 31 -37 40 -45 52 -57 63 -70
40g0J47j64J83k01K20k44K70k96L26l59L96m36M81n32N89o54P29q17R21j046J199
$$ -70 77 -87 96 -105 115 -129 141 -155 171 -188 208 -228 253 -279 310 -344 385 -432 489 -557 642
61F42j397J652j993K484l237M515p042J3706o0940j27054K41196O6371j75543
$$ 642 -755 897 -1096 1388 -1849 2666 -4376 9330 -51610 -178664 62532 128903 -46640
74d6640M9588J06111p7480j3407N1395p3178l0709Q6549n3301j09086O8972L2317
$$ -46640 2948 109059 31579 18172 69567 -3611 -34320 52229 -1072 -110158 -41186 -8869
86h869r4506M5760Q0943o3499J0823R5316j9789k9593L2576q430l368K5041m8243
$$ -8869 -103375 -57615 23328 -40171 -29348 65968 46179 16586 49162 40732 37364 62405 14162
99A4162n5833M5195K2302p6103k797P2954k9575m9246L9057K688j4007M2228j4886
$$ 14162 -41671 3524 25826 -50277 -53074 19880 -9695 -58941 -19884 -17196 -31203 11025 -3861
112c861l4936N7943L1487m0381J1278L8546k3764k5752K7049o692n5787n388J6827
$$ -3861 -38797 19146 50633 10252 21530 60076 36312 10560 37609 30917 -24870 -30258 -13431
125a3431k8550n356J9744j1371J0428K8506n724J2130K8758q755j4574J1421J0388
$$ -13431 -41981 -47337 -27593 -38964 -28536 -30 -5754 6376 35134 26379 11805 23226 33614
138C3614j1594j8140J45N15p790N121m196j8029M184L761p745K715R96j192O548
$$ 33614 22020 3880 4025 4540 -3250 1871 -2325 -20354 -16170 -12409 -20154 -17439 -16443 -17635 -11087
153a1087N760J4152Q926p301J0728J2170j2193k514K974j6246j3767k849r18n593
$$ -11087 -5327 8825 17751 10450 21178 33348 21155 18641 21615 5369 -8398 -11247 -12165 -17758
167a7758o187M887Q57j107J8404O068q779J2868O385r573N556L295p676O22n25
$$ -17758 -23945 -19058 -18201 -19308 -904 5164 -3615 9253 15638 6065 11621 14916 7240 7862 7337
182G337l686j052l064j126m054n067J958k522j053L582n357N450J3127l901N451
$$ 7337 3651 2599 -465 -1591 -5645 -10712 -8754 -11276 -12329 -8747 -14104 -8654 4473 572 6023
197F023J2667p846k168R055n720p247j227n531p725k503N663k366p126R801N613
$$ 6023 18690 10844 8676 17731 12011 4764 3537 -1994 -9719 -12222 -6559 -8925 -16051 -6250 -637
212f37p316R559P569r760L582O545n177K81K313k595k257l80K578k868n186K075
$$ -637 -7953 1606 9175 -585 2997 9542 4365 4646 6959 4364 2107 1727 4305 1437 -3749 -1674
228a674l795n183O409j995n447P273K604K41N951J714J967K934l318n34j24m127
$$ -1674 -5469 -10652 -4243 -6238 -11685 -4412 -1808 -1567 4384 6098 8065 10999 7681 7147 7023 2896
244B896k504m810k306K644l446p18L873j334L114L293k504L697K691l915K251
$$ 2896 392 -4418 -6724 -4080 -7526 -8244 -4371 -5705 -2591 702 -1802 1895 4586 671 2922
259B922J990j390J002p51k08R76l157J71j568n325J185j256l599L500k04j079
$$ 2922 4912 3522 4524 3773 3565 4541 1384 1555 -13 -5338 -4153 -5409 -9008 -5508 -5712 -6791
275f791N915K309O20L935O43J468p56l135J305j888n530L38j403k018J824j908
$$ -6791 -876 1433 2053 5988 6631 8099 7343 4208 5513 3625 -1905 -1567 -2970 -4988 -3164 -5072
291e072k85L005p63R08R29m12L031k34j507M581Q45j704K056m54o57q8l214r70
$$ -5072 -5357 -2352 -3115 -2207 -1278 -1690 1341 1107 -400 4181 5026 3322 5378 4924 4267 4179 965 -5
309ek091k923l9j227j652L759k21N57M809R01N12K821k47M24k71j719O80k540
$$ -5 -2096 -5019 -5058 -6285 -7937 -4178 -4399 -3842 967 1868 2380 5201 4954 5378 5107 3388 4068 1528
327A528l191K038j517k106J166j444l28J035j284J052J096j3J961L11N21L657
$$ 1528 -1663 375 -1142 -3248 -2082 -3526 -3854 -2819 -4103 -3051 -1955 -1968 -7 304 825 4482
343D482n16n89K705j087j549r01k676o64j248k607L82m41q02K344k34J017L348
$$ 4482 3966 3377 6082 4995 3446 2545 -131 -795 -2043 -4650 -4268 -4709 -5511 -3167 -3401 -2384 964
360I64j33M21K243j71J01o5j111J135j461j052O56j933j488P64j391j035P22r10
$$ 964 831 1252 3495 3324 3425 3360 2249 3384 1923 871 1527 -406 -1894 -1130 -2521 -3556 -2834 -3744
378c744Q87O55j79K239Q27P08K146m15M48R94j610j024Q4j985o18r07j912J089
$$ -3744 -2857 -2202 -2381 -142 685 1393 3539 3124 3572 4566 2956 1932 2016 31 -587 -1494 -3406 -2317
396b317o09o14J342J54M61J667o70R38J650j07K57J87k44P62j175q95J035k060
$$ -2317 -2926 -3540 -2198 -2044 -1583 84 -586 352 2002 1895 2152 2339 2095 2857 1682 787 1822 -238
414b38r04P70k171j10J197j667M38J456M42Q04L09R94R03q42J148N02k053M00
$$ -238 -1142 -372 -2543 -2653 -1456 -3123 -2685 -1229 -787 17 326 1320 2223 1381 2529 3031 978 1378
432A378M62k443k73N96j461K39k87J57M81l72O05R31p73J127N53j72P63m4k86
$$ 1378 1840 -603 -876 -280 -1741 -1502 -1789 -1632 -1151 -1523 -918 13 -760 367 920 748 1511 1467 1181
451A181N27r24k99O38j846j85M80q25k10M11l73oO97O58M07l10J295N26k005J159
$$ 1181 1708 784 485 1123 -723 -908 -428 -1253 -1463 -1052 -1425 -1431 -734 -76 331 21 1316 1842 -163 996
471I96J161k176j3J049j133k18L78q52j44j4O81r3p16J352l7r32J008N80o29Q48
$$ 996 2157 -19 -32 1017 -116 -334 44 -808 -952 -966 -285 -378 -1094 258 221 -711 297 877 248 1096
491A096j34n25M97m17m95R5o44k67K33l89L79j62K83Q73m17J41R26k67m65P41
$$ 1096 962 437 934 517 22 117 -527 -794 -561 -950 -571 -733 -450 423 6 147 1073 806 341 1082
511A082j018k62R18r71o5N64o74M15l46L5L08n07q4O35l79O53j33n73J195n5p87
$$ 1082 64 -198 720 -251 -316 248 -426 -11 -357 -322 -14 -521 -605 30 -349 304 171 -402 793 738 -49
532d9J074j93j219O45n59k54j01O4J45l17J09Q10k00l51J430o37l38J074l10o36
$$ -49 1025 832 -387 258 -301 -555 -656 -592 -447 -764 -655 155 -45 -396 1034 397 59 1133 823 187
552A87N47n90k81j56lK19l91m57M79J05n82J093l76j88L05K84L01M7m29R33o06
$$ 187 734 144 -137 -293 -296 -77 -468 -925 -446 -341 -923 170 -206 -394 -89 195 496 543 114 1047 441
573D41n80J312p34j097M50J04o80R7M30m63j81K73J019o69J94J187n84r3P09l15
$$ 441 -139 1173 439 -658 -208 -104 -784 -687 -257 -720 -901 -628 391 -278 -84 1103 519 426 1135 820
593H20l74p9k18K7j50n03L22J84q77L49j42J92K3P4J50K72j86Q81J6m17L43L9
$$ 820 446 367 149 176 26 -477 -155 29 -848 -499 -641 -449 -426 -352 -202 70 -116 765 781 364 707 746
615G46o11P75o84o60K57k56j54Q2o8j07L60k69J83L54L32L06m95K09M92j79j68
$$ 746 135 910 226 -434 -177 -433 -587 -505 -573 -680 -320 -589 -406 -52 280 586 91 300 792 613 445
636D45N19r88L15k40l54K64l9j74j02m74N14J53m28L20L42l5K40K05J35M5Jn90
$$ 445 964 -24 291 51 -303 -39 -78 -252 -354 -828 -314 -161 -589 -269 73 38 278 483 618 663 664 74
658G4J52k02j0Q4l21oO3m45L30k31R3J00J93R7L26j62K14K80k84M4k5L2k83N1
$$ 74 226 24 14 98 -223 -229 -166 -611 -281 -512 -419 -319 -126 -29 297 135 349 629 345 389 364 396 113 164
682A64j71r4p8k24j4L5o4N6j82L31O10m82M85Kp1O8j05Q2mj42k60K04l67R0P0
$$ 164 -7 -101 -179 -403 -417 -382 -446 -390 -572 -241 369 -113 372 374 303 371 266 348 344 202 -58 146 -221 -131 -61
707f1o39M45k5j58M41k37K13J18Q9M3L12k89j31K07l83M44m7l65o4Ok20L93k46
$$ -61 -700 -255 -280 -438 3 -234 -21 97 186 229 541 252 121 328 -55 389 342 -23 -87 -81 -301 92 -154
730a54k51M70r1K25l07J10l2M88k88r2K87j40J22o82L77R2j51j16P4j71J73n2
$$ -154 -405 65 -26 199 -108 2 -30 458 170 78 365 225 347 -335 42 134 -17 -133 -59 -230 -57 -109
752a09K12j61L90n30L69q7j12L47n76M26k39l2J62J00m27K26R0q8K62l14J18J62
$$ -109 103 -58 332 -198 171 84 -28 319 -257 169 -70 -102 60 160 -267 -41 49 -39 223 -91 27 189
774A89k83L26q9k95L40j79M3m0Q8j54Lq0K58k31K42k68J65m9K28m30N8K2L13j42
$$ 189 -94 232 143 -152 188 9 52 12 100 -54 -51 -131 127 -104 138 -130 35 -14 214 -216 -158 -136 177 35
798C5K68k51n3J31n48L76k35J26O3J81j59j65J36J98p2k33K99o9n4p3J28J81l99
$$ 35 303 52 -1 130 -418 -42 -277 -151 -88 93 -66 -231 -95 103 31 -202 97 28 -26 -99 29 210 -189
821a89L60l19J02J25l38L20J35l75K00j69J04K33q5j13K75m77L20j05K21q1J85
$$ -189 171 -148 -46 79 -259 61 196 -179 21 -148 -44 189 104 -9 266 -211 109 4 225 144 329
842C29m68M0r7J38M1j54M75q35K06K71O9q3J56J00K12j39l58M16l31J20Q9l77
$$ 329 -139 -99 -196 -58 -17 -171 304 -531 -325 -54 15 -68 88 188 400 261 -97 319 -12 108 197 -180
864a80q4N06n00K35M8j28M0J84K4M4m2j54k51K17j07J09J03P9M7n4j87r6K32j87
$$ -180 -264 242 -258 -23 25 -103 -63 121 145 189 147 -7 -258 -41 -148 -39 64 143 190 136 -51 -147 85 -102
888a02J68m8L6m0k75j08K18K18R3j04K02j55M8L5k53O6K72k7k68N17m91j96L13
$$ -102 66 18 54 14 -261 -369 -151 67 160 56 258 103 151 186 -67 -1 271 244 -24 493 2 -194 119
911A19k76M4j12J36L1j74K90K29m79K16O2J36P3j83R0l29jK87r3r6o7J78m11K45
$$ 119 -157 -113 -225 -89 -58 -232 58 287 -192 24 86 222 295 112 202 -127 -128 159 66 -30 -97 81 -330 -85
935h5N9p2k48K90j67J83L07j07J91m26K71J32m85L27k00N4J55l61j3N6K97m64
$$ -85 -26 -98 -346 -56 -223 -40 267 160 351 -75 196 328 -157 170 -30 24 179 -182 -195 -139 158 -306
957c06K70k0k7k93O21l54J93j17nO0J90k12J90l43J51k07K98j39l2J56j50l2J06
$$ -306 -36 -56 -83 -376 245 -109 84 -33 -38 22 212 0 190 -153 -2 -209 89 -50 -82 74 -76 -108 -2
980bo0k05L36N7j52J93j69L10N6l25n6J1J78k05l3J21l50K10L46j15j34P2Q6k26
$$ -2 -62 -267 69 126 -26 167 -2 308 364 39 -17 -6 172 -33 -66 55 -295 -85 261 146 12 84 170 -56
1004e6k8K07j27m2K93k23K61j03j30J11l83R8J22n2j23P4N5J2J57k72L7j34L50
$$ -56 -84 123 -4 -46 247 24 285 182 52 163 -220 -122 0 -52 -175 -101 -46 -34 123 -149 -112 -246 104
1027A04n4j98K98j49j12K69j08L3ML8o2J59r9k10J25l1j43K82j8J61o08K33J24
$$ 104 50 -148 150 1 -111 158 50 83 87 125 63 222 123 -87 38 7 -136 146 128 289 -319 -86 38
1050C8k16L85j18j56P1k81M30j82R0k52J93j17J41p0R2Q4o0O6m3j64J17m4K65
$$ 38 -178 207 89 -67 4 -277 153 -29 61 -191 2 -115 26 -44 48 132 72 138 95 -69 48 4 269
1073B69l67Q9j63J65j27K75k30P5K64kj56j82N2l3j52K77j01K31j31pk9J27J18
$$ 269 -98 -9 -172 -7 -134 141 -89 -14 250 248 92 -90 -38 -71 -223 54 -47 184 53 46 17 144 262
1096B62M0l59j99K82J71j54k24J79j54Q9J29j82K27k22K44m5k45Q6LN0J75p6k7
$$ 262 302 -57 -256 26 197 43 -181 -2 -156 -67 62 -120 107 -115 129 84 -161 -75 -72 -22 153 77 50
1119E0jj52J24j93L10q3K69j15q3k3M9M9o6k74j3J49o6K07j1o50L88K95k5r8j38
$$ 50 49 -103 21 -172 138 55 324 209 126 103 152 201 135 -139 -152 -3 -69 138 127 -523 -135 160 135 37 -101
1144a01r7K98j76qL0pj26K03k00Q8K37k04Q9J52j21j27L52k09p3o9R8j10P6O6
$$ -101 -198 100 -76 -84 -54 -61 -187 16 -184 -96 141 -63 26 178 57 -70 282 73 0 -69 29 -81 -5 61
1168F1r3R6l5o4J63N7k23r0M00l92K38o8J21j17k77L46n05L34P3l27L63k80K15
$$ 61 -32 64 29 -35 128 185 -38 -128 272 -120 118 50 171 54 -223 123 -382 -48 25 -302 61 -219 -4
1191dJ83Q4q1k63J10L36k34j65J75J9k37m3N18k55j39J39Q8m82K03J03o4P0O8
$$ -4 179 263 182 -81 29 365 131 -34 141 160 -77 -120 398 143 4 143 231 -251 -48 55 -9 61 129
1214A29k49J10J60j55J60j8M7l08J08J65p6j01m5kj66Mj4L28r1k09K42n7J91j3
$$ 129 -120 -10 150 -5 155 137 184 -124 -16 149 73 -28 -73 -75 -241 -237 -251 77 -14 -223 19 -38 153 140
1238A40j84Q8J23q5j99p1J40k14M93k22L3J21r9J8q4J6N3q5L61j76j34j48K67
$$ 140 -44 44 167 82 -117 -188 -48 -262 231 9 42 163 64 82 -2 14 67 -18 343 167 33 -115 152
1261A52j82j08J8L15J55n48j87O00N2m85J70K0k9J09j06k02L63J50m69K54Oj45
$$ 152 -30 -138 -120 195 350 -198 -385 215 267 -218 -48 -28 -57 52 -54 -256 107 257 -212 42 48 -97
1283i7J69K52q3j75j99MK43j25k32J94K39k61L2mp3J55j10M0P8M0P3l26K95j52
$$ -97 72 324 241 66 -133 -129 114 -11 -243 -49 190 -71 -39 -43 -116 39 -71 -31 47 87 160 -166 129 -23
1307b3J24k64QK28k3L9nl2n6L4K0l17L59n1j75M1P9q9J31Q2j06K20K3k40j1j25
$$ -23 101 -163 -155 73 50 89 84 52 -4 30 50 -267 92 41 -134 -93 -14 -103 28 110 4 224 247 7 -4 -129
1333a29O6j56n5M84l10Q7m4M2j20K21M0j68K89m29J64N81m32l0j02J99k7o03L50
$$ -129 -63 -219 -274 210 -100 -13 -57 -15 -135 86 126 -42 247 -182 -18 563 131 101 -1 198 171 -432 -82
1356h2J9N4j29J45R3m57L99J07k64J84O7L3l16M60k74l65L27j62j2L59k31J49
$$ -82 -63 -9 -138 7 100 -357 42 149 -115 69 136 169 -147 313 39 -326 1 -161 -173 186 -45 104
1378A04p9Jk70K48k6RO1K0k52L25K1m1n9k18n5K88J11k48L41j09j54J91j63J01
$$ 104 25 26 -244 4 -22 -13 48 68 -184 141 162 121 62 -156 -211 77 188 -60 281 172 18 209 46 147
1402A47k24K10l85J58j93L44r4m7r3O1M05m20J94j55K53j16j60j66M73k97L48
$$ 147 -77 133 -252 -94 -287 57 -37 -84 -177 -116 289 -131 63 -92 161 45 -115 -281 192 -105 243
1423B43j18k34J94o1M4k4m5r3k02J95K82j38P0m5p6N9K7j62K42k79K96j10nj26
$$ 243 125 -109 85 24 68 44 -1 -94 -296 -101 181 43 113 68 -8 51 78 -84 158 -121 175 65 60 -66
1447f6J71K4p4O0M3l77K19kpJ01l17K06J53j27J91n0J33q4J15l09l38J05K18k61
$$ -66 105 129 55 115 158 -219 0 -2 -9 92 -225 -19 134 7 198 148 281 197 312 3 -335 -230 -12 -273
1471b73L27j48k07J62J74J3o1O0O5j56RJ36m3j55P0K33j77nO6k68M25k56j18l4
$$ -273 54 -94 -301 -139 35 48 -13 47 112 -44 -35 101 58 -97 -27 206 29 24 90 -178 247 -9 -127 -161
1495a61K1K33P4j3j27R1N0k56K51N1m26J04k0J75k51K31N3j90j89K25K09j33j23
$$ -161 -140 93 167 154 27 118 168 -88 163 214 -212 -108 -128 47 -204 27 80 -110 -299 -74 135 2 -121
1518a21J46j42J31O1r4j7J39j02m1K16j48N4k25J05q7j35K66j24M0M26m27j45
$$ -121 25 -117 14 75 -19 -36 103 1 -40 176 28 82 -143 -38 -125 -260 6 -118 -78 348 -79 -224
1540b24J23nL68k43K18l71R8L59q3k46J58o9Q2Mj72Rn4QL9j44%J72O1rL4J40l20
$$ -224 -101 -106 262 19 237 -134 -36 323 240 -6 152 83 165 169 -3 6 -48 -40 -1 -145 -145 27 88 79 113 253 -67
1567f7j2J66Q7l29J35K23j92J30k07K06p4k07J22M9j36J41K9k1r1J48j0l08J59
$$ -67 -79 87 174 -155 -20 203 11 141 -66 140 66 -141 -19 30 -106 35 64 43 -48 100 90 -218 -59
1590e9K53L0m12J60K27P3l04M0K74k93j81K35j6M6j76l4jJ13J58n4K44l59J68
$$ -59 194 224 -188 -28 199 272 -32 8 282 -11 -192 43 27 73 -103 -137 -138 -25 133 79 323 -36 132
1613A32j93j73R5K52p0j39j48J53l3j14J68J84q0J67k25J14O8j38J64k68j34M39
$$ 132 -61 -234 -139 113 43 -96 -244 -91 -124 -238 -70 114 34 201 -24 90 158 20 184 -84 -218 221
1635B21k01P3k25L44k19L3k7N3k15O5M9K51j58l02L13Q9k88K73L0j1j84K98k53
$$ 221 20 93 -132 212 -7 26 -1 52 -163 -98 -49 202 44 -258 55 144 -144 129 159 148 -36 262 9
1658IN6K2j30L6j63J55J37K4j2K1j23L8M8r0l6K8J57j2kk32J57N0jk5j95j8N4
$$ 9 65 87 -43 -7 -170 -15 122 146 134 155 32 70 118 28 -8 20 177 165 163 -69 88 138 137 112 -83 -101 -47
1685d7q2J35J18j52L02k11j12K34j23R1j97j07K92l9m1KQ6j78j54J91l7K8l4O0
$$ -47 -129 6 124 -28 274 63 -49 185 62 153 -44 -151 141 102 61 63 149 -29 -183 8 -29 -1 -35 25
1709B5J6L8J70m19J10ok00M90j80J94p6J8j99j73QL45l94L11j46P3j23M2r3Q1
$$ 25 41 79 249 -170 -60 -66 -266 224 44 238 162 180 -19 -192 -184 161 -233 78 -68 5 -118 -76 -169 -88
1733h8Q8m6o7kJ8k51L71j06r9J70Q6j17K02K8q2l40J94J02M6k23J12J31j00k8
$$ -88 0 -46 -113 -115 -97 -348 23 -83 -182 -12 74 -43 159 187 105 -235 -41 61 107 -116 -4 127 27 -1
1757aj7j00K61r8m3O2j31l78M87m13L43n5J12k7k6n5p3J04j44R1L77p1j30j05
$$ -1 -18 -118 143 45 2 64 -67 -445 42 -371 -28 -83 29 2 -24 -79 -152 -48 -192 -101 276 205 75 -30
1781c0oJ90j25j44J72o1j15J78l1n3k38K90o9rL1j48J60r3J18P5k29J95o8k04
$$ -30 -36 154 29 -115 57 -4 -119 59 28 -25 -263 27 -42 -51 -20 -168 -8 -101 17 92 -137 58 -10 -214
1805b14M10j97j03O8L01k05Q0j50q4K64l53L53j22j32N9R1k15J92j47J21K16p6
$$ -214 196 -1 -104 -36 265 60 140 -10 -94 170 -183 170 48 -84 -25 66 -149 43 -104 17 233 157
1827A57N5q0m62K85m4O8J03j02P3J12j56l6j39L29j98Q6r2k29M18k82M2L2j36
$$ 157 212 132 -330 -45 -89 -21 82 -20 53 165 9 -27 -166 163 -35 51 -41 -270 148 -134 -92 -60 -196
1850a96K29Oj31m1M7J24M4m0j44J50j80L00q8j09J69k34J56J14l75RK96m25L41
$$ -196 33 39 -92 -133 -86 38 82 42 -102 48 -132 168 80 -29 140 -94 62 176 -199 -190 106 -319 22
1873B2J01k95k9K50R8r1O1q7P1j03J59n29L57P5k92L85j35k12N24j92J05K2l23
$$ 22 123 -172 -201 49 147 56 117 30 101 -2 157 -372 -15 60 -232 153 18 -194 330 138 243 265 -58
1896e8nK3k50L14L7j96J87P6j59q4Nj56K05O6j89M7J74k43M15k56L58m17K00j98
$$ -58 -63 -40 -290 24 61 -135 52 128 -31 -115 -110 -266 -61 5 -184 -137 37 -206 209 -47 311 -106 94 -104
1920a04L52j96k40R0K23N7k72kJ05M0l8J82k11K62k64j76J54L35l41J72K0J21
$$ -104 248 52 -188 -98 125 182 -90 -92 13 53 15 197 -14 248 -16 -192 -38 297 -44 128 148 269
1942B69n75J18K29p9j72M0M0K69Q1m76J60J22P4l9l7L6j55J2j53J82j17J72l1
$$ 269 -306 -188 41 -38 -210 -170 -130 139 220 -256 -96 26 100 61 24 60 -95 -83 -236 -54 -171 1 -30
1965c0K2J07q1j6Q6n4l11J67O7L2p4j13K63J7Ll58M28j52O1k63L02m4k3r0M0n7
$$ -30 -8 99 18 2 88 34 -277 -110 -43 -11 -85 -198 65 82 85 -273 155 3 64 -199 103 59 36 -54 -14 -71
1991g1L46j71k10%O4N6L4j27L3O2j68q5J47J16k3LQ1O4j83Rn7J93m36M61j82p2
$$ -71 275 104 -106 -106 -42 14 48 -79 -46 16 -152 -237 -90 26 3 6 87 151 -32 -23 -80 113 -323 138 -44 -116
2017a16J97k38J69L7m42L99P1j1K37l37n6K55j87k77P6J64J24q2j65J14J53J4
$$ -116 81 -157 12 49 -393 6 77 66 303 -34 -90 165 -22 -299 -223 -59 65 -17 -182 -68 85 99
2039I9O1k10R3j75K02J09j81J39k56K52j27L08l49M8J2J29oj55L61l99K65l69
$$ 99 160 -50 43 -132 70 179 -2 137 -119 133 6 314 -35 13 25 154 148 -7 354 -45 220 -149
2061a49l2K82k09r7J71J78k6J9l96J85K43k80k16L23j92J16J77m6o3j7L6j19J72
$$ -149 -181 101 -108 -205 -34 144 118 137 -259 -74 169 -111 -327 -4 -196 -80 97 51 -12 -29 7 -112 60
2084F0j57NK2J1L0J8m0J25Lk86K95J04q6M0k32O3M7j47R0n5r6M6K51l5j20j37
$$ 60 -97 -92 -70 -59 -29 -11 -51 74 77 -209 86 190 104 144 -88 -25 22 -125 -35 -90 -186 -140 111 76 -44 -181
2110a81j05j7M04j98J45k29M33k28l7N3J8j02J1J96J47j49l72K56p1n4j4K11l3
$$ -181 -286 -303 101 -97 48 -181 252 24 -13 40 58 -44 -33 163 310 161 -211 45 -26 -80 -94 117 84
2133H4J21k34J9J4PL00k82k37K74j21p0Q8o8P2K11k27qo5K69j52R8k70K22k5j78
$$ 84 205 -29 -10 4 11 311 29 -208 66 -55 -125 -37 -105 -33 178 -49 -57 -122 147 -5 93 -177 45 20 -158
2158a58L55k09k02J05j93K2P6O8O7QJ54J1K6j4j47k40M56q8J4N7J2k75J98k41
$$ -158 197 -12 -214 -109 -302 -280 -204 -136 -69 -61 93 104 130 116 -31 -271 185 97 111 168 180 -95 103 -138
2182a38k8m7q0J89j12mp0O39l83K01k60j4J59q6M8O8q8J62j53k3L3q6J05K43n32
$$ -138 -166 -213 -293 -104 -216 -220 -290 349 -34 167 -93 -107 52 -34 14 82 -6 156 3 -20 13 -73 32 275 -257
2207b57m1K85J03J46k56J65j54K81l11P9M6j8K5m16L95J47k24J77k6j76J68J4
$$ -257 -298 -13 90 236 -20 145 -9 272 -39 40 86 68 93 -323 72 219 -5 172 146 -30 138 152
2229A52j63J0P5N7lr7Q8j90l53K46K15K73n13K5L09j62k0K25l03O0l7J90l9n4
$$ 152 -11 -1 74 131 128 31 119 -71 -424 -178 37 310 -203 -178 131 -31 -51 174 -129 -69 -106 84 45 -9
2253iJ81l08R6K9k21M0K45J7j18K94o82K74J49p9l2J0J65n6N0j84M36l00L2K1
$$ -9 172 -136 -40 -11 -232 -192 53 70 -48 246 -436 -162 -13 -92 -124 -114 51 -5 45 -139 297 -3 29 50
2277E0r1J75p0K2n3J7J41j62m17K13J63j76K12m6q1J13j46J17L41j24k40K26k24
$$ 50 -41 134 64 86 33 50 191 29 -388 -175 -12 -188 24 -22 -103 10 -136 -19 322 198 -42 184 -40
2300d0P7n5L01n49L02j52J47J3m48M81o2k82L42l5J4o7J09J1n02J64J32O7p5K94
$$ -40 37 -18 283 -266 36 -116 31 44 -404 77 15 -267 75 40 54 -13 96 107 -395 -231 -99 -32 -107 187
2324A87j17j70K4l8J60k15J01j45J50J42k92M62l17lL25j99J73j00q4L3J8q6P6
$$ 187 70 -100 -76 -114 46 -169 -68 -213 -63 79 -213 249 -68 -71 254 55 228 128 44 77 95 9 85
2347H5J08k94P7j49K36m8j82K61p8o6J04p7K11l18K33J67m41J06o4k13K76k48
$$ 85 193 -101 -24 -173 63 15 -167 94 16 -50 54 -23 188 -130 103 270 -171 -65 -129 -342 -66 -314
2369c14K83j1J6k30L04r8L4m2l5O0L2N4J07Pj92m20K84M3m7N14m72K52j25p5M6
$$ -314 -31 -42 -26 -256 48 -50 -16 -58 -93 -33 -1 53 160 167 -25 -445 -161 -118 -165 349 -123 129 4 -71 -25
2394b5Q2k68L08j24j24L43l0j31j98j77K94R8l7j08q0K68k8j07R2m2lj11N6k26
$$ -25 57 -211 97 -27 -151 192 162 31 -167 -344 -50 48 11 -97 -177 91 63 -44 48 6 3 -108 -52 -278
2418b78K6J40j41L58p3k41L20k20K65j26J02j65kQ5n8K04j48r1k2K34k03j4n7
$$ -278 -252 -112 -253 105 32 -209 111 -109 156 30 132 -33 -35 50 -8 196 48 -43 -65 169 -34 -48 -105
2441a05K86k2j93n3J83J44k22LJ72o1j57K5Mn7J54k87J52p8O1K61k36lJ10j71
$$ -105 181 159 -34 -87 96 240 18 21 193 132 -25 0 4 -53 101 -186 -34 -112 -51 210 -26 -29 81 -90
2465i0P8J07j28n4J9K63j55r2J91k15L83j80l44K37o3j90L42J21q1k17J85j59
$$ -90 -12 95 -33 -87 -68 195 40 -52 139 -76 307 127 -217 20 -43 -233 109 230 149 -68 117 -42
2487d2J41k33N3L97l18j1k08K36Q4O4k93OJ21j09K24j81j21J14J37j84J84n8j05
$$ -42 99 -134 -81 316 -2 -13 -221 15 99 163 -130 -124 -3 -112 112 -69 -190 -76 61 -123 61 3 -102
2510a02J49M8P1J6kq0Q9k47J20k59R0K48r6l7K8J40j46K20K9l39K10j81q4J24
$$ -102 47 95 166 182 180 100 189 -58 62 -197 -107 141 45 8 36 176 30 250 279 -60 150 -31 -115 9
2534Ij12OL5K79j31L56l67N9k89K52j65O6J83n2j1m0k85K44J0j8j48L53k68J89
$$ 9 -103 -97 -62 217 86 442 75 134 -155 97 -68 -2 181 129 118 78 -207 37 47 29 -119 234 -34 155
2558A55j58R9J83p6l17J3J38n3r1p1M34j22j48O6l4J41m3k55L32k32K69k40K22
$$ 155 -3 96 279 203 -114 -101 37 -16 -107 -178 256 134 -14 52 18 159 116 -139 193 -39 230 -10 212
2581B12m03J29K39j99K7o5J46m73M68J37j89k35J00K22l28J08P0K27j58l43L81
$$ 212 -191 -62 177 -22 5 -60 86 -387 81 218 29 -206 -106 116 -212 -104 -34 193 35 -308 73
2602G3JJ08l38R3K90j60J25l51r6N52k31o8J41l1j89J67n5r5R0p4J48k01l43L33
$$ 73 74 182 -156 -63 227 67 192 -159 -255 297 66 -2 139 108 -81 86 31 -64 26 -48 100 -101 -444 -111
2626a11K08O0k60K4L31j98n0M7k31J56K9M6j56R3n1P5j1L4K01n9p9P3k1k64K96
$$ -111 97 157 -103 -79 252 54 4 51 -180 -24 5 51 -105 -12 -63 12 1 35 236 177 98 171 150 -114 182
2651A82n27L07k01J76M07k51k28J60J84m37L65k28L3qJ23j64J67k05K37k6j44
$$ 182 -345 -38 -239 -63 344 93 -135 25 209 -228 137 -91 -58 -66 57 -107 60 -145 92 66 -78
2672g8K16q3j49P5J5m30M20M9p5J24q6J7JK0LK49l20J02j04J60l4J15%k01m5M5
$$ -78 138 55 -94 -19 -4 -434 -14 35 -40 84 -2 15 16 36 39 288 -32 70 -34 126 92 207 207 6 -39 6
2698Fj68L9J56l22J36M3J98o7j39J15J3k13L48k04K63o2k41J32j25L29k41J25
$$ 6 -162 -123 33 -289 -153 -110 88 21 -118 -3 10 -203 145 -59 204 142 -99 33 -92 237 -4 121
2720A21p4p7j50J48o4P1j85lM0K79J79m09J71j7N4J69k71J92l8J27J47k32j98
$$ 121 47 -30 -180 -32 -96 -25 -210 -213 -173 106 285 -124 47 30 84 253 -18 174 136 263 410 178 -20
2743b0J29N2J8j9r6j24J02j97K21L0J8j42m4L1j47j2K66N0m04M68k2j62j21K7
$$ -20 109 161 179 160 64 -60 42 -155 66 96 114 -28 -72 -41 -188 -200 66 116 -288 180 158 -4 -125 -98
2767i8J28j48K5K2K7J22n2Q5p9pQ3j63K36j2k24J18P4J81l18J70m15l1L79j95
$$ -98 30 -118 -93 -71 -44 78 26 111 32 25 108 -55 181 169 -55 63 137 318 0 170 -245 -276 103 -92
2791i2O3K80j40j40J94k99O4J63J14k87K30J26k72J11k03J51M0K34j91M9k99N1
$$ -92 -29 251 111 -29 165 -134 -70 93 207 -80 150 276 4 115 -88 63 103 337 146 195 -104 -53
2813e3j25L25n7j63J85j56Q6j25K16J31k07p9J41l90K46j30J6L01j76j23K43M5
$$ -53 -178 147 90 -73 112 -44 42 -83 133 264 57 -22 119 -271 -25 -155 -139 162 -14 -137 106 151
2835A51n3k08J45N1j8K0j64J51m4K04m4K7n5k21j5J09j55N7k39L44m35O00k81
$$ 151 98 -110 35 86 68 88 -76 75 31 235 191 218 163 -58 -73 36 -119 -62 -301 43 -392 208 -73
2858g3K66l75L48k04m9L88k20K84n19K8K04k36K4K18k88L38o8l03K22J80l51K60
$$ -73 193 -182 166 -38 -87 301 81 365 -154 -126 78 -158 -134 84 -204 134 66 -237 -15 165 -186 74
2880G4j40j78L6K50J33n59M11n8J43r2k90L31k83L18k8ll20N05l28j03K05J57
$$ 74 -66 -244 -208 42 175 -384 27 -31 112 20 -270 61 -222 96 68 65 -255 250 -78 -181 24 181
2902A81k99K25Jl6j05q3J03K23l89K44L3j45L56j92k51J80j3K36lj19k45m2Q2
$$ 181 -118 107 108 72 -33 -116 -13 210 -179 65 98 -47 309 117 -134 46 33 269 266 147 -98 -140 -58
2925e8K56j85N3k43j99L67n3jn5O3q3j54K94J14j13J10j34J6R2o1l0j05M8J36
$$ -58 198 13 66 -177 -376 -9 -62 -63 -118 -55 -138 -292 2 116 3 113 -21 -5 87 26 -4 -109 -61 75
2949G5k69J44K27l62K45j03J11j39L19l91K00m2j2L3K93j86k13L27k40j02N0J97
$$ 75 -194 -50 177 -185 60 -43 68 -71 248 -143 57 15 3 36 329 143 -70 257 17 -85 -35 162
2971A62k0l51n3M47l29M45m78o5O36m91k58L47k87L48k26J52k09L28j4k07J7J3
$$ 162 142 -209 -262 185 -144 301 -177 -242 394 -97 -355 -8 -295 53 -173 -21 -230 98 84 -123 -106 -93
2993i3K04K52l77k7q3R6K68k02m91L60n5K63n7l71J24j03L29j22r5J25J64K4l67
$$ -93 111 363 -14 -41 -124 -28 240 38 -453 -93 -148 115 58 -313 -189 -292 37 -85 -180 -55 109 133 -234
3016b34J78J55k60L74j35O3l3l79N29j93j71L29l06J66j72L44O1l66O0pr1L24
$$ -234 -56 99 -161 213 78 141 108 -271 258 65 -106 223 -83 83 -89 255 316 -50 10 3 -88 236
3038B36K5l72j64L87m8Q0m03J16L64m30M06n08K77J42o3p5jj13O0K41k00k19L44
$$ 236 261 -111 -275 112 64 144 -259 -143 221 -209 197 -311 -34 108 45 -30 -31 -144 -84 157 -43 -262 82
3061H2k08K22J24Q8l52J88n3J54l33j26J39m5L75l56o0L62k62lK0j26L87k42K34
$$ 82 -126 96 220 308 -44 144 91 245 -88 -214 -75 -120 255 -101 -161 201 -61 -64 -44 -170 217 -25 209
3084B09k17n8m2K14K8l44L7R2K47n7l44j09L13P0j38M27l39J23k83K43k6j90J8
$$ 209 -8 -66 -108 106 134 -210 -173 -81 166 109 -235 -344 -31 39 -99 328 -11 112 -171 72 46 -144 -126
3107a26N8Q4l1K02l32K00k80L60j20n5j43L16k05j58K27L0R0j76K54j75r4j23
$$ -126 -68 16 -15 187 -145 55 -225 135 15 -40 -183 133 -72 -230 -3 27 117 -59 195 20 -74 -197
3129a97L53l00J39j98J77K29k28Q8j95M49k95P2r5J51j2j07j2k90L43L70n47J25
$$ -197 156 -144 -5 -203 -26 203 -25 63 -132 317 22 94 -1 150 138 31 19 -271 72 442 -105 20
3151B0j29j01M17lj70L6p9L49o28L14k9r7M62n41k6N18m90O5l0j42L62k45J13
$$ 20 -109 -210 207 204 34 70 -9 340 -288 26 -3 -100 362 -179 -205 313 -177 -112 -142 -284 78 -167 -54
3174e4K02J76k40k27j6R1K63O7m28P7L0J67k65K51j33L6J30Q9j17R7j96L2J49
$$ -54 148 324 84 -143 -159 -68 195 262 -166 -89 -59 108 -157 94 -39 -3 127 216 99 196 0 32 181
3197A81m43R2K82k94M8K44J16r2j82J08J88j46K2j90j5j03p0l7L18o3j52P7k49
$$ 181 -262 -170 112 -182 -134 110 226 134 -48 60 248 102 124 -66 -81 -184 -254 -291 27 -36 -188 -111 -360
3220c60L20j37L33l32J59n9N9L2L5R2j77K28j24j70K9L34k10j26J84p3p6K63k8
$$ -360 -40 -177 156 -176 -17 -76 -17 15 50 142 -35 193 69 -101 -72 262 52 -74 110 37 -39 224 196
3243A96j19JO4j89J27j95Q6O7n8K48k71lj20J67K28q4J30J5r8j93k92J27L12j72
$$ 196 77 78 142 -47 80 -115 -29 38 -20 228 -43 -46 -166 1 229 145 275 290 192 -1 -293 -166 146 -26
3267b6n5O1k38J87n2j91N18l06L51k32r8k2l2pJ44L4J98l89K21P0j78n1l5K38
$$ -26 -81 -20 -258 -71 -123 -314 204 -102 249 17 -81 -103 -135 -142 2 36 234 -155 66 136 -42 -93 -128 110
3291A10L2m4o6J41j16q0Q4n9l28L22j2q9l4O0pJ98j91M0j34m7J11q0K09j52P6
$$ 110 142 98 32 173 57 -23 61 2 -326 -4 -16 -105 -139 -79 -86 112 -79 -39 -173 -220 -109 -189 20 -132 -56
3316e6J92qJ80m00K2K19l03L22l09L49j97l2J04J05l01J57j90J77n6J37l1k85
$$ -56 136 128 308 -92 -70 149 -154 168 -141 208 11 -21 83 188 -113 44 -146 31 -25 112 81 -204
3338b04L02k07K4q0N05j62n0J83l03jN9j40K86l32J78k04K99k24J19%Q4l4o2j50
$$ -204 98 -109 -85 -165 340 178 128 311 8 7 66 -74 212 -120 58 -146 153 -71 48 48 132 98 36 -114
3362a14J52m00L74J9L16k45q2j21O4J01Lp2K54k13J88j63k03k5L11j16j02K55
$$ -114 38 -362 12 31 347 102 20 -101 -37 64 67 -5 249 36 224 61 -142 -167 144 28 -74 181
3384A81l03J74j6k62K82k5j94L77l46L39k72R2N1k18J48Q2k63R7q5J54k6L21k12
$$ 181 -122 52 36 -226 56 31 -163 214 -132 207 -65 27 78 -140 8 90 -173 -76 -161 -7 -33 288 76
3407G6J38j77m29K32J70j06K16L8k86J35k15J45K7j8K99k70K48n27J67K59q9j85
$$ 76 214 37 -392 -160 10 -96 120 158 -128 7 -208 -63 -36 -54 245 -25 223 -304 -137 122 33 -152
3429a52L05K5j81J93k20J00k38N8J53j64K07OJ02j10Q5k28m4J4m3MK8J95k95M24
$$ -152 153 178 -3 190 -30 70 -168 -110 43 -121 86 92 194 84 169 -59 -103 -89 -132 -128 -100 95 -200 224
3453B24m51M26m57J84J47J89j60j15J5q7J38j75j78K49l4J50k22L07jl61J12J24
$$ 224 -227 199 -258 -74 73 262 102 -13 2 -85 53 -122 -300 -51 -85 65 -157 150 149 -212 -100 24
3475B4j10r5J54m0Q0n2O0J08j88j05J00M1j50Q6M85k63P8J02k33J61l31k53M09
$$ 24 -86 -181 -27 -67 13 -39 21 129 -59 -164 -64 -23 -173 -87 398 135 213 315 82 243 -88 -341 68
3498F8Kj81J48m8j41J07m5K05K12n15K12j17j11K35l90L51J49J52n7j00ok12R8
$$ 68 70 -111 37 -11 -152 -45 -90 115 327 -188 24 -93 -204 31 -359 -8 141 293 236 136 130 -82 16
3521A6K49k61K88l52M2J06O2p4K15j98nOr0j73N6K14J74k13j05r9R6O0K34k5q8
$$ 16 265 4 292 -60 -18 88 150 76 291 93 88 94 4 -169 -113 101 275 62 -43 -142 -46 14 248 223 135
3546A35m02M83j39J2l4m00K56J14M4l12K32j52l8J7O6o4K91m5j67L3l2M65l97
$$ 135 -267 216 77 89 55 -345 -89 25 69 -243 -11 -163 -201 -184 -118 -182 109 64 -103 -70 -102 363 -34
3569c4n6p8L35l12j86K81J41n7J25k90k4K11p9n6k34M31j58L71k24j21J83k44
$$ -34 -90 -168 167 -145 -331 -50 91 34 159 -131 -155 56 -23 -79 -313 118 -40 331 107 -14 169 -75
3591g5K13p3J3j65J3K79k10k34J77J34j04k16M95k64n2k8J1O2K1j17L78j56k62
$$ -75 138 65 78 -87 -74 205 -5 -239 -62 72 -32 -248 247 -17 -69 -97 -86 -24 -3 -120 258 102 -160
3614a60N9J06K48P3k18%M6l43J27J93m09L20l9n1K16q7J38j12j41QL9n0K47o4
$$ -160 -101 5 253 326 108 108 154 -189 -62 131 -278 42 3 -48 168 81 219 107 -34 -26 13 -37 210 146
3638A46l7r2r7J72j95Q4J20l99J26K85k2L2K28k20k7l3K12l60J62j31j79L69n
$$ 146 109 17 -80 92 -103 -19 101 -298 -172 113 91 123 351 131 104 71 283 -77 85 -46 -225 144 139
3661A39j01m6k25L87Q8k02j5k5l27K43L51j22j98J53K69m39l7p4O7R1J18k8l1
$$ 139 38 -8 -233 154 242 40 25 0 -327 -84 267 145 -53 100 369 -70 -107 -181 -114 -23 95 67 36
3684C6m7MJ13M4M1J08q6l05l3jJ51R0k67M30l09j7p4L91k89k7j5n4J87J30k23
$$ 36 -11 -7 106 150 191 299 213 -92 -125 -126 25 115 -152 278 -31 -48 -122 269 -20 -47 -62 -116 71 201 -22
3709b2nK09l15K85k5Q3k57R2k64L01l38K92J90l79K31K96l94J87j90L7K35j47
$$ -22 -27 182 -133 152 127 210 -47 45 -219 82 -256 36 226 -153 78 374 -20 167 -23 14 249 102
3731A02M8r0K4j42J69j08p3R6J33l9m0O9j91j42J12o0n2M20k19p5L93l28k33J91
$$ 102 150 60 84 -58 111 3 -70 26 159 120 80 149 -42 -184 -72 -132 -184 236 17 -58 335 7 -226 -35
3755c5M8qL48m43P1p1M60l13k0K40n29K44RJ70p5k73j21K73k6J54k0j93j22K14
$$ -35 13 5 353 -90 -19 -90 370 57 37 277 -252 -8 1 171 96 -177 -298 -25 -51 103 83 -110 -232 -18
3779a8J4L66l65P9n1r9O3j25K98j69K62k87k6Q8j09Q3j38J86R5k3j7k22Q0J98
$$ -18 -4 362 -3 76 25 -74 -11 -136 162 -7 255 -32 -58 30 -79 4 -134 52 147 124 107 -115 -35 163
3803A63o8j88K99k1l43m0K58m9N2l9P0k49K27j9k83K64R3k09L78k55l3n7m0J81
$$ 163 95 -93 206 185 -158 -198 60 11 63 24 94 -155 72 53 -230 34 127 -82 296 41 8 -49 -89 92
3827I2k18L87k83K06p2l8k06L75k80P2j64R3P3l19K65J5L0p8K32j73l1J58j31
$$ 92 -126 261 -22 184 112 74 -132 243 -37 35 -129 -36 37 -282 -17 -2 28 -50 182 9 -22 136 5
3850Ej06OR0jM0L6j00J43q5r6l9J93k13l9p2J47l0j24K82l92L00l6K54o2K0k67
$$ 5 -101 -95 -5 -6 34 70 -30 113 28 -68 -107 86 -127 -166 -238 -91 -121 -245 37 -355 -55 -91 163 101 121 -146
3876a46j99M98r7j99L18k35L72j56k98L2J12k14J11jJ49k1j18p2L34l07N41k01
$$ -146 -345 153 56 -143 175 -60 312 156 -142 -110 2 -212 -101 -102 47 26 -92 -164 170 -137 404 203
3898B03m42K71m2J65r4J3r2K2k78j31K34K55k25J64J72l96rK0j10K04J34j69J44
$$ 203 -239 32 -10 155 61 74 -18 4 -274 -405 -171 84 -141 23 195 -201 -210 -190 -300 -96 38 -131 13
3921A3k86Q6K84k0K54n74J36J93k09Q3L90m57N8j79M08k09k8LQ0j8j85K93j06
$$ 13 -273 -187 97 77 331 -243 -107 86 -123 -40 350 -107 -49 -228 180 -29 -57 -54 26 8 -177 116 10
3944A0J33K37k97j29OM5R8K31k32j48N04o58L69k09J32J5j01J36k81l2M81l3l28
$$ 10 143 380 83 -46 -40 5 103 334 102 -46 458 -200 169 -40 92 107 6 142 -139 -171 310 277 -51
3967e1J51l03R0nM23l45l00N09l14J13j0J47k37R3o4J52j95J45J80j37kk0K14
$$ -51 100 -203 -113 -118 305 -40 -340 169 -145 -32 -42 105 -132 -39 -103 49 -146 -1 179 42 40 20 234
3990B34j27K8j93M4K00m85O6K03Q0q8q2K44r1L2j60j05K99L3k31j2l8J59J84k88
$$ 234 107 135 -58 -14 186 -299 -233 -30 50 -38 -120 124 33 65 -95 -200 99 132 -99 -111 -149 10 194 -94
4014i4K22j70j4j39J67L2J68j95J78l11j0J25J14n1j45P8K3m0J71l49J87R9j94
$$ -94 128 -42 -56 -195 -28 4 172 -23 155 -156 -166 -41 73 22 -123 -45 -22 -62 109 -240 -53 46 -148
4037a48J24OP1r1K58l06J98J0m7j98J41k21M63l60k3J79j25J42j56J08K43k46
$$ -148 -24 -18 53 -38 220 -86 112 122 75 -123 18 -203 260 -100 -123 56 -69 73 -83 25 268 22
4059B2r1L71m38K57k13o0K05r9k18K02m3n0j8J92q7q4L62j98P1k4O4p4k24J19
$$ 22 -69 302 -136 121 -92 -152 53 -46 -264 -62 -105 -155 -173 19 -68 -152 210 12 83 59 123 49 -175 -56
4083e6j43K72J08Q7l9j93Q7j37K6J55k09J5K36n4n1j42Lj14P7M5l22J22R0K9k6
$$ -56 -199 73 181 268 229 36 123 -14 12 167 -42 -27 209 155 104 -38 -35 -149 -72 -27 -349 -227 -137 -108 -134
4108a34K7j12L09O9L6o7k16K2J97j30m3k9J67j03J15J04k08l0o8J55n8O3J81j00
$$ -134 -107 -219 90 159 195 128 -88 -66 131 1 -42 -71 96 -7 108 212 4 -26 -94 61 3 66 247 147
4132A47j02o8j41l6o3P5K64k6j88O3K26O8m08p8O75l39j14l5O2J77M1l2k38P3
$$ 147 45 -23 -164 -200 -263 -188 76 50 -138 -75 151 219 -189 -267 408 69 -45 -80 -18 159 200 168 -70 3
4156CJ29J4q5K8m1k7j36j93K59K9l39M31P7k36J27K2j76K16P8p0m6k39J7M5l5
$$ 3 132 146 61 89 48 21 -115 -308 -49 -20 -359 72 149 -87 40 62 -114 102 180 110 64 -175 -158 -113 -148
4181a48J53J6l0O7k01K8M44m67O2J70L03l29J39m11J92o0k16K09K15j29oK25l11
$$ -148 5 21 -9 58 -143 -115 329 -138 -76 94 397 68 207 -204 -12 -72 -288 -79 136 7 1 226 -85
4204h5J42j83K34qj00L00m61O3j10K16J53o80N27n4n7J61lj88n0J00J03M3J11
$$ -85 57 -126 108 100 0 300 -161 -98 -208 8 161 -519 8 -46 -103 58 55 -133 -183 -83 20 63 174
4227A74k31r3J83%J00j4k34k3K14L6k18K64k23K63j76l50L28o2j72L80r4j57j1
$$ 174 -57 -150 33 33 133 119 -115 -138 76 112 -106 158 -65 198 22 -328 0 -62 -234 146 52 -105 -116
4250a16J12P0M5k37J63p7P0QJ54m53J59j22L00r5J70l31J95k50J89J43P8K7j73
$$ -116 -4 66 111 -126 37 -40 30 38 192 -261 -102 -224 76 -19 151 -180 15 -235 -46 97 175 202 29
4273B9j05K6R5j02J00K0L87q9n42J45J27j85J04j61L95j98k07J20M4J48k30K7
$$ 29 -76 -50 45 -57 43 63 450 361 -181 -36 91 -94 10 -151 244 46 -161 -41 3 151 -79 -52
4295e2r0K65m23L53J14q9R4o4L7m34J97j32M22k27j89L33l17J97J25l24O5J67
$$ -52 -142 123 -300 53 167 78 172 108 145 -289 -92 -224 198 -29 -218 115 -202 -5 120 -204 -139 28
4317B8k72K38N1k07K93n7j18K1r4J37j59J00l3L1j43J27p8J52J14K5m48K31qL41
$$ 28 -244 -6 45 -162 131 74 -44 -23 -117 20 -139 -39 -72 -41 -184 -57 -135 17 131 156 -292 -61 -69 272
4341B72j75Lj71l3mK86l54K16m8J53k71K44k5oJ51j46o8j57J27J20j67m0J98m0
$$ 272 97 100 -71 -104 -108 178 -176 40 -8 145 -126 118 93 87 238 92 24 -133 -6 114 -53 -93 105 65
4365F5p2k6R9k22J33l6%n0k68J56J58J05m3K39k11p0J57q0J3k14L85J3l73J17
$$ 65 -7 -33 66 -156 -23 -59 -59 -109 -377 -221 -63 42 -1 238 27 -43 114 34 47 -167 218 231 -142 -25
4389b5J21n0J44l92K2nK83j20J60k44N1Nl8J55J8j00J62j58K2j41N4J16l75N61
$$ -25 96 46 190 -202 -180 -185 98 -22 138 -106 -55 -50 -88 67 85 -15 147 -11 11 -130 -76 40 -335 226
4413B26j98R3R8l54J74m2L7j84M44l29k8J47l6Q7k43N5olJ13J8k30k5L31K6j70
$$ 226 28 121 219 -135 39 -3 34 -150 294 -35 -63 84 48 135 -108 -53 -59 -62 51 69 -161 -186 145 171 1
4438AP9k15J31jM1l06M01J2k25M7o2J27N0j96L5K26k13n3q4L20k11K52j34l34
$$ 1 80 -135 -4 -5 36 -270 131 143 -82 -35 -97 30 80 -116 -81 145 -68 -121 -205 115 -96 156 22 -312
4462c12P1J78K19n2K6J27m60K50K00k85R0J55p8m36K28m5J61o9J21o0J22jN0j74
$$ -312 -241 -63 156 104 130 257 -203 47 247 -38 52 207 129 -307 -79 -124 37 -32 89 29 151 150 200 26
4486B6k48K93j63R5R8J70n11L06Q4j72J30j11j92R4j41K98o1n9k3J52Q7J09l16
$$ 26 -222 71 -92 3 101 271 -240 66 150 -22 108 -3 -195 -101 -242 56 -5 -64 -87 65 152 261 -55
4509e5J97k75J72j84K72k8j34Q5j89K05k64J09K44j86J72k31M46m08Q3L0l3j34
$$ -55 142 -133 39 -145 127 99 -35 50 -139 66 -198 -89 155 -31 141 -90 356 -52 31 61 28 -106
4531a06j88J31J14K19k17J49j2l7k46K37l08K67m4J9O5p6Q6j33J49q7J00k25K25
$$ -106 -294 -163 -49 170 -47 102 90 53 -193 44 -264 3 -41 -22 43 -33 53 -80 69 -18 82 -143 82
4554H2p2K41k65j18mJ36j9j3mL06k45J58r5m6k04k22L63J63j53j80N9J27M7l19
$$ 82 10 251 -14 -132 -136 0 -19 -32 -36 270 25 183 88 42 -162 -384 -21 142 -11 -191 -132 -5 42 -277
4578b77L73J07K0l67R6ok08K24j4LN6k49J83K14k08k7K36k03j63J53j76O1L37
$$ -277 96 203 223 -144 -48 -54 -262 -38 -52 -49 7 -242 -59 155 -53 -80 156 -47 -210 -57 -233 -172 165
4601A65mk17k33j3J62K58j76l7J01p9K85j33r1jn3M1L7o2J52j4j78j09k8K51q4
$$ 165 161 -56 -289 -302 -140 118 -58 -95 6 -73 212 79 -12 -13 -66 -25 12 -50 102 88 -90 -199 -227 24 -60
4626f0j70n0J62j2m8M34j38j89N2J2J49j92k1L7j23K99k2L1k75K37j15R1L5Oj39
$$ -60 -230 -280 -118 -130 -178 256 118 -71 -19 -7 142 -50 -71 -34 -157 142 120 151 -124 113 -2 89 124 130 -9
4651iJ76m15qL08r7L7J75n0k25J68J3k77Q3K30l78K55M7R6l51K59K08l02k42J55
$$ -9 167 -248 -256 52 -45 -8 167 117 -108 60 73 -204 -121 109 -269 -14 33 129 -222 37 245 -57 -299 -144
4675a44K65k40J80j31n0J84r6m9M21m22J08j90J80P7J8j6j61J02n6l8r1J53k40
$$ -144 121 -119 61 -70 -120 64 -32 -81 340 -82 26 -164 16 93 111 95 -66 36 -20 -58 -149 4 -236
4698b36K58j8L14k79K74q5n43K75Mj3n9J49j71J39J76j17K92m98K87j20j11M66
$$ -236 22 4 318 39 313 228 -315 -40 -36 -49 -108 41 -130 9 185 68 360 -138 149 29 -82 384
4720C84n65L35J12l49k6J17P6j12rr8K86l3k54L67j64k08K83j99oo7J9J52p6k9
$$ 384 -181 154 266 -83 -109 8 84 -28 -37 -135 151 118 -136 231 67 -141 142 -57 -63 -130 -111 41 -35 -64
4744f4L87l46L91l96K08n8k7Q3l34L61m64K08L05l01L8J27m46L13k13J3q2J43
$$ -64 323 -23 368 -28 180 122 95 178 -156 205 -259 -51 254 -47 -9 118 -328 -15 -228 -215 -297 -154
4766a54J73J0o2J37n8Q8k35K05J47N2m46L40k73J10l6j89K42K3l08K90J10n9k05
$$ -154 19 29 -33 104 46 134 -101 104 251 303 -143 197 -76 34 -2 -191 51 74 -234 56 166 107 -98
4789i8J18J80r9p3q3j76J57O0J46o2QO6l8k13n4L96j23j69m5j41J75l02M62k01
$$ -98 20 200 101 28 -55 -231 -74 -14 132 70 78 144 106 -107 -161 235 112 -57 -102 -243 -68 -370 92 -109
4813a09n1J37L67Nl60L1jk13K04J25k49J86j06L1K3j00M4j58M44l79Q5p8K12K
$$ -109 -160 -23 344 349 -11 20 19 -194 10 135 -114 72 -34 -3 20 -80 -36 -194 250 -129 -44 -122 90 92
4837I2j26J09j41Kp9O9K08J4m05K26q1q5K05l18K13K88l88O52p09K37J08j33Q
$$ 92 -34 75 -66 -64 -143 -74 134 148 -257 -31 -112 -197 8 -310 -97 191 -197 455 -254 -17 91 -42 -34
4860c4l6J44k10J11P9M2l47L64k88J33M4j73L63J92N5m78r6J40j03J30J51j11
$$ -34 -70 74 -136 -25 54 96 -251 113 -175 -42 2 -171 192 384 439 -39 -135 5 -98 32 183 72
4882G2j91n9L24j89L25j55r9R5Q9k53L16p7k38k3j8K17k69M3j88M68l10J47j32
$$ 72 -119 -178 146 -43 282 127 28 123 212 -41 275 198 -40 -63 -81 136 -133 -90 -278 190 -120 27 -105
4905a05L5J77L14n48K89q2j75n4J16K14k46L12kK8l40K72m18L98m67K49K4K0J58
$$ -105 -70 107 421 -127 162 80 -95 -149 -33 181 -65 247 245 273 -67 205 -213 185 -282 -33 -9 11 169
4928A69o8j55q4K8J53n8K0J08k42K65l38j0K17j01o1J31K1J28k0k27M08m63L59
$$ 169 101 -54 -138 -110 43 -15 5 113 -129 136 -202 -212 5 -96 -157 -26 -5 123 103 -124 284 -179 180
4951A80k71K27j48J2N5j9O0q7o9J1k32L04j89J50O0qJ40l38J79q0p9J09p5K03
$$ 180 -91 136 -12 0 55 36 96 9 -60 -49 -281 23 -166 -16 44 36 176 -162 17 -63 -142 -33 -108 95
4975I5k09J74k46K70j23j06K13J22j32m12L82K12k27m30K92N0M4j29l0J60J0j5
$$ 95 -114 60 -186 84 -39 -145 68 190 58 -354 28 240 13 -417 -125 -75 -31 -160 -190 -30 -20 -35
4997c5R9j57qL49k88J70k33n8J00K72k62J64j78J59j52K45j58MO7m01K87j57R3
$$ -35 64 -93 -101 248 -40 130 -103 -161 -61 211 -51 113 -65 94 -58 187 29 33 100 -301 -14 -171 -78
5020g8r7O4K20k2k69J16j13m2L53j24j26K54j36j32J16K3O5j71L69j08k05J05
$$ -78 -175 -111 109 87 -182 -66 -179 -221 132 8 -118 136 0 -132 -16 7 72 -99 270 162 -43 62
5042F2k80L46j12K5m6oJ15q7o8l2N1k1J33L4k27Q0kk10j54N09j07L52m29k3L56
$$ 62 -218 128 16 41 -5 -11 104 17 -51 -83 -32 -53 80 114 -113 -33 -35 -245 -399 110 3 355 -74 -97 259
5067B59k89K1J09P8k09n1J00j99K14rk23K04k4J98n42N12k55j25K18j13pK05k37
$$ 259 -30 -9 100 178 -31 -82 18 -181 33 24 -199 5 -19 179 -363 149 -106 -231 -13 -126 -133 72 -165
5090a65J82k5n5R2l01M45k87Q3mnQ9k9j90J78l0p2j6K20n15N86j35j47K87J4j54
$$ -165 17 -8 -63 29 -272 173 -114 -31 -35 -40 49 20 -170 8 -22 -94 -110 110 -405 181 46 -101 186 200 46
5115D6j1o1j73L78j85k6J56p4P8L7m77L43j75K60j66J04KN8J79l53k01l1M49k77
$$ 46 35 -26 -199 179 -6 -32 124 50 128 165 -312 31 -144 116 -50 54 56 114 293 -60 -261 -292 157 -120
5139a20q0K44J47l41J76p6J8k01L77K5l47j06J81O9K15j82j13p9J03J06q7R5J84
$$ -120 -200 44 191 -150 26 -50 -32 -233 144 169 -178 -284 -103 -34 181 -1 -114 -193 -90 16 -71 24 208
5162B08l21K40n2p0j61l8K07j03O8m3j0J17j86M5rK44k89K21o1k00o2K27L3L8
$$ 208 -113 127 75 5 -156 -194 13 -90 -22 -65 -75 42 -144 -99 -108 136 -153 68 7 -193 -255 -28 5 43
5186D3j22M38p21K37J29J78k3p9l44L20l3J16k99K87m6K87r5l30M6O1J03j34j1
$$ 43 -79 359 -362 -125 4 182 159 80 -264 56 23 139 -160 127 81 368 273 -57 -11 50 153 19 8
5209Hq3o4R8O5k56J52pj76L10l56K51K74k2k27o5r4K04l6pK73j18l3K6n6j52J61
$$ 8 -75 -139 -41 24 -232 -80 -87 -263 47 -309 -58 216 194 -33 -98 -192 12 -24 -31 242 124 91 117 61 -91 70
5235G0K03p9l48P8J96J7k23L32k52K04k77k68N21n8j10m9m3J45j60J2j67K80J46
$$ 70 273 194 -154 -76 120 137 -86 246 -6 198 -79 -347 174 116 6 -43 -86 59 -101 -89 -256 24 170
5258A70j29j01p7kJ25J35J17l71K39o8n2J39j47k16K26K04k72L41k80J48k29J21
$$ 170 41 -60 -137 -139 -14 121 238 -133 106 38 -14 125 -22 -238 -12 192 -80 261 -19 129 -100 21
5280B1j32L16j49j51J83rj39l7J8K45k84L3L1K11j23l16J0J75Q6rL22o2m6j17
$$ 21 -111 205 56 -95 88 79 -60 -97 -79 166 -118 -85 -54 157 34 -282 -272 -97 -11 -20 302 240 194 77
5304G7l1K0k62K37l32L2J71J69J20j62J64p1k95K00R8j91J02m13O31l03K06k95
$$ 77 46 66 -196 41 -291 -259 -88 81 201 39 203 132 -163 37 135 -56 46 -367 264 -39 167 -128
5326a28J42p8Q6J55M4l30j7K07m7k3n5q6J57ok41K46J33l35K98R0k51p2j62J46
$$ -128 14 -64 22 177 221 -109 -126 81 34 11 -44 -130 27 21 -220 26 159 -176 122 212 -39 -111 -273 -127
5350a27K1J45n4J32Q3m1q4j97K11j73jJ43M9M5j30R7r2l44L66j46L10l10P4J25
$$ -127 -106 39 -15 117 200 159 75 -122 89 -84 -85 58 107 152 22 119 27 -317 49 -97 213 -97 -23 102
5374A02j58j87J29j09L09J77j76k48J92p1o4J10K46l95J34o2J02J2j03l5K28J18
$$ 102 -56 -243 -114 -223 86 263 87 -161 31 -40 -104 6 252 -143 -9 -71 31 43 -60 -95 133 251
5396B51l04L02o6r3qj9P3j26j97J02J80j27j54J32j8r7k3K03j71K50o1M4J00k89
$$ 251 -53 249 183 90 82 63 136 10 -187 -85 95 -32 -186 -54 -72 -169 -192 11 -160 90 29 73 173 -116
5420a16n0J20N5L76p05L15j29N2j13K59j52Rj68L05l54J20J26K08q5k30J43K2
$$ -116 -166 -46 9 385 -320 -5 -134 -82 -195 64 -88 -79 -247 58 -296 -176 -50 158 73 -157 -14 8
5442HJ91J4j85O1J49n56K87k03J03P0J63m33K40o2k25K49l8L37k05j80L11n0k00
$$ 8 199 213 28 89 238 -318 -31 -234 -131 -61 102 -331 -91 -153 -378 -129 -167 170 -35 -215 96 46 -154
5465a54O1K9J14k7J3J75n4l37n2L4J56K07l03J88j56K27o0J07q4n6P4K91l76k2
$$ -154 -93 -64 50 23 36 211 157 -180 -232 -198 -42 165 -138 50 -106 121 61 168 84 28 102 393 17 -5
5489eP8o6M0r4j41M58l87J10j1J5P4k03l46L25K02O2p3j80Q9n8N5J27M9j71J90
$$ -5 73 7 47 -47 -188 270 -117 -7 -18 -3 71 -132 -478 -153 49 111 38 -142 -53 -111 -56 71 120 -51 139
5514A39l23J53J35k80L23m7q5M0k11P7J78J9j52J10j55n2J6JK07j50N1P2J53j14
$$ 139 -184 -31 104 -176 147 100 15 55 -156 -79 99 118 -34 76 -79 -131 -115 -114 93 -57 -6 66 219 105
5538A05k84M5K69k53j6J19k9R5n0K12k32k42L65m24K49R8N5n16N46l25j23N12
$$ 105 -179 -134 135 -118 -134 -15 -44 51 1 213 -19 -261 104 -320 -71 27 82 -434 112 -213 -336 176
5560A76j08M0J51j90j04J28j95J77k74L14j15k96R2J61J18m0j78K36p6m3j29L5
$$ 176 68 108 259 69 -35 93 -102 75 -199 115 0 -296 -204 -43 75 35 -143 93 17 -26 -155 -120
5582a20j81K12j04K31l50R8M39l4q2q2j75k52M66J55l81K47k30L8j3L8N5P9J59
$$ -120 -301 -89 -193 38 -312 -214 225 191 109 27 -148 -400 66 221 -160 87 -143 -105 -118 -80 -25 54 213
5605B13m14K04K91k48k81K97M7j05K75k43j24l9l0J07J74j16R4J89k87O6q0J76
$$ 213 -201 3 294 46 -235 62 109 4 279 36 -88 -127 -157 -50 124 8 102 291 4 70 -10 166
5627A66l23K93M2j56K97l46O1L6L2k05J06q4M73l84R8P4j17q9J1N1k41J23j9j94
$$ 166 -157 136 178 22 319 -27 34 70 102 -103 3 -81 392 8 106 180 63 -26 -15 36 -205 -82 -101 -295
5651b95L88m2j39j27K09Q3J03L5l39R1J67m8j21oj32L19k37QPj7Q0rJ79m37L43
$$ -295 93 51 -88 -215 -6 77 180 215 -124 -33 134 86 -35 -41 -173 146 -91 -83 -76 -93 -13 -22 157 -280 63
5676F3j23J98N1j53o1k53Q6K27K23l31j12K87K1j34n8J0LJ28P7m12K13q1L73k43
$$ 63 -60 138 189 36 -25 -278 -192 35 258 -73 -185 102 123 -11 -69 -59 -56 72 149 -263 -50 -131 242 -1
5700aJ86l53L63j56j36J96j54J93k19Q5J48j5j03J11o4j85j0K68l3j94J07J20
$$ -1 185 -168 195 39 -97 99 -55 138 -81 4 152 137 34 145 81 -104 -114 154 121 -73 34 154
5722A54l64L99j39k86K20P8J16l14K52k6k9J99k85L31r0m29L15k22K55l64q6J13
$$ 154 -210 189 50 -236 -16 62 178 -136 116 90 61 260 -25 306 216 -213 102 -120 135 -229 -315 -202
5744b02K26K92m57K35k33J74J88r4K9n50L41L0P2Q6k55Q8q5K1j9J42Q0l66L89
$$ -202 24 316 -141 94 -139 35 223 129 158 -392 -51 -21 51 137 -118 -30 -115 -94 -113 29 109 -257 132
5767A32o8k33K13p3J9j27q9k7J97K3n0j0J47o7k40K31j03pq7J01J47M0j23P5O5
$$ 132 64 -169 44 -29 -10 -137 -226 -253 -56 -33 -83 -93 54 -13 -253 -22 -125 -132 -219 -118 29 69 -54 21 86
5792H6O7j74j31M2K72l55J92K04j24J70j30J29j24j86K89r4o2L3j38p6o6J36Q
$$ 86 153 -21 -152 -110 162 -193 -1 203 79 249 119 248 124 -62 227 133 71 104 -34 -110 -176 -40 -32
5815c2OK29k25K49j72j34J7Q2M29m22j6R0L1l22L51j61j50Q9j20K30mRJ08j63
$$ -32 -26 203 -22 227 55 -79 -62 20 449 27 11 101 132 -190 161 0 -150 -61 -181 49 45 54 162 -1
5839ak03M69n74K61K27P3n68L64k38Q1K63j82N3j7L09j03j64o3J29j20K11m44
$$ -1 -204 265 -309 -48 179 252 -316 48 -190 -109 154 -28 25 8 317 214 50 -13 116 -4 207 -237
5861b37Q5n0J43J34k32n3J97o6j45J48j06m5K08P6R4k39M9l3N4Mj9Q8J12k61O0
$$ -237 -152 -202 -59 75 -157 -210 -13 -79 -224 -76 -182 -227 -19 57 151 -88 -39 -72 -18 -14 -33 55 167 -94 -34
5886c4J18k49J13k1J62n5K09j73l1O4j29J86k97M01K9l96N33k42k81J94Nl20O6
$$ -34 84 -165 -52 -73 89 34 243 70 39 103 -26 160 -137 264 293 -103 430 188 -93 101 106 -214 -148
5909a48J34J1J52k51L00o9k6j32Q4L8k12j9J73O6l29K74j73l5L51m29L40m07j01
$$ -148 -14 -3 149 -102 198 129 103 -29 55 93 -119 -138 35 101 -228 46 -127 -162 189 -240 100 -307 -408
5932d08K58J34J37k21R4O8l10J98L98n80L36R4k58k07J77K68l05Q7j22J1j77Q9
$$ -408 -150 -16 121 -100 -6 62 -248 -50 348 -232 104 198 -60 -267 -90 178 -127 -40 -162 -151 -328 -239
5954b39L82m14K03J43j11Q3K9J0Q1l37J40J97l20K44m30L10N6L3o7P5M7j12P9
$$ -239 143 -271 -68 75 -36 47 76 86 167 -170 -30 167 -153 91 -339 -29 27 60 -7 68 115 3 82
5977H2j33J73k9J05j15j27P0k27J68ok02J88K22n4O7k61J78O0m32K80M7j34L15
$$ 82 -51 122 93 198 83 -44 26 -201 -33 -39 -241 -53 169 115 182 -79 99 159 -273 7 54 -80 235
6000B35K60o45K94k12J88J29k93J66p9J8k8j71R3K49j75p1r5rn1L31l82L48k77
$$ 235 495 -150 144 -68 120 249 -44 122 43 61 33 -138 -45 204 29 -42 -137 -146 -197 134 -248 100 -177
6023a77K21r9K0j94K54j12kK30l8j57M6j11n1J76j90l20N20r6k41J26J81j20J29
$$ -177 44 -55 -35 -229 25 -87 -89 141 103 -54 -8 -119 -170 6 -184 -504 16 -80 -321 -195 -14 -134 -5
6046eJ91m81J71J23Q1m84M48m2l8O9kj16k5L53k57j4R5j24L0k23K10%K60l28L50
$$ -5 186 -295 -124 -1 80 -404 44 2 -36 33 31 -85 -110 243 -14 -28 67 -57 -27 -250 -40 -40 220 -108 242
6071B42l5j14k27n3K02mj8K52k40M4j03L44n1J47k87k34K86j49Q6l83M81K2l60
$$ 242 207 93 -134 -187 15 11 -7 245 5 49 -54 290 239 386 99 -135 151 2 88 -295 186 208 -152
6094a52J38j0P2l58J21K18J48j06l9j85p7J51m0L06k49J43j71K10k44k0L78J9
$$ -152 -14 -24 48 -310 -189 29 177 71 32 -153 -230 -79 -119 187 -62 81 -90 120 -124 -144 234 253
6116B53l67M37l31M9o9j80M38j14O7j48K73l10l51L74r8j6K33j93K5J17l02L98
$$ 253 -114 323 -8 41 -28 -208 230 116 183 35 308 -2 -353 21 -77 -93 140 -53 -28 89 -213 185
6138A85n0P0k50l7l6k45K29J00k2k47K01O1m9K19j22j92N8M5J51p5J53l53M6q
$$ 185 135 205 -45 -82 -118 -363 -134 -34 -56 -303 -102 -41 -90 129 7 -185 -127 -82 69 -6 147 -206 -160 -168
6162a68N7J67k2J1J0j25o6J67j34L27l32P2J02J57j81P2k04N0r5n1R8L00j31m3
$$ -168 -111 56 34 45 55 -70 -136 31 -103 224 -108 -36 66 223 42 114 -90 -40 -135 -186 -88 212 81 38
6186C8k7J42j40O1m7l43K03L49j30Kk03j5L42l38J34N7O9j70p8R8K20o6k50M6
$$ 38 11 153 13 74 27 -316 -113 236 106 108 -95 -110 232 -106 28 85 154 -16 -94 4 224 158 -92 -46
6210d6N3J98k18j06L73k54J78l14J63pl3j80J14J58M1P4l62K77j17j05N8K16j37
$$ -46 7 205 -13 -119 254 0 178 -136 27 20 -13 -193 -79 79 120 194 -168 109 -8 -113 -55 161 24
6233B4J07m45K61K71q6J17k5j87j03K11k4pJ28m81K48J5k66K22l49L62M3j35n9
$$ 24 131 -314 -53 218 132 249 224 37 -66 145 121 114 242 -239 9 24 -242 -20 -369 -7 36 -99 -158
6256a58J08N3j26L66k92J78l87Q7K96l01K43l1j3K51j84L3k04P5l3j6J9NL29o12
$$ -158 -50 3 -123 243 -49 129 -258 -171 125 -176 67 36 23 274 90 123 -81 -6 -39 -55 -36 -31 298 -314
6280c14L11j64J07J57k67J55k80M68j18L8P4o6K10k72j74m0L90n83L29Q9o1L6
$$ -314 -3 -167 -60 97 -170 -15 -295 173 55 93 167 101 311 39 -135 -175 215 -368 -39 50 -11 25
6302B5OL37n38J90j95K23K84m74J03j67M38k21P0q0O6j67r5P8M8r6J31J29o0k9
$$ 25 31 368 -170 20 -175 48 332 -142 -39 -206 232 11 81 1 67 -100 -195 -117 -69 -165 -34 95 35 6
6326FP5k18o6L52J10l05m1R4p5JK1K30l18L33l14J40j26L34l12Q6Jj2k7q0l43
$$ 6 81 -137 -203 149 259 -46 -87 7 -68 -67 -46 184 -134 199 -115 25 -101 233 -79 7 8 -4 -31 -111 -454
6351d54N09J24o78O47M0k52o6M2K84j33r0O9j02K83l58j92L37J02k18K45n6j95
$$ -454 55 179 -499 148 188 -64 -130 -88 196 63 -27 42 -60 223 -135 -327 10 112 -106 139 83 -112
6373a12K15r9k82K71L4M4K5k31J96k34K92J10p1j73l09L81L24k06m06K47k03J60
$$ -112 103 4 -278 -7 27 71 96 -135 61 -173 119 229 158 -15 -324 57 381 175 -231 16 -187 -27
6395b7j74K74l39L85j55J35k51K40j76p9K28j44J44j5J06q9k2o6L21k64o4O9l14
$$ -27 -201 73 -266 119 -36 99 -152 88 -88 -167 61 -83 61 46 152 63 41 -25 296 32 -32 37 -277
6418b77K57K17p2j43L4P3k73K16k52L65k68J88p5J93m18q1L79K5j74K58l24j5
$$ -277 -20 197 125 -18 16 89 -184 32 -220 145 -123 65 -10 183 -235 -316 63 88 -86 172 -152 -167
6440a67L28L4k91M0Q5J41j47k12J18KK02j20o0O3K54l61R9j99N1P8K26q1j51k19
$$ -167 161 195 -96 -56 29 170 23 -189 -71 -69 133 13 -47 16 270 -91 8 -191 -140 -62 164 83 -68 -287
6464b87J15O9k92M58P9J9k55K04l12K66l06J68L73m24K33L3j02Jk4j42K78j45
$$ -287 -172 -103 -395 63 142 161 -94 110 -202 64 -242 -74 299 -125 108 141 39 40 16 -126 152 7
6486Gk33L04K50l76K0j3p8P5o6L40m26K54JO1L4k16J87l0l00J58k9K24q7p6R3
$$ 7 -226 78 328 -48 -28 -41 -119 -44 -110 230 -196 58 59 120 154 -62 125 95 -205 -47 -76 148 61 -15 78
6511G8r3J35J68j63k80RM5J06p8J01J4l10L10l3k95K80K2K86m26L69k94P3j16
$$ 78 -15 120 288 125 -155 -146 -101 5 -73 28 42 -268 42 9 -286 -6 16 302 -124 245 -49 24 -92
6534i2k25K95j38K53j71n4K6J92j23m6p1J80j80l0M4K79m12N53l16J27j32j30
$$ -92 -317 -22 -160 93 -78 -132 -106 86 -37 -83 -154 26 -154 -184 -140 139 -273 280 -36 91 -41 -171
6556a71J46J56j08J03Qm47L33o7j28N2Q1M4N6j70N8J84o1m64L54j6J44Q8m0j57
$$ -171 -25 131 23 126 134 -313 20 -47 -175 -123 -42 2 58 -112 -54 130 69 -395 -41 -57 87 175 135 -22
6580b2R7j14k39J79J29ol3N5j47j32J60m4L27j40n7J63l59nJ50m1K03j91R5R1
$$ -22 75 -39 -278 -99 30 24 -9 46 -101 -233 -73 -117 210 70 13 176 -183 -188 -38 -79 124 -67 28 119
6604A19k05m4K61l49M48l74J25J38j43q7J18p1m8O2L3K08k11J08k73L09k28L37
$$ 119 -86 -130 131 -218 230 -144 -19 119 -24 -111 7 -64 -112 -50 -17 191 -20 88 -185 124 -104 233
6626B33j53k04J28Q3k7K24l67Q9r6J42j1j02j5L02k69j35M66j50K09n46o2L15
$$ 233 80 -124 4 87 60 284 -83 6 -90 52 41 -61 -76 226 -43 -178 288 138 347 -199 -261 54
6648E4l0m7j44M3J45j21j9J84rq9l9J40q1j11OJ89j3j99j37J05J75q7J63R7p0
$$ 54 24 -23 -167 -124 21 -100 -119 65 56 -33 -72 68 -13 -124 -118 71 58 -141 -278 -173 2 -85 78 175 105
6673A05r7j52P0O9M06n68r4L57p8l9J86MJ1k08k2Q0r0J37J20j41k49K09k36L55
$$ 105 8 -144 -74 -5 401 -167 -261 96 18 -21 165 169 180 -28 -50 30 -60 77 197 56 -193 16 -220 135
6697A35j74J45l01J40L6K83k41j57L3L6M5l4J49l58L26J74k39M8q4J2J87l78L50
$$ 135 -39 106 -195 -55 -19 264 23 -134 -101 -65 -20 -54 95 -263 63 237 -2 46 -38 -26 161 -217 133
6720A33l05K24k91L3L55r7K9j40J77k8j51O5j99K67K16m46L31k91K22k58K28j2
$$ 133 -172 52 -239 -206 149 52 81 -59 118 90 -61 4 -195 72 288 -158 173 -118 104 -154 74 62
6742F2L3j78J94Q3n40PK79m0K6L53m43M6K94n8k02L53l63j10J08N8J32j24n6J56
$$ 62 95 -83 111 194 -346 -339 -60 -100 -74 279 -164 -118 176 118 -84 269 -94 -204 -96 -38 94 -30 -86 70
6766G0k23J93L9j74J74J61j93J50l56J82j67J06l20K72L67k66j05R2k7J55K2j63
$$ 70 -153 40 79 -95 79 240 47 197 -159 23 -144 -38 -358 -86 281 15 -90 2 -25 130 152 -11
6788a1M3O9j60k6J60j40J25j64J09k39J42M00j35k12J0Q3%J2K10k57K73l42j71
$$ -11 32 101 -59 -85 75 -65 60 -104 5 -234 -92 308 173 -39 -29 54 54 66 276 19 292 -50 -221
6811b21p0L42Q4l03J7K75k07k67J64L95m73N89l33k61L46J54j43l82K49j77K77
$$ -221 -291 51 135 -168 -151 124 -83 -350 -186 209 -264 325 -8 -269 77 231 88 -294 -45 -222 55
6832E5p3J33k96O2P0m6K86k59k12M31j3j83j03K55l21Q9L74l2k24J12k23K80j44
$$ 55 -18 115 -181 -119 -49 -95 191 -68 -280 151 138 -45 -148 107 -214 -125 249 217 -7 105 -118 162 18
6855A8j53j27J37J10j6J65j88j38M18K79m47Q3r5Q7k38M1l0L85l63J3N9J34k33
$$ 18 -135 -262 -125 -15 -31 134 -54 -192 226 505 58 141 46 133 -105 -64 -94 291 -72 -59 0 134 -99
6878i9J26l1K2l63M23j4M1l53J65K31m9P4k33J40l97L23P9J4j39n7J61lK0k18
$$ -99 27 -4 18 -345 78 64 105 -248 -83 148 99 173 -60 80 -317 6 85 99 -40 -97 64 61 81 -137
6902a37L42k63q7K93q9j85J08mkk36J57R6k17K93Mk07j09J61J85k25J3J90p6O3
$$ -137 205 -58 -145 148 59 -126 -18 -22 -24 -260 -103 -7 -224 69 73 -134 -243 -82 103 -122 -109 81 5 68
6926F8k48K47j6j04K96M3l61J94J11o46L62J00l78N69k10k34J06J13j12j81L70
$$ 68 -180 67 51 -53 243 286 -75 119 230 -416 -54 46 -332 237 27 -207 -101 12 -100 -281 89
6947H9J26k06q3l8J00P0j64K94k29J43k7j26J18l68K49J76p9K85l31j4J97o10
$$ 89 215 9 -74 -112 -12 58 -106 188 -41 102 75 -51 67 -301 -52 124 45 330 -1 -15 182 -428
6969d28J35L30k39M33j47L7k43J53P7o7N5m18L36n8J29k9j60K14l43J56o2K5L1
$$ -428 -293 37 -202 231 84 121 -122 31 108 41 96 -322 14 -44 85 56 -104 110 -233 -77 -139 -114 -83
6992h3N4m2r0K37j25j63J86J54l53J12J64L6k50J23j48m0K18rJ66j70N14q40L06
$$ -83 -29 -71 -161 76 -49 -212 -26 128 -225 -113 51 87 -163 -40 -188 -228 -10 -19 147 -23 491 -349 -43
7015d3K3ll41M14k95L75l25K97k50N5J05P1J20l42L3L3j11L35l20L06m7N6o7j41
$$ -43 -20 -23 -364 50 -245 130 -195 102 -148 -93 12 83 203 -139 -106 -73 -184 151 -169 137 90 146 79 -62
7039f2o9J24n3j36R1J30M5j38K02P4k11k89L61K37n64L23P4l69K14k00O82l90
$$ -62 -131 -7 -60 -196 -105 25 70 -68 134 208 -3 -292 69 306 -258 65 139 -230 -16 -216 466 76
7061G6l67J79M29l39J45j3j44L8j68L27j49L91k24n4M1n63K50K32p0J57j32k24
$$ 76 -291 -112 317 -22 123 110 -34 4 -164 163 14 405 181 127 168 -395 -145 87 17 174 42 -182
7083a82K81k70j3K87k52l6K24n7m8j42%L79J6j21L11j28J08o59K83K51l53J44
$$ -182 99 -171 -184 103 -149 -185 39 -18 -66 -208 -208 171 187 66 377 249 357 -302 -19 232 -121 23
7105B3q1JO6jk03j1J61J87j61q6J19n1J94j02j03N9Jj34J9J43L17j37k89P0R3
$$ 23 -58 -57 9 8 -195 -206 -45 142 -19 -105 14 -37 157 55 -48 11 12 -122 -103 40 357 220 -69 1 94
7130I4l9l8q2M0q1J24m7J66k03K18J29l06j98K61K84Mm18J66k55K74p9k24K37
$$ 94 55 17 -65 -25 -106 18 -29 137 -66 152 281 -25 -223 38 322 326 -92 74 -181 93 14 -210 27
7153B7r8K3n3K34l10L16k55RL28l95L38K4l5n1k06J25j97N92n41m5J57RL29k01
$$ 27 -71 -48 -101 133 -177 139 -116 -107 221 -174 164 188 153 102 -104 21 -176 416 -125 -170 -13 -4 325 124
7177A24q2l07O9L69k12m2O1o6K87J2n9j41k34m1%L67k68K35K35l64o0K09L8j97
$$ 124 42 -265 -196 173 -39 -81 -20 -86 201 213 154 13 -221 -262 -262 105 -163 72 307 -57 -117 92 130 -67
7201f7l2J71l7m1n7Q1p2J47r7q6J78o1O7N3Ql59J53K39r1Q8j27L6k39J65j39N7
$$ -67 -99 72 35 -6 -63 18 -54 93 -4 -90 88 27 94 147 155 -204 -51 188 97 185 58 94 -145 20 -119 -62
7227f2J16n7o8L35j46j86O5P2l7p4J12K31l85K23n48K92R9l3J16j48JK4L26k15
$$ -62 54 -3 -71 264 118 -68 -3 69 32 -42 70 301 -84 139 -409 -117 -18 -51 65 -83 -82 -58 268 53
7251E3l2J8j2j41n5J82N4J05q7Q5k0J82j81j95OP9PRm36K29j26N77l52n7k2K84
$$ 53 21 39 27 -114 -169 13 67 172 85 170 150 332 151 -44 -38 41 48 57 -379 -150 -276 301 -51 -108 -130 154
7277A54j19J50k13K67l76o4K59l19L80l18K69k6j35qJ54j96K11O2q3N4j34N8J60
$$ 154 35 185 -28 239 -137 -201 58 -261 119 -199 70 44 -91 -99 55 -141 70 132 49 103 -31 27 187
7300A87k17J67k36N6k7k03L2O45k40r9K8j27J26m23M17r5j73L65k5o1k98N1P5
$$ 187 -30 137 -99 -43 -70 -273 -241 404 164 65 93 -34 92 -331 86 -9 -182 183 158 97 -201 -150 -75
7323g5j32K12k32M19m46R9L70Mk42J02R6k08J92o2L00n33K70j61P9M8j44n3J62
$$ -75 -207 5 -227 192 -254 -155 215 219 -23 79 175 -33 159 97 397 -136 134 -27 52 100 -44 -97 65
7346F5k1J69p0k31J59p4L5j01J13j59L69j91k04j21L38R8j96J20j33J02n8n7k92
$$ 65 44 213 143 -88 71 -3 32 -69 44 -115 254 63 -141 -262 76 174 -22 98 -35 67 9 -48 -340
7369c40M52k0j33N2O6j20J71m16K69L3O7O2j48K70j42k49L6L05j24J07j90K08
$$ -340 112 92 -41 11 77 -43 128 -288 -19 14 81 143 -5 265 123 -126 -90 215 91 198 8 216
7391B16j44q0J47j77K35n4j16o2K8rJ4K26j82l00L3%L11k45J43l1Q7k0K7j15r8
$$ 216 72 -8 139 -38 197 143 27 -35 -7 -16 -2 224 42 -258 -225 -225 86 -159 -16 -47 40 20 47 -68 -166
7416a66L40k75P4K24l57J61P9j29R7j73q8K93PR4m14K49r4M6r1J78J3l2j82J68
$$ -166 174 -101 -27 197 -160 1 80 -49 48 -125 -213 80 87 181 -233 16 -78 -32 -123 55 68 36 -146 22
7440B2lO3j26J51j45n4J70o2j25nkL86l28QL41k33k00J55K1q7L07r3k65K98l7
$$ 22 19 82 -44 107 -38 -92 78 16 -109 -114 -116 270 -58 -50 291 58 -142 13 34 -53 254 161 -104 194 157
7465A57m88O08o78K40K23j19K63j36k26L62m01j46M31o2l53L28j01n3l6K40M1
$$ 157 -331 277 -401 -161 62 -57 206 70 -156 206 -195 -341 90 28 -325 3 -98 -151 -187 53 94
7486I4k46O8L2J44N0k09J10M8j92J32j92J42J71l00P7L65l99Q9l46N76p3k42o3
$$ 94 -152 -84 -52 92 142 -67 43 91 -101 31 -161 -19 152 -148 -71 294 -105 -16 -362 214 141 -101 -164
7509a64J9J25N1k1K30j97K0l81K30M8l8L4m3p7J95ok7j78L46l88J35n8J45J89
$$ -164 -145 -20 31 10 240 43 63 -318 -88 -40 -78 -44 -87 -164 31 25 -2 -180 166 -222 -87 -145 0 189
7533A89k46N7l97O28r9m49K27m9K78L8l33J63p5k36Q7J70K82j72J25n06J86J87
$$ 189 -57 0 -397 231 132 -317 -90 -139 139 177 -156 7 -68 -304 -217 -47 235 63 188 -318 -132 55
7555E5j71J01k57J35J94q1k41K70P5k53M78j45k91J80j44J69J47M4k07o2j93L22
$$ 55 -116 -15 -272 -137 57 -24 -265 5 80 -173 305 160 -131 49 -95 74 221 265 58 -4 -197 125
7577A25l15M46m77K78l0k30J44r0J58m3k30K81OJ43k27J76L4k74J50Q7j44j95
$$ 125 -190 256 -221 57 27 -203 -59 -149 9 -34 -264 17 23 166 -61 115 149 -125 25 112 -32 -227
7599b27L13n1l57J89J35P7L2J98l99J93k4K01k37j17P3j3L05j97m28M92j20j24
$$ -227 86 35 -322 -133 2 79 111 309 -90 103 79 280 43 -74 -1 -14 291 94 -334 158 38 -86
7621h6k27O23n20J43K06k54m7K73j84R5J52j70L43l23O1k90L28k0q0Q5q1n6j07
$$ -86 -313 310 -210 -67 139 -115 -162 111 -73 22 174 4 347 24 85 -205 123 103 23 108 27 -29 -136
7644a36L83k47r9K37j3Q9k01o9J76l16J96J46j98K21j48N2o8k7j36L06J40l39
$$ -136 247 0 -99 138 125 214 13 -56 120 -196 0 146 -52 169 21 73 5 -22 -158 148 288 -51
7666e1O8l03L30Q4n7k34M22k09k02k9R2M7j7J46j0P9k7J90k93O2r8K79l10K04
$$ -51 17 -286 44 128 71 -163 259 50 -152 -181 -89 -42 -59 87 77 156 129 319 26 88 -10 269 -41 163
7690A63l53M7K43j64k03N57l61Nj1J71j33j43L95j52K36m87K6j98M33j20J09m27
$$ 163 -190 -143 100 -64 -267 290 -71 -66 -77 94 -39 -182 213 61 297 -190 -164 -362 71 -49 60 -367
7712c67L13q5j27K05k21L33Lk33J88j55n9K26K8K6l5k93L46j9l70K36J05n5LJ29
$$ -367 -54 -139 -266 -61 -282 51 54 -179 9 -146 -205 21 49 75 40 -253 93 74 -296 -60 45 -10 -7 122
7736A22j79J00k58J71j7K10j53j96K84q7N9l1k01M20l03o7N7j15L22j76J2j79
$$ 122 -57 43 -215 -44 -61 149 -4 -200 84 -3 56 25 -176 244 -59 -126 -69 -184 138 -38 -26 -205
7758b05L50R3Kk89J43m45K98J45n7LJ29j96J6R3j13J33o9j53K66m52J35K91l60
$$ -205 145 238 240 -49 94 -351 -53 92 35 38 167 -29 -13 80 -33 100 31 -122 144 -308 -173 118 -242
7781b42L02NJ15l27J14K5J89j08r8J11k41R7j39N80m79J14m35L14NJ71j70J04
$$ -242 60 65 180 -147 -33 -8 181 73 -25 86 -155 -58 -197 383 -96 18 -417 -103 -98 73 -97 7
7803GO6j30L30m76J13L24k34K03q8k02oJ68k22M01o68L59J63j41j10oL16o1j48
$$ 7 73 -57 273 -203 -90 234 0 203 115 -87 -93 75 -147 254 -414 -55 108 -33 -143 -149 167 106 -42
7826d2N5J28J35q7k39R9k02J9J06J02l32L71o4o4n0j6m4K03j02j0J25k2l37J94
$$ -42 13 141 276 189 -50 49 -153 -134 -28 74 -258 113 49 -15 -65 -81 -125 78 -24 -34 91 69 -268 -74
7850g4J98k42p5qk7K98k14J80Q9j01k2K1r7J54Lp2j8j01j05L44k50J76l1l26L62
$$ -74 124 -118 -193 -201 -228 70 -144 36 125 24 2 23 -74 80 83 11 -7 -108 -213 131 -119 57 26 -300 62
7875F2pK61j89j58k32L50j29K07k37J96j8l24J74J29k30j40O2K40R2j55N6P9k48
$$ 62 55 316 127 -31 -263 87 -42 165 -72 124 106 -218 -44 85 -145 -285 -223 17 109 -46 10 89 -159
7898a59O0l38M02O8J2n7J8J35j59p5P8q9l6J01j32J38K03l70K22j17o9L09R5k84
$$ -159 -99 -437 -35 33 45 -12 6 141 -18 -93 -15 -104 -140 -39 -171 -33 170 -200 22 -95 -164 145 240 -44
7922d4R7j00J36j70J66P9n35R3M25p6k6j38K03r6n1J83l66J40J88k04L5R6J66
$$ -44 53 -47 89 -81 85 164 -371 -278 147 71 45 -93 110 14 -37 146 -220 -80 108 -96 -61 35 201
7945B01r0K5R2j13l0j50J35l6O6K2o0n2K40l84j8K25R7k94K74o6j67J13q1J71
$$ 201 111 136 228 115 85 -65 70 34 100 122 62 10 250 -134 -152 73 170 -124 150 84 -83 30 -51 120
7969A20J59j48K4j52O5j83J59J30k74J04j64J70kk73J35K64M2q5K0J94l72j80
$$ 120 279 131 155 3 68 -115 44 174 -100 4 -160 10 8 -265 -130 134 176 91 111 305 -67 -247
7991b47J84J06r7N0o0O0q0J07J21J0j85K6Jo2J30m4K10m69K09j07M86m29J92j87
$$ -247 -63 43 -54 -4 -64 -4 -84 23 144 154 -31 -5 -4 -66 64 20 230 -239 -30 -137 349 -80 112 -75
8015g5k2L07j59q7k95M23k64M17k06L04l99K7K40k98o5L18k11K52k67J29r2m3
$$ -75 -97 210 51 -36 -331 92 -172 245 39 343 -56 -29 211 -87 -152 166 -45 207 -60 69 -23 -66
8037f6j92L02J15j51J01j41P1r0j28Q7J51j34K29k43j57J39J1K19j51n2J06m7
$$ -66 -258 44 159 8 109 -32 39 -51 -179 -92 59 -75 154 -89 -246 -107 -96 123 -28 -80 26 -21
8059b1J7K30k82L01n42L19n9Pn2J97j34l2K00L1k58J41p5NK3j30J14Rj95J21L9
$$ -21 -4 226 -56 245 -297 22 -37 -30 -82 115 -19 -51 149 180 -78 63 -12 -7 16 -114 0 9 -186 -65 -26
8084b6J05k46J6J28J30J94n16J13k1K56k80J48j57J27j35K11lk43J78j44Q6K02
$$ -26 79 -167 -151 -23 107 301 -215 -102 -123 133 -147 1 -156 -29 -164 47 44 -199 -21 -165 -79 123
8106A23l5j06j23J95j56r7J1L12k49L15j67N0J35n58J72K57l26J45K15Q1k53j3
$$ 123 88 -18 -141 54 -102 -199 -188 124 -125 190 23 73 208 -350 -178 79 -247 -102 113 194 -59 -72
8128g2J55o5rp2K7K37l48j6j35M08N1n9r6n0r4pN8J37r7j05l1L26j33k6j07J22
$$ -72 83 18 9 -63 -36 201 -147 -163 -298 110 161 102 6 -44 -138 -145 -87 50 -47 -152 -183 143 10 -16 -123 -1
8154aj13j4P7P5J20O2m1j34j83J96j66K39kO5m76m0L5J98K71n1Q5l58L49j29k
$$ -1 -114 -128 -51 24 144 206 165 31 -152 44 -122 117 115 180 -296 -336 -301 -103 168 117 202 -156 193 64 62
8179F2j43R4R7k09K10j11R6J56r1k01j28j19
$$ 62 -81 13 110 -99 111 0 96 252 161 -40 -168 -287
8191b87
$$ Imaginary data points
##PAGE= N=2
##DATA TABLE= (X++(I..I)), XYDATA
0@%%%%%%%%%%%qJ6j6J6k4L2m0M8n6P1q4J00j19J36j57J82k10K45k83L24l70M21
$$ 0 0 0 0 0 0 0 0 0 0 0 0 -8 8 -8 8 -16 16 -24 24 -32 39 -45 55 -64 72 -85 97 -113 132 -151 173 -197 224
33B24m77N39o07O82p66Q58r59J069j186J318j462J616j786J972k175K398k644
$$ 224 -253 286 -321 361 -405 453 -506 563 -623 695 -767 849 -937 1035 -1140 1258 -1386
50a386K913l208L534l899M306m763N280n870O552p353Q305r459J0898j2744J5212
$$ -1386 1527 -1681 1853 -2046 2260 -2503 2777 -3093 3459 -3894 4411 -5048 5850 -6894 8318
65H318j8700K4045l3361N4217j89987M2366K30639k08838K5735J17608l8196k4966
$$ 8318 -10382 13663 -19698 34519 -155468 -113102 117537 -91301 -65566 52042 13846 -11120
77a1120J23401l8543o4128N0560m252r6113O8061M7812j15631j6130R8571n7604
$$ -11120 112281 73738 9610 60170 55918 -40195 27866 75678 -39953 -56083 42488 -15116
89a5116m2876O0495l2741o1847N3597K8293p370K4065r790j9390P2356N0229o4914
$$ -15116 -57992 2503 -30238 -92085 -38488 -10195 -17565 6500 -3290 -22680 49676 99905 34991
102C4991k4959O9276k2797p5718J6899K279m8703J6772j010m2103M0021M0676
$$ 34991 10032 79308 56511 -19207 -2308 -29 -48732 -31960 -32970 -75073 -35052 5624
114E624m1284Q160N7737o945k5658L2533J5687l8695JL2886k2342k0532K0121
$$ 5624 -35660 -27500 30237 23292 -2366 30167 45854 7159 7160 40046 17704 -2828 17293
127A7293j3616j6385J2793j7330j3559J8671j0153j8781J6097J9948L74k873J5208
$$ 17293 3677 -12708 85 -17245 -30804 -12133 -22286 -41067 -24970 -5022 -4648 -7521 7687
140G687J8662J403N048L068j6634l664K330j8163r472m513j0619l61J390N326
$$ 7687 26349 27752 32800 35868 19234 15570 17900 -263 -9735 -14248 -24867 -25228 -23838 -18512
154a8512Q089n095P207J8264n135j896J3288m665o627P203M767k931p089j24j350
$$ -18512 -10423 -15518 -8311 9953 4818 2922 16210 11545 4918 12121 16888 13957 6868 6744 5394
169E394r574L137K97j8998Q30P890j0303M361J2632j995O441R908K160M095J584
$$ 5394 -4180 -1043 -746 -19744 -18914 -11024 -21327 -16966 -4334 -6329 112 10020 12180 16275 17859
184A7859j122k591o786j869m370p840j312n951j544J0251l708k702J2383l583
$$ 17859 16737 14146 7360 5491 1121 -6719 -8031 -13982 -15526 -5275 -8983 -11685 698 -2885
198b885m272J3395O74n600M471J984k661Q44M887j274j0210K176M137j3249m60
$$ -2885 -7157 6238 6912 1312 5783 7767 5106 5950 10837 9563 -647 1529 5666 -7583 -8043
213h043N741j1308j688J0437k568Q55Q031J821J581L895L790q10n836P82j606
$$ -8043 -2302 -13610 -15298 -4861 -7429 -6574 1457 3278 4859 8754 12544 11734 5898 6680 5074
228E074p734K715j316r235L903L444m645L373K098j433L251o05L89M068p62O27
$$ 5074 -2660 55 -1261 -10496 -6593 -3149 -7794 -4421 -2323 -3756 -505 -1110 -721 3347 2585 3212
244C212R50M5L956j542l567J713l541k815L95o119j475L052m063J320N393O08
$$ 3212 4162 4207 8163 6621 3054 4767 1226 -1589 -1194 -7313 -8788 -5736 -9799 -8479 -3086 -2478
260b478K947K665J615L324q94l28K25m713m01L84n240L97O44l811K120J115k170
$$ -2478 469 3134 4749 8073 7179 6851 7076 2363 1962 2346 -2894 -2497 -1853 -5664 -3544 -2429 -4599
277d599R09R40J70R02p68K892K907k346K773K910j132R58r74l311O21k558l447
$$ -4599 -3690 -2750 -2580 -1678 -2446 446 3353 1007 3780 6690 5558 6516 5542 2231 2852 294 -3153
294c153j292k435P1R92k060M309L332j269K910K535L25J700r21n97K6k261k97
$$ -3153 -4445 -6880 -6809 -5817 -7877 -3568 -236 -1505 1405 3940 4265 5965 5044 4447 4473 2212 1915
311A915n74k618J032j68l549K009n73k671J162M48J56J322J64K504J878m54L346
$$ 1915 1341 -1277 -245 -413 -3962 -1953 -2526 -5197 -4035 -3587 -3431 -2109 -1945 559 2437 1983 5329
328E329J611k033O12j162k696Nl015k046J32j790k57O96o49L089R76o36L292J543
$$ 5329 6940 4907 5519 4357 1661 1666 -1349 -3395 -3263 -5053 -5310 -4614 -5263 -2174 -1198 -1834 1458 3001
346C001j065J129k32K82R29j801o9K05j880L32j525j872J298j549k118J284k90
$$ 3001 1936 3065 2833 3115 4044 2243 2174 2379 499 831 -694 -2566 -1268 -2817 -4935 -3651 -3941
363c941N86J344L90K564J634j65K287l03j263J186j252k008r0j997j257J89j450
$$ -3941 -3355 -2011 -1621 943 2577 2412 4699 4396 3133 4319 3067 1059 969 -1028 -2285 -2096 -3546
380c546M11O79r30J387O05J1K005nr3K141l88J96M88r19L32L4j810Q6o18k016
$$ -3546 -3135 -2456 -3386 -1999 -1394 -1383 622 617 524 2665 2277 2473 2961 2042 2374 2408 598 684 66 -1950
400a950L37j516n74J460k19K06J123O84J300N97j50K257n96j144J180j703j065
$$ -1950 -1613 -3129 -3703 -2243 -2462 -2256 -1133 -449 851 1448 1298 3555 2959 1815 2995 1292 227
417B27R13j477j346P53o16n43N4j0J028p45N85J909r91J72K555j123j71J610r76
$$ 227 1140 -337 -1683 -930 -1546 -2089 -2035 -2045 -1017 -1762 -1177 732 -259 -87 2468 1345 1174 2784 1808
436A808l63j43q93l4j185m75K2q21j3J103j039Q06J148l37J236P5r5J188n75j079
$$ 1808 1445 1302 409 375 -810 -1285 -1263 -2084 -2097 -994 -2033 -1227 -79 -416 820 895 800 1988 1413 334
456C34J133m32j096N56q20m41J46j44J12p37P19P64j655P48K010j255l73K105
$$ 334 1467 1035 -61 495 -325 -766 -620 -764 -652 -1389 -670 94 -1561 -813 1197 -58 -431 1674
474A674n44o39Q95j71j068L41j98m10j067M37L14j378Q87R13o64L02R82r65Q36
$$ 1674 1130 491 1386 1215 147 488 290 -120 -1187 -750 -436 -1814 -927 -14 -678 -376 606 -359 477
493D77N22n62J63j0m92N02k91m57K48k63J96l93o02P90k61m05P99j39NJ087l82
$$ 477 999 437 600 590 98 600 309 -148 100 -163 33 -360 -962 -172 -433 -838 -39 -178 -173 914 532
514E32n45J074m78j9j55k81j57l33l78J16j87L86k0m39Q62L99j026J548j43q55
$$ 532 -13 1061 583 564 409 128 -29 -362 -740 -624 -811 -425 -445 -884 -22 377 -649 899 756 -99
534i9P89K15j108J38O71n82l77J37K77j40q13P85l2q59R56J6n33M00O60L5O0J33
$$ -99 690 905 -203 -65 606 24 -353 -216 61 -79 -892 -107 -139 -998 -42 -26 -559 -159 501 536 596 729
556G29K76n5j035N18m9q74J34r9n29K68n6M05m1j97P12J94m71R02P2j005P81K93
$$ 729 1005 950 -85 433 384 -490 -356 -455 -984 -716 -772 -367 -408 -605 107 301 -170 732 804 -201 580 873
578H73o43j51M03m56m52L8N13o40l57P39j37r03J109L0m15O86K05K85M40n77O9
$$ 873 230 79 482 26 -426 -388 125 -515 -872 -133 -270 -1173 -64 -34 -449 237 442 727 1167 590 659
599F59J00n12r3L30j002M1k04r4J53j46N04j58M7K56J71k94Q95j52n19L62L43
$$ 659 759 247 154 484 -518 -477 -681 -775 -622 -768 -264 -422 -375 -119 52 -242 653 501 -18 344 687
620F87l99O1j79K60k47o21J98j61l38J99j87J40O16k01j22Q45j64q2M25n4j60
$$ 687 288 349 170 430 183 -438 -240 -401 -739 -540 -727 -587 29 -172 -294 551 387 305 730 676 516
641E16K73k98p71J83J94k84o42L19N8l17L17M09l80q1O86k5J80j13J66J37J18
$$ 516 789 491 -280 -97 97 -187 -829 -510 -452 -769 -452 -43 -423 -504 182 157 337 224 390 527 645
662F45l3j6k92k51j2m40J45m4k16K66j25l7K63p1k9M66j17Q1J91L0K40m37l08
$$ 645 612 596 304 53 41 -399 -254 -298 -514 -248 -373 -410 -147 -218 -247 219 102 183 374 404 644 207 -101
685a01M21k19n8k17k73J96j89l2L27M2J0k4J04N0J82r7o1L8K50j36J45k58l7J5
$$ -101 320 101 43 -174 -447 -251 -440 -472 -145 -103 -93 -117 -13 37 219 122 61 99 349 213 358 100 63 78
709G8l45J94R0l91J35Q8j35L90J47o9l7j80J13l6Mm7J55j26K81j02l78l4J18l3
$$ 78 -267 -73 17 -374 -239 -151 -286 104 251 182 145 -35 78 42 46 -1 154 28 309 207 -171 -205 -87 -120
733a20N0l37J45O5r2M41m2r3J24j09k07L01J48j42M4j11m3L75l88k11M29m32K18
$$ -120 -70 -407 -262 -197 -289 152 110 17 141 32 -175 126 274 132 176 65 22 397 9 -202 227 -205 13
756A3j54K22O6k91P6m6L16Q6k86J38J16J78n66M5O0K1j52k4L0K80m09P9P6Q0J33
$$ 13 -141 81 147 -144 -68 -114 202 288 2 140 256 434 -132 -87 -27 -6 -158 -182 -152 128 -281 -202 -126 -46 87
781H7L8l08j36N94k00o4n7J40J11j95j68M08n08K80K2j46K02j84K75q5j07P4j22
$$ 87 125 -183 -319 275 75 11 -46 94 205 10 -158 250 -258 22 44 -102 100 -84 191 106 -1 73 -49
804d9p4J97j5L1K3k41n2J6P3k47M49L2l36J78N2K8j69K31K3k97k7N08l67P7J9
$$ -49 -123 74 59 90 113 -128 -180 -164 -91 -338 111 143 -193 -15 37 65 -104 127 150 -147 -174 334 -33 44 63
829F3l50K68j79j40J37J67kj23J61J25K2Oj55J49k71K88k0l73K98j8P3N0j5k75
$$ 63 -287 -19 -198 -338 -201 -34 -36 -159 2 127 149 155 0 149 -122 166 146 -227 71 53 126 176 161 -114
853a14J98n7l24L5J79l3L42l62q1nL81k60K21j3j1k27R6O8j34J8J5J95o4j75r9
$$ -114 84 27 -297 -262 -83 -116 226 -136 -217 -222 159 -101 120 107 96 -131 -35 33 -101 -83 -68 127 63 -112 -211
878b11K52J4j26J70L0O4j36L4p9L36k32l4k25J22K54l68j11K31LJ26J59m65K1
$$ -211 41 55 -71 99 129 193 57 91 12 348 116 82 -143 -21 233 -135 -246 -15 -12 114 273 -192 -171
901a71J16j51N38n60Q4L17J78m47K97j10k57J2j65K87Ok79q4L31j32K17k33J52
$$ -171 -55 -206 332 -228 -144 173 351 -96 201 91 -166 -154 -319 -32 -26 -305 -389 -58 -190 27 -206 -54
923e4K63k13K33j64oJ58k74J11J57J4l54M37k05k19J82p5j8k52J34J13K91k91
$$ -54 209 -4 229 65 59 217 -57 54 211 225 -129 308 103 -116 66 -9 -27 -279 -145 -32 259 -32
945c2r3K4L25j43M7K18k39j95J66P2k56J92j79j47L10j24JK78l37%K34l32P9J25
$$ -32 -125 -101 224 81 128 346 107 -88 78 150 -106 86 -93 -240 70 -54 -53 225 -112 -112 122 -210 -131 -6
969flJ43K1k36K14J1p2J24r4m42M7M93l76K42j24Q8K5l3j10J30q0n1J93J1j38
$$ -6 -9 134 155 -81 133 144 72 196 102 -340 -293 200 -176 66 -58 30 55 22 -88 42 -38 -89 104 115 -23
994b3N6L17m87M23k67p1R7J78j05n9k68j54L97j42Q6nJ39j25j1N6L47k45Ko2j14
$$ -23 33 350 -137 286 19 -52 45 223 118 59 -209 -363 34 -108 -22 -27 112 -13 -24 32 379 134 136 74 -40
1019d0O3q3J38j25Lk17N9J54M6l05K19O8k88M11m7k43L34M5j66J5j91K91j13j46
$$ -40 23 -60 78 -47 -44 -261 -202 -48 -2 -307 -88 -20 -308 103 56 -187 147 192 26 41 -150 141 28 -118
1043a18Q6J62j37P2j86k14K48J5N5L03j56r7rP1k7j20J54l60Q3L55O5j94k14K02
$$ -118 -32 130 -7 65 -121 -335 -87 -72 -17 286 130 33 24 95 68 -52 102 -258 -175 180 245 51 -163 39
1067C9R3r8J00k65j11K17K12J52k97J94l02K55l29J3J87K97m17j11L51J0k15j03
$$ 39 132 34 134 -131 -242 -25 187 339 42 236 -66 189 -140 -127 60 357 -60 -171 180 190 -25 -128
1089a28l4J18L77o14K91pP9M6o02N19l12L59J11l36L54m58N3j1K54P3m13N11m00
$$ -128 -162 -44 333 -281 10 3 82 128 -474 45 -267 92 203 -133 221 -237 -184 -195 59 132 -281 230 -170
1112a70J97j29R2M5om0q6O6n7K44m09K40J02j21R9M6l25K06J51q2j53K84j16N
$$ -170 27 -102 -10 35 29 -11 -97 -31 -88 156 -253 -13 89 -32 67 113 -212 -6 145 63 -90 194 78 83
1136H3l50J83J37l36K56j33K00R0l48J66M05n2j3k52j5J23j52L8m81O37l74J97
$$ 83 -267 -84 53 -283 -27 -160 40 130 -218 -52 353 301 288 36 21 144 -8 30 -451 186 -188 9
1158Io4qO5L83k85o5N2k99K40p4Q1j41O0r3m1J20K46n4J96k27j23L5j50J9J10
$$ 9 -55 -63 2 385 100 35 87 -212 28 -46 35 -106 -46 -139 -180 -60 186 132 328 101 -22 13 -137 -118 -8
1183hk74L80k64L65n20K03J77l1n9j27K70L3j00l6J88j2k46n7J37q4o5K0J06O5
$$ -8 -282 98 -166 199 -321 -118 59 28 -31 -158 112 145 45 9 197 185 -61 -118 19 -65 -130 -110 -4 61
1207F1k23L56m2k09mJ86k18J23J51l3j69J90j73j50L42K2k83j70K93j40j63L25
$$ 61 -162 194 152 -57 -61 125 -93 30 181 148 -21 169 -4 -154 188 210 -73 -243 50 -90 -253 72
1229G2j23J10P2M7l95L73k28Q3j41L28Rm28K51J39p6l24L17j60L4j78J92lj07
$$ 72 -51 59 131 178 -217 156 -72 11 -130 198 207 -221 30 169 93 -231 86 -74 -40 -218 -26 -29 -136
1252a36O9J53j52mJ1J19m6j10k52K55M11k00l60J95J71k43J29p7J79m22K95K05
$$ -136 -67 86 -66 -70 -59 60 14 -96 -348 -93 318 118 -242 -47 124 -119 10 -67 112 -310 -15 190
1274A90l56r5L24j50K41m17J22J95j05J4J83P4j36j1l06M11k89N9N5M33l26l31
$$ 190 -166 -261 63 -87 154 -263 -141 54 -51 -37 146 220 84 73 -233 178 -111 -52 3 436 110 -221
1296b21L77m49K12N75m89L8k19j95L72J15L3j40J72j80K5J6k26J7K17m4l2M1k2
$$ -221 156 -293 -81 494 5 43 -176 -371 1 116 149 9 181 1 26 42 -184 -167 50 6 -26 15 -7
1319gl05K57J60j90P6pJ92k20j58L13J3m04K61R1j38k8K12K13j10j90l0q0L07
$$ -7 -312 -55 105 -85 -9 -16 176 -44 -202 111 124 -280 -19 72 -66 -94 118 331 221 31 1 -79 228
1342B28j08k55J16K00j04l60L70k81J18q5K15N6N4m10K62K41j82r8J48m3j97J9
$$ 228 120 -135 -19 181 77 -283 87 -194 -76 -161 54 110 164 -246 16 257 75 -23 125 82 -115 -96
1364i6J39k32J92j35L56P7k04M4k31J56Q4j61K69k75j30K07K7k08N15m83K22j92
$$ -96 43 -189 3 -132 224 301 97 141 -90 66 150 -11 258 -17 -147 60 87 -121 394 -89 133 -59
1386e9J85K35o50K50n3qK27k17j66L14r5J36J08j57j56Q8o2K84m71K30Q8j62K90
$$ -59 126 361 -289 -39 -92 -100 127 -90 -256 58 -37 99 207 50 -106 -18 -80 204 -267 -37 51 -111 179
1409A79j77K9QJ8J56j27j59J07j07M2O4K14mj79j31r1K13k19J25J19oj62L43j89
$$ 179 2 31 39 57 213 86 -73 34 -73 -31 33 247 243 64 -67 -158 55 -164 -39 80 74 -88 255 66
1433F6l7j39J60j02k54K50J81n4Rk6k23J10r3J80L4J6m3m4P4%J06j58jL3j75K29
$$ 66 29 -110 50 -52 -306 -56 125 71 80 54 -169 -59 -152 28 62 78 35 -9 65 65 171 13 12 45 -130 99
1459I9J17m79o4J80M3MK17J65k67j51L04l74J90j17r1K80K3P1j17J64l21J47P9
$$ 99 216 -263 -327 -147 -104 -100 117 282 15 -136 168 -206 -16 -133 -224 56 79 150 33 197 -124 23 102
1482A02k40K08J31j05j26M7L07j63l40R7J03L88m06m2K8J01j7j1j5k04L87j11
$$ 102 -138 70 201 96 -30 17 324 161 -179 -82 21 409 3 -39 -11 90 73 62 47 -157 230 119
1504A19k51K9K55j52k74M8L86l67L80k6k23J78J46l67L27l62l2J18K39p3l68L95
$$ 119 -132 -103 152 0 -274 -226 160 -207 173 147 -76 102 248 -119 208 -154 -186 -68 171 98 -270 125
1526A25P2J67m21n4l4oM36l96qJ61p9N4J01k26M94n31J59M7O6l26K02K03j75P5
$$ 125 197 364 -57 -111 -145 -151 285 -111 -119 42 -37 17 118 -108 386 -145 14 61 127 -199 3 206 31 106
1550A06k37J63J81L3l14p3L21J68n58k9J67j57K42P5j56Q2J96j09Rj68O4n6M1
$$ 106 -131 32 213 246 -68 -141 180 348 -210 -239 -72 -229 13 88 -68 14 210 101 110 -58 6 -50 -9
1573ij75l8K67l5R1k27Q8J48r5j36K64j85O8q3j50O8J92l19R6Q1J05j36m5K54
$$ -9 -184 -222 45 10 101 -126 -38 110 15 -121 143 -42 26 -57 -207 -139 53 -266 -170 -89 16 -120 -165 89
1597H9k51J73m0m5J31J0k00L88l19J24k2j37Q0j91M54j09Lq6j24K3J99j61J57
$$ 89 -162 11 -29 -74 57 67 -133 255 -64 60 38 -99 -19 -210 244 135 138 52 -72 -49 150 -11 146
1620A46j32J62J1l90L72l47Q1n0K41j64j5q8L30j10j90J66j00M7L14Qm80K2lK32
$$ 146 14 176 187 -203 169 -178 -97 -147 94 -70 -85 -173 157 47 -143 23 -77 -30 284 292 -188 -166 -169 63
1644F3j95K38j81l2N71n70K05j71J85l6l07K46K4K82m82L59m04jL17J70j56k15
$$ 63 -132 106 -75 -107 464 -106 99 -72 113 77 -230 16 40 322 -160 199 -205 -206 111 281 125 -90
1666i0J20P4J67l22Q2j89M33k79R6k01k4J74k32J85J46j81K3J61J89M5j17M6k98
$$ -90 30 104 271 -51 31 -158 275 -4 92 -109 -133 41 -191 -6 140 -41 -18 143 332 377 260 306 8
1689Hk39M26o46P7K17J10j38K56j37P5j98L20m2k70J41O%P1j57j41J48K9K59k39
$$ 8 -231 195 -451 -374 -157 -47 -185 71 -66 9 -189 131 89 -181 -40 -34 -34 37 -120 -261 -113 -84 175 -64
1713f4j39K57O9m2l88M82l95R8K41k39K72j41J68k49J15L6o7l0j10O8l2J24j86
$$ -64 -203 54 123 81 -307 175 -220 -122 119 -120 152 11 179 -70 45 81 14 -16 -126 -58 -90 34 -152
1736a52L41m04K90K04m32M13k50J2K1k6J41k67l3j73K26K1R5l24M47k06J41K7
$$ -152 189 -215 75 279 -153 260 10 22 43 17 158 -109 -142 -315 -89 -68 27 -297 150 -56 85 112
1758A12j39m0J0M3j55m6K91j59J43q0P8M2P1l07n3K54J06L6n9j13m5J49l58L84
$$ 112 -27 -67 -57 -14 -169 -215 76 -83 60 -20 58 100 171 -136 -189 65 171 207 148 35 -10 139 -219 165
1782A65k43K67l81j09K36J14R0l27M58j8j98R2j30j14O2k30R9L3N5j78J85R4q3
$$ 165 -78 189 -192 -301 -65 49 139 -188 270 252 54 146 16 -98 -36 -266 -167 -134 -79 -257 -72 22 -61
1805f1J59q4K79l28j07P5j43K12p3L33k5k85N2N2k6K29n06J34M3rK92j73J56j2
$$ -61 98 14 293 -35 -142 -67 -210 2 -71 262 237 -48 4 56 30 259 -247 -113 -70 -79 213 40 196 184
1829A84k75j83L02q9L21m42j4N3K07l8J31k02K39l47O1M27j76m48L46J44j33k00
$$ 184 -91 -274 28 -61 260 -182 -196 -143 64 26 157 -45 194 -153 -92 335 159 -289 57 201 68 -132
1851a32L76k36n3L19l50P6m5J01k06M84l18K31k50J94k10J69k8j55K69n11N01
$$ -132 244 8 -45 274 -76 0 -45 56 -150 334 16 247 -3 191 -19 150 122 -33 236 -275 226
1872B26k08K02k10K31k30o6L4J5p0J67k37J57j51j0J19R6k57K62r6J81J26p4k52
$$ 226 18 220 10 241 11 -55 -21 -6 -76 91 -146 11 -140 -150 -31 65 -192 70 -26 155 281 207 -45
1895d5K3LN0k61M26n27J82J84j62J10K07k51P5l36K76j2k4J21j94K69J16l05M36
$$ -45 -22 -19 31 -230 196 -331 -149 35 -127 -17 190 -61 14 -322 -46 -58 -82 39 -155 114 230 -75 361
1918C61m65J60P0p0L2L2m84L44O3m8K63l52K74q4Rm28M05O7j55N6J4p1kj68J05
$$ 361 -104 56 126 56 88 120 -364 -20 43 -5 258 -94 180 96 105 -323 82 149 -6 50 64 -7 -9 -177 -72
1943g2n4j20M35J77k95L04k44m8J27k03n3J15n3q4J84j21N9J58RLk01L2J17k69
$$ -72 -126 -246 189 366 71 375 131 83 210 7 -46 69 16 -68 116 -5 54 212 221 224 23 55 172 -97
1967i7J35l7J16R9l59L74k08K8Rj7n2J01k39K08l60Q7L68l92M56n9j51J8J43n2
$$ -97 38 1 117 216 -143 231 23 51 60 43 -9 92 -147 61 -299 -212 156 -236 220 161 10 28 171 119
1991A19r2J82n52L52J33j94l8K20k85J99j59K59p9K14l48M01k39j16qk0K00j73
$$ 119 27 209 -343 9 142 -52 -90 130 -155 44 -115 144 65 279 -69 332 93 -23 -31 -51 149 -24
2013b4l3J53q1J21j84J44rj61J56k18j41M14k51j4LL97m25Q3J71o5k32K52Q4j6
$$ -24 -57 96 15 136 -48 96 87 -74 82 -136 -277 137 -114 -128 -125 272 -153 -70 101 36 -196 56 140 124
2037A24O4k17mK20n6k27L32k09R9k22nK25j90Q1j91K18k41L91k83M6K31j17j72
$$ 124 188 -29 -33 187 131 -96 236 27 126 -96 -101 124 -66 15 -176 42 -199 192 -91 -45 186 69 -103
2060a03O9k66K91J6J01j11j75J67j18m6L49k10L7j35q0Q1K09Q4j78jO2oJ59r8
$$ -103 -34 -300 -9 7 108 -3 -178 -11 -129 -175 174 -36 1 -134 -214 -133 76 160 -18 -19 43 37 196 98
2084I8l30L46k85m0J91J59k27n3J21J75j63j15R4n1J54k44k24M18m59M81r5O8
$$ 98 -232 114 -171 -211 -20 139 -88 -141 -20 155 -8 -123 -29 -80 74 -170 -394 24 -435 46 -49 19
2106A9K4k48J53J90k35j88N01k22M1j59K19k22J14j32n1L04k33K14q3Po4m5r0
$$ 19 43 -205 -52 138 -97 -285 216 -6 35 -124 95 -127 -13 -145 -196 108 -125 89 6 13 -51 -96 -186
2129a86J84o7J72k99K79K4l31K3K07j21K60l27L88l01l5N01l84L13l89J9J76j48
$$ -186 -2 -69 103 -196 83 107 -224 -201 6 -115 145 -182 206 -95 -130 371 -13 300 -89 -70 106 -42
2151d2q6K19N0k11j78K78l9NK0j76M35m08K20k00R4J2J09N9j43j14N9k12J77Q3
$$ -42 -128 91 141 -70 -248 30 -9 -4 16 -160 275 -133 87 -113 -19 -7 102 161 18 -96 -37 -249 -72 11
2175A1k11K14L3J58n34K92j13n3o0J35J05L5m0m6j11J15Q5K22lm34M25j68J85
$$ 11 -200 14 47 205 -329 -37 -150 -203 -263 -128 -23 12 -28 -74 -185 -70 15 237 234 -200 225 57 242
2198B42l73J63l2j1j66K31r9q9M08l25M16n23L17k39q1J9o3J35J16k33J52J74
$$ 242 -131 32 0 -11 -177 54 -45 -134 274 -51 365 -158 159 -80 -161 -142 -205 -70 46 -187 -35 139
2220A39q2j18K5O6j52R6m5J11j66K41o4RLk68K72k7J9o1p8k3J55K08k11L8Np2
$$ 139 57 -61 -36 30 -122 -26 -71 40 -126 115 51 60 63 -205 67 40 59 -2 -80 -103 52 260 49 87 92 20
2246B0j1K42l47J46r4J16J77m50K05l92K23L09j09O6Nj48P4J73j67k10r1L74k37
$$ 20 9 251 -96 50 -44 72 249 -201 4 -388 -165 144 35 101 106 -42 32 205 38 -172 -263 111 -126
2269a26K03k51K54l60K51J9J74l56M35J0o02K47K50k04K92j91j00K07k87K01m0
$$ -126 77 -174 80 -280 -29 -10 164 -192 243 253 -349 -102 148 -56 236 45 -55 152 -135 66 26
2290B6j21J7j76L9K99j40j18J16O4p6P2K2m9L0J7J18p34P39k55l6K40j15P0nj05
$$ 26 -95 -78 -254 -215 84 -56 -174 -58 6 -70 2 24 -25 5 22 140 -594 145 -110 -146 94 -21 49 44 -61
2315f1l8j14K4K85q5k75L74j52j43K99r6J11j95J96j74RP8j89r3L35j16qJ12J22
$$ -61 -99 -213 -189 96 11 -264 110 -42 -185 114 18 129 -66 130 -44 -35 43 -146 -239 96 -20 -28 84 206
2339B06j75J64j65J28M3k19k21n9M48nm17L17K77l9o5l32J4J79j29j06J30j3Q2
$$ 206 31 195 30 158 201 -18 -239 -298 150 145 -272 45 322 283 218 -114 -100 79 -50 -156 -26 -39 43
2362D3l8l4j4P2KK2J9l0l1K3m4k3J67j92O1k3K50j60l5J29m8J58l67o2J63K33
$$ 43 5 -29 -43 29 31 53 72 42 11 34 -10 -33 134 -58 3 -20 230 70 35 164 116 274 -93 -155 8 241
2388B41n62K97K4p1J01qO3J3J06l44j64L86m37J85J99Q9k10Q7L0L48l28L6j88
$$ 241 -321 -24 0 -71 30 22 85 98 204 -140 -304 82 -355 -170 29 118 -92 -5 25 373 45 81 -107
2411a07J93n2j77j5J2O2n3L49j32j46j1L20j82j82n4J67j41L29l8m9j86r9K87
$$ -107 86 34 -143 -158 -146 -84 -137 212 80 -66 -77 243 61 -121 -175 -8 -149 180 142 93 -93 -192 95
2434I5j31o0M1M9Q8k44M25l25J64l78L37m2j04J05J00o6Q8j8O9k19K2M6K6J45
$$ 95 -36 -96 -55 -6 82 -162 263 -62 102 -276 61 19 -85 20 120 54 142 124 193 -26 -4 42 68 213
2458B13j87l83L94J53j80K79k89n6lj08K4J77K3k01J3K34k06K54j82q2O8J37k68
$$ 213 26 -357 37 190 10 289 0 -56 -59 -167 -143 34 57 -144 -131 103 -103 151 -31 -113 -45 92 -176
2481a76L08k32J21o4m9k4K27j00j16J06k32J77J85j98j49K88j97J96O3k03K17
$$ -176 132 -100 21 -43 -92 -116 111 11 -105 1 -231 -54 131 -67 -216 72 -125 71 134 -69 148
2502A48k91o6K57k10J13j11J39J7R3k53N0K42%k07P7R8j02J01j89j34Q1J47R3
$$ 148 -143 -209 48 -162 -49 -160 -21 -4 89 -164 -114 128 128 -79 -2 96 -6 95 -94 -228 -147 0 93
2525I3l3k53L53l81M46m19j9J39M4K5L7j2j29J45n6k82N13k36J01k09J83ml68
$$ 93 60 -193 160 -221 225 -194 -213 -74 -30 -5 32 20 -109 36 -20 -302 211 -25 76 -133 50 46 -322
2548c22K56J52k5J07j21P1J84l61J95lJ13j46l47M19k72K7J82O5l27k25K96j02
$$ -322 -66 86 61 168 47 118 302 -59 136 133 246 100 -247 172 -100 -73 109 174 -153 -378 -82 -184
2570a84K28j49J87K23L4l91l4K6R4L7pk45J13J76j12N3J58j39L4J42j25P8o11
$$ -184 44 -105 82 305 339 -52 -86 -60 34 71 64 -181 -68 108 -4 49 207 68 102 244 119 197 -414
2593d14P14k70k7j95L26j57j47J04O3K15q3k7j78J77j32j11J11J24N4j74k22N16
$$ -414 300 30 3 -192 134 -23 -170 -66 -3 212 129 102 -76 101 -31 -142 -31 93 147 -27 -249 267
2615B67m87K10j76J56j24J03k0J34j60r5m4M5Q1K91K0k82O4J1R5j3nQ8j21J60
$$ 267 -220 -10 -186 -30 -154 -51 -71 63 -97 -192 -236 -191 -110 181 201 -81 -17 -6 89 76 71 159 38 198
2639A98l21J57K5L5j07K9k33J46R7q4J41Q6j04l04K71J2O4m0m4K16jk33l0J07
$$ 198 -123 34 59 94 -13 16 -217 -71 26 -58 83 169 65 -239 32 44 108 68 24 240 239 6 -24 83
2663H3N7J05j71j42J3j35P7M21k57j11K15J6k1l93L08k71L25j45J64O8m3p3j94
$$ 83 140 245 74 -68 -55 -190 -113 308 51 -60 155 171 150 -243 65 -206 119 -26 138 206 163 90 -104
2686a04J68j39K50P8l15N9P7Rj35L3m9J57k32L98k10J8L04l56R7l08O8R9J80j50
$$ -104 64 -75 175 253 -62 -3 74 83 -52 -19 -68 89 -143 255 45 63 367 11 108 -200 -132 -33 147 -3
2710cJ26J03m89M92k47K9j48RK62n24L45K81j62j6j29J81j68Jj13M90k05n0k41
$$ -3 123 226 -263 229 -18 11 -137 -128 134 -390 -45 236 74 58 -71 110 -58 -57 -170 320 115 65 -176
2733a76L39m20J62J37k03K8K53N7k96R6R9k22LO8K82l8l09Q9J60k64K67p1L0j90
$$ -176 163 -257 -95 42 -161 -133 120 177 -119 -23 76 -146 -143 -75 207 169 -140 -51 109 -155 112 41 71 -119
2757a19r2L74R1r9j86J68m43K26l4P1Q6l7M9J86l85QK62j74J35Q6m06P4K20J46
$$ -119 -211 163 254 155 -31 137 -306 -80 -114 -43 43 6 55 241 -144 -136 126 -48 87 173 -233 -159 61 207
2781B07Mk82K30n1l31L06j2j25j76M21k51o2j55l2J08J39J96q4K71k33m7j49p9
$$ 207 211 -71 159 108 -223 83 71 -54 -230 191 -60 -122 -277 -309 -201 -62 134 50 321 88 41 -108 -187
2804a87J91j37K27q9N9N4J5j84j34PJ96J6Q8k99P3J60J5O5j88R9k93L70l58J15
$$ -187 4 -133 94 5 64 118 133 -51 -185 -178 18 34 122 -177 -104 56 71 136 -52 47 -246 124 -234 -119
2828a19K56J01k15J26l97L09P9r2l6J27k84L66R9j71N2k90K63L0l96L29k73L61
$$ -119 137 238 23 149 -248 61 140 48 12 139 -145 221 320 149 201 -89 174 204 -192 137 -136 225
2850B25k88n4J24k36M25j87m7r2L36j67k54L25o3J2M5k52J83j48L74k75l73O17
$$ 225 -63 -117 7 -229 196 9 -38 -130 206 39 -215 110 47 59 104 -148 35 -113 261 -14 -387 230
2872B30k00J97j14j18k90j4K83o9K5K74k32o3J1J65L6l37K97j06J04j44J28j29
$$ 230 30 227 113 -5 -295 -309 -26 -95 -70 204 -28 -91 -80 85 121 -216 81 -25 79 -65 63 -66
2894f6j33K07K20k72m4L13l26K02L4K7k12l6M8R6j6R5l0q5j75J76M2J71k95P1
$$ -66 -199 8 228 -44 -88 225 -101 101 135 162 -50 -86 -38 58 42 137 107 22 -153 23 65 236 -59 12
2918A2j90M8l7j35J01M02l85K57m5k1L6j57p9K74l37R6K25%m2L0o8l21L88J20
$$ 12 -178 -130 -167 -302 -201 201 -184 73 28 7 43 -114 -193 81 -256 -160 65 65 23 53 -15 -336 52 172
2942A72k80r1J22J4O1J61k71l10N84n3l21J29J75j01m4P1J32q0l29N40m75K05
$$ 172 -108 -199 -77 -63 -2 159 -112 -422 162 109 -212 -83 92 -9 -53 18 150 70 -259 281 -194 11
2964A1J04j73O9j34L87k63J8j98r1K70j2j55K40N9j49o3K21J98q8j21k85J20K46
$$ 11 115 -58 11 -123 264 1 19 -179 -270 0 -12 -167 73 132 -17 -80 141 339 251 130 -155 -35 211
2987B11j4l24L90r8l54N37l82k03J45k5J3j35K87M7j04O7k04K76k25q0K1P0L8
$$ 211 197 -127 263 165 -189 348 -34 -237 -92 -117 -104 -239 48 95 -9 58 -146 130 -95 -175 -154 -84 -46
3010d6jr6J94J79J58m37K0j06Q0M9J9R8l8J76j32j84j72j1L03L6j88J61J60j24
$$ -46 -47 -143 51 230 388 -49 -29 -135 -55 -6 13 111 73 249 117 -67 -239 -250 53 89 -99 62 222 98
3034I8j85n1R4m7j45L30j28L19l29P1j09J38p9O1m8O2j62J29p8K73P7m41R2J89
$$ 98 -87 -138 -44 -91 -236 94 -34 285 -44 27 -82 56 -23 38 -10 52 -110 19 -59 214 291 -150 -58 131
3058A31k52K10r7J82k47J32P2m4k05N3q0K17O5Ok57P5J10RO1r0J2Lr8N0j16J03
$$ 131 -121 89 -8 174 -73 59 131 87 -118 -65 -145 72 137 143 -114 -39 71 80 141 51 63 66 -32 18 -98 5
3084EJ35k41K43p5j2Km6k10M23j93j89J37O3M5j34p2L08k04J6Q3j34L79m23R2
$$ 5 140 -101 142 67 55 57 11 -199 224 31 -158 -21 42 87 -47 -119 189 -15 1 84 -50 329 -94 -2
3108bN5k06J54J66k42P2rj2J0J14j06J20R0j34j27j5J82j24Q3O4l55P0Q1j24M06
$$ -2 53 -153 1 167 -75 -3 -12 -24 -14 100 -6 114 204 70 -57 -72 110 -14 69 133 -222 -152 -71 -195 211
3133B11k89J77j84M8J78L5k97J43j7j41K60l38K67o4j45Q6P0j51J83L23j31k59
$$ 211 -78 99 -85 -37 141 176 -121 22 5 -136 124 -214 53 -11 -156 -70 0 -151 32 355 224 -35
3155c5J69J41m94K79n8p9Q4j48J22J57j80q1p8J34J34j62j88L57j83R6J58l50
$$ -35 134 275 -219 60 2 -77 7 -141 -19 138 -42 -123 -201 -67 67 -95 -283 74 -109 -13 145 -205
3177b05K07K31J6o08K61K31j61L3k20J13l42L75j69J19J72QRo4l7Q6k8l07J12
$$ -205 2 233 249 -359 -98 133 -28 5 -215 -102 -444 -69 -238 -119 53 61 70 6 -31 55 27 -280 -168
3200a68l3K70m6j18J08o2j50J70O6J57k24L60m12J45n0Q5M2k71J41k0k24L81l1
$$ -168 -201 69 23 -95 13 -49 -199 -29 37 194 -30 330 -82 63 13 98 140 -131 10 -10 -234 147 116
3223A16j01j15j7R8Jj05L14j82m8J12k40K31p8k03K24J11J05m19K17l7K25n9l76
$$ 116 15 -100 -117 -19 -18 -123 191 9 -39 73 -167 64 -14 -217 7 118 223 -196 21 -16 209 150 -226
3246b26O2P1J82k08J63l0l75M07k77L68j33r0K73k54j25M2J73j01Q7L09n22L70
$$ -226 -164 -93 89 -119 44 14 -361 46 -231 137 4 -86 187 -67 -192 -150 23 -78 9 318 -204 166
3268A66J06m19J45r5J29J56J67j33l62K7P2L3j06O7J10OjQk09L45j37j43L9j80
$$ 166 272 -147 -2 -97 32 188 355 222 -140 -113 -41 -8 -114 -47 63 69 68 76 -133 212 75 -68 -29 -209
3292b09K58o1j1J48j68j08J71R8k24P5j7J64J22n15K77l44J06J48o8K83l57N15
$$ -209 49 -12 -23 125 -43 -151 20 118 -106 -31 -48 116 238 -277 0 -344 -238 -90 -158 125 -232 283
3314B83m08l8j62K72N7Rj3P4K8j50j31J74J77l8j42j86K37j73J35J76j55k16J37
$$ 283 -125 -163 -325 -53 4 13 0 74 102 -48 -179 -5 172 134 -8 -194 43 -130 5 181 26 -190 -53
3337e3p0K76k16J09k36K7k2L56J45l65K70l58R0K48j89j92P2Q1j34Q5K00k78R2
$$ -53 -123 153 -63 46 -190 -163 -185 171 316 -49 221 -137 -47 201 12 -180 -108 -27 -161 -76 124 -154 -62
3360f2M2K47j77l08L46j46o8L4L2J52k1k59N0J97o0j07M1j00J69qo9NpJ00j76
$$ -62 -20 227 50 -258 88 -58 -126 -92 -60 92 71 -188 -138 59 -1 -108 -67 -167 2 -6 -75 -70 -77 23 -153
3385a53m6L58o7j8j57K4j66J52q5L02l86j3L31k4P0k27l9J66p8o3p2K85n8r9J02
$$ -153 -199 159 92 74 -83 -59 -225 -73 -158 144 -242 -255 76 52 122 -105 -144 22 -56 -119 -191 94 36 -63 39
3410C9L4J8o4J02k52L23km52L54Q5j31j69J67j87L77l32J19j22J98j38K64l22
$$ 39 73 91 27 129 -123 200 198 -254 100 185 54 -115 52 -135 242 -90 29 -93 105 -33 231 -91
3432i1J84j22j61J58j43K25l74L14j77J86n0K57j08J4p0J28K2m2j77K35m2j43
$$ -91 93 -29 -190 -32 -175 50 -324 -10 -187 -1 -51 206 98 112 42 170 192 150 -27 208 166 23
3454B3K07j73j40J66k90J55K53k78n6N2J2n0j14k3N22l34j61J05J37K05l21k00
$$ 23 230 57 -83 83 -207 -52 201 -77 -133 -81 -69 -119 -233 -256 266 -68 -229 -124 13 218 -103 -303
3476c03M30j36j1l32K95K32r9k40J53j41K74n7r3J39n7j59k19L10J78k36R2L15
$$ -303 127 -9 -20 -352 -57 175 76 -164 -11 -152 122 65 -28 111 54 -105 -324 -14 164 -72 20 335
3498C35n43K19J00k83K8K24K0J1j68j6Q8j07K39k50QJ76j90j9L4mq6M47q4k24
$$ 335 -208 11 111 -172 -144 80 100 111 -57 -73 15 -92 147 -103 -95 81 -109 -128 -94 -98 -184 263 179 -45
3522d5j1K43o7k54J30k3pJ50j27l0k5Qr4qK1P7q2L08l86K5J55k05L72k32J67K9
$$ -45 -56 187 120 -134 -4 -27 -34 116 -11 -41 -66 -58 -152 -160 -139 -62 -144 164 -222 -197 -42 -247 125 -107 60 89
3548H9j28L44k97j94j20L64j55J39j13J15K8r8R3k9j91J22K19l19J84Ql8P3k68
$$ 89 -39 305 8 -186 -306 58 -97 42 -71 44 72 -26 67 38 -153 -31 188 -131 53 61 23 96 -172
3571a72K27J15J0p0L46n86k35J41J27mJ69k29L26O6m41M41l28m7L25p0j48r7O6
$$ -172 55 170 180 110 456 -130 -365 -224 -97 -101 68 -161 165 231 -210 231 -97 -144 181 111 -37 -134 -68
3594f8J03J39j46qj03l36L25J94k34K38k54J53Nnk08J26J16q5j08R2p8K97q3j63
$$ -68 35 174 28 20 -83 -419 -94 100 -134 104 -150 3 8 3 -205 -79 37 -48 -156 -64 -142 155 72 -91
3618i1K91l98J95P4j99P7r3O3k1Q7J94Q6j91o5J93l01L35j96N5o4J51K0j79l15
$$ -91 200 -198 -3 71 -128 -51 -144 -81 -102 -15 179 265 74 9 202 -99 236 40 95 31 182 202 23 -292
3642b92J2M19m5Q9L39n46J28k23N4K0J68k61L27k33O6j0L8J4j62J44J6k43L27
$$ -292 -280 139 94 183 522 -24 104 -119 -65 -45 123 -138 189 -44 22 12 50 64 -98 46 62 -181 146
3665A46k96K7J7N2J58M2k30K12J03N3k34j16L6l5j36K82k52K56l0p7k43L14m9
$$ 146 -150 -123 -106 -54 104 146 -84 128 231 284 50 -66 -30 -65 -201 81 -171 85 55 -22 -265 49 0
3688@M1k16J07Q2J20k16k5L88j04j35n2J06R3k28p0N6j89J52L8q3j5K05m6J13
$$ 0 41 -175 -68 14 134 -82 -107 281 177 42 -10 96 189 -39 -109 -53 -242 -90 -52 -135 -150 55 9 122
3712A22q1l14K69L09k66j04K56j45k90J98p6Q7k41L04j92J68J54j16L00l24j03
$$ 122 41 -273 -4 305 39 -65 191 46 -244 -46 -122 -35 -276 28 -164 4 158 42 342 18 -85
3733h5K04j29l8%N0l6J43j58P4r2j62M02N7j08k03r8K5o6J93l9j28J79Q6m13M11
$$ -85 119 -10 -48 -48 2 -34 109 -49 25 -67 -229 173 230 122 -81 -179 -154 -220 -27 -66 -194 -15 71 -342 69
3758F9j27J78r5j57R1L6n5J24k83k2K50qk2J7o4Q2q3l2K40r5o0q1p7K8L42m65
$$ 69 -58 120 25 -132 -41 -5 -60 64 -219 -241 9 1 -21 -4 -68 14 -69 -101 139 44 -16 -97 -174 -146 196 -269
3784b69J15K94j75j0j5l4Q0M5J51j35j54L77l8q5m97K28j29N96j62j08j63Q4l0
$$ -269 -154 140 -35 -45 -60 -94 -14 31 182 47 -107 270 232 147 -350 -122 -251 345 183 75 -88 -4 -34
3807c4j8L52k37p6o6j27K32J38k10J67l4r3K49k05k9o5L6k77L49j35j8L69j36
$$ -34 -52 300 63 -13 -79 -206 26 164 -46 121 87 -6 243 38 9 -56 -20 -297 52 -83 -101 268 132
3830A32j31j31O7l4n9K27nk63J65l3j53M55l62L23j64r1K07k16L3J6j97J91q7
$$ 132 1 -130 -63 -97 -156 71 66 -197 -32 -65 -218 237 -125 198 34 -57 150 -66 -33 -17 -214 -23 -110
3853a10j19L36p7K21j59k43R7J15J34k27q3P1r8M3R0j47Q2k30N92l3l21k30N1
$$ -110 -229 107 30 251 92 -151 -54 61 195 -32 -115 -44 -142 -99 -9 -156 -74 -304 288 255 -66 -296 -245
3876b45N40m40K07j23P3Q2L1l36L07j73OK85k45J4o2J68j17P5p5j65L65j05j68
$$ -245 295 -145 62 -61 12 94 125 -211 96 -77 -71 214 -31 -17 -79 89 -28 47 -28 -193 172 67 -101
3899a01m1K10j37J51k64K08n4j53Q3K43J13n19L54r1K64l19J14m84K97K58m13
$$ -101 -142 68 -69 82 -182 26 -28 -181 -98 145 258 -261 93 2 266 -53 61 -423 -126 132 -281
3920b81R4J28P2l34M46R9k67O4j36J97j70J51m7k7j20L93m03k6K73o3j64J83l47
$$ -281 -187 -59 13 -321 125 224 -43 21 -115 82 -88 63 16 -11 -131 262 -141 -167 106 43 -121 62 -285
3943b85L76l4J16k22k06K27r3n2k71M73j27J77o6o1k09L60k2l38J15O3j85L07
$$ -285 91 57 173 -49 -255 -28 -121 -173 -444 29 -98 79 13 -48 -257 103 81 -257 -142 -79 -264 43
3965D3O8J6l55J00J12j18k25L28Q8l96K22j7N2J54PQ4j42q3K32o0K0l46J06L49
$$ 43 111 127 -228 -128 -16 -134 -359 -31 57 -339 -117 -134 -82 72 79 163 21 -62 170 110 130 -216 -110 239
3989B39k50N1l5R2j29o0N9n0j1o0J00j49L34j29J92l12J14n9k02N14k2l96P4J30
$$ 239 -11 40 5 97 -32 -92 -33 -83 -94 -154 -54 -203 131 2 194 -118 -4 -63 -265 249 227 -169 -95 35
4013C5n0J46k63J14J7l1j69PR5L8K1J18J75j86J79l14L64k90j41K18q6k96J98
$$ 35 -15 131 -132 -18 -1 -32 -201 -194 -99 -61 -40 78 253 67 246 -68 296 6 -135 83 -3 -299 -101
4036a01L54k61j07O1J43J12k26J97k59j6Q3k24J74j9J91k77L00l54L35q1k50L09
$$ -101 253 -8 -115 -54 89 201 -25 172 -87 -103 -20 -244 -70 -89 102 -175 125 -229 106 25 -225 84
4058H4K1M0l40L51k86P8q9M7J66j33J53O3j18nr0j6o4n9J16J54Q2k10j3K14j94
$$ 84 105 145 -195 156 -130 -52 -141 -94 72 -61 92 155 37 32 -58 -74 -138 -197 -81 73 155 -55 -68 146 -48
4083d8J86j33j06j19L13O5k83J51r5L29l29l21L55O3P5k15L22J1m5j3m53N20m39
$$ -48 138 5 -101 -220 93 158 -125 26 -69 260 -69 -390 -35 28 103 -112 210 221 176 163 -290 230 -209
4106b09L56j08J15k58J09n7J23j24r0K87k57J55j67P0l5R5R6j93m7J62M1k81J84
$$ -209 147 39 154 -104 5 -52 71 -53 -143 144 -113 42 -125 -55 -90 5 101 -92 -139 23 64 -217 -33
4129c3K69l76J35k38L48j47KJ11k65J20J46p4J2J10n6K14m98J07L18l51m0j69
$$ -33 236 -140 -5 -243 105 -42 -40 71 -194 -74 72 -2 10 120 64 278 -220 -113 205 -146 -186 -355
4151c55K56J64K25j86R0l55M1J57m0k13L02j27L7P6J5N3j1n06M20j1J43j45j44
$$ -355 -99 65 290 104 194 -161 -120 37 -3 -216 86 -41 -4 72 87 140 129 -377 43 32 175 30 -114
4174a14K80n26L79O7q0j59L5J02Q4lj95J20K16pk23J96m29K51r5K52j26k81K98
$$ -114 166 -360 19 86 6 -153 -118 -16 68 65 -130 -10 206 199 -24 172 -257 -6 -101 151 25 -256 42
4197D2j84l1o0K17K26j10l3Q7j09J64l01K34l64p2J66J79J16j48L6J50l72o2L79
$$ 42 -142 -173 -233 -16 210 100 67 154 45 209 -92 142 -222 -294 -128 51 167 19 55 205 -167 -229 150
4220A50M2k38n7k8O1l29N53Pl50M98l82j27L48k91K91m92K98N5j47P6J07J69q5
$$ 150 192 -46 -103 -131 -70 -399 154 161 -189 309 -73 -200 148 -143 148 -344 -46 9 -138 -62 45 214 129
4243A29k57J18QP3k19M88l15k32J95j52K01j7P5j23L5O1j1k68JL12Qj03QK83q
$$ 129 -128 -10 -2 71 -148 340 25 -207 -12 -164 37 20 95 -28 7 68 57 -211 -210 102 110 7 15 298 290
4268B90k96k13K96K34rm79k6K88q5m2K95m02J01J08P6J1k86K9Mj27J72M6JN2k7
$$ 290 -6 -219 77 311 302 -177 -203 85 0 -42 253 -149 -48 60 136 147 -139 -110 -106 -233 -61 -15 -14 38 11
4293A1J13Oo6j84N27j82k52n7o2M34j9k12%R9k5k28j23K47K40k22N0k46r1L48
$$ 11 124 130 64 -120 407 225 -27 -84 -146 288 269 57 57 156 131 -97 -220 27 267 45 95 -151 -242 106
4317A06j77mL23l31J56J43j92O9k50K25m90M52k01J82j3j64o1N7K83j48oO0k24
$$ 106 -71 -75 248 -83 73 216 24 93 -157 68 -422 30 -171 11 -2 -166 -227 -170 113 -35 -41 19 -205
4340b05J74jO4O4j25j45q0K62P1l99Q1J76j60K38K4j49j4N8K18j60Ok7J22J24
$$ -205 -31 -32 32 96 -29 -174 -254 8 79 -320 -239 -63 -223 15 39 -110 -124 -66 152 -8 -2 -29 93 217
$$ [...]
8191A05
##END NTUPLES=NMR FID
##END=
