##TITLE=1H_DE-92
 200.13MHz, CDCl3,
 8 sc
 
 28.4.2025
##JCAMPDX= 6.0         $$ Bruker NMR JCAMP-DX V2.0
##DATA TYPE= NMR FID
##DATA CLASS= NTUPLES
##ORIGIN= UXNMR, Bruker Analytische Messtechnik GmbH
##OWNER= pz
$$ XWIN-NMR		Version 3.5
$$ Mon Apr 28 14:14:28 2025 Russian Standard Time (UT+4h)  she@DPX200
##.OBSERVE FREQUENCY= 200.1313
##.OBSERVE NUCLEUS= ^1H
##.DELAY= (6, 6)
##.ACQUISITION MODE= SIMULTANEOUS
##.ACQUISITION SCHEME= undefined
##.AVERAGES= 8
##.DIGITISER RES= 18
##SPECTROMETER/DATA SYSTEM= spect
##.PULSE SEQUENCE= zg30
##.SOLVENT NAME= CDCl3
##.SHIFT REFERENCE= (INTERNAL, CDCl3, 0, 14.3821)
##AUDIT TRAIL= $$ (NUMBER, WHEN, WHO, WHERE, WHAT)
$$ ##TITLE= Audit trail, XWIN-NMR		Version 3.5
$$ ##JCAMPDX= 5.01
$$ ##ORIGIN= Bruker BioSpin GmbH
$$ ##OWNER= she
$$ F:/spectra/data/she/nmr/H-C/1/audita.txt
$$ ##AUDIT TRAIL=  $$ (NUMBER, WHEN, WHO, WHERE, WHAT)
(   1,<2025-04-28 14:12:20.07 +0400>,<she>,<DPX200>,
      <created by zg, POWCHK disabled, PULCHK disabled
       configuration hash MD5:
       00 E9 B6 7A A2 85 ED C7 34 08 36 98 17 FE 4E 26
       data hash MD5: 16K
       B4 55 0C 9A C7 5A 5D 21 66 0E 78 E5 F3 05 90 7E>)
$$ ##END=
$$ 
$$ hash MD5
$$ 2D C1 DC EE B2 0F B6 31 B7 A7 E6 53 D6 01 94 12
##$RELAX= 
##$RELAX= 
##$RELAX= 
##$RELAX= 
##$RELAX= 
##$RELAX= 
$$ Bruker specific parameters
$$ --------------------------
##$DU= <F:/spectra>
##$EXPNO= 1
##$NAME= <H-C>
##$PROCNO= 1
##$TYPE= <nmr>
##$USER= <she>
##$AMP= (0..31)
100 100 100 100 100 100 100 100 100 100 100 100 100 100 100 100 100 100 
100 100 100 100 100 100 100 100 100 100 100 100 100 100 
##$AQSEQ= 0
##$AQ_mod= 1
##$AUNM= <au_zg>
##$AUTOPOS= <>
##$BF1= 200.13
##$BF2= 200.13
##$BF3= 200.13
##$BF4= 200.13
##$BF5= 200.13
##$BF6= 200.13
##$BF7= 200.13
##$BF8= 200.13
##$BYTORDA= 1
##$CFDGTYP= 0
##$CFRGTYP= 5
##$CHEMSTR= <none>
##$CNST= (0..31)
1 1 145 1 1 1 1 1 1 1 1 1 1 1 1 1 1 1 1 1 1 1 1 1 1 1 1 1 1 1 1 1 
##$CPDPRG= <>
##$CPDPRG1= <>
##$CPDPRG2= <>
##$CPDPRG3= <>
##$CPDPRG4= <mlev>
##$CPDPRG5= <mlev>
##$CPDPRG6= <mlev>
##$CPDPRG7= <mlev>
##$CPDPRG8= <mlev>
##$CPDPRGB= <>
##$CPDPRGT= <>
##$D= (0..31)
0 0.7 0 0 0 0 0 0 0 0 0 0.03 0 0 0 0 0 0 0 0 0 0 0 0 0 0 0 0 0 0 0 0 
##$DATE= 1745835139
##$DBL= (0..7)
120 120 120 120 120 120 120 120 
##$DBP= (0..7)
150 150 150 150 150 150 150 150 
##$DBP07= 0
##$DBPNAM0= <>
##$DBPNAM1= <>
##$DBPNAM2= <>
##$DBPNAM3= <>
##$DBPNAM4= <>
##$DBPNAM5= <>
##$DBPNAM6= <>
##$DBPNAM7= <>
##$DBPOAL= (0..7)
0.5 0.5 0.5 0.5 0.5 0.5 0.5 0.5 
##$DBPOFFS= (0..7)
0 0 0 0 0 0 0 0 
##$DE= 6
##$DECBNUC= <off>
##$DECIM= 32
##$DECNUC= <off>
##$DECSTAT= 4
##$DIGMOD= 1
##$DIGTYP= 9
##$DL= (0..7)
0 120 120 120 120 120 120 120 
##$DP= (0..7)
150 150 150 150 150 150 150 150 
##$DP07= 0
##$DPNAME0= <>
##$DPNAME1= <>
##$DPNAME2= <>
##$DPNAME3= <>
##$DPNAME4= <>
##$DPNAME5= <>
##$DPNAME6= <>
##$DPNAME7= <>
##$DPOAL= (0..7)
0.5 0.5 0.5 0.5 0.5 0.5 0.5 0.5 
##$DPOFFS= (0..7)
0 0 0 0 0 0 0 0 
##$DQDMODE= 0
##$DR= 18
##$DS= 0
##$DSLIST= <SSSSSSSSSSSSSSS>
$$ [...]
##$SUBNAM0= <"">
##$SUBNAM1= <"">
##$SUBNAM2= <"">
##$SUBNAM3= <"">
##$SUBNAM4= <"">
##$SUBNAM5= <"">
##$SUBNAM6= <"">
##$SUBNAM7= <"">
##$SUBNAM8= <"">
##$SUBNAM9= <"">
##$SW= 18.0517328524113
##$SWIBOX= (0..15)
0 0 2 0 0 0 0 0 0 0 0 0 0 0 0 0 
##$SW_h= 3612.71676300578
##$TD= 16384
##$TD0= 1
##$TE= 0
##$TE2= 300
##$TE3= 300
##$TEG= 300
##$TL= (0..7)
0 120 120 120 120 120 120 120 
##$TP= (0..7)
150 150 150 150 150 150 150 150 
##$TP07= 0
##$TPNAME0= <>
##$TPNAME1= <>
##$TPNAME2= <>
##$TPNAME3= <>
##$TPNAME4= <>
##$TPNAME5= <>
##$TPNAME6= <>
##$TPNAME7= <>
##$TPOAL= (0..7)
0.5 0.5 0.5 0.5 0.5 0.5 0.5 0.5 
##$TPOFFS= (0..7)
0 0 0 0 0 0 0 0 
##$TUNHIN= 0
##$TUNHOUT= 0
##$TUNXOUT= 0
##$USERA1= <user>
##$USERA2= <user>
##$USERA3= <user>
##$USERA4= <user>
##$USERA5= <user>
##$V9= 5
##$VALIST= <valist>
##$VCLIST= <CCCCCCCCCCCCCCC>
##$VD= 0
##$VDLIST= <DDDDDDDDDDDDDDD>
##$VPLIST= <PPPPPPPPPPPPPPP>
##$VTLIST= <TTTTTTTTTTTTTTT>
##$WBST= 1024
##$WBSW= 4
##$XGAIN= (0..3)
0 0 0 0 
##$XL= 0
##$YL= 0
##$YMAX_a= 51127
##$YMIN_a= -82790
##$ZGOPTNS= <>
##$ZL1= 120
##$ZL2= 120
##$ZL3= 120
##$ZL4= 120
##$ABSF1= 10
##$ABSF2= 0
##$ABSG= 5
##$ABSL= 3
##$ALPHA= 0
##$AQORDER= 0
##$ASSFAC= 0
##$ASSFACI= 0
##$ASSFACX= 0
##$ASSWID= 0
##$AUNMP= <proc_1d>
##$AZFE= 0.1
##$AZFW= 0.1
##$BCFW= 1
##$BC_mod= 2
##$BYTORDP= 1
##$COROFFS= 0
##$CY= -3
##$DATMOD= 1
##$DC= 2
##$DFILT= <>
##$DTYPP= 0
##$F1P= 0
##$F2P= 0
##$FCOR= 0.5
##$FTSIZE= 0
##$FT_mod= 4
##$GAMMA= 1
##$GB= 0.15
##$INTBC= 1
##$INTSCL= 1
##$ISEN= 128
##$LB= 0.25
##$LEV0= 0
##$LPBIN= 0
##$MAXI= 10000
##$MC2= 0
##$MEAN= 0
##$ME_mod= 0
##$MI= 1.114404
##$NCOEF= 0
##$NC_proc= 0
##$NLEV= 6
##$NOISF1= 3.799351
##$NOISF2= 2.8
##$NSP= 1
##$NTH_PI= 0
##$NZP= 0
##$OFFSET= 14.38212
##$PC= 1
##$PHC0= -1184.05
##$PHC1= 6.392208
##$PH_mod= 1
##$PKNL= yes
##$PPARMOD= 0
##$PSCAL= 0
##$PSIGN= 0
##$REVERSE= no
##$SF= 200.129724274929
##$SI= 16384
##$SIGF1= 3
##$SIGF2= 2
##$SINO= 400
##$SIOLD= 16384
##$SREGLST= <1H.CDCl3>
##$SSB= 0
##$STSI= 0
##$STSR= 0
##$SW_p= 3205.1282051282
##$SYMM= 0
##$S_DEV= 0
##$TDeff= 0
##$TDoff= 0
##$TI= <>
##$TILT= no
##$TM1= 0
##$TM2= 0
##$TOPLEV= 0
##$USERP1= <user>
##$USERP2= <user>
##$USERP3= <user>
##$USERP4= <user>
##$USERP5= <user>
##$WDW= 1
##$XDIM= 8192
##$YMAX_p= 0
##$YMIN_p= 0
$$ End of Bruker specific parameters
$$ ---------------------------------
##NTUPLES= NMR FID
##VAR_NAME=  TIME,          FID/REAL,        FID/IMAG
##SYMBOL=    X,             R,               I
##VAR_TYPE=  INDEPENDENT,   DEPENDENT,       DEPENDENT
##VAR_FORM=  AFFN,          ASDF,            ASDF
##VAR_DIM=   8192,          8192,            8192
##UNITS=     SECONDS,       ARBITRARY UNITS, ARBITRARY UNITS
##FACTOR=    0.0002768,     1,               1
##FIRST=     0,             0,               0
##LAST=      2.2672688,     0,               0
##MIN=       0,             -82790,          0
##MAX=       2.2672688,     51127,           0
$$ Real data points
##PAGE= N=1
##DATA TABLE= (X++(R..R)), XYDATA
0 0 0 0 0 0 0 0 0 0 0 0 0 0 0 0 0 0 0 0 0 0 0 -4 8 -8 8 -8 8 -8 11 -15 16 -16 18 -23 23 -28 31 -31 36 -40 45 -51 56
43 56 -59 67 -75 82 -90 99 -109 121 -133 146 -160 180 -198 222 -247 281 -320 368 -429 509 -619
64 -619 777 -1027 1456 -2346 4877 -27937 -82790 25866 51127 -12247 8250 40988 10666
77 10666 3521 22555 8699 -9138 5669 612 -23266 -12262 243 -17364 -13167 2748 -4238
90 -4238 -2747 9065 5094 2646 6293 5475 5958 5390 -283 -2191 956 358 -4321 -3428 1082 -2203
106 -2203 -4408 -392 -1953 -2402 1249 -1211 -2545 2774 2868 -975 1746 4010 1309 175 2288 1560
122 1560 -1819 -1212 17 -2260 -2364 -478 -1953 -1715 568 175 472 1223 1260 763 840 1100 974 -261
140 -261 72 247 -641 -356 -117 -422 -474 -342 -61 72 56 -242 117 -93 -241 402 125 -81 514 401 -209
161 -209 116 42 -45 -227 -453 -254 -466 -231 -47 -216 -84 339 283 302 329 54 -180 -18 99 206 -166 -358
183 -358 117 -193 -122 -5 -109 -60 139 8 -73 17 -25 -181 131 -223 -17 217 -47 43 -14 -94 104 34 -95
206 -95 10 36 177 -58 -55 411 -55 -288 69 250 -72 110 114 15 -130 -12 146 -220 -327 -149 -24 -69 -53
229 -53 74 -146 294 3 95 -332 -184 -96 -260 -133 311 244 21 151 84 -201 51 105 14 83 235 -78 -34
252 -34 -124 140 4 325 119 -13 372 -157 200 170 90 148 -1 94 -260 116 104 49 84 118 116 -2 -136 -99 174
277 174 135 -54 -108 116 -115 -148 158 127 10 111 35 200 -130 77 41 -16 -85 -159 -213 82 96 -144 13 215
301 215 -194 -62 221 -23 30 137 -288 -20 -312 -97 -89 -215 130 280 44 -147 -203 -526 53 -117 -77 -134
323 -134 98 -9 -82 -136 88 -32 -156 40 186 142 60 -178 -160 -142 159 -181 -54 -88 200 116 276 154 -180
346 -180 97 -208 -93 122 11 239 70 49 32 198 -390 -79 -178 107 105 39 -80 211 76 -144 102 45 214
369 214 -27 121 -102 209 8 199 381 -22 154 -35 -297 -92 -50 -167 95 109 -1 208 -2 49 -33 7
391 7 173 -183 20 -98 303 -94 4 158 145 123 -224 49 -4 -40 26 -100 123 -137 -95 160 -4 130 -306
414 -306 -69 143 -88 224 165 -253 -41 -151 177 -10 -62 -62 141 82 113 4 212 -11 103 57 -56 33 12
437 12 -292 268 -178 -200 127 16 115 -90 -18 -149 140 -67 93 150 -22 110 -61 39 151 -108 22 -195
459 -195 -47 -83 -62 -130 -82 93 -6 371 -125 67 54 -143 154 -128 -133 -72 -119 25 -83 -50 -102 25 136 28
483 28 29 36 -62 -13 -147 120 -83 67 108 3 144 18 9 -122 91 175 -40 -298 -140 -65 175 85 -163 94 -53
508 -53 -200 164 105 162 39 -91 185 2 -276 -83 89 16 33 -119 -226 119 102 131 -77 -241 -79 48 5
531 5 42 0 322 27 75 202 -84 -125 -21 7 127 -89 -120 32 -2 -195 45 -8 190 -21 213 -54 -300 221
555 221 219 1 -185 -51 59 125 117 98 -127 -116 55 -5 52 -43 -294 -228 50 9 -42 -133 218 -50 63 129 -13
580 -13 9 325 -107 201 -73 -320 28 80 -93 -99 -14 -150 71 127 -150 -222 -177 -48 -25 -101 -200 -88 -2 -130 9
605 9 -189 143 172 225 -24 -233 0 249 62 252 388 17 -22 -104 7 86 102 -29 38 -95 216 -11 -234
628 -234 261 -178 272 -95 -54 89 -129 -196 -36 88 19 45 -120 -22 -11 99 -132 107 16 27 -141 -251 129
651 129 102 205 178 93 132 96 -43 -2 25 64 -18 180 266 -275 164 122 266 150 73 -223 210 -50 -200 28
675 28 65 118 35 -209 67 -60 -29 -124 4 54 240 294 -94 -20 3 29 -75 303 -116 89 -148 82 115 172 234
700 234 -3 309 47 125 19 109 -125 -287 -144 -140 -62 -95 -44 78 -229 239 -122 84 -51 234 65 -46 53
723 53 10 123 -220 -155 274 -40 37 -2 -25 -25 -33 138 -80 -111 -67 -25 -38 -85 264 344 -119 92 185 -39 -16 42 -202
750 -202 94 -158 -79 -115 204 168 2 -37 -5 -100 108 1 -176 184 186 -312 15 -87 101 62 -153 266 38
773 38 -33 -4 -27 186 144 130 -9 -78 -60 -75 -119 -3 -43 -21 -275 109 -72 -19 144 -23 -58 -224 123 -17 66
798 66 -134 -10 -6 143 316 304 95 4 -80 -48 -370 -141 76 76 490 -120 129 -121 35 -137 111 -91 86
821 86 199 -102 35 -65 -274 -43 5 163 -30 196 20 22 45 202 -171 167 45 4 228 95 273 195 -38
844 -38 -228 85 240 -13 -139 -5 -189 33 64 115 -213 -70 97 -184 28 -119 -169 47 -44 72 24 56 -179
867 -179 51 -38 -10 11 -15 -11 92 -45 229 -202 -299 96 -90 48 163 -116 -203 140 202 308 -296 -191 74
890 74 -258 188 -191 147 67 148 -103 146 10 -53 291 -177 -125 -62 -69 -82 7 39 24 -46 -76 -8 141 33 107 199
916 199 -266 -2 -78 -45 161 -108 -109 -206 -222 105 164 -66 72 179 -172 -184 -80 96 -17 -16 -60 54 3 199
940 199 1 200 -63 -82 -230 -47 88 73 -14 -28 42 -6 43 -63 -139 59 205 155 -200 53 34 187 -119 28
964 28 162 -240 88 -65 -269 -82 360 39 -37 -99 -196 -1 -83 -74 -125 -273 117 318 90 232 -237 294 -277
987 -277 -141 38 -193 94 10 -239 58 128 -141 169 -80 111 12 -56 88 -48 -166 -22 172 100 137 94 52
1010 52 -56 -54 -31 -75 -72 -20 188 -120 -40 82 35 130 1 -218 -177 217 -39 -133 190 -137 44 85 -109 102 112
1035 112 -63 230 -104 -156 139 358 -40 96 -247 143 -229 -161 -154 139 -186 310 166 -455 -26 80 109 -77
1057 -77 -119 -150 -42 -95 -46 158 -222 -86 -40 -258 -133 -157 40 39 262 29 -182 98 -38 -44 -101 90 132 17
1081 17 142 27 -165 106 -66 83 -168 -35 156 253 126 -149 22 238 223 128 0 51 156 -117 -3 162
1103 162 -174 35 21 134 -146 -65 1 -119 83 24 101 -201 230 40 -99 -93 60 40 223 226 41 165 99 -132
1127 -132 -105 -81 140 68 28 -125 240 98 91 -59 350 -60 -129 -118 -145 -58 -20 -57 79 -104 -370 -56 -173 -38
1151 -38 -172 140 -15 -116 25 -2 90 41 106 84 138 -44 127 151 115 -141 -44 61 152 -148 37 267 87 160
1175 160 123 185 -136 259 11 66 -10 -268 109 -195 49 -48 -138 194 -143 5 -42 -89 13 124 -132 -46 -190
1198 -190 -78 -92 36 279 52 -8 48 -116 -146 15 130 261 -55 71 -87 234 232 109 -148 -76 -60 -13 55
1221 55 -194 75 -46 -18 -56 203 -90 91 -137 -140 -260 -118 -7 -79 -118 -28 167 -75 -63 -96 -75 -277 -52 -16
1245 -16 29 61 172 184 277 106 139 80 44 36 -233 -49 -58 -93 0 91 121 19 43 -42 159 -2 -30 -93 25 -170 -50
1272 -50 244 364 155 54 -35 -123 -171 -76 128 13 -190 -47 20 119 -181 26 12 41 37 -167 209 -2 109 -12
1296 -12 -24 -72 -285 -56 245 -55 87 238 -18 -104 -144 53 42 -191 -8 -122 -122 16 149 -52 192 -153 -256
1319 -256 -80 -247 42 -78 63 -177 15 -34 -154 21 168 153 -167 -51 -64 33 365 98 -31 -89 149 -179
1341 -179 110 41 -209 57 67 60 -178 -60 -17 -357 122 -40 -65 -106 -50 1 -9 83 -16 -131 2 168 -252 71
1365 71 -130 90 65 56 -54 89 66 154 -63 21 -202 77 -122 -43 97 -291 -156 101 -107 -20 -214 242 -8
1388 -8 -315 -58 402 -259 -184 72 176 103 43 32 -125 48 -36 -291 -293 74 88 -17 213 29 -50 165 179 11
1412 11 -20 -286 26 28 167 149 -20 -16 -153 17 10 -17 -34 30 -62 -131 129 -26 -10 183 -246 200 -114 -209 45
1437 45 97 45 -150 -281 76 -127 -51 -84 98 69 -191 -157 47 -31 -135 285 -64 22 48 -27 -19 -51 -57 -238 149
1462 149 -10 -181 57 204 61 -288 -47 -213 -29 -37 5 -91 12 -163 116 232 33 108 83 118 -332 192
1484 192 49 -124 109 -126 -54 -188 -101 -76 281 -26 30 -8 -175 -28 5 -101 3 -232 226 154 -9 -221
1506 -221 1 -280 -67 19 26 -77 34 126 90 1 -255 148 11 -64 -148 -60 141 -244 -273 16 -315 -234 32 193
1530 193 -1 3 -157 17 -77 87 16 9 -77 -147 139 56 88 94 56 161 58 249 -26 145 22 -140 190 -36
1554 -36 50 -8 -113 92 -24 -12 -172 -58 -266 -133 52 -128 109 245 -311 172 266 230 78 -145 186 278
1576 278 134 80 30 -128 75 -120 118 225 -112 -53 24 75 -204 49 -229 -293 105 -206 -179 -71 -223 70
1598 70 45 -13 4 -92 -38 63 -4 -42 192 45 35 -9 74 -64 -76 -341 -1 204 -81 410 104 -57 116 334
1622 334 -110 11 253 6 -136 -67 -8 335 168 -52 107 -31 -9 43 -113 -35 42 -217 167 -40 -439 -158
1644 -158 -3 62 -236 51 206 89 289 -75 -9 59 277 48 33 -199 85 15 234 43 -33 -102 -283 234
1666 234 -50 -154 -31 -17 -182 -44 -45 -139 -154 -71 -202 221 3 102 -345 -167 59 264 18 114 60 75 70 101
1690 101 -57 -41 244 3 -88 194 -88 -146 -156 135 45 -54 -70 -64 -5 149 -89 232 219 -170 12 20 -118 83
1714 83 -30 -39 343 -78 90 91 263 -232 258 -325 -310 118 -19 225 222 136 -20 93 163 68 141 -136 105 -92
1738 -92 -144 -113 -34 40 44 -62 77 100 49 82 113 191 -64 162 -33 174 12 52 -259 -50 244 -148 -37 -50 -31
1763 -31 -126 79 37 59 70 50 70 49 -131 -183 73 -95 -101 25 -126 -58 -99 150 -57 4 32 69 123 40 61 212
1789 212 -103 -18 -70 62 -166 -165 55 -21 98 87 194 19 16 -1 46 -81 -29 116 66 42 237 -201 -183 35 -11
1814 -11 -75 -140 -232 -112 160 21 97 -76 -6 260 47 -3 173 72 22 -234 17 81 152 157 -15 -172 87 111
1838 111 -306 -155 48 -58 -258 109 101 285 105 42 170 222 140 152 192 319 -241 -35 -112 -150 163 -126 -60
1861 -60 -177 -142 53 -85 114 -119 -105 163 20 -125 -105 75 -136 30 96 -18 171 222 213 319 40 -107 26
1884 26 -218 -46 152 -3 -33 110 231 -217 86 -60 182 55 38 -44 92 106 95 -137 209 -144 -68 -20 -29
1907 -29 213 -338 -89 -29 106 -98 -223 -46 149 109 -103 113 186 45 97 139 230 184 128 2 -13 -181 -176 52
1931 52 -144 -248 188 -258 189 -169 10 -123 31 -43 28 -93 -135 26 209 -21 34 58 -289 -71 -190 -162
1953 -162 -123 115 281 191 -114 -26 11 -325 81 54 23 -133 192 -212 -193 368 -107 -81 129 151 216 277 -322 -87
1977 -87 -60 -301 -45 23 -181 -161 -39 293 285 5 13 9 -19 -112 -61 -1 -152 1 13 32 25 11 -198 217 363 -284
2003 -284 143 108 124 121 -93 -144 -260 -141 -17 -162 276 -146 135 -233 110 136 -124 274 9 -158 41 -173
2025 -173 -216 -36 -105 -66 58 144 27 257 11 -225 46 103 -56 -39 -283 57 -65 -162 28 -44 123 12 -2
2048 -2 46 318 415 115 15 -15 -168 -166 64 -18 -152 144 15 46 -121 155 98 -50 107 -326 -34 -34 -85 143
2072 143 24 94 93 184 -207 57 117 252 188 -265 107 -106 -235 -20 -59 45 25 -93 -292 -162 107 445 -144
2095 -144 -70 517 -45 26 -38 189 191 254 65 -67 -158 304 256 -113 -264 -26 -236 -3 -2 32 13 -329 -132 199
2119 199 147 -191 -200 -150 -140 -8 319 -199 -75 137 85 186 -181 104 210 17 -94 -83 -297 -84 174 21
2141 21 -80 -142 151 -214 -231 -84 -5 212 -154 18 80 42 44 -66 -42 -90 -131 7 -82 -70 8 -41 -259 62 188
2166 188 -190 80 -86 -4 73 63 164 -200 9 -214 -107 -141 -33 -24 -230 19 -17 163 -41 -35 -135 239 -68
2189 -68 23 -6 -144 -119 -27 -367 -24 -82 145 21 56 -140 34 -252 -48 -89 294 -157 -145 14 -81 -52 146 -327
2213 -327 -10 235 93 60 7 -157 150 -261 -12 -285 -126 -119 -19 65 -144 126 222 -8 -86 118 -56 302
2235 302 27 27 21 111 -71 -123 -58 -8 200 86 178 -146 133 -36 -153 69 12 37 162 68 -96 -100 360 -33 215
2260 215 -23 236 -246 -3 233 7 13 -145 51 7 6 -32 8 178 -70 19 96 -37 119 -135 285 -4 -96
2283 -96 -20 10 232 113 -346 -90 -74 53 -150 128 140 183 102 -89 133 130 43 42 -45 -244 36 114 109 -38 405
2308 405 -176 67 67 -55 -169 -53 206 161 -42 -99 -115 -62 106 24 225 39 -43 -296 162 -62 -7 72 56 152
2332 152 -250 -120 15 241 15 -12 -1 -183 -179 -28 -168 -183 -80 -114 -182 -10 -97 25 -298 -54 122 103 -198
2355 -198 -48 -109 87 134 90 100 110 43 -71 -148 132 -130 -72 157 -163 83 74 99 44 17 -130 -30 -475 -83
2379 -83 -386 -33 44 213 -61 -96 22 -160 235 -133 -194 51 -140 -71 -6 69 -188 101 56 124 96 -153 13
2402 13 87 -344 169 -138 320 40 -34 -279 -132 -10 -76 181 28 139 -64 -295 -144 -26 -12 -193 69 212
2424 212 -133 -58 -117 223 -51 -102 222 -50 210 39 35 212 202 -222 100 3 -57 -37 -131 112 -130 58 -48
2447 -48 83 -55 21 -95 -248 235 -149 -124 88 -63 180 -61 158 80 -257 4 89 17 89 75 81 -103 -65 -172
2471 -172 -51 -27 -210 -45 9 71 -55 -46 77 6 -196 -257 -134 -237 33 -92 -130 198 -21 228 168 109 -54
2494 -54 44 -422 155 -60 140 -8 -11 178 -150 171 131 96 262 -65 63 -76 17 -120 18 258 -184 -30
2516 -30 -93 47 -18 -47 -123 79 33 203 -78 148 99 130 305 10 79 31 269 113 201 -76 161 -55 32 -265
2540 -265 -74 37 64 -74 24 176 -4 -113 -243 15 160 -62 91 41 38 84 21 -35 81 -64 245 -108 -2
2563 -2 173 -206 50 54 -396 -50 -267 -322 -55 20 -74 -228 -15 -124 -7 -195 281 -16 20 -7 -61 72 80 100
2587 100 186 -296 13 266 278 15 -117 -44 -182 -159 -339 -40 3 -113 -194 259 149 -72 61 -110 -107 -216 173
2610 173 -148 -14 -4 78 -177 -211 79 -32 78 124 100 50 45 -70 -53 135 -169 -96 90 169 152 -134 -11 -104
2634 -104 -89 243 96 189 -22 -53 -17 -75 90 -158 -7 -46 255 32 -280 -31 4 39 85 -117 -469 -109 50
2657 50 -81 105 34 -65 -32 233 37 296 174 -68 -22 -212 -51 -34 30 -72 -100 -28 68 213 -147 -50 -192 108
2681 108 -109 174 18 -25 75 56 57 -163 -103 -71 109 20 -195 -29 -11 173 11 -30 -74 -56 108 -23 -219 19
2705 19 115 -10 -55 241 71 -81 253 10 -72 -312 -60 -56 27 92 5 157 -178 103 -116 42 -27 -162 -72 106
2729 106 -208 -59 94 -204 123 124 134 73 -138 -148 -11 83 15 -110 -61 -15 -79 454 50 -63 18 86 13 64 -76
2754 -76 -53 60 223 -7 -242 -135 -44 -156 181 -51 52 97 44 -70 101 118 281 -62 -8 118 -239 183
2776 183 55 13 -191 -28 -231 -29 -86 48 -337 47 9 163 18 182 -64 -9 30 -219 75 195 -14 8
2798 8 109 -135 141 57 141 -169 -9 -181 -14 122 61 89 190 -66 163 -76 207 -179 -68 84 147 164 -29
2821 -29 219 80 53 -96 -143 125 -67 106 55 110 -11 -113 5 163 283 -254 -189 85 382 343 58 -108
2843 -108 81 69 -60 -364 182 211 -67 25 53 -14 -261 -16 -132 -25 64 143 317 -14 -99 -69 -91 -252 133
2866 133 -67 122 62 32 135 -160 -259 -77 121 10 -56 -15 -400 252 14 -23 126 -12 192 -213 111 14
2888 14 -145 -23 -9 -74 12 -54 113 157 69 116 -65 -216 95 -34 174 -39 -38 -34 -8 -162 142 -266 -28 13 36
2913 36 -13 -253 -173 281 -127 61 163 -195 214 -195 -107 153 -29 -263 153 170 -225 -165 -12 -114 122 15
2935 15 242 -40 242 327 -207 -245 -6 -58 108 257 15 -213 64 45 146 -300 69 -43 13 163 319 -12
2957 -12 234 69 33 61 37 -16 -131 -243 -218 -93 83 1 14 123 77 -219 -260 9 -118 -191 -97 123 -62 142
2981 142 -191 -235 26 -9 66 8 117 177 -107 210 123 22 187 51 10 -197 10 126 -238 -108 -67 178 127
3004 127 -21 76 14 24 145 -10 -21 -224 229 21 151 21 -100 33 113 -201 -125 -210 51 -222 71 1 52
3027 52 -67 -88 15 -110 -415 -235 199 321 -34 86 71 -76 -161 -86 84 -104 272 -97 -72 101 -356 -160
3049 -160 170 -156 -24 2 -47 171 102 208 91 75 57 60 50 81 157 -125 16 -180 -22 -134 -219 -220 117 181 386
3074 386 -94 61 -217 23 -191 -161 44 6 -6 -77 41 192 23 -77 267 8 -53 -143 129 108 58 -169 125
3097 125 -139 -99 -93 131 -25 7 -83 -273 -17 -120 -72 350 -40 63 174 -235 281 7 -202 184 19 63
3119 63 124 -93 -25 115 -240 50 -95 -36 -21 -81 159 90 -140 189 -141 98 312 -234 -12 121 -97 151
3141 151 -132 109 -76 42 187 91 86 244 -179 153 24 101 80 -30 99 32 276 14 147 -30 -129 -185 81
3164 81 -165 67 -1 -236 -140 -93 28 340 207 50 -50 75 216 -174 -44 69 126 215 131 223 55 63 129 170
3188 170 254 7 -102 100 110 -135 138 -26 -118 41 55 -103 26 126 -81 44 155 -136 -117 104 -56 105
3210 105 -22 -130 -129 -110 -255 -38 -63 156 -403 -10 153 -243 53 129 109 -52 511 61 -176 -253 101 142 13
3233 13 121 -19 -125 -21 89 -175 -61 -141 55 203 221 225 110 90 -138 -148 104 111 -156 -400 337 183 72
3256 72 210 -97 -10 -90 -44 -193 -40 -205 -5 101 -112 -74 71 -67 2 -137 -4 88 41 -361 28 73 282
3279 282 70 -86 246 -54 184 5 -152 -22 -161 193 99 50 191 163 -56 -182 202 73 40 92 -45 126
3301 126 -54 -38 -271 -91 -207 201 -41 73 442 161 -81 2 155 75 -173 73 -196 329 152 -58 205
3322 205 308 -215 31 -91 -23 231 -61 48 -23 56 -104 19 -159 -106 76 48 -315 119 5 -21 158 18
3344 18 -90 55 106 -25 51 -18 -328 15 11 125 -169 85 -234 59 -275 -160 -236 68 -32 -17 127 -263 289
3367 289 -69 -78 -199 -52 23 18 -160 37 -42 -128 -184 -118 -259 -85 -108 -73 -165 40 -260 -99 206 -47 127 116
3391 116 -33 -133 57 -106 165 252 -68 -104 141 -284 29 64 17 72 -21 -59 -133 38 82 20 -85 86 -199
3414 -199 -45 -78 85 71 -143 106 60 -100 -195 -30 -212 153 18 -212 68 7 -80 -59 64 -204 197 60
3436 60 -133 -87 128 -197 -32 -218 169 -76 12 -124 -410 -118 100 -87 -37 -99 23 206 51 -171 -185 262
3458 262 272 134 -13 -136 -128 103 90 -13 -6 -108 -46 19 -71 -8 -54 -142 140 135 -32 109 286 128 -325 -45 138
3483 138 104 49 126 9 44 167 44 64 163 -213 -344 -37 -110 -4 149 -254 161 -131 50 21 59 183 321
3506 321 -21 -33 51 238 -166 -4 12 -12 -167 -150 7 -115 398 150 161 -44 -13 -244 -308 -293 -28 62 -22 117
3530 117 -13 152 -83 270 -40 -95 88 -161 100 120 -21 106 101 109 54 -355 217 -30 142 -92 186 175 279
3553 279 -57 -90 -3 -224 -107 220 46 116 -252 -172 56 -33 -94 -123 -42 76 -227 -249 47 311 -59 -15 -129
3576 -129 -46 237 -51 274 211 -26 -54 160 69 -97 -29 107 -80 -122 -150 186 48 82 178 111 -4 -393 -99
3599 -99 44 104 -112 -143 23 -173 344 -29 143 135 83 -77 64 20 -282 -60 -26 -14 -5 243 -14 180 17 38
3623 38 239 57 31 -78 39 282 2 206 381 -108 118 -178 170 -77 168 155 -132 158 92 66 -12 119
3645 119 24 -210 -2 6 -120 110 -76 -93 -132 35 244 322 4 -52 191 -239 248 35 -152 124 238 94
3667 94 -281 -14 -36 -281 131 -9 54 -12 8 41 -185 223 25 -47 -58 42 101 -8 138 173 88 -101 36 4
3691 4 87 -140 -190 -7 85 101 -30 -349 -106 -104 -193 125 -178 -280 144 -258 54 -30 35 81 -130 97 -50 47
3715 47 -29 -97 60 -302 11 112 21 189 -83 120 -88 -487 22 -221 -68 -109 -192 157 -114 -235 44 -65
3737 -65 82 429 -20 -101 150 309 54 -55 -82 -116 20 -89 -31 142 220 -177 169 -60 -11 -62 85 426 -458
3760 -458 172 99 -33 -54 -15 -197 -12 -113 -81 -56 79 -73 -69 145 165 -41 47 -81 141 -32 -90 210 120 266
3784 266 -332 142 50 -43 -57 144 201 65 252 -446 30 29 -134 -85 -146 -203 -87 204 -19 -7 86 -4 191 293
3808 293 84 73 73 30 18 318 -131 -45 286 -98 -13 -161 -113 -68 333 197 42 228 -201 295 70 -166 73
3831 73 -95 -115 -116 -69 -190 -87 79 147 94 -108 113 91 86 -308 -260 20 -50 -43 -76 24 -27 8 19 93 -151 18
3857 18 209 -301 -79 -121 84 19 -10 78 128 153 0 220 17 -274 151 -143 104 87 -240 -148 -135 -203 -12 32
3881 32 -105 0 56 -47 -90 19 -85 -213 77 -35 66 199 -146 16 102 -262 20 244 80 152 -74 58
3903 58 -54 257 114 -129 -2 -81 -195 -118 300 -73 -52 129 165 213 -91 187 1 -14 61 127 -199 195 44
3926 44 155 -172 11 -9 -76 -130 22 -66 113 -85 69 -30 -92 -105 -226 -37 -22 14 -153 -37 -281 -143 -21
3949 -21 -212 -67 -1 15 -124 -70 -54 72 92 -160 -241 80 -117 -86 -109 2 -330 493 37 -75 -144 69 -173
3972 -173 81 42 112 211 61 156 69 139 -325 -88 -91 178 17 -222 216 -80 -543 102 67 228 -309 54 -36
3995 -36 -208 13 -83 -118 117 209 53 -10 -8 15 176 24 -167 81 137 47 -25 33 -15 -44 23 -113 36 -92 223
4020 223 -188 -23 125 -162 -5 138 109 -258 71 -108 191 29 10 -90 24 98 -86 -24 88 16 23 92 -45
4043 -45 -109 -72 -60 28 120 132 302 78 -30 -33 43 -98 32 -131 111 155 77 -87 54 -75 231 37 123 144 168
4068 168 -98 40 -50 -285 40 222 -323 194 68 42 -177 -170 -15 -13 77 -61 -186 -139 265 10 208 -161 73
4091 73 -159 -14 -33 -29 -96 -16 224 140 -166 -13 76 -67 18 271 24 -301 -17 75 -158 -31 94 106 -46 156
4115 156 -71 117 41 -259 -27 241 230 -31 -191 21 -364 -100 -8 -219 -19 -182 -101 15 91 -83 -45 -56
4137 -56 37 57 165 49 55 -22 -75 235 82 -234 -150 -30 128 -342 -25 267 197 -3 -86 -49 -58 -97 7 -75 47
4162 47 129 3 -31 143 -271 -191 14 -104 57 60 -193 50 -143 -6 -16 -74 30 -76 14 49 341 17 109 -124
4186 -124 74 41 -74 153 -103 -43 -29 -18 73 -21 -35 87 102 -73 29 16 15 174 110 186 -297 -337 -85 -187 146
4211 146 -221 -229 -147 -279 63 11 17 -34 -41 59 63 -12 -11 -92 -136 34 -158 -104 213 139 -39 20 -115 -190 98 31 127
4238 127 5 8 86 12 -66 -377 -195 -123 -76 105 113 199 27 -84 204 9 -86 -186 73 123 -66 -80 72 -44
4262 -44 -299 -201 -306 -79 -70 -140 163 32 81 214 -297 -7 -140 -7 -258 -13 30 -30 -26 -125 -169 -73 -171 183 46
4287 46 -293 -137 -158 90 46 114 -45 221 65 -138 -327 -54 102 99 206 -59 -109 -24 -200 -219 -126 -35 59 84
4311 84 -114 153 16 96 -22 -76 131 -226 80 332 -122 32 28 -212 1 48 -134 -5 109 -184 185 -59
4333 -59 36 -91 226 266 -13 95 126 44 10 -8 90 17 -153 106 61 41 110 6 19 366 88 175 214 23 -178
4358 -178 34 216 149 65 -77 36 236 69 -59 198 -284 118 -26 149 -117 282 196 -225 -30 -58 12 16
4380 16 183 240 22 -119 288 136 103 162 49 -225 363 -87 212 -75 -56 7 -138 -56 -255 242 -20 148
4402 148 392 130 213 42 105 -69 97 -128 130 -29 -47 -358 76 -29 15 -94 233 6 -6 -67 -28 130
4424 130 -110 156 -4 91 38 170 -160 -2 29 209 -114 -139 76 -47 75 -30 194 46 -69 -147 -82 86
4446 86 -296 -111 296 -99 166 -179 -209 -69 -253 -172 -31 -182 83 20 58 -125 33 45 78 159 -220 446 111
4469 111 233 -94 98 -48 -158 -74 181 221 106 -190 191 337 -30 -58 168 -114 -26 30 113 -190 -116 -24 -69
4492 -69 -79 -126 63 -37 128 -211 153 114 54 163 9 -88 -35 295 -134 -118 2 47 417 55 -247 -53 -2
4515 -2 -40 472 133 -4 -65 -20 93 29 -176 -433 -50 -243 -48 183 -29 -87 30 -4 -30 -104 49 -23 -118 -208
4539 -208 53 -81 17 -288 -88 -98 62 88 166 281 221 246 166 168 38 279 32 -160 215 191 96 55 -6 -137
4563 -137 225 138 -142 -142 -104 58 183 -87 114 -86 -26 -241 -67 98 -63 -170 5 175 320 147 -147 137
4585 137 -76 -254 40 -196 -37 -200 -287 116 168 -208 -10 -304 16 -30 37 64 59 56 -30 -22 76 156 -124 183 -105
4610 -105 9 -4 132 -215 -23 -114 118 -45 -261 91 164 -101 171 -43 -23 -28 -152 118 298 29 162 -137
4632 -137 -187 66 -179 -102 -216 -230 -313 68 96 94 -105 -70 99 -173 -94 169 49 -218 -224 -116 83 -77 54 206
4656 206 -142 -36 11 162 156 -8 -222 -7 -129 -76 362 -232 23 122 -381 -42 -183 144 135 -184 157 -180
4678 -180 27 41 9 68 139 -36 -172 1 115 189 178 68 241 -45 -350 40 -149 172 192 -261 -125 -20
4700 -20 192 320 53 -199 200 63 201 -110 -105 -208 -24 -190 -17 -32 -67 -215 -7 -234 129 16 180 -297
4722 -297 16 -18 -200 -65 -412 242 210 91 101 74 -67 -93 89 -170 137 -18 320 40 29 -58 134 292
4744 292 137 -144 33 35 171 -93 259 229 13 -1 -82 48 -292 52 42 70 -14 205 81 -29 -151 124 -336
4767 -336 108 59 -1 54 96 119 -33 114 122 36 135 39 -57 -81 -118 32 207 -24 82 29 -336 -79 164 18 9
4792 9 -81 16 79 -128 -161 209 -131 207 69 77 -44 164 66 330 80 -103 -101 -9 -134 196 51 -129 -250 -11
4816 -11 -133 -223 330 -120 -6 112 15 -137 32 0 -78 79 -37 -75 184 32 -185 71 91 -66 -144 163 84
4839 84 140 10 230 121 -192 105 21 36 26 54 -255 -336 -184 -1 -206 -110 -2 -44 -251 124 -57 121 -242
4862 -242 -87 -51 152 85 -194 156 205 -203 13 224 63 -312 237 146 -79 -2 160 194 -86 -274 -79 116
4884 116 -46 160 119 90 193 -188 -90 117 36 -176 152 -213 -218 132 89 -241 -109 274 -33 41 -163 -270 -62
4907 -62 53 66 97 69 -41 35 21 -248 -157 101 49 144 377 119 176 -131 -184 -129 -301 88 -95 -60 -111 -35 -94
4932 -94 -86 -256 -204 46 -89 13 -228 -259 33 -12 -167 -28 231 34 47 -131 -116 97 43 321 29 288 61
4955 61 -59 146 67 -69 -106 -83 -114 186 90 185 -111 24 146 112 -328 -116 374 70 111 -154 189 80 -116
4978 -116 40 -194 -46 -56 28 -84 -83 79 -157 -41 -96 130 100 83 -362 -119 -139 -192 16 390 185 -225 2
5001 2 -105 -51 -200 -102 261 -3 -39 156 -72 -21 175 95 128 137 -76 174 -108 217 -223 133 -117 -6 108
5024 108 114 303 151 -32 24 -296 -210 205 -125 -352 50 147 -75 -179 -295 24 -74 -252 163 78 -218 -65
5046 -65 -383 133 -42 -152 202 205 -187 -139 121 -90 90 -122 301 0 -65 148 205 4 -51 41 84 238 -7
5069 -7 19 -114 195 117 108 49 -2 -4 -67 149 52 75 157 -177 35 12 -173 20 -350 -120 90 7 -17 30 77 207
5095 207 4 -2 -105 439 -90 -189 -320 -35 -308 223 137 -35 -16 29 -238 63 -98 70 -53 -117 -190 -70 274
5118 274 107 -106 100 -106 -252 -362 -188 -63 187 -167 -58 42 -80 99 -42 -123 32 12 65 235 5
5139 5 168 89 -5 33 -342 169 -39 20 172 -118 42 126 -165 -113 -119 -127 -57 8 -47 200 255 126 -45 -6 53 113
5165 113 140 156 -39 40 38 156 46 31 -179 -128 30 -10 17 191 232 -63 -147 -113 -132 108 -206 -112 246 -162 -258
5190 -258 30 74 11 -114 -130 64 8 108 -82 -54 -38 -77 275 -1 -65 -267 -189 213 105 6 -127 -55 136 191
5214 191 41 286 28 26 -78 317 -230 204 52 230 251 161 60 -152 -433 -187 305 -42 144 103 42 -85
5236 -85 -97 -119 -14 156 20 -21 147 -177 69 -130 -200 109 269 83 381 113 79 170 66 -152 -22 147
5258 147 34 -13 184 86 -408 -228 -43 -63 259 -134 -39 174 224 200 309 278 123 -13 24 36 -110 34 32 -8
5282 -8 -337 36 33 147 104 -216 -89 -58 -67 125 -296 -41 -81 231 27 207 211 67 -129 44 -23 -56 -84 10 -43
5307 -43 -83 -40 71 65 -22 173 24 -168 129 -84 -134 -120 -205 -71 -129 -125 -47 -276 33 65 98 -26 -114 -236 -279 -89
5333 -89 -45 212 -77 -100 -31 14 198 -131 -7 -22 3 99 59 -146 85 148 346 59 188 233 18 83 -22 79
5357 79 -10 95 -39 174 -48 63 229 -30 13 121 53 -53 -246 -179 1 35 -62 -69 -241 -128 89 101 -46
5380 -46 280 34 296 286 -10 -35 -5 114 -217 -228 -208 76 8 155 86 24 -173 -256 -64 -62 114 -179 41 -221
5404 -221 -189 28 11 -138 183 91 139 20 10 -165 -81 -58 52 100 -108 231 -240 38 -41 33 -184 100 -12
5427 -12 -35 55 -170 -293 -121 93 -112 -148 64 -117 -154 36 -2 -35 16 57 95 -77 -240 -131 -91 59 59 21 39
5452 39 -319 -279 189 -35 -227 -97 13 -3 -17 79 -6 -65 106 -171 85 -214 -148 -182 27 -53 29 -130 151 63
5476 63 -92 -34 34 -2 82 -60 260 165 172 83 291 -137 -94 44 139 95 78 -79 -175 150 -299 -348 81 18 -50 -33
5502 -33 -151 171 143 -161 -61 0 37 156 65 -83 75 363 -20 13 54 -211 120 39 -267 291 -227 31 74
5525 74 123 -275 -60 121 72 -14 -166 -19 27 15 -18 44 -109 121 -107 179 32 29 -135 16 174 20 -10 42
5549 42 42 95 -16 -194 55 -97 204 -120 158 239 153 73 148 -53 -58 52 -185 159 -82 179 90 -29 51 -107
5573 -107 41 -58 79 100 -34 206 -49 -21 -122 -161 -104 55 76 -53 -204 -96 -65 -93 143 -63 -41 -82 -42 -92
5597 -92 -35 -44 -75 -118 -18 220 85 -78 -142 64 143 8 144 177 -42 3 -56 3 -79 3 -142 31 -54 -193 -66
5622 -66 -195 -2 121 -130 -14 85 -188 228 -80 26 236 33 -72 14 -201 48 -151 27 -185 134 182
5643 182 -40 -246 -75 151 -22 122 -116 211 67 -123 -67 158 63 4 -131 36 -1 -117 155 28 -97
5664 -97 13 53 -96 -167 38 2 64 -142 -241 -257 250 54 -36 249 -67 62 95 99 117 -52 -61 353 -74 118 -71
5689 -71 -178 12 56 211 27 -141 125 -22 42 -45 -125 -217 372 -88 -47 -247 -98 143 67 -160 141 26 99
5712 99 141 119 51 -84 102 -65 -168 4 -33 -56 177 -11 93 106 31 -245 25 12 45 -61 -143 74 -220 242
5736 242 -91 -341 -170 161 80 172 -3 155 -88 -28 35 -99 3 56 117 -167 201 -25 -36 -192 -197 173 116
5759 116 366 -59 66 -104 -98 73 -175 191 -152 -261 -119 -18 145 65 -49 139 -271 51 -155 -203 140
5780 140 -7 52 -329 -95 -330 -7 344 -86 31 -122 -38 -401 -202 59 -51 6 -178 23 -87 147 -172
5801 -172 -47 -108 230 -25 -63 -303 -20 -70 74 -128 -122 140 -10 -75 -20 29 -21 42 129 -63 128 181 -37 -166
5825 -166 -58 239 -215 306 162 -27 -233 -148 4 33 -468 -93 217 136 40 27 4 -152 2 -3 21 -294 -229
5848 -229 40 -46 -1 -87 90 -190 -88 -73 0 205 219 237 -26 142 166 99 -8 109 227 -124 -259 114 151
5871 151 -198 112 172 -258 73 274 -296 -71 -249 -47 -334 194 94 66 209 -75 24 47 -157 15 -165
5892 -165 -178 -325 -298 -204 69 -69 50 -23 217 217 214 74 -2 -86 -26 -182 93 139 48 -238 49 -53 -147 -82 -183
5917 -183 -66 -44 207 -391 72 10 -90 -45 -171 -86 -252 -286 -177 30 -293 -57 208 16 -226 -63 -19 -156
5939 -156 208 148 -95 -115 6 -51 194 -34 109 24 16 -36 -16 -150 88 54 46 32 1 77 -57 -221 275 93 8
5964 8 -82 -76 -156 261 -138 -40 23 -121 85 -371 16 61 128 -336 -81 -48 -43 -77 -143 87 -94 -179 19 -24 38 82
5990 82 181 -361 8 -18 -281 -180 -37 -130 -156 -45 -45 37 -96 119 1 90 100 -55 -129 178 -180 -338 -232 -4
6014 -4 70 155 23 111 102 17 -219 152 150 -164 -147 -94 239 -52 175 113 -172 84 -151 3 10 36 57 83 90 -163 90
6041 90 113 392 73 165 78 18 -24 -80 -78 353 146 184 225 177 -124 107 46 41 -64 -58 -228 -45 56 128 -41 124
6067 124 -13 -185 -30 17 -19 -242 -116 192 141 161 -39 118 157 109 -89 -251 199 169 -18 -137 13 -147
6089 -147 110 -77 -257 126 112 91 -245 29 -65 -20 -89 75 -31 110 -17 74 -25 -129 -84 -159 -167 -222 -30 181
6113 181 150 -214 1 -165 244 -68 -8 -97 -103 42 321 -163 -4 -270 42 32 -116 -41 -15 -136 5 -35 -218
6136 -218 321 205 -62 221 111 60 -326 180 54 -143 95 -76 417 -200 127 -181 228 -65 -150 159 -176
6157 -176 -27 -172 -145 -116 -31 -22 22 210 -341 -40 84 176 71 145 39 100 26 55 167 74 -237 171 -69 5
6181 5 257 108 125 1 76 206 18 -62 79 -157 55 255 -179 62 110 52 -105 93 100 147 -315 67 66 175
6205 175 24 -13 53 66 -28 -15 167 -84 36 58 140 -137 -145 10 20 185 -206 154 210 83 -32 6 -97 66
6229 66 314 -4 -130 -99 129 -24 -60 54 340 29 -51 115 125 -47 -43 313 -231 -98 155 -119 142 -31
6251 -31 221 53 108 -131 4 -49 112 202 159 47 149 -58 -40 23 -257 45 217 -146 86 -62 -33 -224 258
6274 258 116 -48 229 123 74 106 54 71 -45 100 -108 63 103 77 -6 136 -65 23 -109 -80 -57 36 -15 -3
6298 -3 16 -42 -156 -15 30 -27 -116 -136 -128 -139 40 99 -9 -104 -173 131 -164 -13 56 -167 148 4 -43 -143 111
6323 111 164 142 379 285 50 146 159 45 -94 -31 -30 206 129 -142 72 -56 111 -74 -231 63 82 88 -78 90
6347 90 -119 -26 140 -232 65 209 161 230 336 184 -206 -65 239 12 -338 336 -217 96 232 214 102 -210
6369 -210 -202 -156 -90 -138 73 38 21 -118 58 74 56 86 6 -224 -203 -35 162 -29 -284 -213 247 95 -24 -305
6393 -305 -39 155 73 160 -122 -140 -168 73 -220 182 21 -65 -72 88 -27 165 103 -272 60 223 97 48 83
6416 83 161 -50 165 90 -44 158 -215 28 77 228 35 -455 -178 -52 140 121 101 -395 -30 -72 152 -16
6438 -16 -96 200 74 49 431 -357 15 -17 0 32 -38 -152 -58 115 266 -79 -97 94 -13 -215 -214 -54 -32 -97
6462 -97 -85 119 171 101 55 -19 -41 87 -109 79 34 -97 104 274 -78 36 -93 -111 60 17 -84 -18 -157 63
6486 63 -96 -74 20 -45 -113 300 -103 129 3 -47 190 60 -6 -69 -194 -126 -389 80 61 192 308 -139 -38
6509 -38 -180 36 -102 -93 -38 32 4 -82 32 158 277 48 -27 -84 65 -74 126 -86 -73 21 -125 -29 -220 -239
6533 -239 -47 -96 318 -43 162 -105 -168 -247 -42 -38 -88 30 2 -237 -228 185 -91 118 -106 27 -175 -75 41
6556 41 206 21 -59 43 52 -271 257 -26 -382 -41 -29 221 44 162 -36 93 -35 -292 -203 -51 -67 -164 199
6579 199 460 149 34 -260 86 46 -119 -180 47 -26 30 28 -54 -96 -244 -217 68 -86 -82 -51 306 200 -115 34
6603 34 241 117 -173 -146 44 -99 -20 30 422 -249 -28 -393 -35 244 -39 119 -90 10 -70 10 -77 101
6625 101 168 -215 -89 -37 39 -68 104 -85 -328 91 137 -66 266 36 44 116 4 179 -254 39 -66 -134 85
6648 85 253 -205 75 24 288 -188 -117 128 -9 113 -5 -1 134 246 93 20 168 86 99 47 36 395 -211
6671 -211 -161 -59 252 -26 63 -216 229 95 69 40 -193 139 -77 -105 -202 -102 157 -48 373 -131 138 123
6693 123 134 24 -223 -389 65 55 74 15 -117 -81 -30 16 -231 -192 -237 213 -73 57 -56 -45 20 -435 16 93
6717 93 -43 -225 -153 -26 106 260 34 -42 95 67 -61 97 100 39 -135 -19 213 21 -155 66 -42 134
6739 134 165 105 101 -404 201 164 -40 -30 100 -184 -233 11 244 387 136 -39 214 -348 -188 81 91 4 72
6762 72 159 -278 83 84 170 223 -134 184 -101 -41 -348 177 291 32 238 6 190 -101 67 -67 -210 -34
6784 -34 153 26 103 -320 24 -136 162 72 25 -26 -82 89 176 98 259 135 -181 -173 -85 -118 -129 174 -73 -77 -56
6809 -56 -26 -45 183 -60 130 -156 181 48 -81 -20 212 -64 -153 -45 -249 -215 19 107 204 57 -189 94 164
6832 164 46 50 13 -75 -65 -69 -239 366 -63 60 -84 231 -83 37 77 207 -27 51 140 305 34 273 -151
6855 -151 246 -72 -166 208 260 -262 -130 -4 -63 169 68 -46 -20 -4 -146 231 -246 -160 81 -195 -112 94
6877 94 -193 5 -14 -306 42 -43 -287 -150 225 -193 82 -42 34 0 -21 -121 -134 -71 -208 -245 -35 57 28 123
6901 123 276 -24 242 -83 -163 -18 186 338 94 164 172 24 -47 -142 -55 94 319 -109 -62 175 -172 31 -94
6924 -94 258 60 78 -68 -52 54 -193 -107 -209 96 187 9 -2 159 207 -30 -10 325 196 104 -186 -15 -1
6947 -1 -125 -112 -103 -7 -184 238 -200 95 -136 -137 -238 -19 -93 -22 -46 -180 -52 -126 121 27 -28 91 119 -119 280
6972 280 -23 -82 73 28 -103 197 71 -70 -497 61 100 170 -108 -88 -151 222 30 376 37 66 -77 140
6994 140 -48 41 -286 88 -129 151 273 21 -78 255 -152 81 -10 5 72 188 198 190 165 -187 -90 -271 -189 -186
7018 -186 108 -118 104 -341 145 27 -41 41 -72 92 150 291 116 76 59 201 -203 -34 -217 -376 64 -161
7040 -161 -159 265 57 -43 -38 83 336 -153 -148 -94 70 272 -230 -188 -237 -183 38 130 -415 166 -62 -65 111 76 -125
7065 -125 -185 1 7 80 130 263 191 -206 158 211 110 -230 -194 130 71 -74 -147 227 -30 -10 152 42 3 44
7089 44 89 178 -78 4 151 56 -516 11 -197 -29 108 -321 126 -226 -21 82 -6 8 -168 209 296 -28 -124
7112 -124 168 -116 -375 3 -232 -13 151 180 89 -126 148 190 124 76 184 171 340 113 18 -24 136 -122 5
7135 5 166 68 -115 48 -117 -134 -93 -13 46 -95 21 5 -50 340 -37 -58 -6 30 184 -57 -6 80 123 -13 -9 19
7161 19 62 -88 -385 210 66 125 152 -192 -58 231 67 162 9 -75 -156 -91 -149 54 -240 -189 -58 42 -3 -129
7185 -129 175 101 120 -62 -280 192 72 184 -198 -79 81 -120 -74 -3 15 277 -8 24 10 -91 100 202
7207 202 -175 173 -114 142 91 1 -85 -59 21 -270 66 -142 46 -47 52 163 8 -51 97 -212 -50 56 244
7230 244 -151 186 450 81 110 -122 285 126 -275 472 -76 53 -283 53 -25 -46 -115 23 61 -96 203 132
7252 132 113 -36 58 223 36 -50 -4 -38 282 267 -4 -195 27 241 55 -87 63 133 -250 275 190 -16 226
7275 226 -13 -26 -180 -125 -44 88 28 -15 76 165 -129 53 -172 -19 192 -97 238 55 47 137 -61 -164 -6
7298 -6 182 53 127 17 -80 84 69 -159 -171 153 -247 150 150 77 -185 -177 6 336 188 -17 144 -191 41 73
7322 73 151 193 63 52 9 108 221 -1 -196 -40 153 -40 -73 -93 -177 4 10 -95 175 -8 137 312 -251 -69
7346 -69 27 -104 -96 -48 112 -28 9 35 196 -105 26 248 -102 -3 -99 129 161 -47 -459 -80 -245 -132 42
7369 42 -140 19 -126 48 -54 83 -196 -122 -10 208 252 -118 104 202 165 -139 -71 -44 -62 27 119 89 25 -3
7393 -3 117 -216 202 151 -72 187 -31 -15 61 -45 -188 24 97 112 -13 -80 77 -196 119 -136 129 -177 -122
7416 -122 -119 90 -205 132 -343 -126 -349 -69 -45 33 -107 73 34 -137 43 19 -42 -284 314 -14 183 74
7438 74 296 -65 -289 11 64 149 122 -51 -146 14 103 40 120 81 51 -245 136 207 48 -5 -166 23 150 240
7462 240 -283 -59 230 137 -180 -73 97 286 43 -18 -84 -86 121 -44 54 -66 -176 -9 211 -148 -39 -78
7484 -78 -71 8 -104 136 198 215 47 3 -68 -266 342 155 -10 -16 -115 -200 93 -303 -246 -42 -512 141 177 -72 35
7509 35 -280 -62 -63 -115 118 -35 156 -103 -48 36 -32 -22 -14 -47 -146 -18 -201 61 -88 -213 -116 -220 285 32
7533 32 -60 140 105 63 126 -57 88 -51 -32 -99 -182 233 85 -215 -95 -62 2 49 -49 -180 82 -184 -250 11
7557 11 -14 151 -51 -43 -66 47 -17 150 -181 -231 151 -137 54 93 -60 124 -129 21 -154 124 -73 67 112
7580 112 -23 -2 -81 133 60 4 -171 -123 -135 -32 53 33 -89 -74 220 57 48 160 22 -131 -42 -95 -458 -99
7604 -99 313 -3 107 -195 10 -183 -149 -184 3 -160 -121 -329 -160 -102 89 77 -58 27 -174 -94 -6 180 79
7627 79 317 -9 -112 -340 -22 -176 50 -143 135 -154 -112 18 -43 16 -235 -171 -24 6 -181 63 -64 -96
7649 -96 -292 -234 340 251 -128 -111 -43 -74 -110 264 4 148 225 -175 8 12 -93 111 -28 253 -2 113 81 38
7673 38 -34 88 -139 -132 -180 142 200 69 -176 -177 184 -198 -332 -279 -38 0 -11 -400 104 -256 252 280 377 -57
7697 -57 -213 -31 -217 -111 128 172 -84 -95 -64 -19 -9 8 164 -37 224 -114 -44 -126 30 -133 80 -91 153
7720 153 154 211 192 132 148 -38 9 -135 -99 -225 1 3 138 15 161 92 -37 -14 28 87 -143 18 144 -35 -205
7745 -205 240 30 -79 105 265 236 -131 -100 -126 -140 265 -19 173 351 -88 -107 67 -23 100 134 -51 27 -96
7768 -96 83 -160 56 -22 250 314 -167 95 140 76 124 165 151 -181 242 -16 -248 99 86 208 -52 137 236
7791 236 -68 -9 -60 -17 -200 -22 90 -114 -5 140 57 -5 -53 163 -142 62 1 -268 -89 20 -450 -56
7813 -56 -39 -1 85 38 -190 -43 57 -168 76 342 -4 1 -139 116 -8 -220 72 -239 120 76 44 -135 -45
7836 -45 79 119 102 69 -35 -15 36 107 -65 -147 -114 100 -101 213 33 236 -173 132 30 233 151 78 -112 -23
7860 -23 116 -67 353 -241 156 117 6 251 55 -275 36 18 -154 40 42 -59 99 117 -65 -295 -323 88
7882 88 -167 -20 -12 -39 -78 149 155 314 1 56 288 -16 99 39 125 -342 249 -26 52 -3 -77 -16 -208 87 -284
7907 -284 75 133 -58 -373 -167 -5 35 172 287 25 27 -114 -23 -52 14 267 -20 77 -80 -127 181 -104 133
7930 133 70 41 -34 -385 228 -37 111 -66 -4 46 -99 -49 117 107 -65 95 25 -175 -35 19 64 -51 -33 -67
7954 -67 97 49 -129 7 -264 26 92 55 89 -32 89 36 2 -124 180 -4 -88 -23 -76 -176 4 -263 -56
7977 -56 -167 -127 106 94 -39 380 98 191 -122 64 -188 81 192 142 -61 211 95 64 208 40 -187 53
7999 53 -6 119 129 155 -11 -147 211 -108 -101 -7 -152 18 3 -255 -109 -67 147 -170 203 124 201 -131 144 77
8023 77 -187 77 96 -132 274 -275 -35 -111 96 243 -43 33 -61 -63 -48 206 22 -2 -30 224 79 -79 327
8046 327 -51 -166 66 59 19 -26 -102 241 -114 160 -72 -22 -212 -75 98 188 28 30 37 61 -142 -74 -213 48
8070 48 203 149 -124 177 -21 -7 -16 51 64 185 -200 -202 -87 184 428 88 48 -240 197 91 9 -102 92 -156
8094 -156 -191 26 -160 -192 -87 -159 -188 190 -45 175 -126 435 -176 63 -270 -158 74 85 116 -52 -89 -137 177
8117 177 -127 257 -111 379 71 -30 10 -155 212 188 -33 -137 -89 191 123 -177 135 -94 224 -153 -134 -55
8139 -55 -58 172 -8 77 14 206 144 -12 66 -124 35 -80 -227 31 342 -113 356 133 -21 117 -149 -61 -67
8162 -67 -264 146 -196 -267 74 -133 -55 341 27 -52 68 33 -81 -266 106 52 -68 164 61 28 -232 31
8184 31 -96 51 -78 -42 -71 116 21
8191B1
$$ Imaginary data points
##PAGE= N=2
##DATA TABLE= (X++(I..I)), XYDATA
0 0 0 0 0 0 0 0 0 0 0 0 0 0 0 -6 8 -8 8 -8 10 -16 16 -24 24 -32 32 -40 48 -55 63 -72 80 -91 105 -119 134
35 134 -152 169 -191 212 -238 263 -293 325 -359 398 -440 486 -535 589 -648 714 -788 869 -958
54 -958 1057 -1170 1299 -1448 1619 -1820 2063 -2358 2733 -3217 3878 -4833 6350 -9132 15959
69 15959 -74531 -48609 37769 -54507 -27792 23032 11284 -5975 29583 21855 5826 14531 20552
82 20552 -7502 -1112 13101 -4150 -12623 5447 -3493 -10126 -1246 -3129 -10129 -3455 -1975 -1229
96 -1229 695 -25 240 6126 6848 3630 2835 7052 3634 -1697 450 -247 -4411 -2010 -3593 -6284 -1334
113 -1334 205 -3680 -775 3230 1071 130 2716 3049 16 -4 1903 328 -900 1028 -147 -1727
129 -1727 146 -193 -1335 -497 -588 -1183 -737 162 196 -57 332 1140 694 161 1212 718 105 134 -103 -90
149 -90 -688 -876 -316 -438 -553 146 -88 -64 498 589 -4 -43 533 12 -100 -49 34 -261 -453 117 -348 -276 12
172 12 -36 -73 9 365 76 47 228 12 -51 22 291 37 -336 -16 204 -202 -16 -130 -228 -221 -93 213 160 -174
196 -174 75 49 264 -87 24 0 101 122 -75 -169 66 -74 101 -210 183 -147 -115 160 578 23 88 287
218 287 -69 177 129 -96 -228 81 96 -48 -183 -216 -221 160 -29 108 51 -75 167 -62 -21 229 -206 126 -276
241 -276 -3 73 -73 128 54 58 93 -243 173 -62 88 -89 -127 -127 318 -45 -131 50 87 -70 189 170 -200 88
265 88 12 -274 -398 -71 22 -15 -27 142 47 74 133 -220 -158 -193 129 -170 53 127 18 20 267 -129 -220 129 -302
290 -302 129 97 -6 -52 -10 74 53 0 -172 117 -25 -79 -223 -55 -69 1 -8 -15 -152 -278 105 -113 125 83 141
315 141 -239 -89 -150 100 -115 8 -166 -340 -33 183 -74 129 60 107 -15 -266 -99 125 56 141 -46 112
337 112 72 -108 -41 24 163 -146 67 -92 172 -98 -185 240 146 -252 123 114 222 -20 61 121 -177 174 36
360 36 23 -20 -207 -17 -130 -9 175 -225 153 70 -228 66 474 37 28 -181 145 273 -37 -329 -165 -184 149
383 149 -200 189 209 -62 -200 -97 -249 78 84 -132 86 -106 264 81 1 -28 -351 -366 -49 143 65 -53 -183
406 -183 -57 214 -260 -62 142 45 116 -35 310 -241 52 100 193 -309 -131 59 150 148 -18 174 -46 -47 -17 -292
430 -292 -26 -89 -93 -187 174 -46 -115 6 -12 227 132 -205 37 -14 -83 -21 -55 -71 75 -195 -126 221 1 -100 232
455 232 -2 49 -80 205 -229 -25 -30 -64 -163 -338 67 28 -17 -29 -84 25 408 14 174 -178 62 16 -21 49
479 49 -43 136 28 -6 48 -169 153 -75 27 -14 399 -59 129 50 45 -65 174 -329 -88 20 -238 157 -6
502 -6 130 -142 105 32 39 198 206 70 -109 -331 -57 52 198 57 -100 -19 -17 -37 324 -27 -103 -39 -91 241 81
527 81 77 -35 -42 70 153 -22 53 173 -80 48 -76 92 -265 82 -55 -194 -40 176 48 -46 34 239 -50
550 -50 55 -239 -44 177 -52 -226 -78 -95 -149 156 9 -158 -460 128 77 -103 -10 111 32 -236 107 -98
572 -98 161 153 -192 49 -111 132 -120 -253 146 191 -167 -109 89 -121 153 -41 -35 -74 39 17 116 -218 43 77
596 77 -19 -15 -8 -65 -31 -173 36 79 14 -91 118 -15 -46 -75 -130 47 -186 32 65 78 51 49 -35 94 74 -150 -132
623 -132 -88 -53 102 -47 -1 40 119 34 27 94 146 339 -5 -45 146 214 31 136 90 -140 -119 15 162 50 -265
648 -265 -305 -86 -217 38 60 -15 -4 -188 128 -15 -184 113 23 -272 -99 -56 226 37 42 39 -80 69 -77 125
672 125 -23 68 -279 101 99 -66 73 63 -215 225 73 -103 -153 -110 -70 -17 144 18 -84 76 -101 101 182
695 182 49 -78 401 -219 -98 -71 -39 -178 29 128 -24 -83 -1 -296 6 -280 150 -287 71 50 -38 88 15
718 15 125 -227 -232 77 -302 51 -159 -120 -141 86 74 -88 -100 363 331 -333 -209 -182 -170 181 -22 -160 -56 -117
742 -117 -16 199 54 113 140 80 27 104 -96 -309 125 48 27 -114 184 231 54 -139 330 255 137 -7 -77 249
766 249 200 86 -232 20 88 122 157 125 38 63 146 22 -68 111 57 150 242 -104 118 -6 132 102 167 -128 53
791 53 -89 67 174 158 111 63 -159 -185 -5 -44 -5 -72 -109 121 254 94 16 -17 95 -7 -186 -144 -125 163 172
816 172 -49 179 144 -3 -83 -68 -110 188 -37 137 43 44 -13 -203 -271 -59 290 -486 101 22 -138 -127 258 255 -134
841 -134 -282 -99 96 -264 59 -23 68 33 71 188 -66 109 -425 196 -276 -195 90 258 92 223 225 290 -20
864 -20 -98 223 -98 318 -23 53 -59 59 7 -2 65 261 -194 -160 -48 -151 -14 106 5 -38 148 -312 -209
887 -209 -83 122 -249 -73 -107 296 43 107 3 116 259 -41 -107 215 143 108 -49 -64 -145 -90 93 199 66
910 66 -19 -168 -17 207 48 127 -228 177 5 -89 271 -168 -104 81 115 -126 10 -6 89 -121 -74 -88 -65 130
934 130 35 -74 144 -73 53 -158 97 247 25 329 -12 78 -8 55 -35 -38 -105 175 49 -70 -145 113 219
957 219 211 110 27 -129 19 12 31 -89 206 56 -168 323 138 -215 298 -5 -167 3 125 -101 -114 25 -197
980 -197 64 -36 3 -277 72 -186 -120 -6 252 -56 -145 59 -82 -22 -132 80 -21 30 -198 67 -71 -318
1002 -318 29 -37 55 -65 38 155 -100 53 349 -114 66 97 -22 78 75 272 71 11 -19 -39 -26 -147 -77
1025 -77 94 -15 -34 -191 -123 287 -176 -241 -37 -176 226 -185 -106 -23 139 117 -309 136 39 -175 -123 -74 -120 -285
1049 -285 -7 -73 -209 -182 -91 -97 82 130 -111 -6 -240 48 -260 240 13 147 -53 72 -115 -49 160 -205
1071 -205 -78 12 221 145 33 -175 -27 65 -130 101 -215 215 205 94 123 -264 -179 -51 170 44 204 -152
1093 -152 -4 31 116 -242 47 265 -183 131 52 -195 -54 223 191 -29 78 51 80 -109 -85 246 130 -68
1115 -68 -70 194 24 -9 -89 14 -160 -146 2 193 285 -17 95 258 -192 222 172 246 -128 -192 78 -113 -173 -221
1139 -221 -32 -130 323 190 -151 76 -299 -94 -85 -8 30 57 28 -81 176 178 198 16 105 -250 12 -112 71 -221
1163 -221 -27 -121 93 -61 -110 84 366 -83 -42 195 -248 216 -66 -170 1 158 155 179 -1 4 -98 201 65
1186 65 237 153 190 -71 -116 98 -34 -132 127 -161 -113 -115 32 281 -220 328 147 71 -193 -45 52 26 -198 -12
1210 -12 41 -114 140 -234 -159 54 92 17 -170 -174 -63 155 42 -333 -59 342 -35 137 108 -138 -87 37 201
1233 201 -115 -37 -85 -50 -153 126 -66 89 112 22 -19 -7 -51 98 -119 -337 -19 -8 199 216 -15 -91 -153 68
1257 68 -183 -82 14 22 29 -151 -63 -171 82 -129 -16 84 -59 59 -23 -6 117 -167 -134 -67 -345 -233 76 37
1281 37 20 -70 200 -65 55 -65 -163 147 -150 93 288 -264 162 44 -140 -376 -78 238 4 107 78 -251
1303 -251 -75 -10 223 -27 -161 -144 102 160 -157 -35 -227 304 28 248 14 148 -164 -14 138 -6 -208
1324 -208 8 -126 -281 -222 40 -202 -132 -62 -19 175 139 108 86 -254 -318 -142 7 -53 32 -16 143 39 -66 -20
1348 -20 169 185 -267 69 -176 140 51 -240 163 14 143 226 -237 -177 75 -100 6 120 49 -163 -170 313 -204
1371 -204 80 -57 64 -47 243 -114 121 182 208 54 80 161 -191 21 133 -28 -47 166 -66 -389 -367 -129
1393 -129 31 -76 163 -162 36 -3 -38 -182 -149 -98 22 156 -176 -79 267 196 -4 229 -56 71 -92 -41
1415 -41 -19 53 -156 -51 326 176 37 121 -127 -40 -104 33 -45 211 105 177 80 141 2 -10 162 -21 33 -251
1439 -251 -231 -4 43 -155 163 61 -79 -227 323 170 -164 164 -65 -136 -30 -27 -157 -102 255 24 33 125 168
1462 168 -225 0 -58 137 -280 149 30 -152 -11 203 68 197 245 9 -227 -109 -182 -88 73 33 89 -1
1484 -1 -150 -241 -351 -78 60 126 -49 -61 63 -91 -75 -76 68 139 196 -62 216 133 -195 -96 -19 39 -237 131 -147
1509 -147 29 -199 -223 112 169 -118 -67 -172 13 261 172 -135 -83 -21 -36 -72 68 126 -142 -285 41 -186 53
1532 53 -127 -70 -81 -296 -199 65 81 16 188 55 233 -18 75 277 -149 6 219 -59 33 -22 -30 -33 175 121 323
1557 323 6 10 -139 -135 -239 -65 -56 -282 18 106 1 78 20 -12 9 145 -80 212 -114 491 237 -122 -62 -268
1581 -268 72 66 186 -164 -187 -79 -33 -117 -135 307 106 250 28 243 -33 -177 385 158 93 27 227 205 -117
1604 -117 -180 -140 -181 -7 -195 117 99 121 -54 -1 217 204 97 -35 101 186 54 -41 -33 -16 158 220 121 -109 -90
1629 -90 29 132 110 -122 57 -190 99 147 -105 113 177 45 -135 94 49 -94 181 25 250 346 -85 6
1651 6 -35 -177 53 68 203 98 -35 -80 -25 37 -185 1 7 -76 -166 105 134 36 -45 -46 -68 48 58 151 -56 45
1677 45 199 -104 22 -33 60 -273 -146 -15 224 -401 140 217 125 89 47 -48 -93 81 -313 21 66 -220 54
1700 54 71 49 257 -122 168 26 -238 -91 -135 98 26 -134 18 221 43 -315 -184 -55 9 -158 -103 215
1722 215 -66 108 -84 119 81 179 27 -89 74 -140 162 -61 303 -128 104 11 -48 -150 -164 -52 -25 43
1744 43 -143 23 -146 87 146 214 205 72 -29 58 95 329 -244 -188 -172 271 263 216 -40 -212 -132 105 -92 8
1768 8 -215 -160 44 186 54 103 37 106 -342 -261 136 -207 -26 -103 68 -193 104 412 215 115 241 253 -49
1791 -49 -60 -91 59 134 -175 192 -72 110 -57 -107 -48 38 -412 -178 -138 4 79 -114 37 67 -93 51 16 148
1815 148 18 -35 31 4 -39 -355 -191 -123 58 35 -131 -125 122 -100 -5 -198 107 -327 -4 290 -41 352 198
1838 198 125 -75 -22 170 -161 145 -153 109 53 21 -167 28 210 88 131 240 -231 209 -56 -39 26 -64 425
1861 425 -107 36 202 108 111 -183 -98 -116 98 -172 -39 -141 -74 141 81 -61 -25 -231 55 58 44 -3 -128 -133 83
1886 83 -25 72 -20 -81 26 23 2 170 -71 -255 160 57 -92 188 176 49 -11 73 114 144 -238 -19 209 137
1910 137 -156 -133 -237 -219 -22 -138 -66 -542 22 -201 -60 31 -27 -14 -73 -51 -174 -228 102 -168 -187 193 -157
1933 -157 282 -29 -45 295 245 58 -32 124 -331 -16 -60 201 150 13 32 -56 -54 -85 -144 56 10 187 -53 -35
1957 -35 -184 219 -127 42 138 42 134 -83 -37 -322 -217 143 -125 199 -190 -110 244 68 12 -176 -140 52 -9
1980 -9 168 -153 -193 -10 94 -15 263 -13 53 24 94 160 -13 65 -168 -193 -46 42 -96 144 -109 33 -34 51
2004 51 -16 146 15 116 107 21 -348 -13 -13 269 0 229 -8 -56 65 168 314 43 108 -258 -107 -250 -12
2027 -12 348 -14 155 -55 -153 230 26 212 161 -130 127 -81 37 3 -274 22 -55 -21 13 42 -99 81 -60
2050 -60 138 13 -250 211 4 -209 137 -175 73 -113 110 -100 -28 246 -139 243 64 -173 110 -282 92
2071 92 -36 -207 -331 151 60 45 -161 -174 -115 -241 138 -3 -85 215 -57 -125 -222 106 217 102 237 -359 116
2094 116 -79 11 294 187 170 255 123 87 -147 55 -33 -7 -130 -63 51 9 -98 102 191 -35 -116 -185 -222 160
2118 160 -68 131 83 -137 -72 8 73 17 118 227 97 -17 -28 -62 -165 280 -82 -237 -146 -128 -189 134 -194
2141 -194 -50 -23 -215 -57 215 44 -161 62 -100 -24 -13 120 19 60 218 -229 -16 -78 29 -60 -42 108
2163 108 7 -61 74 -74 -71 -233 -62 -1 95 60 34 -16 -147 93 -208 83 199 6 -290 63 -109 -190 56
2186 56 -141 73 50 -152 127 -164 97 -93 -18 -94 29 -122 -5 -154 148 42 -517 46 -75 -346 76
2207 76 -179 -72 -183 81 -67 71 60 -322 61 -106 99 304 233 -213 128 164 215 112 191 3 86 256
2229 256 -198 -55 71 1 31 -209 157 26 56 23 -4 -14 65 -112 195 0 -332 -11 92 43 -185 -66 19
2252 19 -43 -13 72 -159 -254 112 -86 -48 -38 -68 295 -129 -213 12 -18 -48 12 -27 -220 55 -235 136 -7 -12 212
2277 212 207 114 175 48 235 -54 212 51 -156 2 -62 74 -41 349 -48 74 -459 0 17 148 162 -30
2299 -30 -209 183 -206 -33 174 -38 358 13 73 156 -133 0 -35 -260 169 -133 51 50 121 -23 13 -12 6
2322 6 219 14 -169 166 -71 -59 -26 -3 -65 -78 -240 -36 -24 -52 -31 -80 366 97 293 -56 91 -76 154 205
2346 205 280 -238 -196 275 -126 245 -115 -53 118 22 -155 -296 -211 -164 354 -294 36 48 -288 131 26 312
2368 312 -92 -106 -74 218 -214 -98 7 32 150 46 -56 -296 -133 -15 132 -106 -23 135 -261 164 -178
2389 -178 311 -14 -137 -20 105 -220 102 106 -155 135 -25 -60 -276 -183 -29 28 -25 -92 -103 291 -125 -154 -261
2412 -261 193 -191 -136 -196 60 97 -87 23 -170 221 28 37 -30 10 76 -60 -93 100 -135 -1 -51 5 206 342
2436 342 48 52 -50 79 54 11 55 282 -118 -86 90 -178 97 -68 -19 -76 1 -88 54 283 -31 -130 73 -18
2460 -18 309 -52 -199 -116 -93 -38 -101 356 -54 -41 -231 151 -78 -109 177 -240 -63 151 -60 35 32 256 163 86
2484 86 243 94 228 217 -28 85 20 -67 60 -63 -142 -270 129 -23 -187 -147 -46 -274 -119 -176 261 170 307
2507 307 -256 -130 -266 -47 20 5 40 16 -99 -330 17 44 7 -131 -313 190 63 -23 -111 120 -41 10 -83
2530 -83 -145 275 79 118 63 -171 85 199 -101 18 174 278 -66 -97 12 292 90 186 2 20 145 -133
2552 -133 -19 99 -146 -25 -37 165 -309 -8 63 -17 70 -126 11 406 179 19 106 -51 -182 118 -45 222
2574 222 365 -3 -182 -222 -100 71 -163 7 -11 -244 -55 -270 -292 73 106 -127 76 -71 -267 -191 169 74
2596 74 39 -293 66 135 11 -4 152 166 353 300 -149 71 40 91 95 -32 18 -17 -25 111 -178 427 -157 -13 4
2621 4 217 -46 -210 -161 -142 -289 -170 29 67 -94 170 -340 151 9 -112 -119 -306 217 382 -27 22 -4 225
2644 225 64 -44 64 262 217 50 10 52 -55 151 6 241 -11 25 39 -109 49 -45 272 160 113 47 77
2667 77 -33 -230 -106 49 7 -203 -9 -9 389 171 -211 139 -35 218 -200 -44 310 203 -96 -59 -228 -113
2689 -113 -218 15 24 -16 79 -212 32 240 -55 -99 -40 -66 0 6 -143 -136 11 5 173 -180 -177 -217 -30 -2 -158 47
2715 47 -103 0 -114 105 150 -140 -249 118 -95 307 -37 51 123 64 -112 405 74 25 -11 105 33 -210 -247
2738 -247 170 183 -400 111 -229 0 166 -162 -10 126 -77 -165 -163 -362 -70 -236 100 7 12 160 162 -44 -197
2761 -197 127 28 84 -7 -22 -103 -11 49 -127 -95 -36 52 28 104 97 18 -92 -357 -60 -151 31 109 166 -25 -308 -97
2787 -97 255 28 23 32 27 -210 -39 85 -291 29 -110 -75 64 -37 232 -45 138 -103 227 -88 124 -20 -102
2810 -102 -80 -191 9 -141 85 47 106 10 121 36 -39 72 -142 214 -53 89 -56 38 -223 -114 53 168
2832 168 -171 -202 -154 319 -75 -96 -14 154 32 -152 157 131 -284 126 119 27 62 84 68 156 -240 15 228 -92
2856 -92 -56 -104 41 -28 -4 18 231 6 -115 -35 -326 11 -108 -156 53 118 149 0 0 81 -52 -32 -100 -108 -110 -10
2882 -10 -18 0 111 -64 170 -226 -16 -64 -14 87 -195 16 -11 104 -298 -41 62 -191 251 -72 -176 10
2904 10 71 46 1 -94 -108 -129 54 -210 -66 82 13 -53 -231 -144 -144 203 180 -126 -62 -47 190 256 99 -89 146
2929 146 42 80 -18 44 338 258 251 126 -333 193 149 119 92 -23 122 14 -90 153 220 -224 58 81 20 29 -26
2954 -26 -191 -25 -99 97 -79 136 -192 354 -77 -46 -343 -164 -83 91 238 -97 -111 134 318 -288 64 -136
2976 -136 -168 108 -89 12 -68 -41 467 131 -91 319 -161 156 -122 -63 -114 -11 103 68 63 167 -76 -290 -141
2999 -141 42 -221 188 231 104 30 -356 155 -158 299 -100 -14 -37 340 200 -144 -61 302 -68 -167 -59 -118
3021 -118 106 -175 74 -138 327 454 106 -41 50 -192 -159 103 258 -173 -43 -298 84 70 88 -70 355
3042 355 95 95 83 109 -35 171 -212 169 -20 -69 43 -33 -68 -10 -105 -116 306 -83 164 -14 45 -143 -118 -84
3066 -84 -76 8 -86 67 178 202 -1 14 201 -93 -113 -69 -268 64 -61 102 99 109 414 -138 -9 -25 201 46
3090 46 212 -64 329 82 69 209 -89 -78 175 -155 80 89 -66 -89 -125 -50 -144 135 236 251 -104 -52 -209 24
3114 24 183 126 139 115 8 169 -216 40 5 -90 158 -100 -257 147 91 264 -36 -20 -373 -72 69 -22 -239
3137 -239 10 -62 78 -410 26 88 -26 -199 16 38 -74 -199 -127 1 114 225 -3 95 109 -23 164 273
3159 273 -23 -14 166 225 -156 -255 98 196 -261 173 -29 101 219 63 -65 134 133 -71 -274 116 -72 -54 -209
3182 -209 -175 -67 -105 123 293 9 -107 -51 -185 4 101 -29 -151 95 -90 -7 98 62 158 -204 60 24 54
3205 54 27 -39 45 -15 128 -38 22 -300 182 -70 -77 190 -114 70 -251 -129 -96 -106 -226 -217 166 -20 82 133
3229 133 121 88 -66 48 -113 -21 -101 23 -69 -151 -75 126 -109 -23 -115 -196 -22 150 -20 -64 60 -123 128 -157
3253 -157 -231 -48 -2 193 42 112 126 -132 37 57 122 65 93 -270 81 -34 -31 -153 195 -151 -122 -25 27 166
3277 166 27 176 87 -90 385 -21 -176 -4 -20 143 -337 -6 92 -159 -31 38 311 -212 -35 -88 127 46
3299 46 83 -6 155 222 -106 -101 -240 -290 39 16 161 -145 42 217 114 128 -241 16 -159 -100 -58 16 112 -3
3323 -3 -121 -95 -102 -179 -273 -4 84 165 21 55 -188 -169 -57 -38 196 282 259 185 89 51 -83 -8 -128 -249 17 92
3349 92 153 -40 -8 -134 -362 24 -80 87 -165 -87 -96 17 53 30 -33 -31 -73 -57 44 82 -77 55 57 -221 231
3374 231 -155 -48 -17 243 23 118 -32 100 -96 156 44 -108 18 187 78 110 -130 -195 12 -4 -23 10
3396 10 89 165 -169 360 -137 221 -36 -2 116 -117 -83 -42 -32 53 -49 -164 38 37 75 -158 171 -124 -35 -313
3420 -313 -78 66 127 -19 -255 -108 -4 -12 310 82 -188 157 -14 216 -64 -203 -56 22 -132 -290 59
3441 59 -109 -108 90 -13 -354 491 -107 167 50 -63 -59 153 -239 -69 23 140 88 -75 58 -183 110 -219
3463 -219 -5 -269 -45 -122 210 9 -180 106 -174 -49 73 58 -15 -175 -199 27 -171 -3 -63 77 7 -14
3485 -14 230 198 -111 -49 -148 -113 -30 -21 -54 -39 -25 117 -5 122 69 154 27 -96 -81 167 27 2 -11 -51 -151 -11
3511 -11 18 167 32 100 -51 85 -319 -81 -100 93 -101 -13 20 -80 9 50 90 143 176 -1 -53 12 210 321
3535 321 43 -280 233 -244 -168 -98 48 -7 -125 14 56 109 111 -318 45 272 -85 -97 -159 44 -375 -251 263
3558 263 -65 106 82 -33 -156 -50 -164 -123 -48 -520 106 -84 98 -204 -7 -66 92 82 30 -56 106 10 -129
3581 -129 -20 -24 234 -184 55 53 -47 -25 -75 88 -13 80 108 108 -76 -229 113 -140 200 39 -227 105 77 90
3605 90 -49 -17 191 -15 89 -277 -70 191 59 -212 119 114 -209 248 -153 208 102 -119 -130 -15 181 -39
3627 -39 -14 -57 0 -19 48 -127 -152 161 284 -123 -35 -193 -117 -79 123 -238 65 -110 -237 -43 -204 -203 -140 93
3651 93 -19 139 20 -54 -47 -193 -189 215 44 143 -188 -5 27 -202 -15 -161 135 -1 -132 -46 -48 175 29 356
3675 356 -380 -46 -39 -29 -252 343 69 91 -81 -267 110 78 227 -12 23 -309 -44 -63 -280 -218 215 -289 -89
3698 -89 183 -6 -4 -16 -23 -17 91 -195 25 147 -26 320 168 21 -62 -174 158 -73 96 -53 24 -112 92
3721 92 451 27 -107 -83 233 255 -64 138 -46 -204 -5 -196 -125 161 -121 235 5 -219 173 64 -236
3742 -236 -101 -236 -47 197 114 -89 160 28 112 -28 -216 93 -11 46 136 203 -157 229 157 215 -118 -212 -241
3765 -241 -69 -127 23 37 19 10 -144 102 80 -110 -40 17 160 -117 -193 21 259 75 -150 -201 -16 121 241
3788 241 43 -7 99 46 -135 116 233 -8 -17 257 -322 -199 192 -77 -33 25 -6 -70 77 -9 -37 -18 -173 -93
3812 -93 -16 6 87 -78 160 62 -298 110 -56 153 117 -223 -53 -169 34 -78 118 1 20 -32 -78 -42 193
3835 193 -174 -143 127 322 176 199 -59 -136 8 74 -101 90 402 175 -168 207 -15 -91 -3 -94 -149 -158 -155 17
3859 17 48 -55 -59 -45 13 121 257 13 132 235 270 39 33 312 209 -225 13 -183 2 150 82 260 0
3882 0 80 -223 -1 88 -175 -118 -277 -238 42 -2 -257 -164 -14 -37 22 -97 98 -50 45 -90 55 275 28 -128
3906 -128 -39 -42 -63 229 233 46 -91 170 -205 228 -188 -29 74 -47 84 -77 -220 -141 -230 -201 82 -85 -74
3929 -74 -229 185 160 -153 209 -60 49 84 -118 -150 28 -252 -143 295 -73 163 154 -144 -1 -66 -79 -135 -229
3952 -229 10 66 44 27 101 -123 -49 -14 -224 183 -30 -28 73 -289 128 89 -339 -96 85 103 11 -56 -138 -29
3976 -29 45 130 77 139 -271 146 -35 62 233 86 207 191 -87 113 28 25 -151 8 66 -104 108 -51 122 35
4000 35 161 263 -127 -57 185 -129 46 153 34 -149 -51 -220 -366 -16 -1 -128 -114 17 -202 -97 -129 -37
4022 -37 125 121 286 51 -150 41 54 181 -228 -86 -59 -230 -192 -131 9 20 249 53 -95 -243 -39 -259 -205
4045 -205 -254 28 -133 -109 -24 90 -62 -204 275 179 87 115 206 -187 -38 36 303 -143 -32 -108 33 -27 -184
4068 -184 -45 31 -14 -9 -69 86 13 -30 -223 83 -12 -11 -47 120 80 -132 -31 -63 -27 373 -25 95 -24 -158 18
4093 18 -9 162 268 -90 -51 -63 40 41 -98 -293 63 105 81 132 34 -22 230 89 238 -46 186 -60 -24 52
4117 52 -12 84 -150 -103 -164 41 113 29 69 31 -90 50 -137 -155 -171 156 243 -38 5 69 -110 7 -241 -62 -18
4142 -18 -20 248 -39 60 -110 63 -72 -83 215 -39 134 -20 148 -249 -122 -17 -124 -169 -100 -227 73 -192
4164 -192 -135 -49 -295 117 58 182 -268 99 -1 102 58 -82 60 166 103 -154 70 -53 -264 -235 -206 -160 155
4187 155 -111 -208 -123 -115 -84 146 -98 -122 -26 25 205 83 -238 73 357 331 40 161 1 6 13 -180 -106 18 -47
4212 -47 178 47 -225 -85 222 217 -80 96 165 -7 -73 -78 -120 36 -113 -199 -77 127 -150 -121 -131 113 -12 35
4236 35 333 81 -93 -128 -163 -40 -140 74 98 -436 262 -45 -50 219 -64 -77 42 -52 -127 276 187 -36 143
4259 143 -131 498 -148 -9 -52 90 32 335 37 128 370 5 140 211 -41 -93 145 108 -109 26 -45 132
4281 132 -135 -23 118 220 116 20 -171 -37 -126 -185 -123 90 -274 87 36 -110 128 -164 217 -63 198 -164
4303 -164 94 -4 -248 189 -90 -206 -120 -60 5 101 -91 -184 -260 -205 -74 -121 21 76 -46 -57 7 155 -85 -41
4327 -41 310 86 179 82 -73 88 74 89 -333 -15 177 -226 51 -77 -106 -5 -1 174 -293 -190 138 166 -77
4350 -77 150 -18 -180 75 5 63 117 -14 -57 53 -9 390 -229 60 83 -78 -91 289 -151 -79 -105 221 -224
4373 -224 -159 -41 -144 -175 -168 -16 188 206 61 103 16 102 -329 -21 -242 9 28 110 10 25 5 -36 173 179 47
4398 47 -62 100 34 -180 168 59 94 101 -74 93 -31 52 297 -135 40 -216 75 -6 73 148 95 -259 -95
4421 -95 -158 192 -21 0 -22 44 -82 -76 -181 105 127 -118 142 -5 -215 -24 -93 -244 -43 -126 113 98 -40 97
4445 97 63 -190 -148 -54 130 345 -117 38 -133 68 -110 -182 -79 151 -138 -283 -213 -65 228 -11 -101 3
4467 3 64 42 4 -19 262 87 143 374 38 -169 177 61 -30 -89 16 -9 214 -104 249 -80 101 184 28 -88
4491 -88 34 -42 123 133 136 20 32 276 35 212 155 182 17 275 -153 212 -114 -131 131 -186 95 59 67 108
4515 108 -12 -380 -8 168 -315 -132 -154 195 76 233 5 -78 279 134 116 127 -4 -164 -33 257 -68
4536 -68 -74 46 212 162 -154 -2 -60 -267 -111 -33 -13 -179 124 -51 50 -207 113 226 -63 108 -349 202
4558 202 46 188 35 -120 -26 -279 -116 93 215 -77 -140 90 63 190 12 -92 -159 -98 6 -253 12 244
4580 244 -80 143 -154 107 -5 -38 131 -50 -122 -98 -169 92 76 -379 -1 96 227 -202 -115 -266 -90 308
4602 308 323 -202 28 -215 70 71 42 467 -53 -21 -358 -162 -45 -3 -10 -68 58 97 58 -150 -107 -183 -98 -116 336
4627 336 91 312 43 -159 16 3 112 -171 -97 32 2 -151 178 -56 99 -7 -72 -66 -94 136 -212 113
4649 113 68 41 49 154 -179 -88 51 -62 139 4 18 -67 272 -122 100 120 -56 98 107 90 134 -245 -97 -15
4673 -15 -80 -46 9 131 -139 181 -133 17 -5 12 59 -98 -200 -80 102 -21 -19 -221 78 -190 51 -105 -79
4696 -79 -14 154 27 -41 110 -3 39 -262 26 -2 -380 129 -301 -18 -366 -68 113 118 -171 -58 -128 113 206
4719 206 -217 -195 47 -109 -122 -211 28 8 46 112 -139 -147 14 72 215 -84 -125 6 268 58 12 -1 -158 -156 39
4744 39 53 99 161 -193 -5 -360 -112 -316 -240 -138 82 -162 -91 55 60 216 153 34 -233 -269 -128 58 -84
4767 -84 -79 144 -104 177 -185 -13 -28 -185 18 22 -216 198 207 137 -52 149 -52 -67 115 -28 45 -202 95 96
4791 96 22 53 55 -65 -126 -155 -34 40 58 250 -212 6 60 -3 30 23 -108 24 129 -134 49 -67 142 -45 148
4816 148 -77 -245 -2 -6 101 -34 -107 64 323 -396 68 -50 16 195 -73 -31 148 -220 -108 226 -108 126
4838 126 136 122 -140 23 -45 51 -182 63 -112 155 -76 -65 -70 -92 129 352 42 -10 133 108 -153 156 213 81
4862 81 -69 -65 16 -32 -6 115 -205 33 184 -131 80 -243 -144 10 31 14 12 18 112 11 -10 287 -54 -111 191
4887 191 60 -104 83 -41 -149 -60 -111 -96 33 48 97 -235 -148 -150 183 -109 -2 -11 -47 152 364 18 207 88
4911 88 -35 -162 -300 -17 -65 -168 25 120 -456 206 -255 -203 172 298 -210 -212 -231 220 156 -238 -19 34 88
4934 88 227 78 -72 -90 -130 -14 -59 -221 -7 -78 -133 -30 157 21 -90 -69 66 136 96 -3 48 313 239 316
4958 316 -161 -90 129 33 113 82 6 -168 71 135 -128 146 64 -52 -103 230 94 -360 -94 114 29 -128 206
4981 206 -107 18 -186 110 150 92 421 -1 44 144 98 150 363 142 -237 -54 262 -60 -29 251 -79 71
5003 71 70 -131 -166 81 -90 -130 -501 163 -60 -157 -103 128 -22 104 213 214 3 -207 46 -448 43 -143 -166
5026 -166 62 -13 -97 -120 328 -130 -19 -15 372 -92 263 86 116 -105 -49 -265 -14 -83 -329 -46 -275 67 21
5049 21 72 -39 50 164 11 187 -119 31 -16 -150 -70 -233 106 275 300 -72 35 281 2 -31 -12 48 -47
5072 -47 83 -95 116 -123 18 150 -260 167 -282 64 205 154 19 -263 58 54 -128 -9 16 90 150 -264
5094 -264 16 55 -391 141 15 13 -113 56 -175 87 -154 -99 67 153 134 -55 -61 121 -85 195 4 29 -68
5117 -68 -5 -124 57 -76 -54 67 131 -206 -219 -255 -41 35 -85 114 -71 -93 -115 157 201 -75 -75 156 -38 298
5141 298 -149 228 -155 118 -170 -175 65 42 -88 -147 -200 287 2 -1 -154 36 64 9 166 211 58 -302 -45
5164 -45 -221 -169 14 94 -253 2 38 80 -261 34 60 8 -241 54 -115 152 186 -91 63 -22 50 146 -9 1
5188 1 -111 81 -174 -102 -18 73 33 55 -64 56 138 -74 306 29 9 3 -55 -130 -25 84 36 -200 -24 -121 -190
5213 -190 -9 -52 -9 47 -48 -134 243 -111 -119 106 24 -70 -113 -28 46 60 -249 140 -84 -65 12 -156 -198 -348 97
5238 97 -127 6 -154 53 70 -154 282 160 29 108 -22 41 248 -17 222 101 -113 62 -30 -103 -111 -168 -103
5261 -103 90 386 -210 52 60 80 -153 112 113 -76 75 -198 -297 26 175 -89 -61 235 156 -86 -40 -31 -20 -68
5285 -68 -135 33 0 30 -13 15 -23 -118 -44 -103 0 139 -230 41 228 235 -37 -46 -69 -72 -288 34 143 -100 36 -167
5311 -167 -144 -152 4 149 -184 240 151 30 51 89 -34 156 -72 -150 83 26 307 17 29 44 -42 22 10 -152
5335 -152 40 -74 6 -129 -191 22 169 -108 -127 153 11 128 99 16 -316 -238 21 28 -174 -65 -29 40 55 -60
5359 -60 -43 249 186 -138 151 123 3 215 -289 93 79 162 58 181 66 -87 61 -223 234 -91 -158 127
5381 127 43 7 -379 -280 -92 -231 -70 -108 -133 -13 -142 137 -294 -123 -179 -162 -1 3 -160 -405 106 176 162 34
5405 34 -43 146 -34 -63 -23 -240 162 24 332 154 -120 -101 -28 -84 71 -155 273 231 207 -118 64 86 -36
5428 -36 -101 -280 41 41 63 98 -188 -355 -208 -38 -33 61 -191 107 120 207 -315 -96 29 -268 325 337 42 -137
5452 -137 138 -93 89 -48 297 19 -25 115 -70 36 -54 149 -31 13 18 69 23 -284 29 -68 92 103 -98
5475 -98 14 193 41 -222 295 -4 -28 73 -68 -187 -276 -36 112 -7 262 358 170 70 115 129 14 -36
5497 -36 0 131 -267 -137 121 28 -110 194 124 154 145 -102 -52 -80 -65 99 -54 135 111 -119 -198 104 80 40 190
5522 190 76 -84 -72 132 -166 -31 -92 17 3 162 -103 125 298 51 240 -83 208 -281 -110 -140 33
5543 33 21 -282 92 69 -119 99 -30 96 -28 -216 85 -75 172 -260 212 71 63 111 259 -14 -268 69
5565 69 -197 -68 183 -71 -99 197 -141 75 -137 99 -61 -209 127 34 129 -59 27 68 -62 206 -3 -54
5587 -54 151 156 75 110 -96 -26 60 -288 -99 -24 104 -71 347 192 59 -37 -67 -30 111 -58 -359 -136 -21 -121
5611 -121 267 -124 110 144 33 -9 94 77 97 106 -40 -205 239 113 117 -180 156 -95 -49 262 124 66 -46
5634 -46 -84 -121 207 108 9 -7 -80 58 -239 -64 30 -85 -22 5 206 -249 -18 -2 376 158 -9 207 106 31
5658 31 96 223 -47 -17 73 -18 -89 -190 -1 -66 -185 -41 4 -99 -64 -88 92 -83 67 -93 111 -45 -193
5681 -193 -86 -28 112 -203 159 177 248 17 261 217 487 131 38 -43 106 126 138 -59 71 -194 -171 -228 -91
5704 -91 52 -119 410 298 -209 256 -226 -32 -110 -200 -113 -84 -122 -39 198 9 -143 -107 196 26 -47 0 190
5727 190 265 124 -122 53 184 272 -16 -78 -120 140 -196 -61 36 -143 3 170 316 191 159 116 350 329 -116
5750 -116 -220 129 217 52 -119 33 294 -138 20 54 -169 -52 -136 73 147 166 174 -104 -261 121 43 427 -129
5773 -129 -182 -18 8 -48 -37 198 152 -233 36 254 -199 91 -205 361 186 -97 68 240 -65 -172 122 -70
5795 -70 -89 -189 -44 190 203 76 39 299 45 246 -120 -131 -234 22 150 -133 -122 -337 5 -148 200 65
5817 65 -214 188 -84 178 -39 -24 100 -179 -140 -29 -66 85 -33 -200 273 -41 118 68 35 65 -1 -297 77
5840 77 -100 -31 122 99 119 23 -178 75 56 111 187 111 -224 68 -311 148 32 77 -68 -220 70 129 88 246
5864 246 -228 -88 -192 -229 -59 -105 -72 153 43 -182 402 -321 169 -7 -72 -205 -53 77 -24 142 20
5885 20 361 -26 -8 -209 28 104 50 219 159 68 81 126 -87 -129 -45 66 101 -165 -78 -84 -324 110 104 334 -202
5910 -202 -170 49 -162 20 -179 -160 14 -105 -12 -54 243 231 -102 200 175 -385 -86 -63 202 -38 231 73
5932 73 14 -48 -230 -115 -92 53 162 206 -62 -2 -116 -255 88 96 15 164 201 -36 -103 -31 -93 -4 -197 -82 -184
5957 -184 236 -75 44 6 -89 104 38 -92 133 135 245 4 26 62 -175 -73 98 -138 -90 -20 -206 234 -67
5980 -67 112 7 37 114 12 228 0 25 151 120 -16 310 -31 240 15 84 -81 -127 -70 23 -120 -24 384
6003 384 52 92 3 -259 172 103 -83 82 -174 -212 9 185 110 -24 107 -132 -129 -204 -274 65 -264 -135 293
6026 293 163 -124 75 19 120 -77 77 133 9 -192 -315 25 -87 56 -138 -205 -88 -13 177 187 232 -145
6048 -145 42 63 303 -9 195 38 -68 63 -281 392 127 -10 192 -99 141 -62 -310 43 -23 -101 133
6069 133 -30 -59 -182 -77 100 -250 -44 87 91 64 -232 -453 144 -127 -43 -37 -171 133 -87 36 85 -135 -189
6092 -189 -89 -71 -28 -78 -134 -10 154 49 80 75 24 -66 106 -50 108 42 -100 -1 184 52 5 34 -112 -151 86
6117 86 -13 -282 122 -435 -358 -121 237 229 205 190 -35 -134 -206 151 -22 81 147 -21 245 -104 152 -113 125
6140 125 -62 209 -156 104 17 282 -71 -10 113 101 191 191 75 -238 56 -158 37 -142 -181 -89 -3 297 125
6163 125 266 1 228 -155 -120 -132 107 237 66 40 288 -95 231 23 -43 -229 127 -132 -162 -167 -69 403 -16
6186 -16 17 19 9 278 99 -48 18 53 30 22 84 -106 162 337 177 -176 -233 221 7 -44 286 24 191 -126
6210 -126 -84 -117 39 -213 316 211 -38 13 122 -15 -10 -61 -289 118 -56 -11 51 15 164 49 -25 59 75 208
6234 208 172 -84 33 26 -44 -95 35 -139 -62 -197 -203 92 -212 133 -102 152 -160 -152 3 141 -31 -63 -98 -189
6258 -189 121 -57 -15 195 127 122 -54 -162 -2 -32 167 -1 70 67 102 -74 79 -170 22 -52 50 -45 -218 205
6282 205 -138 128 -103 183 -145 7 168 12 -121 46 312 125 51 -81 -322 -92 -148 107 218 -76 -437
6303 -437 -108 7 11 76 121 -129 -197 -68 -222 -123 -169 56 238 -56 -1 171 -211 -17 -23 -101 -24 170 -136 -201
6327 -201 30 -3 134 3 -41 1 -135 -96 171 -129 -149 225 -228 113 -108 51 70 -140 23 2 21 -61 -153
6350 -153 52 138 69 -4 113 181 -65 143 36 15 1 -73 -11 -51 50 328 116 -35 -248 79 186 -75 -64
6373 -64 29 -130 229 -117 56 -29 61 84 -260 131 92 30 198 73 141 -362 -51 -82 -321 -151 -124 -9 -155
6396 -155 135 79 -314 182 -12 89 305 -222 -81 325 -124 -106 87 369 -126 -5 -136 -45 128 -315 -44
6417 -44 -58 72 71 118 288 -113 -53 109 73 -35 -115 -58 -243 -111 -237 262 -19 7 -126 199 83 -94 260
6440 260 -186 -169 -62 -6 105 336 -8 -149 -138 179 -179 117 -256 -214 -242 127 -145 -129 -203 201 205 16 218
6463 218 257 -51 -2 172 -105 77 152 -173 -152 60 -125 194 -264 -31 -70 170 206 87 132 138 2 175 0
6486 0 249 -65 250 -31 -232 173 -311 43 -101 39 96 117 205 -14 -26 166 -46 252 -115 149 -112 -57
6508 -57 -6 196 130 -511 50 174 27 57 -32 104 -159 -52 55 -206 6 213 -21 -25 -57 54 -152 -80 -13
6531 -13 -92 -112 17 -68 -211 -105 -95 127 -70 -411 -94 -233 225 -166 -102 -53 -65 -39 65 -306 -72 197 82
6554 82 -237 -74 -18 38 92 94 -49 -98 -129 -319 274 39 45 -270 162 250 -292 -69 131 67 93 -143 186 9
6578 9 87 -183 -58 81 -221 -113 -6 -201 100 199 43 -117 116 -36 -11 -260 -109 214 163 -8 138 119
6600 119 83 -14 -79 150 -216 -69 -287 85 -134 -121 118 -161 45 104 -115 184 88 -68 9 142 98 301 -3
6623 -3 -83 -46 -132 -34 -231 -123 -39 -8 62 103 -415 142 -22 85 108 184 -28 153 172 35 57 -140 -250 -142 126
6648 126 219 53 -54 -88 213 -35 113 -82 -101 126 -86 -58 -47 -136 -89 11 314 -252 -97 -61 122 130 -7
6671 -7 24 15 256 -279 88 -217 28 -100 56 -93 76 -7 8 -77 -71 -84 312 -14 -17 75 -142 192 65 -89 134
6696 134 -112 263 14 13 165 -104 66 148 -122 113 -120 -195 -54 -189 31 28 12 -4 42 -150 -43 204 131
6719 131 132 153 85 -113 8 -246 -239 -132 -327 -158 98 -131 244 115 -288 7 202 7 92 173 49 -53 -186
6742 -186 79 -67 -160 3 -225 188 25 -44 26 64 167 -245 27 -133 35 127 -32 263 74 -88 144 -302
6764 -302 -99 154 -256 -67 111 135 111 -33 -103 -85 -144 -70 -131 -68 -152 -189 2 -92 -47 -56 263 -198 142 334 -107
6789 -107 144 -301 -117 -4 -17 66 -23 -147 87 -137 143 384 -228 156 -99 83 70 150 -14 -120 17 11
6811 11 109 37 185 73 11 -13 -55 -8 -73 132 4 12 -99 11 -173 -79 101 122 79 66 -81 -94 54 154 202
6836 202 289 217 -79 -201 -62 -133 257 26 -123 -106 103 -105 25 -3 -103 163 111 -98 15 23 222 413 -182
6859 -182 -40 -273 8 209 101 -260 10 69 -227 76 150 15 239 -180 -93 -11 24 -121 91 -158 244 171
6881 171 -75 109 -113 -175 169 -69 -64 -94 -86 91 -179 -24 68 200 48 -3 -12 145 -81 -47 -29 379 -130 2
6905 2 -154 158 153 -135 148 -62 262 -17 -21 -120 -52 -353 4 57 252 -141 -263 -293 183 31 -210 201 -273
6928 -273 76 -78 -107 94 -105 88 101 -172 18 -79 193 102 -35 49 -62 -138 -183 333 -132 225 -109 55
6950 55 22 3 -28 -77 78 -124 313 -6 113 28 35 136 -61 212 -46 -231 -144 -181 298 -210 78 290 -21
6973 -21 -269 -119 -74 -229 117 -90 -13 93 87 324 -37 -27 -119 26 137 -63 -6 -176 147 -200 -153 -118 170
6996 170 34 -371 67 203 -198 -54 79 -278 -16 -71 -12 51 82 -239 -6 142 -253 151 78 142 -263 160
7018 160 160 39 -148 60 -127 -31 -87 24 -144 75 -159 97 -219 -168 -44 189 307 53 53 66 218 -169 167
7041 167 237 -60 -101 252 -310 286 107 118 -154 37 -146 -52 -304 -114 191 -44 -76 84 33 19 -36 -43 -187
7064 -187 -32 11 -49 1 42 -171 246 -255 142 287 38 -164 128 -36 -14 -14 -85 316 206 -109 154 -77 -16
7087 -16 48 94 225 104 142 49 159 232 247 -33 217 -54 75 -95 -92 0 -130 66 -41 89 190 -72 358
7110 358 31 -171 46 -112 5 84 14 -5 -180 -55 -16 -13 78 137 -223 116 -154 -25 173 -59 88 290 122
7133 122 314 -2 -22 -138 195 -233 -27 -46 -119 145 185 110 -15 -120 -80 110 88 -106 -210 82 79 -116 55
7156 55 -97 128 196 -125 -186 -305 -53 112 -59 199 -99 -316 204 -89 -56 -122 -109 28 -16 -115 -184 102 59
7179 59 92 -319 -79 4 88 -61 61 -30 -105 -135 34 51 41 218 -99 171 -104 -12 -165 -130 -230 71 123 81
7203 81 85 -151 42 165 -144 -127 33 2 177 -32 -26 -62 -4 -32 -18 -171 28 157 207 -152 -106 296 -337 74
7227 74 -12 -27 60 140 46 -221 -30 40 26 251 130 -290 105 -259 -181 -29 -83 56 -65 -6 32 -98 -344 0
7251 0 -135 101 -172 -87 5 -128 296 66 -84 -114 -298 -70 -131 -151 -180 101 -35 -44 -124 -144 -273 -390 -21 -245
7275 -245 -163 -141 -175 154 9 -29 -90 -374 -5 -287 -97 -161 267 25 -53 96 67 97 262 382 247 33 4
7298 4 -37 -51 122 97 281 34 232 181 254 -71 -76 72 -59 -16 -21 -187 163 105 146 -143 -45 -73 -166 -120 -26 -27 -277
7325 -277 -117 -15 -32 -60 -189 4 -100 -155 37 7 -51 -420 -17 78 -21 78 157 -115 -60 154 144 -25 -165 -99
7349 -99 -256 -23 49 -40 -27 -224 -128 -424 1 -115 -2 -165 85 -172 -15 408 -44 165 -109 -15 204 48
7371 48 88 14 50 118 -17 -74 -26 -104 183 6 -82 -98 -51 68 118 -109 -24 75 102 67 -140 -76 -45 -208 101 -92
7397 -92 -84 39 132 -105 -10 166 -132 -83 -78 63 79 152 -44 -166 -15 38 69 -168 52 45 -111 -11 137 60 139
7422 139 32 13 127 51 -14 -68 -246 -140 67 -86 59 -124 -190 -169 -199 83 454 -129 -107 116 151 295 -62
7445 -62 145 -153 -80 -298 364 136 -196 -456 -183 -185 -10 242 -41 95 -100 -484 56 -121 34 -17 33 -53
7467 -53 -182 -67 -75 84 112 -46 19 -262 83 137 17 70 13 -18 43 78 187 195 147 97 156 2 -324 99 -167
7492 -167 -213 112 71 96 -38 -139 -72 -116 159 48 164 23 -135 180 264 -78 -229 -163 -49 55 -146 -2
7514 -2 -424 -43 24 -93 -68 -170 54 -35 335 48 -86 -26 26 -60 -118 -15 -107 -46 213 -167 -118 -141 8 140
7538 140 -169 -39 -223 -187 -286 39 28 249 -20 -218 26 -159 61 -44 -164 -6 155 27 111 193 79 191
7560 191 221 -127 -219 82 90 -146 -119 72 55 171 126 117 -65 84 -49 -242 -136 -225 67 -81 135 65 84 27
7584 27 90 228 129 -86 -16 -72 -177 -15 -34 94 -62 -533 54 76 -95 -230 19 126 -117 45 -142 48
7606 48 -47 47 190 -185 -253 148 -61 221 110 121 -386 479 49 -13 -118 3 150 -35 -35 -46 185 263 85
7629 85 -39 110 -66 -74 92 -160 109 -2 -209 -229 40 117 -49 -162 30 -114 -58 -188 -203 182 -140 -293
7651 -293 -135 -177 -74 -111 -131 -66 134 257 62 -384 -77 132 315 197 -83 -123 140 -161 190 56 -29 -26 -216
7674 -216 229 105 -54 -98 61 -211 -64 21 87 -148 -38 111 177 119 3 -260 29 45 -67 42 -51 -39 -241
7697 -241 -190 45 -41 -62 44 173 43 328 -66 -87 -107 -246 13 144 236 49 41 129 -125 100 -50 -198 105
7720 105 -48 -108 166 120 -188 186 -158 21 101 -168 -106 -125 -64 35 5 -162 229 91 -132 -59 158 243 165 180
7744 180 -2 18 -87 119 6 85 -51 -90 -33 -102 -16 -224 78 49 -36 96 -127 -89 -91 10 193 56 -26 -224
7768 -224 -40 -70 28 -84 -81 -6 27 161 -106 -244 89 105 82 -29 28 164 88 -239 -85 79 -92 -31 294 71
7792 71 -207 -27 112 56 23 -139 -245 206 -168 -156 43 -150 -42 -6 27 82 148 10 -313 160 7 71 52
7815 52 -25 -105 -117 -24 106 -98 -83 164 -326 -30 -76 59 17 -164 130 -623 -99 -74 84 -136 -136 43 -52 148
7839 148 -81 158 -51 -210 129 135 100 24 -192 64 -187 134 -33 -74 -68 96 -311 -20 20 -70 321 189 83
7862 83 49 247 151 -56 86 66 108 -11 76 10 77 13 6 78 -82 91 25 197 82 392 192 225 41 49 139 111
7888 111 90 183 219 -33 59 -204 -96 -20 -8 41 105 176 89 24 215 -36 -43 45 -8 -85 -155 197 157 177 70 218
7914 218 97 -8 -201 92 64 -198 142 9 -64 -28 2 186 149 -191 -5 237 -154 27 148 323 -127 240
7936 240 -154 -376 -113 -142 192 45 110 23 293 41 26 51 217 -100 40 41 152 146 53 -111 154 54 188
7959 188 118 22 180 -84 -223 166 137 148 161 186 -74 -43 201 -228 -205 -39 -75 67 -137 -2 -178 146 64
7982 64 -2 -190 -292 -102 49 -79 -118 -210 76 -242 209 231 175 -80 -107 231 157 263 129 141 -43 -137 131
8005 131 132 -105 -83 -65 -165 -28 135 245 -308 -127 -251 -140 -232 8 127 -65 237 69 152 62 -30 41 152
8028 152 -104 48 -275 -102 -57 209 -175 -178 166 -26 -100 71 -149 -33 200 74 63 198 -180 217 156 -61
8050 -61 -319 -134 42 135 -32 102 196 -80 -108 63 -81 -311 -47 46 288 10 107 -85 -48 -104 -161 -12 -168
8073 -168 178 4 -43 123 -75 -27 -242 -39 -58 -11 326 108 -6 134 67 95 66 51 125 278 -213 4 -188
8096 -188 -228 70 149 87 159 -77 -145 75 65 59 -152 -109 -202 6 -11 115 -185 122 -17 241 -143 34 -42 12
8120 12 -71 -117 -110 101 27 45 51 -188 -100 -99 -126 228 312 163 242 -86 119 0 83 121 -72 252 36 0 -64 -314
8146 -314 -128 -139 91 -17 -168 -60 36 -53 -15 38 12 -55 108 -212 134 -158 12 39 186 -151 -159 -50 -62 32
8170 32 12 146 90 -28 53 -29 -158 300 48 -340 -28 -206 98 -161 -79 249 -183 22 170 99 -24
8191b4
##END NTUPLES=NMR FID
##END=
