##TITLE=1H_DE-91_oil
 200.13MHz,CDCl3 ,
 8 sc
 
 16.4.2025
##JCAMPDX= 6.0         $$ Bruker NMR JCAMP-DX V2.0
##DATA TYPE= NMR FID
##DATA CLASS= NTUPLES
##ORIGIN= UXNMR, Bruker Analytische Messtechnik GmbH
##OWNER= pz
$$ XWIN-NMR		Version 3.5
$$ Wed Apr 16 14:00:38 2025 Russian Standard Time (UT+4h)  she@DPX200
##.OBSERVE FREQUENCY= 200.1313
##.OBSERVE NUCLEUS= ^1H
##.DELAY= (6, 6)
##.ACQUISITION MODE= SIMULTANEOUS
##.ACQUISITION SCHEME= undefined
##.AVERAGES= 8
##.DIGITISER RES= 18
##SPECTROMETER/DATA SYSTEM= spect
##.PULSE SEQUENCE= zg30
##.SOLVENT NAME= CDCl3
##.SHIFT REFERENCE= (INTERNAL, CDCl3, 0, 14.3821)
##AUDIT TRAIL= $$ (NUMBER, WHEN, WHO, WHERE, WHAT)
$$ ##TITLE= Audit trail, XWIN-NMR		Version 3.5
$$ ##JCAMPDX= 5.01
$$ ##ORIGIN= Bruker BioSpin GmbH
$$ ##OWNER= she
$$ F:/spectra/data/she/nmr/H-C/1/audita.txt
$$ ##AUDIT TRAIL=  $$ (NUMBER, WHEN, WHO, WHERE, WHAT)
(   1,<2025-04-16 13:59:13.15 +0400>,<she>,<DPX200>,
      <created by zg, POWCHK disabled, PULCHK disabled
       configuration hash MD5:
       00 E9 B6 7A A2 85 ED C7 34 08 36 98 17 FE 4E 26
       data hash MD5: 16K
       21 C3 95 F3 3A BF 3A 8F 36 29 81 6C B8 94 17 17>)
$$ ##END=
$$ 
$$ hash MD5
$$ 6F 9B 27 63 F2 0B D8 77 57 77 A0 C3 2B CE 50 AF
##$RELAX= 
##$RELAX= 
##$RELAX= 
##$RELAX= 
##$RELAX= 
##$RELAX= 
$$ Bruker specific parameters
$$ --------------------------
##$DU= <F:/spectra>
##$EXPNO= 1
##$NAME= <H-C>
##$PROCNO= 1
##$TYPE= <nmr>
##$USER= <she>
##$AMP= (0..31)
100 100 100 100 100 100 100 100 100 100 100 100 100 100 100 100 100 100 
100 100 100 100 100 100 100 100 100 100 100 100 100 100 
##$AQSEQ= 0
##$AQ_mod= 1
##$AUNM= <au_zg>
##$AUTOPOS= <>
##$BF1= 200.13
##$BF2= 200.13
##$BF3= 200.13
##$BF4= 200.13
##$BF5= 200.13
##$BF6= 200.13
##$BF7= 200.13
##$BF8= 200.13
##$BYTORDA= 1
##$CFDGTYP= 0
##$CFRGTYP= 5
##$CHEMSTR= <none>
##$CNST= (0..31)
1 1 145 1 1 1 1 1 1 1 1 1 1 1 1 1 1 1 1 1 1 1 1 1 1 1 1 1 1 1 1 1 
##$CPDPRG= <>
##$CPDPRG1= <>
##$CPDPRG2= <>
##$CPDPRG3= <>
##$CPDPRG4= <mlev>
##$CPDPRG5= <mlev>
##$CPDPRG6= <mlev>
##$CPDPRG7= <mlev>
##$CPDPRG8= <mlev>
##$CPDPRGB= <>
##$CPDPRGT= <>
##$D= (0..31)
0 0.7 0 0 0 0 0 0 0 0 0 0.03 0 0 0 0 0 0 0 0 0 0 0 0 0 0 0 0 0 0 0 0 
##$DATE= 1744797552
##$DBL= (0..7)
120 120 120 120 120 120 120 120 
##$DBP= (0..7)
150 150 150 150 150 150 150 150 
##$DBP07= 0
##$DBPNAM0= <>
##$DBPNAM1= <>
##$DBPNAM2= <>
##$DBPNAM3= <>
##$DBPNAM4= <>
##$DBPNAM5= <>
##$DBPNAM6= <>
##$DBPNAM7= <>
##$DBPOAL= (0..7)
0.5 0.5 0.5 0.5 0.5 0.5 0.5 0.5 
##$DBPOFFS= (0..7)
0 0 0 0 0 0 0 0 
##$DE= 6
##$DECBNUC= <off>
##$DECIM= 32
##$DECNUC= <off>
##$DECSTAT= 4
##$DIGMOD= 1
##$DIGTYP= 9
##$DL= (0..7)
0 120 120 120 120 120 120 120 
##$DP= (0..7)
150 150 150 150 150 150 150 150 
##$DP07= 0
##$DPNAME0= <>
##$DPNAME1= <>
##$DPNAME2= <>
##$DPNAME3= <>
##$DPNAME4= <>
##$DPNAME5= <>
##$DPNAME6= <>
##$DPNAME7= <>
##$DPOAL= (0..7)
0.5 0.5 0.5 0.5 0.5 0.5 0.5 0.5 
##$DPOFFS= (0..7)
0 0 0 0 0 0 0 0 
##$DQDMODE= 0
##$DR= 18
##$DS= 0
##$DSLIST= <SSSSSSSSSSSSSSS>
$$ [...]
##$SUBNAM0= <"">
##$SUBNAM1= <"">
##$SUBNAM2= <"">
##$SUBNAM3= <"">
##$SUBNAM4= <"">
##$SUBNAM5= <"">
##$SUBNAM6= <"">
##$SUBNAM7= <"">
##$SUBNAM8= <"">
##$SUBNAM9= <"">
##$SW= 18.0517328524113
##$SWIBOX= (0..15)
0 0 2 0 0 0 0 0 0 0 0 0 0 0 0 0 
##$SW_h= 3612.71676300578
##$TD= 16384
##$TD0= 1
##$TE= 0
##$TE2= 300
##$TE3= 300
##$TEG= 300
##$TL= (0..7)
0 120 120 120 120 120 120 120 
##$TP= (0..7)
150 150 150 150 150 150 150 150 
##$TP07= 0
##$TPNAME0= <>
##$TPNAME1= <>
##$TPNAME2= <>
##$TPNAME3= <>
##$TPNAME4= <>
##$TPNAME5= <>
##$TPNAME6= <>
##$TPNAME7= <>
##$TPOAL= (0..7)
0.5 0.5 0.5 0.5 0.5 0.5 0.5 0.5 
##$TPOFFS= (0..7)
0 0 0 0 0 0 0 0 
##$TUNHIN= 0
##$TUNHOUT= 0
##$TUNXOUT= 0
##$USERA1= <user>
##$USERA2= <user>
##$USERA3= <user>
##$USERA4= <user>
##$USERA5= <user>
##$V9= 5
##$VALIST= <valist>
##$VCLIST= <CCCCCCCCCCCCCCC>
##$VD= 0
##$VDLIST= <DDDDDDDDDDDDDDD>
##$VPLIST= <PPPPPPPPPPPPPPP>
##$VTLIST= <TTTTTTTTTTTTTTT>
##$WBST= 1024
##$WBSW= 4
##$XGAIN= (0..3)
0 0 0 0 
##$XL= 0
##$YL= 0
##$YMAX_a= 111792
##$YMIN_a= -157631
##$ZGOPTNS= <>
##$ZL1= 120
##$ZL2= 120
##$ZL3= 120
##$ZL4= 120
##$ABSF1= 10
##$ABSF2= 0
##$ABSG= 5
##$ABSL= 3
##$ALPHA= 0
##$AQORDER= 0
##$ASSFAC= 0
##$ASSFACI= 0
##$ASSFACX= 0
##$ASSWID= 0
##$AUNMP= <proc_1d>
##$AZFE= 0.1
##$AZFW= 0.1
##$BCFW= 1
##$BC_mod= 2
##$BYTORDP= 1
##$COROFFS= 0
##$CY= -3
##$DATMOD= 1
##$DC= 2
##$DFILT= <>
##$DTYPP= 0
##$F1P= 0
##$F2P= 0
##$FCOR= 0.5
##$FTSIZE= 0
##$FT_mod= 4
##$GAMMA= 1
##$GB= 0.15
##$INTBC= 1
##$INTSCL= 1
##$ISEN= 128
##$LB= 0.25
##$LEV0= 0
##$LPBIN= 0
##$MAXI= 10000
##$MC2= 0
##$MEAN= 0
##$ME_mod= 0
##$MI= 1.114404
##$NCOEF= 0
##$NC_proc= 0
##$NLEV= 6
##$NOISF1= 3.799351
##$NOISF2= 2.8
##$NSP= 1
##$NTH_PI= 0
##$NZP= 0
##$OFFSET= 14.38212
##$PC= 1
##$PHC0= -833.5476
##$PHC1= 16.59221
##$PH_mod= 1
##$PKNL= yes
##$PPARMOD= 0
##$PSCAL= 0
##$PSIGN= 0
##$REVERSE= no
##$SF= 200.129724274929
##$SI= 16384
##$SIGF1= 3
##$SIGF2= 2
##$SINO= 400
##$SIOLD= 16384
##$SREGLST= <1H.CDCl3>
##$SSB= 0
##$STSI= 0
##$STSR= 0
##$SW_p= 3205.1282051282
##$SYMM= 0
##$S_DEV= 0
##$TDeff= 0
##$TDoff= 0
##$TI= <>
##$TILT= no
##$TM1= 0
##$TM2= 0
##$TOPLEV= 0
##$USERP1= <user>
##$USERP2= <user>
##$USERP3= <user>
##$USERP4= <user>
##$USERP5= <user>
##$WDW= 1
##$XDIM= 8192
##$YMAX_p= 0
##$YMIN_p= 0
$$ End of Bruker specific parameters
$$ ---------------------------------
##NTUPLES= NMR FID
##VAR_NAME=  TIME,          FID/REAL,        FID/IMAG
##SYMBOL=    X,             R,               I
##VAR_TYPE=  INDEPENDENT,   DEPENDENT,       DEPENDENT
##VAR_FORM=  AFFN,          ASDF,            ASDF
##VAR_DIM=   8192,          8192,            8192
##UNITS=     SECONDS,       ARBITRARY UNITS, ARBITRARY UNITS
##FACTOR=    0.0002768,     1,               1
##FIRST=     0,             0,               0
##LAST=      2.2672688,     0,               0
##MIN=       0,             -157631,         0
##MAX=       2.2672688,     111792,          0
$$ Real data points
##PAGE= N=1
##DATA TABLE= (X++(R..R)), XYDATA
0@%%%%%%%%%%%%%%%%%pJ5j6J6j6J6j6K4l2L2l7M5n0N8o6P4q5R4j05J18j31J46
39G7j62J81k03K25k48K73l01L32l67M06m47M91n41N97o58P28q11R02j006J132
59F00j280J461j688J978k365K909l726N079p683J4351o1628j05639K08489O0934
73A11792j20659M3240O8576p5918o544N8226m1731l7216M4574m5060q8231L5550
85e3401K1829o5024L7334O7323m2162k72O3442r996j2236L4913k969j9532R941
98B9190r792j5990K3617L119n6875j3693M3661p520k5329K0713m638j5710K3198
111f049j922j3434L3608J0193k6800J5170K7729j7800j1257K4009q227m3795j663
124b0238J5256j9532j498J6945j4021k583K2817L173M586J8512j716j5237M24
$$ plain form
0 0 0 0 0 0 0 0 0 0 0 0 0 0 0 0 0 0 0 -7 8 -8 8 -8 8 -8 16 -16 16 -21 24 -26 32 -34 40 -45 49 -56 62 -69 77
39 77 -85 96 -107 118 -130 143 -158 174 -193 213 -234 257 -284 313 -345 383 -428 474 -532 600
59 600 -680 781 -907 1071 -1294 1615 -2111 2968 -4715 9636 -51992 -157631 50858 111792
73 111792 -8867 34373 102949 27031 20487 78713 36982 -234 44340 -720 -88951 -53401
85 -53401 -31572 -96596 -59262 8061 -34101 -34373 29069 19073 6837 41750 38781 19249 29190
98 29190 19398 3408 27025 30144 -26731 -40424 3237 -4283 -29612 -8899 -13537 -29247 -6049
111 -6049 -7971 -21405 12203 22396 -4404 10766 38495 20695 9438 33447 25220 -18575 -20238
124 -20238 -4982 -24514 -26012 -9067 -23088 -25671 -2854 319 4905 23417 21701 6464 6888
137F888J0260j878j1424K67L81j0244J63L792m553J270o55m674j577k318N706
152h596J0936k082q40N197k489M387J0550k797o472j866m492m874j377M171k221
167b865r675K199M965k475Q368P347o519J801L434n534J4L246j279l462l433k8
183c896R61K03N072J06o261J293J409k33L458j049m25K089l774K199O553l820
199C885l394K290m068l883J389J799j759k820K380J818k630N958O093m572P70
214C256K698m438Q13M009k709l945j370m37o95n73K538j89l729K147N66k135M698
231E05K456m515J365L102r43N77J085J685j376m567N53M0j979L89m86l393O71
248d831J867J327J884K11J624M98k364K083K367k474m12o37k020M56K57K18j97
$$ plain form
137 6888 17148 15270 3846 4113 4494 -5750 -5587 -1795 -6348 -5078 -5733 -10407 -11984 -14302 -8596
152 -8596 2340 258 -582 4615 2126 6513 17063 14266 7794 5928 1436 -3438 -4815 -644 -2865
167 -2865 -12540 -10341 -5376 -7851 517 7864 1345 3146 6580 1046 1060 4306 3027 -435 -3868 -3896
183 -3896 -2935 -2732 2340 2446 -3815 -2522 -1113 -1346 2112 1063 638 2727 -1047 1152 7705 3885
199 3885 491 2781 -1287 -5170 -3781 -1982 -3741 -6561 -4181 -2363 -4993 965 7058 2486 3256
214 3256 5954 1516 2329 6338 3629 -316 -1686 -2123 -2818 -3391 -853 -1042 -4771 -2624 -2058 -4193 505
231 505 2961 -1554 -189 2913 1970 2547 3632 5317 3941 -626 -73 -33 -2012 -1623 -2109 -5502 -4831
248 -4831 -2964 -1637 247 458 2082 2580 216 2299 4666 2192 1780 1143 -877 -421 -164 54 -143
265a43j578J88j41j991K283J547j926N90O08L0K374J312m87J08m33l66n46j272
283A57R04r38l031M8M45m07J360K83l36J167J43O36N15O3J712j301k098J689J049
302B060j142K73k64q51o59l83J77n9n83R0q50q35K682O77o72J172M18l2N26j30
322A615M86n83p76j92r51o86J340l83j233P7N00m95Q46r5O58m03k77O37K48K14
342E47J190k31j195M21J27m50L26n72p35J1j131N40J53K4P28k91k67J440K45n56
362C24O57j4o89p5O2O92o40l38M9l92n85J276l14n46J02j62j28p2P06P91m06m39
384a41R02j92q6O24m53m44j71l01J03p0m10K54k93k59N08J32N06K25l91l03O04
405C44j67J98J01Jj55m44j22N03k11j96P9m25m98R24l4J54kJ7Q3l66L46P27o09
$$ plain form
265 -143 -1721 -1533 -1674 -3665 -1382 165 -1761 -1171 -563 -533 1841 3153 2666 2774 2341 1975 1429 157
283 157 1061 123 -2908 -2860 -2415 -2822 -1462 -1179 -1515 -348 -205 431 946 1009 2721 1420 -678 1011 2060
302 2060 918 1191 927 76 -583 -966 -789 -848 -1431 -1341 -2191 -3026 -344 333 -339 833 1251 1219 1745 1615
322 1615 2101 1518 742 550 -401 -1087 253 -130 -1363 -1286 -786 -1281 -435 -530 128 -275 -552 85 333 547
342 547 1737 1506 311 732 859 409 735 163 -572 -561 -1692 -1152 -999 -975 -247 -538 -805 635 880 324
362 324 981 967 278 203 265 957 317 -21 28 -364 -949 327 13 -533 -431 -593 -721 -793 -87 704 298 -141
384 -141 761 569 483 1107 654 210 39 -262 -159 -229 -639 -385 -678 -937 -429 -297 209 434 43 -260 344
405 344 177 375 476 477 322 -122 -244 259 48 -148 -69 -494 -992 -68 -102 52 50 67 150 -216 130 857 248
428B48k23N27n06l22N34j97n24J44Q2j40L2L55L66n02P4K34n09M64K70l01p1O6
450A01l76N33j33j06L07m42k44J30Q7J52J89l98Q1L69n0n0j86R3K11m80k56L85
472h3q4j80L31l01J03L64j23k6m8K16k5l25M38K48n37M2J19m29R3J53j85q3Q9
495b33R8O6k95L12L48l23K6J78j60L19K11l31L1Q8l98j61J96j48M62p52J97K12
517e7n0r9L88j46L07j31O8K41l60L06l08M3k04n6R5n4n1M6l30K03N2J40l39K86
541a0J65j19K82M9r3Q4M3l46n9j40L92jl53m42M4J40K75J08r1j08J44j64N51l
565C48k48p0q9PJ47K9k40R1N1k37K40k69J21J5j67J10K39J31J6j87J72j17k01
588a08lL81j79K10J20p61K9J53O6j86K70j51k0O2M50J03m97L8K22j94lJ70P0k41
$$ plain form
428 248 25 552 46 -276 258 61 -463 -319 -237 -377 -345 10 376 -126 -52 182 -327 137 407 106 35 101
450 101 -275 258 125 19 326 -116 -360 -230 -143 9 198 -200 -119 250 200 150 -36 57 268 -212 -468 -83
472 -83 -167 -347 -16 -317 -214 150 27 1 -47 169 144 -181 257 505 -32 10 129 -300 -207 -54 -239 -322 -233
495 -233 -135 -69 -364 -52 296 -27 -1 177 17 336 547 216 247 335 -63 -224 -28 -176 286 -466 -269 -57
517 -57 -107 -206 182 36 343 212 280 521 161 467 159 202 -2 -58 37 -17 -68 -22 -352 -149 -97 43 -296 -10
541 -10 155 36 318 367 274 358 401 55 -4 -144 248 247 -106 -548 -504 -364 -89 19 -72 -180 -36 -200 351 348
565 348 100 30 -59 -52 95 124 -116 -25 26 -211 29 -240 -119 -104 -271 -161 78 209 225 38 210 93 -108
588 -108 -111 270 91 301 421 -340 -311 -158 -92 -278 -8 -159 -179 -117 333 436 -61 -23 199 5 2 172 242 1
612Aj41K74L5l49K24p1j72L06Pl31P7o5J34l54P7K91N7o8J8jJ40r6k19J89j10
637a47L31j25k86J17K3J23n4R0J79l03J30n4m8p4K31L3k32N4K15K1m16K68j02
660b6l6n3J40j19J00j75K26q2R4L3l75K19P7l3J47k07P3j97J81l78J25K25L5k2
684b8J35j53J22M2l12J52J34q9k49M5M26m34L6Q3J0K33j25j19K63K8j95j29K29
707A05k41K74m9k71K93j14o7m11L42L42k47L3P3k1k39M59k7j16O6M8m58L16j2
730G8j14J99j65N9J15m09K37R3j73L57k42J87k83j07L1J70J03j8j39oj02j4P8
753f5o1K63j94l00K45P1J78k7j8J15j08rl5j08l0J75J39k91J54p0m5K26j4n44
777c53N84k12q9J14p2O8l32L22j73J29NJ00k11R3J10q6j22R4J87j68o4o8O7J1
$$ plain form
612 1 -140 134 169 -180 44 -27 -199 107 114 -217 -140 -205 -71 -425 -348 -57 0 -68 -50 -51 89 -7 -226 -37 -147
637 -147 184 59 -227 -110 -87 36 -18 72 251 -52 78 24 -24 -98 133 166 -66 -12 203 224 -192 76 -26
660 -26 -62 -115 25 -94 6 -169 57 -25 69 102 -273 -54 23 -10 137 -70 3 -194 -13 -391 -266 -41 -6 -28
684 -28 107 -46 76 118 -194 -42 92 3 -246 -201 225 -209 -173 -90 -80 153 28 -91 172 200 5 -124 105
707 105 -136 138 89 -182 111 -3 -70 -481 -139 203 -44 -11 62 41 -198 261 234 118 184 232 -226 90 78
730 78 -36 163 -2 57 172 -237 0 93 -80 277 35 222 -61 -168 -137 33 136 118 -21 -27 -129 -143 -65
753 -65 -126 137 -57 -357 -112 -41 137 110 92 207 99 90 55 -53 -83 92 231 -60 94 24 -21 205 191 -353
777 -353 231 19 -70 44 -28 40 -292 30 -143 -14 -9 91 -120 -27 83 -3 -125 -31 156 -12 -76 -144 -77 -66
801f6J38K87l42j78K06j47q3J84J79k47j83J23L53k85N0P9k44L14M1m49J19J68
823A7R7k83P9J17l8k84K12L11J31j39k97J89k29L55k70J5P1j48L72k18j7Lj05
846e9M7P1L34k21k48k85L84j11K38k90L59j53J79j56q5k45N16m38M8J52j52K85
868A70m21K27J76K43n26N5J25J22k00j72J56L00k48L25k89J78l25K44k71O2J69
889A00O5p4N4j44j67L53n5k25K07kN4k30Q7J11j81K16j91j6O8o2O4K8K70l80R4
914D4J28n4j35p9P5J43O1j98J82j05o7L8j19R3K3J40k42J46O2k45K43K1k3k49
938a17J14j18K16j59J85j12j9K86j48k57L36j51j1l17K13J67j32J81LJ16l37m3
960a04L3Q5J0jQ3r5J50j06K4n6J19p2r4K14k50K67k15J19k85M02m84M15k35o9
$$ plain form
801 -66 72 359 17 -161 45 -102 -185 -1 178 -69 -252 -129 224 -61 -11 68 -176 138 179 -270 -151 17
823 17 114 -169 -90 27 -11 -295 -83 228 359 220 -77 112 -117 238 -32 -17 54 -94 278 60 43 46 -59
846 -59 -12 59 393 172 -76 -361 23 -88 150 -140 219 66 245 89 4 -241 275 -163 -115 37 -115 170
868 170 -251 -24 152 395 -131 -76 49 171 -29 -201 -45 255 7 332 43 221 -104 140 -131 -69 100
889 100 165 91 145 1 -166 187 132 -93 114 112 166 -64 23 134 -47 169 -22 -38 30 -32 32 60 330 -50 44
914 44 172 118 -17 -96 -21 122 183 -15 167 62 -5 33 -86 7 30 170 -72 74 136 -109 134 155 132 -117
938 -117 -3 -121 95 -64 121 9 -10 276 128 -129 207 56 45 -272 -59 108 -24 157 160 276 -61 -104
960 -104 -71 14 24 23 106 11 161 55 79 23 142 70 -24 190 -60 207 -8 111 -174 228 -256 159 -76 -145
984a45K83k07J29P7Q1k81K16j84J53N9j37j56m3JN5J50N4j50p8r7K26q8Q4P2o2
1009A2k68J99J91n9p2j48K64k28K32k63L1L5O9J11k29L98m6k26n5kM6J15k86J55
1033b4o9L59o9k27J74p5R7J23l02J65k2m15L2J51L45k7m03o3N77k01j18%M9k36
1057a79J85j39J57j11q1J27L83l26O8k0P5k85L52k6k26m1R9p4q8l1P6J6N0K10
1081A71k68L43l68j26J27J06N9K57k72J4j74M2qJ82j08n8J82j59M2j28M1j67L31
1104F1Pj69K43M5l14K77j0l52K16j37K55j68O4j16K96m82O8L89j39pm5k14L11
1127G9q7k7n8J93j49nr9O8R5J43j34j79J05J42o6p6k7j7j88J43l8J88m8J82k78
1152a38J11k29M84l15k9O8K2J27j66O3J9j3j47K14j37M2k43L92m49M55j58k79
$$ plain form
984 -145 138 -69 60 137 218 -63 153 -31 122 181 44 -112 -155 -154 -99 51 105 -45 -123 -220 6 -82 2 74 12
1009 12 -256 -57 134 75 3 -145 119 -109 123 -140 -109 -74 -5 106 -123 275 229 3 -52 -54 -8 107 -179 -24
1033 -24 -93 266 197 -30 144 69 166 289 -13 152 130 -285 -253 -102 243 216 -187 -250 327 126 8 8 57 -179
1057 -179 6 -133 24 -87 -168 -41 342 16 84 64 139 -146 206 180 -46 -87 12 -62 -150 -181 -105 -89 -39 171
1081 171 -97 246 -122 -248 -121 -15 44 301 29 43 -131 -89 -97 85 -23 -81 101 -58 -16 -144 -103 -270 61
1104 61 68 -101 142 187 -127 150 140 -212 4 -133 122 -46 18 -98 198 -284 -216 173 34 27 -18 -232 79
1127 79 -8 -35 -93 100 -49 -54 -153 -85 10 153 19 -160 -55 87 21 -55 -82 -99 -287 -144 -182 6 -42 140 -138
1152 -138 -27 -256 228 -87 -116 -48 -26 101 -65 -2 17 4 -143 71 -66 -24 -267 125 -324 131 -27 -306
1174c06K61M6qj28J42K64j73j43K51k20k63K88q7j03Q1J08Q5P8k77N0K83k42k9
1197d2j67M09q0k13k3J11K07l39L12j54K2p7J20J1k13K38j36p0m9L3P3K66O4l59
1221e6p0K25k50K51k78J71K78k14J72k13J72Pj02Q0k42k66K77J94k2k40J1L9o6
1244a42J21K49j58j44L8r0Q7J86P0k53j79R5j07J05K31j66J32k26J97q3J72j64
1266b9k7j67J83J02j17K66l70L29k65j12R5J59K77l30N7k85K10j35J76J12j00
1287B9j58J60j50j33m8J17J40K18j77j9O7N6p8r3n1L11j90q1J75m0j8j00k36M65
1311A66j89p6j77L33J33p0j74mM76o10J03l1K5Q7J49J33k80j27R5M41o22L53j40
1334fK22j58j15J56l25K27j19Rn6L65k57Q0K04o3j97M9J74j26l19K27N4k67K83
$$ plain form
1174 -306 -45 1 -7 -135 7 271 98 -45 206 -14 -277 11 -76 -179 -98 10 95 173 -104 -54 229 -13 -42
1197 -42 -209 200 120 -93 -116 -5 202 -137 175 21 43 -34 86 97 -116 122 -14 -84 -133 -100 -27 239 303 -56
1221 -56 -126 99 -151 100 -178 -7 271 57 229 16 188 195 93 173 -69 -335 -58 136 114 -126 -115 -76 -142
1244 -142 -21 228 70 -74 -36 -126 -39 147 217 -36 -215 -120 -227 -122 109 -57 75 -151 46 -37 135 -29
1266 -29 -56 -223 -40 62 -55 211 -159 170 -95 -207 -112 47 324 -6 51 -234 -24 -159 17 129 29
1287 29 -129 31 -119 -252 -300 -183 -43 175 -2 -21 46 102 24 -69 -120 191 1 -80 95 55 37 -63 -299 166
1311 166 -23 -99 -276 57 190 120 -54 -58 418 -192 -89 -120 -95 -8 141 274 -6 -133 -38 403 -219 134 -6
1334 -6 216 58 -57 99 -226 1 -118 -109 -165 200 -57 23 227 164 -33 16 190 64 -255 -28 26 -241 42
1357D2J38r6j76M03k29k03o5R5R5J3k48L49J38k9j69M7qj20J28M0k19q4N6K7P2
1382ck12r5J84Q2L90m30M18j64l20K27K40r7k32K63n58K01P1K05j07k03O82o57
1404a15j40K87k70K69o5j50J54L19n38L64r7K09m4m34K83j92L35j37r2P4K4k81
1426b37J80J65Pk55J80J87j43k22L36k40L4Q6j94L03j06mk06r4J04q7K26J89j16
1449I3k72J52J46k90J13R0r9r9K20k51K10n3n1L56J52o25K03p2J73l64L91j34
1471a1j74K59j91J97n0P5l63M00Pj69m3J18j49J17L32l18J57ok60k2p5r1J76n0
1495a34j37K95j95L06j56l34M43j22N1J8Q2m4j66Jj28K26j24Q2K45j17j51P2m0
1518b7K75r2j33l21M85m0j89NO3P7J53k67Q1J71k05mj10J46l7J41l00J82j91o8
$$ plain form
1357 42 180 84 -92 311 82 -121 -186 -91 4 17 -231 118 256 227 58 105 97 -23 105 145 -74 -158 -102 -75 -3
1382 -3 -215 -310 -126 -44 346 -84 334 170 -150 77 317 220 -12 251 -307 -106 -35 170 63 -140 542 -115
1404 -115 -255 32 -238 31 -34 -184 -30 289 -249 115 18 227 183 -251 32 -160 175 38 -54 20 44 -237
1426 -237 -57 108 115 -140 40 227 84 -138 198 -42 -8 78 -116 187 81 77 -129 -223 -119 -206 20 209 93
1449 93 -179 -27 119 -171 -58 32 -67 -166 54 -197 13 -40 -91 265 417 -208 -5 -77 96 -268 123 -11
1471 -11 -185 74 -117 80 30 105 -258 142 149 -20 -63 55 -94 23 355 37 194 188 -72 -94 -169 -260 -84 -134
1495 -134 -271 24 -171 135 -21 -355 88 -34 17 35 117 73 -93 -92 -220 6 -118 -36 209 92 -59 13 -27
1518 -27 248 156 23 -298 187 147 -42 -37 26 103 256 -11 70 241 36 32 -78 68 31 172 -128 54 -137 -205
1542b05K81K1j20m6K72j90m8M1m9J19k07r4L27k1j59p0m1j96L10j42L07p3J87
1565B04p7NK9N2j04k65K01K19j62n8nlL7l30L52k5K04k05l35j4J54K52j38J68
1589A56O5j84L4R8k52N2j27K4L31o4j69J78O2k20K39r5k62M6pj57K95n0K1j57
1613a43K5p2J28J21M0l75L02o7O1Q9l26oJ85J09n3p2j46K49l7jL7q1L21k24j14
1638e0Q8M1J11k61j7L44j90m29J73K14J08j15L4j42J49k34r9L5Q8J49k8J5j34
1661a50m7K04k8N6K72l22J24L07l51n4j44O1J16j93K40o3J21k73Q0j65J70K10
1683A71j40j34J67p2j03K23O6k45OmN5P4M8K2j12m5k8K08j55K47k91K20j24P0
1707A24N7k07J11k63J22O5J39p3l4p3R3n7J79q0j10K4j17M6r3L46Qk89L45l02
$$ plain form
1542 -205 76 97 -23 -69 203 13 -35 6 -43 76 -131 -225 102 81 -78 -148 -189 -385 -75 -217 90 17 204
1565 204 127 132 161 213 109 -156 45 264 102 44 39 36 73 -257 95 70 274 69 -266 -280 -126 126 -12 156
1589 156 221 37 71 169 -83 -31 -158 -134 197 133 -36 142 204 -16 223 128 -134 -88 -95 -252 43 -7 14 -143
1613 -143 -118 -190 -62 59 99 -276 26 -41 20 109 -217 -223 -38 71 18 -54 -200 49 12 11 48 -33 288 64 -50
1638 -50 38 79 190 -71 -88 256 66 -363 -190 24 132 17 51 -91 58 -176 -275 -240 -152 -3 -31 -16 -150
1661 -150 -197 7 -21 35 307 -15 109 416 65 11 -133 -72 44 -149 91 28 149 -124 -44 -209 -39 171
1683 171 31 -103 64 -8 -111 112 178 -67 -61 -65 -10 64 112 134 22 -23 -51 157 2 249 -42 178 54 124
1707 124 181 -26 85 -178 -56 9 148 75 41 -32 61 4 183 103 -7 17 -100 -54 -147 199 207 -82 263 -39
1731c9j32Q2P8K59k60k08K95L5j60P9j02J05L0l0r6n7M11j29k60K33r6k04J27
1754c9L74k95k29K6K56K0jr4L3Om8j60L41j36J84l76P5J55j43P4M4N4q4O9j72
1779f6j96M56m82N3J34O9J48l23P3j01J67l0Q0J97N0l64qK10j6k36K19j21J55
1802F8qj50O8P4J11k96K99k87k0o0K04J1J05j14L9j98Q3P1j34j61K94j04O5M9
1826Ij08j49J98J83J0p7k0j36J55J20l51K72l90M13j32Q9k92K3J61J65r3J2n4
1849HL0K43k44rq2m5L0O6m6J85j72J65J91l10O7l6R0j03n1L6J0J0o2M0j50K15
1875G6N2n8jQk05J48J31k72j41J66K42j95j3O2j51J61N5k30J34j74K33j29K41
1898A40o0J04j73j0n0r3K27Mq1K2l56J75K69P6m9m71K43k5J02Oo4P8%o3q5O5N8
$$ plain form
1731 -39 -171 -89 -11 248 -12 -220 75 110 -50 29 -73 32 62 32 -64 -121 290 161 -99 134 38 -166 -39
1754 -39 335 40 -189 -163 93 113 112 18 51 57 9 -151 190 54 238 -138 -63 92 -51 23 67 121 37 106 -66
1779 -66 -262 194 -288 -235 -101 -32 116 -207 -134 -235 -68 -98 -18 179 229 -135 -143 67 51 -185 34 -87 68
1802 68 60 -90 -22 52 163 -133 166 -121 -141 -201 3 14 119 5 44 -154 -71 0 -134 -295 -1 -105 -40 9
1826 9 -99 -248 -50 133 143 66 46 -90 65 185 -166 106 -284 129 -3 86 -206 -183 -22 143 50 62 8
1849 8 38 281 37 28 -54 -99 -69 -3 -49 136 -36 129 320 10 77 41 131 28 -23 13 23 33 -29 11 -139 76
1875 76 128 70 69 77 -128 20 151 -121 -262 -96 146 -49 -62 0 -151 10 65 -165 -31 -205 28 -101 140
1898 140 80 184 11 1 -49 -142 85 89 8 30 -326 -151 118 194 145 -326 -83 -108 -6 0 -64 14 14 -49 -134 -69 -11
1925a1j94J93j7n6J06N6J81k09J06j09n5N2j57J63m20m6O39k91J45J22k86n0J35
1948cQ3l84K10LK1J89k62j67M79r7J52l50J10M6N7m9k02n7K94k95K39k0J36K13
1972C46m70k3K93P7m33K15n0M1K3j00j31J10J26k53J68J08K2q6l9o2O1l8K18q5
1996C8rK23M3l34J88k02O4m1k2RK1K91n99L53J47k43R0r2L09l24j77K85l2j62
2020a76J8L6J84p9J13p5k06K53Pj29l5k52K51q4J06J69k9r4N4q4J8L8Lj21n6j01
2046b71L24q0k3K17j66o7j77O0J29M45m52k6J39N6j21p4j82K59J39l28K32Q8j80
2069e9J6K4JJ26j6j17J62k66J83P5k33j83M16j2j76O6p4J28o1j98L35l74J02K49
2093A14j38J35l18p4O24n02j18L91k70J83j4j91L04j55j2J31K29q8k81K99n3l20
$$ plain form
1925 -11 -205 -12 -29 -85 21 77 258 49 155 46 -9 43 -114 49 -371 -417 222 -69 76 198 -88 -138 -3
1948 -3 80 -304 -94 -91 -70 119 -143 -310 169 72 224 -126 -16 30 87 38 -164 -221 73 -222 17 -3 133 346
1972 346 -124 -147 146 223 -210 5 -45 -4 19 -81 -212 -102 24 -229 -61 47 69 -17 -56 -118 -57 -95 123 38
1996 38 29 252 295 -39 149 -53 11 -30 -52 -43 -22 269 -330 23 170 -73 17 -75 234 -90 -267 18 -14 -176
2020 -176 -158 -122 62 -17 96 21 -185 68 75 -54 -89 -341 -90 -174 -68 101 72 -22 32 -52 -34 4 7 -114 -170 -271
2046 -271 53 -27 -50 167 1 -66 -243 -183 -54 391 -61 -87 52 108 -13 -87 -269 -10 129 -199 33 121 -59
2069 -59 -43 -19 -18 108 92 -25 137 -129 54 129 -104 -287 129 117 -59 7 -67 61 0 -198 137 -237 -135 114
2093 114 -24 111 -207 -281 343 -159 -277 114 -156 27 13 -178 126 -29 -41 90 319 231 -50 249 196 -124
2115a24k98M49k04J92j3k04M18k61k2j01K77k39K96k82q5L46j62nj13K13J62p9
2137A61j26j97l1L17j74k05M35j65k7n8j51L06k13J62k34K69J98l45k04L83k57
2158a56q7K53N0j6Kj18r7K47j59J3J49J39m48M22p3J33j61j37j10Q4J01r0L9J30
2182A10j71KN9J22j73M6j19m8K74j25j8M2k4J50l98N5J57K23l35j13L74o1P3L0
2206A32j76J43k06J27J8K76l11J5J68J38l24J49j71m6J23P2K6k85M57l95l00L69
2228aL18n03M4J44o6Q2l29Q5L70k41j82K98l1n5J02o4M6k09K04K9j4L09k15J3
2252A34j93j51L58l61P8L33n3j00K32n56K26m0J37l61L19K16k43j49J51R1Qj42
2274f6j05K19J11j55K35L6n73J73N1m4K34o0j12O5L04l10L1k13k54N14N5r4n2
$$ plain form
2115 -124 -422 27 -177 15 2 -202 216 -45 -67 -168 109 -130 166 -116 -201 145 -17 -22 -135 78 240 161
2137 161 35 -162 -193 124 -50 -255 180 15 -12 -70 -221 85 -128 34 -200 69 267 -78 -282 101 -156
2158 -156 -243 10 60 44 46 -72 -169 78 -81 -68 81 220 -228 194 121 254 93 -44 -154 -70 31 -59 -20 110
2182 110 -61 -59 0 122 -51 -5 -124 -172 102 -23 -41 1 -23 127 -271 -216 -59 164 -171 -284 90 29 102 132
2206 132 -44 99 -107 20 38 314 3 18 186 324 0 149 -22 -68 55 127 153 -132 325 -70 -370 -1
2228 -1 317 -186 -142 2 -64 18 -311 -226 144 -97 -279 19 -12 -67 35 -29 17 -192 12 41 27 336 121 134
2252 134 -59 -210 148 -213 -135 198 145 45 277 -279 -53 -93 44 -317 2 218 -25 -174 -23 68 76 -66
2274 -66 -171 48 159 4 239 275 -298 -125 -74 -118 116 56 -56 9 313 3 34 -179 -433 81 136 42 -10
2297a0J64k18j20K26j37J34L1j99J39j06q4M25k66P3j53N6Q3j88K37J18k32pJ72
2320A38r1k48J25J30N6j70L88m25J17k00o7J87q5N5K30m3j33j5q4o8L57qj9j31
2344dJ10j75l1r4J72Jk16O8M64l80O0k5j00J30R2J10j54M5q7k20J13j03J49oJ06
2369B5n1RN1p7Q5j80K40k23J91J28j88JOK84j65j44k6j0R5q0K76Rp2k03Q3n2J05
2396A17j45q0P1j51L76m58L24l03J47J6l5J17j78K89o1r8L4k22L23K7r0J91k97
2419h6J54j11J51k93L89j18K9k74J87o1r8M5J68l6Q8j30jJ3o7J56j03K69q0o9
2443A22o0r8j30L96l34l37M19L79l75K3O2k92J91j4k15M42l3N3j4j72m4qP1J85
2467B17p9j76J99j17l76L01O3L36o62N51n67L88k74Q5J21m4N5J42j62R7Q2r4L8
$$ plain form
2297 -10 154 -64 -184 42 -95 39 70 -129 10 -96 -180 245 -21 52 -101 -45 38 -150 87 205 -27 -34 138
2320 138 47 -201 -76 54 110 -60 328 -97 20 -180 -247 -60 -145 -90 140 97 -36 -51 -135 -203 154 146 127 -4
2344 -4 106 -69 -100 -194 -22 -21 -237 -169 295 -85 -25 -50 -150 -20 72 182 28 73 -14 -234 -121 -224 -75 -81 25
2369 25 -26 -17 34 -43 42 -138 102 -121 70 198 10 11 17 301 136 -8 -34 -44 51 -29 247 256 184 -19 64 12 117
2396 117 -28 -108 -37 -188 188 -270 54 -249 -102 -86 -121 -4 -182 107 46 -52 -18 -240 83 110 20 211 -86
2419 -86 68 -43 108 -185 204 86 115 -159 28 -33 -131 -86 82 46 134 4 3 16 -51 105 2 271 191 122
2443 122 62 -36 -166 230 -104 -441 -22 357 -18 5 67 -225 -34 -48 -263 179 146 199 185 13 -31 -39 32 217
2467 217 138 -38 161 44 -332 -31 32 368 -294 257 -310 78 -196 -111 10 -34 21 163 1 98 180 86 124
2490A24l5j86J05k7J75k14J17j63K42p4O4k19K06k65R1Q9l0P3k25J38k15K13K18
2513B02m57M07j04l54K67m06N72Q8l48J3L94m41M66n65K14k8J58P7j38k74M23
2534A66l23K07n5j06j83K83Q0m1L2m5L0J20k96J95l06L48m05K53K09m61M00m2
2556F0j96L81l99K3j18J22K09l54L28j45k97K86J13j81K24j61K06m5J9j01j39
2577a65J45j6M5K4J77l17NJ08J00k61Q0L13j31l19K83l56M05k48l2o9K86l71K04
2600a10N9J5l2q4K0J07J02p2r8j18K57J15L2P6k75J63k03m2p2M26m42M81k97J4
2624B2J36l41M49k53Q0Rp5qj05K21q6k51K06M0Q9p9j87L0Q9k81J15O5K71k00j92
2649b36K68j29K39J2j65n6KP4q4K35o1R6m16K37N5J32j66j2P7L2j52j67K10j71
$$ plain form
2490 124 89 -97 8 -19 156 -58 59 -104 138 64 128 -91 115 -150 -59 30 0 73 -152 -14 -229 -16 202
2513 202 -255 152 48 -306 -39 -445 127 215 -133 -120 274 -167 299 -266 -52 -80 78 155 17 -257 166
2534 166 -157 50 -5 -111 -294 -11 69 28 60 15 45 165 -131 64 -242 106 -299 -46 163 -298 102 60
2556 60 -136 245 -154 -131 -249 -127 82 -272 56 -89 -386 -100 13 -168 56 -105 101 56 75 -26 -165
2577 -165 -20 -36 9 33 210 -107 -102 6 106 -155 -75 238 107 -212 71 -285 120 -128 -160 -229 57 -314 -110
2600 -110 -51 -36 -68 -152 -132 -25 77 5 -93 -211 46 161 193 269 -6 157 -46 -88 -160 266 -176 305 8 22
2624 22 158 -183 266 13 93 102 27 19 -86 135 49 -202 4 44 133 54 -133 -103 -14 -295 -180 -115 156 -44 -236
2649 -236 32 -97 142 154 -11 -67 -65 9 -75 160 99 195 -221 16 71 203 37 25 102 134 -18 -185 25 -146
2673a46J03L35p4l61J74J34k82J38N2j42J00J59l28Q3N2M5N0m2m5R8j25j42K15
2696E1j09l2k03K37Q5l14L47K18m91L39L6K0k44n4K28Q5j5j2k83Q7k07j28K88
2719g1K11j89Q7J01N5n5l27M13l67K8j1J17o0O4J64m30J23L21k56J01j73K00j78
2742a32J86J73k99M4j90K92m3j70N04k68J5k15L31j90k35l5K16K69r9j97Q5N6
2764I8p9K92m15K20l26M36p3j70K70n29P6M23J70l61nk88M24j94p2O1K3j10K69
2787A40k16o9oN2M16l03o4O1j06J33j81K29j16O3J10k61L6M03j34r4J42k24K07
2810B18n3k66K46l24j81L58j77K36l7L8j49P1k90L93K69k95K8mO1k64Km5J82R7
2834A14r5j24J4K51j82k24J07J37K22k27K25l28J53Rk91L42k67J66k09K49j27
$$ plain form
2673 -146 -43 292 218 -143 31 165 -117 21 73 -69 31 190 -138 -55 -3 42 92 50 5 103 -22 -164 51
2696 51 -58 -90 -293 -56 29 -285 62 280 -211 128 164 184 -60 -114 114 199 184 172 -111 -24 -231 -359 -71
2719 -71 140 -49 38 139 194 139 -188 225 -142 -114 -125 -8 -68 -4 160 -270 -147 174 -82 19 -154 46 -132
2742 -132 54 227 -72 -28 -218 74 31 -139 365 97 112 -103 228 38 -197 -232 -16 253 154 -43 42 98
2764 98 19 311 -104 116 -210 226 153 -17 253 -276 -200 223 393 32 27 -261 163 -31 -103 -42 -19 -129 140
2787 140 -76 -145 -151 -99 317 14 -50 11 -95 38 -143 86 -30 33 143 -118 -82 321 187 93 235 11 218
2810 218 165 -101 145 -179 -360 -2 -179 57 20 58 -91 -20 -310 83 352 57 85 81 142 -122 -120 -165 17 114
2834 114 19 -105 -91 160 -22 -246 -139 -2 220 -7 218 -110 43 52 -239 103 -164 2 -207 42 -85
2855h5L37j62J09k55j79J43K0J85p6j54J69Mk80L00Qj93J11P2k01J52o8l28K03
2878a68J37J71j7l41j15K09j19J09M59l06r3J16o9j81J04K73j21j75j2J47M1O5
2900A14j04J47k90r9J50Q5k20J69n5J68O2k60R0J3Oj47K68J18k76q0J44j31K40
2923A12k82J30k6N4m6j13K54N9j83J30p2P8p2P9rJ17k05j19RLJ85n7J96l52K07
2948G7K5M9j77OP6j65L83l33J18j21J73j70k04M58m31J60J18j08k77K30J93k22
2970a42N1j1K72j64j00P2p6L18l71K42J4j29K31j88j98K77k93L20mk58J10P9L0
2993H2R1m24K32K29q7J35j29j63J85r9J0q8j72M2K96j57q7k21L99pPj97P4j21
3017a70K51q1j96K20O7q2l87J52J55k5L6Q3J63r5j99j23L64P8k23pk47J2J14N2
$$ plain form
2855 -85 252 90 199 -56 -235 -92 -72 113 37 -117 52 56 -224 76 84 -109 2 74 -127 25 -43 -371 -168
2878 -168 -31 140 123 -218 -333 -124 -243 -134 325 19 -74 42 -27 -208 -104 169 48 -127 -139 8 49 114
2900 114 10 157 -133 -232 -82 3 -217 -48 -103 65 127 -133 -43 -30 -24 -171 97 215 -61 -141 3 -128 112
2923 112 -170 -40 -66 -12 -58 -171 83 142 -41 89 17 95 23 102 93 210 5 -114 -105 -102 83 26 222 -130 77
2948 77 102 151 -26 -20 56 -109 274 -59 59 -62 111 -59 -263 195 -236 -76 42 -66 -343 -113 80 -142
2970 -142 -91 -102 170 6 -94 -22 -98 220 -151 91 105 -24 207 19 -179 98 -195 125 121 -137 -27 52 82
2993 82 173 -251 -19 210 123 258 129 -34 151 52 62 -26 -198 -156 140 -17 -104 -325 74 67 74 -123 -49 -170
3017 -170 81 0 -196 24 91 9 -378 -226 -71 -96 -60 23 186 91 -108 -231 133 211 -12 -19 -266 -254 -140 -88
3041h8R0j92K16J56k66J84k89l3L31kR4k34N4k8l9J24L2j80L7K39m25L60R1Pn1
3066A88k08N8N2k81J16L97l81K04j4j08P6R3m4k77j9J46P8P5r2N1J01R6j96l03
3090a92K98r9M1j02nm9M11l70m6k22L12k2k5k66N46m9kn8m1J1p7P4k13J5K36P
3116A13k69K53j73l4J40O0k0K4J13j15L0n9J5l78L39k26j57R8J32L02j59J76j35
3139G0j21M5O5j73L7pQ9m4N7K01r4l12J03K68j53j25k09L66J84l04l28M02r1J06
3163C2j42R9J17j89p6J2N7J42k7j68J38J31m07K12K01j94p7k19J09J32j14P8K01
3186D8q4L4J07k85L01J03j82P5j87R2J22j69L6K3L3O8k17q0J34J0J52j20LO0L5
3211A12j50j74Q0K11J22l15J05k36L77j73p5K35k77K06J37k30rJ92J5k71M8O1
$$ plain form
3041 -88 2 -190 26 182 -84 100 -189 -222 109 107 201 -33 21 -7 -46 78 110 -70 -33 206 -219 141 232 239 188
3066 188 -20 38 90 -191 -75 322 -59 145 131 23 99 192 148 -129 -148 -2 76 151 59 110 211 307 111 -192
3090 -192 106 7 48 -54 -59 -108 303 -67 -113 -335 -23 -45 -70 -336 210 161 159 101 60 71 -6 68 -145 -130 106 113
3116 113 -156 97 -76 -110 30 90 70 94 207 92 122 63 78 -300 39 -187 -344 -246 -114 188 29 205 70
3139 70 -51 -6 59 -114 -77 -84 5 -39 18 219 125 -187 -84 184 31 -94 -303 63 247 -57 -385 17 -74 32
3163 32 -110 -11 106 -83 -159 -147 -90 52 25 -143 -5 126 -281 -69 132 -62 -139 -358 -249 -117 -231 -153 48
3186 48 -36 -2 105 -180 121 224 42 117 -70 22 144 -25 11 34 67 135 -82 -162 -28 -18 134 14 17 77 112
3211 112 -38 -212 -132 79 201 -114 -9 -245 132 -41 -116 119 -158 48 185 -45 -54 138 153 -118 -70 -9
3233iR5j07m9m8L64k54OR9K1j84JN22l74j35J61r4m9l4J79N6k61M53n81K25l6
3258c3J35m1K00j27q6m9j36L76l28J46J19j09j87L60m03K44r1j60R5N8l6J22m9
3281B0J9j39K12kjj02j7m2m7O6%J89k20N9Q8N9p2o9j26L95r7j35j24J72l00M05
3307A91k60M0M06l40l1r5j07O9J22n8r0n1K30N9j32K76m00L34j44k45R1K04r9
3330c0L7k22P8J16K0K74l82K49l41M37l17L1j03K37l17J55L63j65k04R5j10n5
3352a54J08L33k75J3M9n7l8J02n3k35Q8J34J00j33L8j18L75r3r7O9n3k1k49K23
3376E6j86J26Q9r7M1J73P1k76J21k59J61q1J06K37l35m7J55L9k61O7j0j11K83
3399F2K00j60M0j35j7k3K41n7k66K75j28J99n6k86J14J18l15M02l00j64L14k06
$$ plain form
3233 -9 86 -21 -70 -118 246 -8 -2 97 118 -66 -65 457 83 -52 109 15 -34 -68 111 167 -94 359 -222 3 -33
3258 -33 102 61 261 134 48 -1 -137 239 -89 57 176 67 -120 240 -163 81 -10 -170 -75 -17 -53 69 20
3281 20 39 -100 112 110 109 7 -10 -52 -99 -33 -33 156 -64 -5 83 142 70 1 -125 270 173 38 -86 86 -214 191
3307 191 -69 -29 377 37 6 -89 -196 -127 -5 -63 -153 -204 26 85 -47 229 -171 163 19 -226 -135 69 -30
3330 -30 7 -215 -137 -21 -1 273 -109 140 -201 236 -81 -50 -153 84 -233 -78 285 120 -84 11 -99 -154
3352 -154 -46 287 12 25 74 17 -21 81 28 -207 -119 15 115 -18 20 -98 277 184 87 156 103 82 -167 56
3376 56 -130 -4 85 -12 29 202 273 -3 118 -141 20 -61 45 282 -53 -100 55 94 -167 -100 -110 -221 62
3399 62 262 102 142 7 -10 -33 208 151 -115 160 32 231 175 -111 3 121 -194 208 -92 -256 58 -148
3421a48j11K90jN8m15K88K01j13ml89O2J14L6J30Ql09L83N0k72J95Ml95M00l26
3445b64J66K0o6K42j98K97%j61O4j59o6j56M57L9l35J49k28J09O3j48J99m3M7
3468B8j8l1jJ36j8J21j89n0r2J54p5N0P2j99J48q8J45k47j01M15j52j06K38j54
3492a4Q0K16n00J88J07j58j2k8J04L94m25L8k48K82l0J1Pk05K97q7q4or4J47L9
3517A9R3K9ok00j7r5K65r4kK31j26J12j22k48O5l1K39j51j9M6J77j37j2P7J68
3542B61k70K41l62J64p0R0J3l3j38K01k02K9L8R6j04J11j61r7Nn8M30k9k1k8k77
3567a71j00M12l69L66p6o2j57P3j07K59l24J45l9p5K74q6J75m05M03k48J07j1
3589a6j69L58k8K8p7j02J49k78N03o18J63j91M23k71K77j39J47k70J24K7k66M70
$$ plain form
3421 -148 -259 31 30 88 -327 -39 162 49 45 -344 -282 -168 -132 -2 6 -303 80 130 -142 53 57 -338 62 -264
3445 -264 -98 -78 -144 98 -100 197 197 36 100 -59 -125 -281 176 215 -120 29 -199 -90 -27 -175 24 -19 28
3468 28 10 -21 -22 114 96 217 28 -22 -114 40 -35 15 87 -112 36 -52 93 -154 -255 160 8 -98 140 -14
3492 -14 66 282 -218 -30 77 -81 -93 -121 -17 377 -48 -10 -258 24 -6 5 12 -193 104 17 -67 -73 -167 -20 19
3517 19 112 141 135 -65 -82 -177 88 -6 -8 223 97 209 87 -161 -96 -127 112 -39 -58 -12 165 28 16 93 261
3542 261 -9 232 -130 34 -36 54 67 34 -104 97 -105 -76 -38 58 -46 65 -96 -193 -188 -246 184 155 134 106 -171
3567 -171 -271 141 -228 138 62 0 -157 -84 -191 68 -256 -111 -150 -225 49 -37 138 -267 136 -112 -5 -16
3589 -16 -185 173 145 173 96 -6 143 -135 368 -250 -87 -278 145 -126 151 12 159 -111 13 40 -226 244
3611B44l93l0Q4j5J8M6N0J27l05K28j24j25Q5M06l93K57M6j74M2J22j49K33l63
3634h3j87L03K70m50RJ86R7j01j14N3p9o4Q2J62j84j28L69l8k1j41r3K29N5l17
3658a85J03J40M8k16J36j6J32j09j24L66j56j4l9mk99J89J81N6k59K1k54L76l75
3681c02K10K84l11R9N5p0J4O5k73J48J20J61k56j01J34j10p6Q7J47l3QK1P9J58
3705B58r1j33p0J45J41k98J08Q1P4k52L91p02K42L07l77K50p9p6K0Pj40J90J98
3728A94o5m64M32nk99J85k2Q9j8r1lK38l2j88L0J5K17k98j0J62M7M1j84k0KL11
3754B64j21j8j92R4J13n1k13J43j8K83n03J56O1j09K75k9l35J37K04k0m19L58
3776F0L3k88K97j95J40o3N9q8J03R7j41J9k51J64J32p3j90L05r2J40J1j12J14
$$ plain form
3611 244 -149 -179 -95 -110 -92 -46 4 131 -174 54 -70 -195 -110 296 -97 160 206 32 74 196 47 280 -83
3634 -83 -270 33 303 -147 -138 48 145 44 -70 -17 -96 -160 -78 84 -100 -228 141 103 82 -59 -152 77 132 -185
3658 -185 -82 58 106 -110 26 10 142 33 -91 275 119 105 66 62 -237 -48 133 189 -70 -49 -303 73 -302
3681 -302 -92 192 -119 -20 35 -35 -21 44 -229 -81 39 200 -56 -157 -23 -133 -209 -122 25 -8 0 21 100 258
3705 258 167 34 -36 109 250 -48 60 141 215 -37 354 -348 -106 201 -176 74 -5 -81 -61 -54 -194 -4 194
3728 194 129 -335 97 92 -207 -22 -44 45 27 -64 -67 171 139 -49 -19 -4 213 -85 -95 67 114 155 -29 -49 -47 264
3754 264 143 125 -67 27 140 89 -124 19 1 284 -219 -63 -2 -111 164 135 -200 -63 141 121 -298 60
3776 60 93 -195 102 -93 47 -16 43 -45 58 155 14 33 -218 -54 78 5 -185 120 28 168 179 67 181
3799A81k88K26p8l88M25Q3j38J65l47J79p9Q8m8j4N2J36k83J59M9j5k20k20O48
3822B73k84n9R3J43J35l34k59L68L6j13J43J41l61N4j71J59J41qk59Q5P5N9r4
3845c7o8Q3j70K48k19K77j08j9L45j25k80o3L01j1Q8m47J41K46n28L61j47J33
3867Al87M10j77L21k69j12j12K81j3Q0J13l82M48m35K30K62m2J51l73M25n37L58
3889B41l96K97m08N27k37k06J57N3k47J29K04m48L62k20j90N65j4N8j72m8p9L8
3911c4j78J95p6P1K27k60M0j21J94k98L82j93K64k90Q4p0p6m1K64Q5j85K53j70
3934F7j43q0M37j02k34L4k19M2J23j29N31k19k50K41j16kj46M63k25j00Q0q0J18
3957I1m0L5q6J3j2p5Q6Oj09J03J10k25J04J42p5l78L28n%J46K35j56j00J68k34
$$ plain form
3799 181 -107 119 41 -347 78 161 23 188 -159 20 -59 29 -19 -33 19 155 -128 31 80 65 -155 -375 273
3822 273 -11 -70 23 166 301 -33 -292 76 112 -1 142 283 -78 -24 -195 -36 105 97 -162 -77 -2 57 -37
3845 -37 -105 -22 -192 56 -163 114 6 -13 332 207 -73 -136 165 154 242 -205 -64 182 -346 15 -132 1
3867 1 -386 24 -153 168 -101 -213 -325 -44 -57 23 136 -246 202 -233 -3 259 217 368 -5 420 -117 241
3889 241 -155 142 -266 261 24 -182 -25 28 -219 -90 114 -334 28 -192 -382 183 169 227 55 7 -72 -34
3911 -34 -212 -17 -93 -22 205 -55 -15 -136 58 -240 142 -51 213 -77 7 -63 -139 -180 84 169 -16 237 67
3934 67 -76 -156 281 179 -55 -21 -240 -198 -75 -204 327 108 -142 99 -17 -19 -165 298 73 -27 53 -27 91
3957 91 51 86 0 13 1 -74 12 18 -91 12 122 -103 1 143 68 -310 18 13 13 159 394 238 138 306 72
3982G2Q0j30j74J6K36o9Q5m2Q9j84L42n21j15L16o1PJ37J16r2k4M6l65J03J40
4006HJ46o6m4N4jP6n2n6n3r9K57m16J37q7L25K3K3j72q2J77k48J99%oj69K52M8
4033A74j78j66J27N1J56l83K80r2n4lpK95j79k44L66j33l9N1r5J74pk21p8J23
4057h2J79q4L8k61R1J55J21k85J06j15j85M29M8j37j75R1j37K17J5K5k00J37m
4080a3j51j64M49j06n1L67l58oO5JK04l37O1j01J24j6j07j0K46k46J65J4L9n3
4104A6j42kJ26j14K15N7q3L4j66L0K27n0j5j19q4P3J60j12j71Qk0K23j27K3n8
4129g1J27k9j34J26m0K71n53L18r1K21l18N9J65nJQl6J43l59qJ26J13Q8l02K18
4154C8l9l18R6K8j10K51K1J04j18J33p6%o8k94M32Q2P3k02L5j45J04j46K12l16
$$ plain form
3982 72 152 22 -152 -136 100 31 116 74 163 -21 321 -200 -315 1 -60 -53 84 200 108 84 130 -235 -132 8
4006 8 154 88 44 98 97 173 121 65 12 -87 170 -246 -109 -196 129 152 175 3 -79 98 -150 49 49 43 -126 126 174
4033 174 -4 -170 -43 8 164 -219 61 -31 -85 -88 -95 200 21 -223 143 10 -29 22 -73 101 94 -127 -205 -82
4057 -82 97 13 51 -210 -119 36 157 -128 -22 -137 -322 107 155 18 -157 -66 -203 14 29 54 -146 -9 -13
4080 -13 -164 -328 121 15 -36 331 -27 -33 32 33 237 -100 -39 -140 -16 -32 -139 -149 97 -149 16 30 69 16
4104 16 -126 -128 -2 -116 99 156 73 107 -59 -29 198 148 133 14 -70 3 163 51 -120 -112 -132 91 -36 -13 -71
4129 -71 56 27 -107 19 -21 250 -303 15 -76 145 -173 -114 51 46 47 55 19 162 -197 -205 -79 34 122 -180 38
4154 38 -1 -319 -223 -195 -305 -54 -33 71 -47 86 10 10 -58 -352 80 162 235 33 68 -77 27 -119 93 -223
4178b23J94p9j35K32j07J43j83M82k66l24M51j63j83L7J99OJ07l83J84L9j16j40
4200b28K59j59J40j35L63j41k56N29o69K71j27L7R4qJ78K42m37J64p5p0M1J04
4222A17k02L2O7k7m3n6L20j89p9p0J88j50J96N2l79J37J41m3m4O5k52k04L23J17
4246A7k30L46pL6no0Jj21j81K69j20J58n9o5M5J39j80j77J99N5K3o6j6q8R9J01
4272A13j05r5J08j17M1k6k1Q9L9l33K09L01k96J05q8q9L73k26Q3l15L37k21N4
4295h0l5M7k1P2kL1J99k35k3J47r4q6J34L8j41J4J97Kj13j68r1J29K08j25j40
4320a36o5K43Q8l03J22J67R0l07M52k49j95J84k72J66J47j92j0O4j06J66J24n8
4342A20L8j24j24R6M0j66L20j14M8j86j04K5N6K42l84J91j37K07RK5K1k31k2j2
$$ plain form
4178 -223 -29 -108 -243 -11 -118 25 -158 324 58 -266 185 22 -161 -124 75 81 188 -195 -11 28 -88 -228
4200 -228 31 -128 12 -123 240 99 -157 372 -297 -26 -153 -116 -22 -30 148 390 -47 117 42 -28 13 117
4222 117 -85 -53 14 -13 -56 -112 208 19 -60 -130 58 -92 104 156 -223 -86 55 12 -32 33 -219 -423 -100 17
4246 17 -213 133 126 162 157 97 98 -23 -204 65 -55 103 44 -21 24 163 -17 -194 5 60 83 17 1 -87 12 113
4272 113 8 -87 21 -96 -55 -81 -102 -13 26 -307 -98 203 -93 12 -76 -165 208 -18 65 -250 87 -134 -80
4295 -80 -115 -68 -89 -17 -19 12 211 -24 -47 100 6 -80 54 92 -49 -35 162 164 51 -117 -208 -79 129 4 -136
4320 -136 -201 42 130 -173 -51 116 206 -101 351 102 -93 91 -181 -15 132 -60 -70 -6 -112 54 178 120
4342 120 158 34 -90 6 46 -120 200 86 134 -52 -156 -131 -75 167 -217 -26 -163 44 53 78 99 -132 -154 -166
4366a66J05L5J91k0j25k4Q0o4n3m3j56J83j9p0K89j83k3k30M23j09p5l05L18r3
4390a34K97l32J2L48p0pj12J58lk11j16K51j02J62j64L7j41J66j79J96j08M9L4
4413C1J95l80M8R5p9K67k05m24N26l30J83K66o7j17l73L66j45L56j56N1o1rK11
4436B49l02K83k86QJ37O2j44k37J93J6j17J94M6j80J19l89L29o3R9l4J4j08QQ7
4460a6j26K48p0m29L83o2J15j9N3j40J45J48q5j94N4q3j40K42j47J15j1J38l27
4483b08J1J91J43k07o9L46J37m32K44l07r7K57J6N6j91j35J32j01K18Q7m96K23
4505a82L07j25J7Q1M9L5Km17M10l61J60J97q8m1K06k24n7Q0R3j68J05n3j62K39
4529A03q1J0pK00q9k96N47o51K91j13L30o5j41j03K3M77n45o1j14L25o8j03J63
$$ plain form
4366 -166 -61 -26 165 145 20 -4 76 12 -41 -84 -240 -57 -76 -146 143 -40 -63 -293 130 21 -54 -359 -41 -134
4390 -134 163 -169 -157 191 121 114 2 160 157 -54 -170 81 -21 141 -23 14 -127 39 -140 56 -52 -3 31
4413 31 226 -154 -106 -11 -90 177 -28 -452 74 -256 -73 193 126 9 -364 2 -143 213 57 108 47 38 249
4436 249 -53 230 -56 -48 89 151 7 -230 -37 -21 -138 56 102 -78 41 -348 -19 -82 17 -17 -3 -111 -103 -16
4460 -16 -142 106 36 -393 -10 -72 43 24 77 -63 82 230 145 -49 5 -78 -218 24 -123 -8 -19 119 -208
4483 -208 -197 -6 137 -70 -139 207 344 -88 156 -151 -248 9 25 81 -110 -245 -113 -214 4 91 -405 -182
4505 -182 125 0 17 98 147 182 184 -233 177 -184 -24 173 85 44 250 26 -31 49 142 -26 79 26 -136 103
4529 103 22 32 25 225 136 -160 387 -264 27 -86 244 179 38 -65 -42 435 -110 -171 -285 40 -28 -131 32
4552C2pL3k90K59j3L54l69K8No5k3j36K09j25N4J94j34k8M4k29M47j27M7m01L7
4577b04K74N6k93K08j92K62N4j29o7J07j19k07j40O29j10l00J84K2J44j68p9N3
4599a5j36j94O29m13L5K77l61K30k32J97Q9k83K76m2K5k37L03j74j01l2K55P4
4621A70l12J50j67K42Kk8l26M59N8j11m2j6R4M5l41J73Ql12L36j80M97m55p2K94
4645A66j27j03k47M40j5j13k2M03k97l08R8J54l4J16k21N9J18j8o2K83j24r1r5
4668d0m0q6J21N4r0M3J1j71K56J53k51L19l25J51p4K24l13l7J96n3J36k82k7J67
4692D2l9J35k70o4J36P3J81j53j79K16k68P1j42J08K18k2l19M77k04R6l58N17
4714B52j86j52L00l31j91M53k36oJ2J00N9o6L4J7n8k49L24k16O3m0K32p5j15k17
$$ plain form
4552 32 25 58 -232 27 14 368 -1 27 32 -33 -56 -192 17 -108 -54 140 6 -22 22 -207 240 113 160 -241 -204
4577 -204 70 126 -167 41 -151 111 165 36 -31 76 -43 -250 -390 239 129 -171 13 35 179 11 -68 -15
4599 -15 -151 -345 284 -129 -94 183 -178 52 -180 17 106 -177 99 57 82 -155 148 -26 -127 -159 96 170
4621 170 -142 8 -159 83 85 57 -269 190 248 137 95 79 173 218 -123 50 58 -254 82 -98 399 -56 -128 166
4645 166 39 -64 -311 129 114 1 -21 382 85 -223 -125 29 -5 111 -110 -51 67 49 -13 270 146 55 -40
4668 -40 -80 -166 -45 9 -81 -38 -27 -198 58 211 -40 279 -46 105 31 255 -58 -95 101 48 184 -98 -125 42
4692 42 3 138 -132 -196 -60 13 194 41 -138 78 -190 -119 -261 -153 65 43 -276 201 -3 93 -265 252
4714 252 66 -86 214 -117 -308 145 -91 -97 -85 15 74 8 42 59 1 -248 76 -140 -77 -117 115 40 -75 -292
4738b92J46K10K34k10J97m20j3J10K80l15L74k89N6L45n38L23k41J26o6J74j18
4759G3o3J28j06J24j13J34k78K74k25Mj79L05J98k67J5J08j92k95L21J36j80J89
4781A11j0l04M31q9m48M50J42j86r1j02pJ09p6L62m55k1K80l80L62J62q4l86Q4
4804a46J36K7M5q0L0j3Q2j9K65k60J34k01m6O3m2K70k43K97l51j2k4j69J94L22
4828B59m15M23m46j14N04k80L97l68J79m03j0K11jl5k9k2J94M1k34J10j90R8j48
4851b79K78K80l99N55n57j04K34K5L8J43l50q0P4L45m17O8K70j34J4J15k5N5j66
4874a7J83P1l62J19J38M0nl36K90l23J6K27j81K11J94l96J17O5k71J63O0K86k41
4897D8l9o7J20j60L29k58j28Nk5L51R1k63P0J71j32j62L73j19j36j9q1K42l67
$$ plain form
4738 -292 -146 64 298 88 285 -135 -148 -38 242 -73 301 12 68 413 -125 198 -43 83 17 191 73
4759 73 10 138 32 156 43 177 -101 173 -52 -48 -227 78 276 9 24 132 -60 -355 -34 102 -78 111
4781 111 101 -203 228 139 -309 141 283 97 6 -96 -103 6 -70 292 -163 -184 96 -284 78 240 156 -230 -146
4804 -146 -10 17 62 -18 12 -1 81 62 327 67 201 0 -46 17 -25 245 2 299 -52 -64 -88 -257 -63 259
4828 259 -156 267 -179 -293 211 -69 328 -40 139 -264 -274 -63 -64 -99 -128 -150 44 85 -149 -39 -229 -131 -279
4851 -279 -1 279 -120 435 -122 -226 8 33 71 214 -136 -216 -142 203 -214 -146 124 -10 4 119 94 149 -17
4874 -17 166 237 -125 -6 132 172 167 -169 121 -202 -186 41 -140 71 265 -131 -14 51 -220 -57 3 289 48
4897 48 9 -58 62 -98 231 -27 -155 -150 -175 176 267 4 74 245 113 -49 324 205 69 50 -31 211 -156
4920a56J81o9j33K69k35J43P7O7l83L26m2K6o01K95M15l19J76j62P1K25j93J66
4942A44P2l06L02q0rj44l5n3K48J45l07L86n31K36j89J1o4K15O4j47J19k41K17
4965E3j75J91k68N6L43m03M77l85nP3L6J24k60J95k00J04K00k24K88k73R1J08
4987A46m0l2J40p7K14l22p1J6Kj02L70k47p0Q0J73j96j0Qj25K80k99K23k94J14
5011a19m1J41P9j79J6J44j17r6n3N4J66J20n8j75q5L06j06K50O7j74j89l82M16
5034a5j80P1O2p6k2K30l5j29N3J86k3l04L75m86j8L70K75j51m76L73k9JQMK0J5
5060I9l77J37J10q6L04j63Q7j79j73J04OJ47N8k67J79j18J40j38M3J89m38J65
5082a71J66p2m2m5J3K10m6O0K8j9l9k11J11J77j09Q6k66J72n4O4KK19l17J10n2
$$ plain form
4920 -156 25 -44 -177 92 -143 0 77 144 -239 87 45 71 -530 -235 180 -139 37 -125 -54 171 -22 144
4942 144 216 -90 212 132 123 -21 -56 -109 139 284 -23 363 -168 68 -121 -110 -174 41 105 -42 77 -164 53
4965 53 -122 69 -199 -143 200 -203 274 -111 -116 -43 -7 117 -143 52 -148 -44 156 -68 220 -53 38 146
4987 146 106 74 214 137 351 29 -42 -26 -24 -126 244 -3 -73 7 180 -16 -26 -18 -143 137 -162 61 -233 -119
5011 -119 -160 -19 60 -119 -103 41 -76 -172 -225 -171 -5 115 57 -118 -203 103 -3 247 314 140 -49 -431 -15
5034 -15 -195 -124 -62 -138 -160 70 35 -94 -41 145 122 -182 193 -293 -311 59 334 183 -293 80 51 52 60 64 84 99
5060 99 -278 -141 -31 -117 187 24 111 -68 -241 -137 -131 16 74 -193 -14 -132 8 -130 -87 102 -336 -171
5082 -171 -5 -77 -119 -164 -151 59 13 73 101 82 43 -168 -57 120 11 97 -169 3 -51 13 15 234 -83 27 -25
5107b5O1l57L13q6J35J90j23J68k06j3N2m6j51J49k2mK7M0m51J61J02j04J78J2
5131@N8j04k31M02j55J35k75Q9Lj96K92j46K35J36l30j50K52N54o58K02j70N7
5153@K16k00kl0j17K07k48j62N03k13p7R9K42k24j28L65j09j03KJ97r1k39J23
5176A1K00l33J62p8j7j00R3K5J5J25p7l57L84M6k73K3K45J0k37L12j16j10J39
5199I2j67K2J19M4k06K26k77K13l4K6k06M30l66N2L01l04K20l59P7J58K66m21
5221i4Q1k34N31k81j49o4K33l7j37L3Q8j02J04rl6J65j32k18o9L97j33J76O3l52
5245a76K81m5k5k35J16J03Kj84l74P64k38j51K9m1K31K18r5l27J62n2L34j79k79
5268a61K70j52M4kK3n10L78K40j23J54l71r1Q4L89l33Q7N5j98n5L32N1k01J44
$$ plain form
5107 -25 36 -321 -8 -94 41 231 108 276 70 57 109 63 -88 61 39 35 62 102 -349 -188 -86 -190 -12 0
5131 0 58 -46 -277 125 -30 105 -170 -81 -78 -274 18 -128 107 243 -87 -237 15 569 -89 113 -57 0
5153 0 216 16 14 -16 -133 74 -174 -336 167 -46 -123 -24 218 -6 -134 231 122 19 21 218 127 -112 11
5176 11 211 -122 40 -38 -55 -155 -62 -37 -22 103 26 -331 53 99 -174 -151 94 104 -133 179 63 -47 92
5199 92 -75 -53 66 110 -96 130 -147 66 32 58 -148 282 -84 -32 269 -35 185 -174 -97 61 327 -94
5221 -94 -13 -247 284 3 -146 -210 23 -14 -151 -118 -30 -132 -28 -37 -73 92 -40 -258 -327 70 -63 113 176 -176
5245 -176 105 60 35 -200 -84 19 21 -163 -537 227 -11 -162 -133 -174 57 275 180 -147 15 -37 297 118 -161
5268 -161 109 -43 1 -1 22 -488 -110 130 7 161 -210 -301 -217 172 -161 -74 -19 -217 -272 60 111 -90 54
5291E4j63L24m57k3L67Pk32J54M2O4o6k10L01k62K48j53N9o1j47J27J57k50n2
5314a72j82J93K32K1j47Q0j34J25j47r9L85j52P5k61J36J66q9Qj64J08P4m68N50
5337A38j54j17J53O3N3Jk64l2Q0k4J09lK15l01Q5K64k43K6j12m5J51j1J49k54
5361g3q4P1L46K4j23k65K12j60J04q1p7L9J74Po2j32J63J11N9q9k96J35J44J40
5385B87m89J18Lj48L50q3j49J34r9J71j73M2J49O8n19K90L43j02l87K78l31M55
5407B08k00O9M3j77K08j14j82J43J78k21m4PK03j33L7M6K1L3r8k54K62j98j8M71
5431B90l25J66r6J44j28j61O3L2K3J10j8j19Q3j18j62J08P1m3L01jk17q4P0J86
5455A75m17K29J21k56K54k36K9K11p5k48J71k48J81K09l26L02j48m0J8r2o0J65
$$ plain form
5291 54 -109 215 -242 -265 102 109 -123 31 73 137 71 -139 162 -100 148 -5 54 -7 -154 -27 130 -120 -172
5314 -172 -354 -161 71 92 -55 25 -109 16 -131 -230 155 3 78 -183 -47 119 30 38 -126 -18 56 -412 138
5337 138 -16 -133 20 83 136 137 -127 -159 -79 -103 6 3 218 -83 2 266 23 49 -63 -108 43 32 181 -73
5361 -73 -157 -86 260 284 161 -104 108 -52 52 -29 -106 -67 107 114 52 -80 83 194 253 164 -132 3 147 287
5385 287 -202 -84 -81 -229 121 38 -111 23 -76 95 -78 -36 113 181 -338 -48 295 193 -194 84 -247 208
5407 208 8 77 120 -57 151 37 -145 -2 176 -45 -89 -82 121 -12 25 71 92 125 27 -227 35 -163 -181 290
5431 290 -35 131 35 179 51 -110 -47 -15 8 118 100 -19 64 -54 -216 -108 -37 -80 221 220 3 -81 -11 175
5455 175 -242 -13 108 -148 106 -130 -101 110 35 -213 -42 -290 -109 100 -226 76 -72 -112 -94 -186 -246 -81
5477h1J0j71L56l5n2p0j91O6oJ62P9r2K15k63J64j2k03R6l8L09j33k52J36m47
5501d53M62j28M53j26l91K09k4J55J88l23MJ57j12k68K56m7K9q9k36k7K34J18
5523D1k92K20K54k80M7L6P4q5k5R2p2Q7k74M8q9K09l39J94K3J54J77nl14J89j34
5548f4Lj1j54J57K26j80Q6j36K77j20l1M6J20m5j21K9m1j0j28O4j58K06L6QN4
5573A13k1R7k50M7j68J37L1J57m3J37k52n1J65k93K63o6j1j77J33k7L5j87K19
5596a2l90L80r1l2N7P6m0K29m81R2K45j72K03n1p1K9J92k47M4j91M79l23j18L12
5620A19R5k17J87nj36j35J58j24J32N2p3j47O5L06k70j93M06k41J16q8R2k78L09
5643A30j85l60L13J80j15J01K3j14l2k43J30K50j33k02N08j83j81P1r4J72P1l19
$$ plain form
5477 -81 -71 -242 114 79 27 -43 -234 -168 -174 -12 67 -25 190 -73 91 79 -124 -28 -66 243 110 -142 -6 -453
5501 -453 9 -119 334 208 -183 26 2 157 345 22 26 183 71 -197 59 12 41 -48 -284 -311 -77 41
5523 41 -251 -31 223 -57 -10 26 100 15 -10 82 10 97 -177 -129 -218 -9 -348 -154 -131 23 200 195 -119 70 -64
5548 -64 -61 -72 -226 -69 157 -23 63 -73 204 84 53 99 219 174 53 82 41 31 -97 -33 -191 15 51 59 113
5573 113 92 189 -61 -14 -182 -45 -14 143 100 237 -15 -66 99 -194 69 3 -8 -185 -52 -79 -44 -231 -12
5596 -12 -402 -22 -113 -145 -88 -12 -52 177 -304 -212 33 -139 64 13 -58 -29 163 -84 -40 -231 248 -75 -193 119
5620 119 214 -3 184 179 43 -92 66 -58 74 126 53 -94 -29 277 7 -186 220 -21 95 7 99 -179 130
5643 130 -55 -415 -102 78 -37 64 87 -27 -59 -302 -172 78 -55 -257 251 68 -113 -42 -136 36 107 -212
5665b12K44l2k3J88J08k40m1N9n0p4J86l78L64j14J41rn3m4N5j0P6k68O4J39o8
5690Hr9K44n8Q2l42N1O0j25L4p9K74O3M9j97J73N6k18K25p2k30L80l49p6R0O2
5715FJ04J02k63P8k2j55K52kK5K5j65r2J82O6J64k54k01K8o6l1K79K22q9m9l5
5740A09r9q6NK09n3k1mK22l32j37K88j01K7r6K84q3l44O8L43k2j02K13l60J0j13
5765a75K3J10j00Q0J61l23M78j70L7M9k97K86l25K7J10J44k85L18n7J71j10m4
5787A08j6J04k94K15m0j04R3LJ96l25J31l5J23l4p3m69Q36k89o3L1o0Lj94K72
5811A19k68K6J93j33K85m00J70P8J01l47o8L96l8k2J34j50k28J73o0Q2N9p7O8
5834I3j63J65K31k44j16n9m1L95l83Q0J29n4j54K66j3N6j89k42K31j23J46q7J22
$$ plain form
5665 -212 32 0 -23 165 273 33 -8 51 1 -73 113 -265 99 -15 126 117 64 20 75 65 141 -127 -63 76 8
5690 8 -91 153 95 177 -165 -114 -54 -179 -145 -224 50 113 162 -35 138 194 -24 201 129 -101 279 -70 -146 -56 6
5715 6 110 212 -51 27 5 -150 102 100 125 150 -15 -107 75 141 305 51 -150 -122 -188 -219 60 282 193 144 109
5740 109 10 -76 -71 138 85 64 60 282 -50 -187 101 0 27 -69 215 132 -212 -144 199 177 75 288 -72 -62 -175
5765 -175 -152 -42 -142 -62 99 -224 254 84 121 170 -127 159 -166 -139 -29 115 -170 148 91 262 152 108
5787 108 92 196 -98 117 77 -27 66 69 265 -60 71 36 159 125 52 -417 419 130 67 98 38 41 -153 119
5811 119 -149 -123 70 -63 222 -178 -8 70 171 -176 -244 152 114 92 226 76 -152 21 -39 43 102 25 93
5834 93 -70 95 326 82 -34 -93 -134 261 -122 -42 87 33 -121 145 132 188 -1 -243 -12 -135 11 -76 46
5857D6n3j54K88J23j63j65K24j4j11J41j02k41L93j33l08L47J22q2k37j6k66K38
5879a23L3j44K59k35J4kJ85J1J52j40p7O8l8L08k25k07N6L07j43j72j48K7K41
5902GRL7j02M0n4K5j58J44J44qk63P7K14l26L25j43J73j61N2r2K32n8k84J31J72
5927A33j89o6k23L54J0k1K58k13j18J39kn7r8L5K23l53J03m3N8J78k52L12k99
5950a31k09K42Q2J56k15J95r9M8N9l9Q8n10K50J31O4q6J81J65l38Pj56K25k80
5973a70j2K87j58J57j80l0K09k07J87J44l02ON7P1L9j48L48n67L16j59K67j62
5995gl3J40l5J61l19K11J70m84K98j73R4m7K16k58J80j45q3J76k18L38k08L2j91
6018a85N6K4J75k48L92j77J89l96L47nm0p6J22j72K32m8j98j99K91p9r6L7Ml0
$$ plain form
5857 46 -7 -161 127 250 87 -78 146 132 21 162 60 -181 212 79 -229 118 240 158 -79 -95 -361 -123
5879 -123 -90 -234 25 -210 -196 -198 -13 -2 150 10 -67 1 -37 271 46 -161 -105 202 59 -113 -261 -234 7
5902 7 16 53 -49 -9 -63 -38 -196 -52 92 84 -179 -102 112 -214 111 -32 141 -20 32 -60 172 114 -170 -39 133
5927 133 -56 -122 -345 9 19 -2 256 43 -75 64 62 5 -93 -58 165 -188 -85 -128 -70 108 -144 168 -131
5950 -131 -340 -98 -16 140 -75 120 21 69 128 89 177 -333 -83 48 112 26 207 372 34 41 -115 110 -170
5973 -170 -182 105 -53 104 -76 -106 103 -104 83 227 -75 -69 -12 59 98 -50 298 -269 47 -112 155 -7
5995 -7 -40 100 65 226 -93 118 288 -196 102 -71 23 -24 192 -66 114 -31 -114 62 -156 182 -26 6 -185
6018 -185 -129 -105 70 -178 214 37 226 -170 177 172 132 56 178 6 238 190 -8 -207 84 5 -91 -54 -50 -80
6042h0J19k21K40J53k53jK31N8m83K41q0N1R0k34K07J06k30J93r0l7K1rJ3l7k33
6067b65L39J06l56J53r3j90L95O2j9m3k35q4J92L8m1K8K41j16j4j49K88j36j48
6090d7q7N2p7K39O0j62J77p0r9k78L03j24P3k19K93j08L3K01j02o1n6j7J97k1
6114A00k25L83l69K71j87J16j98K42L6q1l95J88J23n4K5j83L4J38m3l7kK6J92
6137A00J57o4m35O4J75R1k14N1k0P7p8k8K53P5oNk46J91j4j99L56k21j77Q4j94
6162b17L01j73J30j46j38L04J05k51LJ16r2o1K93l61N0J26j47M47k45q0J46Q2
6184A92l80K07l9qL1p3k9J62J53k51kK13k06K31p5Kq5M3J49j93K86k27j66j18
6208a83K02K70j56l26L25l95L03R5J02j47l47K65Q8m04L42J3j52K39k5Ko2l7J80
$$ plain form
6042 -80 39 -182 58 211 -42 -43 188 246 -237 4 -76 -25 65 -169 38 144 -86 107 17 -20 1 -8 5 -32 -265
6067 -265 74 180 -176 -23 -116 -306 89 151 132 89 -146 -230 -38 0 -41 -13 228 112 98 -51 237 101 -47
6090 -47 -134 -82 -159 80 140 -22 155 85 -14 -292 11 -113 -40 -259 34 -74 -41 160 58 -3 -59 -76 121 100
6114 100 -125 258 -111 160 -27 89 -109 133 169 88 -307 -119 4 -50 -25 -208 -174 -36 -79 -116 -118 -92 100
6137 100 257 193 -242 -178 -3 88 -126 -75 -95 -18 -96 -124 129 204 198 203 -43 148 134 -65 291 70 -107 -23 -217
6162 -217 84 -89 41 -105 -243 61 166 -85 -82 34 -58 -119 174 -187 -137 -11 -158 289 44 -36 110 192
6184 192 -188 19 -20 -28 3 -70 -99 63 216 -35 -37 176 -30 201 126 128 43 86 235 42 328 101 -65 -183
6208 -183 19 289 133 -193 132 -263 40 135 237 90 -257 8 96 -308 34 47 -105 134 109 111 49 12 192
6231A92r4L5l45J37j66J11J45p2R3K3J23o6j74J38nr5P6J04k02L5O7K13j49k52
6255a28L06j73j77m7Q4R1J60Q8k41J5k6k47J75p2K03nJ71l37L21j01j04rJ53M
6279A04n04N31q2p7n5K50j54k22J42J81k75K33l59M39k59J44L51l32K47j41P9
6300B41j61m7n7J08q7l0p9l8L16p0k34l2J73KM6P0k22J04J43m01L42L6J00j61
6324F2j97K75o4j2j16l6K41j75L8m4K17j51j45J07J03J58j99k6p7P3J4jk35M59
6348B69m42J76K01m27J18M70m59J47kj99J45R2Mk02J62j49L2J58R4K7k01j73J65
6371FJ47p8k4j15j5J55N4lj09q3L36j16k98K53k22K57k69K34l03j9L42j94P1l01
6395b94K28k6J88j39j98J50R4J93l71M71j29l47K51k95K42k38L61J93l37N0Pj13
$$ plain form
6231 192 98 133 -212 -75 -241 -130 15 -57 36 59 182 116 -58 80 75 -20 56 160 -42 -7 60 273 124 -128
6255 -128 178 5 -172 -219 -135 -44 116 204 -37 -22 -48 -295 -120 -192 11 6 177 -160 161 60 -44 -53 100 104
6279 104 -400 131 49 -28 -83 167 13 -209 -67 114 -161 72 -287 152 -107 37 388 56 303 162 241
6300 241 80 33 -24 84 -3 -33 -112 -150 166 96 -138 -170 3 5 51 121 -101 3 146 -255 87 123 223 62
6324 62 -135 140 76 64 -52 -88 153 -22 16 -28 189 38 -107 0 103 261 62 36 -41 32 46 45 -190 269
6348 269 -173 3 204 -223 -105 365 -94 53 51 -148 -3 89 93 -109 53 -96 -64 94 188 215 14 -159 6
6371 6 153 75 51 -64 -79 76 130 127 18 -65 271 155 -143 110 -112 145 -124 110 -193 -212 130 -64 7 -294
6395 -294 -66 -92 96 -43 -241 -91 3 196 -175 296 167 -180 71 -224 18 -220 141 334 -3 47 54 -59
6417e9M4p0qk2L13m88n2L73J68j9k81Q4j05J46M2k80K53N5l02N21n14L38k24J16
6441B9Q4j05J35p1j1l25L91j79J81Kr2o2J58J02j57j14J44k50L64j16j4K3j15
6464Bj37L39j72j50J22J57j13j70L5R2q6J36Nk81J8L11j82J62l4J11o2j52j68
6487b17J62Mm7J57k48K62J13k32K68l40J64Q3m7L8k55K86R9k94J47j48K04k33
6509g4k25K78n4Q6k9J42k5j10K21k02Q0p6o9mj6K15j86j35J38J4L32j09Jk48J26
6534G1k21J54k02L57m8o3J37j26pr6L1r7J32M2J62m02K76j37J52k18j4J62or3
6558e4R7J50j42kk10J95j07j71J02J35j67J57Nnk0l4J71R9J27l92O1L1J09mj00
6583C1rm0L06j02l90J3K05j3k17N3L46N1j26rm26K09R5J85j52j12K9K31k01J53
$$ plain form
6417 -59 -15 -85 -93 -115 198 -290 -342 31 199 180 -101 -17 -122 24 66 -214 39 94 -208 313 -201 137 -87 29
6441 29 113 8 143 72 61 -264 127 -52 129 131 39 -23 135 237 80 -34 110 -140 224 108 94 117 2
6464 2 -135 204 32 -118 4 161 48 -122 -87 5 -81 55 60 -221 -203 108 -74 88 54 165 103 -49 -217
6487 -217 -55 -51 -98 59 -189 73 186 -46 222 -118 46 129 82 120 -135 151 250 -44 103 -45 159 -74
6509 -74 -299 -21 -75 11 -18 124 99 -11 210 8 88 12 -57 -61 -77 138 -48 -183 -45 -31 301 192 193 -55 71
6534 71 -150 4 -198 159 111 48 185 59 52 -44 -13 -110 22 64 226 -176 100 -37 115 -103 -117 45 39 -54
6558 -54 43 193 51 49 -161 34 -73 -244 -142 -7 -174 -17 -12 -17 -37 -71 100 199 326 -66 -5 26 135 131 31
6583 31 22 -18 288 186 -204 -191 14 1 -216 -163 183 234 108 99 -327 -118 -23 162 10 -102 -73 158 -43 110
6607A10N2k47r5J51KJ48j38oJ89R0k87r1J77j07K04j18J66k51Ml2qL4J25m5K3
6632E0KP7j52J36k15K70R3l67J55M2o0J5m9l60J28M24k0k7J16n09L72q8o4J50
6656A19k00J49j54r9J01k16L44K42l95J76j3l5k82J76J33J09l14N3K69j15M7J5
6678A10l62J51J09l04K33j44M07l13M35k13k38J5jj2j44O48m24J91q5q9Q3R6J6
6701A65k69j16M16l25K2Q8j45K3J95M4k79J78K11k93K21M3k81J91k90K51k38M92
6723C04m94K88n1r5R0j09Oj7K07j04k82L12p1K7j7J08m64N14L9l15M8k6K52j87
6747c7j66K06M8j98o0L75j68l8RJ96K9k61J62Pr0N9M5j76j74J56p8L48O8k62K90
6772B90j80j89m7j71K66J59m28q5L60r2L6J02Jj43Op9J82K1K24k13Nl4k8M50o61
$$ plain form
6607 110 162 -85 -180 -29 -27 121 -17 -23 166 256 -31 -122 55 -52 152 34 200 -51 -47 -79 -87 -53 72 27 50
6632 50 52 129 -23 113 -102 168 261 -106 49 91 31 46 -3 -363 -235 189 169 142 258 -251 121 33 -31 119
6656 119 -81 68 -86 -185 -84 -300 44 286 -109 67 54 19 -263 -87 46 155 -159 -106 163 48 95 110
6678 110 -252 -101 8 -296 -63 -207 200 -113 322 109 -129 -114 -115 -127 -271 377 -47 144 59 -30 53 149 165
6701 165 -104 -220 196 -129 -107 -19 -164 -141 54 98 -181 -3 208 -85 136 179 -102 89 -201 50 -188 304
6723 304 -190 98 47 -48 42 -67 -61 -78 129 25 -257 55 -16 11 -6 102 -362 152 191 -124 -76 -102 150 -37
6747 -37 -203 3 51 -147 -207 168 0 -38 -29 167 196 -65 97 104 14 73 118 -58 -232 -76 -154 194 262 0 290
6772 290 110 -79 -126 -297 -31 128 -300 -385 -25 -117 -81 21 22 -121 -115 -194 -12 9 233 20 25 -9 -37 413 -248
6797b48K32J58q0l52L8M48n9j41n3j17O81l81Q4k90P1Jq8K61l79L16l24L69p9
6820F8l4l8K78k11K29p7l84K38o5J25J73n91L05k71L04j02K9K63l59J61J10o7
6842H4j74L10m20J81J96N2l83N86l59k26R2J30j37K07k5k26k31L67Nj09J48M8
6864A16QL8j32P1l91L42k7j09L9j84K81J29j94l4J21r8J09j45J27k71Q1J84K46
6887C07k91p7N1J06k86J84j02j01K98j39n7J8n5qM6Q5J57m6j25J65K00j74j55
6910Ao8p8J59J77j35L4k07J33r6J60j57K5J88p2M2r6K7n2m3Q7l7J03Q5l89J45
6935f4j25J83K12k02J63k1P1l17L15M5N6l08j80O4P9j8n4r7J59m7K56j67J72j07
6959F8M2Jl91M10n5k28N84l79j48j87L76K41k99J60l19J46j12J20j1j34Q2j15
$$ plain form
6797 -248 -16 142 62 -290 -252 196 137 -4 -57 -174 507 126 210 -80 -9 -8 -96 165 -214 102 -222 147 68
6820 68 34 -4 274 63 292 215 -169 69 4 129 302 -289 16 -255 49 -53 -24 239 -120 41 151 84
6842 84 -90 220 -200 -19 177 229 -154 432 73 -153 -61 69 -68 139 114 -112 -343 24 29 -80 68 116
6864 116 124 162 30 101 -290 52 25 -84 -45 -229 52 181 -13 -47 74 -24 85 -60 67 -204 -123 61 307
6887 307 16 -61 -10 96 -190 -6 -108 -209 89 -50 -107 -89 -144 -152 -106 -21 136 90 -35 130 330 156 1
6910 1 -67 -145 14 191 56 90 -117 16 -80 80 -77 -52 136 64 106 10 37 -15 -58 29 -8 95 180 -209 -64
6935 -64 -189 -6 206 4 167 146 217 -100 215 260 316 8 -172 -108 -29 -47 -101 -198 -39 -86 170 3 175 68
6959 68 110 111 -280 130 75 -153 431 52 -96 -283 93 334 35 195 -124 22 -90 30 19 -115 -33 -148
6981a48J68j54J41Kr2K54k54K56J13l40L07l59j1J57j78j07J99j93N1L8K20N0
7003A20j29m6L61k55k28L77l04N7J71j13J0J69k64J16J64o0j08l47M52j22J99
7024B20j90J1L38n89J10j0K57l93M13Q2j52m5k5j34J03m3R7k96J78K31K6j02o0
7047B7l6M5k23Q6p0nM14l84J69p9L12p7j06N8q6J77o7l02j49J52K66j32j24K55
7071A21m81M14rLp6K4R6qj29J39L0k85J33J7m2r6K62k8l98K75k16J99K9J51j38
7096a3k52J23J66n5J02l5Q5j74J59j33K23p8m00M87j12J84l96K83k05m9m3R8J70
7119A35l08j11N89l23J59M7k87K26j36K29K2k78k14K26j92K45J07r0k24l3J13
7140i8J4J48P6l62L58o2M02m87k0Q8j45O5m0n9J68k9j13K02J08M3j47j1PJ01j32
$$ plain form
6981 -148 20 -134 7 9 -83 171 -83 173 286 -54 253 -106 -117 40 -138 -245 -46 -239 -188 -150 70 120
7003 120 -9 -55 306 51 -177 200 -104 -47 124 11 21 190 -74 42 206 146 38 -309 143 21 220
7024 220 30 41 379 -210 -100 -110 147 -246 167 249 97 52 27 -107 -4 -47 50 -246 -68 163 189 87 27
7047 27 -9 36 -187 -101 -171 -176 238 -146 23 -56 256 179 73 131 45 222 155 -147 -296 -144 122 -10 -134 121
7071 121 -360 54 45 48 -28 -4 92 84 -45 94 124 -161 -28 -11 -53 -149 113 85 -313 -38 -254 -55 -26 125 -13
7096 -13 -265 -142 24 -31 71 36 121 -53 106 -27 196 118 -282 205 93 277 -119 164 -41 -90 -133 -35 135
7119 135 -173 -284 305 -18 141 188 -99 127 -9 220 242 -36 -250 -24 -216 29 136 46 -178 -211 -98
7140 -98 -84 64 140 -222 136 74 476 -11 -31 57 -88 -23 -63 -122 46 17 -96 106 214 257 110 99 106 207 75
7165G5j54J86j00J24j34O8m26N34j59J06j46m5K30k36K48j64k93J07k6L33o8K67
7187C27m24Q1J05m14J78l5r7K97Q0j66L34l90K20p6o5P8l7K22nj03j07j2J83j23
7211E1k05M11q2K2j04R1j40j96J91J60k07Pj84L98k97P8M8rp2m4K05q5j50o2J21
7236e4j2J5O5%j19kJ38o0MJ17p5Q6l5Jl69L57M9l20L55j45N3k71J89q1J09J09
7262A04k8r3J93n9l47M40l19K19k32K2K55M1j39j86L72m79K45k7J50l86L67j31
7284a8J95k44K24j54o5j96M50k19R6k84L50j40J39j83N9l5k54K19J49o4K4rj7
7307B3K56m07j48K67J38K6k03K19j27j96K27Rk26J08K26q1l40K25Q1q6J39jk19
7330i0P7O7K35l17pJ18P6k06n0J71j83N7J39N3l49L68k10m8L74l97J73N4j55N0
$$ plain form
7165 75 -79 107 7 131 -3 65 -361 173 14 120 -26 -71 159 -77 171 7 -286 -179 -205 128 60 327
7187 327 -97 -16 89 -325 -147 -182 -279 18 98 -68 266 -124 96 20 -45 33 -4 218 213 110 3 -9 174 51
7211 51 -154 257 175 197 93 184 44 -152 39 199 -8 -1 -185 213 -84 -6 42 33 -39 -83 122 37 -113 -175 -54
7236 -54 -66 -51 14 14 -105 -107 31 -29 -25 92 17 103 68 69 -300 57 106 -214 141 -4 49 -222 -33 -114 -5 104
7262 104 76 -17 176 117 -230 210 -109 110 -122 -100 155 196 57 -129 243 -236 9 -18 132 -254 113 -18
7284 -18 177 -67 157 3 -62 -258 192 -27 69 -215 135 -5 134 -49 10 -25 -279 -60 89 25 49 40 23
7307 23 279 -128 -276 -9 129 155 -48 171 44 -152 75 84 -142 -34 192 111 -229 -4 77 -9 130 129 -90
7330 -90 -13 54 289 -28 -35 83 159 -47 -97 74 -109 -52 87 140 -209 159 -51 -99 275 -122 51 105 -50 0
7354@j2n2K59k54L28r4k36Ml9J56P8j08n8R2k2N9k23Q7o4K8L1P9K09k86J43j02
7380Cj22n5Q0K13k6l42J60M3l12L04n3k0N9J50L1K5k52%j95L84m0l9J6L9l0j2
7406IK3j39J57J7p7j04k77JN02P2m3l61J99J3K9j90J99j86j03K41k07L84L8k00
7430cK93k17k99K21O2m42M01K32J8m28k7L22j71%R7K4k4l2L6J6n0k3j79J79R8
7455A04j32p8K49j55j25J01j45K19k03r4L3O56o46M85l36N0p6K21n4m1L17l94
7477d4n7q0j35K94K4q7L63k29j35Q7Kk17N69l80R5l2j9lML22k21n9l1L1j39K80
7503B03L1j22j51k45K66L1l3j0l4q7l4J88J78j85R0qm9p4J36j54m9N4P6O4k86
7528b04L88j16k19J60J98j17q7M7K69k74j0j72J69j39j87K32J75j0l1J47k93J23
$$ plain form
7354 0 -12 -64 195 -59 269 175 -61 -57 -96 60 138 30 -28 64 42 101 -122 -35 -99 -71 -40 39 248 -38 105 3
7380 3 -119 -174 -94 119 93 -249 -89 -46 -358 -54 -107 -127 -68 82 113 138 -114 -114 -309 75 35 -4 12 51 21 9
7406 9 32 -107 50 67 -10 -114 -391 -390 112 184 141 -220 -21 -8 21 -169 30 -156 -259 -18 -225 159 197 -3
7430 -3 290 73 -226 -5 57 -385 16 248 266 -162 -189 133 -38 -38 59 83 59 27 63 79 29 6 -173 6 104
7455 104 -28 -106 143 -12 -137 -36 -181 38 -165 -259 -226 430 -216 269 -67 -17 -93 128 74 33 350 -44
7477 -44 -101 -181 -316 -22 2 -85 278 49 -86 1 3 -214 355 -25 70 38 19 16 20 342 121 62 31 62 -77 203
7503 203 234 112 -39 -284 -18 13 -20 -30 -64 -151 -185 3 181 -4 86 78 29 -45 91 -63 -112 -58 18 82 -204
7528 -204 184 68 -151 9 207 90 3 50 319 45 35 -137 32 -107 -294 -62 113 103 72 219 -74 49
7550D9P9m8j2j51J21k32n8M54k63l6J39K3K8k58J13K95o25L23k0o4J46Q7k96O5
7574a41K01J80k59K30j91M1M0j06J9L1J14j01J70j31O0K71k00k49j79Q1J41k52
7596b30L92j79k15K90l33M81l43j8K46K77l96n8K26k4j49K18l72K47lp6J63M6
7618A90r0j4p3o2M9J99l24j04L41K9k20K1k0K04l0j48O6Jk32K18J09q7j49L09
7642A83j38M2l53J75J24j4N8o6J09l13L71j29k71mJ91J61k65j7J97P7l40J19K42
7665A39k79K11k66J83rJ72k02J0k1M05l17l60J99J50Jj01L04j19P5L7j29O0j02
7688D1L1k92M12R1o39J20L72l86J58J03j05Q3k24K68j85J28J41l58L91j67K6j05
7710i6J03K13l47J10j7K06j96l34L40j13K10k64K52O0k78J32P9J26k67K11j53
$$ plain form
7550 49 128 80 68 -83 38 -194 -252 202 -61 -97 42 65 93 -165 -52 243 -382 -59 -79 -143 3 90 -206 -141
7574 -141 60 240 -19 211 20 61 101 -5 14 45 159 58 228 97 157 428 228 -21 -200 -119 22 -230
7596 -230 162 -17 -232 58 -275 206 -137 -155 91 368 -28 -86 140 116 -33 185 -187 60 57 -19 144 190
7618 190 100 86 13 -49 0 199 -125 -229 112 141 -79 -58 -78 126 96 -52 14 15 -217 1 110 23 -126 183
7642 183 45 87 -266 -91 33 19 77 11 120 -193 178 49 -222 -226 -35 126 -139 -156 41 118 -222 -103 139
7665 139 -140 71 -195 -12 -21 151 -51 -41 -62 343 26 -334 -135 15 16 -85 219 100 175 212 83 143 41
7688 41 72 -220 192 283 -356 -236 136 -250 -92 11 -94 -11 -235 33 -152 -24 117 -241 150 -17 9 -96
7710 -96 7 220 -127 -17 -34 172 -24 -358 -18 -131 79 -185 67 127 -151 -19 60 186 -81 130 -23
7731b3j5Q3j02O6J96j50j05k46M38r5o5p8M0p1m6n9Q0M0J27m8L15k76l5J07K04
7756B82j78l8j17O1K18n5p0K2N6j90J3j02J74j96J32l88L02L32j98j97J4J06L2
7779A5n7K37j47n4k4J67m20L13J20m02L20k23J03J84j43J79k77n9J71J56m10K71
7801B0O3j41o5K14J07o4j79l8K27n3R1k68J59l9k17L16J77k53K19k36J44j74J82
7824A92j54j90K00Kl6L71k73L1j86M2O6l8qk41K66J88l07N6J9J08k1K9j32K1J53
7849A58k27j35J0K86k89L87j96j27L0K36j70J19k73P8J67L4j22O9k23P4j55K48
7871b1Qj72J22L7J58k46J45j43K28l22M2QL1Q7J40Q9m7j68Q9j54n0K6K34o7k78
7896b24J62K38kn05L44J09j77J79O0q1n8R4j25j38R9J95O4k58j52J45K2k28j3
$$ plain form
7731 -23 -38 45 -57 9 205 55 -50 -296 142 47 -18 -96 -56 -127 -173 -232 -152 -112 15 -33 282 6 -29 78 282
7756 282 104 66 -51 10 228 173 103 125 181 -9 4 -98 76 -120 12 -376 -74 258 60 -137 -123 -17 15
7779 15 -42 195 48 -6 -30 137 -283 30 150 -252 68 -155 -52 132 -11 168 -109 -168 3 159 -251 20
7801 20 83 -58 -123 91 198 134 -45 -83 144 91 182 -86 73 34 -183 133 310 57 276 40 184 10 192
7824 192 38 -152 48 50 14 385 112 143 -43 -1 65 27 19 -222 44 232 -75 -19 0 108 87 116 -16 5 158
7849 158 -69 -204 -194 92 -197 190 -6 -133 -103 133 -37 82 -191 -113 54 88 -34 35 -188 -114 -269 -21
7871 -21 -13 -185 -63 -26 132 -114 31 -112 116 -206 -164 -156 -125 -38 102 191 144 -24 65 -89 -139 -113 121 54 -224
7896 -224 -62 176 174 -331 13 122 -55 124 184 103 45 139 14 -124 -25 170 234 -24 -176 -31 -9 -237 -250
7919b50J91JL4J89j26oJ22J00m4J56k58k31J53m4L3o5J7p8K04N0N6m05RL03j44
7944c3j19K35j99O8J43j11n6N9M54n40J2J4J79j06n3j19oK02P2l0j16J81j86r5
7968a50J99l50M94k3j33p3R9l19K68l96M86K0j32O%J7k11L83k68L8K03j57J25
7991A26k86K77k38K98j61r1Q1j04l5K14r5K3k29J05K25n2k96L61J07k83J70j37
8013b0M9j52J21J0K25k00k5r5J02l20K61R8J4K2j66J98k64n4J42J00j8J43k7L2
8037A76J8J38m01m2J02j89J03M0R0j00M4KJ00J27m18L00l22M36l71K2J36L83m62
8060h8ON3n2j4J0j76JK40K71j83j67J95j01K5M6K50j50k55J21j55N40n60J35L09
8084C01k75K4m9K18l24J88j07l4L31p7k85nn4J79k5n6j10M14k58m5j6K46j58M4
$$ plain form
7919 -250 -59 -58 -24 165 39 33 155 255 211 367 109 -122 31 -13 20 -45 -28 -106 98 148 204 -201 -192 111 -33
7944 -33 -152 83 -116 -48 95 -16 -72 -13 441 -99 -87 -73 106 0 -53 -172 -178 24 96 66 -50 131 -55 -150
7968 -150 49 -301 193 170 37 -36 63 -256 12 -384 102 122 -10 -4 -4 13 -198 185 -83 -45 158 1 126
7991 126 -160 117 -121 177 16 -75 6 -98 -133 81 -14 9 -220 -115 110 58 -238 123 230 -53 117 -20
8013 -20 29 -123 -2 8 233 33 8 -87 15 -305 -44 54 68 90 -76 122 -142 -196 -54 46 28 171 144 176
8037 176 194 332 -69 -111 -9 -198 -95 -55 35 -65 -21 -19 81 208 -210 90 -232 204 -167 -145 -9 374 -88
8060 -88 -82 -29 -81 -95 -85 -261 -260 -20 251 68 -99 96 -5 20 66 316 166 -89 32 -123 417 -143 -8 301
8084 301 26 50 1 219 -105 83 -24 -58 273 196 -89 -94 -148 31 6 -50 -160 254 -4 -49 -65 181 23 67
8108F7j9k57M01k21J49p5j04J12j27k44O73n66N87m13j6k6nn8J66l25J42L08j3
8131A36j85m2k92L00OqJ81m6N2k25K60k58nl3l8J95J33l81N34n21L26j70Q8j79
8155a72K95l37L92l24j34L13j74R2p9O6mM3j24R8K8J26J9j30j45L99j52n4P2j61
8179d7M4p4J58l0j44J22K52m62L04j96j10L47
$$ plain form
8108 67 48 -209 192 -29 120 45 -59 53 -74 -318 355 -211 376 -37 -53 -79 -84 -142 24 -301 -159 149 136
8131 136 -49 -91 -383 -83 -77 -85 96 50 102 -123 137 -121 -126 -159 -197 -2 131 -250 284 -237 89 -81 7 -172
8155 -172 123 -214 178 -146 -280 33 -141 -49 -128 -62 -66 -23 -147 -49 -21 105 124 -6 -151 248 96 42 114 -47
8179 -47 -3 -77 81 51 -93 29 281 -181 123 -73 -183 164
8191A64
$$ Imaginary data points
##PAGE= N=2
##DATA TABLE= (X++(I..I)), XYDATA
0@%%%%%%%%%%%qJ6j6J6j6K4l2M0m8N6p2Q4r6J16j36J53j77K08k40K73l12L54l99
34b12M53n14N78o46P22q06Q98r98J108j229J360j503J659j830K017k223K449k697
52a414K973l279L620m003M438m935N508o182O982p950R157j0707J2779j5707K0196
67A1476k8022M5584j60777K0336J67255j61224N2351J06956l4989l5107Q8406
78G2245j9977l4849M5892N887p7685L6796L8469p1414j7304N3409o0364m0299
90f9194N3267l419l7284L2216P271j9324J8949K0519J449L2335J9414l6609j0844
103H746M7217p715m9122J400j809l1550R715L697k1481K0285J7280k5617J2177
116a6777L8480o327j1044K5984L085l6058K83K7828j4334j4365J3862j3118j5908
$$ plain form
0 0 0 0 0 0 0 0 0 0 0 0 0 -8 8 -8 8 -8 16 -16 24 -24 32 -40 44 -52 64 -72 81 -96 112 -128 145 -167 187 -212
34 -212 241 -273 305 -341 381 -425 473 -525 583 -646 714 -789 870 -960 1057 -1166 1283 -1414
52 -1414 1559 -1720 1900 -2103 2335 -2600 2908 -3274 3708 -4242 4915 -5792 6987 -8720 11476
67 11476 -16546 29038 -131739 -111403 55852 -105372 -53021 53935 18946 -16161 72245
78 72245 52268 17419 63311 69198 -8487 28309 66778 -4636 -21940 31469 -28895 -69194
90 -69194 -15927 -19346 -56630 -24414 -17143 -36467 -17518 3001 4450 36785 56199 19590 8746
103 8746 55963 48248 -874 526 -1283 -32833 -23118 -19421 -40902 -20617 -3337 -28954 -16777
116 -16777 21703 15376 4332 30316 33401 -2657 -2374 25454 11120 -3245 10617 -2501 -18409
129a8409J6090q95j2150P351m259j4450O025J9061O161m199O227J0787l376M39
143A4403O598n760o037l430j0085n523k202L18O109m205n653O829K735L243J1654
158H994j309p156J957J126m61J797L242j761r493m5O626m639N58M957r353l197
174h157N878l029J02O384P72j577K26J893L170l08L84j257q395j489K486j647
190d564J304n5j451L217K0J610P848k152n010L523r45l466K160J481k881l859
206c220L83K072l469J465M735n508k700N096j965O56O217j057k591K012J991O12
222D729j99O65j048n336k95M89l402J297J932n182L60M520K23Q77K008J997m00
239C235l091J368K988k142k19l05l121J94J769q88k78r90r11M7j733J465L292
$$ plain form
129 -18409 -2319 -3214 -15364 -8013 -12272 -26722 -20697 -1636 4525 326 6553 17340 13964 14403
143 14403 21001 15241 9204 5774 -4311 -9834 -12036 -11718 -5609 -9814 -15467 -8638 -5903 -2660 8994
158 8994 7685 529 2486 3612 3151 4948 8190 6429 -3064 -3109 3517 -1122 -564 4393 -4960 -8157
174 -8157 -2279 -5308 -5206 1178 1950 373 599 2492 5662 5354 5738 4481 -3914 -5403 -2917 -4564
190 -4564 -3260 -3315 -4766 -1549 -1529 81 7929 5777 767 4290 3345 -121 2039 3520 639 -3220
206 -3220 -2837 -765 -4234 -2769 1966 -3542 -6242 -1146 -3111 -2455 3762 2705 114 2126 4117 4729
222 4729 4530 5195 4147 -1189 -1484 -995 -4397 -3100 -1168 -6350 -5990 -1470 -1247 -370 1638 3635 3235
239 3235 144 1512 4500 2358 2139 1834 -1287 -1093 676 -212 -490 -1480 -2391 -2344 -4077 -2612 680
256F80j666o94K628k73J589J857l94k52j698o55j20k433M66Q77k949r06J315l61
274b989K068J397p79j0O61J77Q97m73J427M26k905R22J433j159Oj19j950l51o02
293a923j58k43O7Q19k07j290K455K494p87K65O96o37Q1J76p0o29j130n15j88j440
313b164J589Q44k027K46N89m50N26O17J19M60l51K77M89J43J368j0j853K40M35
332A087j054l21l8p95k00q91L86Q46K16O82N4m96J066R15o78O46m74l18K41n41
352C33J59L50q84Oo70l12P93K37j147L67K42l86O04j59J344lp03N25J84m98R78
373A360n21j070K8j47l27k15M98J67j90o41P24M74l67J018l2o47Q8K39j0N04l89
394E44l47Po06K24K8l53L39p07k48P06J83p7N12m7k7K23p9L38L54n92k91o1k36
$$ plain form
256 680 -986 -1680 948 675 2264 4121 3727 3475 1777 1122 1002 -1431 -965 -88 -3037 -3943 -2628 -2989
274 -2989 -921 476 -303 -313 348 525 1422 949 2376 2802 -103 819 2252 1093 1099 980 -970 -1321 -1923
293 -1923 -2081 -2324 -2257 -1438 -1645 -2935 -480 2014 1227 1492 2188 1551 1632 1808 1738 1109 -21 -536 -724 -2164
313 -2164 -575 269 -1758 -1512 -923 -1373 -847 -230 -111 349 -2 275 764 907 2275 2265 412 652 1087
332 1087 33 -288 -326 -1121 -1321 -2212 -1826 -980 -764 -82 -28 -524 542 1457 779 1425 951 633 874 333
352 333 492 842 -42 -36 -706 -1018 -225 12 -1135 -768 -526 -912 -308 -467 877 874 171 696 880 382 1360
373 1360 839 -231 -203 -350 -677 -892 -394 -227 -417 -1058 -334 140 -227 791 759 112 200 439 429 933 544
394 544 197 204 -402 -178 -150 -503 -164 -871 -1119 -413 -230 -307 205 158 131 354 275 613 967 375 84 23 -213
417b13K35L1m83M2K99j48k45J77O65l62k88O73p9k48K14J36l52L10k17j54J44
438A37j1K28m82l95J13J11k19O61j00l93O18P0j43L07m08J96l60l09L58n9o8K40
460I2m39j74M72L4Q6N4k74P5KK39J52J35p16N67l92l28L66J70j86j13lJ01l24
483d04K11M24n4m84N74j24k98M01O5l95j12M69p49J42O4J88k96k02N17J0M1N20
505E08n50Q6k4P0o2J71P8j7j10l22L54J66k33k39k52M44J1l19K95j54J53O7l90
528b69M25M07j20l35K62k85k9q5k0j07q8j32J30pn1L35m60O56k55J20K56l73J57
551A32n1K31k06l4K8J20N0j77l56l2K80j50J00o5n1J64l7M33j44l7J12j56K01
574C55j93o3j36J79j45k81l26M60K72j88Q3kk77M48j9j57K02O8r5j21n1j02L28
$$ plain form
417 -213 22 53 -430 -388 -89 -237 -482 -305 360 -2 -290 383 304 56 270 406 54 364 147 -7 137
438 137 126 354 -128 -523 -410 -299 -518 143 43 -350 268 338 195 502 94 290 -70 -379 -21 -80 -148 92
460 92 -347 -521 -49 -15 71 125 -149 -74 -72 167 319 454 -262 305 -87 -415 -49 121 -65 -178 -181 -80 -404
483 -404 -193 231 177 -307 267 143 -155 246 311 -84 -196 273 -476 -334 -270 -82 -378 -580 -63 -53 -12 508
505 508 -42 44 20 90 28 199 277 260 150 -172 182 348 115 -124 -376 68 79 -240 55 -99 54 121 -269
528 -269 156 563 443 108 370 85 56 -29 -49 -156 -244 -376 -246 -253 -304 31 -429 227 -28 92 348 -25 132
551 132 81 312 106 72 100 220 270 93 -263 -295 -15 -165 -65 -130 -181 -17 -54 379 235 198 310 154 355
574 355 162 99 -37 142 -3 -284 -610 -150 122 -66 17 15 -262 186 167 10 212 280 185 64 13 -89 239
597B39l49K69k30l4qK41j51k18J93j86MK21JK8j95K95j03mJ00P0k07N4m1j38J18
622c1l4M3r2J07L8m3J05k30K21k06L0n1L40j86l6J60j92J56j49K02o0j44K79l05
646g8j80O8K47l30L97k92J77p8Q0o0L31p2m71M57k54O6l4L3n1K90k27j64M9K68
670A72m74L41j23J24rl7K5m4j2n8N5j11o1K07J95j73k1K87l2k83p7K18k3lk12
695a29o3J79M8k30K69k51k1O8J64J68l25L50m52M36k84q7R4o9L64k48m4n6J15
718dJ8K32P7m33q3J28j2J82j22K30j47k6l6J52Jk03Kk57K74P8j21L3R1Pk88kL93
745A64k09N2K11l30k04K84P0k14J70J27j38Q6j35k06K24m1O3J9J7n2J61j91J75
768A03L2J70k66J09j24p1j6j87J85k18L28Lj66K19r6o7O1O5N5j92J00J89j40k94
$$ plain form
597 239 -110 159 -71 -105 -113 128 -23 -241 -48 -234 -230 -9 -8 20 -175 120 17 13 113 183 -24 30 -11 -149 -31
622 -31 -65 -22 -114 -7 31 -12 93 -137 84 -122 -92 -143 197 11 -25 135 -57 99 -50 152 92 -52 227 -78
646 -78 -258 -190 57 -273 124 -168 9 -69 11 -49 282 210 -261 196 -58 8 -26 7 -44 246 19 -145 -96 172
670 172 -302 39 -84 40 31 -6 19 -25 -37 -95 -40 -151 -212 -5 190 17 -4 283 251 -32 -109 109 86 83 -129
695 -129 -192 -13 35 -195 74 -177 -198 -130 34 202 -123 227 -225 211 -73 -160 -66 -135 229 -19 -63 -119 -4
718 -4 14 246 323 -110 -193 -65 -77 105 -17 213 66 40 4 156 157 -46 -44 -301 -27 51 -70 -37 54 61 -227 -229 164
745 164 -45 7 218 -112 -316 -32 38 -176 -6 121 -17 69 -66 -272 -48 -89 -26 -7 10 -42 119 -72 103
768 103 135 305 39 148 24 -47 -63 -250 -65 -283 45 48 -118 101 5 -62 -1 64 119 -73 27 216 76 -218
792b18J45N6k8J18m1J22Jq0q4J1r0j28K52k47K21k50M0M20m7k77J57l0m8j58J84
817Amj11J40j30N8P1q0o2J8k08M46m94N58m7l31K64o2L1K6J11m5Q7l72K79K44
842C88m59p6J7J68j08j37L46j13k15J48pJ61J56j51J13k88j05J70p7J59K2k21
864a09K58m01J87J25q4j23M1L7n0p9K25M7k04J04K53k79j03K21j30K11j53j18
886a24N0K24k12J20o4r7J47l32L66J42l11R8p9L00m85L41p0q4L50j57j06j9l27
909c29M75j46j07l8oL23j57L6l55K27m7P3O0M0r9o9K17L8j88k20N20J40l79k26
933b17N9J94N8n0K24m96L24K03m13J61r2l58K76q8K84p4L3j80J81J43l06O0k99
956c73M40q2rJ36k12J7P9J89m7m7j24k39M98k80r7L9j27K39j15LJ40r9J65k35
$$ plain form
792 -218 -73 -17 -45 73 32 154 155 75 -9 2 -88 -216 36 -211 10 -240 -200 220 173 -104 53 23 -25 -183 1
817 1 -3 -114 26 -104 -46 25 -55 -117 -99 -307 139 -355 203 156 -175 89 27 58 84 195 150 237 -135 144 388
842 388 -71 -147 -130 38 -70 -207 139 26 -189 -41 -48 113 269 118 231 -57 -162 8 -69 90 112 -109
864 -109 149 -252 -65 60 -24 -147 -106 -69 -119 -198 27 74 -130 -26 227 -52 -155 66 -64 147 -6 -124
886 -124 -74 150 -62 58 -6 -103 44 -288 78 220 -91 7 -72 228 -257 84 14 -70 280 123 17 -2 -329
909 -329 146 0 -107 -145 -151 172 15 51 -304 -77 -124 -51 9 49 -50 -119 98 136 -52 -272 248 388 9 -217
933 -217 -158 36 94 44 268 -228 96 299 -114 47 -45 -403 -127 -215 69 -5 28 -152 29 172 -134 -74 -373
956 -373 67 -15 -24 112 -100 -83 -4 185 138 91 -33 -272 226 -54 -151 -112 -239 0 -115 -112 28 -71 94 -141
980a41K16k65l4L41j26o8K1Kp0L1J89K7k32K17r4k32J31K46k37J21l32J31N09
1003C51m66k15N37l7l9p8l22K94N3k59J12K9n2k3J60P4l06J48J46j2j27Q1lj33
1027h7J87j09P1j84K48J5n6J1k96K72k18K49j79K73k13Q0l43J92K55j63j2j19
1049a26L9J70k65J96L2l36K36K7j6K04j73N1l24L63r7J01j01J05j31R6j64K0o
1072i9l5L3J61J24k42k6Q0p0J32k78K97j82k6QJ58q8L8R4m11M44r8j8lj75J43
1097c9k09q4N48k16j09p9K02k75O4N2J67Or2O6j38R9m3K64j55m9J59k71K06o5
1121Ij12Q0l0M3rR4k57L01j48q6qP0j81L98l06J67L6j05LL9Kj11j10K17K1q4l0
1148i7R4K6j28M3L9L9J5R1L6j26q7N2Jo3p0n6K82M8j63J37l68J66j68P4K27P3
$$ plain form
980 -141 75 -190 -224 117 -9 -77 -56 -54 -124 -93 96 123 -109 108 14 -218 -87 159 -78 43 -289 -158 351
1003 351 -115 -330 207 170 131 53 -269 25 78 -181 -69 -40 -92 -115 45 119 -187 -39 107 95 -32 49 46 -87
1027 -87 100 -9 62 -122 126 141 85 96 -200 72 -146 103 -76 197 -16 64 -279 -87 168 5 -7 -126
1049 -126 -87 83 -182 14 46 -290 -54 -27 -43 161 -12 39 -285 78 -19 82 -19 86 -45 51 -113 -93 -99
1072 -99 -134 -101 60 184 -58 -84 -4 -74 58 -220 77 -105 -131 -123 35 -53 -15 79 -332 112 14 -4 -7 -182 -39
1097 -39 -248 -332 216 0 -109 -188 14 -261 -197 -145 22 28 -64 2 -136 -37 -80 184 29 -20 139 -132 74 9
1121 9 -103 -23 -53 -10 -19 75 -182 119 -29 -115 -123 -53 -234 164 -142 25 61 -44 -41 -2 0 -111 -221 -4 17 -67 -97
1148 -97 -3 23 -105 -62 -23 16 31 122 158 32 -55 -3 -2 -65 -135 -191 91 139 -24 113 -255 -89 -257 -183 44 117
1174A17p5p5N1n2P3k57K12K39j72J7k04M6J77j90O6j08J32k61L31p7J17l45L88
1197A50j02n1j94K11J57N8l52M58k10j57k49L43j40J62R7M4j34j70n4K50k27K77
1219A67l00K84j0pl0j45j8M9n7jK05j31N6J8P2k0j91K94j26j62K53J5R7l94Q4
1244BJ79k95J19l3j8J4R2o0j58J66M1P3l69L10L3q4n6L4n5j00K39o1K6j67L24
1269A96k39n5J25k3j02r8M00O4m49j27M66p3R8J96n56J29K9J77l77K97k07J54
1291B5K47j82ql11L33j8j42R1o3k91M91j19j04K64j00k81J91p9j03L12r4k30M43
1314B72l35q3L21q2j81O4l8K36P8n6k72n4L22j73J05k30P4m8O9j4K11K16o84K95
1338A3p3J31j14O6k31L08l18M9K08j45Q2j48L4P1J1j2J9N6N3K7m9K6r0P0r5J03
$$ plain form
1174 117 42 -33 18 -34 39 -218 -6 233 61 78 -126 -80 97 -93 -27 -135 -3 -264 67 -10 107 -238 150
1197 150 48 -3 -197 14 171 229 -123 335 125 -32 -281 62 -78 84 181 225 91 -79 -133 117 -110 167
1219 167 -133 151 141 134 104 -41 -59 -10 -67 -68 137 6 62 80 152 132 -59 235 109 -53 200 215 312 -82 2
1244 2 181 -114 5 -28 -46 -32 60 0 -158 8 49 122 -247 63 96 12 -44 -10 -65 -165 74 13 39 -128 196
1269 196 -43 -98 27 4 -98 -196 204 268 -181 -308 158 85 183 379 -177 -48 -19 158 -219 78 -129 25
1291 25 272 90 82 -229 104 86 -56 35 -28 -319 172 53 -51 213 113 -168 23 -56 -159 153 59 -171 272
1314 272 -63 -146 175 93 -88 -24 -62 174 252 196 -76 -130 192 19 124 -106 -32 -80 -11 -25 186 402 -282 13
1338 13 -60 71 -43 23 -208 100 -218 -169 39 -106 -24 -172 -138 -67 -56 -68 -49 7 60 87 38 64 -26 44 -51 52
1364E2Q8l75L77J86m67K21j40j1L42j99qL6J17k12j2O2pj19Q6k12L62l27J95k41
1388b06K01J57o5j5P7k98J96jn9M5j49k1J07j75L48j59j30J44j32J41j40Q1n6
1411a09%j08K17j92J41q5qJ25J25L6l5k48K41l9m18O43n29R7K88j93j39K15k20
1434a95L45j89J28k03j41M39j49k9K6j3j36K43J37m58J98rj59K98r7j19J77n4
1456D0R2j71K51j83K3P6pk0j44K55j91l28J4K31J34K0j03J26k8R0l18J50K02l41
1480a30n1K21k0k45J54J14J71k12R6l4K56l77J0j53M9J10r6J23q0J91j52L6Q2
1503F3j67J85j83O5P4Nk46N05m66Q4j0P1L55j84l98L38p4j21K78j27j30J42J23
1526A82k48K72q2l55K47O6l86M05n1R5j76K49j79K01k65q1o3J27r2J8m1K13j0
$$ plain form
1364 52 140 -235 142 328 -139 82 -58 -69 273 74 66 102 219 7 -5 57 50 -69 17 -195 167 -160 35 -206
1388 -206 -5 152 87 72 149 -149 47 46 -13 32 -117 -138 -31 -206 142 -17 -147 -3 -135 6 -134 -53 -109
1411 -109 -109 -217 0 -192 -51 -136 -144 -19 106 142 107 -141 100 61 -357 286 -243 -146 142 -51 -190 25 -195
1434 -195 150 -39 89 -114 -255 184 35 6 32 19 -117 126 263 -195 3 -6 -165 133 36 -83 94 40
1456 40 132 -39 212 29 52 128 121 101 -43 212 21 -307 -293 -62 72 92 -11 115 87 177 -141 9 211 -130
1480 -130 -181 40 20 -225 -71 43 214 2 98 64 320 -57 -47 -200 -151 -41 -137 -14 -94 97 -55 -19 63
1503 63 -104 81 -102 -37 37 42 -204 301 -165 -81 -91 -20 335 151 -247 91 17 -104 174 47 -83 59 182
1526 182 -66 206 124 -231 16 82 -304 101 50 145 -31 218 39 240 -25 -106 -169 -42 -134 -116 -157 56 46
1549D6n4ql34M21p7o2p3L12J9n52N87j86Pk48L50j55r3L01k85O2j24R4P8P2j42
1574d4k2J57j49Q0K07r7j46j43K85k44J0K52L2k25J29K4l06L26RJ91m25K24k2
1597A03j39j55N3J87j5O2J01k16j78L35j29Q2j00K41j78K0j50J03j64J91MN5j23
1620a0M8J58k18m0K14l01J29j00k07L04J09J36j07k53k3j47J45J73J23j42J50
1641A41j14M3K8J08l06j05J53K81m82K57K57l60J19J05K8k94J60l2J94l25P4J22
1663E2R0j61j77L94j76j56m4NL23j72R7j53J31N7j68J12J78l03j11L46k16K17
1685A65j89j20K21lo8K33l59J04J39j36J79k88K07k8O8l12l8L71n55O02p3j76
1707e6K16j32k11J03J93j74O6j33l4K32l2n9N3l13K11n7M7M09o47L91q4L9l81
$$ plain form
1549 46 -8 -16 -350 71 -6 -68 -141 171 190 -362 225 39 46 -202 148 -7 -100 201 -84 -22 -146 -52 26 98 -44
1574 -44 -66 91 -58 22 229 132 -14 -157 128 -116 -106 146 178 -47 82 106 -200 126 135 326 -99 125 103
1597 103 -36 -191 -138 49 34 96 197 -19 -197 138 9 91 -9 232 54 74 -76 27 -137 54 58 113 -10
1620 -10 38 196 -22 -62 152 -149 -20 -120 -327 -23 86 222 115 -138 -161 -308 -163 10 133 -9 141
1641 141 27 70 98 206 -100 -205 -52 229 -253 4 261 -99 20 125 153 -141 19 -13 181 -144 -70 52
1663 52 142 -19 -196 198 22 -134 -178 -173 150 -22 75 -78 53 110 -58 54 232 -71 -182 164 -52 165
1685 165 -24 -144 77 74 6 239 -120 -16 123 -13 166 -122 85 57 125 -187 -225 146 -409 193 120 -56
1707 -56 160 28 -183 -80 113 -61 5 -128 -162 70 38 -21 32 -281 -70 -127 -80 329 -318 73 -11 28 -353
1730c53J11J23N7Jj67O6M98l84j5m8R9R9j79L9j81M6J31K62k11P6M8J01k80J03
1754D2J84q7J24j47m6J16J0m17L76l48K99R7j84Q6j26K35k96P3J63j26j61M3K54
1777A64j86J38j72L1K14l85k36L86L42k40k43j5L90q7J61j95l60J53O4J85m9o4
1799dk47P9J79R7J2l7J49k39j12K49m30K87o6j12j7K61j65L85n09K45k15K61J42
1822A93r0l13J17K03m5j5l6K67k24o2K38j22J06j35m3N9K18n06oL15kO1k57L2
1846d7Q0r3J15k11J44K06l01K94j8k83L50k49J7k3j51mL32j16oK47m60r5K86n5
1870d1j77K40J77k1m0j61q8q7k05K96L29j73k09m8M94n68M63k31R7m5k85M33j50
1893@Oj46J72J6L7j4k39L3OP8loJ52J5j34N7K5k0k05J74J31o4P2j08r3m4K37R0
$$ plain form
1730 -353 -242 -119 -62 -61 -228 -162 336 -48 -63 -111 -12 87 -92 -53 -234 -188 -57 205 -6 70 118 219 -61 42
1754 42 226 139 263 116 70 186 196 -221 155 -193 106 203 19 105 -21 214 -82 -9 154 28 -133 -90 164
1777 164 -22 116 -56 -25 189 -196 -432 -46 296 56 -187 -202 188 101 262 67 -293 -140 -76 109 60 -4
1799 -4 -251 -172 7 104 116 79 228 -11 -123 126 -304 -17 -83 -195 -212 49 -116 269 -240 5 -210 51 193
1822 193 103 -210 -93 110 65 50 14 281 57 -5 233 111 217 82 39 98 316 -190 -196 119 117 178 -79 -47
1846 -47 33 -60 55 -156 -12 194 -107 187 169 -114 236 -13 4 -19 -170 -174 158 42 36 283 -177 -272 14 -41
1870 -41 -218 22 199 178 138 -23 -111 -198 -403 -107 222 49 -160 -208 286 -282 181 -50 47 2 -283 150 0
1893 0 6 -140 32 48 85 71 -168 -135 -129 -51 -54 -60 92 107 -27 30 55 35 -170 4 135 71 143 35 -58 -102 135 225
1921B25j41q5l04N09l22Q8J20K0l04K26k55M1K10N0m1K00k95M5j1QJ0J18k10J03
1945EJ55n9o9p0p2J71r4j31m5K20o0R6Q5j4o2j19L5J8J16j08p4R5M0k22j51J45
1971a69J84OK21k64J07j56p0o6K12K03l53Q1oJ76k21J25K4o2j12K32n4j17J60
1994H1l18J71k37N89n13K54j41K75j50j91P1K11q9J50l86Q5P8K35l92K83k86L37
2016A17N7m06K37j05k62M45J2j83L04l28K58j70k37N84k31j93K6M2J27l53q3N39
2038A97j44jj20J66n4l58K92k8K07q6j51L59j74J06k10L92lm15M9R9m9k65L32
2061A41P4o7l37K82K5k62m3K03M52l01m0N1j59k12K46k84P1M41m22j31J79P0J78
2084A55k5or5j01J65J1l2o0K5k7L8j51j41K8J54N7m7j95L18k63K31j68K73k34
$$ plain form
1921 225 84 -1 -305 204 -118 -30 90 110 -194 32 -223 -182 28 78 37 237 -58 -13 -24 -16 -6 112 -98 5
1945 5 160 101 32 -38 -110 61 -33 -164 -209 11 -49 47 132 118 56 -63 -28 -10 106 -2 -76 19 59 -163 -314 -169
1971 -169 15 21 242 -22 85 -71 -141 -207 5 208 -145 -64 -70 106 -115 10 34 -28 -140 92 38 -79 81
1994 81 -237 -66 -303 286 -227 27 -114 161 11 -180 -109 102 13 163 -223 -138 -60 175 -217 66 -220 117
2016 117 174 -232 5 -100 -362 83 95 -88 216 -112 146 -24 -261 323 92 -101 -75 -33 94 -259 -342 197
2038 197 53 52 -68 98 44 -314 -22 -50 157 71 -80 279 105 211 1 393 390 -25 24 123 74 -191 141
2061 141 215 148 -189 93 118 -144 -187 16 468 167 127 178 19 -193 53 -231 -160 281 -141 -272 -93 -23 155
2084 155 130 124 29 -72 93 104 72 12 37 10 48 -103 -244 -216 -62 -5 -52 -247 71 -192 39 -129 144 -90
2108i0K17j09J10r7j74K27j6n6m9J71k75J14k5r8mL1o2K14j36j35K78J60q2j46
2132c2k69M19M6n46J96J72K6j49J71j21l4K29n0k9Ml89N04N0j40j0j06q3J71j6
2156A4J39j29l8M6j39o0M74l15l5k9J16p8K44J8k52j55J65m8n4J46J17k41P1L04
2180B81n68M84j81j17r2M14j48P0l3q4k9j55J71J95j23k4m2M3R6k3j80k2J73j09
2204cM5k10j53M56k70K44p8k69K79K20l54J52k0m8N4j94J84j51J92J66l91L9J70
2227F0m0O1K37j76k54J19K39l68oJ50p6j55Q5j54M11l61M36k28M6j5K23J02m85
2250a49M11l62K33k63q3N24l22K02m67M55k08o2J62j81k06J18K60n7J36J20P0
2271C31r4j09k82L29j33j94R1J81j44J5l5j10K3K75k8k48rJ26l8N2r3J04j62L66
$$ plain form
2108 -90 127 18 128 31 -143 84 68 12 -37 134 -141 -27 -52 -150 -154 -123 -185 29 -107 -242 36 196 114 -32
2132 -32 -301 118 164 -382 -186 -14 12 -137 34 -87 -121 108 58 29 33 -356 148 198 58 48 -58 -141 30 14
2156 14 153 24 -14 32 -107 -167 307 -8 -43 -72 44 -34 210 228 -24 -179 -14 -62 -116 30 147 -94 -23 281
2180 281 -287 197 16 -101 -193 221 73 143 110 26 -3 -158 13 208 85 61 19 62 158 135 -45 -67 106 -3
2204 -3 42 -168 -321 135 -135 109 31 -238 41 261 -93 59 39 -9 45 -149 35 -116 76 242 -149 -110 60
2227 60 20 81 318 142 -112 7 246 -122 -128 22 -54 -209 -124 -278 133 -228 208 -20 26 11 234 336 -149
2250 -149 262 -100 133 -130 -213 311 -11 191 -276 179 -29 -91 71 -110 -316 -198 62 5 141 261 331
2271 331 237 128 -154 175 42 -152 -61 120 -24 -9 -44 -154 -131 144 116 -132 -141 -15 -53 -1 -94 10 -152 214
2295B14k81K55m4m01J80J83o3j77K91k78O6q4K65j84o1L4J49L08l88k10J18J21
2317A3k48J15KK5j48M68k85o6J96M2j73l74O28k58j45K29q5k7R2k19K35K08k09
2340A6K53q0k77J74p0m6N3j4N3j63K89j06p3rn6Q7q0J22j68J51k22j31M31r4J8
2365E8qq2J54lj26m8L1J38j26k8j3j43N3L70k81j9J15J0j68k1L22o4K61l01j8
2390F3o5j58J76o3J33l7k8L5J3k51J53j7n6K40j13j7k41R3J70j3l51L00J9o9O7
2415a7R7J7k29K86l04J65Rk00J77m9m8L36l33K12n5J37k99R8K28j65l69K84lj42
2439a67M1J29p0O4J17P8k13j97M1J77P1k6k26J22O7L69k98J75j24J52l64J40J6
2462G4k32K11j49j12J52J4K82m33J52R6j01n6n2J6M79l59P1n01N81N1r9J80k23
$$ plain form
2295 214 -67 188 144 -257 -77 106 43 -134 157 -121 -55 -139 126 -58 -119 -85 64 372 -16 -226 -108 13
2317 13 -235 -120 -118 -93 -241 227 -58 -124 72 114 -59 -433 195 -63 -208 21 -64 -91 1 -218 17 225 16
2340 16 269 189 -88 86 16 -30 23 9 62 -101 188 82 9 0 -56 31 -49 73 -95 56 -166 -297 134 40 58
2365 58 50 -32 122 119 -7 -55 -24 114 -12 -40 -53 -196 -143 227 -54 -73 42 52 -116 -137 185 121 382 81 63
2390 63 -2 -160 16 -47 86 49 21 56 69 -182 -29 -46 -102 138 25 8 -233 -140 30 17 -334 -34 -15 -84 -17
2415 -17 80 97 -132 154 -150 15 24 -176 1 -48 -96 240 -93 119 64 201 -98 0 228 63 -306 -22 -25 -167
2439 -167 -126 3 -67 -3 114 192 -21 -218 -177 0 71 45 -181 -59 8 377 79 254 130 282 -82 58 74
2462 74 -158 53 -96 -208 -56 -42 240 -193 -41 55 -46 -102 -154 -138 341 -18 53 -448 133 184 85 265 42
2485D2j37J72j99l5J50q0j79L27m9k75J68K6O8N9p0p7J28M6J27l25M63k36Q7k90
2509h9K9K11k55J87R4k06K05k52M5J34k81M28j87J59p7rj91k04L14p9m7J54k6
2532E7J54n6l34J31o8J13MN5J04k25R0o0j18L79m69K83j97K40K2l4Rj01J52Oj95
2557e8j54L23m08L00O2J52M9r0j20j10j20K0M18r8j1j60K51l07J2q8l6K32j93
2580a34J48R8k54M5j32j7L80j39k31K11M0N9j11L08l06L0J81k09R9j20J22p3k33
2603b38M62k06M8k71L25m26J22J27K3K3j90K15K6N1P6r8l38J50J70k5j94r3R6
2626a65K89P8k53%R9q1J49P1k99K29m98K86J42K88k24PL1M0m6o7j48o3K37j94
2650i2K60j47Lj71J02j33J29J76q1j37L26J18r0M9l88K91m53L90R5k50K04l80
$$ plain form
2485 42 -95 77 -122 -157 -7 -87 -266 61 12 -263 -95 -69 -1 58 -12 -89 39 85 212 -113 350 114 201 -89
2509 -89 -60 151 -104 83 177 -29 176 -76 -31 103 -178 250 63 222 145 136 -55 -259 55 -24 -71 83 57
2532 57 211 155 -179 -48 -116 -3 1 56 160 -65 25 -35 -153 226 -243 40 -157 83 105 71 80 -21 131 137 -58
2557 -58 -212 111 -297 3 65 217 266 176 56 -54 -174 -154 264 166 155 -5 246 -61 -49 -137 -173 59 -134
2580 -134 14 112 -142 -97 -229 -246 134 -5 -236 -25 15 74 -37 271 -35 -5 176 -33 66 -54 68 -5 -238
2603 -238 224 18 66 -205 120 -306 -184 -57 -34 -11 -201 14 40 91 167 69 -269 -119 51 26 -168 -261 -165
2626 -165 124 202 -51 -51 48 -33 116 187 -112 117 -381 -95 47 335 111 118 149 189 143 76 -72 -135 102 -92
2650 -92 168 21 24 -147 -45 -178 -49 127 46 -91 235 353 263 312 -76 215 -238 152 247 -3 201 -179
2672a79J52J56k08M0J34k89L40l1P0j36k77L73l29N61j22j80j78L71k68J27k86
2693a59J73nL3j09n3j1J02J4q5n2q3M18m73K67r8J52k4N4J0j81N4k9J82k00J90
2718H7j33Q2j93J32N2Q5l3N7j75k57J38R7K96lk02k20J04J99k58j5M1n1N7O3J1
2743c9J77q1j3N5j58J42J2j63J07lKJ02l49n2K77J81j32j91J38j30K52R9k08J71
2767A96r3k28K23l10R3k62O59l52O8r9M5J47j16K4j52K71q3r1M9n6q6J66r9L2
2791e4j29J62j20L40k02J9L2j66J94J71l36j78L70j33NK02k74R9R8j3k17K7M8
2814e5k8k4L72k57j52L65k45J66j42J4O3j90K56j38N7K0p7L8n1r0j5J97P7m4k71
2839a54K13K9o2j0j49N04n02R9m4n0L16m85L49LJ11j95J30j92Q0j45L78k38Q3
$$ plain form
2672 -179 -27 129 -79 -39 95 -194 146 115 185 49 -228 145 -184 377 255 75 -103 268 0 127 -159
2693 -159 14 9 42 -67 -120 -131 -29 -15 -100 -152 -235 183 -290 -23 -121 31 7 61 71 -110 -56 -85 97 -103 87
2718 87 -46 36 -157 -25 27 112 79 136 -39 -296 -158 -61 235 232 30 -190 -86 113 -145 -160 -119 -170 -113 -50 -39
2743 -39 138 57 44 99 -59 83 95 -68 39 36 38 140 -209 -261 16 197 65 -126 12 -118 134 233 25 196
2767 196 103 -125 98 -212 -119 -381 278 -74 -6 -105 -60 87 -29 -5 -157 114 31 -60 -11 -67 -153 13 -86 -54
2791 -54 -183 -21 -141 199 -3 16 48 -118 76 247 -89 -267 103 -30 -25 177 -97 2 100 87 -130 -103 -55
2814 -55 -83 -107 265 8 -144 221 -24 142 0 14 77 -113 143 5 62 82 5 43 -8 -98 -113 84 161 117 -154
2839 -154 59 88 26 16 -133 371 -131 -32 -76 -126 190 -295 54 57 168 -27 103 -89 -9 -154 224 -14 69
2862F9K2j0K06k61L70m97J29p1q6K18l29L61J25k32k29K06k21K85J36l31K47j31
2884b4j62J94o3k8J7M7k4K16j62j75J50l6k05J85j7n7J95r8Q3J39k90q0J78j03
2908a20J95q6J59m5j78j02J44J81q5m8l3l8J43k04K92l32J46J5m5k26J55K19j13
2931fJ30j81J37o0J90k92o3k2k7R5J05j18K00Kn28K68N8L58m84L37j61J44K10
2954B92p10N74l80P5L50P1k65j33J22j41P4p6M7N6N8Q2j55j58L43k76J92l3k45
2977b36M49k04K71l10k41M47j41k8N5K9j58N6J29j27k32K42J65j57k33K83k78
2998b19J38K93j73m8o9j31J57k1J41O0Qj98N9L01j76N1n6l86K52%%k32L68J44
3022B63L6m41J70j22J94M7m71K39oj25L30k07K31M1J3l52K4L03l64J3K60l8N4
$$ plain form
2862 69 91 81 287 26 396 -101 28 -43 -129 89 -240 121 246 14 -215 -9 -230 55 191 -140 107 -24
2884 -24 -186 8 -55 -83 -66 -19 -43 173 11 -164 -14 -50 -255 -70 -87 -144 51 -47 36 175 -115 -195 -17 -120
2908 -120 75 -11 148 103 -75 -177 -33 148 63 15 -18 -56 87 -117 175 -157 -11 4 -41 -267 -112 107 -6
2931 -6 124 -57 80 20 210 -82 -145 -167 -194 -99 6 -112 88 90 -438 -170 -112 246 -238 99 -62 82 292
2954 292 -418 156 -224 -149 201 272 7 -126 -4 -145 -71 -147 -100 -44 14 96 -59 -217 126 -150 42 9 -236
2977 -236 213 9 280 -30 -271 176 35 7 62 91 -67 -11 118 -9 -241 1 166 9 -224 59 -219
2998 -219 -81 212 39 -9 -78 -209 -52 -73 68 128 136 -62 -3 298 122 173 117 -269 -17 -17 -17 -249 119 263
3022 263 299 -142 28 -94 100 147 -324 -85 -91 -216 114 -93 138 179 192 -160 -136 167 -197 -184 76 38 92
3045I2m5k31PK83j8k99Q6K65k7Qj88K10k64M3o6L30O0l09j6L05j80k25K84j97
3069i2K28r7J40J9l46J2L43l29k3K10n0J20R0m24J1J84q0J59j98k3K37Kj40O8
3093B1J65k55j46N13l20M3m9J20l57K40j43K71l13M48j92OQ2p7M1k79K20j52K80
3116A67j56L04l35J19j80R5K00j39K4J69j62j77M1n0q3J23l3J33l5J52k54J71
3138I4m4N9q7j05L05j78P5k16k12N04k61R4J40m2m24K65q3j31M50k64J30j74K02
3161I7r0RR1j9k1k75K15J58j49l08N02r7J52m20K01j33J78j77N7P2p6l8j22j1
3185b04K85Mj55K02j18j46L05J3l39M09l37J65p2j8k75K65O0j75J21k64N10j08
3207A28l3P3l28J92N3J89l97K14o4R7rk58J11O9r9j15J49J58j40Q3J48j95J27
$$ plain form
3045 92 47 -184 -177 106 88 -211 -125 140 113 121 -67 143 -121 -78 -144 186 246 -63 -79 226 46 -179 105 -92
3069 -92 136 39 179 198 -148 -136 207 -122 -145 65 15 135 225 -199 -188 -4 -84 75 -123 -146 91 93 -47 21
3093 21 186 -69 -215 298 -22 21 -28 92 -265 -25 -168 103 -210 238 46 52 134 57 98 -181 39 -113 167
3116 167 11 315 -20 99 -81 14 214 75 99 268 106 -71 -30 -80 -163 -40 -73 60 25 177 -77 94
3138 94 50 109 22 -83 222 44 119 -97 -309 195 -66 28 168 126 -298 -33 -116 -247 203 -61 69 -105 97
3161 97 7 16 107 88 67 -208 7 165 16 -292 210 113 265 -155 46 -87 91 -86 -29 43 -33 -71 -193 -204
3185 -204 81 85 -70 132 14 -132 173 186 -153 256 -81 84 12 -6 -281 -16 44 -131 -10 -274 236 128
3207 128 95 168 -160 32 85 274 -123 91 27 124 115 -143 -32 37 -62 -177 -28 130 -10 73 221 26 153
3230A53J61l30K63j44j21K52j21j77J06n2Q4j51N5L42j61j30l23K77Lm5o5K02
3252G8k73K71lK12l53o9OL37k80J74n9n7L02m32L86n52J83K95J29k69J05k62J91
3275F0j41K72k56pk04M44l04K78j68j80L23m7L6j71k26M84l12l9K84j99n7Q4j39
3298a85J44j31J59l8r3J66o6K56l35J83l16L55k80K80k27J58J35O0j99k09J57
3319b6K52j65J0J71l28j05L82K10m65J19k10k5J66k20J33L45j38l99K55M49l49
3340F2j51J7L9n3K3K56j05r5j13N1L10k51k26K09m28O17k79K09r5J34J04k71L38
3363C02J48l57j39J05Mr9J41k42K71n16M66Kj85J76M0n3m9J45k30J8K73k02j64
3386a45K19n2J11l91J66J21r2NP1r6pJ26p0M32m16K46n22K63j2R7N1j87L45m78
$$ plain form
3230 153 314 -16 247 103 -18 234 113 -64 42 -10 74 -77 -22 320 159 29 -294 -17 -14 -59 -124 78
3252 78 -195 76 73 285 -68 -137 -131 206 -74 100 41 -16 286 -146 240 -312 -129 166 295 26 131 -131 60
3275 60 -81 191 -65 -72 -276 168 -136 142 -26 -206 117 70 106 -65 -291 193 -119 -158 126 -73 -130 -46 -185
3298 -185 -41 -172 -13 -51 -144 22 -44 212 -123 60 -256 99 -181 99 -128 30 165 225 26 -183 -26
3319 -26 226 61 71 242 -86 -191 191 401 -64 55 -155 -180 -14 -234 -101 244 106 -293 -38 411 62
3340 62 -89 -72 -33 -86 -63 193 88 -7 -120 -69 241 -10 -236 -27 -455 162 -117 92 -3 131 235 -36 302
3363 302 450 93 -46 59 63 -36 105 -137 134 -382 84 86 -99 77 117 64 15 160 -70 -52 221 19 -145
3386 -145 74 22 133 -258 -92 29 -63 -58 13 -83 -90 36 -34 398 -18 228 -294 -31 -43 54 105 -82 263 -215
3410b15J82L6j27n5R5J30k6n3K0K60j30nm0J6Op1j09K21M2l33L57k75K26j42J32
3435A42m6j19K50k31R6k51P0J50L73o96P4K83k06K9J59k7o4k72K38N2L05m32K54
3458A31k31K59m2k04L30k01K13k15k01L8Q4n5K06J60k48l6l20N17n4k48J46m7
3480a8L42k29P5l58j11M25j22m8J26j05J39r8QM2Q1J42k40l66K76O7p8J26M0j92
3504g6q1K12l78K14R7K6j58N9J95k67J79J54j22J60j42j27k2K64j19j69M3j02
3526a60J96k2k11K3l0K06O2J11J29l46J47J80j26k02P6K4J37m32J25J81j5k41
3548a88J56j22J02K42k41k94K64j10K70Pj83L40m65L22j4j13N9P7k86Q6m4k10
3570c45L60m6k0J52j25J10j95j0K09m0k97J85J69K02l19LP7J06j11O0j62oJ01
$$ plain form
3410 -215 -33 3 -124 -179 -84 46 20 -33 -13 247 117 112 72 88 94 23 -86 135 177 -156 201 -74 152 10 142
3435 142 96 -23 227 -4 92 -159 -89 61 434 -262 -188 95 -111 -82 77 50 -14 -286 -48 4 309 -123 131
3458 131 -100 159 117 -87 243 42 255 40 -161 -123 -39 -94 112 272 24 -12 -332 185 131 -117 29 -18
3480 -18 324 95 170 -188 -299 126 4 -44 82 -23 116 18 26 68 149 291 51 -315 -39 28 -50 76 116 -76
3504 -76 -157 55 -323 -109 -12 14 -144 -85 110 -157 22 176 54 214 72 -55 -77 187 68 -101 -58 -160
3526 -160 36 14 -197 -174 -204 2 64 175 304 -42 105 285 159 -43 33 57 194 -238 -113 68 53 -188
3548 -188 -32 -154 -52 190 -51 -345 -81 -191 79 86 -97 243 -222 100 86 -27 32 109 -177 -91 -135 -345
3570 -345 15 -31 -51 101 -24 86 -109 -119 90 50 -247 -62 107 309 -10 -7 70 176 65 125 -37 -43 58
3593E8l81K36K64o9k73L17l24K8J13j65O4o2L22l31N3K26n4j0nk39K45P5r5J25
3617A18O0k20K26l57L32j83R2L3k27k4J26j05L4P1J02Q1k24K32p0J64k09K12j03
3640A61j65L8K5p3J13K13k29N9j96K21J3R5m91J75j36q4K65jp7J07J80k70R3l0
3664FJ23k57o5K72k71M37k58j6K11j50J42j10n7J54k45nr3K45l50J60L00r3m18
3687c38L88j04j43K22k21K80k29J76R9j13M0j22J92oj21R5R0J05j02k58J35Q0
3709A45k95J25o0J6J74N0j73K8P9N7j94l7L9J50k50M7j89J36M8j54J65K90k42
3732d5j7P6l24M41j24q5L17l73J21n2j21J04j06Q4K4J42M3l59J76K91j87k1j51
3755a46J19lj28j35J03K79j94NM23k50J00l8N9q9jL0q4j66K99m74M01k16J8o8
$$ plain form
3593 58 -323 -87 177 108 -165 152 -172 -144 -31 -196 -132 -194 128 -203 -150 76 22 12 7 -232 13 88 -7 118
3617 118 178 -42 184 -173 159 -24 68 101 -126 -150 -24 -129 -95 -24 78 159 -65 167 97 261 52 264 161
3640 161 -4 34 59 -14 99 312 83 142 -54 167 180 275 -216 -41 -177 -261 4 3 -74 33 213 -57 36 6
3664 6 129 -128 -193 79 -192 245 -13 -29 182 32 174 64 7 161 -84 -89 -182 63 -287 -127 173 80 -338
3687 -338 50 -54 -197 25 -196 84 -145 31 130 17 57 -65 127 121 0 95 185 290 188 -70 65 145
3709 145 -150 -25 -85 -69 105 155 -18 10 89 146 -48 -85 -46 104 -146 -99 -288 -152 -104 -258 -93 197 -45
3732 -45 -62 14 -310 131 7 -78 239 -134 -13 -65 -186 -82 -188 -104 -80 62 105 -254 -78 213 26 5 -146
3755 -146 -27 -30 -158 -293 -190 89 -105 -100 323 73 173 135 194 105 104 134 50 -116 183 -291 110 -106 -88 -156
3779a56k4K00j51J03l4k32N35l08oO8J39k36K52k03K87n73O58k56LJ63k59P1k93
3802b52K29PL62n29M73k53K92m12J2Q5j97R4n4K07k81J34J23j5Rj51J35n1o5L37
3826B39m37J34K18j01j01P5k11K67m26K25K25q4Qk2j07K99m6l1o9j46K86k93Q5
3849a3l44M27j34l1L0j14J28q4q8M07r8m6j74N1l2j30L54j5j78k41K61jP6Q8j7
3874H2j25K51k99J01p6J21J80m27J34L5K48l7j31j42K73k76O6k61L28J1J03J99
3896C58j88m36K32p0K90m44L62o0Kq5N5r8o8K01j42L48l92K38o8k74K23j25j28
3919b69K68N1R2m0k88K48q3Pk2P5k05K4M31j61J8p9K0P1Qn00M73J20o8k65J54
3944H0Q8j65L7M4j44L0k64L20M1l1J80l79J96rj32K89j58o1k2j23K69M1j58L01
$$ plain form
3779 -156 -180 20 -131 -28 -62 -294 241 -67 -73 -5 134 -102 150 -53 234 -339 319 63 66 229 -30 41 -252
3802 -252 -23 -16 346 -183 290 37 329 -83 -71 14 -183 -89 -143 64 -217 -83 40 25 34 -117 18 -33 -98 239
3826 239 -198 -64 154 53 -48 27 -184 83 -343 -118 107 23 31 9 -98 201 155 124 55 -91 195 -98 -13
3849 -13 -357 70 -64 -95 -65 -179 -51 -135 -223 184 86 40 -134 -83 -115 -245 109 94 -84 -325 -64 -65 11 99 82
3874 82 -43 208 -91 10 -66 55 235 -192 -58 -23 225 188 57 -85 188 -88 -22 -283 45 56 159 358
3896 358 170 -266 -34 -104 186 -258 104 44 46 -39 16 -82 -150 51 -91 257 -135 103 35 -239 -16 -141 -269
3919 -269 -1 50 142 102 -186 62 -21 -14 -36 39 -166 -142 289 128 146 67 87 158 166 -334 139 259 191 -74 80
3944 80 168 3 40 84 -60 -30 -294 26 67 36 216 -163 33 24 -108 181 23 -38 -60 -183 86 127 -31 270
3968B70m20p0Q7J04R4j32j75O36k81m27K14J2K3N3q5J49k06o9K93k97J65M3M8
3991B9k88j5J37K62Ok06J27j71oJ01K41k67K66l10L46m32R4j7M8K65j83J9k99
4014b53J51J15k2L34k39j23j19K91j19k7j82K34P3l57K36Mr0J25K22m28J6J28
4036c0k6mK14o2j57j41K26K7j06M50l32J35j31J19j53K37k9k46L7r9o4N2QK61
4060A86k09J54lN3l83J27P7j94K29m13L60J35k45n6pn7K48L4k2n3J4J07q3k22
4084b23L1P3K24j79L10j46o8j69j05M37l20J30K4K4L5M3q8J31l36K05l70L84M9
4107I6q6j25n0J50Q1j8J32k64j6k04K38L3P7k37L04j46R1P3j75J09n7N9P2Rj18
4132B8n1n1nK29j74J11J98k57K40j87O7n1j4r7Qk52K35J8L81n89L46J25k34j47
$$ plain form
3968 270 -150 -220 -133 -29 65 -67 -242 394 113 -314 -100 -88 -65 -12 -97 52 -154 -223 70 -227 -62 -19 29
3991 29 -259 -274 -137 125 131 -75 52 -119 -125 -24 217 -50 216 -94 252 -180 -86 -103 -55 210 27 46 -253
4014 -253 -102 13 -9 325 86 -37 -156 135 16 -11 -193 41 114 -243 -7 -3 -93 32 254 -174 -158 -30
4036 -30 -56 -60 154 92 -65 -206 20 47 -59 391 59 194 63 182 29 266 237 -9 28 -71 -135 -83 -75 186
4060 186 -23 131 128 181 -202 -75 2 -192 37 -376 -16 119 -126 -182 -189 -246 2 36 14 -39 -25 82 -1 -223
4084 -223 -192 -119 105 -74 236 90 22 -147 -252 185 -135 -5 19 43 78 121 33 164 -172 33 -337 47 96
4107 96 10 -115 -165 -15 66 48 180 -84 -100 -304 -66 -33 44 -193 111 -35 56 129 -46 63 6 65 137 146 28
4132 28 -23 -74 -79 150 -24 87 285 28 268 81 148 97 83 -14 -6 -258 -23 -5 376 -213 133 258 24 -123
4156a23L94j43l18O02k65r5R8k52R2k12K23O0k10J89n6r9L0j16K40j23K63j63
4178A6j81M48l68K02J05lr2L46n97J55kJ62j64j12l5L29j49p3J98pj95k9J28j39
4202e7K8L8l5k17K59PK21m15q3L81k02J43M7M1p1r9K15J83j74k11j20J26O6p2
4226ajj08K39j12J12j81l41N00j62r7j9K00K4k21J29P2m5r7J72k7R6j66Q6q6k62
4251b96M37k7j13j28L43k89N1R0r6P3K48l83K73o04P20k46J94j19L1k70K26q4
4273C1O6j84J8j32J42j38L39l22M68k23l0q1j26K05oJ64l2j37j71J08k87M83m34
4296b79M32k74OJ57j54M3J0j0J0R7j8j31J81l29L86k19o4J89j20K82K6k98r4Q4
4320h7K90k68J32j18J48j77j5K11k44j00L04lk9K52l92N2P2J67l72r5O6M69m69
$$ plain form
4156 -123 271 128 -190 412 147 52 150 -102 -10 -222 1 61 -149 40 -16 -115 -85 -201 39 -84 179 16
4178 16 -165 283 -85 117 222 219 127 473 -124 31 29 191 27 -85 -120 209 60 -13 185 178 -17 -46 82 -57
4202 -57 -29 9 -26 -243 16 23 244 -171 -254 127 -75 68 115 156 85 -14 201 384 210 -1 -121 5 71 -1
4226 -1 -2 -110 129 17 129 -52 -393 107 -55 -152 -171 29 53 -168 -39 33 -12 -109 63 36 132 -34 52 -34 -296
4251 -296 141 114 1 -127 216 -73 -22 68 -28 45 293 -90 183 -421 299 53 247 128 159 -111 115 31
4273 31 97 -87 -69 -201 -59 -197 142 -180 288 65 35 -46 -172 33 27 191 159 22 -149 -41 -328 155 -279
4296 -279 153 -121 -115 42 -112 -69 -59 -69 -59 38 20 -111 70 -259 127 -92 -156 33 -87 195 221 -77 -171 -87
4320 -87 203 -65 67 -51 97 -80 -95 116 -128 -228 76 73 44 296 -96 -44 28 195 -177 -272 -206 263 -206
4343b06K48m3j15K05j00k8R2k91J69R6J09j82Nk31K16L47l26J4K1j0Q5J08l16
4366a33J92J15l1j42k1M5j22j23J38o5K96j73L9l0q1J35Q6k49J44J58k16R3k26
4389a71K20r0J22k1O1k55J10P5J78m7n0k49L25j25r4j43P3J70j2k9j26J11l1J67
4413A69j05j79J33k55L53n6j45K35l3j3m68M37Pj31O6K8q2O2J05q0k37L55j58
4436Hj64j12K46m1j24K95j1r8k9L7rK7k35L86m8m3j44J33j35l7K48k09J69k25
4460a15J79k14j7L4J39P8k01K07j94K25k32o7K54QQKJ09l16J50k37K70rk83L7
4484a85K52J4Nj26J41j96j16K91J8J39j65k01K43k00J02j18J89o3J27N1J5J03
4506C20k23J2k24L33k52J65j93j57J41K63o2N6k74m6J61R2J33j14l1J2j10k1M0
$$ plain form
4343 -206 42 -1 -116 89 -11 -39 53 -238 -69 27 136 -46 -41 -272 -56 291 -35 -21 0 -10 75 183 -133
4366 -133 59 174 143 1 -20 25 -97 -220 -82 -147 149 -24 15 -15 -96 39 125 -124 20 178 -38 55 -171
4389 -171 49 -41 81 60 121 -134 -24 51 229 182 132 -117 208 83 -11 -154 -81 89 77 48 -78 33 2 169
4413 169 64 -115 18 -237 116 60 -85 150 117 104 -364 73 80 -51 15 43 -39 23 128 48 -189 166 8
4436 8 -156 -268 -22 -63 -187 108 97 -1 -30 7 -2 25 -210 176 128 85 -59 74 -61 -98 150 -59 110 -115
4460 -115 64 -150 -167 -133 6 84 -117 90 -104 121 -111 -178 76 84 92 94 203 -113 37 -200 70 61 -222 -185
4484 -185 67 81 86 -40 101 -95 -211 80 98 237 72 -129 114 -86 16 -102 87 24 151 202 217 320
4506 320 97 109 -115 218 -34 131 -62 -219 -78 185 123 179 -95 -141 20 112 245 131 100 112 2 -19 21
4529B1k83L14j96J85j27j47K20J82k46p0L21k51Q0j89L42j52J11L0o0j38r9M16
4551B64j50j19J03m4j31j38J38J30j29J72m3O9l3j08p2Q1l14L91N9J65l31J54
4573A14j85R5o9J96j70k7j99N70l97M0j92p3K17J24j09j22L77R0q7j39k72R3J57
$$ plain form
4529 21 -262 52 -144 41 -86 -233 -13 169 -77 -147 174 -77 3 -186 156 4 115 145 85 -53 -152 264
4551 264 114 -5 98 54 -77 -215 -77 53 -76 96 53 122 89 -19 -91 -10 -324 67 126 291 -40 114
4573 114 -71 24 -45 151 -19 -46 -245 325 -72 -32 -224 -297 -80 44 -65 -187 190 280 193 54 -218 -125 32
$$ [...]
8191a02
##END NTUPLES=NMR FID
##END=
