##TITLE=1H_DE-91_4_oil_TFA
 200.13MHz,CDCl3 ,
 8 sc
 
 18.4.2025
##JCAMPDX= 6.0         $$ Bruker NMR JCAMP-DX V2.0
##DATA TYPE= NMR FID
##DATA CLASS= NTUPLES
##ORIGIN= UXNMR, Bruker Analytische Messtechnik GmbH
##OWNER= pz
$$ XWIN-NMR		Version 3.5
$$ Fri Apr 18 16:08:01 2025 Russian Standard Time (UT+4h)  she@DPX200
##.OBSERVE FREQUENCY= 200.1313
##.OBSERVE NUCLEUS= ^1H
##.DELAY= (6, 6)
##.ACQUISITION MODE= SIMULTANEOUS
##.ACQUISITION SCHEME= undefined
##.AVERAGES= 8
##.DIGITISER RES= 18
##SPECTROMETER/DATA SYSTEM= spect
##.PULSE SEQUENCE= zg30
##.SOLVENT NAME= CDCl3
##.SHIFT REFERENCE= (INTERNAL, CDCl3, 0, 14.3821)
##AUDIT TRAIL= $$ (NUMBER, WHEN, WHO, WHERE, WHAT)
$$ ##TITLE= Audit trail, XWIN-NMR		Version 3.5
$$ ##JCAMPDX= 5.01
$$ ##ORIGIN= Bruker BioSpin GmbH
$$ ##OWNER= she
$$ F:/spectra/data/she/nmr/H-C/1/audita.txt
$$ ##AUDIT TRAIL=  $$ (NUMBER, WHEN, WHO, WHERE, WHAT)
(   1,<2025-04-18 16:06:51.15 +0400>,<she>,<DPX200>,
      <created by zg, POWCHK disabled, PULCHK disabled
       configuration hash MD5:
       00 E9 B6 7A A2 85 ED C7 34 08 36 98 17 FE 4E 26
       data hash MD5: 16K
       17 9E D0 AC F3 0D 79 A5 8B E2 08 7C 99 DE 08 5D>)
$$ ##END=
$$ 
$$ hash MD5
$$ A2 17 35 55 38 90 78 26 BB C4 D2 7A FE 26 21 FB
##$RELAX= 
##$RELAX= 
##$RELAX= 
##$RELAX= 
##$RELAX= 
##$RELAX= 
$$ Bruker specific parameters
$$ --------------------------
##$DU= <F:/spectra>
##$EXPNO= 1
##$NAME= <H-C>
##$PROCNO= 1
##$TYPE= <nmr>
##$USER= <she>
##$AMP= (0..31)
100 100 100 100 100 100 100 100 100 100 100 100 100 100 100 100 100 100 
100 100 100 100 100 100 100 100 100 100 100 100 100 100 
##$AQSEQ= 0
##$AQ_mod= 1
##$AUNM= <au_zg>
##$AUTOPOS= <>
##$BF1= 200.13
##$BF2= 200.13
##$BF3= 200.13
##$BF4= 200.13
##$BF5= 200.13
##$BF6= 200.13
##$BF7= 200.13
##$BF8= 200.13
##$BYTORDA= 1
##$CFDGTYP= 0
##$CFRGTYP= 5
##$CHEMSTR= <none>
##$CNST= (0..31)
1 1 145 1 1 1 1 1 1 1 1 1 1 1 1 1 1 1 1 1 1 1 1 1 1 1 1 1 1 1 1 1 
##$CPDPRG= <>
##$CPDPRG1= <>
##$CPDPRG2= <>
##$CPDPRG3= <>
##$CPDPRG4= <mlev>
##$CPDPRG5= <mlev>
##$CPDPRG6= <mlev>
##$CPDPRG7= <mlev>
##$CPDPRG8= <mlev>
##$CPDPRGB= <>
##$CPDPRGT= <>
##$D= (0..31)
0 0.7 0 0 0 0 0 0 0 0 0 0.03 0 0 0 0 0 0 0 0 0 0 0 0 0 0 0 0 0 0 0 0 
##$DATE= 1744978010
##$DBL= (0..7)
120 120 120 120 120 120 120 120 
##$DBP= (0..7)
150 150 150 150 150 150 150 150 
##$DBP07= 0
##$DBPNAM0= <>
##$DBPNAM1= <>
##$DBPNAM2= <>
##$DBPNAM3= <>
##$DBPNAM4= <>
##$DBPNAM5= <>
##$DBPNAM6= <>
##$DBPNAM7= <>
##$DBPOAL= (0..7)
0.5 0.5 0.5 0.5 0.5 0.5 0.5 0.5 
##$DBPOFFS= (0..7)
0 0 0 0 0 0 0 0 
##$DE= 6
##$DECBNUC= <off>
##$DECIM= 32
##$DECNUC= <off>
##$DECSTAT= 4
##$DIGMOD= 1
##$DIGTYP= 9
##$DL= (0..7)
0 120 120 120 120 120 120 120 
##$DP= (0..7)
150 150 150 150 150 150 150 150 
##$DP07= 0
##$DPNAME0= <>
##$DPNAME1= <>
##$DPNAME2= <>
##$DPNAME3= <>
##$DPNAME4= <>
##$DPNAME5= <>
##$DPNAME6= <>
##$DPNAME7= <>
##$DPOAL= (0..7)
0.5 0.5 0.5 0.5 0.5 0.5 0.5 0.5 
##$DPOFFS= (0..7)
0 0 0 0 0 0 0 0 
##$DQDMODE= 0
##$DR= 18
##$DS= 0
##$DSLIST= <SSSSSSSSSSSSSSS>
$$ [...]
##$SUBNAM0= <"">
##$SUBNAM1= <"">
##$SUBNAM2= <"">
##$SUBNAM3= <"">
##$SUBNAM4= <"">
##$SUBNAM5= <"">
##$SUBNAM6= <"">
##$SUBNAM7= <"">
##$SUBNAM8= <"">
##$SUBNAM9= <"">
##$SW= 18.0517328524113
##$SWIBOX= (0..15)
0 0 2 0 0 0 0 0 0 0 0 0 0 0 0 0 
##$SW_h= 3612.71676300578
##$TD= 16384
##$TD0= 1
##$TE= 0
##$TE2= 300
##$TE3= 300
##$TEG= 300
##$TL= (0..7)
0 120 120 120 120 120 120 120 
##$TP= (0..7)
150 150 150 150 150 150 150 150 
##$TP07= 0
##$TPNAME0= <>
##$TPNAME1= <>
##$TPNAME2= <>
##$TPNAME3= <>
##$TPNAME4= <>
##$TPNAME5= <>
##$TPNAME6= <>
##$TPNAME7= <>
##$TPOAL= (0..7)
0.5 0.5 0.5 0.5 0.5 0.5 0.5 0.5 
##$TPOFFS= (0..7)
0 0 0 0 0 0 0 0 
##$TUNHIN= 0
##$TUNHOUT= 0
##$TUNXOUT= 0
##$USERA1= <user>
##$USERA2= <user>
##$USERA3= <user>
##$USERA4= <user>
##$USERA5= <user>
##$V9= 5
##$VALIST= <valist>
##$VCLIST= <CCCCCCCCCCCCCCC>
##$VD= 0
##$VDLIST= <DDDDDDDDDDDDDDD>
##$VPLIST= <PPPPPPPPPPPPPPP>
##$VTLIST= <TTTTTTTTTTTTTTT>
##$WBST= 1024
##$WBSW= 4
##$XGAIN= (0..3)
0 0 0 0 
##$XL= 0
##$YL= 0
##$YMAX_a= 163896
##$YMIN_a= -148478
##$ZGOPTNS= <>
##$ZL1= 120
##$ZL2= 120
##$ZL3= 120
##$ZL4= 120
##$ABSF1= 10
##$ABSF2= 0
##$ABSG= 5
##$ABSL= 3
##$ALPHA= 0
##$AQORDER= 0
##$ASSFAC= 0
##$ASSFACI= 0
##$ASSFACX= 0
##$ASSWID= 0
##$AUNMP= <proc_1d>
##$AZFE= 0.1
##$AZFW= 0.1
##$BCFW= 1
##$BC_mod= 2
##$BYTORDP= 1
##$COROFFS= 0
##$CY= -3
##$DATMOD= 1
##$DC= 2
##$DFILT= <>
##$DTYPP= 0
##$F1P= 0
##$F2P= 0
##$FCOR= 0.5
##$FTSIZE= 0
##$FT_mod= 4
##$GAMMA= 1
##$GB= 0.15
##$INTBC= 1
##$INTSCL= 1
##$ISEN= 128
##$LB= 0.25
##$LEV0= 0
##$LPBIN= 0
##$MAXI= 10000
##$MC2= 0
##$MEAN= 0
##$ME_mod= 0
##$MI= 1.114404
##$NCOEF= 0
##$NC_proc= 0
##$NLEV= 6
##$NOISF1= 3.799351
##$NOISF2= 2.8
##$NSP= 1
##$NTH_PI= 0
##$NZP= 0
##$OFFSET= 14.38212
##$PC= 1
##$PHC0= -831.0807
##$PHC1= 10.79221
##$PH_mod= 1
##$PKNL= yes
##$PPARMOD= 0
##$PSCAL= 0
##$PSIGN= 0
##$REVERSE= no
##$SF= 200.129724274929
##$SI= 16384
##$SIGF1= 3
##$SIGF2= 2
##$SINO= 400
##$SIOLD= 16384
##$SREGLST= <1H.CDCl3>
##$SSB= 0
##$STSI= 0
##$STSR= 0
##$SW_p= 3205.1282051282
##$SYMM= 0
##$S_DEV= 0
##$TDeff= 0
##$TDoff= 0
##$TI= <>
##$TILT= no
##$TM1= 0
##$TM2= 0
##$TOPLEV= 0
##$USERP1= <user>
##$USERP2= <user>
##$USERP3= <user>
##$USERP4= <user>
##$USERP5= <user>
##$WDW= 1
##$XDIM= 8192
##$YMAX_p= 0
##$YMIN_p= 0
$$ End of Bruker specific parameters
$$ ---------------------------------
##NTUPLES= NMR FID
##VAR_NAME=  TIME,          FID/REAL,        FID/IMAG
##SYMBOL=    X,             R,               I
##VAR_TYPE=  INDEPENDENT,   DEPENDENT,       DEPENDENT
##VAR_FORM=  AFFN,          ASDF,            ASDF
##VAR_DIM=   8192,          8192,            8192
##UNITS=     SECONDS,       ARBITRARY UNITS, ARBITRARY UNITS
##FACTOR=    0.0002768,     1,               1
##FIRST=     0,             0,               0
##LAST=      2.2672688,     0,               0
##MIN=       0,             -148478,         0
##MAX=       2.2672688,     163896,          0
$$ Real data points
##PAGE= N=1
##DATA TABLE= (X++(R..R)), XYDATA
$$ [...]
$$ plain form
1838 -117 95 98 80 -9 88 -75 224 -236 -143 79 391 48 286 0 58 -129 187 122 -14 27 241 -154 -67
1861 -67 7 -68 -123 -17 83 -125 31 140 33 281 172 63 -1 188 323 16 -39 -26 -138 -12 183 -127
1883 -127 32 -100 120 105 144 158 -23 81 -36 -10 15 67 74 -73 311 261 111 -23 56 -153 -363 146 110 -60
1907 -60 -109 -54 -48 -102 98 306 -69 212 118 -12 -80 -92 -40 97 45 -46 51 -294 228 98 -72 -72 99 107 44 124
1933 124 -144 -132 102 -47 -9 -84 -272 -29 85 10 -33 108 -17 96 53 -48 208 -270 -204 -58 120 -268
1955 -268 -23 12 -29 101 134 -234 -139 297 77 231 -117 109 66 -38 149 36 3 -156 107 81 33 35 52 -56
1979 -56 106 268 15 2 -172 109 -394 -2 -126 -126 23 -188 56 -142 84 -100 15 -133 -53 -44 -41 0 -463
2002 -463 187 -99 -86 -16 10 39 167 -133 -136 40 9 96 -29 -46 -97 154 2 100 -56 -117 -141 119 -92 -42 227
$$ packed form
1838a17K12Lj8q9R7j63K99m60R3K22L12l43K38k86N8j87L16o5j36M1K14l95Q7
1861f7P4p5n5J06J00k08J56J09j07K48j09j09o4J89J35l07n5J3j12J26J95l10
1883a27J59j32K20j5L9J4j81J04j17K6K5N2Pj47L84n0j50j34P9k09k10N09l6j70
1907f0m9N5On4K00K08l75K81r4j30o8j2N2J37n2r1R7l45N22j30j70%J71Qo3Q0
1933A24k68J2K34j49L8p5j88K43J14p5m3J41j25J13m3j01K56m78O6J46J78l88
1955b68K45L5m1J30L3l68R5M36k20J54l48K26m3j04J87j13l3j59K63k6m8KJ7j08
1979e6J62J62k53j3j74K81n03L92j24%J49k11K44j98K26j84J15j48Q0RLM1m63
2002d63O50k86J3P0K6K9J28l00lJ76l1Q7j25j7n1K51j52R8j56o1k4K60k11N0K69
$$ plain form
2027 227 -125 103 4 193 -91 3 -22 -22 39 239 200 96 199 80 102 30 -28 -13 -12 47 218 -284 59 229 -151
2052 -151 -130 22 37 116 51 -12 28 0 275 -6 -151 332 -13 -108 -422 114 -61 48 -90 -184 -35 116 -17
2075 -17 101 -18 -151 150 132 -33 -376 -311 -15 131 -68 142 158 19 -52 5 16 -125 140 43 -33 -123 164
2098 164 7 -142 -118 105 -61 -209 147 -205 117 -148 195 272 217 60 -234 153 101 -27 35 -114 160 54
2120 54 4 2 54 8 75 278 115 -143 9 167 8 -14 254 -104 -175 156 64 -311 151 196 173 -174 -15 -261
2144 -261 61 141 -79 -85 257 -83 -270 -101 -32 -158 -29 -43 -369 -98 55 -134 -72 -142 -38 158 -43 17 13
2167 13 -215 -161 -206 -278 -171 77 35 241 -46 65 -205 -151 -6 -72 203 -62 322 -29 208 27 106 117 -174
2190 -174 -120 57 108 -131 59 31 192 91 -446 124 -171 78 -148 -83 284 258 184 110 74 68 271 -235 -77
$$ packed form
2027B27l52K28r9J89k84R4k5%O1K00l9j04J03j19K2p2n8J5JN9J71n02L43J70l80
2052a51K1J52J5P9o5o3M0k8K75k81j45M83l45r5l14N36j75J09j38r4J49J51j33
2075a7J18j19j33L01j8j65l43O5K96J46j99K10J6j39p1N7J1j41K65r7p6r0K87
2098A64j57j49K4K23j66j48L56l52L22k65L43P7n5j57k94L87n2j28O2j49K74j06
2120E4n0kN2m6O7K03j63k58J52J58j59k2K68l58p1L31r2l75M62M5k3l47J59k46
2144b61L22Q0k20oL42l40j87J69O9j26J29j4l26K71J53j89O2p0J04J96k01O0m
2167A3k28N4m5p2J07K48m2K06k87J11k70N4J45o6K75k65L84l51K37j81P9J1k91
2190a74N4J77N1k39J90k8J61j01n37N70k95K49k26O5L67k6p4p4l6oK03n06J58
$$ plain form
2213 -77 35 -72 -101 -65 -72 211 -92 120 -116 -156 -142 -84 242 -189 263 -24 119 15 126 12 -238 144 -167
2236 -167 278 -152 -468 29 138 37 92 -99 247 -59 -13 -93 -247 -42 80 -164 300 84 -43 128 -224
2257 -224 104 255 -96 -98 100 212 -238 32 144 -48 -44 180 455 93 342 -78 145 280 111 143 74 66 -64
2280 -64 21 -53 -54 -43 -101 157 95 -102 -183 -46 89 61 -16 -104 -128 -134 -129 -210 -87 301 162 131 -14 159 -129 -7
2306 -7 45 47 -48 -62 -13 224 -245 97 13 57 -24 6 69 -256 -47 177 110 196 -152 -252 64 143 -94 -352 -11
2331 -11 15 -132 109 29 18 85 306 49 5 -16 -28 -59 27 54 116 150 -183 -152 -24 -104 221 282 -168 -117 -269 -59
2357 -59 42 31 75 -11 -157 157 -94 -20 -59 267 -159 -100 5 -90 40 27 -53 -82 -38 -91 178 109 214 3 60
2382 60 -142 -243 73 96 -98 -368 265 -142 74 -115 -35 96 -255 -138 -31 -249 -1 33 40 -168 -101 -148 146
$$ packed form
2213g7J12j07k9L6pK83l03K12k36m0J4N8L26m31M52k87J43j04J11j14k50L82l11
2236a67M45m30l16M97J09j01N5j91L46l06M6q0j54K05J22k44M64k16j27J71l52
2257b24L28J51l51kJ98J12m50K70J12j92MK24K75l62K49m20K23J35j69L2o9qj30
2280f4Q5p4jJ1n8K58o2j97q1J37J35k8p7q8k4oNq1J23L88j39l1j45J73k88J22
2306gN2Kr5j4M9K37m69L42q4M4q1L0O3l25K09K24o7Q6l48j00L16P9k37k58L41
2331a1K6j47K41q0j1O7K21k57m4k1j2l1Q6K7O2L4l33L1J28q0L25O1m50N1j52K10
2357e9J01j1M4q6j46L14k51P4l9L26m26N9J05r5J30j3q0k9M4n3K69o9J05k11N7
2382F0k02j01L16K3j94k70O33m07K16j89Q0J31l51J17J07k18K48L4Pk08O7m7K94
$$ plain form
2405 146 390 85 -133 -27 139 -237 -45 8 29 85 -164 -32 245 -80 -96 45 -87 94 12 -103 2 -26
2427 -26 -85 -214 233 203 -136 290 -178 143 56 76 163 36 -246 -20 -159 -160 2 17 229 78 198 -34 330
2450 330 -14 50 -147 -19 196 8 152 264 39 -38 102 40 -136 -262 29 8 93 1 -91 119 38 23 -116
2473 -116 -33 -129 -94 -7 -132 -22 135 -177 -17 -78 -22 -9 55 -53 86 28 -19 75 -331 -200 -216 -212 46 -193 -186
2498 -186 50 35 -110 137 -101 -67 83 -56 -114 -91 -32 -142 -123 317 97 -220 291 -121 45 285 -53 30
2520 30 194 -214 140 104 -171 27 69 105 0 -300 92 -103 52 -65 0 -61 -158 4 35 42 -229 317 1
2543 1 -277 108 69 9 100 31 14 -367 -50 230 -131 -147 58 -58 -109 -26 -124 227 -90 -137 -20 -13 124 -167 89
2568 89 139 62 -43 -66 -194 215 165 -49 -60 -66 315 125 -76 39 120 -246 -1 -282 22 182 222 29 323
$$ packed form
2405A46K44l05k18J06J66l76J92N3K1N6k49J32K77l25j6J41j32J81q2j15J05k8
2427b6n9j29M47l0l39M26m68L21q7K0Q7j27k82K26j39jJ62J5K12j51J20k32L64
2450C30l44O4j97J28K15j88J44J12k25p7J40o2j76j26K91k1Q5r2r2K10q1j5j39
2473a16Q3r6L5Q7j25J10J57l12J60o1N6J3O4j08J39n8m7R4m06J31j6MK58k39P
2498a86K36j5j45K47k38L4J50j39n8K3N9j10J9M40k20l17N11m12J66K40l38Q3
2520C0J64m08L54l6k75J98M2L6j05l00L92j95J55j17O5o1r7J62L1Pk71N46l16
2543Ak78L85l9o0R1o9j7l81L17K80l61j6K05j16n1Q3r8L51l17m7J17PJ37k91K56
2568H9N0p7j05k3j28M09n0k14j1oL81j90k01J15Q1l66K45k81L04J60M0j93K94
$$ plain form
2591 323 -88 149 176 -102 90 -136 -157 46 11 25 220 -35 214 -248 178 72 99 58 125 -470 -390 22 -201
2614 -201 -29 -144 45 -164 -46 -105 -277 80 111 306 -68 10 -216 -126 44 119 2 97 185 108 115 -113 30
2637 30 53 32 56 -157 107 237 -77 123 -213 149 28 -103 -231 -106 -154 292 -48 -107 19 -228 -38 30
2659 30 -123 340 37 23 243 -216 139 -127 -261 150 -327 -210 -25 37 -1 26 -83 -57 77 167 -66 -115 -164
2682 -164 -24 -137 11 90 -108 327 -22 55 -25 109 178 -62 -85 193 120 -216 -246 -223 -37 401 118 121 -173
2705 -173 -129 -57 -143 -9 68 -123 -157 142 -45 -163 146 102 -100 -76 122 130 -182 -231 -265 -73 -99 -40 146 -225
2729 -225 45 -172 72 392 84 278 -98 -303 92 -162 20 -32 -32 274 205 -200 -106 -128 -121 -35 -116 -149 -36 4
2753 4 -74 -124 32 76 83 312 -329 81 157 100 83 -36 389 -33 -16 -52 24 20 -135 3 -272 245 -66 18 5 79
$$ packed form
2591C23m11K37K7k78J92k26k1K03l5J4J95k55K49m62M26j06K7m1O7n95Q0M12k23
2614b01J72j15J89k09J18n9j72L57L1J95l74P8k26R0J70P5j17R5Q8p7Pk28J43
2637C0K3k1K4k13K64J30l14K00l36L62j21j31j28J25m8M46l40n9J26k47J90O8
2659C0j53M63l03j4K20m59L55k66j34M11m77J17J85O2l8K7j09K6J34R0k33m9m9
2682a64J40j13J48P9j98M35l49P7q0J34O9k40k3K78p3l36l0K3J86M38k83Lk94
2705a73M4P2q6J34P7j91l4K99j87j18L09m4k02K4J98Ql12m9l4J92k6N9J86l71
2729b25K70k17K44L20l08J94l76k05L95k54J82n2%L06o9m05R4k2PQ6q1l3J13M0
2753Dp8n0J56M4PK29o41M10P6n7j7j19M25m22J7l6P6mj55J38k75N17l11Q4j3P4
$$ plain form
2779 79 -124 88 102 -62 -62 38 13 21 -141 -216 44 198 -133 22 100 -191 -130 264 -49 87 4 -221 258 -134
2803 -134 -101 -176 -46 77 -140 -48 -339 103 -55 -29 -122 104 -46 58 -23 166 358 345 -129 -155 -24 -198 20
2826 20 -70 73 136 67 -147 157 24 -359 83 -91 -180 162 -50 177 -157 26 -150 -101 -81 215 -128 112
2848 112 -68 -77 -8 175 97 -133 -186 -295 138 101 181 -218 163 -124 -193 -88 23 -197 55 85 216 3 -156
2871 -156 4 114 238 -166 -188 -91 30 13 72 -189 3 -101 93 11 -171 137 -180 -145 -194 -442 61 48 9
2894 9 27 247 -113 -81 150 -73 -156 -242 13 242 5 83 70 -51 -128 -171 -100 345 127 -128 62 -103 7 157
2918 157 219 -88 122 -1 53 166 176 153 77 -75 193 215 -19 265 205 -19 62 294 -66 150 224 42 -147
2941 -147 -138 -151 304 69 -159 28 102 68 52 -6 251 -205 -10 308 -144 -71 -325 -80 -117 262 56 218 124
$$ packed form
2779G9k03K12J4j64%J00k5Qj62p5K60J54l31J55P8k91O1L94l13J36q3k25M79l92
2803a34L3p5J30J23k17R2k91M42j58K6r3K26j50J04q1J89J92j3m74k6J31j74K18
2826B0r0J43O3o9k14L04j33l83M42j74q9L42k12K27l34J83j76M9K0K96l43K40
2848A12j80rO9J83p8k30n3j09M33l7Q0l99L81k87o9J05J11k20K52L0J31k13j59
2871a56J60J10J24m04k2R7J21j7N9k61J92j04J94q2j82L08l17L5m9k48N03j3l9
2894IJ8K20l60L2K31k23q3q6K55K29k37P8j3j21p7m3P1M45k18k55J90j65J10J50
2918A57O2l07K10j23N4J13J0k3p6j52K68K2k34K84o0k24Q1K32l60K16P4j82j89
2941a47Rj3M55k35k28J87P4l4j6n8K57m56J95L18m52P3k54K45l7L79k06J62r4
$$ plain form
2964 124 -256 -292 -18 61 -66 -438 4 -67 -96 -6 30 28 143 84 195 91 -122 -66 -275 177 88 127 -55 -90
2988 -90 -11 196 34 41 113 142 20 20 -91 35 32 -56 -11 7 175 -66 -39 -36 -63 396 -11 -43 80 -57 64 -20
3014 -20 65 -30 118 -181 6 -25 -51 142 -167 -25 -59 -49 -199 -11 -3 -48 228 -169 288 -86 -138 -283 217 -109
3038 -109 254 85 -152 95 179 -74 57 -150 -105 63 44 20 -26 -363 -77 60 29 131 -283 -111 -153 -1
3060 -1 -122 72 5 39 -55 -200 87 144 -86 -216 -329 -165 102 10 152 -124 119 -169 -95 34 91 -46 78
3083 78 70 -110 -242 -102 -79 -65 73 -103 52 155 9 87 -17 141 89 -184 77 5 -12 -182 194 86 -202
3106 -202 -30 -216 80 229 -25 75 42 -166 -118 6 -132 -154 -81 -18 45 111 175 52 -158 -8 70 -205 -259
3129 -259 249 120 -202 -18 -330 -190 -274 216 -6 -114 107 -18 -103 140 -73 103 74 -257 -384 -40 -75
$$ packed form
2964A24l80l6K74P9j27l72M42p1k9R0L6kJ15n9J11j04k13N6k09M52q9L9j82l5
2988i0P9K07j62PP2K9j22%j11J26lq8M5J8J68k41K7Lk7M59m07l2J23j37J21q4
3014b0Q5r5J48k99J87l1k6J93l09J42l4J0j50J88Qm5K76l97M57l74n2j45N00l26
3038a09L63j69k37K47Q4k53J31k07M5J68j9k4m6l37K86J37l1J02m14J72m2J52
3060aj21J94o7L4r4j45K87N7k30j30j13J64K67r2J42k76K43k88P4J29N7j37J24
3083G8qj80j32J40K3J4J38j76J55J03j46P8j04J58n2k73K61p2j7j70L76j08k88
3106b02J72j86K96J49k54J00l3k08M8J24j38k2P3O3O3O6O4j23k10J50P8k75n4
3129b59N08j29l22J84l12J40q4M90k22j08K21j25q5K43k13J76k9l31j27L44l5
$$ plain form
3150 -75 -127 135 -103 27 -275 -102 -210 -31 -22 181 170 21 48 260 28 101 49 104 461 2 -27 -60 -217 46
3174 46 -6 -243 332 43 129 -28 -5 78 -60 198 -110 -98 -197 142 204 143 -181 -60 -14 -117 -92 -99 259 85
3198 85 -282 -10 77 95 -49 150 334 143 -95 -39 23 -172 54 305 -10 136 -22 -70 114 25 2 343 341
3221 341 -30 -124 65 -26 63 98 -109 254 -105 -84 -32 68 -252 12 -132 60 91 -195 1 244 157 158 211 -34
3245 -34 -47 78 -391 45 27 100 -206 147 242 93 38 215 21 -128 59 -11 -169 39 -165 59 -26 -41 106
3268 106 37 -5 122 100 -34 -185 159 46 -104 -17 -148 -7 74 205 -151 112 29 -60 45 -267 163 -40
3290 -40 -23 -75 -14 159 -58 -313 -155 68 -8 -74 162 254 -28 -277 -111 119 98 164 -120 -11 171 -353 -51
3313 -51 87 -98 149 -53 -87 18 -27 -178 -211 80 288 198 18 -297 13 74 87 16 -43 -73 -15 436 -179 36
$$ packed form
3150g5n2K62k38J30l02J73j08J79RK03j1j49K7K12k32P3n2N5L57m59k9l3j57K63
3174D6n2k37N75k89Q6j57K3Q3j38K58l08J2r9L39O2o1l24J21M6j03K5pL58j74
3198H5l67K72Q7J8j44J99J84j91k38N6O2j95K26K51l15J46j58m8J84q9k3L41k
3221C41l71r4J89r1Q9L5k07L63l59K1N2J00l20K64j44J92L1k86J96K43q7JN3k45
3245c4j3J25m69M36j8P3l06L53R5j49n5J77j94j49J87p0j58K08k04K24q5j5J47
3268A06o9m2J27k2j34j51L44j13j50Q7j31J41Q1J31l56K63q3q9J05l12M30k03
3290d0J7n2O1J73k17k55J58K23p6o6K36R2k82k49J66K30k1O6k84J09J82n24L02
3313e1J38j85K47k02l4J05m5j51l3K91K08r0j80l15L10O1J3p1n9l0N8M51o15K15
$$ plain form
3337 36 -7 201 -294 -160 -2 -54 274 -20 215 -248 153 -53 25 63 -238 -52 190 -284 21 -145 -118 -9
3359 -9 -144 -36 66 -205 152 -227 116 -282 105 71 -128 419 333 20 -115 96 -101 31 -447 -223 34
3380 34 64 -134 -10 94 87 -16 -75 33 -15 206 -68 -167 -108 55 79 -2 -217 -38 -105 16 105 24 174 253 -118
3405 -118 -266 2 -339 120 -49 -77 -86 -76 -168 -52 -151 -37 -317 58 115 -132 91 -19 6 -195 -14 4 -47
3428 -47 -57 -128 -84 291 -197 132 134 85 321 -82 -150 -80 -62 48 0 -30 -56 164 130 -62 -37 -37 -141 -72 340 -183
3454 -183 -116 319 -112 36 160 -314 -13 -107 -255 -174 -109 73 -24 1 -49 -277 225 85 163 247 141 117 91 -80
3478 -80 -87 -80 50 115 13 81 94 -1 107 228 -180 -48 -58 -18 93 277 -224 -157 -20 -88 3 -147 77 23 -183
3503 -183 -86 20 143 72 -125 -26 222 -36 -179 -108 105 -58 -33 -145 53 104 -11 -8 49 109 -92 24 -54 -71
$$ packed form
3337C6m3K08m95J34J58n2L28k94K35m63M01k06P8L8l01J86K42m74L05j66K7J09
3359ij35J08J02k71L57l79L43l98L87l4j99N47q6l13j35K11j97J32m78K24K57
3380C4L0j98J24J04pj03n9J08m8K21k74r9N9J63K4q1k15J79o7J21Q9q1J50P9l71
3405a18j48K68l41M59j69k8rJ0r2J16r9J14k80L75N7k47K23j10K5k01J81J8n1
3428d7j0p1M4L75m88L29Km9K36m03o8P0J8J10m8l0k6K20l4j92K5%j04O9M12n23
3454a83O7M35m31J48J24m74L01r4j48Q1O5J82r7K5n0k28N02j40P8Q4j06k4k6j71
3478h0pPJ30O5j02O8J3r5J08J21m08J32j0M0J11J84n01O7J37o8R1j50K24n4k06
3503a83R7J06J23p1j97R9K48k58j43P1K13j63K5j12J98N1j15LN7O0k01J16p8j7
$$ plain form
3527 -71 191 57 -56 -184 173 103 -108 -12 40 89 47 70 -178 10 122 -27 -234 -195 109 338 292 72 2
3550 2 176 -23 76 135 17 205 -159 0 195 -123 -99 359 -24 -230 59 111 32 16 175 82 77 -120 145 119
3574 119 -20 285 -359 174 292 -74 67 15 -91 -24 168 257 42 -138 -29 -62 -15 -21 -69 -118 33 6 -57 108
3598 108 -114 -73 -115 -23 -20 -70 -104 74 -182 34 103 49 139 91 161 -48 193 139 37 -83 -60 -155 -125 -213 -193 -65
3624 -65 34 -188 -85 131 102 88 -51 29 21 -138 403 33 114 64 -180 -37 173 -29 -61 21 18 133 -137 -31
3648 -31 9 -21 -26 -155 86 72 -121 157 143 106 308 18 -177 -253 -94 -78 -30 -56 39 -297 -22 90 70 18 20 119
3674 119 -76 160 -65 -296 -232 -64 -33 109 286 31 -96 271 224 -6 -95 38 -35 91 183 160 -120 -72 -22
3697 -22 92 53 -146 184 -21 -38 106 125 -298 19 55 101 134 131 -4 158 50 -190 25 33 92 42 13 -219 -102
$$ packed form
3527g1K62j34j13j28L57p0k11R6N2M9m2K3k48J88J12j49k07L9L04K29m6k20p0
3550BJ74j99R9N9j18J88l64J59J95l18K4M58l83k06K89N2p9j6J59r3nj97K65k6
3574A19j39L05o44N33J18l66J41n2j06O7J92Q9k15j80J09l3M7om8m9J51k7o3J65
3598A08k22M1m2R2Ln0l4J78k56K16O9n4R0m8P0k09K41n4j02j20K3r5L0q8K0J28
3624f5R9k22J03K16k9j4j39Q0qj59N41l70Q1n0k44J43K10k02l2Q2lJ15k70J06
3648c1M0l0nj29K41j4j93K78j4l7K02k90j95p6J59J6M8k6R5l36K75J12k0n2KR9
3674A19j95K36k25k31O4J68L1J42J77k55j27L67m7k30q9J33p3J26R2k3k80M8N0
3697b2J14l9j99L30k05j7J44J9m23L17L6M6L3lj35J62j08k40K15QN9n0k9k32J17
$$ plain form
3722 -102 142 435 -35 -149 15 -10 16 -14 -71 -233 53 -150 112 -39 -138 -331 -60 -80 92 101 -57 136 103
3745 103 -92 -10 130 155 -109 -54 221 179 249 185 19 20 183 123 -13 -141 -32 0 -104 277 73 190 273 -118
3769 -118 -372 -181 -114 -203 -141 -8 -13 146 -125 -155 141 -9 -103 -163 43 -83 306 131 113 6 -68 -249 31
3792 31 6 -319 -54 128 -155 -1 211 -79 -68 97 263 40 -63 -78 21 -65 26 44 61 28 12 27 -89 -50
3816 -50 -264 254 -304 -51 91 -72 268 275 -150 142 -128 -203 -414 -165 1 22 -152 170 245 228 65 -229
3838 -229 15 136 -105 100 -160 317 -142 -129 -235 -118 163 -90 125 259 70 19 -3 210 -46 -175 -167 -256
3860 -256 -161 -172 -57 -33 2 -63 -217 -175 -29 101 -279 -111 64 -39 -66 -108 119 -12 7 -171 -80 76 25 101
3884 101 32 18 -124 263 -19 176 208 -211 35 -85 84 -25 -74 186 99 -375 -188 -228 144 119 329 163
$$ packed form
3722a02K44K93m70j14J64k5K6l0n7j62K86k03K62j51r9j93K71k0J72Rj58J93l3
3745A03j95Q2J40K5k64N5K75m2P0o4j66JJ63o0j36j28J09L2j04L81k04J17Q3l91
3769a18k54J91O7q9O2J33nJ59k71l0K96j50r4o0K06j26L89j75j8j07p4j81K80
3792C1k5l25K65J82k83J54K12k90J1J65J66k23j03j5R9q6R1J8J7l3j6J5j16L9
3816e0k14N18n58K53J42j63L40Pm25K92k70p5k11K49J66K1j74L22P5j7j63k94
3838b29K44J21k41K05k60M77m59J3j06J17K81k53K15J34j89n1k2K13k56j29Qq9
3860b56R5j1J15K4L5o5j54M2J46J30l80J68J75j03k7m2K27j31J9j78R1J56n1P6
3884A01o9j4j42L87k82J95L2m19K46j20J69j09m9K60q7m74J87m0L72k5K10j66
$$ plain form
3906 163 -112 -240 -259 -189 -136 -116 -50 -217 -101 -12 -305 70 82 -151 166 172 -37 -16 -79 161 -130 156 -188 137
3930 137 -65 -5 179 131 -13 -66 -306 61 -131 -94 -100 8 -53 -129 148 79 26 42 149 383 55 -82 112 -24
3954 -24 -56 108 27 -61 -154 -210 81 -100 53 -138 -71 -25 -89 18 65 160 9 282 37 -152 59 113 -14 2
3978 2 189 0 -17 164 -36 189 -6 52 103 19 79 153 22 -52 172 82 145 86 -94 -69 -8 -190 -172 210 -207
4003 -207 6 165 137 25 -76 204 -31 31 -159 86 68 36 -30 23 -135 -343 -23 -171 31 -36 -80 130 52
4026 52 146 66 -59 -47 -261 133 -80 78 -162 -167 92 -182 -35 62 89 -82 -144 37 11 -174 -296 -33 -101 -274
4050 -274 -91 -151 78 -164 306 165 156 341 -144 73 134 356 48 120 -49 -55 197 259 97 -263 130 121 -265
4073 -265 -18 -316 -29 -12 49 -37 63 -10 -242 -6 45 89 -152 310 -34 123 -59 122 -71 134 47 21 83
$$ packed form
3906A63k75j28j9P0N3K0O6j67J16Q9k93L75J2k33L17Ok09K1o3K40k91K86l44L25
3930A37k02O0J84m8j44n3k40L67j92L7oJ08o1p6K77o9n3J6J07K34l28j37J94j36
3954b4l2J64q1q8r3n6K91j81J53j91O7M6o4J07M7R5j51K73k45j89K11N4j27J6
3978BJ87j89j7J81k00K25j95N8N1q4O0P4j31p4K24r0O3n9j80K5O1j82J8L82m17
4003b07K13J59k8j12j01K80k35O2j90K45j8l2o6N3j58k08L20j48K02o7m4K10p8
4026E2R4q0j25J2k14L94k13J58k40nK59k74J47R7K7j71o2J81k6j85j22K63o8j73
4050b74J83o0K29k42M70j41rJ85m85K17O1K22l08P2j69oK52O2j62l60L93rl86
4073b65K47k98K87J7O1q6J00p3k32K36N1M4k41M62l44J57j82J81j93K05q7k6O2
$$ plain form
4096 83 -274 -112 41 -6 146 103 -7 119 -5 76 -158 -102 53 -208 -55 27 135 300 -85 -138 -156 -8 -185
4119 -185 194 -114 -5 170 384 6 -7 87 70 -60 77 -294 -179 163 -153 84 51 263 111 118 -144 80
4141 80 -24 191 39 -221 228 126 126 -29 181 -57 -141 116 -96 139 87 -125 4 -186 35 69 114 147 -114
4164 -114 -111 -20 -265 151 -65 243 54 26 -166 52 -71 108 -141 -208 120 -117 -135 148 193 177 40 -66 195
4187 195 196 -144 186 176 196 -34 183 -62 -36 -36 60 -3 -159 312 150 -75 99 -88 265 294 228 -57 90 -4
4211 -4 -41 -95 -115 32 217 193 -85 -23 -216 59 -83 -241 28 -141 147 212 99 127 -290 319 -5 -224 56
4234 56 77 -203 147 18 -145 203 208 -438 118 -160 -140 217 77 -50 35 95 -43 -219 34 -38 37 -83 213
4257 213 95 -154 -179 57 23 -353 -41 -138 157 -110 -81 189 16 -155 -78 208 -148 -228 -185 -67 136 57 -87
$$ packed form
4096H3l57J62J53m7J52m3j10J26j24Q1k34N6J55k61J53Q2J08J65l85n3j8J48j77
4119a85L79l08J09J75K14l78j3R4j7j30J37l71J15L42l16K37l3K12j52Pk62K24
4141H0j04K15j52k60M49j02%j55K10k38q4K57k12K35n2k12J29j90K21L4M5L3k61
4164a14LR1k45M16k16L08j89k8j92K18j23J79k49o7L28k37j8K83M5j6j37j06K61
4187A95Jl40L30j0K0k30K17k45K6%R6o3j56M71j62k25J74j87L53K9o6k85J47r4
4211dl7n4k0J47J85k4k78O2j93K75j42j58K69j69K88O5j13K8m17O09l24k19K80
4234E6K1k80L50j29j63L48No46N56k78K0L57j40j27Q5O0j38j76K53p2P5j20K96
4257B13j18k49k5K36l4l76L12r7K95k67K9K70j73j71P7K86l56q0M3J18K03p9j44
$$ plain form
4280 -87 -258 221 31 -295 170 -82 273 -218 79 -221 172 22 -115 80 210 -48 143 -33 63 -158 -28
4301 -28 13 -61 273 -163 24 -7 -104 -239 158 -45 40 186 29 -170 -320 -258 -129 77 54 -105 3 -130 27
4324 27 67 -31 67 -111 143 161 71 168 128 103 -17 -122 70 -112 89 -110 1 -87 112 109 28 -38 -108 -86 -42 102
4350 102 187 -115 -146 154 6 -92 -97 132 16 74 -8 178 -99 61 -233 93 -215 -128 117 -242 237 1 79
4373 79 -165 0 116 216 266 -190 -25 59 46 -26 87 248 131 122 -119 -8 -18 -99 -220 80 -201 135 -206
4396 -206 137 25 141 21 -41 -109 -18 355 52 251 132 -149 -233 267 -28 98 -129 142 -20 -185 21
4417 21 204 165 -332 -140 -4 235 -71 -299 -356 103 -243 -108 -246 -120 125 156 130 -43 -183 -81 -28 -44
4439 -44 351 15 -216 298 -177 -13 88 27 -21 87 -348 -269 420 1 -82 -201 178 179 65 156 -71 -61 -116
$$ packed form
4280h7j71M79j90l26M65k52L55m91K97l00L93j50j37J95J30k58J91j76R6k21J30
4301b8M1p4L34m36J87l1r7j35L97k03Q5J46j57j99j50O2J29K06k3j59J08j33J57
4324B7M0r8R8j78K54J8r0R7m0k5j20j05J92j82K01j99J11q8J99lq1o6p0K2M4J44
4350A02Q5l02l1L00j48r8nK29j16N8q2J86k77J60k94L26l08Q7K45l59M79k36P8
4373G9k44J65J16J00N0m56J65Q4j3p2J13J61j17rk41J11j0q1j21L00k81L36l41
4396b06L43j12J16j20o2o8R1L73l03J99j19k81q4N00k95J26k27K71j62j65K06
4417B1J83l9m97J92J36K39l06k28n7M59l46J35j38J26K45L1k6j73j40J02N3j6
4439d4L95l36k31N14m75J64J01o1m8J08m35P9O89m19q3j19L79Jj14R1k27J0n5
$$ plain form
4462 -116 -87 177 -88 52 -139 -73 118 -135 210 -6 84 -13 -278 -37 50 251 -85 -443 -231 17 367 -76
4484 -76 -145 189 27 -190 145 -95 -73 -257 -158 0 156 -10 -186 132 53 131 203 326 -174 145 -85 63
4506 63 -260 55 107 -284 121 -13 -11 -87 -69 -13 29 144 -230 -128 -280 36 -58 187 -79 -3 -35 19 66 -384
4530 -384 108 -11 -258 -113 61 -128 65 198 232 129 158 20 -212 150 -168 -33 -255 -47 -1 31 116 181
4552 181 55 1 236 100 -104 -66 134 88 -45 75 117 142 -16 95 120 -22 6 -22 33 -185 -106 296 -437
4575 -437 -223 5 -171 163 100 184 135 191 251 -49 97 11 -46 -66 -303 -18 -230 163 -169 174 59 -57 91
4598 91 355 308 183 -201 239 -149 -102 265 4 -11 -253 142 -239 111 -72 0 258 69 218 44 -107 -3
4620 -3 142 -61 -185 -40 183 69 105 -126 291 -118 -85 100 135 -35 14 123 -222 76 22 -278 142 -151
$$ packed form
4462a16K9K64k65J40j91O6J91k53L45k16R0r7k65K41Q7K01l36l58K12K48L50m43
4484g6o9L34j62k17L35k40K2j84R9J58J56j66j76L18p9P8P2J23n00L19k30J48
4506F3l23L15N2l91M05j34Kp6J8N6M2J15l74J02j52L16r4K45k66P6l2N4M7m50
4530c84M92j19k47J45J74j89J93J33L4j03K9j38k32L62l18J35k22K08M6L2Q5O5
4552A81j26n4K35j36k04L8K00m6j33J20M2K5j58J11K5j42K8k8N5k18P9M02p33
4575d37K14K28j76L34o3Q4m9N6O0l00J46q6n7k0k37K85k12L93l32L43j15j16J48
4598I1K64m7j25l84M40l88M7L67k61j5k42L95l81L50j83P2K58j89J49j74j51J04
4620cJ45k03j24J45K23j14L6k31M17m09L3J85L5j70M9J09l45K98n4l00M20k93
$$ plain form
4642 -151 -216 199 -330 -116 -139 109 -129 194 -90 32 -151 -136 131 -33 -279 64 93 0 -139 -108 56 181
4664 181 269 -30 170 -315 -198 -2 139 222 25 -83 15 -64 13 165 -176 86 -57 22 98 60 26 272 -165
4687 -165 19 227 -17 172 -5 158 183 -56 56 -18 -105 -46 -151 276 16 -142 143 -46 -151 -67 -8 243
4709 243 -18 -73 -167 -92 -13 84 76 -44 -23 -220 -133 252 106 76 35 83 119 -55 51 133 -151 -100 109 88 187 46
4735 46 -49 -116 27 -122 -127 -59 -40 253 294 244 70 -169 129 -150 -21 145 -170 30 -52 91 -23 292 52
4758 52 239 15 -70 145 17 -39 76 -95 -125 208 274 -106 -269 -19 45 -144 157 -57 -158 104 -161 49
4780 49 -349 86 129 496 -45 49 -73 -220 25 169 46 21 57 -317 -124 153 -82 -239 -84 -84 10 236 58
4803 58 227 200 -315 -45 -193 7 123 -26 60 -18 114 285 -335 91 102 -60 -164 -143 106 -304 102 -124
$$ packed form
4642a51o5M15n29K14k3K48k38L23k84J22j83J5K67j64k46L43K9r3j39L1J64J25
4664A81Q8k99K00m85J17J96J41Q3j97j08R8p9P7J52l41K62j43P9P6l8l4K46m37
4687a65J84K08k44J89j77J63K5k39J12p4q7N9j05M27k60j58K85j89j05Q4N9K51
4709B43k61n5r4P5P9R7qj20K1j97Q7L85j46l0m1M8L6j74J06Q2k84N1K09k1R9j41
4735D6r5o7J43j49nO8J9K93M1n0j74k39K98k79J29J66l15K00q2J43j14L15k40
4758E2J87k24q5K15j28n6J15j71l0L33O6l80j63K50O4j89L01k14j01K62k65K10
4780D9l98M35M3L67n41R4j22j47K45J44j23k5L6l74J93K77k35j57J55%R4K26j78
4803E8J69k7n15K70j48K00J16j49Q6p8J32J71o20M26J1j62j04K1K49m10M06k26
$$ plain form
4825 -124 133 -6 169 -210 207 124 116 54 -165 -2 -172 -160 -36 -142 0 -90 -18 44 -215 -194 -76 206 -73
4848 -73 -143 -99 280 -96 -62 110 235 -187 -60 -226 -73 -256 -363 -87 -130 -96 -184 -94 -106 -60 -280 31 -82
4871 -82 -103 -141 -113 52 108 31 249 25 -72 28 70 -167 -85 -75 -299 9 -26 -92 -135 12 218 -185 -156 -96 26
4896 26 161 35 -34 11 -404 194 -98 -165 -30 -46 71 -29 22 -198 71 101 29 -45 -8 162 113 163 146 61 118
4921 118 209 107 -24 83 341 6 53 98 -337 -94 -134 -103 21 200 -162 -40 -89 -119 260 -13 -42 64 45
4944 45 219 184 33 -133 162 -229 -119 -18 170 72 -37 15 -33 -19 32 -11 70 -53 -397 -98 34 73 -128
4967 -128 31 -135 -135 26 137 -124 264 154 -11 56 46 124 -3 -36 150 27 36 226 -132 85 -5 223 110
4990 110 8 88 -404 -124 -48 -432 -131 -45 -33 -233 -96 -145 -31 -206 206 212 90 212 209 80 196 317 -80
$$ packed form
4825a24K57j39J75l79M17q3qo2k19J63j70J2J24j06J42r0P2O2k59K1J18K82k79
4848g3p0M4L79l76L4J72J25m22J27j66J53j83j07K76m3L4q8R0j2M6k20L11j13
4871h2k1l8K8J65N6p7K18k24r7J00M2k37Q2J0k24L08l5o6m3J47K06m03K9O0J22
4896B6J35j26o9M5m15N98k92o7J35j6J17j00N1k20K69L0p2p4L7J70m9N0j7q5N7
4921A18R1j02j31J07K58l35M7M5m35K43m0L1J24J79l62J22m9l0L79k73k9J06j9
4944D5J74l5j51j66K95l91J10J01J88r8j09N2m8J4N1m3Q1j23l44K99J32L9k01
4967a28J59j66%J61J11k61L88j10j65O7j0P8j27l3J86j23RJ90l58K17r0K28j13
4990A10j02Q0m92K80P6l84L01Q6J2k00J37m9J14j75M12Oj22J22lj29J16J21l97
$$ plain form
5013 -80 -85 -93 94 35 162 176 110 161 -242 17 -14 29 275 165 67 -133 -70 120 -10 -33 69 -277 42 -63 -105
5038 -105 41 -30 -107 -147 -25 32 7 -185 65 125 32 236 0 201 167 -75 -211 112 -32 203 92 120 28
5061 28 -48 60 54 137 -23 107 19 56 168 -62 -78 144 -257 76 12 -184 38 -76 -3 283 -57 -45 -165 -32
5085 -32 37 137 -12 -203 160 164 182 109 146 103 -19 30 -113 344 72 310 261 146 -19 -95 58 49 27 45 -66
5110 -66 126 147 -13 -112 -139 -83 -68 113 -51 61 -106 137 98 450 44 -40 -34 -95 -85 -40 -127 -18 14 -80 103
5135 103 99 8 -72 -10 -14 63 -119 -89 -109 189 259 35 -12 265 -316 81 300 98 48 93 -64 -317 -149 -66 186
5160 186 -306 86 -403 -137 -25 106 -42 199 -209 -171 -33 -48 186 -190 -34 186 30 145 -70 174 -142
5181 -142 147 -151 239 -96 124 -35 122 -14 -261 40 125 151 -303 -38 74 211 -94 -50 -31 96 126 -112
$$ packed form
5013h0nqJ87n9J27J4o6N1m03K59l1M3K46j10r8k00O3J90j30k3J02l46L19j05m2
5038a05J46p1p7m0J22N7k5j92K50O0r3K04k36K01l4k42j36L23j44K35j11K8r2
5061B8p6J08oQ3j60J30q8L7J12k30j6K22m01L33o4j96K22j14P3K86l40J2j20J33
5085c2O9J00j49j91L63MJ8p3L7m3j22M9j43M57k72K38m9j15j65p6J53rk2J8j11
5110f6J92K1j60r9k7N6J5J81j64J12j67K43l9L52m06q4Oo1J0M5q7J09L2r4J83
5135A03mr1q0O2mP7j82L0k0K98P0k24m7K77n81L97K19k02n0M5j57k53J68Q3K52
5160A86m92L92m89K66J12J31j48K41m08L8J38j5K34l76J56K20j56J15k15K44l16
5181a42K89k98L90l35K20j59J57j36k47L01Q5K6m54K65J12J37l05M4J9J27L0k38
$$ plain form
5203 -112 101 -20 -27 93 -70 236 -330 -160 -26 -257 -172 -60 -12 102 -43 18 235 148 65 -108 115 -177
5225 -177 -29 -4 -125 202 -147 -144 156 -144 209 48 212 259 174 97 -17 349 42 -84 -23 -53 83 -20 101
5248 101 75 28 -180 -124 -92 -12 -16 -221 -78 -141 -111 -184 37 62 128 -130 -72 -106 68 -121 153 172 -216 -49 59
5273 59 -105 302 -301 -30 -112 197 29 372 -17 -69 -120 68 -143 30 -29 -31 100 -257 204 -164 98 13 8
5296 8 -231 119 73 34 -57 -90 -301 -149 -92 88 35 -76 -72 175 -128 30 -168 61 137 247 133 143 220 -143
5320 -143 -184 -302 28 -65 -42 -304 211 92 20 73 85 -13 -34 -251 304 34 81 130 -271 143 -48 -63 -271 -153
5344 -153 -165 -195 240 0 -77 -211 83 -14 131 72 141 168 107 95 -239 148 30 54 -98 -45 230 -51 -429 33
5368 33 -180 -90 236 147 91 -37 -84 -28 -59 38 175 -4 -87 12 -64 -114 -259 121 -13 329 -135 204 139 -105
$$ packed form
5203a12K13j21pJ20j63L06n66J70J34k31Q5J12M8J14j45O1K17q7q3j73K23k92
5225a77J48K5j21L27l49LL00l00L53j61J64M7q5p7j14L66l07j26O1l0J36j03J21
5248A01k6m7k08N6L2Q0mk05J43o3L0p3K21K5O6k58N8l4J74j89K74J9l88J67J08
5273E9j64M07o03K71q2L09j68L43l89n2n1J88k11J73n9kJ31l57M61l68K62q5n
5296Hk39L50m6l9r1l3k11J52N7J80n3j11MK47l03J58j98K29P6J10j14J0P7l63
5320a43m1j18L30r3K3k62N15j19p2N3J2r8k1k17N55k70M7M9m01M14j91j5k08J18
5344a53j2l0M35k40p7j34K94r7J45n9O9K7o1j2l34L87j18K4j52N3K75k81l78M62
5368C3k13R0L26q9n6j28m7N6l1R7J37j79q3R9p6n0j45L80j34L42m64L39o5k44
$$ plain form
5392 -105 41 104 14 40 157 205 110 -42 14 63 -30 26 240 -30 82 -421 -210 134 -20 -30 -76 136 9 9
5416 9 -98 26 -62 167 -83 -62 6 -93 14 -408 27 -122 235 -158 77 54 -103 -173 142 76 234 112 -113
5439 -113 58 -284 58 193 -61 149 -192 -122 -219 84 -93 -49 279 -144 -126 213 125 -129 -178 69 -10 5 18
5462 18 42 318 -116 -204 37 -228 17 57 11 134 -107 -64 428 289 109 -37 -13 -18 -131 1 -69 -64 -15 -216
5486 -216 54 229 -88 80 15 -63 -35 -100 23 164 -69 13 59 175 -201 -152 95 173 58 56 -345 16 -4 98
5510 98 -85 -101 177 -243 63 -130 87 43 -135 10 188 21 -203 -266 15 -29 -71 -126 142 77 31 262 6
5533 6 -274 -287 36 177 44 -134 -42 -46 36 62 -107 121 378 -72 -215 -66 -96 24 40 -121 -158 149 -197 -214
5557 -214 90 -53 -146 30 76 190 243 3 250 19 -127 -235 48 -114 22 38 19 45 47 -114 -114 231 159 -292
$$ packed form
5392a05J46O3r0K6J17M8r5j52N6M9r3N6K14k70J12n03K11L44j54j0m6K12j27%
5416Ij07J24q8K29k50K1O8r9J07m22M35j49L57l93K35k3j57p0L15o6J58j22k25
5439a13J71l42L42J35k54K10l41P0r7L03j77M4L28m23J8L39q8k54m9K47p9J5J3
5462A8K4K76m34q8K41k65K45M0m6J23k41M3M92j39j80j46K4nj13J32p0NM9k01
5486b16K70J75l17J68o5p8K8o5J23J41k33Q2M6J16l76M9K47P8j15km01L61k0J02
5510I8j83j6K78m20L06j93K17m4j78J45J78j67k24o3K81m4m2n5K68o5m6K31k56
5533Fk80j3L23J41j33j78R2mQ2K6j69K28K57m50j43J49l0J20J6j61l7L07l46j7
5557b14L04j43r3J76M6J14N3k40K47k31j46j08K83j62J36J6j9K6Kj61%L45p2m51
$$ plain form
5581 -292 -123 273 -21 -158 -87 -21 93 223 26 11 -164 -81 231 32 137 -99 238 49 115 -61 180 2
5603 2 -36 -234 20 -216 -114 -126 121 70 69 -169 267 141 -99 118 211 71 -52 -179 65 -114 -53 -48 22 60
5627 60 89 26 -95 -119 343 61 -63 -61 25 -53 45 -71 13 -41 -110 -130 296 79 -180 -100 74 75 -148 70 162 83
5653 83 74 110 72 -171 -180 -66 5 -154 47 126 53 128 -93 -280 1 45 118 143 125 -345 56 203 -326 57 -111
5678 -111 -94 -69 209 211 -30 -357 95 175 47 -54 -144 -147 -22 75 32 -27 -64 -96 -223 -135 -259 299 63 213 15
5703 15 -103 -194 -218 151 -28 -50 -208 -236 136 -250 -20 215 102 -80 -23 14 93 30 134 32 97 54 -13 148
5727 148 -19 -116 181 30 -114 -69 -211 7 176 -42 -55 15 101 -82 -175 99 40 152 -44 13 262 -91 -46
5750 -46 179 -228 -135 66 197 119 111 78 104 46 -112 -78 288 -23 373 -48 80 -91 -68 23 -42 242 -79 89
$$ packed form
5581b92J69L96k94j37P1O6J14J30j97j5j75Q3L12j99J05k36L37j89O6j76K41j78
5603Bl8j98K54k36J02j2K47n1jk38M36j26k40K17R3j40j23j27K44j79O1NP0L8
5627F0K9o3j21k4M62k82j24KQ6p8R8j16Q4n4o9k0M26k17k59Q0J74Jk23K18R2p9
5653H3rL6l8k43rJ14P1j59K01P9p3P5k21j87K81M4P3K5j8m70M01J47n29L83j68
5678a11J7K5K78Kk41l27M52Q0j28j01r0lJ25R7m3n9l7l2j27Q8j24N58k36J50j98
5703A5j18r1k4L69j79k2j58k8L72l86K30K35j13j82N7L7P9o3J04j02O5m3o7J61
5727A48j67r7K97j51j44M5j42K18J69k18j3P0Q6j83r3K74n9J12j96N7K49l53M5
5750d6K25m07R3K01J31p8ql3K6n8j58L4L66l11L96m21J28j71K3R1o5K84l21J68
$$ plain form
5774 89 -181 -311 80 -208 -173 -8 -38 76 40 -25 153 -154 14 -39 -106 30 -125 434 373 -171 -106 103 45
5797 45 25 -303 16 -106 288 -23 -384 -128 159 -226 59 58 21 -9 -101 31 26 290 -46 145 96 -225 254
5820 254 -148 -196 86 -104 -60 -196 -101 -59 121 -224 -85 -296 55 55 3 38 -343 -37 44 -61 -102 120 -122
5843 -122 114 54 213 -80 139 87 -179 -310 135 12 -16 68 -113 -150 -229 -108 45 -26 325 -155 26 -186
5865 -186 1 240 63 -171 -111 68 76 -58 -36 -232 65 -172 208 13 133 -25 -35 -26 84 178 -212 -105 -180
5888 -180 30 137 223 -78 186 58 -307 -9 -67 -124 -18 -37 -68 -66 125 328 -250 200 -77 192 -244 177
5910 177 64 -116 31 27 1 -48 131 -72 -2 169 129 -44 52 -22 86 355 -11 31 -173 35 -244 70 153
5933 153 -34 178 -223 116 -55 135 76 -1 64 -127 -206 -200 -207 -170 12 -109 139 195 -156 63 110 240 -141 237
$$ packed form
5774H9k70j30L91k88L5J65l0J14l6o5J78l07J68n3o7J36j55N59o1n44O5K09n8
5797D5k0l28L19j22L94l11l61K56K87l85K85jl7l0r2J32nK64l36J91m9l21M79
5820B54m02m8K82j90M4j36R5M2J80l45J39k11L51%n2L5l81L06Q1j05m1K22k42
5843a22K36o0J59k93K19n2k66j31M45j23k8Q4j81l7p9J21J53p1L51m80J81k12
5865a86J87K39j77k34O0J79Qj34K2j96K97k37L80j95J20j58j0RJ10R4l90J07p5
5888a80K10J07Q6l01K64j28l65K98n8n7J06j9l1KJ91K03n78M50k77K69m36M21
5910A77j13j80J47mk6m9J79k03P0J71m0j73R6p4J08K69l66M2k04K08k79L14Q3
5933A53j87K12m01L39j71J90n9p7O5j91p9OpL7J82j21K48N6l51K19M7J30l81L78
$$ plain form
5957 237 -64 170 153 24 110 -65 -85 -194 -116 21 -91 11 178 -268 -358 34 -123 62 5 46 87 97 -198
5980 -198 74 -103 -233 -147 -194 -191 48 -57 -153 143 257 -218 -21 52 -116 -258 14 105 5 177 -119 317
6002 317 30 -35 2 354 193 -100 -68 -128 -145 39 4 -215 -16 210 200 126 163 -118 118 -38 208 249 17
6025 17 172 -82 -35 3 139 -212 -86 -221 27 -38 -71 83 -24 -41 -122 10 63 -216 30 -173 108 112 63 79
6049 79 14 202 -34 171 -14 197 172 -175 -19 -71 12 -38 -50 -153 -142 95 -63 -200 -150 -19 65 -84 247
6072 247 -160 -232 -126 -30 -174 293 -61 284 184 10 -227 135 -89 92 -96 -83 213 137 41 242 -85 454
6094 454 88 46 207 163 92 -7 -245 -198 46 -181 35 -168 58 -27 100 -69 184 -25 16 148 166 -45 -33
6117 -33 -119 79 -172 -272 21 -158 22 91 -253 53 144 102 149 110 32 186 97 52 -3 105 -41 -251 70 -5
$$ packed form
5957B37l01K34j7j29Q6j75k0j09P8J37j12J02J67m46r0L92j57J85n7M1M1J0k95
5980a98K72j77j30Q6m7LK39j05r6K96J14m75J97P3j68j42K72R1j00J72k96M36
6002C17k87o5L7L52j61k93L2o0j7J84l5k19J99K26j0p4L7k81K36j56K46M1k32
6025A7J55k54M7L8J36l51J26j35K48o5l3J54j07j7q1J32N3k79K46k03K81Mm9J6
6049G9o5J88k36K05j85K11k5l47J56n2Q3n0j2j03J1K37j58j37N0J31Q4j49L31
6072B47m07p2J06R6j44M67l54L45j00j74k37L62k24J81j88J3K96p6r6K01l27N39
6094D54l66m2J61m4p1r9k38M7K44k27K16k03K26q5J27j69K53k09M1J32J8k11J2
6117c3q6J98k51j00K93j79J80O9l44L06R1m2M7l9p8J54q9m5n5J08j46k10L21p5
$$ plain form
6141 -5 -57 260 -288 95 16 3 -233 98 95 -139 -90 240 58 -54 9 78 -106 -66 -74 141 21 188 -102 -239
6165 -239 278 -40 21 80 -52 234 -174 150 180 -107 -140 104 -9 155 -209 104 242 -121 -68 88 -62 143
6187 143 67 -330 45 214 -159 -210 116 133 -31 -23 -291 59 45 197 -80 19 8 10 61 21 177 -90 60 -235
6211 -235 112 -121 -304 -421 -42 -98 4 -17 -14 -58 193 33 -42 -58 -130 -135 -188 -12 -117 262 -16 233 -164 448
6235 448 2 -66 139 127 174 -29 86 -39 167 167 -252 -233 -72 274 -193 235 110 -88 43 22 -30 158 -182
6258 -182 28 -43 123 156 32 -68 40 -128 -123 34 -34 -101 -443 211 -216 375 177 396 -164 34 162 225
6280 225 131 112 -162 -101 263 43 23 -137 -7 114 44 -33 -73 31 187 -66 -33 -78 12 49 -36 -167 -52 -37
6304 -37 107 -9 178 78 -81 -5 68 -78 307 -315 -1 -139 4 -167 107 -81 -107 334 348 216 40 71
$$ packed form
6141en2L17n48L83p9j3k36L31lk34M9L30j82j12O3O9j84M0qK15j20J67k90j37
6165b39N17l18O1N9j32K86m08L24L0k87l3K44j13J64l64L13J38l63N3J56j50K05
6187A43p6l97L75J69l73n1L26J7j64Qk68L50j4J52k77R9j1KN1m0J56k67J50k95
6211b35L47k33j83j17L79n6J02k1Lm4K51j60p5j6p2nn3J76j05L79k78K49l97O12
6235D48m46o8K05j2M7k03J15j25K06%m19J9J61L46m67M28j25j98J31k1n2J88l40
6258a82K10p1J66L3j24j00J08j68NJ57o8o7l42O54m27N91j98K19n60J98J28O3
6280B25r4j9k74O1L64k20k0j60J30J21p0p7m0J04J56k53L3m5R0L7q5j31J15J5
6304c7J44j16J87j00j59P6P3j46L85o22L14j38J43j71K74j88k6M41J4j32j76L1
$$ plain form
6326 71 80 -9 22 -73 -76 -18 155 -148 81 6 -142 -235 174 -48 -38 173 289 -55 178 86 163 172 -67 -84 -170 273
6352 273 -33 -25 -125 13 -83 -72 42 -97 102 129 -129 21 80 -72 -165 -156 -46 -3 -223 -22 -149 156 170 -185
6376 -185 -30 222 -18 173 -139 -305 94 56 -151 304 -38 -134 -258 234 -82 -158 206 -136 -27 -6 170
6397 170 317 -96 105 149 -2 -94 -186 -252 4 125 181 45 79 -170 -6 -12 165 22 49 -54 141 50 -174
6420 -174 -170 -106 232 329 -198 24 -3 -269 -70 47 39 -185 -22 -221 -19 -48 -333 0 -112 10 -19 -72 -131 124
6444 124 201 -224 150 285 149 -178 263 -40 279 -69 -83 -161 -295 83 -286 -14 418 63 188 -163 89
6465 89 175 -101 -112 -118 -33 240 77 -176 -145 -166 -26 30 228 74 -27 47 154 -187 -97 8 106 69 -68 97
6489 97 -82 -191 16 -187 185 -1 306 -21 35 -277 -192 -51 -90 -88 101 -102 204 -237 -116 139 7 -327
$$ packed form
6326G1Rq9L1r5lN8J73l03K29p5j48r3M09k22J0K11J16l44K33r2P7Rk39j7q6M43
6352B73l06Qj00J38r6J1J14j39J99K7k58J50N9j52r3RJ10M3k20K01j27L05J4l55
6376a85J55K52k40J91l12j66L99l8k07M55l42r6j24M92l16p6L64l42J09K1J76
6397A70J47m13K01M4j51r2r2o6K56J21N6j36L4k49J64oJ77j43K7j03J95r1k24
6420a74MO4L38R7n27K22k7k66J99J17qk24J63j99K02k9k85L33j12J22k9n3n9K55
6444A24P7m25L74J35j36l27M41l03L19l48j4p8j34L78l69K72M32l55J25l51K52
6465H9Q6k76j1oQ5K73j63k53L1k1J40N6J98j54j01P4J07l41R0J05R8l7j37J65
6489I7j79j09K07k03L72j86L07l27N6l12Q5J41l9KJ89k03L06m41J21K55j32l34
$$ plain form
6511 -327 6 -1 70 134 -204 58 -118 -117 20 178 -71 303 -111 91 -38 62 282 -237 127 82 -144 -58 -21
6534 -21 -290 18 314 4 -3 90 -309 -53 -61 -18 51 324 -124 -18 -12 -143 -105 -253 199 158 349 56 204 77
6558 77 145 -67 74 10 5 201 37 10 258 79 -98 80 191 14 44 10 219 -22 15 49 -156 -178 -145 -33
6582 -33 22 193 -84 107 75 -143 443 249 -87 -79 -237 -30 -123 96 -242 -44 263 235 -36 -13 -57 -152 -133 213
6606 213 238 39 -64 -156 203 -16 -95 -94 183 -163 -252 193 -187 -107 31 -48 -251 -51 -198 -168 -104 -75 63 210
6630 210 -63 -119 218 -370 21 -192 -83 -131 -234 -6 -188 102 115 -66 35 62 150 166 -121 72 -43 -29
6652 -29 -81 -81 121 -336 -129 46 129 -123 -141 -3 -177 183 -100 27 44 162 77 258 -106 -85 -6 203 -31
6675 -31 96 -19 17 33 -58 -78 53 142 -241 -224 -111 115 -247 -225 -171 -40 16 -49 -91 -104 61 -195 24 189
$$ packed form
6511c27L33pP1O4l38K62j76JJ37J58k49L74m14K02j29J00K20n19L64m5k26Q6L7
6534b1k69L08K96l10pR3l99K56qM3O9K73m48J06Oj31L8j48M52m1J91k93J48j27
6558G7O8k12J41o4nJ96j64k7K48j79j77J78J11j77L0l4K09k41L7L4k05k2L3J12
6582c3N5J71k77J91l2k18N86j94l36Qj58K07r3K19l38J98L07k8k71K3m4r5J9L46
6606B13K5j99j03r2L59k19p9JK77l46q9M45l80Q0J38p9k03K00j47L0O4K9J38J47
6630B10k73n6L37n88L91k13J09m8j03K28j82K90J3j81J01K7Q8J6k87J93j15J4
6652b9n2%K02m57K07J75Q3k52j8J38j74L60k83J27J7J18q5J81l64K1P9K09k34
6675c1J27j15L6J6r1k0J31Q9l83J7J13K26l62K2N4J31N6o5m2j3J65k56K19J65
$$ plain form
6699 189 -4 222 -91 -25 -256 -52 191 43 -215 180 -65 90 45 334 17 -288 275 132 32 44 -148
6720 -148 140 131 91 173 -104 -237 -189 -183 -168 113 11 -125 7 153 -30 -179 -153 1 -88 21 17 -52 350 110
6744 110 86 20 -126 33 5 -32 -313 272 16 119 -148 -175 3 215 -170 102 241 318 -7 1 22 172 89
6767 89 -75 197 -416 42 -251 129 232 375 -5 -65 131 179 -178 297 -22 210 -176 186 -81 -10 -74 51
6789 51 262 150 -17 -288 79 -226 -56 -5 -297 20 -67 107 -8 183 -83 -116 252 -94 192 -156 -157 -143
6811 -143 184 76 81 51 53 -454 -73 59 160 76 3 -75 -108 149 -137 86 -106 182 -51 196 132 -203 -14
6834 -14 -90 109 -7 -132 -135 -104 222 -80 -78 144 110 -253 -57 -82 36 -85 -53 -52 80 -240 21 22 -118 27 140
6859 140 102 -82 94 -45 44 109 -207 -45 190 -343 31 188 -151 82 165 -211 88 18 16 -223 24 -189
$$ packed form
6699A89j93K26l13O6k31K04K43j48k58L95k45J55m5K89l17l05N63j43j00J2j92
6720a48K88rm0Q2k77j33M8OJ5K81j02j36J32J46j83j49K6J54q9J09mo9M02k40
6744A10k4o6j46J59k8l7k81N85k56J03k67k7J78K12l85K72J39P7l25QK1J50q3
6767H9j64K72o13M58k93L80J03J43l80o0J96M8l57M75l19K32l86L62k67P1o4J25
6789E1K11j12j67k71L67l05J70N1k92L17q7J74j15J91k66l3L68l46K86l48jJ4
6811a43L27j08Nl0Kn07L81J32J01q4p3p8l3K57k86K23j92K88k33K47o4l35J89
6834a4p6J99j16j25lL1L26l02KK22l4l63J96k5J18j21L2JJ32l20K61Jj40J45J13
6859A40l8j84J76j39Q9O5l16J62K35n33L74J57l39K33Q3l76K99p0kk39K47k13
$$ plain form
6881 -189 -149 199 9 -16 -114 -22 85 -59 72 179 -30 -3 -73 -149 2 -237 151 15 -75 172 65 -204 102
6904 102 243 -223 -139 56 -161 -175 -106 -111 -143 -181 -91 17 -58 36 -108 -70 43 -21 -159 -9 -247 182 -59 273
6928 273 64 -155 41 362 139 82 223 -89 -210 42 123 47 65 -222 -85 -19 199 78 4 35 -4 189 -98
6951 -98 175 294 220 106 -311 -279 -179 -137 68 -76 4 176 -312 2 4 -8 -251 -362 -239 42 -229 -77 -34
6974 -34 186 -333 -117 14 89 9 -49 -88 39 -22 81 61 -62 24 121 -182 188 -48 65 -121 -262 -265 110 31
6998 31 32 79 145 240 -218 -88 -226 -269 164 -185 -43 428 -130 25 -79 78 -185 8 242 77 6 44 -146
7021 -146 201 19 37 -51 33 -56 -123 306 216 128 140 -250 122 -179 145 174 52 103 -220 98 11 269 -184 94
7045 94 91 160 -49 42 -23 235 -18 -303 147 -135 110 149 20 47 34 65 166 -62 17 46 -102 -160 -40 -80 -112
$$ packed form
6881a89M0L48j90k5r8R2J07j44J31J07k09K7p0p6J51k39L88j36r0K47j07k69L06
6904A02J41m66Q4J95k17j4O9nl2l8R0J08p5R4j44L8J13o4j38J50k38M29k41L32
6928B73k09k19J96L21k23n7J41l12j21K52Q1p6J8k87J37O6K18j21p4L1l9J93k87
6951i8K73J19p4j14m17L2J00M2K05j44Q0J72m88L14Kj2k43j11J23K81k71J52M3
6974c4K20n19K16J31P5q0n8l9J27o1J03k0j23Q6R7l03L70k36J13j86j41lL75p9
6998C1JM7O6R5m58J30j38m3M33l49J42M71n58J55j04J57k63J93K34j65p1L8j90
7021a46L47j82J8q8Q4q9o7M29r0q8J2l90L72l01L24K9j22N1l23L18q7K58m53K78
7045I4lO9k09R1o5K58k53k85M50k82K45L9j29K7j3L1J01k28P9K9j48n8J20m0l2
$$ plain form
7070 -112 16 -250 74 2 -15 -138 24 158 16 90 169 24 110 -141 110 112 176 163 -4 126 0 183 28
7093 28 -207 208 -21 -17 84 -42 -86 22 -10 -409 89 -230 56 -94 59 -149 -46 36 218 83 108 292
7115 292 -75 213 -69 -256 86 -33 22 247 90 239 34 145 -190 51 44 79 -157 59 -43 155 -67
7136 -67 -106 32 166 -167 -283 180 -81 198 -62 -74 252 209 46 176 7 -102 -21 193 -257 156 -19 -178
7158 -178 130 -271 -121 142 21 87 -371 -109 21 -82 -146 26 -6 64 -17 -59 32 -224 -215 -191 -32 -173 21
7181 21 15 13 82 142 187 -22 232 -76 -92 -114 166 45 38 -17 -11 131 41 -9 -153 -82 -123 54 -98 -116 91 -24 119
7208 119 -82 -143 -4 65 -153 -150 -202 -49 -150 -86 151 216 54 -38 -270 -275 231 -320 305 82 137 -206 5 -91
7232 -91 190 97 -109 -3 -152 -38 -1 -149 30 78 98 -257 -416 -268 142 230 147 208 -69 180 87 -222 -240
$$ packed form
7070a12J28k66L24p2j7j23J62J34j42P4P9j45Q6k51K51KO4j3j67J30j26J83j55
7093B8k35M15k29MJ01j26m4J08l2l99M98l19K86j50J53k08J03Q2J82j35K5J84
7115B92l67K88k82j87L42j19N5K25j57J49k05J11l35K41pL5k36K16j02J98k22
7136f7l9J38J34l33j16M63k61K79k60j2L26m3j63J30j69j09Q1K14m50M13j75j59
7158a78L08m01J50K63j21O6m58K62J30j03o4J72l2P0q1m2R1k56RK4J59j41J94
7181B1okO9O0M5k09K54l08j6k2K80j21pn5OJ42r0n0j44P1m1J77j52j8K07j15J43
7208A19k01o1J39O9k18Ln2J53j01O4K37O5j62r2k32nN06n51O25k23N5l43K11r6
7232i1K81r3k06J06j49J14L7j48J79M8K0l55j59J48M10Q8q3O1k77K49r3l09j8
$$ plain form
7255 -240 -32 150 0 113 185 -95 -27 54 -151 -129 53 -119 -40 -139 -154 60 1 52 -380 -69 -243 -58 -207
7278 -207 -222 -50 131 67 99 -56 75 15 3 327 -18 127 90 356 -59 -254 10 33 61 -131 158 -27 -3
7301 -3 24 203 -113 -207 -16 -84 -334 -141 115 205 -82 231 115 -160 -162 -348 -241 -5 -45 -49 64 -46 224 309
7325 309 41 -237 -204 -95 218 168 -200 -60 -141 146 -55 35 -196 -253 -75 -15 14 13 -193 -100 134 -269 -5
7348 -5 -160 -159 174 -106 63 47 230 185 -228 -19 60 -159 39 9 -32 21 53 -43 -145 233 -194 -170 357 121
7372 121 -188 108 -46 168 -438 -248 33 5 95 6 -148 -17 82 25 -81 -7 32 -308 77 127 62 -157 120
7395 120 -226 131 81 -39 -245 -222 -83 -81 99 -234 7 -7 -170 28 -117 7 125 32 58 -7 -34 -35 32 -386
7419 -386 -57 -13 -91 48 -101 -202 -65 205 52 8 245 -56 -171 -93 224 -83 104 -99 -231 67 -175
$$ packed form
7255b40K08J82j50J13P2k80O8Q1k05K2J82j72P9r9j5K14n9N1m32L11j74J85j49
7278b07j5J72J81o4L2j55J31o0j2L24l45J45l7K66m15j95K64K3K8j92K89j85K4
7301cK7J79l16r4J91o8k50J93K56R0k87L13j16k75kj86J07K36m0mJ13j10K70Q5
7325C09k68k78L3J09L13n0l68J40q1K87k01R0k31n7J78O0K9jk06R3K34m03K64
7348ej55JL33k80J69j6J83m5m13K09P9k19J98l0m1N3L2r6j02L78m27K4N27k36
7372A21l09K96j54K14o06J90K81k8R0q9j54J31R9n7j06P4L9l40L85N0o5k19K77
7395A20l46L57n0j20k06K3J39KJ80l33K41j4j63J98j45J24J18r3K6o5k7jO7m18
7419c86L29M4p8J39j49j01J37K70j53m4K37l01j15P8L17l07J87k03j32K98k42
$$ plain form
7440 -175 -6 343 254 18 -151 261 58 -3 -58 -26 -216 -84 -122 77 194 14 94 -98 -41 -37 -119 -42 -17 9
7464 9 251 -155 -26 -247 101 36 91 -173 -70 -196 162 -85 -397 337 -84 -169 -190 40 -2 158 -23 -104 -165
7487 -165 45 -117 8 175 -118 -21 -38 -56 -348 34 29 287 -17 169 73 245 -174 -138 -59 269 -18 76 -92
7510 -92 -18 -37 -34 119 195 -35 -55 -329 45 -256 80 163 157 165 -118 138 92 -95 4 -125 -63 -37 126 9 128
7535 128 -32 101 131 164 198 -177 -21 -5 125 -36 35 -94 53 -10 -295 56 -69 -275 93 -191 36 39 4
7558 4 -143 -102 -76 279 21 19 339 -17 -86 64 -29 -62 -54 -45 -158 -209 55 63 102 -89 -73 33 -287 93 89 120 -79
7585 -79 -59 314 -156 259 -111 65 38 115 108 -48 -126 -85 47 112 -66 2 257 26 6 331 106 -87 38 196
7609 196 -27 45 -110 -13 206 32 -1 139 83 70 -11 63 92 19 -68 -117 -162 -3 18 75 3 -71 -74 180 109 -55
$$ packed form
7440a75J69L49q9k36j69M12k03o1n5L2j90J32l8J99J17j80Q0j92N7Mq2P7K5K6
7464IK42m06J29k21L48o5N5k64J03j26L58k47l12P34m21q5k1K30m2J60j81q1o1
7487a65K10j62J25J67k93R7j7j8k92L82nK58l04J86r6J72m19L6P9L28k87R4j68
7510i2P4j9LJ53P6k30k0k74L74l01L36Q3oQk83K56m6j87R9j29O2K6J63j17J19
7535A28j60J33L0L3L4l75J56J6J30j61P1j29J47o3k85L51j25k06L68k84K27Ll5
7558Dj47M1K6L55k58kL20l56o9J50r3l3QRj13n1K64QL9j91J6J06l20L80mL1j99
7585g9K0L73m70M15l70J76k7P7pj56p8M1J32O5j78O8K55k31k0L25k25j93J25J58
7609A96k23P2j55R7K19j74l3J40n6j3q1P4K9p3q7m9m5J59K1N7p2p4lK54p1j64
$$ plain form
7635 -55 20 3 -22 -124 -87 203 52 -147 122 -64 -166 33 -189 51 -55 30 -74 -88 20 -79 -95 -216 95
7658 95 178 1 -87 93 -34 268 1 75 -207 -42 -105 -103 -292 -229 -91 -200 188 63 299 46 206 -214 -69
7681 -69 164 -169 -176 -54 17 -115 195 15 -146 -5 -81 129 37 153 -285 -70 -40 100 36 -17 -108 208 114 -159
7705 -159 -262 7 292 173 132 -101 -29 -89 243 113 -36 104 -100 -22 143 -230 51 26 22 34 -92 46 -5
7728 -5 -155 108 55 -308 -50 256 11 -106 -188 -30 5 -38 -98 -102 -127 108 -44 110 -56 131 53 215 18 21
7752 21 132 -186 -83 -6 -76 129 76 11 -97 40 216 -106 215 -82 206 -99 -9 -188 -186 -321 -80 48 213
7775 213 -60 -264 113 -2 54 -72 154 -136 -69 -65 -77 -13 -236 107 115 -98 34 13 114 227 88 50 60 33
7799 33 -180 -131 31 -190 -3 107 -40 47 139 -23 118 -122 -13 -74 -142 -110 -51 19 -6 4 144 -51 -52 257
$$ packed form
7635e5P5j7k5j02L7K90j51j99K69j86j02J99k22K40j06Q5j04j4J08r9j6j21L11
7658I5Q3j77q8J80j27L02k67P4k82J65o3Kj89O3J38j09L88j25K36k53J60m20J45
7681f9K33l33pJ22P1j32L10j80j61J41p6K10r2J16m38K15L0J40o4n3r1L16r4k73
7705a59j03K69K85j19m1k33P2o0L32j30j49J40k04P8J65l73K81k5mJ2j26J38n1
7728ej50K63n3l63K58L06k45j17q2J58L5m3o0mk5K35j52J54j66J87p8J62j97L
7752B1J11l18J03P7p0K05n3o5j08J37J76l22L21k97K88l05R0j79Kj35K41J28J65
7775B13k73k04L77j15N6j26K26k90O7Mj2O4k23L43Qk13J32k1J01J13j39l8J0k7
7799C3k13M9J62k21J87J10j47Q7R2j62J41k40J09o1o8L2N9P0k5J0J40j95jL09
$$ plain form
7823 257 -23 -196 99 53 -30 -323 108 -256 35 -164 -56 -79 -110 34 77 29 162 95 85 -149 -128 83 39
7846 39 -62 -98 17 136 -39 120 -217 -334 -104 -177 -28 182 11 173 -23 -13 136 213 -42 -67 137 -47
7868 -47 114 107 156 30 283 169 -12 36 -56 59 92 -158 -163 -6 -87 -46 -58 -48 -202 -35 -92 -147 419 -150 -189
7893 -189 -52 -225 -98 233 -88 60 68 -5 214 190 -201 -60 97 47 -49 208 108 -89 311 270 25 -10 -39
7916 -39 132 62 -102 103 -94 -90 -100 18 -258 216 228 148 -189 344 -207 -107 -83 -120 -16 -191 185 151 20
7939 20 -197 159 -21 -128 -9 245 -50 -115 -65 -214 74 9 -65 337 152 47 -7 152 55 123 197 173 264 111
7963 111 -50 -224 -108 216 -33 131 -59 33 77 135 -162 -101 -169 -193 -88 91 241 93 -172 -103 -114 -42 239
7986 239 -144 117 -36 -84 14 -63 -236 285 83 261 -53 69 -446 257 -132 -11 37 -118 -53 236 -68 66
$$ packed form
7823B57k80j73K95m6q3k93M31l64K91j99J08k3l1J44M3m8J33o7j0k34K1K11m4
7846C9j01l6J15J19j75J59l37j17K30p3J49K10j71J62j96J0J49P7k55k5K04j84
7868d7J61pM9j26K53j14j81M8r2J15L3k50nJ57q1M1j2J0j54J67n7n5N66n69l9
7893a89J37j73J27L31l21J48Qp3K19k4l91J41J57n0r6K57j00j97M00m1k45l5k9
7916c9J71p0j64K05j97Mj0J18k76M74J2q0l37N33n51J00K4l7J04j75L76l4j31
7939B0k17L56j80j07J19K54k95o5N0j49K88o5p4M02j85j05n4J59r7O8P4k4R1j53
7963A11j61j74J16L24k49J64j90R2M4N8k97O1o8k4J05J79J50j48k65O9j1P2K81
7986B39l83K61j53m8R8p7j73N21k02J78l14J22n15P03l89J21M8j55O5K89l04J34
$$ plain form
8008 66 34 -60 113 196 109 -103 -86 41 28 -111 -75 -157 -61 -83 164 136 -30 -47 -152 -133 39 -92 -32 -62 -233
8033 -233 51 -129 -30 -84 141 254 160 15 418 -118 90 -250 -167 112 83 -11 2 83 -48 -60 88 -97 -98 -51
8057 -51 -2 173 76 262 -169 -173 -91 298 91 196 135 245 315 -328 3 166 260 59 71 308 61 186 140 -11
8081 -11 8 -170 53 -16 -24 89 75 -51 -49 192 110 56 138 59 86 -242 236 -33 236 -35 -68 76 79 225 55
8106 55 49 110 -183 182 169 128 16 -61 214 145 -9 -18 -541 -96 60 56 -164 268 64 67 96 342 -190 -380 -60
8131 -60 10 78 -96 -68 -35 40 -74 -39 -95 89 -232 124 -208 -64 115 240 -215 231 -96 46 118 32 157
8154 157 43 -31 -197 171 142 130 191 32 -107 -153 10 -223 -230 -22 -165 331 0 -20 -189 121 -218 73 141
8177 141 33 -151 72 196 -79 -30 265 204 234 135 -110 43 71 -60
$$ packed form
8008F6l2r4J73Q3q7k12J7J27j3j39L6q2R6k2K47k8j66j7j05J9J72j31O0l0j71
8033b33K84j80R9n4K25J13r4j45M03n36K08l40Q3K79k9r4J3Q1j31j2J48j85jM7
8057e1M9J75r7J86m31mQ2L89k07J05o1J10P0o43L31J63R4k01J2K37k47J25m6j51
8081a1J9j78K23o9qJ13j4j26KK41q2n4Q2p9K7l28M78k69K69k71l3J44LJ46j70
8106E5oO1k93L65j3m1j12p7K75o9j54rn23M45J56mk20M32k04LK9K46n32j90L20
8131f0P0O8j74K8L3P5j14L5n6J84l21L56l32J44J79J25m55M46l27J42P2q6J25
8154A57j14p4j66L68k9j2O1j59j39m6J63k33pK08j43M96l31k0j69L10l39K91O8
8177A41j08j84K23J24k75M9K95o1L0r9k45J53K8j31
8191f0
$$ Imaginary data points
##PAGE= N=2
##DATA TABLE= (X++(I..I)), XYDATA
$$ plain form
0 0 0 0 0 0 0 0 0 0 0 0 0 -8 8 -8 8 -16 16 -16 24 -32 32 -40 48 -56 69 -80 95 -106 123 -143 162 -184 210
33 210 -239 270 -303 341 -382 426 -475 529 -588 652 -721 799 -883 974 -1073 1184 -1303
50 -1303 1437 -1581 1744 -1924 2126 -2355 2612 -2911 3257 -3665 4156 -4757 5515 -6502 7852
65 7852 -9816 12948 -18728 33012 -148478 -114266 163896 -32205 -135656 -24138 94413
76 94413 39023 -24560 -25257 83595 120062 4097 -79954 54819 104231 -59762 -100164 66037
88 66037 65756 -79519 -96497 8750 42183 -29925 -87250 -10218 71991 9782 -70094 8638
100 8638 105696 40130 -53894 4565 73515 22640 -34601 -21048 11968 9177 -52237 -70697
112 -70697 8035 31900 -40902 -40274 45333 49592 -23416 -13516 66521 59944 -10412 -18614 13215
$$ packed form
0@%%%%%%%%%%%qJ6j6J6k4L2l2M0n6O4p2Q8j04J25j49J75k01K29k66L05l46L94
33B10m49N09n73O44p23Q08r01J004j117J240j373J520j682J857k047K257k487
50a303K740l018L325l668M050m481M967n523O168o922P821q913J0272j2017J4354
65G852j7668K2764l1676N1740j81490L4212K78162j96101j03451J11518J18551
76I4413n5390o3583o97J08852L6467j15965q4051J34773M9412j63993m0402J66201
88F6037k81j45275j6978J05247L3433p2108n7325P7032Q2209o2209p9876P8732
100H638R7058o5566r4024N8459O8950n0875n7241J3553L3016k791o1414j8460
112g0697P8732K3865p2802O28Q5607M259p3008R900Q0037o577p0356q202L1829
$$ plain form
125 13215 15923 -11077 -37058 -17990 14396 -11267 -44498 -17134 20133 7159 -24152 -6616
137 -6616 34206 15245 -21760 4234 40838 20676 -13099 -3550 24153 11421 -20411 -12773 5867
150 5867 -4519 -23772 -27961 -6429 13277 -7572 -20314 11121 24597 -359 -6989 18326 27972
163 27972 2419 -12524 4171 8210 -7786 -15032 -8447 4591 -745 -21358 -9720 16182 6577
176 6577 -8342 2022 13949 8102 -3974 -1419 10818 7232 -6450 -10327 -1205 6475 -6472
189 -6472 -16434 2840 8381 -12112 -10619 6588 7827 970 22 5463 9558 4697 126 2338 7726
204 7726 4788 -10322 -11207 3264 -2470 -14809 -4709 3324 -3161 -5575 -781 6293 7783 2735
218 2735 2513 5384 5652 1016 -3341 2007 6178 -5084 -9347 -758 -1260 -5180 -3520 -1369 570 -637
$$ packed form
125A3215K708k7000k5981J9068L2386k5663l3231K7364L7267j2974l1311J7536
137f616M0822j8961l7005K5994L6604k0162l3775R549K7703j2732l1832P638J8640
150E867j0386j9253m189K1532J9706k0849j2742L1435J3476k4956o630K5315R646
163B7972k5553j4943J6695M039j5996p246O585J3038n336k0613J1638K5902r605
176F577j4919J0364J1927n847j2076K555J2237l586j3682l877R122P680j2947
189f472r962J9274N541k0493J493J7207J239o857r48N441M095m861m571K212N388
204G726k938j5110q85J4471n734j2339J0100Q033o485k414M794P074J490n048
218B735k22K871K68m636m357N348M171j1262m263Q589n02l920J660K151J939j207
$$ plain form
234 -637 -3978 1194 6242 5239 1651 1825 6107 4017 -2681 924 4264 -2076 -5451 -4982 -5033 -3209
250 -3209 -4071 -4030 573 1141 -1117 669 4728 7643 4550 1531 4350 3130 -2066 -1356 -160 -1151 -2542
267 -2542 -5870 -4357 -821 -2707 -2573 436 851 395 -1154 311 4294 2994 1104 2967 2434 983
283 983 616 -476 1223 1272 -3509 -3804 -2325 -2523 -2329 -2649 -490 820 -982 -309 3504 3432 3178 2776
301 2776 1315 2086 361 -2259 -521 -373 -1959 -2664 -3015 -1223 -111 -1151 815 2140 496 315
317 315 733 1098 1983 497 -698 491 -579 -1194 -66 -303 509 -318 -2220 -666 180 -999 -301 160
335 160 98 485 -499 582 2305 1330 850 1143 -120 113 -502 -1177 -33 -939 -2039 -1105 -985 -126 361
354 361 394 1541 1349 273 898 1160 842 995 -266 -886 -681 -1699 -1050 -27 -431 -279 -117 -586 292
$$ packed form
234f37l341N172N048j003l588J74M282k090o698L605L340o340l375M69n1J824
250c209q62M1M603N68k258J786M059K915l093l019K819j220n196P10J196r91j391
267b542l328J513L536j886J34L009M15m56j549J465L983j300j890J863n33j451
283I83l67j092J699M9m781k95J479j98J94l20K159J310j802O73L813p2k54m02
301B776j461P71j725k620J738J48j586p05l51J792J112j040J966J325j644j81
317C15M18L65Q85j486j195J189j070o15J128k37Q12q27j902J554Q46j179O98M61
335A60o2L87r84J081J723r75m80K93j263K33o15o75J144r06j100R34J20Q59M87
354C61L3J147j92j076O25K62l18J53j261o20K05j018O49J023m04J52J62m69Q78
$$ plain form
373 292 704 266 898 498 191 18 -329 470 923 -579 95 -27 -1129 -356 -349 -440 -141 -497 -717 -4 -18
394 -18 327 842 431 970 809 -75 533 785 -131 -167 -503 -1004 -951 -1253 -370 -21 -753 -227 198 -205 765
415 765 1025 707 927 551 15 285 -266 25 360 -697 -482 -462 -1124 -136 204 -420 -352 -20 -152 305 169
436 169 753 425 -34 616 397 -105 666 559 50 148 -678 -792 -279 -649 -43 10 -615 -14 -7 61 514 468
458 468 571 469 51 38 444 82 106 -45 -400 -127 -398 -776 -26 343 -143 91 -270 43 58 -99 272
479 272 266 -75 130 145 -121 239 -204 -128 114 -265 -153 7 -301 -191 108 -205 111 -16 -57 57 137 135 187
502 187 -94 10 205 -237 237 72 -221 -107 176 -37 -221 -169 56 333 -195 -167 8 -267 -67 177 -234
523 -234 -269 82 47 135 116 90 160 30 70 -9 -292 119 133 -230 -35 75 -368 112 -237 -418 -95 -184 70 42
$$ packed form
373B92M12m38O32m00l07j73l47P99M53j502O74j22j102P73Pr1K99l56k20P13j4
394a8L45N15m11N39j61q84O08K52r16l6l36n01N3l02Q83L49p32N26M25m03R70
415G65K60l18K20l76n36K70n51K91L35j057K15K0o62R88L40o24O8L32j32M57j36
436A69N84l28m59O50k19n02P71j07n09R8q26j14N13l70O06N3o25O01PO8M53m6
458D68J03j02m18j3M06l62K4j51l55K73k71l78P50L69m86K34l61L13J5j57L71
479B72ol41K05J5k66L60m43P6K42l79J12J60l08J10K99l13L16j27m1J14Q0kN2
502A87k81J04J95m42M74j65k93J14K83k13j84N2K25K77n28K8J75k75K00K44m11
523b34l5L51l5Q8j9k6P0j30M0p9k83M11J4l63J95J10m43M80l49j81L23q9K54k8
$$ plain form
547 42 -282 61 52 98 243 220 252 304 257 -34 289 -584 -342 181 -391 -628 -47 133 62 -87 297 369 -222 286
571 286 339 -108 132 421 -150 175 80 -13 -193 11 170 86 -365 221 21 -239 -23 -22 -398 -102 -16 76 239
594 239 124 73 37 -26 10 62 -149 -46 159 138 -405 70 -126 -48 -100 -96 304 -72 99 293 -111 226 267 -34
618 -34 -40 201 184 -43 -29 197 18 -128 -36 -116 -23 -206 11 -144 10 257 -248 76 -81 165 178 -108 -141 386
642 386 -106 70 175 109 -246 49 -5 49 -51 -11 241 -11 138 52 237 123 99 -153 40 278 -13 155
664 155 -4 97 62 464 -32 345 -96 -36 -112 137 -46 -437 -86 -111 -261 -132 137 232 8 274 98 -7
686 -7 189 111 67 9 -68 -15 -3 155 201 -12 -175 -244 -21 -131 -275 41 -188 206 106 93 -9 -34 264 -80
710 -80 -25 -54 -86 164 -88 -75 -4 110 104 25 -158 5 299 -126 108 256 68 -54 119 118 -243 -135 29 54
$$ packed form
547D2l24L43rM6J45k3L2N2m7k91L23q73K42N23n72k37N81J80p1j49L84P2n91N08
571B86N3m47K40K89n71L25r5r3j80K04J59q4m51N86k00k60K16Jl76K96Q6R2J63
594B39j15n1l6o3L6N2k11J03K05k1n43M75j96P8n2MM00l76J71J94m04L37M1l01
618c4oK41j7k27J4K26j79j46R2q0R3j83K17j55J54K47n05L24j57K46J3k86l3N27
642C86m92J76J05o6l55K95n4N4j00M0K52k52J49q6J85j14k4k52J93K38k91J68
664A55j59J01l5M02m96L77m41O0p6K49j83l91L51k5j50J29K69R5k24K66j76j05
686gJ96p8m4n8p7N3J2J58M6k13j63o9K23j10j44L16k29L94j00j3j02k5K98l44
710h0N5k9l2K50k52J3P1J14op9j83J63K94m25K34J48j88j22J73jl61J08J64K5
$$ plain form
734 54 23 28 -18 206 -236 103 19 -161 88 -184 161 409 -39 42 234 -236 139 -39 114 40 -419 -159 -108
757 -108 -230 -51 -123 -294 63 52 -42 -51 -112 -247 14 -107 -242 109 -72 150 58 14 -253 -62 -148 -303 52
780 52 -190 55 -301 -86 164 -21 -58 173 286 -230 141 -291 -244 104 -88 129 104 240 0 60 -69 -96
802 -96 -139 73 33 97 144 13 179 -222 -277 -116 -150 -139 14 27 0 2 91 99 -173 -115 -80 -304 -12 188 -46 -446
828 -446 -174 -15 -16 -1 39 13 40 -40 61 -13 126 294 83 -189 -52 307 59 281 -257 -190 -47 -123 -107 -15
852 -15 33 241 -52 -189 107 64 -206 161 113 237 316 205 -167 -68 147 172 18 -116 179 69 -50 32 -117
875 -117 -88 -72 -96 20 -139 76 8 -88 -12 -102 -36 -159 -19 148 -64 70 -86 1 -309 68 -194 -17 -114 124
899 124 -26 -14 -22 -198 351 171 -105 -61 12 -189 60 -32 -167 -20 -164 273 119 -85 -347 28 -23 200 62
$$ packed form
734E4l1Nm6K24m42L39q4j80K49k72L45K48m48Q1J92m70L75j78J53p4m59K60N1
757a08j22J79p2j71L57j1r4ro1j35K61j21j35L51j81K22r2m4k67J91q6j55L55
780E2k42K45l56K15K50j85l7K31J13n16L71m32M7L48j92K17k5J36k40O0j29k7
802i6m3K12m0O4M7j31J66m01n5J61l4J1J53J3k7KQ9Qk72N8L5k24K92K00k34m00
828d46K72J59jJ5M0k6K7q0J01p4J39J68k11k72J37L59k48K22n38O7J43p6J6R2
852a5M8K08k93j37K96m3k70L67m8J24P9j11l72R9K15K5j54j34K95j10j19Q2j49
875a17K9J6k4J16j59K15o8r6P6r0O6j23J40J67k12J34j56Q7l10L77k62J77r7K38
899A24j50J2qj76N49j80k76M4P3k01K49r2j35J47j44M37j54k04k62L75n1K23j38
$$ plain form
922 62 -127 -19 110 -15 -172 -54 9 -86 50 -14 -240 15 -41 41 -120 183 189 34 184 177 -299 -256 263 52
946 52 253 7 -61 -197 51 145 -99 96 80 -267 -37 -25 138 144 -347 196 -36 107 177 -120 202 -246 -138
969 -138 -57 -110 224 -161 81 121 -135 38 366 -103 -50 -172 9 227 54 -77 310 -74 193 83 22 -211
991 -211 -208 146 -146 -169 -179 100 -12 140 -152 129 50 25 -141 28 134 -63 -8 -5 -139 46 -352 -14 178
1014 178 215 116 -46 218 -201 255 243 -61 -148 69 -51 0 15 -226 37 -26 -153 -38 -123 106 -19 225 81
1037 81 1 218 -160 -246 -255 -59 -28 137 204 180 269 -42 -171 239 113 -233 -131 -233 92 37 -59 117 84 120
1061 120 -111 2 -182 -25 237 227 5 -122 187 -36 -130 73 101 218 21 -40 69 104 215 147 57 52 -108
1084 -108 -179 -216 67 105 144 -75 22 -9 -29 -45 -88 -251 -28 -111 -181 140 -33 -116 -15 50 333 -366 51 126 35
$$ packed form
922F2j89J08J29j25j57J18O3r5J36o4k26K55n6Q2j61L03Oj55J50pm76M3N19k11
946E2K01k46o8j36K48R4k44J95j6l47K30J2J63Om91N43k32J43P0k97L22m48J08
969a38Q1n3L34l85K42M0k56J73L28m69N3j22J81K18j73j31L87l84K67j10o1k33
991b11LL54k92k3j0K79j12J52k92K81p9k5j66J69J06j97N5Lj34J85l98L38J92
1014A78L7r9j62K64m19M56j2l04q7K17j20N1J5k41K63o3j27J15q5K29j25K44j44
1037H1q0K17l78q6rJ96L1J65O7k4Q9l11j29M10j26l46J02j02L25n5r6J76l3L6
1061A20k31J13j84J57K62j0k22j27L09k23r4K03K8J17j97o1J09L5J11o8r0nj60
1084a08p1l7K83L8L9k19R7l1k0j6m3j63K23q3p0L21j73q3J01O5K83o99M17P5r1
$$ plain form
1109 35 -20 105 206 -163 93 -155 40 55 -109 -145 -1 -13 -153 -74 -205 -56 9 -207 -125 -53 -41 -104 32 129
1133 129 138 -34 17 145 -185 39 -62 -144 159 -186 -143 29 135 -239 187 162 97 200 -154 121 128 60 -41
1156 -41 182 -69 -91 -103 -230 -15 -174 252 -81 -39 277 -155 153 -114 29 70 38 73 -100 117 78 16 27
1179 27 -238 75 131 -54 161 15 -113 -375 68 26 -37 -266 165 -27 -240 48 122 -273 81 13 168 -54
1201 -54 -100 81 -111 105 -313 -25 193 -147 -104 -88 -39 -1 -27 118 179 88 -50 -77 139 91 -241 55 -28 72
1225 72 318 -151 -60 -239 -116 318 -85 134 -141 19 -107 50 -79 -44 223 -65 -89 -184 48 9 -89 51
1247 51 59 85 328 68 -172 -123 -112 127 -40 80 -48 136 -117 -279 -115 -33 -9 16 91 -67 155 122 -116 -7
1271 -7 -92 -117 42 -57 -10 -99 35 -123 -34 -92 -37 103 276 -308 16 -89 -104 -379 -366 -130 152 49 144 17
$$ packed form
1109C5n5J25J01l69K56k48J95J5j64l6J44j2j40P9j31J49O5k16Q2P2J2o3J36R7
1133A29Rj72N1J28l30K24j01q2L03l45M3J72J06l74M26k5o5J03l54K75Po8j01
1156d1K23k51k2j2j27K15j59M26l33M2L16m32L08k67J43M1l2L5j73K17l9o2J1
1179B7k65L13N6j85K15j46j28k62M43m2o3k29M31j92k13K88P4l95L54o8J55k22
1201e4m6J81j92K16m18K88K18l40M3J6M9L8k6J45O1r1j38k7K16m8l32K96q3J00
1225G2K46m69R1j79J23M34m03K19k75J60j26J57j29L5K67k88k4r5K32l9r8J40
1247E1QK6K43k60k40M9J1K39j67J20j28J84k53j62J64Q2K4K5P5j58K22l3k38J09
1271gq5k5J59r9M7q9J34j58Q9n8N5J40J73n84L24j05j5k75J3K36K82j03R5j27
$$ plain form
1295 17 -52 -188 74 -110 61 -12 251 55 157 190 -108 248 203 -217 -126 -227 -221 93 149 -157 86 -174 197
1318 197 68 212 -51 345 98 -44 68 138 -1 -8 -135 -64 -25 -9 254 -260 297 -117 261 -133 215 241
1340 241 230 -267 40 -7 29 -11 38 -13 -414 -201 -48 -149 -148 -82 86 -240 -77 -3 -134 -81 -22 -196 -89 -28
1364 -28 69 -48 -300 53 33 -35 234 185 -121 -2 124 93 37 114 -237 108 -127 153 58 -45 -44 167 203 232
1388 232 123 149 -23 -29 -65 3 -77 -30 -18 122 -32 41 -105 -115 50 -177 -27 -67 -90 -136 35 37 114 -112 17
1413 17 -41 93 -22 18 -113 -142 -21 -92 -79 345 141 -224 60 -74 60 -58 -73 -43 248 90 -8 203 82
1436 82 -173 -237 -72 -50 106 22 133 14 13 75 -220 -152 353 133 -181 -66 -205 -133 -154 -191 25 -153 -72 30
1460 30 132 14 -94 -25 -212 81 -67 72 -134 73 116 -47 -10 78 155 -169 -31 -55 -29 -82 74 158 65 -125
$$ packed form
1295A7o9j36K62j84J71p3K63j96J02L3k98L56m5m20R1j01OL14N6l06K43k60L71
1318A97j29J44k63L96k47j42J12P0j39pj27P1L9J6K63n14N57m14L78l94L48K6
1340B41j1m97L07m7L6m0M9n1m01K13J53j01JO6J68l26J63P4j31N3N9j74J07O1
1364b8R7j17k52L53k0o8K69m9l06J19J26l1n6P7l51L45k35K80r5j03JK11L6K9
1388B32j09K6j72ol6O8q0M7J2J40j54P3j46j0J65k27J50m0k3m6J71KP7k26J29
1413A7n8J34j15M0j31k9J21p1J3M24k04l65K84j34J34j18j5L0K91j58r8K11j21
1436H2k55o4J65K2J56q4J11j19jO2k95O8N05k20l14J15j39P2k1l7K16j78Q1J02
1460C0J02j18j08O9j87K93j48J39k06K07M3j63L7Q8P7l24J38k4K6n3J56Q4r3j90
$$ plain form
1484 -125 57 -221 80 -17 64 -417 -42 92 321 -98 -9 239 -58 92 -153 26 101 109 -256 -9 138 38
1506 38 -83 70 55 27 -66 0 -4 215 262 -151 -23 184 104 43 -114 50 60 14 -42 29 95 94 -436 88 -44 -5
1532 -5 -47 279 28 115 124 81 -47 -86 210 11 196 123 274 -223 -112 -231 23 -154 -7 -114 201 -155 0
1555 0 256 38 -178 105 -339 167 162 -241 194 -4 62 -185 179 -43 -205 49 260 -102 158 -136 -45 195
1577 195 -117 283 261 73 21 -47 103 -109 -134 12 -44 76 -52 56 -63 -79 110 58 -427 231 75 215
1599 215 109 60 117 -335 94 -58 70 -66 136 27 -227 80 177 -293 109 81 113 158 181 -136 -102 223 -4
1622 -4 -176 -238 -88 312 208 -264 121 66 -184 48 31 -194 7 -38 187 38 -142 -59 109 -49 -98 -105 -79 -112
1646 -112 -46 36 194 21 -62 -246 -122 31 -197 -99 37 -234 -432 8 -98 210 44 170 308 53 -36 -94
$$ packed form
1484a25J82k78L01r7Q1m81L75J34K29m19Q9K48k97J50k45J79P5Ql65K47J47j00
1506C8j21J53j5k8r3O6mK19M7m13J28K07q0o1j57J64J0m6n6P1O6jn30N24j32L9
1532em2L26k51Q7Rm3j28l9K96j99J85p3J51m97J11j19K54j77J47j07L15l56J55
1555@K56k18k16K83m44N06nm03M35j98O6k47L64k22j62K54K11l62K60k94R1K40
1577A95l12M00k2j88n2o8J50k12k5J46n6J20j28J08j19j6J89n2m85O58j56J40
1599B15j06m9N7m52M29j52J28j36K02j09k54L07R7m70M02k8L2M5K3l17L4L25k27
1622dj72o2J50M00j04m72L85n5k50K32j7k25K01m5K25j49j80Q3J68j58m9pK6l3
1646a12O6Q2J58j73q3j84J24J53k28R8J36k71j98M40j06L08j66J26J38k55q9n8
$$ plain form
1668 -94 -287 47 -37 -26 -58 157 -247 28 -119 181 -401 23 258 -70 -1 -278 -97 -13 -7 -62 -145 97 45 -194
1692 -194 -26 -346 -83 24 -58 56 119 66 346 156 -107 -128 -212 26 105 7 90 105 -156 234 97 135 -40
1715 -40 -78 154 -25 75 279 13 -63 219 125 54 -30 -32 159 -36 -268 108 242 33 -10 45 135 -23 254 138
1739 138 169 -77 120 -190 54 -66 -243 -2 -30 190 -215 -68 -94 102 -155 -12 -72 -71 -66 110 153 78 139 -66
1763 -66 -100 -42 126 -17 -133 193 3 266 -57 -272 36 -55 -27 -326 18 -115 108 9 -64 -104 2 132 -31
1786 -31 24 -95 22 98 32 33 284 -76 -128 -100 226 81 67 160 182 -165 -27 -217 2 -26 195 236 131 257
1810 257 -77 177 -120 -85 114 -10 289 -202 257 -225 7 40 -105 -320 -325 49 4 -94 10 -26 -250 -16
1832 -16 -390 -119 235 -48 68 -179 -116 -110 -146 -40 99 29 112 218 -155 -36 165 -96 -48 -56 -125 154 -120 -158
$$ packed form
1668i4j93L34q4J1l2K15m04K75j47L00n82M24K35l28O9k77J81Q4On5q3K42n2k39
1692a94J68l20K63J07q2J14O3n3K80j90k63k1q4K38P9r8Q3J5k61L90j37L8j75
1715d0l8K32j79J00K04k66p6K82r4p1q4kJ91j95k32L76J34k09m3N5R0j58K77j16
1739A38L1k46J97l10K44j20j77K41k8K20m05J47k6J96k57J43o0JNJ76M3p5O1k05
1763f6l4N8J68j43j16L26j90K63l23k15L08r1K8k99L44j33K23r9p3m0J06J30j63
1786c1N5j19J17P6o6JK51l60n2K8L26j45j4R3K2l47J38j90K19k8K21M1j05J26
1810B57l34K54k97L5J99j24K99m91M59m82K32L3j45k15nL74m5r8J04l6k24K34
1832a6l74K71L54k83J16k47O3Ol6J06J39p0Q3J06l73J19K01k61M8qo9K79k74l8
$$ plain form
1856 -158 -189 112 198 -75 160 94 40 48 14 -23 -70 -107 45 4 64 -214 -136 2 -115 148 136 62 54 -101 -184 69
1882 69 98 49 60 -287 -195 -31 64 0 104 85 129 -193 36 147 -155 61 74 11 2 -38 -93 -146 -248 2 -220
1907 -220 100 -16 71 -200 51 -117 -189 -103 90 61 0 86 -36 -95 -182 225 54 179 113 -30 -61 40 -170
1930 -170 -61 68 93 -9 -45 -216 -30 -96 60 -152 261 -275 -90 288 98 -122 75 30 103 12 -102 -43
1952 -43 -4 -34 338 137 170 169 83 -210 109 -9 -256 65 -244 6 -56 197 -289 43 -65 201 -110 -111 30
1975 30 -162 172 64 -337 -109 -77 42 179 86 -59 -59 -41 96 79 -132 -227 -165 -88 -106 -43 173 -113 -29 99
1999 99 56 -162 -54 94 -55 -45 111 -46 -7 -46 -119 -5 91 -83 64 96 104 -38 46 43 482 155 -224 -186 136
2024 136 165 -128 -24 -10 -27 -140 -64 -29 345 -1 -90 -156 29 25 -142 -151 -211 -272 52 90 177 76 94 -61 -42 -53
$$ packed form
1856a58l1L01Q6k73K35o6n4Ql4l7m7l7J52m1O0k78P8J38j17K63j2p4qj55q3K53
1882F9K9m9J1l47R2J64R5o4J04j9M4l22K29J11l02K16J3o3rm0n5n3j02K50k22
1907b20L20j16Q7k71K51j68p2Q6J93k9o1Q6j22n9q7M07j71J25o6j43l1J01k10
1930a70J09J29K5j02l6j71J86o6J56k12M13n36J85L78j90k20J97m5P3r1j14N9
1952d3L9l0L72k01L3jq6k93L19j18k47L21l09K50o2K53m86L32j08K66l11jJ41
1975C0j92L34j08m01K28L2J19J37r3j45%J8J37j7k11r5O2P7j8O3K16k86Q4J28
1999I9m3k18J08J48j49J0J56j57L9l9p3J14R6j74J47L2Qj42Q4lM39l27l79L8L22
2024A36K9k93J04J4j7j13P6L5L74l46q9o6J85mj67ro0o1L24L8Q7j01J8j55J9j1
$$ plain form
2050 -53 -96 -152 40 14 115 128 -43 67 14 -2 10 85 103 32 -48 88 230 15 -21 -116 -52 9 90 -91 -45 100
2076 100 -52 172 155 44 -185 -135 -116 -266 -27 9 -178 -32 -149 -44 45 -148 192 190 -246 -203 -114 120 115 -124
2100 -124 39 -45 -141 191 -53 -172 -127 156 -21 222 97 17 123 -18 71 -139 -93 -48 127 242 -236 -106
2122 -106 90 -49 -36 141 -96 -88 -185 -31 -332 -272 107 -76 44 30 -294 -118 68 -93 -107 -184 54 -54 124
2145 124 -77 123 82 -38 96 -50 93 -37 350 210 -99 -142 -14 -64 -75 94 20 -50 95 -42 -204 58
2167 58 -170 292 -273 -104 -91 130 -64 -57 -49 40 -392 74 72 -6 27 -81 -179 175 84 -298 71 43 29 -76 115
2192 115 343 9 -130 -187 -58 46 -209 49 -29 -219 -58 -227 224 23 63 113 -33 -42 -145 -337 160 -31
2214 -31 -119 -130 15 141 -31 -257 -231 -22 -147 240 59 -105 -104 -131 -197 40 -113 14 46 -100 10 134 -307
$$ packed form
2050e3m3n6J92k6J01J3j71J10n3j6J2P5J8p1q0J36J42k15l6r5O4O1Q1j81M6J45
2076A00j52K24j7j11k29N0J9j50K39L6j87J46j17J05Q9j93L40km36M3Q9K34nk39
2100a24J63q4r6L32k44j19M5K83j77K43j25q0J06j41Q9k10M6M5J75J15m78J30
2122a06J96j39J3J77k37Qr7J54l01O0L79j83J20j4l24J76J86j61j4p7K38j08J78
2145A24k01K00m1j20J34j46J43j30L87j40l09m3J28n0j1J69p4p0J45j37j62K62
2167E8k28M62n65J69J3K21j94PQQ9m32M66kp8L3j08r8L54r1l82L69k8j4j05J91
2192A15K28l34j39n7J29J04k55K58p8j90J61j69M51k01M0N0j46rj03j92M97j91
2214c1q8j1J45J26j72k26K6K09j25L87j81j64Jk7o6K37j53J27L2j46J10J24m41
$$ plain form
2237 -307 -120 -207 -7 10 -103 -19 79 -144 175 110 38 -77 124 -282 151 29 49 -2 36 173 -54 31 -97
2260 -97 -254 196 278 -253 127 -323 228 -26 108 63 62 49 -171 -8 -20 115 -47 37 -55 -106 -86 40 -43 -90
2284 -90 6 78 176 -76 -113 -171 250 117 -141 287 230 -2 -132 -84 -50 213 -95 212 -113 -61 -97 -10 -101 78
2308 78 -217 58 -241 -304 72 78 82 145 -70 165 74 -3 283 16 209 -132 207 -18 37 -117 28 7 -342 249
2332 249 10 -116 261 61 -108 212 -54 94 192 84 -141 -228 252 -42 -30 -162 59 -193 186 241 -120
2353 -120 -242 84 -227 65 204 29 -44 197 -165 -138 76 167 -211 40 157 26 -128 -26 29 -208 52
2374 52 152 447 151 83 -160 134 -142 -173 -34 80 -167 64 268 310 46 203 44 52 306 -111 240 258
2396 258 -16 -72 158 -111 -346 158 -165 -155 303 -161 96 -6 166 -127 235 200 -46 4 209 -239 -25
$$ packed form
2237c07J87q7K00J7j13Q4R8k23L19o5p2j15K01m06M33j22K0n1L8J37k27Q5j28
2260i7j57M50Q2n31L80m50N51k54J34m5jj3k20J63j2J35j62Q4r2n1K0J26q3m7
2284i0R6P2R8k52l7n8M21j33k58M28n7k32j30M8L4K63l08L07l25N2l6Q7r1J79
2308G8k95K75k99o3L76OMO3k15K35r1p7K86k67J93l41L39k25N5j54J45k1l49N91
2332B49k39j26L77k00j69L20k66J48R8j08k25q7M80k94J2j32K21k52L79N5l61
2353a20j22L26l11K92J39j75p3K41l62K7K14R1l78K51J17j31j54J02N5k37K60
2374E2J00K95k96o8k43K94k76l1J39J14k47K31K04M2k64J57j59QK54m17L51J8
2396B58k74n6K30k69k35N04l23J0M58m64K57j02J72k93L62l5k46N0K05m48K14
$$ plain form
2417 -25 -163 -1 -54 -252 27 -185 -9 -84 234 -309 8 -96 -100 83 -39 -84 269 -29 -197 -148 111 136 -167
2440 -167 -70 -294 328 114 -29 -170 -76 319 -63 -178 -181 64 219 158 -197 202 -189 45 68 -195 101 -62
2462 -62 67 335 -268 159 200 -146 -103 -103 -237 62 -85 -186 88 71 -128 -16 -133 -122 350 23 -200 16
2484 16 31 -181 89 -228 -74 89 98 11 213 52 -16 -137 -185 -87 -126 -12 303 298 72 4 -242 -83 78 4
2508 4 -291 57 115 7 -63 83 190 34 313 7 -164 -2 131 137 -26 239 -21 -70 -298 -65 84 -84
2530 -84 96 -113 33 -59 -15 -127 39 33 -85 -127 21 -47 -118 -53 60 25 -175 222 -193 -295 -144 -219 114 -232
2554 -232 69 232 3 -45 -196 -120 -166 -15 39 -218 36 -41 72 15 -42 -159 108 -110 -138 -113 180 -316 183
2577 183 42 -5 59 -32 -65 -120 33 -153 -54 -167 175 -97 -26 -18 28 -25 -52 -143 -43 -79 -258 6 229 130 13
$$ packed form
2417b5j38J62n3j98K79k12J76p5L18n43L17j04mJ83j22m5L53k98j68M9K59K5l03
2440a67R7k24O22k14j43j41R4L95l82j15lK45J55o1l55L99l91K34K3k63K96j63
2462f2J29K68o03M27M1l46M3%j34K99j47j01K74j7j99J12j17J1M72l27k23K16
2484A6J5k12K70l17J54J63Rq7K02j61o8j21m8R8l9J14L15nk26o8k46J59J61p4
2508Dk95L48N8j08p0J46J07j56K79l06j71J62J33Oj63K65k60m9k28K33J49j68
2530h4J80k09J46r2M4j12J66oj18m2J48o8p1O5J13l5k00L97m15j02J51p5L33l46
2554b32L01J63k29m8j51P6m6J51N4k57K54p7J13n7n7j17K67k18k8K5K93m96M99
2577A83j41m7O4r1l3n5J53j86R9j13L42k72P1QM6n3k7r1J00l6j79K64K23r9j17
$$ plain form
2602 13 132 -82 103 -117 17 -77 -29 42 14 208 -38 -7 -29 140 208 -199 107 -75 -460 -148 120 -302 -141
2625 -141 -120 -156 103 240 -117 172 37 -149 80 -115 -43 194 222 40 194 -138 76 -57 25 -221 148 -235
2647 -235 -22 -44 -4 -49 -3 -238 21 58 -280 21 -18 -179 132 -131 147 113 -195 23 54 -5 -7 9 35 65 96
2672 96 -96 -82 151 -95 16 -114 -62 -51 -147 -2 -78 134 7 -122 107 0 -92 -278 -201 9 35 -110 -157
2695 -157 220 114 -252 52 -322 -160 160 -269 -5 -200 58 -168 -79 29 -252 75 60 -33 89 -186 -215
2716 -215 49 -74 -26 39 -99 74 -52 157 90 -63 111 -129 8 16 -117 -134 -337 -20 -282 -11 -114 -34
2738 -34 -180 -97 248 -165 -158 50 29 160 129 145 -218 258 263 -70 84 2 -122 34 -59 254 -29 -74 -195 -127
2762 -127 496 112 209 83 174 -159 191 -117 134 -105 -79 38 265 63 218 -81 35 -270 -221 90 -219
$$ packed form
2602A3J19k14J85k20J34r4M8P1k8J94k46L1k2J69O8m07L06j82l85L12K68m22J61
2625a41K1l6K59J37l57K89j35j86K29j95P2K37K8j82J54l32K14j33Q2k46L69l83
2647b35K13k2M0m5M6k35K59L7l38L01l9j61L11k63K78l4l08K18L1n9kJ6K6L0L1
2672I6j92J4K33k46J11j30N2J1r6J45p6K12j27j29K29j07r2j86P7K10K6j45m7
2695a57L77j06l66L04l74J62L20m29K64j95K58k26Q9J08k81L27j5r3J22k75k9
2716b15K64j23M8O5j38J73j26K09o7j53J74k40J37Qj33j7k03L17k62K71j03Q0
2738c4j46Q3L45m13PK08k1J31l1J6l63M76Nl33J54q2j24J56r3L13k83m5j21O8
2762a27O23l84R7j26R1l33L50l08K51k39K6J17K27k02J55k99J16l05M9L11l09
$$ plain form
2783 -219 191 60 147 -4 -33 -199 -47 93 153 157 77 2 -71 -49 34 11 -74 75 36 70 144 -102 -36 -73 66 150
2809 150 -423 -72 -34 -84 165 175 -166 95 71 171 -43 213 -122 -178 -138 -165 -108 27 287 7 135 -50 -157
2832 -157 -134 129 38 136 4 188 -23 -58 56 -60 0 -67 -253 95 132 -21 190 -47 -11 221 285 -49 33
2855 33 -213 -76 -19 -79 -178 91 -64 -25 -28 -4 302 -114 48 53 5 -252 -229 44 -46 -115 33 12 117 178 44
2880 44 175 -205 3 -134 30 -57 141 151 -284 -76 127 -59 250 40 -223 296 254 -19 3 -155 38 -119
2902 -119 171 -154 -118 209 -68 53 -60 15 73 -115 -22 69 -107 -320 213 -118 117 224 100 61 119 -50
2924 -50 249 153 5 107 283 -187 -139 -4 257 239 -42 106 -38 -125 -6 207 5 208 -27 -35 -17 -40 124
2947 124 166 -140 -12 189 -58 71 -72 -135 75 -43 -239 -132 -183 -133 -111 -175 -54 92 -7 4 163 -5 -145
$$ packed form
2783b19M10j31Q7j51k9j66J52J40O0Mq0p5p3K2Q3k3q5J49l9L4P4k46O6l7J39Q4
2809A50n73L51L8n0K49J0l41K61k4J00k14K56l35n6M0k7N7J35K60k80J28j85j07
2832a57K3K63r1R8j32J84k11l5J14j16O0o7j86L48L7j53K11k37L6K32O4l34Q2
2855C3k46J37N7o0r9K69j55L9lK4L06m16J62Nm8k57K3K73r0o9J48k1J05O1j34
2880D4J31l80K08j37J64q7J98J0m35K08K03j86L09k10k63N19m2k73K2j58J93j57
2902a19K90l25L6L27k77J21j13P5N8j88R3R1j76k13N33l31K35J07j24l9N8j69
2924e0K99r6j48J02J76m70M8J35K61j8k81J48j44q7J19K13k02K03k35qJ8k3J64
2947A24M2l06J28K01k47J29j43o3K10j18j96J07n1N0K2o4J21J46r9J1J59j68j40
$$ plain form
2970 -145 -146 -102 28 -15 -175 210 71 127 83 19 111 -160 285 130 215 -7 -61 -189 -244 50 -93 -59 107 300
2994 300 -105 313 -62 188 197 -178 219 242 -45 -38 -174 305 119 150 -55 -315 -67 227 173 -58 94 0 83
3017 83 -215 -75 -87 -214 90 -113 -334 25 -71 -10 -220 -140 -63 369 -227 137 56 -216 243 67 -94 -168 -140
3040 -140 -49 -127 -220 81 -47 -38 -77 -69 79 -60 135 -79 224 -111 166 109 3 52 -58 83 -94 176 -56
3063 -56 -229 2 -214 -97 -229 -168 -105 -60 156 66 -205 -96 215 58 90 322 -187 -115 88 -36 151 -202
3085 -202 91 -55 33 2 -198 -290 -235 59 31 91 -40 -150 251 36 105 -146 54 -197 -66 -175 -429 -26
3107 -26 164 282 -231 -72 -187 11 -227 -164 8 89 -402 -44 -174 0 -4 -86 -119 -115 139 -26 239 116 -128
3130 -128 -62 137 -72 28 104 202 258 72 216 249 18 -119 48 -77 8 -211 -125 11 175 -41 41 -28 134
$$ packed form
2970a45jM4J30m3j60L85j39N6m4o4R2k71M45j55Q5k22n4j28n5K94j43L4J66J93
2994C00m05M18l75K50Rl75L97K3k87Pj36M79j86L1k05k60K48K94n4k31J52r4Q3
3017H3k98J40j2j27L04k03k21L59r6O1k10Q0P7M32n96L64q1k72M59j76j61p4K8
3040a40R1p8r3L01j28Rl9QJ48j39J95k14L03l35K77n7j06M9j10J41j77K70k32
3063e6j73K31k16J17j32O1O3M5K16r0k71J09L11j57L2K32n09P2K03j24J87l53
3085b02K93j46Q8l1k00r2N5K94k8O0j31j10M01k15O9k51K00k51J31j09k54M03
3107b6J90J18n13J59j15J98k38O3J72Q1m91L58j30J74mq2l3MK54j65K65j23k44
3130a28O6J99k09J00P6R8N6j86J44L3k31j37J67j25Q5k19Q6J36J64k16Q2o9J62
$$ plain form
3153 134 -177 37 132 18 255 -75 185 137 25 142 20 16 -37 17 343 -91 40 247 -148 -321 -29 -150
3175 -150 -83 21 -177 -76 -42 -24 -89 -135 -15 127 225 125 -277 -270 -172 156 51 8 -19 -34 199 -99 20 57
3199 57 -80 61 29 250 -146 -174 19 -146 35 223 33 131 -108 150 56 131 -19 -214 116 38 -73 36
3221 36 -36 -138 -220 132 40 7 -31 -34 -122 123 281 -76 179 -171 -143 -116 -105 -112 164 300 7 179 -165 -182 51
3246 51 221 -70 -126 46 207 173 16 -18 110 19 -207 -185 42 67 -42 29 111 -19 -191 121 -30 187 -48
3269 -48 0 74 60 68 119 -187 -206 -120 65 -23 20 25 228 -18 -107 223 144 -51 -9 85 8 189 -122 167 -28 -130
3295 -130 -49 26 -192 -61 135 6 -28 -118 -305 184 1 91 -84 -348 -216 69 20 209 -72 69 131 47 186
3318 186 7 165 240 -15 218 36 197 -52 106 -223 175 80 18 -282 134 170 -271 -6 -25 10 -35 170
$$ packed form
3153A34l11K14R5j14K37l30K60m8j12J17j22mn3N4L26m34J31K07l95j73K92j21
3175a50O7J04j98J01L4J8o5m6J20J42R8j00m02PR8L28j05m3k7j5K33k98J19L7
3199E7j37J41l2K21l96k8J93j65J81J88j90R8k39K58r4P5j50j95L30p8j11J09
3221C6p2j02q2L52r2l3l8lq8K45J58l57K55l50K8K7J1pK76J36k93J72l44j7K33
3246E1J70k91n6J72J61l4j57l4J28r1k26K2K27K5j09P1Q2j30j72L12j51K17k35
3269d8M8P4j4QN1l06j9Q6J85q8M3NK03k46q9L30p9j95M2R4p7J81l11K89j95j02
3295a30Q1P5k18J31J96j29l4r0j87M89j83R0j75k64J32K85m9J89k81J41O2q4J39
3318A86j79J58P5k55K33j82J61k49J58l29L98r5o2l00M16L6m41K65j9L5m5K05
$$ plain form
3340 170 -127 5 115 103 244 -11 -342 -101 -30 81 -7 60 -99 -19 -43 -43 -300 46 -217 -140 1 63 -94
3363 -94 -30 -32 -81 -5 -156 -93 4 268 54 -393 -80 75 -38 28 -160 240 -188 177 133 68 99 -8 11 126
3387 126 -128 -33 -111 2 -61 79 34 -1 54 128 -7 19 193 -111 -28 184 52 112 -60 78 63 -19 192 14
3411 14 -28 38 41 -191 8 333 122 -181 -215 66 122 -141 169 30 192 55 172 -105 99 -152 -101 -123 214
3434 214 -146 186 19 -60 -200 -165 -184 94 222 89 -40 165 -53 174 -102 24 54 17 188 -56 131 -77
3456 -77 104 161 -131 -131 -50 163 139 -156 -8 172 -116 -224 -35 -19 219 -163 -203 8 -281 -55 -100 -98 55 -161
3480 -161 -173 135 -47 62 -187 422 -150 -249 217 -149 -56 -37 298 -292 -307 10 190 41 62 -126 -59 -50 -226
3503 -226 -205 1 -212 -4 288 104 29 57 45 -163 -131 -89 54 222 203 21 106 15 66 -6 16 -90 25 -170
$$ packed form
3340A70k97J32J10j2J41k55l31K41P1J11q8O7j59Q0k4%k57L46k63P7J41O2j57
3363i4O4km9P6j51O3R7K64k14m47L13J55j13O6j88M00m28L65m4o5L1j07J9J15
3387A26k54R5p8J13o3J40m5l5N5P4j35K6J74l04Q3K12j32O0j72J38j5q2K11j78
3411A4m2O6Lk32J99L25k11l03l4K81N6k63L10j39J62j37J17k77K04k51N1k2L37
3434B14l60L32j67p9j40L5j9K78J28j33j29K05k18K27k76J26L0l7J71k44J87k08
3456g7J81N7k92%Q1K13k4k95J48J80k88j08J89J6K38l82m0K11k89K26m5KJ53k16
3480a61j2L08j82J09k49O09n72r9M66l66R3J9L35n90j5L17J80j49K1j88O7Rj76
3503b26K1K06k13K08K92j84p5K8j2k08L2M2J43J68j9j82Q5r1N1p2K2j06J15j95
$$ plain form
3527 -170 -319 -108 -4 -83 -90 -113 -250 111 56 -76 -89 32 42 -417 306 126 -173 45 151 134 55 -31 -68 14
3551 14 -28 43 -250 -131 -86 90 130 -23 -108 55 161 200 2 -150 -362 143 -19 94 -228 -7 -129 29
3573 29 230 80 75 174 -40 -92 36 -117 -138 69 173 -75 241 193 -22 -110 124 -192 65 -3 79 198 -71
3596 -71 29 -50 8 -94 159 -272 -74 -118 124 15 -78 55 129 27 -190 -1 245 13 -208 33 18 -171
3618 -171 -38 -60 111 -105 76 82 -65 463 -63 -45 -214 -195 -279 -226 150 287 -106 119 -21 93 -87 -219
3640 -219 -72 133 100 -87 258 84 239 10 -67 -363 88 -125 33 42 119 269 73 -64 -166 114 -33 117
3662 117 210 181 78 -136 -30 -46 -64 37 65 68 104 -14 -125 165 226 141 -7 81 -44 -182 107 210 107 325
3686 325 -48 -296 171 -196 -75 34 175 -140 141 52 59 -29 314 98 -218 412 62 93 -158 167 73 -14
$$ packed form
3527a70j49K11J04p9pk3j37L61n5j32j3J21J0m59P23j80k99K18J06j7p9q6l7Q2
3551A4m2P1k93J19M5J76M0j53q5J63J06L9j98j52k12N05j62J13l22K21j22J58
3573B9K01j50nR9k14n2J28j53k1K07J04k48L16m8k15q8K34l16K57o8Q2J19k69
3596g1J00p9N8j02K53m31J98m4K42j09r3J33P4j02k17J89K46k32k21K41j5j89
3618a71J33k2J71k16J81Oj47N28n26J8j69J9q4N3L76J37l93K25j40J14j80j32
3640b19J47K05l3j87L45j74J55k29p7k96M51k13J58RP7J50j96j37j02K80j47J50
3662A17R3k9j03k14J06j6j8J01K8LL6j18j11K90O1q5j48Q8j25j38K89J03j03K18
3686C25l73k48M67l67J21J09J41l15K81q9Pq8L43k16l16O30l50L1k51L25r4q7
$$ plain form
3708 -14 111 100 -112 -155 -115 24 69 -11 -19 4 -26 328 -105 116 5 8 -215 101 -154 -220 -118 -9 -87 4 23
3733 23 -143 129 326 92 63 -53 -216 57 111 32 -108 -203 43 37 -148 -107 262 37 223 17 21 56 -24 215
3757 215 -212 109 -50 -125 94 -94 -39 -219 -132 -375 -28 -244 225 -96 -193 -43 -112 -76 146 -60 148 -7
3779 -7 141 189 218 -131 149 -133 20 -49 181 -12 202 157 -217 -112 151 158 -22 43 -263 -119 106 -198 152
3802 152 21 -293 -4 -104 106 -68 -3 -96 -195 4 -93 -126 -20 -26 -85 93 257 68 -9 84 -161 -130 -249 170
3826 170 220 51 96 183 -101 155 -164 -48 164 -79 281 -116 -45 -253 -244 -28 -114 -100 243 105 -152 54 3
3849 3 -186 -134 49 -184 -370 119 -53 41 49 21 -283 124 16 119 2 -141 81 -30 271 -3 127 -55
3871 -55 -56 35 26 -61 -49 139 40 162 -29 -96 -41 78 -123 103 -14 -309 -100 -57 -149 22 -225 -131 347 -93 -163
$$ packed form
3708a4J25j1k12m3M0J39M5q0qK3l0L54m33K21j11Lk23L16k55o6J02J09p8R1J9
3733B3j66K72J97k34k9j16j63K73N4p9j40r5K46oj85M1L69k25J86k06ML5q0K39
3757B15m27L21j59p5K19j88N5j80Q7k43L47k16M69l21r7J50o9L6K22k06K08j55
3779gJ48M8K9l49K80k82J53o9K30j93K14m5l74J05K63Pj80O5l06J44K25l04L50
3802A52j31l14K89j00K10j74O5r3r9J99r7l3J06on9J78J64j89p7R3k45L1j19M19
3826A70N0j69M5Q7k84K56l19J16K12k43L60l97P1k08RK16q6J4L43j38k57K06n1
3849Cj89N2J83k33j86M89j72R4Qk8l04M07j08J03j17j43K22j11L01k74J30j82
3871e5jR1rq7J2J88r9J22j91o7N5J19k01K26j17k95K09M3r2J71k47R4M78m40p0
$$ plain form
3896 -163 -69 81 115 -78 60 -68 -18 -46 76 -276 37 -134 299 163 373 -41 -251 -149 -30 46 -5 148
3918 148 -58 146 117 17 -103 55 -194 -193 351 110 65 113 187 -157 84 -108 -74 91 67 -85 -351 -30 -86
3941 -86 -154 137 -104 -90 -157 -139 17 12 43 -84 53 -31 -76 127 144 -33 58 -14 182 10 -435 89 -38 270
3965 270 184 -73 -87 198 186 4 -35 282 34 -216 100 -201 -264 -136 -127 -138 -42 4 320 372 100 259 94 -131
3989 -131 -129 -190 70 -179 -40 162 51 -127 -216 78 19 -146 -258 -50 90 -243 51 -69 -26 -162 95 434
4011 434 -153 79 46 130 253 -206 152 38 -417 138 -67 52 -1 119 79 -9 -188 26 -109 151 89 134
4033 134 -62 128 -195 -144 -159 178 -172 -71 -315 -48 -191 387 -100 -144 -125 -3 2 -119 -163 273 222 -121 -144
4056 -144 -66 -159 -20 146 348 -102 -6 134 -27 159 158 5 -54 -39 -345 102 110 -19 173 27 258 -381 -82
$$ packed form
3896a63R4J50L4j93J38j28N0k8J22l52L13j71M33j36K10m14k10J02J19P6n1J53
3918A48k06K04k9j00j20J58k49JN44k41m5M8P4l44K41j92L4J65k4j52k66L21n6
3941h6o8K91k41J4o7J8J56nL1j27J37q4m5K03J7j77R1p2J96j72m45N24j27L08
3965B70q6k57j4K85j2j82l9L17k48k50L16l01o3J28Rj1R6M6L16N2k72J59j65k25
3989a31Ko1K60k49J39K02j11j78q9K94n9j65j12K08J40l33K94j20M3j36K57L39
4011D34n87K32l3Q4J23m59L58j14m55N55k05J19n3J20m0q8j79K14j35K60o2M5
4033A34j96J90l23N1j5L37l50J01k44K67j43N78m87m4J9J22Nj21m4M36n1l43k3
4056a44P8r3J39J66K02m50R6J40j61J86jj53n9J5l06M47Qj29J92j46K31o39K99
$$ plain form
4079 -82 36 -107 -33 -153 119 303 298 136 -24 88 59 89 49 44 146 -122 157 -25 -13 -143 68 200 185 -44
4103 -44 -241 -79 15 -29 -15 -224 -134 -38 -198 -225 -196 51 -58 43 -63 96 -63 18 13 -68 179 -153 -124 -372
4127 -372 -135 -15 59 204 -54 -195 -349 -343 -83 2 39 154 147 -88 -65 -26 240 16 102 -34 -54 -99 -17 123
4151 123 194 46 100 -201 -77 -53 -74 -61 -117 -189 45 -237 -90 -61 -30 -196 40 115 95 200 -166 67 88 -148
4175 -148 317 152 -58 -239 -85 257 4 0 -85 -362 -8 -33 -199 47 126 79 69 -125 -82 -335 -110 -15 -133
4198 -133 143 -149 -94 295 -165 20 5 -55 58 88 28 -125 105 85 -187 216 -52 330 -54 108 75 139 107
4221 107 99 208 292 166 134 172 259 -195 -105 65 -113 -176 34 -15 -134 67 143 242 -172 84 -108 497 110 -112
4245 -112 -132 54 -242 -201 6 -146 216 -185 47 -72 -78 -17 63 125 -96 -95 -84 -7 -122 -246 32 89 71 -43
$$ packed form
4079h2J18j43P4j20K72J84nj62j60J12k9L0m0nJ02k68K79j82J2j30K11J32j5k29
4103d4j97J62R4m4J4k09R0R6j60k7K9K47j09J01j06J59j59Q1nq1K47l32K9k48
4127c72K37J20P4J45k58j41j54OK60Q5L7J15pk35K3L9K66k24Q6j36k0m5Q2J40
4151A23P1j48N4l01J24K4k1J3n6p2K34k82J47K9L1j66K36P5k0J05l66K33K1k36
4175a48M65j65k10j81J54L42k53mq5k77L54k5j66K46P9m7j0j94M3k53K25R5j18
4198a33K76k92N5L89m60J85j5o0J13L0o0j53K30k0k72M03k68L82l84J62l3O4l2
4221A07qJ09Q4j26l2L8Q7m54R0J70j78o3K10m9j19K01P6R9m14K56j92O05l87k22
4245a12k0J86k96M1K07j52L62m01K32j19oO1Q0O2k21JJ1P7j15j24K78N7j8j14
$$ plain form
4269 -43 -144 -225 4 -89 -89 63 -113 -187 156 -167 -59 -165 -124 222 47 -40 104 130 -165 144 -58 71 153
4292 153 -182 -2 -54 128 -200 -64 -131 46 -58 -112 184 20 184 49 -205 -33 -20 -62 240 -36 51 -111
4314 -111 -14 -36 60 -23 -77 -237 56 41 -68 83 -164 -53 -269 110 63 137 62 -27 -163 -193 -51 -69 32 -327
4338 -327 -232 -258 -98 -109 -312 -29 15 -19 88 75 -33 -131 103 -104 -233 34 266 -275 188 114 -72 98 -196
4361 -196 -139 -25 78 71 -143 42 -70 337 -135 30 7 -112 -43 6 90 -50 89 7 -98 280 410 -278 69
4384 69 -64 -275 1 37 -124 -85 47 226 43 86 -8 -138 -185 37 -117 45 199 187 270 -75 -106 -273 103
4407 103 -291 -193 30 -152 64 63 -44 35 131 -44 5 173 -32 96 253 110 -186 -54 114 97 -58 -507
4429 -507 -105 -234 34 -228 -128 106 24 -129 74 192 253 75 14 6 -97 -293 117 79 -31 -156 -204 -59
$$ packed form
4269d3j01q1K29r3%J52j76p4L43l23J08j06M1L46j75q7J44K6k95L09k02J29Q2
4292A53l35J80n2J82l28J36o7J77j04n4K96j64J64j35k54J72J3m2L02k76Q7j62
4314a11R7k2R6q3n4j60K93j5j09J51k47J11k16L79m7P4p5q9j36l0J42j8J01l59
4338c27R5k6J60j1k03K83M4l4J07j3j08r8K34k07j29K67K32n41M63p4j86J70k94
4361a96N7J14J03pk14J85j12M07m72J65k3j19O9M9Q4j40J39q2j05L78J30o88L47
4384F9j33k11K76L6j61L9J32J79j83M3r4j30m7K22j54J62J54j2Q3l45l1j67L76
4407A03l94R8K23j82K16jj07P9R6j75M9J68k05J28J57j43k96J32J68j7j55m49
4429e07M02j29K68k62J00K34q2j53K03J18O1j78o1qj03j96M10l8j10j25m8J45
$$ plain form
4451 -59 -25 -210 -107 96 151 25 24 92 -5 -65 144 83 59 287 26 85 -80 4 10 -154 45 18 66 -17 92 70
4477 70 67 -165 352 123 177 294 163 -253 -42 61 -130 -202 -175 -68 -68 124 -4 -88 -84 97 45 -180 -84 72
4501 72 88 190 -158 -182 56 43 -5 90 -156 240 -43 -93 -23 -136 144 148 -111 -56 -40 -98 -303 -66 51 31 76
4526 76 169 255 52 -87 -36 120 47 -86 -5 270 195 -89 -87 -114 19 51 -191 -76 207 129 -407 330 195 -7
4550 -7 204 5 178 -26 135 66 12 -29 -29 -89 -213 181 -64 204 -192 -105 170 173 136 -203 -120 -358 -43 61
4574 61 -149 -140 -261 247 -235 165 -44 70 68 183 175 -113 -194 19 -19 241 56 -76 -12 50 67 -193 -15 -229
4598 -229 -151 74 139 -80 23 4 -205 -119 15 -137 -243 57 -303 149 -77 -135 17 273 74 153 -336 131
4620 131 36 -39 80 -99 -188 -14 56 -52 111 -155 -115 -179 -250 -165 -290 30 -41 48 -58 -82 84 11 122 -166
$$ packed form
4451e9L4j85J03K03N5j26jO8r7o0K09o1k4K28k61N9j65Q4Oj64J99k7M8q3J09k2
4477G0lk32N17k29N4J17j31m16K11J03j91p2K7J07%J92j28q4MJ81n2k25R6J56
4501G2J6J02l48k4K38j3m8R5k46L96k83n0P0j13K80Mk59N5J6n8k05K37J17k0M5
4526G6R3Q6k03j39N1J56p3j33Q1K75p5k84Kk7J33L2k42J15K83p8n36P37j35k02
4550gK11j99J73k04J61o9n4m1%o0j24L94k45K68l96Q7K75Ll7l39Q3k38L15J04
4574F1k10Rj21N08m82M00k09J14kJ15qk88q1K13l8K60j85j32O4O2J7k60J78k14
4598b29P8K25O5k19J03j9k09Q6J34j52j06L00l60M52k26n8J52K56j99P9m89M67
4620A31r5p5J19j79q9J74P0j08J63k66M0o4p1Q5j25L20p1Q9j06k4J66p3J11k88
$$ plain form
4644 -166 -3 -196 -254 -77 21 239 188 -55 -31 -162 -54 342 -30 462 -93 106 -181 37 53 231 128 46
4666 46 -164 -380 -105 -80 339 -62 -25 -30 -163 -28 58 26 -7 -227 -296 6 98 -30 -8 79 71 71 66 33 48 -104 6
4693 6 -25 123 -127 -150 -126 112 93 -111 140 15 -240 99 -77 -64 242 -59 -45 -35 27 18 -17 303 -247 -70
4717 -70 -34 125 150 -278 318 283 -126 -54 -107 223 -23 -122 131 -462 -82 -101 -93 78 -166 64 33 -192 262 -11
4741 -11 -13 50 13 -95 -237 292 168 -56 83 137 -43 -311 134 -201 -230 201 -214 205 -143 173 -73 19 -31
4764 -31 -118 227 202 95 -30 206 -45 10 157 -65 -25 -72 -110 68 123 -63 128 56 17 -164 -196 -198 -161 5 -81
4789 -81 -119 127 -79 205 -3 -71 98 114 -71 -82 36 235 -81 -20 -236 133 -4 37 -44 -75 31 159 169
4812 169 -263 79 48 -55 -117 -53 195 231 18 118 -85 -32 -71 4 137 55 96 32 95 -172 -47 107 50 214
$$ packed form
4644a66J63j93n8J77R8K18n1k43K4j31J08L96l72M92n55J99k87K18J6J78j03q2
4666D6k10k16K75K5M19m01L7nj33J35Q6l2l3k20o9L02R2j28K2Q7q%nl3J5j52J10
4693Fl1J48k50k3K4K38j9k04K51j25k55L39j76J3L06l01J4J0O2rl5L20n50J77
4717g0L6J59K5m28N96l5m09P2n3L30k46r9K53n93L80j9QJ71k44K30l1k25M54k73
4741a1kO3l7j08j42N29j24k24J39N4j80k68M45l35k9M31m15M19l48L16k46R2n0
4764c1q7L45k5j07j25K36k51N5J47k22M0m7l8J78N5j86J91p2l9j81l2kL7J66q6
4789h1l8K46k06K84k08o8J69J6j85j1J18J99l16O1k16L69j37M1q1l1J06J28J0
4812A69m32L42l1j03o2O4K48L6k13J00k03N3l9P5J33q2M1o4O3k67J25J54n7J64
$$ plain form
4836 214 7 56 5 -113 -165 -102 246 110 -247 -10 -490 -44 99 -272 12 153 83 351 134 -13 55 4
4858 4 83 -55 254 -56 -145 -333 -42 19 84 24 -59 107 276 -44 -51 286 -135 -8 -21 -192 -61 -90 -286 -178
4882 -178 -18 56 -169 4 -116 -3 15 -186 286 159 40 114 -90 151 70 -38 -7 39 217 -330 -12 -107
4904 -107 -93 -217 -134 35 21 92 -210 104 -108 -74 -139 270 113 -5 -47 -16 -143 -17 -35 75 -87 -33 50 -36
4928 -36 320 -108 -82 121 111 111 -4 -214 -19 36 -232 0 -18 -20 -1 -51 39 16 192 -158 84 73 -9 -23 118
4953 118 84 -31 -15 3 189 57 20 46 156 42 40 99 223 -55 -147 97 -169 -104 128 15 84 61 -200 117
4977 117 341 -254 -286 79 56 -31 16 153 -3 -74 -82 -83 -268 124 53 73 69 -73 111 -15 -100 -225 -55 -168 53
5002 53 53 39 169 -461 -329 161 238 -112 40 43 -161 177 -220 67 144 -68 30 21 172 -115 -53 332 -88 417
$$ packed form
4836B14k07M9n1j18n2O3L48j36l57K37m80M46J43l71K84J41p0K68k17j47O8n1
4858DP9j38L09l10q9j88K91O1O5o0q3J66J69l20pL37m21J27j3j71J31k9j96J08
4882a78J60P4k25J73j20J13J8k01M72j27j19P4k04K41q1j08L1M6J78n47L18r5
4904a07J4j24Q3J69j4P1l02L14k12L4o5M09j57j18m2L1j27J26j8J10j62N4Q3q6
4928c6L56m28K6K03j0%j15k10J95N5k68K32j8kJ9n0R0k3J76l50K42j1q2j4J41
4953A18l4j15J6J8J86j32l7K6J10j14kN9J24k78r2K44k66O5K32j13O9k3k61L17
4977A17K24n95l2L65k3q7M7J37j56p1qjj85L92p1K0mj42J84j26q5j25J70j13K21
5002E3%j4J30o30J32M90P7l50J52Lk04L38l97K87P7k12R8rJ51k87O2L85m20N05
$$ plain form
5026 417 97 -39 -31 -55 149 -3 -86 31 -90 -9 196 198 153 140 -220 -90 0 -211 -87 95 7 -98 72 -193
5050 -193 -43 -7 23 -315 -30 -305 -222 -26 -133 -19 -1 154 67 -196 -59 -233 -15 -133 -159 -90 14 327
5072 327 125 -233 -106 31 241 1 93 -167 -199 -142 -50 -43 9 -158 -17 80 -191 -158 -69 178 3 410 -249
5095 -249 -199 -145 -308 361 34 108 -206 -161 -286 40 266 -68 -205 -135 159 79 -67 81 -257 -56 86 43
5117 43 44 65 130 48 165 237 -401 170 55 -251 290 -78 -155 -61 50 -169 0 -67 -324 16 -73 -64 46 -167
5141 -167 -30 61 -203 -160 -97 -190 241 -28 11 -81 2 -110 -187 70 153 8 60 135 175 83 145 264 101 -36 -309
5166 -309 248 -120 -16 100 -278 -124 154 122 136 39 -94 69 -46 33 -81 -39 -125 337 88 119 -143 -87 -32
5189 -32 -3 -5 51 31 99 139 -14 -27 253 -164 47 81 -56 2 88 116 6 -202 323 -12 -21 97 -52 31 -153
$$ packed form
5026D17l20j36Qk4K04j52q3J17j21Q1K05Km5j3l60J30R0k11J24J82q8j05J70k65
5050a93J50L6L0l38K85k75Q3J96j07J14J8J55q7k63J37j74K18j18k6O9J04L13
5072C27k02l58J27J37K10k40R2k60l2N7R2PN2j67J41R7k71L3Q9K47j75M07o59
5095b49N0N4j63O69l27P4l14M5j25L26K26l34j37P0K94q0j46J48l38K01J42m3
5117D3JK1O5q2J17P2o38N71j15l06N41l68p7R4J11k19J69o7k57L40q9RJ10k13
5141a67J37R1k64M3O3r3M31k69L9r2Q3j12p7K57Q3j45N2P5M0r2O2J19j63j37k73
5166c09N57l68J04J16l78J54K78l2J4r7j33J63j15P9j14M2q6M62k49L1k62N6N5
5189c2K9kN6k0O8M0j53j3K80m17K11L4j37N8Q6K8j10k08N25l35rJ18j49Q3j84
$$ plain form
5214 -153 -105 177 -2 -74 104 -179 -327 66 259 97 -290 -93 -140 65 55 144 286 -140 142 251 104 -194
5236 -194 -310 68 -119 89 58 -71 -91 -85 15 182 -7 -164 -150 57 -46 45 92 89 11 55 -246 264 35 -122
5260 -122 -56 168 42 -186 -163 -238 -122 95 -72 136 31 -50 126 3 -43 52 -491 14 -242 194 -86 -190
5282 -190 -86 128 -75 80 -70 -339 3 -68 -35 -37 10 80 -149 -23 194 136 -21 -479 40 -89 -27 -5 -137
5305 -137 -150 37 -141 17 217 -146 138 72 63 -66 53 -60 331 1 85 81 51 -57 54 -33 50 -17 -94 105
5329 105 -185 -41 -284 -11 156 -107 286 -147 -281 -23 -58 -144 -91 125 -181 -152 8 -140 137 -394 -8
5350 -8 -158 -4 -200 2 143 -28 -39 194 -202 221 -81 29 -113 -139 280 -464 70 -95 -87 152 320 47
5372 47 -81 298 -126 3 -167 -14 22 127 118 -83 -23 -262 153 -97 99 -40 75 31 4 247 -80 202
$$ packed form
5214a53M8K82j79p2J78k83j48L93J93j62l87J97m7K05j0Q9J42m26K82J09j47k98
5236a94j16L78j87K08l1j29k0OJ00J67j89j57J4K07j03R1M7lp8M4l01N10k29j57
5260a22O6K24j26k28K3p5J16K17j67K08j05q1J76j23m6R5n43N05k56M36k80j04
5282a90J04K14k03J55j50k69L42p1L3kM7P0k29J26K17n8j57m58N19j29O2K2j32
5305a37j3J87j78J58K00l63K84o6rj29J19j13L91l30Q4ml0j08J11q7Q3o7p7J99
5329A05k90J44k43K73J67k63L93m33j34K58l5q6N3K16l06K9J60j48K77n31L86
5350hj50J54j96K02J41j71j1K33l96M23l02J10j42k6M19p44N34j65QK39J68k73
5372D7j28L79m24J29j70J53L6J05rk01O0k39M15k50J96j39J15m4k7K43l27K82
$$ plain form
5394 202 13 -21 72 344 -126 -224 -282 106 198 39 240 135 -336 337 165 -27 -139 146 -161 86 -65 -16
5416 -16 -1 -140 414 229 -182 80 -271 96 276 -6 299 -83 115 139 -52 -119 -30 133 -307 123 -5 -46
5438 -46 237 398 184 32 -9 -217 -21 128 -38 13 25 62 97 -302 344 -304 -75 93 -174 -76 55 -15 62
5461 62 -422 -53 260 11 127 -13 221 -101 -218 -58 -56 -10 -4 138 148 80 140 187 -45 77 -72 52 104 24
5485 24 115 -55 -231 168 111 -178 -20 -20 -100 -136 -198 -35 97 -248 -234 -112 86 10 295 108 -49 -301 176
5508 176 168 -137 -151 166 -48 79 -183 -72 -76 -112 -11 -239 198 -122 -165 38 113 35 3 34 37 -75 19 -72 43
5533 43 -126 -50 -133 45 -93 188 210 -100 -358 75 198 -393 228 310 -168 -52 84 19 -57 42 -44 329 -187
5556 -187 35 159 -3 157 143 -106 127 203 -95 -13 28 126 163 36 -16 227 159 -79 -261 -91 -150 -121 -257
$$ packed form
5394B02j89l4R3K72m70r8n8L88R2j59K01j05m71O73j72j92j12K85l07K47j51M9
5416a6J5j39N54j85m11K62l51L67J80k82L05l82J98K4j91o7Q9J63m40M30j28m1
5438d6K83J61k14j52m1k08J96J49j66N1J2L7L5l99O46o48K29J68k67R8J31p0P7
5461F2m84L69L13k49J16j40K34l22j17J60KM6OJ42J0o8O0M7k32J22j49J24N2q0
5485B4R1j70j76L99n7k89J58%q0l6o2J63J32l45J4J22J98p6K85j87j57k52M77
5508A76ql05j4L17k14J27k62J11ml6J01k28M37l20m3K03P5p8l2L1Lj12R4r1J15
5533D3j69P6q3J78j38K81K2l10k58M33J23n91O21Q2m78J16J36o5p6R9q6L73n16
5556a87K22J24j62J60j4k49K33P6k98Q2M1R8L7j27n2K43o8k38j82J70n9K9j36
$$ plain form
5579 -257 44 64 -18 102 261 -256 -172 119 171 220 238 -169 169 61 268 152 330 -81 -93 202 -19 -29 -47
5602 -47 36 -63 -44 -351 96 157 146 391 132 -235 -146 -216 64 -94 -86 125 -248 57 253 266 86 -46 77 -125
5626 -125 -123 184 -138 110 -30 34 -142 -267 155 -279 -124 -60 -115 97 1 120 2 142 330 -136 -132 -84 64
5649 64 -204 -121 191 -45 -174 14 50 29 -20 13 124 -56 -64 90 144 -7 -32 -90 58 -63 -84 -250 121 349
5673 349 82 67 115 216 11 11 -177 18 428 -57 142 238 119 -71 -87 -17 116 -317 -16 -100 11 -58 243
5696 243 89 -18 -154 -22 164 -60 -18 10 11 171 116 -80 87 106 -152 14 147 -11 -59 -301 -250 43 -105
5719 -105 104 -21 283 171 -121 189 122 226 72 -63 255 14 -200 248 -53 89 106 -46 -6 -16 -79 -15
5741 -15 -97 -190 -119 -39 6 -163 106 121 92 122 53 -316 -69 -10 -16 -94 50 95 67 -112 6 -222 191 91 -214
$$ packed form
5579b57L01K0q2J20J59n17Q4K91N2M9J8m07L38j08K07j16J78m11j2K95k21j0j8
5602d7Q3r9J9l07M47O1j1K45k59l67Q9p0K80j58QK11l73L05J96J3j80j32J23k02
5626a25KL07l22K48j40O4j76j25M22m34J55O4n5K12r6J19j18J40J88m66MM8J48
5649F4k68Q3L12k36j29J88L6k1m9L3J11j80qJ54N4j51k5n8J48j21k1j66L71K28
5673C49k67j5M8J01k05%j88J95M10m85J99R6j19j90j6P0J33m33L01q4J11o9L01
5696B43j54j07j36J32J86k24M2K8JJ60n5j96J67J9k58J66J33j58m8k42N1K93j48
5719a05K09j25L04j12k92L10o7J04j54j35L18k41k14M48l01J42J7j52M0j0o3O4
5741a5q2r3P1Q0M5j69K69J5k9L0o9l69K47N9op8J44M5k8j79J18k28M13j00l05
$$ plain form
5766 -214 26 30 -11 -88 334 -66 75 -49 45 -48 -132 29 64 -147 -72 28 -111 -194 -169 89 -36 -116 144 -111
5790 -111 -284 32 -344 -321 -151 46 -60 -239 13 37 156 -57 63 75 -190 84 -65 25 -198 88 292
5811 292 -152 195 49 -315 59 129 100 164 6 339 200 -95 -62 168 -265 -317 -69 163 -43 -224 -93 -253
5833 -253 437 103 -8 -50 -149 -36 46 -20 146 227 -144 42 -74 -167 -53 52 40 -342 -277 97 -108 167 49
5856 49 65 140 305 195 -6 -108 83 -148 -79 -40 -44 -174 -41 1 50 216 120 147 -184 150 57 -161 85 355
5880 355 156 -108 94 251 -49 -88 -235 -67 -17 18 168 28 -171 37 249 -194 143 43 -235 -159 -46
5901 -46 -100 63 -115 -150 -47 -208 101 183 108 152 149 112 353 111 192 -217 -44 -134 89 118 46 -168 -112 23 129
5926 129 -29 -118 11 239 -47 132 213 -81 112 -114 50 365 -13 -145 173 173 -261 -11 -143 39 -126
$$ packed form
5766b14K40Mm1p7M22m00J41j24R4r3q4J61L5k11P5J00j39q3K5K58j25q0K60k55
5790a11j73L16l76K3J70J97j06j79K52K4J19k13J20J2k65K74j49R0k23K86K04
5811B92m44L47j46l64L74P0k9O4j58L33j39k95L3K30m33n2K48K32k06j81J31j60
5833b53O90l34j11m2r9J13Q2o6J66Q1l71J86j16r3J14J05j2l82O5L74k05K75j18
5856D9J6P5J65j10k01j02J91k31O9L9mj30J33M2M9J66r6K7l31L34r3k18K46K70
5880C55j99k64K02J57l00l9j47J68N0L5J50j40j99K08K12m43L37j00k78P6J13
5901d6n4J63j78l5J03j61L09Q2p5M4ll7K41k42Q1m09J73r0K23K9p2k14N6J35J06
5926A29j58q9J29K28k86J79Q1k94J93k26J64L15l78j32L18%m34K50j32J82j65
$$ plain form
5947 -126 53 -49 70 165 181 -6 174 -98 136 132 -115 -87 -220 -38 -234 -95 -46 -205 -167 -12 -251 33
5969 33 -345 -159 32 -120 127 -6 159 -240 -33 82 -57 111 88 401 -263 193 67 -35 -255 -18 116
5990 116 -182 21 133 262 22 44 114 146 239 183 160 173 -120 145 37 -151 -114 -68 -58 -25 -265 -26 142 7
6014 7 -160 -152 5 21 158 55 -38 -283 -2 -41 -95 -152 -106 -84 197 -12 -6 0 109 -257 10 84 -8 16 -182 -85
6040 -85 -23 189 25 66 205 68 -170 -3 -60 -121 -107 176 93 -127 105 10 -68 -37 -135 -76 3 -7 89 380 5
6065 5 -71 -66 -183 270 207 -80 146 -41 190 -83 218 131 61 201 227 251 -258 80 43 80 23 -107 48 7 61
6090 61 324 334 -246 18 -25 -67 -10 134 -20 1 44 124 -90 46 59 -235 -45 -107 236 -212 271 -101 -58 234
6114 234 146 89 1 -138 55 -160 -213 31 -69 242 -188 -11 -26 61 -98 198 -25 265 -140 63 493 -78
$$ packed form
5947a26J79j02J19R5J6j87J80k72K34mk47K8j33J82j96J39M9j59L8J55k39K84
5969C3l78J86J91j52K47j33J65l99K07J15j39J68k3L13o64M56j26j02k20K37J34
5990A16k98K03J12J29k40K2P0L2R3n6k3J3k93K65j08j88L7M6J0L3k40K39J68j35
6014Gj67QJ57J6J37j03r3k45K81l9n4n7M6K2K81k09OOJ09l66K67P4r2K4j98R7
6040h5O2K12j64M1J39j37k38J67n7o1J4K83q3k20K32r5p8L1r8N9P9j0R6K91l75
6065Ep6Nj17M53o3k87K26j87K31k73L01q7p0J40K6K4n09L38l7L7n7j30J55m1N4
6090F1K63J0n80K64m3m2N7J44j54K1M3Q0k14J36J3k94J90o2L43m48M83l72M3K92
6114B34q8n7q8j39J93k15n3K44j00L11m30J77j5Q7j59K96k23K90m05K03M30n71
$$ plain form
6136 -78 146 25 -153 52 130 85 12 3 187 101 -111 76 188 -3 -129 -20 45 21 -66 -112 38 206 -91 -84
6160 -84 13 -43 134 220 42 16 135 164 -111 -201 -180 222 -21 25 375 -107 -202 -196 153 -8 -224 49 148 -126
6184 -126 86 52 -2 -168 -89 -34 160 -105 1 -77 -180 -13 127 350 -109 -172 17 88 -95 70 15 60 -230
6207 -230 -280 267 151 227 -89 -123 145 65 10 77 -148 23 23 71 -217 -70 224 90 -55 241 229 219 -66 131
6231 131 -120 68 -57 12 -143 -174 189 -30 26 -160 -46 -190 -136 -262 -144 -15 -14 41 -129 -111 -88 88 -103
6254 -103 81 81 -324 -52 2 -67 185 -75 183 -201 117 -74 -83 -69 -90 -26 128 -211 68 271 -104 -63 -81 155
6278 155 -86 64 -10 -217 242 115 137 175 62 -247 -328 17 -17 -259 55 13 -115 -53 113 35 116 77 114 -20
6302 -20 135 13 -224 -278 72 71 182 83 -16 155 -99 -24 -4 -181 106 -50 -15 58 -112 -116 -37 307 35 104 87
$$ packed form
6136g8K24j21j78K05P8m5p3rJ84q6k12J87J12j91j26J09O5k4q7m6J50J68k97P
6160h4R7n6J77Q6j78k6J19K9k75r0K1M02k43M6L50m82r5OL49j61k16K73R9k74
6184a26K12l4n4j66P9N5J94k65J06p8j03J67J40K23m59o3J89P1j83J65n5M5k90
6207b30n0N47j16P6l16l4K68q0n5O7k25J71%M8k88J47K94j34j45K96j2j0k85J97
6231A31k51J88j25O9j55l1L63k19N6j86J14j44N4j26J18J29JN5j70J8K3J76j91
6254a03J84%m05K72N4o9K52k60K58l84L18j91rJ4k1O4J54l39K79K03l75M1j8K36
6278A55k41J50p4k07M59j27K2L8j13l09q1L45l4k42L14m2j28O2J66p8Q1l9L7j34
6302b0J55j22k37n4L50jJ11r9r9J71k54P5K0j77K87j56L5P3j70mP9L44k72O9j7
$$ plain form
6327 87 121 -148 38 106 50 -197 232 42 64 106 25 -129 -91 29 132 -177 6 -282 -100 70 -37 -96 -32
6350 -32 62 -265 94 -190 -58 52 -30 -178 68 -56 -112 50 -20 48 -98 81 83 -259 -186 72 265 -23 209
6373 209 -117 29 -145 133 -158 50 -75 -54 -12 -171 23 118 -4 -228 102 -48 63 -3 -40 47 227 -8
6395 -8 11 473 159 113 119 58 235 -100 33 32 171 -28 -252 -20 100 -40 -43 51 -50 -20 -144 198 117 -19 111
6420 111 -80 160 -97 37 187 -86 96 132 88 -331 -47 268 40 -73 212 -80 372 -59 -39 -38 -73 28
6442 28 331 115 -74 -157 -225 -47 6 -312 -220 -226 -228 124 -4 -63 -222 81 116 218 34 -297 -115 -161 54 -15
$$ packed form
6327H7L4k69J86O8n6k47M29j90K2M2q1j54L8J20J03l09J83k88J82J70j07n9O4
6350c2R4l27L59k84J32J10q2j48K46j24n6J62p0O8j46J79Kl42P3K58J93k88K32
6373B09l26J46j74K78k91K08j25K1M2j59J94R5j22k24L30j50J11o6l7Q7J80k35
6395hJ9M62l14m6Oo1J77l35J33jJ39j99k24K32J20j40lR4j01L0j24L42q1j36J30
6420A11j91K40k57J34J50k73J82L6m4m19K84L15k28j13K85k92M52m31K0Jl5J01
6442B8L03k16j89q3o8J78N3l18R2okL52j28n9j59L03L5J02j84l31J82m6K15o9
$$ [...]
8191a12
##END NTUPLES=NMR FID
##END=
