##TITLE=1H_DE-91_4_oil
 200.13MHz,CDCl3 ,
 8 sc
 
 18.4.2025
##JCAMPDX= 6.0         $$ Bruker NMR JCAMP-DX V2.0
##DATA TYPE= NMR FID
##DATA CLASS= NTUPLES
##ORIGIN= UXNMR, Bruker Analytische Messtechnik GmbH
##OWNER= pz
$$ XWIN-NMR		Version 3.5
$$ Fri Apr 18 15:27:11 2025 Russian Standard Time (UT+4h)  she@DPX200
##.OBSERVE FREQUENCY= 200.1313
##.OBSERVE NUCLEUS= ^1H
##.DELAY= (6, 6)
##.ACQUISITION MODE= SIMULTANEOUS
##.ACQUISITION SCHEME= undefined
##.AVERAGES= 8
##.DIGITISER RES= 18
##SPECTROMETER/DATA SYSTEM= spect
##.PULSE SEQUENCE= zg30
##.SOLVENT NAME= CDCl3
##.SHIFT REFERENCE= (INTERNAL, CDCl3, 0, 14.3821)
##AUDIT TRAIL= $$ (NUMBER, WHEN, WHO, WHERE, WHAT)
$$ ##TITLE= Audit trail, XWIN-NMR		Version 3.5
$$ ##JCAMPDX= 5.01
$$ ##ORIGIN= Bruker BioSpin GmbH
$$ ##OWNER= she
$$ F:/spectra/data/she/nmr/H-C/1/audita.txt
$$ ##AUDIT TRAIL=  $$ (NUMBER, WHEN, WHO, WHERE, WHAT)
(   1,<2025-04-18 15:25:44.90 +0400>,<she>,<DPX200>,
      <created by zg, POWCHK disabled, PULCHK disabled
       configuration hash MD5:
       00 E9 B6 7A A2 85 ED C7 34 08 36 98 17 FE 4E 26
       data hash MD5: 16K
       2A 90 32 3A 52 5F 5F CA 24 FF C0 8B 90 0D 70 A0>)
$$ ##END=
$$ 
$$ hash MD5
$$ 1D 1A 9C 3B 3A 3D 44 AF 91 8B 8A 7B 31 4E CE FC
##$RELAX= 
##$RELAX= 
##$RELAX= 
##$RELAX= 
##$RELAX= 
##$RELAX= 
$$ Bruker specific parameters
$$ --------------------------
##$DU= <F:/spectra>
##$EXPNO= 1
##$NAME= <H-C>
##$PROCNO= 1
##$TYPE= <nmr>
##$USER= <she>
##$AMP= (0..31)
100 100 100 100 100 100 100 100 100 100 100 100 100 100 100 100 100 100 
100 100 100 100 100 100 100 100 100 100 100 100 100 100 
##$AQSEQ= 0
##$AQ_mod= 1
##$AUNM= <au_zg>
##$AUTOPOS= <>
##$BF1= 200.13
##$BF2= 200.13
##$BF3= 200.13
##$BF4= 200.13
##$BF5= 200.13
##$BF6= 200.13
##$BF7= 200.13
##$BF8= 200.13
##$BYTORDA= 1
##$CFDGTYP= 0
##$CFRGTYP= 5
##$CHEMSTR= <none>
##$CNST= (0..31)
1 1 145 1 1 1 1 1 1 1 1 1 1 1 1 1 1 1 1 1 1 1 1 1 1 1 1 1 1 1 1 1 
##$CPDPRG= <>
##$CPDPRG1= <>
##$CPDPRG2= <>
##$CPDPRG3= <>
##$CPDPRG4= <mlev>
##$CPDPRG5= <mlev>
##$CPDPRG6= <mlev>
##$CPDPRG7= <mlev>
##$CPDPRG8= <mlev>
##$CPDPRGB= <>
##$CPDPRGT= <>
##$D= (0..31)
0 0.7 0 0 0 0 0 0 0 0 0 0.03 0 0 0 0 0 0 0 0 0 0 0 0 0 0 0 0 0 0 0 0 
##$DATE= 1744975544
##$DBL= (0..7)
120 120 120 120 120 120 120 120 
##$DBP= (0..7)
150 150 150 150 150 150 150 150 
##$DBP07= 0
##$DBPNAM0= <>
##$DBPNAM1= <>
##$DBPNAM2= <>
##$DBPNAM3= <>
##$DBPNAM4= <>
##$DBPNAM5= <>
##$DBPNAM6= <>
##$DBPNAM7= <>
##$DBPOAL= (0..7)
0.5 0.5 0.5 0.5 0.5 0.5 0.5 0.5 
##$DBPOFFS= (0..7)
0 0 0 0 0 0 0 0 
##$DE= 6
##$DECBNUC= <off>
##$DECIM= 32
##$DECNUC= <off>
##$DECSTAT= 4
##$DIGMOD= 1
##$DIGTYP= 9
##$DL= (0..7)
0 120 120 120 120 120 120 120 
##$DP= (0..7)
150 150 150 150 150 150 150 150 
##$DP07= 0
##$DPNAME0= <>
##$DPNAME1= <>
##$DPNAME2= <>
##$DPNAME3= <>
##$DPNAME4= <>
##$DPNAME5= <>
##$DPNAME6= <>
##$DPNAME7= <>
##$DPOAL= (0..7)
0.5 0.5 0.5 0.5 0.5 0.5 0.5 0.5 
##$DPOFFS= (0..7)
0 0 0 0 0 0 0 0 
##$DQDMODE= 0
##$DR= 18
##$DS= 0
##$DSLIST= <SSSSSSSSSSSSSSS>
$$ [...]
##$SUBNAM0= <"">
##$SUBNAM1= <"">
##$SUBNAM2= <"">
##$SUBNAM3= <"">
##$SUBNAM4= <"">
##$SUBNAM5= <"">
##$SUBNAM6= <"">
##$SUBNAM7= <"">
##$SUBNAM8= <"">
##$SUBNAM9= <"">
##$SW= 18.0517328524113
##$SWIBOX= (0..15)
0 0 2 0 0 0 0 0 0 0 0 0 0 0 0 0 
##$SW_h= 3612.71676300578
##$TD= 16384
##$TD0= 1
##$TE= 0
##$TE2= 300
##$TE3= 300
##$TEG= 300
##$TL= (0..7)
0 120 120 120 120 120 120 120 
##$TP= (0..7)
150 150 150 150 150 150 150 150 
##$TP07= 0
##$TPNAME0= <>
##$TPNAME1= <>
##$TPNAME2= <>
##$TPNAME3= <>
##$TPNAME4= <>
##$TPNAME5= <>
##$TPNAME6= <>
##$TPNAME7= <>
##$TPOAL= (0..7)
0.5 0.5 0.5 0.5 0.5 0.5 0.5 0.5 
##$TPOFFS= (0..7)
0 0 0 0 0 0 0 0 
##$TUNHIN= 0
##$TUNHOUT= 0
##$TUNXOUT= 0
##$USERA1= <user>
##$USERA2= <user>
##$USERA3= <user>
##$USERA4= <user>
##$USERA5= <user>
##$V9= 5
##$VALIST= <valist>
##$VCLIST= <CCCCCCCCCCCCCCC>
##$VD= 0
##$VDLIST= <DDDDDDDDDDDDDDD>
##$VPLIST= <PPPPPPPPPPPPPPP>
##$VTLIST= <TTTTTTTTTTTTTTT>
##$WBST= 1024
##$WBSW= 4
##$XGAIN= (0..3)
0 0 0 0 
##$XL= 0
##$YL= 0
##$YMAX_a= 91577
##$YMIN_a= -133530
##$ZGOPTNS= <>
##$ZL1= 120
##$ZL2= 120
##$ZL3= 120
##$ZL4= 120
##$ABSF1= 10
##$ABSF2= 0
##$ABSG= 5
##$ABSL= 3
##$ALPHA= 0
##$AQORDER= 0
##$ASSFAC= 0
##$ASSFACI= 0
##$ASSFACX= 0
##$ASSWID= 0
##$AUNMP= <proc_1d>
##$AZFE= 0.1
##$AZFW= 0.1
##$BCFW= 1
##$BC_mod= 2
##$BYTORDP= 1
##$COROFFS= 0
##$CY= -3
##$DATMOD= 1
##$DC= 2
##$DFILT= <>
##$DTYPP= 0
##$F1P= 0
##$F2P= 0
##$FCOR= 0.5
##$FTSIZE= 0
##$FT_mod= 4
##$GAMMA= 1
##$GB= 0.15
##$INTBC= 1
##$INTSCL= 1
##$ISEN= 128
##$LB= 0.25
##$LEV0= 0
##$LPBIN= 0
##$MAXI= 10000
##$MC2= 0
##$MEAN= 0
##$ME_mod= 0
##$MI= 1.114404
##$NCOEF= 0
##$NC_proc= 0
##$NLEV= 6
##$NOISF1= 3.799351
##$NOISF2= 2.8
##$NSP= 1
##$NTH_PI= 0
##$NZP= 0
##$OFFSET= 14.38212
##$PC= 1
##$PHC0= -833.1195
##$PHC1= 14.39221
##$PH_mod= 1
##$PKNL= yes
##$PPARMOD= 0
##$PSCAL= 0
##$PSIGN= 0
##$REVERSE= no
##$SF= 200.129724274929
##$SI= 16384
##$SIGF1= 3
##$SIGF2= 2
##$SINO= 400
##$SIOLD= 16384
##$SREGLST= <1H.CDCl3>
##$SSB= 0
##$STSI= 0
##$STSR= 0
##$SW_p= 3205.1282051282
##$SYMM= 0
##$S_DEV= 0
##$TDeff= 0
##$TDoff= 0
##$TI= <>
##$TILT= no
##$TM1= 0
##$TM2= 0
##$TOPLEV= 0
##$USERP1= <user>
##$USERP2= <user>
##$USERP3= <user>
##$USERP4= <user>
##$USERP5= <user>
##$WDW= 1
##$XDIM= 8192
##$YMAX_p= 0
##$YMIN_p= 0
$$ End of Bruker specific parameters
$$ ---------------------------------
##NTUPLES= NMR FID
##VAR_NAME=  TIME,          FID/REAL,        FID/IMAG
##SYMBOL=    X,             R,               I
##VAR_TYPE=  INDEPENDENT,   DEPENDENT,       DEPENDENT
##VAR_FORM=  AFFN,          ASDF,            ASDF
##VAR_DIM=   8192,          8192,            8192
##UNITS=     SECONDS,       ARBITRARY UNITS, ARBITRARY UNITS
##FACTOR=    0.0002768,     1,               1
##FIRST=     0,             0,               0
##LAST=      2.2672688,     0,               0
##MIN=       0,             -133530,         0
##MAX=       2.2672688,     91577,           0
$$ Real data points
##PAGE= N=1
##DATA TABLE= (X++(R..R)), XYDATA
0 0 0 0 0 0 0 0 0 0 0 0 0 0 0 0 0 0 0 0 5 -8 8 -8 8 -8 8 -13 16 -16 18 -24 24 -29 32 -37 41 -45 52 -58 62 -70
40 -70 78 -87 96 -106 119 -130 144 -158 174 -192 211 -233 257 -285 315 -349 391 -437 493 -559 642
61 642 -747 880 -1066 1332 -1742 2453 -3905 8006 -44005 -133530 35693 87145 -3643 37596
75 37596 91577 25251 15030 53954 13385 -11274 35408 1061 -70270 -31851 -11251 -70228
87 -70228 -37754 17140 -29705 -38966 17881 16526 1857 24525 30576 22737 22932 11107 5292 26971
101 26971 24831 -22257 -29691 7611 -352 -22782 -9953 -18357 -26749 -3725 -11004 -20420 14866
114 14866 21180 -4131 8011 30038 17111 10832 30485 20284 -16577 -15032 -2367 -23371 -24231
127 -24231 -7405 -20023 -21360 -2564 -2627 2289 20373 17112 2881 6183 18115 14474 1616 5209
141 5209 8079 -5251 -5126 549 -6002 -5685 -4608 -11868 -14790 -12715 -5862 -161 -2940 1073 5646
156 5646 1511 8228 18571 12741 8017 7757 1793 -3644 -3728 -1891 -5135 -12340 -9301 -6294 -9165 -998
172 -998 5314 449 3378 6552 1475 3270 6450 4051 1234 -1017 -1343 -928 -1519 1445 128 -4823
188 -4823 -3441 -2721 -3543 -221 -1181 -1964 919 -439 2065 7529 5240 4032 5213 1423 -650 -979
204 -979 -2121 -3442 -5952 -5492 -4896 -6521 -1301 2986 -766 2200 5041 1381 3471 6672 3517 1124
220 1124 1003 -110 -1310 -1127 110 -1360 -4437 -2220 -2298 -4420 -812 -152 -3236 -855 715 392 2617
237 2617 4076 4661 4155 2124 2276 2031 80 289 -1845 -4713 -3644 -3953 -3684 -1337 -1627 -1088 843
254 843 261 2153 3352 2223 2468 2176 656 1119 820 282 162 -1268 -1756 -1340 -2496 -1267 -1036 -2333
272 -2333 -1584 -1330 -1424 1122 2037 1636 2285 2002 2327 2625 1557 1331 666 -1590 -1568 -2117 -2606 -1784 -2066 -2374
292 -2374 -1128 -1024 -69 1268 994 1547 1744 622 1674 1951 1232 1522 560 -202 -209 -841 -380 -580 -1858
311 -1858 -1729 -1747 -1886 -525 72 -284 795 873 932 1879 1831 1835 1585 594 271 59 -984 -763 -854 -1721 -1249
332 -1249 -1397 -1109 37 -171 55 661 39 644 1076 766 1118 769 202 579 354 163 306 -515 -873 -909
352 -909 -1083 -886 -502 -934 -640 -295 123 795 1063 948 1497 631 535 710 76 158 -215 -1015 -639 -710 -746 -143
374 -143 -321 -490 -64 -204 -107 371 444 392 381 144 493 338 47 560 149 1 14 -344 -349 -345 -594 -649 -477 -589
398 -589 75 186 566 724 242 395 471 -5 361 417 -278 -347 -504 -693 -52 -156 -204 238 -469 -122 245 34
420 34 254 0 -50 115 218 219 66 182 -36 404 -234 -212 -49 -242 -102 -269 -559 -252 -4 131 -9 29
442 29 375 153 123 315 109 -172 3 13 -558 -68 185 -91 165 7 -157 -69 -226 309 288 -168 65 112
464 112 74 334 254 -29 -163 28 -249 -322 -93 -262 -28 -484 -378 222 63 558 296 -26 92 263 263 421
486 421 41 76 -59 -184 -193 -242 -293 -267 -39 -274 -215 246 47 47 12 247 273 -239 117 297 -142 413 15 -88
510 -88 314 -107 -279 -176 -36 -297 30 -218 258 -74 -111 -40 289 -8 250 251 57 9 -163 96 -10 -82 -210
533 -210 53 -77 -173 -128 -212 -92 -51 -249 132 72 25 -77 -120 43 -5 62 296 49 -74 53 106 -136 111 -74
557 -74 -126 -54 -39 -207 190 -103 208 25 -166 161 -122 354 -67 182 -217 68 -26 -144 -9 -3 84 -6 15 175
581 175 -228 66 45 55 76 163 50 54 125 162 380 111 -52 -141 105 91 -101 -69 81 132 17 -48 -2 26 116 -19
607 -19 -94 337 185 43 -95 7 -254 24 -148 -26 17 -30 -295 50 -92 246 -48 -143 -292 -257 150 127 -94
630 -94 105 117 69 129 -29 62 -12 -123 33 108 -98 -121 -279 -144 -142 -200 49 -232 179 -63 -24 -109 28 -156 -71
655 -71 271 -200 34 109 -98 -194 -137 -213 166 -138 182 117 -6 -63 53 96 48 50 -109 52 13 168 -153 446
679 446 -77 45 89 -162 71 18 131 15 106 67 264 -67 -154 -13 -116 186 183 94 -63 79 -134 -90 223
702 223 -182 -233 -133 -67 182 8 58 155 -55 -36 43 131 152 205 176 334 156 246 -127 136 -49 159 -99 441
726 441 192 108 -199 207 216 39 -64 -61 142 -153 -12 71 152 -51 -11 -337 37 33 -12 101 -58 128 126 -61 53
751 53 -89 237 -145 -141 -16 -7 100 -242 -223 -73 194 -161 -141 37 -200 -20 -24 -194 193 -65 -114 45 14 -123
775 -123 49 -24 173 119 -219 138 -121 -152 -224 20 52 -239 88 10 160 -132 -121 -341 194 168 -149 -123 -131 48
799 48 -231 52 41 206 13 20 -85 -168 127 -136 -185 175 58 -166 -81 -85 -275 -3 -145 -61 29 115 -104 -139 -210
824 -210 134 135 -173 -378 10 81 267 -120 -11 117 231 198 -288 -63 -173 27 -210 -59 197 -75 -42 146
846 146 146 2 206 114 -39 192 68 255 50 0 -18 -16 31 146 -94 -226 -43 188 163 13 -78 -1 74 13 -15
871 -15 91 -247 -41 276 49 94 153 -447 -57 -153 -124 66 99 154 114 117 72 298 -91 85 -59 452 -244 31
895 31 -95 -150 65 -197 -31 73 -169 -83 -121 -112 14 194 -64 346 -181 553 -259 68 0 -190 248 -321 -188
918 -188 48 -153 -11 -102 0 198 -20 251 -126 -19 66 -75 -165 -16 -66 316 197 51 3 -23 -146 58
940 58 -61 -57 279 60 -131 -148 180 -65 215 -16 -140 207 18 48 -55 163 -20 -10 153 104 -125 225 -56
963 -56 -63 157 182 54 201 -20 -330 -23 -151 130 105 -5 237 91 -41 69 297 84 -190 -6 -171 2
985 2 -53 -153 -107 286 165 -68 -297 340 125 -81 13 -63 158 352 81 -57 -68 145 63 -102 200 60 -158
1008 -158 146 -18 -3 -59 -29 3 47 -3 94 -18 133 143 71 -94 -70 95 -26 -39 82 -155 222 12 35 132
1032 132 258 162 277 -54 -39 -240 -58 -310 157 -394 -103 -63 93 -159 -371 246 -32 168 -170 249 38
1053 38 166 -79 10 -29 -39 118 299 83 12 99 156 5 -10 209 194 -250 -85 -52 108 -171 -23 40 264 -30
1077 -30 57 170 -54 45 -8 -180 -111 262 -103 -132 -26 -60 -36 138 253 -105 15 -83 83 -138 41 1 116
1100 116 217 -12 309 155 -132 34 -169 -70 109 -81 -73 -115 41 152 -125 121 -15 -55 -110 209 -462 -121
1122 -121 112 208 24 58 -195 83 -37 -29 -139 -241 -264 -127 20 151 14 -136 175 -250 89 -5 -89 55
1144 55 -52 52 -16 -2 -143 37 39 -32 68 229 -198 12 60 -75 -41 -85 149 -124 -45 -310 -176 -68 243
1167 243 17 -307 -260 92 98 76 -95 -119 263 -74 -93 -30 -94 -1 -9 -72 56 126 262 41 -207 81 -53 195
1191 195 -8 -196 118 -146 186 266 -143 -35 -133 291 107 -3 208 -125 191 111 161 -31 111 105 -163 117
1213 117 -23 236 75 247 -11 -206 81 38 151 226 43 -173 -209 -80 2 -53 -24 -180 -223 40 -23 190 19
1236 19 -145 0 11 -183 -179 105 -215 329 41 126 100 -100 -27 -204 -380 -295 263 85 -76 163 33 57 -306
1259 -306 -189 -178 108 -16 1 -2 94 -155 -98 131 -7 8 43 112 -50 -103 -139 -89 -131 259 -7 -128 -230 -134 -178
1284 -178 -96 -65 -218 -98 227 -124 7 93 29 23 91 -80 -19 -161 -331 -50 -36 7 -268 -164 67 -77 -196
1307 -196 -141 -170 -8 88 102 -59 230 -42 -87 -115 -333 13 -119 -88 -168 131 -211 -23 139 -66 -42 24 -72 -217
1331 -217 202 -48 47 -180 149 -205 313 -84 -64 421 62 -258 -111 -264 4 254 -4 -270 114 -178 121
1352 121 139 -46 116 -56 249 -12 216 -289 259 -13 -193 251 -139 -80 -69 -160 36 -143 80 30 88 -100
1374 -100 183 -187 -24 101 -220 27 100 -127 -19 -45 -93 278 -93 -134 -133 -137 165 11 -30 -215 -42 127 -139
1397 -139 287 -12 217 -21 -52 -166 -59 108 -85 175 84 108 -257 294 69 69 62 -128 -196 77 93 -39 -94
1420 -94 -22 182 -108 215 -172 104 115 158 -10 -38 -17 -67 19 -142 -10 129 4 88 180 -94 41 204 23
1443 23 20 35 -131 -252 -20 -39 78 170 221 178 -320 -146 -50 206 34 152 23 -156 50 36 -107 136 -40
1466 -40 -493 114 72 -196 22 61 -150 -178 -9 5 174 -48 -55 -290 28 7 -238 57 -165 -171 172 -156 2
1489 2 -187 407 134 39 35 -349 -75 12 -296 -141 318 174 -235 22 124 -27 121 -14 191 212 135 -65 210
1512 210 -20 161 -27 -88 -73 -203 236 -309 85 -121 182 61 -62 132 210 202 -39 -89 -271 -44 -104 38
1534 38 -188 -234 39 26 129 204 115 384 -3 -25 63 93 90 -232 -118 -37 18 -101 71 9 -55 -47 243 -31 -63 197
1560 197 308 34 34 -88 -111 -67 -21 -313 -99 -77 4 277 144 -55 -257 129 161 79 -13 30 234 -53 10 219
1584 219 69 187 -60 -195 123 -28 107 -45 -103 11 -314 54 -33 -103 12 347 -170 159 249 21 -89
1605 -89 -49 -42 -39 -33 -128 75 -60 15 -291 -154 34 39 -53 405 -206 -1 -95 -36 380 166 -35 179 120 24 -95 62
1631 62 38 63 -226 -21 -93 -106 -151 179 79 -251 -94 49 -128 2 92 -96 40 247 56 173 -101 136
1653 136 -123 -208 -25 -77 -115 -164 9 119 -18 73 59 -29 41 67 -337 -229 185 84 95 -98 -25 209 -66 -161
1677 -161 -75 26 117 -89 -34 -6 21 -354 -126 -262 92 73 -182 40 -89 78 -26 154 49 -162 -14 39
1699 39 244 -218 -10 -133 58 -188 92 140 -127 267 -85 -133 34 158 -260 19 403 -100 113 103 -117
1720 -117 147 -261 -177 -129 -55 -170 -86 122 249 -11 27 72 -118 -249 46 -148 -87 -195 -119 -70 -82 -92 156 139
1744 139 87 -48 60 175 158 -59 -265 12 -346 -269 132 -132 -74 136 -167 136 79 205 -33 53 187 45
1766 45 -57 89 -168 -16 12 42 196 62 35 -28 86 47 -25 77 185 -37 29 52 36 -42 106 -99 -40 33
1790 33 147 -4 140 27 -161 260 141 364 -25 76 88 208 105 112 -87 58 46 208 30 55 122 275
1812 275 108 63 28 25 266 -198 33 -64 86 -100 284 16 -86 221 217 -167 -309 157 233 189 1 45 -151
1835 -151 -119 -10 161 -38 -288 -69 -19 61 198 -7 -197 -67 -111 182 130 76 -17 132 134 -2 9 52 -122 -97
1859 -97 -203 167 83 -112 247 116 -116 3 -61 -44 86 -54 -9 -59 -252 71 40 88 0 -169 9 -36 -60 -337
1883 -337 108 -92 -72 -100 -80 42 -165 -118 53 75 -283 229 132 -65 268 158 -43 98 78 28 188 -29 -66
1906 -66 152 157 -20 -205 20 -163 -156 -120 148 -220 113 -2 76 -31 221 -8 -172 2 -92 -123 -4 -71 136
1929 136 32 53 75 -136 -181 101 270 -192 -133 24 81 -46 195 157 263 -118 -122 -46 132 -116 136 -233 258
1952 258 153 1 -43 38 5 -110 -65 200 -114 -6 38 23 -224 -155 75 -74 136 -68 -89 -233 -167 -95 -23 33
1976 33 -73 140 -121 247 4 -54 -42 -221 139 -124 302 -40 21 277 1 140 -194 114 73 94 -209 255
1998 255 -86 67 12 168 106 174 -69 195 104 -69 -63 -139 -38 14 151 120 -84 26 242 -285 153 224 149 99
2022 99 123 101 -289 -153 59 176 -42 200 -209 279 -193 114 210 6 -186 116 74 -96 -123 -225 156 164 190
2045 190 215 143 60 -160 50 -77 -150 102 -147 -152 234 54 47 65 -14 204 -183 -54 -104 224 -75 88 21 -68
2069 -68 -23 73 74 48 -144 -69 -7 77 127 -146 82 60 188 -294 -33 11 -119 -91 -18 -82 -46 -2 -12 -290 -114 -26
2095 -26 79 -4 54 -139 82 250 -247 53 -264 -205 -18 -81 -85 127 112 -80 -33 22 79 46 -42 114 46 144 -12
2120 -12 -132 130 -22 -25 -112 115 81 137 239 -98 -313 46 -151 -240 -140 29 -51 271 -46 -207 -59 79 -121
2143 -121 184 -171 150 100 20 -15 51 345 296 -140 265 153 -208 -161 -136 -303 36 18 125 101 -86 -192 50
2166 50 91 -159 41 -74 54 3 -4 -75 100 55 -3 -44 149 24 -26 -141 -146 -163 169 52 20 -239 -262 -140 114
2191 114 30 9 187 -103 -26 -203 96 30 7 -40 5 59 -89 100 216 26 35 143 3 262 86 139 100 -37
2215 -37 18 50 213 19 -177 -227 44 -198 135 -204 22 20 -37 151 184 22 150 -19 145 -96 140 -123 -128
2238 -128 43 39 199 -167 -169 202 109 108 339 -183 46 -57 -105 148 36 77 179 123 96 236 -13 28 239 -14
2262 -14 -53 46 204 152 105 -41 -36 -71 61 -5 140 -88 17 84 115 -48 195 97 -183 -61 -113 56 233 73
2286 73 95 94 -63 -73 191 -105 32 -23 132 37 -161 -105 53 -30 -39 -38 217 -358 52 2 -158 379 43 -178 48
2311 48 113 -53 -180 -238 191 157 334 -197 2 201 -114 169 176 -19 47 292 80 -202 -112 -83 -6 67 -155 126
2335 126 27 25 -220 -124 52 -170 -134 218 206 -95 -54 3 32 41 83 -113 53 293 68 -20 -71 -29 245 234 121
2360 121 -3 -19 91 148 -93 -6 -71 -237 -139 -28 30 229 -176 81 72 44 -19 58 -174 -114 -164 193 -7 -90 73
2385 73 66 68 -59 128 21 -294 127 -60 115 48 72 -187 -247 -96 123 -214 24 268 2 103 162 40 72
2408 72 -181 -224 -60 244 -3 -146 10 157 -261 94 -113 -204 -151 -97 83 136 -326 212 116 -206 40 -103
2430 -103 43 236 130 -10 -74 -92 57 -139 -218 165 -92 21 141 -21 -90 222 54 78 275 -7 208 102
2452 102 -4 108 -31 -25 38 84 -20 -108 -341 -13 16 -198 -38 -168 3 -226 -54 -267 107 -109 53 142
2474 142 113 -346 -17 -22 -7 -178 127 -97 -105 -69 -248 -28 -25 -13 -228 47 43 119 -14 -238 42 -212 149 43
2498 43 31 -186 -113 21 -126 -130 -144 154 -53 210 86 53 -262 -110 6 -85 150 -184 135 -307 -86 205 -64
2521 -64 -153 -8 30 -186 -195 -31 -136 -62 78 -58 -62 -219 -7 112 107 30 -67 210 -245 -76 1 -127 51 159
2545 159 108 -100 195 -57 -92 216 -66 100 41 -160 304 81 2 -42 280 -196 -227 90 -125 -330 -203 332
2567 332 126 -53 101 -161 -58 19 -133 35 50 131 127 -229 -75 -149 221 1 180 198 -80 -64 -434 -158 -409
2590 -409 33 -240 -45 187 -35 -177 -65 79 35 -28 -106 -45 123 96 -306 183 -273 310 -56 170 219 -58
2612 -58 48 69 -142 -15 -25 -80 -28 137 172 -21 22 140 89 206 -260 -114 64 125 -396 113 121 -333 -32 315
2636 315 -70 56 91 -225 76 21 41 51 -99 69 169 -310 15 1 -10 5 -69 31 279 -38 -11 118 1
2659 1 19 -111 23 -185 -88 29 321 -46 -29 -69 44 -214 -41 63 110 -386 43 -82 -52 37 113 -97 -154 -244
2683 -244 -306 255 60 -284 216 80 -37 -187 -286 1 -76 121 -72 240 187 292 89 -95 4 281 256 51
2705 51 -184 -213 -46 30 64 147 -19 79 -204 219 -34 -147 -162 -8 -161 18 186 206 -33 -133 208 105 -11
2728 -11 -248 115 48 139 -161 -169 82 225 -199 135 -137 -10 81 -60 -103 -2 -65 -5 274 -114 -84 -182 -101 102
2752 102 -117 34 80 14 -220 103 49 -98 42 148 -10 -97 274 27 -86 -131 68 48 233 -74 97 24
2774 24 -124 210 -86 -111 -29 -121 94 -135 115 -299 60 178 129 9 104 -17 32 51 -1 204 147 -85 171
2797 171 -76 -59 -157 63 274 -2 -74 214 70 143 -27 119 53 150 313 26 -118 -72 191 198 -152 -285 3
2820 3 -80 -394 -102 53 94 -59 -186 264 -269 -220 4 292 -379 416 -129 -9 -54 -154 180 -244 -147 7
2842 7 -90 268 -125 -342 239 179 -163 55 63 167 -62 -250 -27 249 1 300 -23 -126 -358 -58 -23 -137
2864 -137 -179 -293 -5 134 234 304 -199 101 -149 15 2 -25 -173 -47 -48 -71 -151 -73 -109 -54 -248 170 15 40
2888 40 102 99 77 105 103 -29 -70 32 -9 19 8 205 46 -380 205 -285 20 241 132 18 -118 -49 -131 -117 -100
2913 -100 108 200 -145 33 65 70 -163 124 193 -7 68 27 110 160 -109 151 -158 32 104 25 80 44 -57 -107 196
2938 196 8 42 -56 -152 -145 31 182 -16 104 -37 135 145 -171 -202 -206 40 -4 -40 -138 -54 98 -18 -70 -50 -116
2963 -116 -322 -164 18 -139 37 111 -171 161 92 -10 -174 -75 31 -162 -52 43 181 83 54 74 -131 72
2985 72 -182 140 -115 161 244 -155 -60 -329 358 -45 118 -23 -170 362 97 -30 113 124 -45 -40 -209 -10
3007 -10 67 158 -14 54 166 325 -43 18 109 29 -208 146 69 -11 -4 179 192 -49 -34 242 54 11 -335 25 -46
3032 -46 -134 105 -92 28 -79 43 80 219 -21 146 15 -188 -38 -39 -144 106 1 -189 -115 156 -38 21
3054 21 132 262 -269 -188 249 93 -346 89 -165 14 -101 41 -50 74 -69 -167 -89 -92 -159 -25 -107 197 197 -37
3078 -37 270 -59 150 -49 91 -82 -92 -39 -116 208 172 33 176 -8 -198 22 130 -43 70 284 -52 -104
3100 -104 112 139 -159 164 145 85 -182 -236 -126 54 -142 -59 125 -150 92 -202 -7 -95 92 27 -77 -107 -66
3123 -66 41 -31 -102 -13 -2 -70 -5 -39 -111 198 348 -162 9 -123 -203 49 146 23 27 121 27 -206 -279 174 13
3148 13 -179 219 46 53 158 119 -17 65 -131 -210 34 -58 84 44 81 111 -183 -182 43 95 -41 319 -81 -25 -4
3173 -4 144 -114 -118 105 120 -90 205 -106 27 5 -13 13 203 -41 324 120 -32 41 -32 -11 187 98 -139 -45
3197 -45 -166 180 -53 120 2 205 -99 62 74 137 -37 92 -63 139 -39 -72 -2 269 304 145 35 -80
3219 -80 -38 -253 -59 -30 -145 -15 312 -73 76 -83 -194 205 160 -114 23 90 -59 -61 -84 -127 127 217 -131
3242 -131 92 -34 30 228 216 -167 -51 312 -160 98 154 30 -144 83 -25 -54 6 4 -238 -94 51 53 16
3265 16 229 -232 -114 -86 63 33 44 -152 40 -160 237 -7 -62 337 -160 -108 -43 6 -39 165 79 221 90
3288 90 57 22 -37 -76 -301 135 -130 47 -120 43 65 -255 -158 75 -112 95 -39 -88 -6 -32 -287 89 -61
3311 -61 -44 17 99 132 -88 -37 30 134 46 51 -35 33 75 141 85 -94 -92 -145 12 -225 -153 -173 -235 12 98 86 105 57
3339 57 -51 86 38 308 -164 337 43 23 94 -34 -71 50 252 90 46 316 -38 58 106 213 -225 126 36
3362 36 -94 157 16 163 204 -67 -15 7 -12 98 -87 83 -22 132 3 -133 82 -29 8 12 180 5 -118
3385 -118 114 200 45 -29 26 118 51 142 -135 -110 71 73 281 29 118 9 8 -74 76 -26 12 -142 14 10 96 54
3411 54 57 -21 -101 17 128 52 47 -184 -39 84 -60 60 -184 -124 -88 18 78 16 -175 308 11 10 -96 113 146
3436 146 89 -38 183 232 46 -182 126 145 152 -303 -29 -20 -4 86 -107 -391 116 291 52 -117 146 36 -105
3459 -105 -221 276 -264 -86 177 -105 154 -208 -32 -112 -156 398 57 43 -67 79 -17 44 121 -68 -194 225
3481 225 -124 148 -152 -302 119 63 -175 -299 174 12 58 275 37 -216 337 -8 -193 -212 -46 296 -298
3502 -298 207 -177 -109 76 -29 72 206 -155 -56 76 207 23 40 86 -232 -60 -60 -23 82 261 77 21 143
3525 143 -10 52 -36 -43 237 82 87 9 339 -87 -86 212 63 47 -13 -126 43 -17 179 138 124 91 -254 -109 113
3550 113 -36 -17 57 -51 83 -105 -18 -88 -10 68 90 -155 22 324 -208 217 24 81 13 -24 -93 -211 -45 293
3574 293 38 -200 10 130 -83 91 -84 -170 -162 -20 29 99 -205 -173 8 24 257 86 -32 159 -110 -78 -255
3597 -255 -58 -121 -40 -43 113 -224 16 -6 -305 69 -202 -131 -283 -100 -111 35 114 -100 51 60 26 40 -123 -300
3621 -300 -98 193 -113 -32 -71 -63 -176 -148 197 4 -139 0 -17 -198 -29 160 247 -57 132 -60 124 92 -184
3644 -184 -209 86 21 -59 168 -39 -113 147 16 53 -33 -34 72 -251 172 -203 -157 -242 -27 -61 188 -135 12 21
3668 21 -17 -117 9 85 59 11 217 235 -105 114 211 42 235 -215 -56 -116 -13 -83 -32 -59 -24 -74 -98 -37 36
3693 36 13 98 -12 9 4 -320 146 -222 117 212 -218 -312 44 -14 -151 22 -21 150 -12 -112 -370 139 218 -186
3717 -186 -101 80 170 114 47 9 -121 45 78 -23 1 -86 -22 18 -137 -223 -112 38 -44 -69 -106 -111 -68 73 19 79
3743 79 -96 -160 182 288 -329 49 -199 -47 -41 -123 106 -94 35 73 -200 79 273 142 154 256 -22 -108 178
3766 178 149 70 -114 116 -40 -78 -108 15 -147 -99 -71 125 -67 -425 -17 -130 -53 -29 -50 120 -146 14 178
3789 178 -105 127 355 35 -182 67 99 -60 226 73 -159 -70 248 -199 89 150 -101 -87 -53 -28 -26 -44 -178
3812 -178 51 -310 7 0 150 207 -224 -274 171 -90 26 -236 -60 -165 59 -252 -49 145 -153 160 -185
3833 -185 -220 203 -3 -119 188 1 -48 -16 -97 -285 90 -129 246 92 109 119 28 399 -235 126 42 -49 176
3856 176 -18 171 -222 219 155 41 165 -88 136 -226 63 -47 100 -174 -11 63 -74 101 -216 -54 -159
3877 -159 52 139 117 -164 103 -284 -130 -60 59 -132 -180 -13 -27 150 -63 260 56 -2 -125 -273 -101 67
3899 67 -229 3 4 127 149 152 178 -124 56 90 64 -49 -80 -56 43 -119 69 -4 109 203 -241 -135 112 -72 86
3924 86 235 -135 -155 8 70 -84 -47 195 190 -179 278 -121 -270 -103 162 113 6 94 276 -7 -51 5 21 210
3948 210 33 -152 -101 54 -155 29 -14 -265 52 24 -202 -154 -5 -13 -115 198 172 230 63 -116 -20 121 -15
3971 -15 230 -150 55 -75 -79 93 -163 295 -156 -122 10 -61 98 -152 -287 -2 266 79 -239 42 30 75
3993 75 52 -96 89 6 -62 -44 -71 -280 24 -190 -147 157 -73 220 348 39 -235 92 5 86 84 173 148 -9
4017 -9 -27 -99 239 344 226 -302 -117 65 2 247 165 122 -33 76 -38 377 93 -17 -44 -19 -217 56 -70
4040 -70 -149 -52 63 295 -304 99 -78 -58 20 42 -33 115 12 -102 176 60 -135 60 87 53 -25 -108 -20 -2
4064 -2 86 -347 -75 231 139 -228 -208 -24 27 272 165 15 -36 108 -36 126 76 152 -137 63 -85 -28 -177
4087 -177 145 -208 73 133 82 79 -174 -259 197 -38 -272 -1 -34 -3 -232 -79 49 -255 -99 13 48 96 158
4110 158 57 29 -268 -257 61 196 -135 -57 266 -39 50 55 37 -6 -59 -2 7 -43 23 -289 239 40 176 180 -44
4135 -44 222 -62 5 -83 -90 -151 -160 -86 -204 422 51 -29 -34 177 -151 105 1 -141 12 82 -249 130 -167 -33
4159 -33 -95 142 82 176 -160 64 -79 180 -7 -245 -30 191 107 -263 -120 -64 -333 -28 68 0 117 266 -77
4182 -77 -3 -25 190 -74 -173 -73 125 -25 163 182 -33 -45 -351 -101 -212 123 -52 -32 -121 -116 92 23 128 -279
4206 -279 -27 -50 51 0 -124 39 9 109 242 145 -298 -104 174 -182 83 91 -93 -73 -87 -6 42 16 -23 24
4230 24 -37 76 181 101 -33 -32 41 53 120 275 -296 -62 138 -144 363 292 153 199 317 9 8 -47 -71 -90 -56
4255 -56 66 134 -425 99 92 -2 158 262 270 -38 -24 -145 10 235 -154 92 -188 37 193 42 -21 -41 -85 35
4279 35 17 8 9 48 11 -2 -341 -106 -83 55 -117 54 64 -100 105 -85 -105 94 370 -197 216 79 160 199 -52
4304 -52 -39 -54 77 171 -114 -61 -54 60 -128 -49 124 -133 -343 277 -128 138 -135 128 -267 172 7 -150 151
4327 151 219 54 -66 48 21 74 37 8 -118 -266 36 213 -92 -8 -36 38 -73 -39 -78 181 175 -203 -44 -212
4351 -212 92 -57 -136 -88 32 87 31 -201 -53 6 -34 60 -210 88 -63 -78 167 -65 37 -174 -96 234 70
4374 70 -108 -228 -244 7 23 107 -14 -253 47 95 -28 115 -196 193 44 125 -125 46 248 170 -55 60
4396 60 46 283 -75 -94 -312 78 392 -16 91 37 -134 110 69 2 105 -53 -88 -125 -142 -62 109 256 44
4419 44 -163 -185 -56 52 200 148 -184 -127 270 67 57 -179 41 -69 -164 141 -133 184 123 66 -42 272 93
4442 93 -196 -116 349 32 186 -42 -132 48 87 -36 4 0 170 92 -218 -45 26 79 160 -161 291 -201 229 -31
4466 -31 52 71 192 55 -11 117 18 71 160 -142 170 94 46 65 -267 -9 -27 -321 -75 207 74 292 33 241
4490 241 -103 -39 -106 55 -51 99 -79 190 -189 42 190 -149 75 -39 34 10 152 1 -6 -28 -101 68 256
4513 256 -276 -321 56 -38 -22 243 -126 222 -47 -111 162 -356 -16 66 -60 85 3 -103 -14 -4 -32 193 167
4536 167 -170 250 -34 -62 -110 -217 214 -33 -169 -303 -283 109 72 45 -33 -179 134 212 166 71 -481 177 -168
4559 -168 22 -417 -217 -55 27 112 19 49 20 60 -255 107 3 162 111 -64 -51 -119 5 -82 -139 364 -108 24
4583 24 135 67 337 -121 176 -41 4 -134 -236 131 -144 -24 -51 38 46 22 -160 -66 -237 120 64 -41 -242
4606 -242 -105 -102 142 -124 -82 90 -96 -98 189 -75 -224 -132 6 152 25 5 -57 134 43 -154 73 -121 -84
4629 -84 108 46 57 -86 99 -18 181 -62 -117 -13 -89 118 -265 44 80 145 21 12 -179 -137 -19 -41 352 -85
4653 -85 49 -54 -45 107 48 -37 -129 -226 211 -19 234 91 -105 50 -71 -66 200 -20 -155 -46 -50 38 62 274
4677 274 111 253 178 -21 1 147 187 161 -87 42 120 38 118 -160 -116 -28 -37 13 135 180 38 54 -20 106 -52
4702 -52 75 -192 113 -108 139 78 -89 138 17 -13 131 -240 -209 167 -89 99 26 -87 -207 325 300 218
4724 218 -148 -236 -25 -102 79 0 60 77 -150 146 91 118 228 44 50 -255 254 115 -81 258 154 -2 17
4747 17 410 3 -1 -111 50 47 -5 -205 -82 -81 5 -15 55 -10 -79 277 61 88 -21 90 -27 -83 120 11 -102
4772 -102 144 208 -58 -34 1 86 -12 129 -1 42 -176 -290 30 -7 39 70 123 24 24 -45 -113 -7 -50 -86 187 -62
4798 -62 144 -583 -79 9 30 151 -103 36 -46 -223 138 129 -256 -153 213 37 -1 -60 10 80 -86 131 -226
4821 -226 156 6 47 160 -211 105 -67 -163 122 -286 162 85 -39 -31 -118 -52 -62 140 124 -39 235 239 28 39
4845 39 71 80 27 -60 105 264 -316 -191 18 -136 9 196 214 24 -42 25 186 116 62 -113 -75 19 -26 67 91
4870 91 -4 -164 -26 110 -295 -21 -95 -74 -101 318 -69 23 69 -13 1 -45 31 -80 220 -147 -293 -159 65 133
4894 133 -25 128 93 -43 -192 150 261 82 -4 -9 44 82 292 -153 22 139 115 66 -154 130 -54 -233 -135
4917 -135 -73 124 -26 -30 150 -124 64 155 123 220 -176 103 -82 232 -303 25 2 31 -118 187 -208 65 -114
4940 -114 -34 -27 77 -51 148 145 72 27 187 51 -272 29 104 45 -208 60 221 -38 -14 80 178 22 -218 -157
4964 -157 337 -68 208 -188 -256 163 -160 -371 -106 -104 -84 -50 -154 43 -257 -20 32 75 -89 -11 53 -13 -244
4987 -244 -50 -88 21 -198 -216 220 -184 -119 -48 -123 62 120 146 272 -39 -208 -90 75 170 11 -44 258 -7
5010 -7 50 279 203 -207 -94 -279 -228 48 21 23 -274 42 -207 57 -17 -78 15 118 -72 -10 -5 66 -112 -212 -153
5035 -153 -148 -115 15 -43 -240 164 -243 19 -146 255 339 462 -73 -74 149 263 40 201 47 4 -84 183 -31
5058 -31 -154 410 23 -57 10 -10 -15 121 -111 176 39 96 -34 -82 188 -51 79 99 -77 -69 229 -29 -4 -101
5082 -101 -162 82 203 -203 -213 -240 -65 252 -318 -27 -84 95 -245 -114 -214 72 -306 -98 162 -175 -257 311
5104 311 127 64 193 -94 144 -88 -239 -169 -3 48 -12 119 -95 134 -153 151 36 168 176 253 142 -309
5126 -309 246 49 -77 -176 -193 -130 258 93 -336 -196 115 -114 -58 -221 15 -17 -20 -191 -169 48 -219 -2 41
5149 41 101 182 18 -89 122 -88 -29 40 -145 7 -128 -10 107 -6 -79 -53 294 82 -43 51 -239 18 -60
5172 -60 -280 7 -127 276 272 -64 -164 335 -52 -192 -123 -94 -138 -80 50 284 -183 41 -78 122 -56 2 -145
5195 -145 288 67 -38 3 -218 370 116 -146 -80 -43 -167 57 -26 80 -108 -124 28 85 67 -57 281 43
5217 43 -145 146 323 69 -330 -189 -122 9 -97 25 112 259 83 -29 -15 246 -280 -253 75 -60 -153 -247
5239 -247 184 -39 -46 -30 -116 47 254 55 -156 -74 -11 55 -197 42 -77 19 -16 22 -328 -176 141 -36 108
5262 108 -43 51 -66 186 -34 116 -88 45 -144 24 -82 -78 12 -266 69 -53 -126 -180 213 147 5 194
5284 194 28 128 120 -80 54 -27 -25 -2 -212 176 157 -272 -34 56 17 -38 -175 41 87 -172 -139 86 -245 106
5308 106 -22 171 -281 144 175 -353 138 144 155 50 -14 231 73 -226 195 202 -395 66 99 107 -112 32 -78
5331 -78 -65 195 123 20 100 -164 -90 77 -10 -105 198 217 21 -150 -171 117 -119 -58 -135 -80 154 293 -135 -57
5355 -57 185 -22 111 -220 -201 -143 44 -56 294 111 48 -122 109 -99 -119 237 -355 -221 -164 -265 -65 -19
5377 -19 -139 282 49 -208 -26 139 31 -51 -39 79 38 49 129 -130 -158 20 -192 -157 7 -143 315 18 -24
5400 -24 -141 198 -52 63 49 -99 34 -98 -4 19 -17 -22 40 68 36 1 -55 -172 6 -264 -83 -21 -1 -165 -51
5425 -51 -154 199 104 226 15 -144 21 -260 87 75 69 -89 108 -115 101 230 87 40 42 121 -176 -26 -63
5448 -63 183 7 187 -115 -78 156 -112 112 177 -208 86 181 231 144 165 40 -70 -83 75 -218 -183 122 -83
5471 -83 -122 -108 -188 -73 -48 6 43 -137 298 -40 -69 234 -120 -17 219 -23 -353 -181 94 287 40 37 -13 -158
5495 -158 -32 78 -252 -66 -102 130 3 -242 -19 -118 18 294 160 263 -115 -339 -183 196 178 -116 -154
5516 -154 -78 145 55 2 -68 119 -78 43 -25 16 -41 30 0 76 19 -152 -118 34 28 -106 190 19 76 -13 -70 310
5542 310 199 -264 15 48 194 -104 141 -150 -118 -32 -244 -1 -14 -29 8 -62 -181 104 -82 92 28 -46 -82
5565 -82 115 54 -77 204 187 57 -510 83 -109 -147 209 158 40 -51 122 -5 7 -65 -45 -111 -149 72 1 67
5589 67 -135 78 61 320 129 -75 316 198 169 -177 -241 115 69 -54 -233 -322 118 84 168 -62 357 233 -15
5612 -15 129 -68 4 -103 -245 93 125 -19 89 -146 61 100 11 -42 -19 116 -166 129 35 -152 120 -279 -76
5635 -76 -46 -229 52 45 -19 -191 269 -9 88 -56 30 135 182 268 -39 32 -421 -87 -63 18 -172 -190 -291 106
5659 106 -46 -100 161 51 -49 54 3 90 260 252 167 -50 271 -6 -33 -46 209 36 236 -88 68 2 -79
5682 -79 124 14 -241 239 185 -197 -139 -14 -73 -213 -184 291 232 130 -80 -268 -218 -160 -112 65 -67 -183 126
5705 126 -18 -126 177 22 -111 37 -62 19 4 38 279 51 -64 207 178 -26 40 -113 73 -129 216 33
5727 33 263 86 189 65 117 270 15 12 -269 5 155 198 -9 -27 -232 60 -39 -116 76 -4 85 110 -82 -63
5751 -63 -151 91 81 -153 -20 118 59 -18 72 -48 -10 -114 190 35 46 67 -160 -63 -308 -64 60 -8 256 145
5775 145 -47 -11 -74 -125 -130 134 -140 -55 -57 -66 -274 51 218 92 -87 134 -18 52 61 -155 51 193 240 133 20
5800 20 211 105 -66 19 26 99 -191 -236 -27 55 69 29 0 47 -50 -148 11 -77 -57 -145 262 125 268 36 -222
5825 -222 -162 143 38 -116 -13 128 17 -228 33 -183 131 82 -284 -78 64 -71 45 158 -218 151 -13
5846 -13 156 -146 -89 238 305 47 341 -136 6 -113 261 -177 52 6 98 89 -327 72 -51 26 -199 -151 -297
5869 -297 138 88 -131 -81 -204 40 42 15 -127 -61 239 21 -4 47 43 -64 -350 -181 -68 -125 -50 159 36 -195
5893 -195 -18 -206 -95 2 182 146 -100 164 -139 -145 -118 -18 37 35 -62 -73 156 62 85 -25 53 1 -117 140 104
5918 104 -183 -146 -13 -42 16 -34 67 31 -154 -179 -62 -326 -126 65 114 -33 -4 -105 215 -56 1 40 267
5941 267 23 -55 -100 159 -34 277 -61 -29 52 118 82 164 -27 -140 69 153 94 -151 -8 -54 133 94 -72 -44
5965 -44 -189 209 47 124 196 -164 -77 32 118 -33 131 25 81 177 -199 142 -32 -156 100 72 -321 -180 -88
5988 -88 201 139 -158 -88 52 -190 -6 169 145 -160 -124 39 2 117 -219 205 220 227 -166 -232 -10 -118 335
6011 335 -34 -261 -159 -56 -63 -229 161 -9 -276 32 130 122 -114 -36 55 -205 262 98 48 27 -211 -1 -312
6034 -312 -156 129 -83 -111 -8 -15 -291 313 -7 -132 -38 -92 -11 21 204 -147 -77 18 27 -160 -46 -13 -30 -90 -48
6059 -48 -193 -160 224 -145 39 52 1 178 267 33 88 -210 23 -78 136 61 -51 87 86 112 -103 183 -144
6082 -144 -251 -73 -27 162 -23 14 -99 52 9 -279 178 126 -53 108 -162 71 57 -133 92 -184 90 18
6104 18 271 43 62 83 -149 -56 267 -35 -84 -79 -5 75 -83 -57 282 300 -155 -161 53 -132 -144 -149 -96 -121 74 113
6130 113 -77 180 161 65 -36 150 -196 68 -8 92 11 -71 91 -152 -70 169 -23 2 -25 -189 91 59 48
6153 48 144 -281 182 18 113 41 171 4 101 -179 -25 -304 -11 -105 182 284 350 -14 -96 -169 31 380 205
6176 205 174 -25 -140 86 -119 -41 -51 116 -54 -269 47 162 -296 -36 95 102 -5 110 122 57 -23 98 -142
6199 -142 -191 1 87 -56 -80 -52 -173 131 -194 136 -96 -3 33 -70 190 -65 182 -70 -287 -216 162 -122
6221 -122 117 -18 37 198 -131 -55 -337 -312 174 103 351 -64 5 -124 -286 70 -84 205 45 203 -42 135
6243 135 -7 -62 -252 -182 -170 -142 -74 -4 227 48 128 -67 -7 -34 119 316 -71 137 21 -151 -20 -45 39 -164
6267 -164 -68 -235 -114 90 -19 197 -74 2 126 -243 -30 46 -125 44 -186 242 36 -167 -10 -73 19 58
6289 58 134 158 159 135 93 88 304 -35 -12 136 1 115 105 5 -18 -14 149 339 8 -123 -208 -443 179 72 -303
6314 -303 24 73 -75 55 92 -23 -118 -408 -29 210 183 122 -186 -86 -95 -110 7 -149 -23 56 -87 185 39
6337 39 0 -178 4 -36 -116 -117 -223 -7 -73 -33 -242 36 -85 -5 206 -16 52 205 -47 143 202 -122 -139 -92
6361 -92 9 -146 125 210 -37 -180 14 28 -20 -8 30 -82 189 -326 -71 -3 45 -94 -197 -70 -14 -200 136
6384 136 10 283 158 46 105 134 10 14 88 -90 -251 57 -5 31 -35 210 127 -52 158 -205 -13 -116 -42
6407 -42 -192 -28 142 -29 146 -34 87 -236 101 -146 125 67 338 126 293 194 -119 33 253 -144 107
6428 107 37 -189 88 -22 -63 214 91 -69 -107 198 -67 -147 -21 90 -356 44 -218 -63 -139 -8 144 57
6450 57 40 228 -73 -100 -173 73 -71 340 -213 -71 126 -130 101 140 140 77 30 -67 -46 -27 -1 -362 -21 -115 82
6475 82 -305 -211 170 229 -168 91 -149 155 -247 285 16 -18 -382 16 -29 -3 13 -182 -377 -75 -92 42 -175
6498 -175 48 189 -52 -57 125 205 100 -3 37 -41 292 167 -311 -133 220 28 -244 -128 27 -78 -208 49
6520 49 102 176 -38 113 30 213 -11 46 -4 227 -29 157 -119 -31 -15 -66 -160 -242 172 -38 26 -81 -119 130
6544 130 9 160 -87 -61 90 -81 72 349 66 -8 -218 185 -85 359 -92 18 -21 -84 2 -239 71 -154
6566 -154 83 -210 -126 181 -45 -119 -73 1 -148 -245 83 -41 -44 35 -185 -229 86 -236 58 -22 85 -142 -132 -10
6590 -10 -61 206 150 -66 -110 150 -52 68 -332 131 27 -31 70 9 -82 61 367 -62 -29 12 -98 35 -77
6613 -77 36 133 177 -74 -219 268 -52 180 10 -73 -137 73 87 -132 -105 -319 -9 196 66 117 43 36 321 -192
6637 -192 -118 164 103 -217 -2 -366 -55 23 -24 5 -83 103 -31 167 304 45 98 -112 51 -13 175 49 34
6660 34 -160 -11 -78 15 285 375 -180 -58 154 -27 -113 -27 207 53 -12 103 3 298 142 70 -120 -114 -91 -99
6684 -99 36 251 -2 -103 141 -3 4 120 -95 -1 65 22 81 29 -342 3 68 -24 -37 -212 126 -14 -60 -35
6708 -35 39 -119 166 161 -114 -161 167 161 -125 157 -85 98 77 232 -141 -14 51 25 111 -18 -38 167 -60 -210
6732 -210 157 -311 37 -172 69 -213 27 102 71 -23 37 164 -96 -52 51 156 -266 -148 2 -201 140 -20
6754 -20 30 -23 -174 -27 17 148 -403 -105 23 -172 85 -201 170 136 -21 -188 -66 -96 42 -2 28 259 -85
6777 -85 93 6 -73 -95 5 -130 -59 -9 -22 27 -185 -111 -385 -85 -42 246 -68 -181 99 -62 28 -131 42 -113
6801 -113 435 136 -112 111 101 -201 -123 -112 -487 185 154 226 -94 -32 28 -111 -158 -34 -97 -200 13 82 106 -11
6825 -11 13 265 263 -222 236 266 1 -52 -36 -91 -122 -67 157 -11 136 126 62 149 2 -45 -57 171 -58 146 -142
6850 -142 -94 -166 -210 292 -15 -148 32 -105 70 -266 -235 -50 27 -179 -6 51 50 44 -265 -21 94 72 -45 -149
6874 -149 227 -28 52 -38 -7 180 235 -91 -37 112 91 -21 -53 118 -81 -333 -56 -103 -99 -19 -177 -93 -112 -99 124
6899 124 138 -324 -25 111 -112 -43 155 41 220 -218 36 152 -216 30 75 -24 -30 48 132 -74 144 27 41
6922 41 163 6 16 60 27 303 -138 230 -145 -87 11 114 12 -134 122 130 280 -266 76 -124 -231 -122 -109
6945 -109 127 -93 -284 161 205 -155 -246 -241 -47 -257 -17 -53 34 -47 123 270 288 85 -95 126 83 16 -294
6968 -294 140 49 -71 166 -92 347 -50 76 144 32 172 -287 22 -51 43 -149 -105 -57 -137 -4 67 127 7
6991 7 372 -52 35 60 80 -50 -60 49 138 96 -197 17 2 267 156 96 67 -31 216 58 -65 124 22 -236
7015 -236 -140 96 -24 56 -20 -28 -258 165 152 -24 218 -140 84 -29 -81 187 54 69 -23 23 -335 -41 -139 -85
7039 -85 -199 -29 108 -122 81 150 -23 -191 -158 -5 42 -221 228 -2 -89 267 -11 207 -93 188 -205 10
7061 10 308 -444 -65 -24 82 90 63 48 321 56 -142 149 88 -93 136 132 124 136 -14 -191 52 100 -162 169
7085 169 46 -19 -23 -45 -53 118 -145 329 -23 -315 104 130 -113 -144 160 -263 -146 -181 279 6 124 24 -296
7108 -296 56 -21 40 -170 -155 -6 -230 -65 -139 255 207 82 210 -90 56 -78 -335 98 -118 -11 -148 -58
7130 -58 -25 -168 114 -121 -49 -145 -285 -210 -142 46 109 104 -207 144 184 -182 -50 -159 87 -140 82 88 -62 326
7154 326 73 -203 71 -116 84 -104 -201 19 39 -142 44 -5 80 203 168 -95 116 -358 -122 332 103 -140
7176 -140 -227 -59 37 121 27 226 303 -183 11 0 293 -113 116 42 176 30 27 -119 -18 212 -177 159 37
7199 37 24 152 17 -179 70 195 -48 -95 115 -166 -48 -161 127 -133 -110 -66 214 -213 19 -135 -37 -68
7221 -68 37 51 -44 -151 -113 -36 -61 -10 133 55 196 16 268 -87 -95 272 61 15 14 82 -56 357 146 168 -132
7246 -132 137 -171 -79 298 47 325 79 -26 203 152 -71 -80 237 182 -75 83 211 111 279 -107 -284 -189
7268 -189 36 168 6 -37 -260 -153 55 88 -48 18 132 14 -23 -235 -248 -104 -59 -70 -60 55 191 -127 30
7291 30 -178 -33 193 -196 -15 -134 7 -24 54 -35 77 37 22 -89 87 71 211 -157 97 -37 -130 47 212
7314 212 -137 -41 39 50 11 -256 163 -60 33 -129 108 -242 63 -232 38 -53 142 82 179 -137 -13 107 142
7337 142 -46 -123 146 232 -234 -90 -37 -210 328 38 -49 3 -134 -216 -22 -6 39 31 43 -36 -77 328 174 4
7361 4 40 13 -26 50 -14 222 -177 -221 337 -3 -79 -236 188 -67 -100 -50 62 100 140 -246 178 78 18 208 -3
7386 -3 -74 -149 87 -47 28 -135 41 329 157 113 119 54 -136 289 -59 -99 165 -99 -60 -158 -101 85 -240 -206 218
7411 218 -67 20 16 130 -163 -92 181 -50 -330 142 -123 22 224 -106 93 -10 162 62 67 33 -78 10 -103
7434 -103 165 -90 -84 -219 126 -142 134 -67 -199 272 49 -109 38 86 -147 124 -53 2 79 -41 275 -25
7456 -25 -143 148 154 55 -111 48 71 140 76 79 67 116 33 231 88 49 189 11 339 -48 -263 -7 39 -25 171
7481 171 141 87 174 -95 15 61 151 -180 84 81 -86 -10 -91 -194 38 -85 -154 26 6 196 -125 -131 51 -1 -100
7506 -100 20 6 32 -67 31 -125 85 -110 -15 196 -150 -108 -203 41 251 28 -96 -58 -174 125 39 54 -61
7529 -61 92 -234 -84 -491 32 -35 -179 150 -230 -50 202 71 103 -2 -43 -221 -23 101 262 72 -33
7550 -33 68 -152 -28 -73 -177 184 -59 -26 163 -81 -227 -1 -134 -255 -134 -124 -187 -168 -23 181 95 -152
7572 -152 -237 330 -94 99 317 -455 38 102 311 -52 116 65 -99 -72 -170 -40 -130 -93 -127 36 -72 -229 176
7595 176 -169 180 -56 201 114 106 -99 -172 -99 -118 115 -166 50 -174 43 -151 -27 340 -51 154 66 -112
7617 -112 231 -112 74 -89 20 -318 32 54 66 -120 -28 -136 181 -38 69 256 -209 237 230 -145 -132 21
7639 21 44 -47 13 -85 -55 122 -86 -40 163 36 161 -8 115 -123 146 -63 -1 -194 -117 -203 -190 163 28 -178
7663 -178 -57 9 -51 52 164 -64 -116 185 66 -206 89 18 -136 77 7 -28 -44 -119 -169 25 -136 191 -147
7686 -147 172 -190 -62 -383 -50 98 -129 -26 -125 -257 -177 -30 -3 -79 -71 -24 29 -76 -12 -133 -163 318 -138
7709 -138 278 -124 -122 127 280 -24 -79 197 92 129 82 -19 -56 25 -47 -83 334 -79 -329 258 -123 187 -308
7732 -308 106 231 -128 60 39 -138 -207 -30 -82 -240 -10 -59 142 14 21 23 -56 0 -24 89 165 156 91 -173 -101
7757 -101 -186 0 38 -239 12 74 130 40 11 113 -169 319 -25 -56 -101 177 -19 222 -73 138 178 -10 -271
7780 -271 -363 -220 317 -192 29 -251 148 182 84 66 165 59 -186 -26 217 -87 6 115 -203 142 -61 -197
7802 -197 -232 60 114 -85 -140 -131 270 73 12 121 -82 226 28 -58 91 -9 -316 66 41 -96 53 60 -124
7825 -124 -52 63 37 209 -198 83 43 -14 152 44 1 69 130 76 -41 115 20 -38 -203 -67 109 9 35 -144
7849 -144 -278 79 127 -174 -141 25 17 209 -3 -46 126 42 -111 -59 -86 -72 -50 132 -148 145 -13 -105 44 -66
7873 -66 17 -1 -195 176 -90 -214 -173 23 -167 125 12 -34 165 234 272 91 172 11 -9 244 -90 166 -43
7896 -43 -76 91 297 -126 -65 68 -179 179 -38 181 187 153 93 176 84 -10 62 260 -63 98 -67 -78 9 24 31
7921 31 70 78 353 -36 18 -393 -24 74 22 -130 15 88 102 50 -192 -373 -48 95 49 132 -121 208 88 -278
7945 -278 9 -80 312 227 -28 121 222 51 -46 276 -41 120 -62 224 184 76 4 59 -79 -74 209 42 73
7968 73 231 248 107 93 326 73 111 33 -111 210 -84 -24 65 3 -34 151 -109 18 229 -8 -55 -142 -224 40
7992 40 -116 -77 236 -15 -66 76 -4 -43 -29 -204 89 37 254 -66 7 31 74 -78 -138 -158 188 12 -68 -119 7
8017 7 7 -114 -51 -192 98 -64 63 223 -180 16 151 47 67 -20 259 204 294 342 -13 -42 24 -71 111 -67
8041 -67 -171 -220 505 -2 -73 138 39 47 0 -93 16 -142 122 -150 -135 99 94 -164 -46 91 -34 16 268 -46
8065 -46 131 -131 -7 165 -74 -157 212 -67 311 -150 100 -115 -190 -20 17 230 85 -300 -132 -272 -43
8086 -43 107 -106 163 -125 -53 -195 -230 -206 56 -353 109 40 284 -58 -55 173 -266 360 -21 104 121 -9 -55
8109 -55 -535 -260 121 -99 269 -231 -17 142 145 107 179 -38 -152 -210 -12 175 270 -61 -222 166 -16 167
8131 167 -53 39 -182 -157 46 -138 168 70 -80 -9 -94 50 123 -51 195 327 197 -48 79 -202 12 -95
8153 -95 -66 4 -53 74 -82 19 -140 139 -171 -203 -199 -181 -131 103 -404 -217 -141 -214 103 4 149 155 51 -21 103
8178 103 109 212 -90 102 42 -52 -53 -61 -262 -56 -345 224 -65
8191f5
$$ Imaginary data points
##PAGE= N=2
##DATA TABLE= (X++(I..I)), XYDATA
0 0 0 0 0 0 0 0 0 0 0 0 0 0 8 -8 8 -8 8 -16 16 -24 24 -32 37 -40 48 -56 68 -80 89 -104 120 -136 153 -174
34 -174 196 -221 250 -279 312 -348 387 -432 476 -528 585 -646 713 -787 867 -956 1052 -1159
52 -1159 1277 -1408 1555 -1724 1913 -2130 2383 -2680 3039 -3475 4025 -4743 5722 -7139 9390
67 9390 -13532 23733 -108555 -87451 48236 -85100 -43147 41861 14885 -7710 67176 49312
79 49312 21743 57714 49281 -26581 6377 44737 -11156 -15481 39135 -15348 -54443 -6193 -6449
92 -6449 -45287 -26814 -14484 -21869 -13941 -3314 4721 31328 40015 8880 5070 46532 39293 -1684
106 -1684 -736 -4447 -26745 -14763 -17168 -35703 -10525 1778 -24919 -14027 17680 12208 3605
119 3605 22631 22202 -7204 -2403 22304 7786 -2876 13006 1399 -13416 164 -3076 -12737
132 -12737 -4750 -10219 -25467 -18170 -529 2366 -4411 4430 17235 11016 11028 20647 14807 7666 6832
147 6832 -3450 -9862 -8351 -6650 -5856 -11643 -12956 -6471 -7754 -3493 8575 4326 -1523 3811 3696
162 3696 2520 6346 9129 6475 -286 500 3897 -912 -307 2983 -5927 -8238 -3911 -8148 -6730 -289
178 -289 -776 -741 985 3752 7112 6893 7830 5897 -782 -1585 -586 -3956 -3238 -4350 -7118 -3934 -2923
195 -2923 -2116 3583 2463 303 3608 2539 1380 3322 3826 2284 539 61 491 -1768 -269 1519
211 1519 -3906 -5134 -1906 -4653 -4347 743 -849 -2206 1191 3105 3951 4864 5863 4901 1041 1706 2146
228 2146 -2133 -2023 -1316 -5702 -5026 -2968 -3644 -1992 -50 149 579 443 1820 3646 2555 2641 2501 134
246 134 1166 1946 564 1044 -274 -2683 -2269 -2814 -2772 -1271 -2715 -2440 -870 -727 1133 2859 3013 3470
264 3470 2759 1639 2513 1371 493 -34 -2328 -2589 -2434 -2992 -1619 -1005 -1779 -1169 -424 314 1473 1430 1327
283 1327 1941 897 1317 2274 1277 1486 659 -608 -489 -1289 -1780 -1372 -2167 -2381 -1921 -2215 -623 529 540
302 540 1383 1671 1725 1984 2148 1946 1567 42 -631 -833 -1358 -797 -814 -1999 -1390 -907 -1188 31 265 358
322 358 716 173 605 1422 864 1383 1428 197 691 279 -333 69 -341 -1301 -1334 -1822 -1543 -601 -722 -100 483
343 483 -108 902 1385 1047 1607 884 -105 263 -351 -154 -103 -1016 -816 -688 -1170 -232 -265 -351 -225 -322 -77
364 -77 163 241 541 773 303 507 635 125 551 286 -562 -427 -757 -773 -455 -512 -605 -402 -221 358 436 390 820
387 820 479 224 409 18 220 303 -177 -454 -127 -578 -30 176 -132 -31 -581 -457 295 172 38 412 -26
408 -26 -24 493 303 556 419 283 -86 -257 -318 90 -258 -582 -161 -506 -232 -93 202 457 342 152 342 253
430 253 -6 405 297 -213 74 -229 -306 -183 106 -293 -70 -62 -102 -27 -210 488 -124 -14 432 31 157 511
452 511 217 -134 -143 40 182 -189 -247 -247 -454 -362 -408 -278 103 207 68 -66 38 62 304 431 125 -55 -215
475 -215 -178 141 149 105 40 -48 -45 19 -435 42 -185 11 -1 266 105 345 249 328 178 -302 -20 87 -110 42
499 42 -119 -341 -46 -411 16 178 250 38 71 120 163 328 41 -97 -101 70 -173 -170 -43 35 -221 -183 86 -226
523 -226 137 171 -369 141 -142 152 65 152 266 373 257 136 336 -90 31 -125 -231 -338 -189 78 187
544 187 -104 54 70 -35 102 253 -171 -42 41 130 -29 48 -180 -102 -60 -51 -155 -59 38 -161 -80 46 76 -122
568 -122 306 209 -94 130 95 64 400 -223 88 -161 -228 178 -199 -470 81 -52 193 235 2 56 226 -75
590 -75 -35 -26 226 -127 -72 -25 128 81 245 92 41 -133 96 -234 179 91 -78 -43 -172 85 -47 -16 45 51 185
615 185 20 35 53 -99 43 9 -86 28 -170 48 -65 -23 259 -73 -457 98 -161 24 -48 -37 -67 56 -244
638 -244 28 89 150 -147 -317 -35 -13 -142 60 66 -4 141 -63 145 232 -35 -109 -374 -24 -35 83 237 8
661 8 -224 23 158 -20 -339 136 -55 -57 -101 -169 -73 -30 -108 112 -34 -92 -9 20 -19 -190 288 132 188 34 -68
686 -68 113 -53 -142 -39 94 121 -54 22 302 38 -53 81 -74 108 68 17 -42 -104 -56 4 165 281 117 -223
710 -223 0 -90 -18 51 48 7 -97 241 101 -28 20 42 200 -66 166 215 67 334 -30 -94 -64 -131 80 -197
734 -197 -132 -48 20 -12 225 13 153 155 -71 -64 -96 -12 -73 4 31 34 -83 203 -142 2 183 -39 159 -83 -30 62
760 62 -74 24 165 -33 48 -46 100 -185 -127 -161 175 11 98 26 -81 204 -119 -29 -175 135 43 129 98 -239
784 -239 -97 -139 39 28 -24 -88 62 -221 172 -51 27 218 3 204 -95 174 44 -58 65 -90 -16 257
806 257 126 -73 -211 90 -86 -197 -105 -52 -91 -20 -113 100 142 -54 17 59 75 136 -101 195 -30 49 57 -183 209
831 209 -301 20 -156 -83 -63 20 96 40 -43 109 168 173 1 24 -80 -140 115 -158 171 -112 46 33 255 -244
855 -244 42 23 -221 -74 -98 -59 -248 -107 -74 127 -93 7 247 88 -71 -77 81 -139 75 90 -15 35 -3
878 -3 -317 -16 5 334 -70 54 180 -13 -27 132 -111 -126 -96 15 -7 -28 62 -133 41 53 -207 -63 193 65
902 65 -176 103 -86 35 49 72 -218 -162 -9 -253 30 135 9 -244 -7 -39 21 -245 -56 -425 54 120 34
925 34 132 26 11 -12 49 58 18 -148 6 253 6 -167 -3 195 68 -285 263 62 -13 259 211 -257 -302 -69
949 -69 265 244 33 -113 193 44 314 218 -144 455 -175 -83 -42 -35 -199 -14 86 114 -31 177 470 -88 128
972 128 71 194 13 292 125 302 -4 28 -214 149 -77 125 -18 132 207 46 -101 -50 14 -18 -198 49
994 49 -71 205 181 28 121 145 246 -163 127 -50 -22 38 59 252 -210 9 390 -281 65 23 71 24 -46 0
1018 0 262 -79 123 -177 -67 62 -200 -92 208 63 84 243 -66 -112 55 53 20 378 -27 112 117 109 159 347
1042 347 -193 -310 142 321 97 212 -97 14 84 -279 -117 163 -210 -44 122 25 156 236 64 103 -192
1063 -192 -36 164 4 -17 -37 -139 -280 -38 -40 123 193 161 171 130 50 36 119 115 266 56 -56 -194 16 20 35
1088 35 -100 -363 -316 117 -27 -368 119 313 278 -7 -254 -272 -100 -128 -205 -92 317 189 -134 210 -126 10
1110 10 -54 166 0 3 44 -114 203 -255 104 -43 35 -122 -249 44 -134 -94 -146 348 8 21 -40 37 95 8
1134 8 -28 24 132 -19 -217 -56 136 -179 132 -112 -198 166 -18 2 -52 -155 -151 -12 -125 36 145 -5 155
1157 155 286 70 -27 15 -108 -178 -4 -100 175 115 21 174 -5 -4 -75 26 -44 141 207 -93 61 -40 -29 -32 -19
1182 -19 199 95 -7 52 -48 125 142 -246 -24 -127 -9 -34 -128 4 -82 41 -21 -45 -95 -91 -51 231 8 -11
1206 -11 -135 -8 5 51 150 168 -119 -143 257 98 303 234 143 180 99 -192 -86 -100 -37 135 133 -113 -141 -33 135
1231 135 -171 -302 46 22 -41 -98 201 184 178 7 243 193 74 -93 122 56 -2 -69 -108 -13 125 -27 -4 105
1255 105 254 -101 13 124 -103 -45 69 -99 -174 -139 158 -168 -216 187 -79 232 -108 95 41 -30 115 15
1277 15 -66 81 -84 -31 -301 -136 -104 26 -63 64 76 -72 -77 141 21 27 -399 -41 -90 172 76 -113 127 -88
1301 -88 -186 85 128 -26 -292 29 -235 -71 -211 -69 -61 65 43 -152 -40 -272 39 27 91 -79 -189 -39 -93
1324 -93 2 11 -107 183 -25 62 10 175 -36 144 -141 -34 -136 400 135 -7 -49 -30 -22 29 97 -153 28 83
1348 83 91 24 133 -76 -9 105 -2 -161 49 39 -41 322 170 -178 -46 284 92 -87 -31 75 11 324 -41
1371 -41 -96 -278 -123 103 306 -55 -161 25 22 83 -384 -39 -29 -149 -60 -128 102 -36 -65 -6 298 79 -91
1394 -91 54 -34 -19 -18 63 83 -36 -25 55 -314 65 72 181 107 56 143 -109 162 24 -20 187 160 -29 127 183 311
1420 311 195 17 202 -143 61 -94 148 -191 176 -184 -65 101 -159 26 133 -125 -28 -135 -5 40 -31
1441 -31 -34 -16 -164 -1 -13 121 -43 167 -170 6 80 -137 -49 -85 4 51 70 -192 -3 49 -97 -117 -174 -50 325
1466 325 -17 -11 -151 102 -181 -29 125 21 157 29 175 181 -148 -105 -175 59 -149 209 277 -177 48 -139
1488 -139 21 -101 -198 215 -38 11 355 53 155 -183 -129 136 -129 51 252 83 127 -2 198 -6 127
1509 127 -43 -190 114 -257 53 16 25 -18 -142 -68 43 -25 130 107 -100 151 168 -51 14 16 145 16 -23 -205
1533 -205 43 302 -72 86 -237 32 -15 -136 192 -181 21 26 3 -88 196 -182 26 76 232 176 -82 -295
1555 -295 205 18 41 -36 -64 -5 -142 347 -34 -500 -180 -245 38 219 -106 -239 216 -176 -201 -112 38 15 -105
1578 -105 -7 143 11 156 170 154 83 -166 45 -186 -135 152 -128 -87 104 -355 -216 -66 46 -63 33 180
1600 180 27 -149 -175 71 81 -143 -249 -233 -48 -61 -121 -35 -169 -16 5 -65 -370 -84 -50 -181 161 186 -179
1623 -179 -69 53 -43 221 53 -52 165 266 247 32 -184 -17 -2 29 -175 -85 79 -33 265 163 -118 -67
1645 -67 -31 -113 -139 -93 -139 62 126 -11 20 183 21 280 -201 -30 54 -129 -82 -4 192 -10 77 -122 24 262
1669 262 110 124 -1 152 -1 127 44 -42 24 43 47 80 -46 77 85 5 -12 148 199 -60 12 -59 142 17 53
1694 53 -123 -54 125 142 5 3 42 51 114 -215 -110 -20 -244 -86 42 -11 -179 -87 -82 -43 -49 91 110 -113 -46 86
1720 86 150 -58 -115 247 33 -282 -90 105 -100 3 0 52 -280 166 22 99 -12 -42 -32 107 -67 -108 41
1743 41 14 130 -97 -47 -225 -106 -183 -111 186 -49 110 -103 -55 -109 -14 -158 -381 168 -221 -86 20 -252 -47
1766 -47 -74 -122 -81 -68 60 -158 -76 -159 104 16 151 14 49 -323 56 146 155 -51 25 33 165 83 -94 -38 11 -150
1792 -150 -156 140 312 -61 81 -243 -273 40 318 88 108 -169 12 -204 81 -25 63 125 61 36 321 -51 57
1815 57 82 -186 3 -7 -84 85 55 249 41 -5 -242 45 74 77 -262 34 126 -20 -116 -27 -13 50 121 130 264 -332
1841 -332 40 -78 -11 50 -198 -82 -46 133 -23 -232 48 167 -118 -14 38 -231 50 -109 -184 -52 79 -50
1863 -50 194 -73 116 -76 -172 -82 78 -453 142 -158 -50 -141 41 -107 50 -42 -102 325 -70 453 -129 66
1885 66 -315 -417 -19 -47 -52 254 9 27 128 169 -203 355 -259 -19 122 -72 87 -53 77 -282 -21 -194
1907 -194 144 -172 -281 258 47 98 -85 -75 143 -120 -82 -135 -70 -206 -106 -149 103 -19 -234 64 -42 -203
1929 -203 72 349 210 -166 8 -143 -347 -48 -58 6 70 -60 -3 144 -39 70 -177 70 -157 -25 357
1950 357 -68 278 -38 25 53 124 5 74 84 -157 83 -21 -11 -1 191 -37 -72 127 -253 120 63 63 -97 -130
1974 -130 169 -191 -148 243 129 -26 241 -4 -126 118 -11 -15 18 -397 224 -20 -197 1 -23 -19 183 -72
1996 -72 55 59 16 147 188 50 -198 61 -351 -107 8 -48 -127 297 20 -64 -169 -163 224 83 146 91 57 121 121
2021 121 -68 97 -83 -144 54 122 89 -289 134 -11 -285 41 -33 88 -296 3 55 51 -131 -123 149 -179 -220
2044 -220 208 43 93 -5 130 138 112 -341 13 103 245 149 39 51 -82 302 -4 81 -119 247 75 2 58 -151
2068 -151 -181 156 -90 2 40 95 -59 79 283 -237 205 -139 74 25 179 318 -128 -110 90 -108 102 28
2090 28 21 46 -185 -165 -117 171 102 75 -86 -114 -99 121 86 127 2 107 -19 16 -202 123 140 -104 -177 -65 16
2115 16 -6 149 219 -30 -120 240 33 -147 67 224 46 -146 150 -220 -129 -44 -169 -137 -110 69 -60 91 135
2138 135 12 48 -341 -21 21 -27 -12 -315 21 47 -133 52 11 -212 -138 -1 -9 -88 -308 -121 -13 166 169 22
2162 22 145 -36 -5 -470 22 50 20 57 224 144 294 144 8 -240 -162 31 -268 -168 122 285 53 123 55
2185 55 -2 130 11 -83 -95 -45 -100 -128 103 129 -40 69 135 -479 -135 148 -30 -191 -55 113 114 -42 -18 -163
2209 -163 94 -179 -28 72 -85 -90 -142 198 39 -38 -123 -42 -249 -15 97 38 -31 87 58 -28 38 58 -199 104
2233 104 -172 159 -231 -336 83 170 -203 75 -39 -61 108 253 255 84 -242 128 197 185 -105 -320 206 -146
2255 -146 203 29 487 138 -79 -29 415 -226 152 100 64 147 59 241 -267 0 112 -280 -34 160 104 -253
2277 -253 -31 108 -181 16 -119 195 146 -41 -99 77 -122 -235 -173 85 78 -18 219 -46 -93 39 -238 23
2299 23 25 -35 29 -310 20 101 -35 215 5 287 40 -21 -97 -127 313 -8 111 -43 8 60 -120 -33 3 -105
2323 -105 102 -190 -193 -65 115 7 4 -99 -132 -56 45 185 -109 -108 -83 179 10 -72 -71 98 118 46 49 153 349
2348 349 -21 -19 255 -156 56 -152 -187 224 -255 7 86 -15 -63 -9 -100 284 -234 -75 -64 2 -69 163 73 51
2372 51 -40 -91 -166 -85 -434 59 111 98 131 166 -275 136 3 39 24 126 30 80 -275 -48 224 -96 33 -48 99
2397 99 39 -63 78 171 116 -46 -80 -215 -3 166 -165 70 119 -148 -307 142 -85 88 39 -118 36 159
2419 159 -54 -170 130 -84 82 174 116 -61 92 -218 -21 178 17 87 27 -126 70 -34 -89 -192 -119 74
2441 74 85 86 18 -125 -73 -32 -55 1 -172 96 75 -87 -181 -55 -52 -34 61 -215 -110 9 -315 -8 208 -48 2
2466 2 -73 -88 144 -24 262 -36 -110 -42 -16 -74 -92 -113 -110 -146 421 149 76 -167 -25 -255 54 46 -38 242 251 -186
2492 -186 20 32 -255 -141 -22 128 209 -60 26 -245 44 -178 -330 126 -99 107 -110 -368 223 168 59
2513 59 -244 -203 80 -229 233 -107 -153 140 125 143 162 139 189 -115 -69 -25 -174 167 -46 97 -59 -121 -204 1
2537 1 -3 258 135 -80 158 -63 208 250 189 0 13 -227 -87 -37 133 235 -64 104 -73 -106 -224 26 -36
2560 -36 14 -5 8 -19 -84 404 68 -246 68 144 64 -24 -108 -46 -127 79 61 30 -68 222 -113 -107 30 -80 -176 -280
2586 -280 -127 -143 -80 119 120 52 33 85 -49 116 -112 164 -107 -234 194 347 -131 25 -3 4 -155 -47 -54 105
2610 105 -138 -224 -266 191 45 90 207 -169 218 123 -188 -346 262 218 143 177 -53 -171 -7 129 45 -38 26
2633 26 -171 128 142 204 -15 -56 -173 -232 -144 -63 151 152 163 -136 -118 -232 216 9 -215 -42 -218 -78 8 -136
2657 -136 51 -116 73 61 60 -281 29 -236 -41 3 125 -60 117 179 -64 -164 -73 29 57 187 58 28 -96
2680 -96 52 54 28 -200 -63 81 -13 10 -110 -134 231 -165 -90 88 20 -113 77 33 -74 -109 142 -51 -398 -137
2704 -137 -92 -49 -10 -230 215 114 -18 118 218 -104 -174 253 64 73 -111 -36 -146 249 215 32 -95 129 -63
2727 -63 -36 -72 -41 165 -52 -268 127 -151 70 128 170 134 -100 92 143 -102 7 -59 5 107 12 60 23 86 -62
2752 -62 -129 131 -199 70 -43 -129 -132 -305 126 -124 -199 -19 -129 87 -62 -144 -268 -61 -58 -85 -82 -110 99 14 -83
2777 -83 33 106 76 -18 20 5 -55 268 122 -93 277 127 -98 262 111 -88 90 -44 -179 -134 -22 -141 -246
2800 -246 -231 169 92 -88 -42 112 123 -203 56 20 115 104 91 -80 -220 -174 217 147 -140 89 102 -48 -131 90
2824 90 -60 37 -209 39 148 -1 -229 130 105 -178 -43 -10 -57 -13 20 22 167 -175 13 -189 238 -220 -43
2847 -43 -332 51 28 70 -42 279 -133 104 101 36 81 -401 42 -81 -144 -238 -72 -28 -227 -9 95 -14 -215
2870 -215 -36 243 9 151 44 187 -148 191 -60 -392 64 11 23 217 90 83 -182 -127 -104 -28 -54 193 26
2893 26 -95 -63 202 -320 80 157 313 33 -205 -60 -32 -80 289 248 76 -28 37 -274 329 -65 -144 64 -101
2916 -101 195 -138 125 52 13 -28 296 -48 -18 -138 58 -135 -131 70 -13 -188 -233 -113 -17 24 109 -116 -171 101
2940 101 -195 -253 264 383 -33 -173 -69 -44 -100 370 56 -103 -110 38 -73 118 188 -113 -147 -200 47 -49 193
2963 193 -228 57 70 -47 -63 -315 208 -3 205 -168 -137 -21 -192 14 -119 171 79 177 251 -259 48 -79
2985 -79 136 -11 126 -33 309 27 162 77 -204 59 404 -288 41 315 72 -347 192 -125 -136 -109 32
3006 32 28 -230 35 -242 -34 169 -300 -197 -236 -232 60 1 -57 173 84 -186 39 -66 127 88 -16 -15 -50 71
3030 71 -25 -252 -15 46 -44 108 -147 -54 -19 -71 -179 -182 -82 75 -98 -139 188 -71 -127 -106 26 -431 81 147
3054 147 -67 239 271 -239 209 146 94 194 -83 154 -62 34 143 -70 -30 147 100 20 -183 161 -148 110
3076 110 216 -81 159 106 -44 123 92 157 82 16 156 36 87 -129 -42 14 66 2 -114 -119 -30 -38 72 -80 -80 313
3102 313 -88 61 -180 -95 26 -171 253 129 99 159 -94 -108 38 130 -44 -60 152 -209 -23 -235 -264 99
3124 99 249 112 -331 12 -102 134 -73 -199 -101 133 -89 86 57 211 61 137 -57 65 114 82 71 -127
3146 -127 88 221 -154 -303 -64 -52 -54 -70 -97 -96 -253 -134 -98 -119 -249 -36 -49 13 225 -173 -215 -156 127 44 -61
3171 -61 -23 -18 169 -87 -17 -92 109 -207 -178 -84 -26 -46 17 -198 76 314 -17 -97 112 64 -187 -105 320 -191 20
3196 20 -68 2 -22 284 74 210 -180 -59 -212 -92 153 -54 -113 -8 95 -159 -191 -119 -211 139 -206 -71 90
3219 90 -173 45 86 141 13 115 44 157 94 249 167 59 184 -312 -29 88 272 188 130 30 -203 -32 -231
3242 -231 -33 -136 -209 4 46 -21 9 14 40 -337 101 -8 49 88 -43 272 -110 5 -158 -58 25 -85 3 -124
3266 -124 -58 93 -45 73 51 -2 285 -36 -136 195 58 -106 -172 81 -22 29 71 117 15 53 58 -166 143
3289 143 -161 48 -50 -36 -59 203 243 -165 148 -293 -118 60 51 61 166 -197 51 105 82 -57 -95 83 -80
3312 -80 6 -141 91 119 -4 146 55 -98 319 242 30 -290 -58 82 20 -6 82 18 -140 1 -282 -42 42
3335 42 -146 159 -24 -72 33 259 73 -26 -43 67 66 -21 -259 -138 71 356 296 -89 86 -87 -49 91 45
3358 45 83 185 -58 60 -108 233 -350 254 -237 6 23 224 98 90 -344 -214 33 2 -27 -239 -10 -146
3380 -146 73 -181 -132 -39 -147 28 86 -149 99 45 74 -39 -18 -120 -37 -204 121 -353 28 -11 153 -87 21
3403 21 60 36 73 107 64 202 -282 -200 41 93 -139 -79 102 -129 315 49 76 -35 28 -222 237 -48 198 -104
3427 -104 111 63 -165 152 -166 -94 18 119 14 -73 -373 208 -160 22 -155 404 0 62 33 -6 -45 -271
3449 -271 -10 -99 -75 10 78 -271 96 -88 90 6 114 17 -237 -90 279 37 401 30 3 58 -8 48 -160
3472 -160 -132 -46 161 89 8 63 -52 21 102 235 51 -9 58 105 -100 167 97 7 67 122 6 88 0 259 7
3497 7 -22 115 -266 -288 -262 69 198 138 -28 274 -118 40 -34 -69 14 -22 176 -18 206 -137 59 1 -165 -101
3521 -101 33 -78 133 76 43 -8 -277 -146 36 -132 159 -33 11 205 -55 75 -78 -117 -291 -35 -6 -26
3543 -26 22 -247 -50 -145 292 -6 -65 -119 138 74 8 59 -156 -185 2 66 -123 -274 -87 179 93 232 -95 -102
3567 -102 -92 200 71 24 224 8 207 95 41 -171 -1 73 119 -328 -108 299 30 -39 -14 -25 -90 -3 56 -25
3591 -25 74 75 149 29 -60 54 118 -177 -89 -160 -10 -114 59 0 -97 40 180 202 95 62 111 -221 -106 112 -89
3616 -89 -142 141 64 172 -108 9 -49 -76 -174 141 144 -23 150 -157 71 -111 91 -137 25 -81 -31 87 42
3639 42 118 -119 -185 -88 -121 68 -49 -215 -105 40 208 -39 160 -24 298 -180 -309 39 -50 49 191 -72
3661 -72 -42 81 -57 -106 68 -163 146 145 -142 -38 17 -45 -16 -144 -149 -79 -35 61 -251 -40 75 189 85 -111
3685 -111 83 -58 15 -33 111 -73 -110 56 159 -55 -113 20 160 186 -40 160 -263 245 188 -7 139 -141
3707 -141 -205 33 78 67 -258 -52 -144 47 59 11 -27 139 41 -9 -19 -188 -291 1 110 -7 -71 70 -90 37
3731 37 -170 -147 73 -286 4 98 52 -91 136 22 16 -170 -282 -204 29 -27 151 -277 -121 -160 49 -210 -57
3754 -57 -179 28 -81 -160 192 -46 -1 13 66 -13 167 -61 -30 -144 -7 -99 -19 40 150 -320 302 -108 58
3777 58 121 107 -168 -140 109 157 18 -123 -91 -53 74 167 -131 -166 193 98 117 8 152 -96 -323 169 205 102
3801 102 -169 -189 245 93 -56 11 -213 245 -32 -14 -41 -17 -136 161 167 23 121 -51 53 142 333 203 -179
3824 -179 -149 279 12 -32 170 129 -49 92 -118 30 -15 -209 -24 32 23 248 9 -85 9 290 133 -208 28
3847 28 -102 -88 183 -13 101 76 35 26 -42 -55 -47 -101 107 23 -53 -7 84 75 -130 -126 -54 73 -15 137 97 -207 -253 320
3875 320 0 94 77 -172 65 8 120 -218 -96 -36 184 -1 -384 228 -112 -89 -28 79 -37 -58 -11 162 -95
3898 -95 -67 15 -28 -47 -30 21 -24 -395 -32 -179 -221 -233 -210 -222 117 -26 23 166 171 -155 -3 -5 -20 -150 -76 -80 -8
3925 -8 -170 -67 114 50 120 1 239 14 93 192 -244 -18 -11 -231 -3 14 259 55 234 206 373 -68 64
3948 64 -93 126 -169 196 -92 357 -134 -92 -175 -124 76 -140 81 -122 -8 -149 151 -153 28 -194 23
3969 23 110 213 43 -7 88 132 20 -171 -140 146 -105 3 -30 -164 245 198 -89 192 128 -227 187 -19 98
3992 98 -26 258 411 -109 72 25 -262 67 -49 -9 52 96 74 113 -49 -55 -294 36 106 29 74 86 -209 36
4016 36 -2 -22 -88 -207 -16 -176 316 -65 116 193 23 77 -112 -108 -194 16 359 322 34 51 73 -25 47 -204 94
4041 94 194 97 165 -130 -125 -118 119 -125 -75 -55 76 149 22 -88 109 138 -143 -197 243 -93 -86 -51 85 216 -63
4066 -63 -147 -25 -176 129 -94 61 -145 43 47 -242 170 -55 -319 46 182 -72 17 48 72 -19 329 196 57
4089 57 178 -293 -6 -155 190 -149 -141 121 93 -151 -247 206 -60 -11 90 -23 -17 159 -245 -9 0 -76 169 189
4113 189 -74 4 -42 103 89 104 -127 79 70 -167 -143 201 157 -151 162 56 61 86 40 -25 -108 5 -140 -81 -86 -198
4139 -198 248 82 -1 -211 -155 -27 181 -143 66 -12 117 -110 230 252 96 -26 84 -275 -160 1 18 -123
4161 -123 -159 -71 -78 -211 100 20 222 -132 -284 -73 -20 -226 71 -106 59 187 9 -147 288 -269 60 123
4183 123 -25 222 -163 416 -169 -201 -58 -102 13 19 50 2 -4 -102 -230 -194 -170 -395 -100 66 76 138 112 102 48
4208 48 97 -206 -257 -30 285 102 -26 -332 -171 170 -80 71 -32 -338 52 38 151 -42 -233 -50 -16 13
4230 13 25 190 84 -71 -42 227 8 185 202 187 59 -267 21 249 -192 -153 -169 144 -61 -128 -277 -125 56
4253 56 166 -323 -6 -248 -64 97 240 -137 -213 -109 26 18 57 69 -95 -17 52 126 -35 189 187 113 -241 -128
4277 -128 271 -233 -101 49 231 -170 160 11 -88 218 210 -119 20 -57 -141 167 -28 130 -57 95 1 -71
4299 -71 -28 -103 -244 25 -317 31 -169 174 -126 -481 -45 -103 321 110 212 171 -20 -4 20 -107 -73 -84 121
4322 121 -279 228 258 83 -67 -141 76 -175 34 177 157 138 161 23 103 -70 -356 -112 -137 -193 17 -29 55
4345 55 -265 233 -115 -95 197 -128 51 231 33 23 -164 3 166 84 -20 -12 -61 -80 32 -56 -19 107 122 -172
4369 -172 95 -168 122 62 -88 181 -175 228 80 -202 -46 -82 -67 81 -41 -81 -53 137 -71 117 -57 -237
4391 -237 132 41 -268 -94 -21 -69 170 24 -98 132 142 223 95 201 -57 223 152 -144 207 43 -70 28
4413 28 -186 128 177 278 165 -75 -111 -171 -6 149 -36 131 58 -104 24 -334 180 -40 -103 -129 217 -133
4435 -133 6 123 -87 -42 212 -45 -18 -26 -43 183 -83 15 -210 181 -28 -112 91 -243 18 -30 43 75 65 -77
4459 -77 -199 75 -8 -84 -71 139 -193 -34 -77 63 -99 -27 123 -189 78 -47 244 71 275 98 48 -51 -52
4482 -52 -11 141 -31 51 110 -396 91 -59 61 144 -238 -193 -200 192 80 -46 -245 -213 -167 -80 35 92 150 155 114
4507 114 84 -16 -119 105 -185 -31 66 -209 61 -102 -43 -150 -283 -4 94 -112 68 220 170 168 167 89 -63
4530 -63 -33 48 102 -21 177 -176 55 -209 -194 59 -198 -308 -65 -92 -75 73 38 -152 58 81 -43 -2 79 137
4554 137 -238 232 -29 -272 89 347 7 431 43 -22 176 3 -33 -46 -124 -36 -279 27 105 -236 30 72
4576 72 72 144 58 -121 25 -92 307 -249 -67 -67 -103 -64 -172 -153 53 -1 -36 -63 122 129 55 73 -45 7 36 162
4602 162 29 214 9 183 -7 120 28 -142 -130 72 -204 -30 74 -134 11 128 21 -37 155 -183 66
4623 66 6 -102 251 -80 9 376 -107 7 -159 237 131 30 -61 18 299 -175 123 96 -92 19 -126 -106
4645 -106 -160 13 39 -69 -105 -123 -118 -42 222 280 -192 -101 150 -133 130 179 -274 -254 -138 -105 26 227 96 -34
4669 -34 79 -15 45 -247 136 226 -138 43 27 52 -245 107 89 114 216 -184 -69 -96 158 -57 -251 93 -182
4692 -182 -295 128 110 -47 26 -130 10 70 177 -181 1 41 -10 233 -95 -50 71 30 88 -248 -206 13 206
4715 206 -51 -179 212 -70 182 -95 221 -115 -59 -26 24 -140 -37 -68 90 -44 133 290 85 -135 119
4736 119 2 185 -21 -131 219 -127 332 34 -10 -31 -106 185 52 -229 15 -21 127 95 -67 29 -188 137
4758 137 62 -156 336 76 25 230 -50 59 74 -12 99 -69 165 112 105 -68 -50 -279 25 -13 131 215 -13
4781 -13 -32 143 149 -162 40 -222 45 -47 -73 -88 -94 -147 -133 230 -182 65 100 -20 273 -142 64 47 327 222
4805 222 -115 165 21 137 -263 -238 -38 131 -109 -250 -116 -321 127 58 20 244 -71 -33 -23 -67 -79 -400
4827 -400 165 17 98 315 -176 -65 -53 1 81 -57 25 240 282 -56 -162 -52 198 132 7 -220 40 95 -3
4850 -3 34 -57 -18 66 -341 -240 -69 -112 168 11 240 -119 60 186 110 -171 247 73 -105 36 -169 77 -443
4873 -443 284 -161 7 18 189 -65 -106 109 -170 -57 -179 -170 -96 77 -10 3 7 -68 -171 -160 -96 -92 83 -148 400
4898 400 102 34 -48 -133 108 108 -306 135 57 154 54 171 36 137 -197 -129 97 -4 54 165 -367 25 -40
4921 -40 110 230 116 -55 -111 -137 -300 74 -229 -177 -202 -27 -85 -54 -44 -47 118 252 38 122 13 83 -68 49
4945 49 94 -41 252 -134 261 192 205 -238 -24 88 -194 -89 41 -85 176 148 161 59 109 213 -224 81
4967 81 -54 -96 27 -220 -224 -18 132 -133 -84 -91 101 -149 -109 -187 221 -64 175 -1 9 55 104 -42 -253 330
4991 330 -39 121 -19 -80 -137 146 43 317 -206 217 -59 31 -125 231 -67 -123 66 2 111 120 -162 71
5013 71 -42 46 10 261 -53 -237 114 145 76 89 88 25 117 64 60 -36 41 -49 57 -225 -31 -34 -62 -47 272 -78 -88
5040 -88 137 5 -159 -191 -29 4 -91 86 -308 -250 -33 102 -6 -220 -68 -3 -280 83 19 108 18 -57 27 -37
5064 -37 26 -256 -35 23 -14 -70 165 170 -4 167 139 264 204 -110 -47 52 145 -63 -279 29 160 -20 -72 29
5088 29 -169 45 -123 133 126 -71 -28 -117 -64 -55 164 -131 40 210 -117 -88 -2 156 -35 -5 -10 196 98 61 27
5113 27 128 -15 69 284 94 -73 -51 219 -137 224 162 -4 147 -28 -76 201 258 -56 -131 12 229 -23
5135 -23 189 -146 -18 -21 -258 -145 271 47 -46 -228 -88 -58 -4 29 55 160 35 24 -1 -152 99 48 -189 284
5159 284 -439 18 108 -134 27 21 58 174 141 338 -186 67 3 191 141 75 21 167 -356 -256 -79 294 198
5182 198 -84 -23 -67 -321 -126 61 -149 -11 73 -210 109 223 10 -95 110 -76 168 100 -156 -171 -114 -11
5204 -11 -12 448 -37 199 65 102 -17 155 60 209 -96 -139 178 -74 8 -84 -105 7 146 287 -177 92 -59
5227 -59 221 -128 -128 -96 68 -60 -94 137 -131 130 148 170 263 -207 172 -102 147 -68 -9 81 12 -69 -192 -204
5251 -204 110 85 -86 226 -26 124 259 -16 -253 268 -29 -190 -196 -116 -104 284 -118 3 17 -192 41 129
5273 129 41 -85 -128 -113 45 -60 40 -1 -75 63 -37 47 173 -61 -458 -24 -100 -83 164 -153 128 -119 144
5296 144 131 40 -215 269 -62 26 19 135 380 33 -102 -326 -87 -302 -263 233 165 44 -20 139 -10 233 363
5319 363 -164 -213 213 137 -169 -18 -22 -194 176 -17 -47 26 -34 202 -48 62 163 119 60 -45 -136 -237 -57
5342 -57 -86 128 -135 -46 -176 85 -119 -101 -130 -127 -159 65 52 -31 170 -46 -2 -244 -120 -72 -485 164 306 11
5366 11 52 236 135 10 -219 -94 -2 54 26 -99 42 92 -9 20 -49 -64 0 491 92 -170 16 -103 109
5389 109 199 196 -208 -32 -16 46 -111 -80 45 -90 -129 74 -21 83 66 -128 45 191 85 155 118 74 -71 -206
5413 -206 -180 19 0 53 200 -56 350 54 -125 18 -165 -48 47 -117 79 20 108 92 105 -131 -60 -49 -107 -142
5437 -142 -118 90 194 74 85 15 -65 -123 -315 -47 134 -63 69 -42 98 91 -161 140 -138 -124 -177 275 84
5460 84 99 -264 29 7 -86 34 87 28 -4 178 3 -39 -81 129 -295 -83 -24 -59 225 -123 78 92 26 23 222
5485 222 -334 -24 -121 -158 -16 122 322 -60 134 112 33 223 -1 101 -13 -235 186 18 -11 -197 -63 -100
5507 -100 -106 8 194 46 -67 122 169 -253 -94 108 300 -96 160 -324 -51 -146 -52 177 -30 375 -162 -158
5529 -158 102 -76 49 -133 -93 27 101 13 -9 70 141 -162 13 -180 -243 216 61 -156 -80 0 -88 79 285
5552 285 236 -60 116 78 -71 -168 22 -77 -111 56 -69 -18 108 95 144 -261 -47 -39 -63 -76 105 -76 -82 133 335
5577 335 267 -40 -293 -69 29 -2 178 -34 -121 85 -219 -110 110 -198 28 -45 -67 -68 42 94 99 -40 258 -194
5601 -194 143 13 -284 -27 -268 16 -328 -96 -221 121 1 122 -214 -87 140 7 49 -24 -62 -78 -228
5622 -228 89 -83 -61 207 -65 -38 150 149 -82 377 52 -134 65 45 -109 74 155 117 9 -28 -120 -85 -218
5645 -218 -220 -24 -113 -142 -225 -67 -204 -94 17 77 273 82 -217 -175 213 83 -186 30 391 -144 -22 -23 -211
5668 -211 173 176 11 37 202 -82 102 -52 59 184 -119 31 97 -27 16 242 -58 -44 124 -229 -104 -113 -100
5691 -100 56 -74 42 -78 -149 -29 114 4 205 54 -286 -133 90 408 165 147 -163 -121 53 92 -1 -128
5713 -128 48 -348 -214 72 -111 54 -63 -65 -115 -301 129 250 -183 268 -52 147 46 113 41 39 11 16 49 77
5737 77 -28 82 -99 -42 23 -135 -29 87 144 -74 -126 -2 -94 48 23 -93 185 -186 78 323 -70 249
5759 249 238 25 174 -87 -36 -65 -98 -159 48 115 215 -226 -377 15 -231 -56 -125 -180 -181 -252 -39 50 -116 132
5783 132 72 -172 32 60 -26 34 -122 52 140 10 -441 -29 -160 -63 118 221 -24 74 49 92 36 345 365 -247
5807 -247 91 -133 40 -75 -207 53 186 83 127 80 51 83 76 86 302 43 -2 -69 -178 156 208 71 80 -42
5831 -42 84 -153 183 -90 -35 130 -109 9 151 80 192 -25 -24 -158 -139 33 -35 121 -168 127 -387 -70
5853 -70 22 -131 -35 -160 -183 132 74 2 17 -67 182 229 -5 -25 -22 111 -24 121 168 80 -82 -42 -106 -192 -19 -58
5879 -58 40 -125 320 -8 122 -216 110 -322 -136 39 81 -104 27 -23 -111 26 11 -136 -67 117 -152 -21
5901 -21 -95 59 14 199 -231 57 49 100 101 114 -255 83 -50 125 -329 -25 79 -58 108 48 -39 76 90 62
5925 62 164 119 -99 -33 64 -14 214 -84 -35 -55 -83 16 -110 33 -95 -65 9 -32 67 -186 251 -228 282 -38
5949 -38 -183 76 -258 -89 166 89 -271 162 -60 47 134 93 209 173 -28 -76 -1 259 104 -31 9 -67 37
5972 37 260 -68 81 -70 132 51 114 -21 -99 -97 -154 -105 42 -217 105 99 -226 18 -163 -141 102 220 69 28
5996 28 -177 58 15 174 69 31 -160 -52 36 19 68 -162 -344 163 90 225 -162 -1 -47 92 163 97 -223
6019 -223 -50 -214 -84 30 -274 -75 328 -271 -174 -195 -24 -61 204 216 -133 1 233 46 -66 -140 -6 85
6041 85 220 186 -38 115 -250 90 -205 106 165 98 93 -528 -100 -14 72 -27 -195 25 -76 -40 274 1 11 -38
6065 -38 -249 54 172 -59 77 112 -107 -100 -51 -26 164 -7 48 305 -54 54 -20 -8 147 14 -91 42 45 -98
6089 -98 -67 486 75 -44 -122 -339 -46 250 54 -47 -12 -33 60 -169 46 -159 67 113 116 -61 35 -233 193
6112 193 96 -2 87 -40 134 -5 37 66 134 44 -88 197 -38 -73 284 -127 108 -129 209 -60 -234 -38 21
6135 21 424 -14 -69 36 229 -85 20 -187 -6 32 13 -203 -141 148 6 91 327 3 52 182 85 -83 249
6158 249 -38 -82 106 192 -46 91 52 4 23 -207 -39 47 27 58 -164 182 -18 278 136 88 16 -12 -167 -133
6182 -133 -267 28 111 42 22 84 79 -123 160 202 -24 -204 40 162 -48 -33 205 179 -45 88 -31 247 -212
6205 -212 -223 198 -22 121 -118 9 -29 -121 33 -42 167 -54 229 -208 -6 -10 18 -86 -88 -22 176 40 124 -85
6229 -85 11 379 11 -94 -97 -10 -12 85 134 121 6 -56 -104 35 59 123 28 -158 207 218 -181 187 -197 231 140 21
6255 21 -36 104 -218 141 -219 -142 -127 299 -16 -269 192 -68 -253 58 45 202 -106 12 95 -125 -59 13 -109
6278 -109 -32 58 -53 -274 166 -200 -145 200 118 -148 17 150 126 128 177 88 170 10 -96 -242 -122 22 214
6301 214 -74 -179 -113 318 280 -423 145 74 -85 -256 7 30 174 154 19 -357 -77 -65 -25 -60 -67 160 438
6324 438 57 185 -111 -192 -35 144 -150 -134 30 -51 156 -32 -145 -116 197 -126 160 73 -109 -136 -176 -195 1
6347 1 11 -284 201 203 248 118 2 73 -52 158 365 -185 -2 -71 -159 79 159 197 -239 -133 -63 -242 71 293
6371 293 187 295 -93 88 -315 251 -74 96 -79 -44 -22 -34 204 146 -8 -123 -57 -90 -64 -10 -1 97 55 32
6395 32 -43 -153 -44 63 -87 81 95 65 33 -253 -470 -81 -96 -196 66 196 1 -111 123 -19 160 17
6417 17 56 -49 139 205 105 122 -16 139 -148 -125 6 -123 -100 -212 99 6 -63 148 -37 272 204 -147 341
6440 341 -16 360 203 -49 -202 -109 28 140 -23 -148 -77 412 -72 -140 -44 -167 -42 -189 -81 -49 -23 209
6462 209 -168 -47 -98 48 73 -253 129 141 -41 -126 -73 -42 171 -14 93 61 61 -10 11 46 97 -189 63 210
6486 210 -97 -7 -316 159 145 114 93 7 118 -19 -209 -41 6 -104 -18 -172 -44 97 -334 58 42 -104 -73
6509 -73 59 59 -58 94 90 55 -34 -91 -122 64 -235 72 -49 27 243 -63 68 -84 -214 -127 170 -64 216 35
6533 35 -117 -207 -257 -7 161 12 -38 43 -69 -31 125 -343 191 -466 52 -68 78 176 128 44 241 160 22
6556 22 -69 -98 -47 -16 197 -96 285 -67 -39 -192 -94 100 33 279 -12 204 5 -196 67 -3 -242 -40 77
6579 77 49 -65 -43 -168 -52 205 72 176 154 -299 -94 214 -12 182 159 16 68 -30 38 -32 86 -117 25
6602 25 -300 -64 169 459 39 46 43 37 -60 78 -64 -92 -125 -111 194 55 24 -73 191 101 265 76 -4 -163 186
6627 186 217 157 -11 -68 26 87 -17 397 -86 211 15 -163 -120 -124 376 -71 -128 30 64 -47 -24 132 31 -151
6651 -151 139 -121 44 71 262 8 184 -43 -100 -46 98 214 53 235 -32 -72 -96 271 243 -315 280 -2
6673 -2 -21 157 61 -48 149 -144 -151 -73 -52 20 -11 95 1 21 96 18 342 -90 -38 9 176 -267 -310 -35 202 -196
6699 -196 152 -179 -266 22 -126 63 37 237 144 333 -43 -87 -66 -139 27 167 70 -32 85 -86 -54 147 -320
6722 -320 -254 101 -17 4 77 235 -90 -22 61 -50 -13 -216 -22 164 -39 115 -11 123 33 94 -20 -1 138
6745 138 -173 137 16 92 166 155 100 -19 -107 -140 106 88 -146 -63 -6 6 223 63 -2 -302 -39 -94 1 -266
6769 -266 101 306 15 56 -142 -124 41 53 6 147 283 -173 -68 -58 -110 405 -24 -204 -6 271 88 -21
6791 -21 288 78 99 -17 -146 29 -232 158 -155 1 152 -65 165 -50 58 -63 -32 76 -12 -375 -71
6812 -71 38 130 -126 -169 -76 291 -82 -234 26 56 -3 144 178 12 -54 45 -126 17 233 -52 122 -81 395
6835 395 -113 425 171 46 -137 -132 18 120 10 -210 -64 5 -104 246 -4 -210 -115 -143 -113 -81 -74 -120 8
6858 8 105 -99 -334 81 105 -56 -11 -139 -81 52 -27 -189 -72 -54 -80 -154 106 -256 -66 -53 -125 292 -69 -16
6882 -16 -28 -7 92 287 24 -276 -189 -102 -41 -145 -125 127 -55 102 135 -133 -73 102 -105 -4 -207 0 89 -58
6906 -58 253 98 193 56 135 58 8 -140 -228 -20 165 -9 -119 138 52 -81 86 -37 260 18 124 -261
6928 -261 -51 -140 -333 -25 79 -74 -252 284 -41 -203 109 -281 -210 35 -260 30 -213 -183 264 -10 55
6949 55 190 37 17 107 77 -203 4 -87 329 -214 201 44 -49 269 -96 74 -188 -173 -180 147 -257 -78 -186
6972 -186 -319 -127 -79 103 191 203 14 307 171 -55 -2 75 12 -6 86 -17 196 -20 14 -89 -10 104 -13
6995 -13 32 -354 -2 -62 83 -66 -114 290 62 -101 -34 54 107 5 256 -41 -56 90 131 -42 -151 -101 -17 -22
7019 -22 -159 -15 -24 -69 213 -26 -69 -89 -46 98 212 -86 20 29 393 55 -69 69 42 268 -82 158 2
7042 2 87 -42 78 0 -50 278 -18 78 -160 -97 -40 1 -58 -28 -247 -67 175 -311 -190 32 -189 48 188 201
7066 201 3 84 -56 168 -20 224 98 -31 383 228 107 -31 -35 360 36 -141 129 135 157 -114 -62 108
7088 108 128 158 202 -86 -215 159 89 72 111 88 -268 -52 0 -165 -62 -123 -97 18 283 74 -207 -38 43 -167
7112 -167 -106 -89 -24 -276 1 -145 -32 -67 -64 172 -1 -21 80 58 10 -6 -112 222 -36 146 251 -189 -46
7135 -46 -71 -295 -148 -233 189 -224 -29 -129 45 -72 -13 -27 -72 151 118 24 336 171 32 -109 -184 -74 84
7158 84 117 10 -42 -198 -8 -248 40 -178 72 -259 33 -184 82 42 -17 111 -40 219 216 -205 -40 247
7180 247 120 -15 -164 3 33 101 -211 334 -110 59 -57 67 -12 -52 -12 58 112 -15 295 334 -116 209 -152
7203 -152 17 184 152 88 -74 -160 190 185 -15 -204 11 71 60 23 -154 -210 3 74 11 -160 -258 -43 144 -205
7227 -205 152 -62 -429 -273 36 185 136 -341 28 -66 -136 83 4 121 256 85 -160 108 -16 -175 -59
7248 -59 12 -31 78 120 -107 220 189 2 55 -27 160 -55 -55 98 -143 -157 283 -138 120 316 -89 -20 226 42
7272 42 165 -116 168 107 -146 -41 -16 -117 170 -39 300 19 55 -31 -126 -131 -186 198 -25 -84 62 -106 91
7295 91 159 86 10 21 -242 73 33 27 93 -121 -317 89 467 -81 -259 -169 -32 116 94 -117 -311 101 76 -95
7319 -95 -202 -156 28 -42 224 -215 -16 -21 -124 -128 105 25 -10 -25 -8 -51 123 150 -205 -83 -39 -100 -79 -81 -43 96
7345 96 -17 45 91 197 311 106 -215 -296 193 2 -274 55 -125 -92 -218 27 -22 -135 -200 -4 69 258 -234
7368 -234 86 93 106 -97 -59 -175 200 135 71 -59 -38 -13 80 56 62 -3 -24 190 -150 -2 28 -7 -222 200 -28
7393 -28 67 102 96 -3 33 115 53 -213 -43 33 190 -98 89 -296 -243 57 313 -143 -46 -220 98 130 -85 -136 -141
7418 -141 219 163 -295 79 -69 171 105 -216 7 -158 -28 -38 119 -159 29 11 -67 -142 -132 111 37 -1 -62
7441 -62 -189 -21 53 -88 -32 35 -86 49 -25 -286 -70 150 232 -247 -75 -4 -150 287 99 34 -162 222 71
7464 71 118 28 157 51 263 122 -15 -38 266 -4 170 27 231 69 -195 17 53 -101 -150 -26 31 -36 -44
7487 -44 113 99 -153 -136 -31 34 136 -47 -201 -164 -77 -176 82 94 132 -73 -139 99 226 67 -146 174 112 -174
7511 -174 32 -2 135 -102 174 -113 -63 -8 -78 123 -131 117 -141 -155 100 -100 -236 -195 -279 -11 -143 -270
7533 -270 -27 179 -227 71 27 -105 3 -79 315 -5 -21 167 -4 -89 230 84 -115 -21 112 57 -257 107
7555 107 38 205 -5 287 145 -130 -159 -174 -95 -101 -130 20 -26 69 121 137 291 -21 88 -143 -7 61 -250 -169
7579 -169 12 55 163 -225 109 113 -392 80 37 13 161 217 -106 270 163 71 258 -128 355 -9 -70 -94 35
7602 35 43 -171 -11 69 92 198 9 -2 39 290 -164 -92 -85 -385 114 102 -298 -78 -228 4 -320 13 -194 89
7626 89 40 -63 39 -145 219 18 -43 150 -222 17 -202 204 -14 140 148 187 -10 218 -49 21 -123 148
7648 148 -59 136 90 -118 7 99 39 -123 -31 -92 26 -147 -232 307 -61 -127 147 -220 -32 -87 111 -158 35
7671 35 -256 141 66 102 -79 -93 -57 -61 57 -23 -133 -215 132 121 4 70 149 107 1 -229 -51 -70 -47 -161 -36
7696 -36 -86 -78 -113 129 -10 -372 100 -64 61 -96 212 -148 79 -121 74 -281 118 161 -124 159 -360 -72
7718 -72 -199 -88 116 81 269 -128 147 -1 23 -328 86 -84 32 3 -2 158 -28 -44 344 -250 119 160 20
7741 20 89 74 -35 -210 -195 -17 -52 -161 -105 44 -226 92 207 -101 97 156 -48 180 -252 -92 120 66 -66
7764 -66 81 92 17 -70 -55 -72 100 -104 -78 -68 48 -246 99 -120 -198 -160 -245 -95 69 226 200 144 -117 -125 -78
7789 -78 108 14 38 -26 54 268 -59 -14 136 -174 -120 75 102 -80 85 -23 57 -65 -94 81 -57 -43 -406 361
7813 361 -106 -171 186 30 -38 -15 -140 95 73 14 108 -223 -47 76 237 -255 45 -164 113 -250 124 161
7835 161 52 12 152 127 -349 338 -42 -92 184 -214 -259 -113 -28 101 -110 -44 96 26 -106 82 46 -95 45
7858 45 -37 21 -118 42 26 -64 193 45 7 -22 -280 46 -17 -305 -17 -111 -98 256 -41 63 180 92 -96 -216
7882 -216 -132 3 -68 189 90 26 -129 -42 58 103 482 73 -84 225 -110 -371 -380 62 -141 125 131 22 -129
7905 -129 188 -111 -288 25 189 -97 0 -82 -2 300 -116 152 -14 -105 126 123 -56 -179 -228 -120 -69 155 134
7928 134 -64 -85 -85 -131 31 -120 7 -23 -166 93 53 47 -81 39 171 65 89 316 69 -145 -54 197 -241
7951 -241 35 94 -146 -223 149 83 40 131 -224 49 -234 -96 103 -72 -11 318 40 82 17 -25 19 -32 209 -81
7975 -81 -82 -129 -107 -242 123 -111 -174 -62 -189 -67 52 -152 -93 146 -148 -77 187 -36 167 15 152 -381 105
7998 105 -210 41 -114 385 -68 -29 -17 207 2 -7 140 214 -216 102 -52 -7 -5 -207 -117 56 24 -190 -348
8021 -348 48 130 -177 19 57 -2 14 -96 151 23 -179 -32 31 42 138 -43 -169 -69 -88 173 24 254 -78
8044 -78 -41 -193 98 -175 -56 -280 73 116 7 134 284 268 229 -59 -15 -78 -1 -231 32 19 125 103 83 -44
8068 -44 8 169 430 -118 -63 -128 281 84 -179 154 74 4 -2 84 -330 -257 10 233 44 -94 -133 129 -24 382
8092 382 14 74 -130 -202 -222 143 -43 30 -30 2 45 -100 -91 23 216 -206 170 -153 72 263 114 211 -7
8115 -7 -2 35 224 123 31 133 -61 43 -167 -1 -88 211 13 -116 112 -32 197 -264 68 -50 -3 124 225
8138 225 275 120 -286 119 192 82 -166 293 -43 230 -10 -119 -32 -216 -144 -459 -89 144 -10 -55 -188 13
8160 13 -181 87 -201 157 145 122 -82 -50 -206 26 -144 -290 319 -50 -219 30 132 -101 161 22 36 96
8182 96 139 26 -187 195 126 176 -171 138 350
8191C50
##END NTUPLES=NMR FID
##END=
