##TITLE=1H_DE-91_3_oil_TFA
 200.13MHz,CDCl3,
 8 sc
 
 18.4.2025
##JCAMPDX= 6.0         $$ Bruker NMR JCAMP-DX V2.0
##DATA TYPE= NMR FID
##DATA CLASS= NTUPLES
##ORIGIN= UXNMR, Bruker Analytische Messtechnik GmbH
##OWNER= pz
$$ XWIN-NMR		Version 3.5
$$ Fri Apr 18 16:22:58 2025 Russian Standard Time (UT+4h)  she@DPX200
##.OBSERVE FREQUENCY= 200.1313
##.OBSERVE NUCLEUS= ^1H
##.DELAY= (6, 6)
##.ACQUISITION MODE= SIMULTANEOUS
##.ACQUISITION SCHEME= undefined
##.AVERAGES= 8
##.DIGITISER RES= 18
##SPECTROMETER/DATA SYSTEM= spect
##.PULSE SEQUENCE= zg30
##.SOLVENT NAME= CDCl3
##.SHIFT REFERENCE= (INTERNAL, CDCl3, 0, 14.3821)
##AUDIT TRAIL= $$ (NUMBER, WHEN, WHO, WHERE, WHAT)
$$ ##TITLE= Audit trail, XWIN-NMR		Version 3.5
$$ ##JCAMPDX= 5.01
$$ ##ORIGIN= Bruker BioSpin GmbH
$$ ##OWNER= she
$$ F:/spectra/data/she/nmr/H-C/1/audita.txt
$$ ##AUDIT TRAIL=  $$ (NUMBER, WHEN, WHO, WHERE, WHAT)
(   1,<2025-04-18 16:21:38.75 +0400>,<she>,<DPX200>,
      <created by zg, POWCHK disabled, PULCHK disabled
       configuration hash MD5:
       00 E9 B6 7A A2 85 ED C7 34 08 36 98 17 FE 4E 26
       data hash MD5: 16K
       97 5E 62 04 39 17 E4 AD D0 30 DC 02 DC 5D 0E F5>)
$$ ##END=
$$ 
$$ hash MD5
$$ 41 3D B2 E9 55 B0 4C B3 78 F5 E8 79 65 4B 0E 10
##$RELAX= 
##$RELAX= 
##$RELAX= 
##$RELAX= 
##$RELAX= 
##$RELAX= 
$$ Bruker specific parameters
$$ --------------------------
##$DU= <F:/spectra>
##$EXPNO= 1
##$NAME= <H-C>
##$PROCNO= 1
##$TYPE= <nmr>
##$USER= <she>
##$AMP= (0..31)
100 100 100 100 100 100 100 100 100 100 100 100 100 100 100 100 100 100 
100 100 100 100 100 100 100 100 100 100 100 100 100 100 
##$AQSEQ= 0
##$AQ_mod= 1
##$AUNM= <au_zg>
##$AUTOPOS= <>
##$BF1= 200.13
##$BF2= 200.13
##$BF3= 200.13
##$BF4= 200.13
##$BF5= 200.13
##$BF6= 200.13
##$BF7= 200.13
##$BF8= 200.13
##$BYTORDA= 1
##$CFDGTYP= 0
##$CFRGTYP= 5
##$CHEMSTR= <none>
##$CNST= (0..31)
1 1 145 1 1 1 1 1 1 1 1 1 1 1 1 1 1 1 1 1 1 1 1 1 1 1 1 1 1 1 1 1 
##$CPDPRG= <>
##$CPDPRG1= <>
##$CPDPRG2= <>
##$CPDPRG3= <>
##$CPDPRG4= <mlev>
##$CPDPRG5= <mlev>
##$CPDPRG6= <mlev>
##$CPDPRG7= <mlev>
##$CPDPRG8= <mlev>
##$CPDPRGB= <>
##$CPDPRGT= <>
##$D= (0..31)
0 0.7 0 0 0 0 0 0 0 0 0 0.03 0 0 0 0 0 0 0 0 0 0 0 0 0 0 0 0 0 0 0 0 
##$DATE= 1744978898
##$DBL= (0..7)
120 120 120 120 120 120 120 120 
##$DBP= (0..7)
150 150 150 150 150 150 150 150 
##$DBP07= 0
##$DBPNAM0= <>
##$DBPNAM1= <>
##$DBPNAM2= <>
##$DBPNAM3= <>
##$DBPNAM4= <>
##$DBPNAM5= <>
##$DBPNAM6= <>
##$DBPNAM7= <>
##$DBPOAL= (0..7)
0.5 0.5 0.5 0.5 0.5 0.5 0.5 0.5 
##$DBPOFFS= (0..7)
0 0 0 0 0 0 0 0 
##$DE= 6
##$DECBNUC= <off>
##$DECIM= 32
##$DECNUC= <off>
##$DECSTAT= 4
##$DIGMOD= 1
##$DIGTYP= 9
##$DL= (0..7)
0 120 120 120 120 120 120 120 
##$DP= (0..7)
150 150 150 150 150 150 150 150 
##$DP07= 0
##$DPNAME0= <>
##$DPNAME1= <>
##$DPNAME2= <>
##$DPNAME3= <>
##$DPNAME4= <>
##$DPNAME5= <>
##$DPNAME6= <>
##$DPNAME7= <>
##$DPOAL= (0..7)
0.5 0.5 0.5 0.5 0.5 0.5 0.5 0.5 
##$DPOFFS= (0..7)
0 0 0 0 0 0 0 0 
##$DQDMODE= 0
##$DR= 18
##$DS= 0
##$DSLIST= <SSSSSSSSSSSSSSS>
$$ [...]
##$SUBNAM0= <"">
##$SUBNAM1= <"">
##$SUBNAM2= <"">
##$SUBNAM3= <"">
##$SUBNAM4= <"">
##$SUBNAM5= <"">
##$SUBNAM6= <"">
##$SUBNAM7= <"">
##$SUBNAM8= <"">
##$SUBNAM9= <"">
##$SW= 18.0517328524113
##$SWIBOX= (0..15)
0 0 2 0 0 0 0 0 0 0 0 0 0 0 0 0 
##$SW_h= 3612.71676300578
##$TD= 16384
##$TD0= 1
##$TE= 0
##$TE2= 300
##$TE3= 300
##$TEG= 300
##$TL= (0..7)
0 120 120 120 120 120 120 120 
##$TP= (0..7)
150 150 150 150 150 150 150 150 
##$TP07= 0
##$TPNAME0= <>
##$TPNAME1= <>
##$TPNAME2= <>
##$TPNAME3= <>
##$TPNAME4= <>
##$TPNAME5= <>
##$TPNAME6= <>
##$TPNAME7= <>
##$TPOAL= (0..7)
0.5 0.5 0.5 0.5 0.5 0.5 0.5 0.5 
##$TPOFFS= (0..7)
0 0 0 0 0 0 0 0 
##$TUNHIN= 0
##$TUNHOUT= 0
##$TUNXOUT= 0
##$USERA1= <user>
##$USERA2= <user>
##$USERA3= <user>
##$USERA4= <user>
##$USERA5= <user>
##$V9= 5
##$VALIST= <valist>
##$VCLIST= <CCCCCCCCCCCCCCC>
##$VD= 0
##$VDLIST= <DDDDDDDDDDDDDDD>
##$VPLIST= <PPPPPPPPPPPPPPP>
##$VTLIST= <TTTTTTTTTTTTTTT>
##$WBST= 1024
##$WBSW= 4
##$XGAIN= (0..3)
0 0 0 0 
##$XL= 0
##$YL= 0
##$YMAX_a= 164938
##$YMIN_a= -192271
##$ZGOPTNS= <>
##$ZL1= 120
##$ZL2= 120
##$ZL3= 120
##$ZL4= 120
##$ABSF1= 10
##$ABSF2= 0
##$ABSG= 5
##$ABSL= 3
##$ALPHA= 0
##$AQORDER= 0
##$ASSFAC= 0
##$ASSFACI= 0
##$ASSFACX= 0
##$ASSWID= 0
##$AUNMP= <proc_1d>
##$AZFE= 0.1
##$AZFW= 0.1
##$BCFW= 1
##$BC_mod= 2
##$BYTORDP= 1
##$COROFFS= 0
##$CY= -3
##$DATMOD= 1
##$DC= 2
##$DFILT= <>
##$DTYPP= 0
##$F1P= 0
##$F2P= 0
##$FCOR= 0.5
##$FTSIZE= 0
##$FT_mod= 4
##$GAMMA= 1
##$GB= 0.15
##$INTBC= 1
##$INTSCL= 1
##$ISEN= 128
##$LB= 0.25
##$LEV0= 0
##$LPBIN= 0
##$MAXI= 10000
##$MC2= 0
##$MEAN= 0
##$ME_mod= 0
##$MI= 1.114404
##$NCOEF= 0
##$NC_proc= 0
##$NLEV= 6
##$NOISF1= 3.799351
##$NOISF2= 2.8
##$NSP= 1
##$NTH_PI= 0
##$NZP= 0
##$OFFSET= 14.38212
##$PC= 1
##$PHC0= -833.3499
##$PHC1= 12.79221
##$PH_mod= 1
##$PKNL= yes
##$PPARMOD= 0
##$PSCAL= 0
##$PSIGN= 0
##$REVERSE= no
##$SF= 200.129724274929
##$SI= 16384
##$SIGF1= 3
##$SIGF2= 2
##$SINO= 400
##$SIOLD= 16384
##$SREGLST= <1H.CDCl3>
##$SSB= 0
##$STSI= 0
##$STSR= 0
##$SW_p= 3205.1282051282
##$SYMM= 0
##$S_DEV= 0
##$TDeff= 0
##$TDoff= 0
##$TI= <>
##$TILT= no
##$TM1= 0
##$TM2= 0
##$TOPLEV= 0
##$USERP1= <user>
##$USERP2= <user>
##$USERP3= <user>
##$USERP4= <user>
##$USERP5= <user>
##$WDW= 1
##$XDIM= 8192
##$YMAX_p= 0
##$YMIN_p= 0
$$ End of Bruker specific parameters
$$ ---------------------------------
##NTUPLES= NMR FID
##VAR_NAME=  TIME,          FID/REAL,        FID/IMAG
##SYMBOL=    X,             R,               I
##VAR_TYPE=  INDEPENDENT,   DEPENDENT,       DEPENDENT
##VAR_FORM=  AFFN,          ASDF,            ASDF
##VAR_DIM=   8192,          8192,            8192
##UNITS=     SECONDS,       ARBITRARY UNITS, ARBITRARY UNITS
##FACTOR=    0.0002768,     1,               1
##FIRST=     0,             0,               0
##LAST=      2.2672688,     0,               0
##MIN=       0,             -192271,         0
##MAX=       2.2672688,     164938,          0
$$ Real data points
##PAGE= N=1
##DATA TABLE= (X++(R..R)), XYDATA
0@%%%%%%%%%%%%%%%qJ6j6J6j6J7k5L2l2M0m8N5o3P1q4R4j06J22j38J56j76J97
37A04k22K49k77L10l45L80m20M65n13N66o26O90p59Q37r23J018j122J237j371
56g22J523j696J897k135K421k771L213l786M567n700P497j0768J8568p1597m6498
71a05987J61069k6586m2123J41452L7113j54608J8778J15117p5300j10114N9637
82A8448M690j14212k2425K7976k9592L9617N8420k0850J9444N7621r820J6558
94D5875N7262j0297l8578l996k4125l8867J0275J6455m7326l2860J7315p158M825
107e1200M6089n539q944M8430m810l7951L8811L4108k8543k649K3117l0482m4638
120b4201K1716L0078k9740k4280m537l1741k139L6598J133l009K8343J8121L335
$$ y = [0, 0, 0, 0, 0, 0, 0, 0, 0, 0, 0, 0, 0, 0, 0, 0, -8, 8, -8, 8, -8, 9, -16, 16, -16, 24, -24, 31, -32, 39, -45, 49, -57, 65, -73, 83, -93, 104, -118, 131, -146, 164, -181, 199, -221, 244, -269, 297, -329, 361, -398, 439, -484, 534, -588, 649, -722, 801, -895, 1002, -1133, 1288, -1483, 1730, -2056, 2511, -3189, 4308, -6460, 12108, -59489, -105987, 55082, 28496, -13627, 127825, 164938, 10330, 29108, 144225, 68925, -41189, 18448, 23138, -91074, -113499, -85523, -115115, -75498, -17078, -37928, -18484, 39137, 29317, 45875, 103137, 92840, 54262, 50266, 26141, -12726, -2451, 14004, -33322, -66182, -48867, -56025, -51200, -5111, -10650, -19594, 28836, 24026, -13925, 24886, 58994, 30451, 27802, 50919, 20437, -24201, -2485, 27593, -2147, -26427, -30964, -62705, -64844, -28246, -27113, -30122, -1779, 16342, 19677]
133A9677Q571J9463K0096q973j9571j0283k4349k1270j833o798j0195n560j588
146d2613M354L730K0066K7880k684m453R974p171N025K2672r599j6626J341p417
160D479j2893q21P374J029j0092m341l241o340J5986J4984n688P422O663j2191
174B330N805J1105l411L031o748k4255q879N569J542n592n14P794l648J256K1330
189F715O539L995J9848r619k1505Q426P04j2988R91l284j3986q908K463L953j9
204a6675J1389Q752j6902j924J9677l54K622J5087n971p201N689l427m749M361
218A0374N77j1143j6323l492K971l019P958O856n491O829P586k987J4309J3729
232B8734p153p193n820p333j635k044l047o206o068K454j387K47J5739O866k905
$$ y = [19677, 28248, 47711, 67807, 58834, 39263, 28980, 4631, -16639, -18472, -25270, -35465, -41025, -42613, -38259, -34529, -14463, 13417, 10733, 6280, 16254, 9083, 14108, 36780, 27181, 10555, 11896, 4479, -8414, -9235, -1861, -832, -10924, -15265, -18506, -24846, -8860, 6124, 436, 7858, 14521, 2330, 8135, 19240, 15829, 18860, 12112, -12143, -21022, -15453, -13911, -19503, -20017, -12223, -15871, -14615, 6715, 13254, 17249, 37097, 27478, 5973, 14399, 15103, 2115, 3106, -178, -14164, -23072, -20609, -16656, -16675, -5286, 3466, -13436, -15360, 4317, 3963, 6585, 21672, 15701, 8500, 14189, 10762, 6013, 10374, 10951, -192, -16515, -20007, -17036, -20055, -12097, -5241, -10732, -3903, 3683, 696, 15005, 28734, 21581, 14388, 8568, 1235, -400, -2444, -5491, -11697, -17765, -15311, -16698, -16451, -712, 6154, 3249]
247C249M810k860l799R781L146m416q57m352l995l369p78O612j356p346l795q319
263a7644M31J0983q24m26O657J095K282N001M352R596P18r714o071o001l312q97
279c774o516j167P4o527J618P522O394J0583L003n096P08j65N0K257l723k891
295B350l371p338J692L569l57N417mo031k46J23J821M402j873o49J002k644J763
312c74M636K514O042m434r929K86m9j352m50l928p83K46l477N055P653L820M536
329A0012k116m208L637j384k542o6m232l112l037m874M020O708R41J922j175j690
345a196M284L19Q58J746m373k515o77l493L588L964q57P38l421k835L798P68n53
362A43N19l250p85L91j886N537M899j224L59l038j782L765r60k696K58l265k236
$$ y = [3249, 8059, 5199, 1400, 11181, 14327, 9911, 9054, 4702, 707, -2662, -3440, 3172, 1816, -5530, -9325, -17644, -17213, -6230, -7054, -7480, -823, 272, 2554, 7555, 11907, 21503, 22221, 12507, 6436, 435, -2877, -3774, -10290, -11457, -11383, -17910, -16292, -8770, -2376, 8207, 11210, 6114, 6822, 6657, 6707, 8964, 5241, 2350, -1021, -8359, -6667, -3098, -3455, 1962, 1958, -4073, -4319, -4196, -2375, 2027, 154, -495, 507, -2137, -374, 4262, 6776, 12818, 8384, -1545, -1259, -1308, -2660, -3110, -7038, -7821, -7575, -11052, -5997, 1656, 5476, 10012, 7896, 3688, 7325, 5941, 3399, 3333, -899, -4011, -7048, -11922, -7902, -1194, -253, 1669, 494, -1196, 3088, 3407, 4265, 6011, 1638, -877, -1554, -5047, -1459, 2505, 1648, 2386, -1035, -3870, -72, 696, 143, 662, -2588, -3373, -2982, -4868, 669, 5568, 4344, 4703, 1665, -117, 3648, 2688, -8, 250, -3015, -5251]
379e251q32q18N959M027k269O98m09N42L530j367j048P70m825k841J09n33M369
396a89J494k918P42k58l88M629j0r12P83l882j788J302K81M202j21l997N72r89
414a447m17L602r19k087J144k468j305J510K127M090o75l143J619o97j94K327
430C067k121j409J50m462o66L266J449K449o82j967K390q8L29K515j932j182n78
447E28m086k95K473o4K223j164l147J953J448K69K899o56j248m24k296J713K140
464B266J58J708l469l308K953j14k415K043j382j798l52j663K253L480J449J445
480C254j266k32K914r10m03J893l763k856j085k793J650K120j638K06K72P3K948
497C84J313J167J123j650j54j095k709L160J693k703j78j351k335K725O00j588
$$ y = [-5251, -6083, -6901, -942, 3085, 816, 1514, 1105, 1647, 5177, 3810, 2762, 3532, -1293, -4134, -4025, -4558, -189, 1305, -1613, -871, -1129, -1517, 3112, 3102, 2190, 2973, -909, -2697, -1395, -1114, 3088, 2967, -1030, -458, -1447, -1864, 1738, 819, -1268, -124, -2592, -3897, -2387, -260, 3830, 3155, 12, 1631, 934, 740, 3067, 946, -463, -313, -4775, -5441, -2175, -726, 1723, 1041, -926, 1464, 1376, 1705, 4220, 2288, 1106, 528, -3558, -3853, -1380, -1444, 779, -385, -3532, -1579, -131, 138, 3037, 2381, 1133, 709, -1587, 126, 2266, 2424, 4132, 663, -2645, 308, 194, -2221, -178, -1560, -3358, -3710, -5373, -3120, 360, 1809, 3254, 1988, 1756, 4670, 3760, 3357, 5250, 1487, -1369, -2454, -5247, -3597, -1477, -3115, -2909, -2637, -2564, 384, 1697, 2864, 3987, 2337, 2183, 1088, -1621, 1539, 3232, 529, 351, -1000, -3335, -610, -10, -1598]
513a598J011j313r54j26M23M195J252k120J343M6O7K158j588r31Q09l791l049
530d166M26j000K170J114j885R53J655J055K396Q45Q77Q1l138o04M44j375P36
547E84j51l321K47K85N4K295q7o0Q47j903o36J746O28J689K88k722K59Q22L24
566A188R91j496p85N15l237n93K164k51P73J50j696J686J723Q38J273l65j24j000
584A754l438M33J512j340j24q83j354J823P2P55K600M14p36O95j376L17J134r48
602A310J83j610k018J193j43k78J667j533o86J176j603J159K919r39r1Q1o64J718
620A841N45p77Q93j103r13j157k481J240J455k345J85O99q01K183J491L1K142
637C128l05j258l54pJ236m75k398J87j097k108J775J92p90J500m18r00J043P58
$$ y = [-1598, -587, -1900, -2854, -2980, -2557, 1638, 2890, 770, 2113, 2159, 2226, 4384, 2796, 1865, 2674, -1117, -4166, -3740, -4740, -2570, -1456, -3341, -2388, -733, 322, 2718, 3563, 4440, 4521, 1383, 779, 1223, -152, 584, 433, -2888, -2641, -2356, -2302, -7, -94, -154, 693, -1210, -1846, -100, 528, 2217, 2505, -217, 42, 864, 1188, 2179, 683, -102, 413, -2824, -3417, -1253, -1504, -731, -581, -2277, -591, 1132, 1970, 3243, 2878, 2754, 1754, -1684, -1251, 261, -1079, -1203, -2086, -3440, -1617, -1545, -790, 1810, 2224, 1488, 2183, 807, 1124, 2258, 1310, 1493, -117, -2135, -942, -1085, -1363, 304, -1229, -1915, -739, -2342, -1183, 1736, 797, 706, 787, 123, 1841, 2386, 1609, 2502, 1399, 486, -671, -3152, -1912, -457, -2802, -2617, -1918, -2719, -536, 955, 986, 3128, 2823, 1565, 1211, 1204, 2440, 1965, -433, -246, -1343, -3451, -1676, -1484, -2274, -774, -1192, -2092, -1049, -291]
655b91J551J212j193Q62p29k52J540o58j349N32j733j537j87n52Q58Q71k066O66
673b455J156J001J268Q94J209M21j373m07J65q78L34n83k923N57L39j411O32R44
691a110R2O23l28K09J114Q4J437j04j630P64L48j006J109k46j321q3j403o24N95
710a480k08N93k46j343J789O63L72J262N84K35%j246k34R44j157k93q79j936R15
729a665J75n76J831J56j26O63m52L59J633q79k63k55q72K73Q6m76J216n20q85
748e77N85j166M04J228j015K7K28j051J145M63J34Q07J35o07J11p86L37P92j632
767d38l15m58o75Q24L65j30J381L55p63M58o5Q53J98j296m25k83o49K63m86K20
787a066J277m51p48R87K20Q46J31q24L14m26n75O28j88k40O98p11n75Q44o84M64
$$ y = [-291, 1260, 2472, 1279, 2141, 1412, 1160, 2700, 2042, 693, 1225, -508, -2045, -2232, -2784, -1926, -1055, -3121, -2455, -1299, -298, 970, 1864, 3073, 3494, 2121, 1714, 1879, 1001, 1335, 752, -2171, -1614, -1275, -2686, -2054, -1110, -1018, -395, -723, -514, 600, 684, 2121, 2017, 387, 1151, 1499, 493, 1602, 1356, 35, -48, -1451, -2075, -1480, -1688, -1095, -1341, -2684, -895, -232, 140, 1402, 1986, 2221, 2221, 975, 741, 1685, 528, 235, -644, -2580, -1665, -1490, -2066, -235, -79, -205, 458, 6, 365, 1998, 1119, 856, 601, -271, 2, 88, -388, 828, 308, -577, 8, -1158, -754, 474, -541, -514, -286, -1337, -192, 271, 405, 1212, 1347, 740, 851, 65, 402, 1194, -438, -753, -1211, -1886, -1062, -697, -827, 554, 909, 146, 604, 539, 1392, 1590, 294, -131, -414, -1063, -800, -1286, -1066, 211, -240, -988, -1, 219, 1065, 1196, 372, 686, 260, -315, 313, 125, -115, 583, -128, -703, 141, -543, -79]
807g9M21j442K82J58Q8M82M50k5Q79n50l62R56m67M35o20j009j03j87q95O02j48
828a134jR75l37l63J527L50R9J16q43Q42n40q17O32M1n61j22p74K4N00m04K88
849e02M33p87M45K78lQ54n3l20O18q29O45K73n74R0j57j186L43k75n74R63l19
870f37n6N13m47M55J160n76K78M0n66K91j98m00N65m83m38J43m23K91P28q94O
891f48N06l33K81K41N2O71l08n03P10m85O45j31q85J82j85p47P58jo2K12k15k03
913d48Q15p7J92O16r13l7J16n53L38j93m13O17l5p51R07l35L69M85q19M25m9p69
935e12L42J18q0O60o61m98J157n21K20R2q20K76J5l72M06K52j44L27j37k76J015
956H59l85K8p5o75J21j0o55K15P2o3N97n16J43J014k50J54L97o95K27k0n65J74
$$ y = [-79, 342, -1100, -818, -660, -572, -90, 360, 335, 1214, 664, 302, 1258, 791, 1226, 606, -403, -506, -693, -1588, -986, -1134, -1135, -160, -497, -860, 667, 1017, 1116, 1232, 389, 1231, 691, -126, 506, 547, -14, -136, -910, -886, -386, -790, -502, -69, -856, -411, -133, -136, 718, 665, 345, 963, 134, 779, 1052, 478, 568, 411, -775, -432, -707, -1281, -318, -637, -693, -180, -627, -172, 988, 412, 690, 730, 164, 455, 257, -143, 422, -61, -499, -356, -779, -488, 240, -654, -648, -142, -475, -194, 47, 99, 770, 462, -41, 669, 184, 829, 698, -187, -5, -190, -937, -179, -180, -242, -30, -245, -448, 367, 290, 482, 1098, 185, 148, 264, -289, 49, -144, -557, 60, 25, -726, 181, -154, 215, 700, -119, 306, 257, -512, -170, -52, -132, 528, -133, -631, 526, 5, 225, 317, -503, -227, -212, -584, -178, 74, -70, 257, 120, -156, 859, 474, 502, 427, -248, -127, -137, -792, -577, -505, -568, 29, -487, -344, 670, 420, 574, 971, 276, 503, 483, -82, 92]
978I2m0n25L38o53K53N83m61J93J80k24J47M16o50M42K59l42K48l23O1O98l39
999C53K79k13p90K40j97n13K14J50k39M91J71m14J203k05L23O2n46K35k67o08
1019b71M34j93n78K38l64N24J41m33L11O07n73L25j9K5M17n18p1J15O0J3K40j33
1041B97j67K43o64%Nk21J81Rj57L85j46K45L47j38L1J54n03N20j08n53LR7l48
1064d88J11J66r7J57r1L94K46n31J17J47k42J78P1m80K69Rj33L71m35L39L66m98
1086e4M41K7n60M73l45k01L43l35J34N42q02K80K51o74N64J65k15k81J83k91P40
1107C85m03L41j3O2l5km19M21l53j46O0k79j5M50o42L70M10n65N79Kj09M31j87
1130C43k47J07k68NL91l65k9J38k84J66%l80O20o08J47Q5l13K80R23m32k8M42
$$ y = [92, 52, -473, -135, -788, -535, 48, -413, -220, -40, -264, -117, 299, -351, 91, 350, 8, 256, -67, -6, 692, 353, 632, 419, -371, -131, -328, -841, -627, -477, -716, -225, -54, -468, 735, 530, 853, 915, 369, 604, 337, -271, 163, -30, -608, -370, -734, -210, -69, -502, -191, 416, -157, 168, 149, 174, 591, 73, 2, 117, 177, 190, 430, 297, 130, 373, -291, -291, -286, -507, -326, -317, -474, -89, -235, 10, 357, 219, 250, 404, -99, 421, 313, -240, -237, -140, -488, -377, -211, -308, -151, -242, 152, 398, -133, -16, 131, -111, 67, 138, -342, -73, -64, -197, 174, -261, 78, 444, -54, 387, 414, -146, 327, -18, -219, 124, -211, -77, 465, -337, -57, 194, -480, 84, 249, 34, -247, -64, -355, 385, -18, 323, 310, 372, 337, 335, -84, 337, -16, -162, -102, -381, -396, 54, -588, -218, 192, -373, 206, 208, 99, 530, 343, 96, 203, -65, -60, 331, -34, -63, 75, -209, -43, -43, -423, 197, -411, -264, -179, -492, -212, 711, 279, 251, 693]
1152F93m90L71l45N8l14j22n28L37jo1L18j65P3M74j66j2N26o22K23J63m43J9
1174a4p0J55J25k61k74P08n98q9L40n40O41l32j30K60J9K47J08p9%M05j72j62
1196B87k29k29K07j18k74K4l44K03N74l20L69J86o25P01j2k93P1j84j45L28l95
1217b18n1J34m2J30L20m91M19j69NL9K8m51N79l99o3M19q7k7J62l75J22K19l39
1240a36J60l33J77K79l21o8K05L0K01M8j58R8M1l11l7p7J02Q4k33J32p8K6K11
1263D2L34j84m5L91l78O4m19J64R9l50O5L93n68p0L22K6q4M80n03J46J16j90L59
1286B10R9k4j67o7K31n5KJ12l99k25o8J80j6j31l62M78J52k07L93L02k90K01P6
1309D25p0Ll60j9J42l33J44L7l08o8L35M8O9K8k19L64J78m48P17o02M66j89j18
$$ y = [693, 203, 574, 229, 287, -27, -149, -677, -340, -341, -402, -84, -249, -176, 298, 132, 120, 646, 24, 247, 410, -33, -14, -84, 71, 196, -65, -339, 369, -229, -318, 22, -518, 123, -209, -339, -79, -60, 187, 295, 216, 216, 621, 449, 287, 58, -171, 36, -82, -356, -332, -676, -473, 101, -219, 150, 336, -289, 412, 400, 107, 178, -6, -151, 177, -218, -269, -135, -177, -47, 273, -218, 201, 32, 37, 76, 104, -347, 232, -167, -230, 189, 102, 75, 237, -138, -16, 203, -136, 24, -309, -132, 147, -174, -242, -37, -7, 194, 242, 84, 182, 223, -88, -125, -202, -100, -16, -249, -117, -195, -169, 42, 376, 192, 147, 538, 160, 224, -195, -31, 68, -282, -217, 176, -392, -462, -140, -114, -198, 282, -221, -75, 41, -149, 210, 309, 285, 118, 51, 282, 227, 229, 341, -58, -283, -351, -171, -187, -318, -680, -202, -50, -257, 136, 438, 148, 349, 425, 355, 358, -2, -21, 121, -212, -68, -31, -339, -407, -72, -24, 45, 73, -146, 218, 396, -52, 665, 63, 529, 340, 222]
1332B22q2M5j73n1k74M8J86j38j92L46l96M02J70o3K93j4j11K17n4l19K33l53
1354e8k09K7R1q5o8k37M96k03J06L11J63l23J33m5J03l8j45r8M05k79j02K8Oq4
1378a05p8j44M95l36j39K78OK6K16k76L51k17l49K53J70k21j00j53J31R2o9L80
1400B11r4n29L89K85k20N4J76k83p0r5J36L42n50J50J0j24L13j38R4J45l24J83
1422F1J05j59j12M15k84L53K2o15K85P6k46j3j11k17O07o76J55N63l78P8N43m95
1444d3L71J23k55J52r7n21L16l94j34N38l78K02Q9j40J13K42n8J90J1j75L54q30
1466c24J27K89j29N3j45k18P11n33l45L05q4o4K22o1R1L15k62J88J15j78K68j10
1488B31O9R1l08o81N98l40K15J12l57J06J26K17rK08l39L77p5k98M73n83oK79
$$ y = [222, 140, 185, 12, -39, -313, -265, -79, -217, -409, -63, -459, -57, 113, 50, 343, 329, 218, 435, 381, 62, 295, -58, -267, -240, -149, -234, -302, -539, -43, -246, -140, 171, 334, 11, 144, 99, 202, 164, 19, -79, 326, 47, -55, -27, -21, -105, -183, -327, 168, -168, -307, -29, -23, 3, 219, -57, 294, 77, -272, -19, 151, -70, -170, -323, -192, -100, -169, 211, 117, -412, -23, 262, 42, 96, 272, -11, -81, -176, -40, 302, -248, -98, -88, -212, 101, -37, 57, 202, -122, 61, 166, 7, -105, 310, 26, 379, 401, -214, 71, 147, -99, -112, -223, -440, 167, -509, -354, 209, -169, -91, 452, -43, 328, 451, 196, 348, 251, -270, 46, -348, -482, 56, -322, -120, -31, -171, -58, 184, 126, 316, 327, 152, 506, -324, -197, 92, -37, 16, -129, -347, 364, -169, -514, -209, -293, -357, -135, -196, -105, 210, -52, 136, 251, 73, 341, 231, 300, 391, 83, -598, 0, -340, -125, -13, -370, -264, -138, 79, 70, 278, -61, 316, 241, -57, 416, -167, -173, 106]
1510A06m07M17k50j38J07jl43M18J44j70L8K67l38K49j81J59j74O2L73m7l28k1
1532e8K32k60K58m95L01K3J34j83J8MJ58K15m31R4n5r9J81k94M7M10m24K25n3
1555e2j04K29J34j30J52j74R9pj06k7L1j72J61j96P9j10J30l7J50j13J8o2J84
1578G7nm7J79k62K14J13r6j01k95J33j52l9M0O4K9K48l46J35K07J66M6jj51Jr2
1603F5k05L39m86J81J75l47M31l39J49o7j00J37K61J34J03l10q2j35L59k68J55
1624A50nj08j96J06k15K17j93L3J2M4R8J86j47K08m3n9Q7j0j35J32j48J8p7k75
1648c20j31K67Q7m0J5OL08l48K78J90l54J23p8J54l53J32o6K10j52o2J71o7j84
1671b14N13l54r3M0nP4L1j93M50M0j59k3M5k42Q3j73J71J33l31J43LJ15j1K22
$$ y = [106, -301, 116, -134, -272, -165, -166, -509, -91, 53, -117, -79, 188, -150, 99, -82, 77, -97, -35, 338, 291, -37, -58, 174, -86, 172, -323, -22, 1, 135, -48, -30, -26, 132, 347, -84, 10, -45, -144, 37, -257, -210, 200, -224, 1, -52, -156, 73, 207, 77, 229, 55, 154, 147, 41, 14, 45, -127, 34, -162, -83, -193, -63, -100, 50, -63, -45, -107, 77, 72, 25, 204, -58, 156, 269, 173, 72, -223, -90, -242, -281, -241, -177, -148, 100, -246, -111, 96, 262, 308, 307, 156, 157, 65, -140, 199, -287, -106, 69, -278, 153, -186, -37, -104, -204, -67, 194, 328, 431, 121, 39, -96, 263, -5, 150, 145, 37, -159, -53, -268, -51, -244, -211, -199, -155, -57, 129, -18, 190, 147, 88, 175, 165, 30, 162, 14, 32, -45, -320, -451, -184, -97, -137, -122, -116, 192, -156, 122, 312, -42, 81, 3, 157, -196, -64, -130, 80, -72, -134, 37, -30, -214, 299, -55, -148, -108, -113, -39, -8, -201, 249, 289, 130, 107, 152, -90, -7, -180, -9, 124, -207, -64, -61, 54, 43, 265]
1695B65j97P0k13K10J5N7j76n5o4j76L14j46J54k56L15j93J82l04J91k85K98L07
1717C13m12J67l9p4K43k2l51L77k84M2N7j0R1Nk0J19J4l69M20k55L86k35k4j66
1741b7P2j33M5o8J87j69J81l4Q9Nl69K07o1M04r8jk4j44n4M9o6k21K62k55J05
1766a18J84J02l32J11Q0k50J35K68k7K54l39K61j05j86j08k02M16Q9k30q2O9Q4
1788G4j86nn2M10k24R5J60k26m6J99rj80J73l56K89l56l1J72P1M2l6K29j64K45
1812B88l1k36M4l04L19J62j39k53j30J38L89m05J09J59k04l4K24J47k71P3q0J5
1834b0J71k9j03L2j03K86k59K52j90j44M27n66P5L08j9r1K35l19J25J21j71l6
1856a8j61L44l02J36J19r3k94J71K11q3j40M7K03j97M80m51J55P5k68R6j19j06
$$ y = [265, 68, 138, -75, 135, 150, 207, 31, -24, -88, -264, 50, -96, 58, -198, 117, -76, 106, -198, -7, -292, 6, 313, -99, 68, 29, -45, 198, 176, -175, 202, -82, -40, 17, 7, 98, 103, 83, 202, 216, -153, 267, 12, 398, 163, 139, -27, 45, -88, -43, -111, 76, -93, 88, 54, 143, 148, -221, -14, -75, 329, 231, 230, 206, 62, 8, 57, -9, -230, 32, -223, -118, 66, 168, -164, -53, 27, -223, -88, 180, 153, 407, 68, 329, 224, 38, -70, -272, 144, 233, 3, -79, -10, 74, -112, -117, -169, 241, 17, 112, 272, 46, 0, 199, 190, 10, 183, -173, 116, -240, -271, -99, -28, 14, -22, 207, 43, 288, 257, 21, 65, -239, 80, 242, 103, -150, -280, -142, 247, -158, -49, 110, -94, -128, 96, 243, -28, 45, -35, -20, 151, 122, 19, 51, -52, 234, -25, 227, 37, -107, 320, -246, -171, 137, 118, 27, 262, -57, 68, 189, 18, -18, -179, 165, -137, -1, 118, 25, -269, -98, 113, 30, -110, -63, 140, -57, 423, -28, 127, 202, -66, 30, -89, -195]
1878a95L77k47j47L51j34J73p4k33J08j88J29M18p7M5j56n5j55N81j025J82K63
1899e9l0j22K20k46M6M72m82J60l1lK69k40Q5qk11J22qn5L13k0k90K96l36J08
1923e0J37l50L36j41p7K70K1k92P4o0J84M4p4j07L54l91r1O4J53j22J50p1L0Q9
1947H0K46k06R1rl3k41K51m1j4j94K09l7q1j77J01J02k13o9J32K06K11j64j56
1970fL10n95J47J76L65l13j9J33j56j67j94Q9L77j37J10j18j93L55o4K22j77k67
1992a22O0M2o4n2L43m92J76M61o81K38J6L59j43k44L04k86JJ53J46m4n2j78K01
2015A42j76m27N06j81J26r5J11q5M5n5R7J22K55l28P6k03R6k82J93J15p6R7l43
2038b70K08j01K85l35K48J0o5m4M3K19j45J30o09M69j42j9J75j05M8j10J40j63
$$ y = [-195, 182, -65, -212, 139, 5, 178, 104, -129, -21, -209, -80, 338, 261, 306, 150, 95, -60, 521, -504, -322, -59, -89, -211, 9, -237, -191, 281, -201, -41, -72, -75, 194, -46, 39, 31, -180, -58, -66, -121, 192, 172, -118, 178, -158, -50, 87, -263, 73, -68, -145, 125, 146, -146, -72, -132, 52, 96, 22, -85, 269, -122, -213, -149, 4, -118, 32, -39, -9, 80, 326, 120, 211, 202, 169, -72, 179, 138, 124, -70, 139, 102, 21, -156, -55, 47, -166, -235, -103, 103, 314, 150, -6, 304, -291, -144, 32, 397, 84, 65, 198, 42, -125, -319, -230, 147, 10, 120, 2, -191, 164, 100, 322, 145, -122, -62, -20, -84, -136, 207, -285, -109, 352, -329, -91, -75, 284, 141, -103, 201, -85, -84, 69, 215, 171, 119, -59, 142, -34, -461, 45, -136, -10, -105, 6, -79, -34, -89, 8, 130, 385, 57, 133, -70, 26, -256, -63, 52, -24, 73, -270, -62, -163, 122, -213, 35, 45, -20, -64, -21, 198, 53, 183, -426, 43, -99, -118, 57, -48, 0, -110, 30, -133]
2060a33R7QJ94j09j15R1k5q1K18j0l31N01l67k8n1K70j04j3j74O9J70J44j45k75
2084a99L60k74K39p0M7j9K7j24o3K77l41O5j62K49k3l0m9J36j9j25K85k60J61
2107H8l71Q4O8oJ25j83J8j33J46J6P3j35J01L2J31j53J05O3l0K79l45N1J22l9
2131A07j45J02J07k55k6J71j94J98O8m1j68j1M9J38m10M87k81NK33k4l67J39J72
2154E4l9r4J95p2r3P4K9J79l41J61M9j90K36j76J15j23r0L4m8K01j14J68m52P3
2178b64O30n27R2j0K72r6j98R3O4K06k40o9P7j20m9R9J2j26PQ5m2NJ22O5j2K14
2204B90j63K81m06p1J84j33l94L89K2J68j98o8M3M9K06k06L3J42J03p1l77M10
2226B33M0k42L0j60%J23K07k93J54l06J14K8j29J15J48M9O0l01K37p3k81K00K88
$$ y = [-133, -36, -28, 166, 57, -58, 33, 8, -73, 145, 135, -196, 305, -62, -90, -141, 129, 25, 12, -162, -93, 77, 221, 76, -199, 161, -113, 126, 56, 103, 84, 111, -13, -76, 201, -140, -75, -237, 12, -11, -41, -90, 46, 27, -98, 187, -73, 88, -283, -199, -131, -137, -12, -195, -177, -310, -164, -148, -75, -210, -109, -77, 54, -99, 6, 69, 39, 318, -27, 24, 146, 107, -38, 64, 171, -84, -110, 61, -133, 65, 133, 92, -76, -87, -38, 100, -310, 177, -104, -99, 134, 110, -257, -118, 54, 15, -79, 116, 44, -49, 25, 54, 233, -108, 53, 102, -88, 148, -28, 87, -36, -126, -92, -140, 61, -53, 115, -337, -264, 366, -161, -69, -79, 193, 97, -101, -8, 56, 262, 22, -47, 30, -90, -139, -40, -28, -154, -147, -62, -104, -99, 23, 88, 76, 290, 127, 408, 2, -69, 115, -18, -412, -23, -1, 167, -31, -99, -56, -7, 199, -7, 26, 168, 271, 200, -177, 233, 273, 31, 61, -99, -99, 24, 231, -62, 92, -214, -100, -72, -201, -86, 62, 111, 171, -130, 107, 34, -247, -47, 241]
2249B41k86l07K71J33q3j39O0J27n7K75j4k01Q7j7l1N4m43L54P6p6K08l72j7L24
2273A67j79k11J13M3J86m25J64M09j53o2m0Q8Mk88K64k56J03L06j50l0j16p3K08
2296G2p6P9J47k07q7K10j63J01P9l44J99p0M2P7n7l4N9R9j82O0rJ76r3J28K5j86
2322D5l7J10j67K66r3k46K15j7l5OJ47k08L26n34N8L54j11k21Q6j24J40J38j81
2345h3j41qJ41l1n3j0J87j83nL47k13M3l7q4j16L43q1L2j64Q4J29l36K87j41K19
2370A26k19k8L26p2j28j37K90j58M3j31L16k71J58J13m3k21J64N4l12k83K18j17
2392c12N64r5l96M34j29j62J27j1k07K64j26J36j13L42m25J17P2j05K4J45m6m06
2414c08O18j74o3R4j95l8K01o0k8J35R1k57n5O5M8Q7l72J20j01J27K6M2Q9k16
$$ y = [241, -45, -352, -81, 52, -31, -170, -110, 17, -40, 235, 221, 20, 107, 90, 59, 113, -330, 24, 100, 24, 232, -140, -157, 167, -12, -223, -110, -67, 119, -306, -142, 267, 114, 52, 12, 100, 104, -184, 80, -176, -73, 233, 83, 53, -63, -136, 72, -4, 75, 222, 15, -72, 138, -25, 76, 155, -189, 10, -60, -18, 59, 2, -32, 27, 126, -56, 4, -5, 171, 78, 206, 231, 45, 8, 118, -49, 217, 124, -122, 93, 76, 41, 47, 194, -14, 312, -222, -164, 190, 79, -142, -56, -180, -40, 98, -83, -224, -232, -91, -122, -175, -185, 2, -181, -186, 161, -52, -9, -46, -130, -246, 97, 16, 48, -116, -32, 97, -239, 48, -93, 126, -93, -121, 205, 133, 5, -132, 158, 0, 43, -88, 228, -43, 115, 228, 185, -36, 128, 182, -130, -413, -195, -312, 252, 157, -239, 195, 66, -96, 31, 20, -187, 77, -49, 87, -26, 316, -109, 8, 80, -25, -1, 144, 98, -308, 310, 136, 73, 167, -28, -66, 135, 75, 47, 182, 273, 16, -39, 26, 74, 161, -211, -91, -192, -65, -39, 3, 92, -124]
2438a24J3L13k06Q1j78R4j18O6Q1k83M35l76K2K59M14k98k90K36j90J9N1l70K63
2461h6oQ8Q5l52K35J26j44r9M32l33M94o16J74J07R9k62K85j64j96K28l34M57
2483B18k78K8R0p2L3l07N51j85J07k59K96O2k68j9M9j05N3m5J4K24l21n4R4R8
2507Dk4J2pJ81M9j97J2O2j5m6p9n3J19Mk4j8j45L07k17j81K54k4K37k98j12j81
2533c80M28J94k94j86L37j58J45R9j10l45K74Q7m06L00j25J81j78K97k56K46k61
2554a11J46k91L37Q9j99J08j04Q3l7k06M74l24J42J46k02J66k97J10K73l32J02
2575G3M6j76R9j93J22j11J55l8J33j05N1O8rj28O6k23K71K30j98k48L94k20j29
2598g0K13l02K46r2j19m8K35k02M2K40j35p3R9jk33K79K8m4K3K0j50k09K65j31
$$ y = [-124, -111, 202, -4, 77, -101, -7, -125, -59, 22, -261, 174, -202, -180, 79, 493, 195, -95, 141, -49, -30, 21, -349, -86, -92, -4, 81, -271, -36, 90, -54, -153, 279, -54, 440, -176, -2, 105, 204, -58, 227, 63, -133, 95, -239, 218, -60, -32, 58, -14, 19, -288, 263, 78, 185, -74, 222, 284, 16, -3, 46, -59, -6, -51, -37, 187, -134, -188, -94, 4, -20, -8, -15, 166, 215, 18, 30, 92, 77, 31, -48, -101, 18, 22, -2, -20, -165, 142, -75, -256, -2, -26, 211, -87, -199, -380, 48, 242, -52, -238, 99, -59, 86, 185, 75, -270, 4, 91, -315, -15, -140, 41, -137, 160, -96, 150, -111, 35, -256, 81, 170, -29, 79, -25, 58, 21, -185, 289, -35, 107, 253, 51, 217, -80, 30, 303, -29, 73, 119, -57, 42, -151, -29, -140, 15, -23, 110, 5, 56, 124, 115, -13, 53, -170, 101, 331, 133, -115, 279, 59, -70, 143, -159, 87, -5, -124, -172, 63, -139, -97, 143, 8, -65, 34, 33, -200, 79, 107, 63, 86, 106, -44, -253, 12, -119]
2622a19J14J28m56L75j43J9J98k08J90J85k44J6L64m52N3q3j15J15J31k46K35
2643E7Pj72J09j12J86j90PK79j90j61l8J62K39o9J21n99N91j67m2J02k50n6K33
2666D7k79K28L0Q9M9k26L10n6j01r0j85J45J02p4O6l79J73L21k69J05K31k55K2
2689Dm6n2J15L30m79J78q2J64k0j95j66J11L25l38K93j52Q2Qk00N8K32j36J08
2712A42k03j32L71j23k5R4l96K53J9j4J34j09j27o2K06l14K45L89l78N1n3K7J9
2735A4N3P8k10R9k56J50L6rK5J32k29L5M2K27j9k04J13k02J05j00K91j82n9J3
2759e7P6n2Mq6J58Mj03L9J05R3n86J57K8R8J09k39J86K82j29j49j1N5K8k6k78
2784b94J18N82n79J24J14j50r6j13N99j15n1j03q5J07K5k21j15L50k79K00J22
$$ y = [-119, -5, 123, -333, 42, -101, -82, 116, -92, 98, 283, 39, 55, 419, -33, 20, -63, -178, -63, 68, -178, 57, 64, -108, 1, -111, 75, -115, -108, 171, -19, -180, -218, -56, 183, 114, 235, -364, 227, 60, 18, 120, -130, -186, 47, -232, -4, 26, 115, 164, -62, 248, 192, 91, 1, -184, -39, 63, -11, 55, -324, -151, 170, -99, 6, 237, -18, 4, -42, -94, 21, 351, -128, 50, -32, 132, 112, -83, -249, -138, 187, -151, 142, -10, 72, 80, -120, -62, 170, 34, 142, -61, -193, 178, 55, 30, 124, -272, -19, 0, -14, 120, 11, -116, -178, 28, -286, -41, 348, -30, 21, -32, -5, 14, 67, 145, -65, 34, -222, -72, -36, -45, -20, 112, -117, -82, -40, 187, 168, -36, 77, -125, -20, -120, 171, -11, -70, -57, 19, -33, -29, -115, 43, 47, -56, -17, 88, 181, -405, -248, -220, -122, -13, -252, -66, 216, 87, -62, -73, -18, 10, -16, -294, -176, 406, -173, -49, 65, -85, -181, -294, 305, 190, 139, 36, -49, 58, 83, -138, -253, 97, -182, 18, 140]
2805A40k23K51r9r4L33j44j05N4M7l11J43J30k7k40k23M20j52K77l87M18J2k21
2827aq7L6K49j16l9K94k30k41J32O1m2j02M1j12J00o0J50l8O5k95N42o54M60l8
2851G5j26J26l29L25J28k85J07N1k6k2k74J52K81r0k73J29M4J43q4j59J34k68
2873b41K18k77K68l21L56Q8l20L56K1k0o7J83n1k87JK57p5j83K58J39j93r5j41
2896a26O0r9J14j8j31J28mm3K29k85j71L59Ko1K7K87j07l66N08l54k47O6k4M08
2920A52O1m05L23l93M10n6j90J88m9P5j23k9K81n29K40K19k57L9j9J16Ok11j06
2943b57K73K6k9k4j49P9J33j01j34L06j13j96J60J4KJ52j18O9j18M6K48r4l25
2966a50L81r2j87M2P8P2m14K11j80J71J57m5K53k17p1j03R8j67N13m59M9M2p6
$$ y = [140, -83, 168, 69, -25, 308, 164, 59, 113, 160, -151, -8, 122, 95, -145, -368, 52, -100, 177, -210, 208, 220, -1, -88, -52, 197, 81, 42, 336, 106, -135, -3, 58, 16, -86, -45, -157, -57, -117, 33, -5, 60, -235, 307, -347, 113, 75, -51, 75, -254, 71, 199, -86, 21, 72, 46, 24, -250, -98, 183, 93, -180, -51, -7, 136, 52, -107, 27, -241, -23, -300, -32, -353, 3, 91, -229, 127, 148, 128, 61, 244, 193, -94, -93, 164, 89, -94, 164, 303, 110, 15, -126, -66, -165, -51, -69, -200, -72, -76, -119, 110, -175, -346, 13, 15, -46, -19, 268, 161, -205, 303, -51, -298, -232, -256, 152, 213, -192, 131, -262, 148, 92, -98, 90, 41, 116, -7, -36, 245, -284, -44, 175, -82, -43, -62, 54, 60, -151, -257, 16, 42, 13, -11, -160, -81, 52, -49, -183, 123, 10, -186, -26, -12, -10, 142, 24, 93, -25, 21, 269, 175, -150, 231, 139, -48, -6, 72, 144, -270, -59, -239, -68, 89, 44, 297, 80, 9, -94, 4, -163, 350, -109, -60, -18, -94]
2989i4J19NM6J5p6J0J09Kq4q6j17K5k7LL05j22J34m0n12N55k66K26J32m40K7L04
3015A53l73J75pJ99n7k48L85l22J26j8j67L49q1M2k10J52N7k18J9N8j17q8O5K88
3039A62J42n29J32J69n6L15m60P1k2k7L18k48j44J49J45l13L0K65j99K7K34j67
3061fQ7l77M17l43Q0M4M29n88J87J34k61k1J46N3K51j77l00K73J56Q4l20J75j48
3084b5J42j08q4J23J6o4j49L16k75L36r0k80L76k74j95J87k6J32k77J59J93k20
3106h7L8J58k53j80L60n1K22l89J60K46l36P3K16k22j91L67l67J56J93k00L88
3127C01k44j0k30J47K58k56K38j46j81r9K46r3p4p7J37M6J89j30k57J01J81qQ7
3150A26j5j38k42K68J13pl6l3l09M40k28K60J03m66L91q9K12m26R4j76J84O9j05
$$ y = [-94, 25, 30, 76, 91, 15, 25, 134, 136, 52, -34, -151, -126, -153, -150, 155, 33, 167, 127, -385, 170, -96, 130, 262, -178, -151, 153, -220, -45, -52, 147, 90, -158, 227, -95, 31, 13, -154, 195, 114, 156, -54, 98, 155, -63, -44, 14, -103, -191, -126, 162, 304, -225, -93, 76, 20, 335, -125, -54, -76, -103, 215, -33, -177, -28, 117, -196, -166, 99, -100, -73, 161, -6, 81, -296, 121, -222, -142, -98, 331, -257, -70, 64, -197, -218, -72, -19, 232, 55, -245, 28, 184, 268, -52, 123, -25, 117, 9, -75, 48, 64, 0, -149, 167, -108, 228, 138, -142, 234, -40, -235, -48, -74, 58, -219, -60, 133, -87, -49, 109, -144, -324, 36, -15, 207, -182, -22, 224, -112, -39, 177, -45, -236, 131, -236, -80, 113, -87, 301, 57, 47, -183, -36, 222, -34, 204, 58, -123, -222, 24, -69, -143, -220, -83, -37, 152, 22, -235, -134, 47, 39, 126, 111, -27, -269, -1, 112, 105, 69, 36, -273, 167, -61, 199, 302, -164, 227, 138, 350, -76, 18, -158, 26, 95, -10]
3173a0Q9K9l71K63R9M8l01J05q2L38l33j83O0M13k0k95M94k94jk01J66k41J97
3196c1j8J25j64q3K03L1J0Mj50J80N3k71K68p4j51NN9J85j65P4m0j2p7Q1L05k13
3222A34j85K12k24l5P8Oj19k5O0K37N8k88L3r6R5j52K82k4L07m73K64q2kp1K91
3247B81j90q1J91l42J29O2O0k92J99Q5J30l20M8J96r9j93R5k05Q6J70k14L92m29
3270b41M45l09J19l72N53k04l05L12L00n17L8K17m1k4K04R9l77R7m6K10j33RQ1
3293A15J16k5j00k44j9o5L17q5j5J8k21K02j14K61o7n7k37K10L28l70o0j60M19
3316A47k60J36R3l25J03J83q6m4L7NN3J41j17m1J67k55o6j48K25M4J44j75K92
3339B53j67k24j26L16K33k35k38K28M1j22P9n3J25j84L20m73L09K2j66P9r0j06
$$ y = [-10, 79, 108, -263, 0, 99, 147, -154, -49, -131, 207, -126, -309, -249, 164, 144, -151, 343, 49, 48, -153, 13, -228, -31, -49, 76, -88, -171, 32, 63, 73, 77, -73, 107, 160, -111, 157, 83, -68, -63, -4, 181, 16, 90, 50, 38, -39, 42, 347, 134, -51, 161, -63, -98, -20, -14, -133, -158, -98, 139, 197, -91, -58, -154, -59, -211, 71, 47, 354, -119, 145, 63, 61, -10, 281, 91, 10, 201, -141, -12, 50, 110, -182, 17, 102, 232, -88, -40, 156, 57, -136, -41, -246, -160, 10, -204, 188, -241, 204, -105, 14, -358, 195, -9, -314, -2, 298, -219, -181, 36, -5, -29, 175, 274, -103, -6, -52, 158, 25, 34, 115, 231, 206, 106, -138, -157, -222, 95, 10, -5, 13, -208, -6, -120, 141, 74, 17, -220, -10, 318, -52, -112, -272, 147, -113, 23, 116, -209, -106, 77, -9, -53, -16, -11, 42, 183, 66, 25, 192, -63, -129, -277, -52, -8, 136, -39, 253, 86, -138, -264, 52, 285, 50, -188, 40, 81, -41, 38, -15, 110, -74, 246, -227, 82, 104, -62, 17, -73, -179]
3361a79J30q5OJ96j76N35m73j74n7J69J53k18K40k38J72j6K80k48r4L22j73j25
3383e3k7q6M69k10J09k22L8M7K3j17J11J00l94J60j61J0K15l01K30K67k77j07
3405a76K91l61M83q1j81J2j52P9M4K57k78j95L91k5j0lJ05l02N5QJ44l2k39M4
3429a22K4J18k52J40KJ60k25m7R3J35m0J24q0J8k50M58l07J5j27O6J54j66J13
3452Dj36J84J56L5l97J83j46k9L42k7j74O8j82Q7K22Q5k27K18j14Q9k03j35J42
3475D5J40l98J09R7m1j21M59k11o9O4o5j07J06j69K89j25l4k5Q1jJ66j32j17J
3499e8J3k2j12JL15k75M50k91j5R0K40m28K24j14j40J83l60M10k21J05r2M18n23
3522b02J87k49l55O59J37j6l16L70k22J81r6j69k14M45l84L89j23j31J96k37K08
$$ y = [-179, -49, -134, -128, 68, -108, 427, -46, -220, -277, -108, 45, -173, 67, -171, 1, -15, 265, 17, -77, 245, 72, -53, -80, -166, 303, 93, 202, -20, 18, 65, 88, -29, 82, 182, -212, -52, -213, -203, 12, -289, -59, 208, -69, -176, 115, -246, 237, 156, -25, -13, -165, -86, -42, 215, -63, -258, 133, 108, 98, 95, 200, -102, -47, -39, 105, 73, -166, -122, -98, 20, -232, -92, -90, 70, -155, -202, -109, 26, -14, 110, 30, 48, -202, 256, -51, -36, -163, -97, 57, -109, 4, -132, 52, 208, 243, -154, 29, -117, -146, 196, 169, -5, 63, -119, -32, 190, 275, 48, 266, 152, 241, 38, -97, 45, 185, -213, -104, -7, -48, -169, 290, 79, 10, 74, 9, -98, 8, -161, 128, 3, -31, -56, 25, 24, 190, 58, -59, -58, -45, -67, -179, -178, 137, -138, 312, 21, 6, 96, 336, -92, 132, 18, -122, 61, -299, 111, -110, -5, -97, 321, -202, -15, -264, -619, 40, 177, 161, -155, 215, -7, 174, 78, -91, -305, 140, -244, 145, 22, -109, 87, -150, 58]
3543E8K3J51l88K30k08K1j03K38r3R9J32jj69J03j36q3O8k5J2J55k36J77n6k7
3567e8J28j45p6J36M1j29J05l3q9K13k34Q1j69K80J00l2l54L38K04j97q1j93N48
3590C84p80L98p1R6L1j53O4j33m0K07J11R5J28m07l26K94R5r1PJ01M9O3k12P6
3614a4J65N9j53O9J88p5j86J00n6j6o0k53L68l85L44k25R9J28J80o3Jl3k01J10
3638I1K22m17K33J19j42k86K04j39l1L64j56L3pk26K79J6j73m7m1K39m0k2Q7k9
3662A31l00K79j50J16J43l02j03K03l19O56k43j70L13k10J06N6o2n7k0OP6l57
3684b08J2K81K46n06J99j13K34k01j12J14J63K46o18L50q9J12j80L18p8j33k99
3705b62L05J4k45K18k23K93j55R8k54Q1N69l50l39K66j75J32j81J30Oqk0p4k0
$$ y = [58, 81, 232, -156, 74, -134, -113, -216, 22, -71, 28, 160, 159, -10, 93, -43, -126, -58, -83, -71, 84, -152, 25, -31, -58, 70, -75, -151, -15, 26, -103, 2, -31, -120, 93, -141, -60, -229, 51, 151, 119, -235, 103, 307, 110, 29, -164, 384, -396, 2, -69, 27, 58, -95, -31, -164, -204, 3, 114, 209, 337, -70, -396, -102, -7, -98, -91, 10, 59, 122, -90, -14, 151, 210, 57, 126, 314, 239, 53, 153, 97, 81, 21, -232, 136, -249, 95, -130, -31, 97, 277, 214, 215, 182, -19, 91, 313, -104, 129, 248, 106, -180, 24, -115, -146, 218, 62, 95, 88, -138, 141, 157, -16, -63, -104, 135, 95, 73, 160, 131, -169, 110, -40, 76, 219, -83, -186, 17, -302, 354, 111, -59, 254, 44, 150, 206, 144, 87, 67, 73, 149, -208, -196, 85, 331, -175, 24, -89, 145, -56, -168, -54, 109, 355, -263, 87, -2, 110, -70, 248, 170, 37, -262, 43, 57, -188, 30, -193, 100, -55, 43, -211, -130, 439, 89, -250, 16, -159, -27, -208, -78, -72, -80, -100, -174, -194]
3728a94L34K8j07j69K57j96J37k68K77q3K78k16m6r4j08N0L30k40j54M61l38r4
3750a55K74k52j42K62J21J05k55K55m04K34l08L14O0j94J20j56M0K67ok75n7O
3772a46K02j39m9K89m5J36J34n76M29pk83L98j89N0j97j63R8J04j45J8K01k42
3794a22J94P7j70n5P0J09l13J46K48j64N2K17m28K43l96J41K97l83K65n9J59j21
3816GJ34K4j82J93R0o77K88k18L15P4r9K98j96M8l87L95l24J8M7N48l16R3j43
3839C0k0P6r4J42n2k30J70k96K77J4J6J19j83K37k11k0r2j18K20j08J38L2j11
3862f4K91l07R8m05K18J66K23k86K18p2j2j58L0J12kj74J97l32K43J71j73l6j09
3885a63L95J32m11j34qK47m4O3j1k25K09R5j79l91M48K1k5j61K97n5J54j96p4
$$ y = [-194, 140, 168, 61, -108, 149, -47, 90, -178, 99, 16, 294, 78, 32, -62, -170, -120, 210, -30, -184, 277, -61, -155, 119, -133, -275, -13, 108, 213, -42, 213, -191, 43, -265, 49, 109, -85, 35, -121, -81, 186, 180, -95, -152, -146, 56, -83, -132, 157, 112, 248, 382, -194, 235, 228, -55, 343, 154, 204, 7, -156, -58, 46, -99, -81, 120, -122, 72, 149, -21, -76, -6, 103, -210, -64, 184, 20, 72, 289, -139, 104, -292, -151, 146, -237, 28, -31, 128, 7, 141, 165, -17, 176, 266, -411, -123, -341, -26, 48, -51, 247, 51, 99, -288, 107, -217, -199, -152, 396, 80, 173, 30, 10, 86, -8, 134, 82, -148, 22, -274, 3, 17, 33, 152, -31, 206, -5, -25, -117, -235, -15, -123, 15, 47, -64, 227, -80, 18, -387, -169, -3, 220, -66, 152, 80, 68, -90, -60, 52, 50, -124, 73, -259, -16, 155, -18, -54, -163, 232, 364, -47, -181, -189, 58, 14, 77, 66, -159, 50, 145, -34, -425, 23, 44, 19, -142, 155, 100, 254, 58, -16]
3908a6l54J89o6L50j26J51k01j47L61Q4l93L19k72L74k21r4K38j15j10J04J57
3929B12k97L06k25J2J40k34J18l5j48J79p4J16j51n2L32k92J92%k25o0L59k31
3951e8N9oK70q1j75q7M25m21j67M58k81K05k45K86j89Q5k8J12k92N48k76j66J2
3974a2N1jj57L34k57p8J38r0LJ44k20K96j21J8kn0j34J04MJ51j16m39M22j2J2
3999a2K69k95O5k8l6N9J3p1J67k61K40k37L77k01k32K89j51k71K83O0J9M4k07
4022a17n9K19N4j30k09J55M15l21RL4j06L03o1l84L24j4Pp1k6J14q0k23L76l22
4046a13M9J32Qq3J0J07k39L11l81M45j03l61L43Q8k91J42M8n03M94k26l6Q7K25
4069A53j1j32p1j44K6J50K27m0M4l72M18o35M93mj28J53j63L89l58k2m8J0R7K68
$$ y = [-16, -370, -181, -247, 103, -23, 128, -73, -220, 141, 225, -168, 151, -121, 253, 32, -62, 176, 61, -49, 55, 212, -85, 221, -4, 8, 148, -86, 32, -3, -151, 28, -46, 70, -81, -133, 199, -93, 99, 99, -126, -186, 173, -58, 1, -5, 265, 184, 9, -78, 347, -74, -241, 217, -64, 141, -104, 182, -7, 78, 50, 162, -130, 418, 142, -24, -12, 39, 38, -119, 215, -42, -120, 18, -72, -69, 75, -145, 151, 30, 48, 46, -4, -138, -34, -30, 121, 5, -434, -12, -24, -12, 257, -38, 27, -1, -37, 22, 35, -36, 131, -130, 110, -127, 250, 49, -183, 106, -45, -316, -33, 27, 46, 90, -117, -176, 43, 97, -33, -242, -87, 328, 7, 16, 50, -56, 247, 186, -198, 126, 112, 119, 48, 22, 136, 56, -167, 209, -113, -64, 68, 76, -7, 3, 110, -129, 182, -199, 246, 143, -218, 125, 213, -78, 64, 112, -391, 103, -123, -159, -72, 153, 142, 10, -61, -205, -179, -29, 198, 158, 202, -170, 248, -387, 106, 102, -26, 127, -36, 353, -5, -27, -75, -65, 32, 300]
4093C00q5l42L85l96J08j34L10j70M9M5k18K82j75L76m23k10K23K39j97K35l42
4114a40Q8J05j58j2K0j67K08K45n2j4pj72M2K26l46P7m6L00k10K9rNM13o97R3
4139a79j7K64p8p0Q3K67j77k58K63j4Q9j87P9k08J99k15K00k07%J79k28M59l43
4162i9M61j83j68Oj65K94l6O2j77q2j76M00ln30L62K77l23j22K98R8k31p5mM12
4186B96m5k85N3k36L6K39j38J57l07J83j3L1J20O4j01n6l33J90J2J07R6m9L7p5
4210a7K30k95k7J67j4k08J02J24j84K20k70L86j61j17Nk00L28l5r7j45K67q3k36
4233b60J23N29n57r0M39l46L56l40p5J52n6J32m4j33J08j79J90L9m1J76j31j8
4255b6K14j24k18P6L64m31J50m2L00m94Q4M11k99J42j99j47M23j15j12j12J01
$$ y = [300, 215, -127, 258, -138, -30, -164, 146, -24, 25, 70, -148, 134, -41, 335, -88, -298, -75, 164, -33, 202, -140, -52, 53, -105, -117, -97, -264, -56, 189, 137, 123, 116, -56, -14, 212, -134, -57, -103, 197, -13, 16, 7, 12, 425, -272, -179, -196, 68, -10, -80, 3, 270, 93, -165, 98, 84, 173, -14, 65, -143, 56, -159, 41, -166, -166, 13, -215, 244, -99, 362, 179, 11, 17, -148, 146, 110, 172, -5, -87, -263, 137, 134, -396, -34, 243, -80, -202, 96, 194, -37, -112, -116, 296, 251, -34, 19, -217, -181, 58, -80, 77, -230, -47, -60, -29, 91, 155, 54, -2, -335, -145, -133, -26, 70, 21, 58, -17, 213, -82, -109, 58, 44, -164, -62, 62, -122, 98, -172, 214, 53, -64, -59, -259, 69, 34, -63, -208, 59, -24, -260, -137, 392, -165, -255, 184, -162, 194, -146, -221, -69, -125, 7, -37, -170, -62, -241, -51, -12, -53, 123, -8, -26, 188, 64, -154, -78, 286, -145, 5, -37, 263, -231, -147, 264, -35, 107, -92, -239, 184, 69, -43, -155, -54]
4276e4J39J51j68j83n3l5K89k04oj05Q9L24l10K28j99L46Jl77K00Q2jk71J68k27
4300a76J80O2Pj51K47r4L2j66j26M02k42l59L16L2J25l21K88Q7j52jM7K19k70
4323a4P9j89J39J7L6N4j57J38O3k24R0o3N8J45k0l70J43m7J17R3L2k28O3J94J86
4348C35l68J41k09K04M2j56J10j40m2j1J3l37J95J80L1J63j46M6o7p9Q5L4k37
4371b13P9J7L4k08L03J92j32M9J19m56L6j1J43rL30m64J36M0P7k63K07R9K49k99
4395E5j4l3k0r4rj7J02Q4pJ42k22JkJ3P5k24J35%J13Q7k08K20l57L60j28l4J26
4422A44Rn3k43J73rl4l0n0K07M4r1m48K69J33l13K39Q3J83l50L53k29M3MQ8q8
4447C4j91K43j3j18J02mM1l12N1L62m7r9Q6k33P6J18J15k49L5o4m5J89J73k44
$$ y = [-54, 85, 236, 68, -115, -168, -203, 86, -118, -124, -229, -140, 184, -126, 102, -97, 249, 250, -127, 73, 155, 154, -117, 51, -176, 4, 66, 73, -78, 169, 75, 107, -59, -185, 217, -25, -384, -68, -36, 89, -232, 56, 143, -9, -10, 37, 256, -14, 65, -124, 15, 32, 68, 122, -35, 103, 166, -58, 32, -31, 27, 172, 152, -218, -75, -122, -5, 88, 120, -108, -45, 149, 335, -33, 108, -101, 103, 145, -11, 99, -41, -83, -94, -81, -418, -223, -43, -12, 151, 5, 51, -16, -95, -10, 24, -213, -134, -117, -83, -291, 12, 204, 72, 121, 240, -216, -180, -191, -48, -57, 273, -191, -55, -15, 62, -201, 6, 105, 354, 55, 41, 8, -12, -106, -115, -132, -30, 54, 47, 189, -33, -32, -34, -21, 54, -170, -35, -35, 78, 165, -43, 177, -180, 180, 52, 18, 144, 153, 100, -143, 30, 21, -13, -43, -93, 114, 158, 67, -381, -112, 21, -292, -53, 30, 213, -137, 216, -13, 30, 34, 122, 34, -157, 86, 73, -45, 57, 53, 94, -218, -167, 195, 148, 49, 135, -98, -22, 96, 211, -38, -3, -67, -112, 77, 250, 6]
4471Fk31J70J42J5p3j17P3J50j28J71l26K84q5k1j66M85n22J4K11k26M29l62N5
4494e2J6J02p2J85n2j49j5J60k1l10L24k2L7m87R9J58K45J62r0j70k5k77L84k55
4518a25K93j92K41l81N4L8OJ91j53K09j06k76J79o7K84J04j37l4r3M5o8j1j4J85
4542A72k36jK35k71k9j83L85n0k52l3L14L4j40J42k03L28k37R8k6J88l96K26p1
4565fJ22j18K99m96K17j36o5J49m5P7j46q1R7N7J23j64K42P3l11J70L12k92l51
4588b73M99k23j40J26n0j87K51r8K9n6K31J59l25N8K29J9j80N1j29k23rJ79P1
4611IR8k18J95L08m58k5p0K49K2o6J27K0nm77j6K77K41j15l60K29J53m0k31oL5
4636a24o8M96k48O3q8M9l38o6N48Pl97J90m30M16O2j65l6J9P8l8j71K39J66k70
$$ y = [6, -225, -55, 87, 102, 29, -88, -15, 135, 7, 178, -148, 136, 51, 30, -136, 349, -173, -159, 52, -174, 255, -107, -52, -36, 66, -6, 179, 127, -22, -37, 123, 102, -208, 116, 94, 131, -356, -257, -99, 146, 308, 218, 48, 23, -254, 130, -125, 168, -24, 217, -164, -110, -72, -66, 125, -28, 181, 75, -201, -22, -89, 195, 299, 162, 128, 35, 80, 12, 1, -13, 172, -64, -65, 170, -101, -130, -313, 72, 22, -230, -263, 51, 85, -55, 87, -116, 212, -25, 73, 47, 235, -161, 65, -6, 116, -2, 297, -199, 18, -118, -183, -34, -79, -2, -148, -229, -132, -75, 48, -116, 126, 199, -112, 58, 370, 78, -273, 226, 3, -137, -11, -61, -248, 3, -95, -66, -122, 109, 268, -57, 1, 230, 249, 69, 120, -9, -232, -241, -62, 9, 107, -111, 84, 392, -66, -91, -161, 88, 110, 44, 171, 191, 186, -291, -307, -30, 211, 96, -264, -35, 118, 78, -153, -159, -124, -192, 304, 56, 119, 31, 80, -258, -324, 224, 231, -166, 24, -406, 10, 72, -93, -129, -110, -32, -70, -241, -2, 164, -106]
4660a06J75j75l8K72j2j78NJ64j28K55j91m4p6K44j7o4P9k20M35m49n1Q9J34j37
4684c4q1M04l30K22k89K69m73M74k83P0J64k37M89o16K61l09N94k94j10K36j68
4705d1M22k40L3j36R3m0o9j52OL11k34NK7j67K76k37J05K67k39LJ28k2l92L77
4729H4o2P5j84K23j8k68K87J5O6q2n1K50l53M0k42J66Q8J10j61m7L5J33j54J79
4753A29p4q8k12K49k65k88L91n0L08p6j92J90J38j42k78O80n27q1K07m6j52O0
4775a19J29J73k04j68L64k88LK85m36L90j00j69K97J3k04m5K99l23p2j65K23J52
4797C5m3J63k82L08L5l36K59k33K36m2j16K3j02O5J96j16K08J1k96j48L90o8j45
4820BR1p2k14K33Oj68L08k06k3J3R7J00l37J01K73m07kL81l44J8J3j28P8qL06
$$ y = [-106, 69, -106, -144, 128, 116, -62, -57, 107, -21, 234, 43, -1, -77, 167, 150, 86, 165, -55, 380, -69, -120, -31, 103, -34, -115, 289, -41, 181, -108, 161, -312, 162, -121, -51, 113, -124, 365, -251, 10, -299, 295, 1, -109, 127, -41, 381, 141, 174, 38, 131, 91, 22, -130, -124, 187, -47, -42, -15, -182, 94, -143, -38, 229, -10, -7, 121, 99, -293, 84, 22, 97, -87, 136, 118, -150, 137, 152, 218, 136, 85, 335, -18, 22, -220, -54, 34, 144, -17, -64, -29, 104, -50, 129, 55, -33, -245, 4, -261, -549, -158, -208, 100, 24, -168, 22, 160, 18, -260, 420, -107, -188, 19, -27, -179, -119, 10, 183, -21, -189, 175, -113, -110, 175, -261, 129, 29, -140, 157, 170, -34, -79, 220, -103, -175, -340, -117, 35, -8, 155, -127, 181, 216, -120, 139, -94, 142, 100, -16, 7, -95, -30, 166, 50, 258, 269, -27, -175, 215, 147, 2, 93, 21, -193, 40, 46, -122, 186, -20, -43, -30, 67, 167, -170, -69, 204, -203, -205, 176, -168, -150, -137, -265, -187, -195, 111]
4845A11p7M1p8J30p2m7L4K37l43mL52l34J77k38J46l7rJ55k98K02O1M0j97J44
4869I6J82k91K69j98J90l31K53j74K2R4P9l97J5K80j03O6k8q8J52J88m32K06j23
4892g3O5J13j21k8J46m05L35K8n5j41j0J95j74K57l23P3k57L89O3n0j6J0j21L97
4916B97j14o0lN6j46L6q3LN1j40K70m7l92J71J24j63n9K76rj24k27J38M5QJ85
4941I3nj06J45r2j8k38L56j37O4k0q8L8r1L62j50k01j6K18K00l51Jj01L28Q5k66
4966A0J88p1K6j26n0J76k38L13j05J75p5l66P4J38k34L67m76J91K80k73Qk93L35
4989b6n9Q8q7n3J03R1j83K63q8j84j5K49j21j8K46j51J10k95j09M17p7j15q2J16
5013B0J98m3k84j01K43j17J61j59J92K4n2L0l31N01l64K69j4l03K57r2q2j6m2
$$ y = [111, 34, 75, -3, 127, 55, 8, 42, 279, -64, -68, 284, -50, 127, -111, 35, -2, -11, 144, -154, 48, 109, 149, -48, 96, 278, -13, 256, 58, 248, -83, 170, -4, 18, 112, 191, -206, -191, 89, -14, 52, 24, -64, 88, 276, -156, 50, -73, -8, 105, -16, -44, 102, -303, 32, 60, 5, -136, -146, 49, -125, 132, -191, -118, -375, 14, 77, 27, 11, 21, -100, 297, 183, 123, 120, 176, 30, 66, -17, -14, 37, -103, 167, 120, -272, -101, 23, -140, -199, 77, 68, -56, -283, -145, -100, -92, 93, 88, -18, 127, 35, 17, -221, 135, -2, 62, 42, -46, -8, -99, 263, 113, -88, -104, 114, 314, -37, -36, -137, 191, 276, 10, 198, 127, 153, 27, -23, 153, -85, 228, 123, 298, 223, -143, -69, 69, -165, 202, -274, -83, 197, -76, -68, -361, -26, -85, 3, -84, -137, -34, 57, -126, 137, 49, -135, -150, 99, -22, -40, 206, 55, 165, -130, -239, 178, 101, -14, -96, 20, 218, 175, -109, -210, 33, -84, 77, -82, 110, 134, 82, 112, -219, 282, -82, 187, 173, -130, 127, 35, -47, -63, -105]
5036a05Q9R1N2k04Q4j04m0J12J44j64K53l26M3j72K50L8m29N04j57J01O1m9k3
5059D9J62m20K19N2j73L06k36K7J49K37k52j92j39J86j27K08j87LM30k62n0K10
5081B00l82L70K14k65oj95Q4Q6J9p6l0J11j14k2r8j11J16k3O0K04k50K32o77M33
5105a20K6J82j34r9J01n4L20l06R9L96l99K6k5l1K79j99k50K03O2k46M98m24O4
5128c1k05L85K5k34J93N2j49J07q7N1k56J01K29k90L11l5j25k35K58k05l3j32
5150c05L74j14K79l52K9m4J89n2j06n4N2j2J38J16j24j6k17J98pj3l86O03j35
5173D1k09L32j42J65J9k02J00j51K5O2K88k84P7j95J24l17L20l39L27j94n2J46
5195e9O8K29j39k17L67j90J55k42J15pK0k6k48J84R9j27L08l74N8l8j7J19n2L42
$$ y = [-105, -16, 75, 127, -77, 7, -97, -137, -25, 119, -45, 208, -118, -75, -247, 3, 41, -388, 116, -41, 60, 121, 72, 49, 211, -209, 10, 62, -111, 195, -41, -14, 135, 372, 120, -72, -211, -25, -152, 56, -131, -128, 302, 40, -10, 200, -182, 188, 402, 137, 131, -64, 20, 106, 125, 49, 19, 130, 16, -6, -104, -215, -99, -122, -62, 142, -108, 124, -553, -120, -94, 88, -46, -145, -44, -98, 222, -84, 15, 411, 12, 38, 13, -18, 261, 62, -188, 15, 77, -169, 329, -95, -31, -236, 149, 174, -60, 133, 185, 36, 143, 56, 107, -149, -48, 181, -109, 202, 167, 42, -193, 65, -140, -173, -305, 69, -45, 234, -118, -89, -133, 56, 4, -102, -156, -104, -116, 22, 138, 14, -2, -219, -21, -28, -41, -427, 176, 41, -168, 164, 22, 187, 206, 4, 104, -47, -22, 40, 328, 44, 121, -74, 50, -267, 53, -286, 41, -153, -205, -59, 9, 238, 99, -118, 249, 59, 214, -28, 87, 80, 100, 74, -174, 10, 109, -18, 290, -84, -26, -64, -81, 38, -14, 328]
5219C28l70O0j87Q7J09N8n0%o9M7L2k0k4J72j25O7n4M5J75k78J31j41q9J45R4
5244A43M6j14K12m41K23j88L79j71m08J24J61N3o0Q2R9k00J16jJ33K3l74P0Q6
5267gJ07J02q0k06O4k7L82n60N20j98j18J06j19L47n57J6L41j92R0j4K17j86n2
5290b4J20j62j19j47K03R9J77p5n6Q5k28J20J54J17k01j3K5j38L22k67j69P2p5
5313a80L93l26K49o7k25Q7q4J5K34L3k81p8L34J00q1j2r8J65m48K4J90j45M96
5336B95k95J24k8r0l0k7J86k68j3J63pJ82l05M86m20L61n91K10l2J28J72m73M37
5359A65j37j20N2J87p5O6k13J9K8L3k10K69k31K07N6n3J62o3j92N3k66K20j72
5382b15m3K95j57J0j66K63K82k03Kq2J36n58L72l10L39Q4k05J48o9J2P2q4j7J83
$$ y = [328, -42, 18, -169, -82, 27, 85, 35, 35, -34, 13, 45, 25, 1, 173, 48, 115, 61, 106, 281, 3, 134, -7, -96, 49, 143, 189, 75, 287, -154, 69, -119, 260, 89, -319, -195, -34, 19, -41, 41, 140, -60, 56, 55, 188, 211, -163, -93, -7, 100, 202, 122, -84, -20, -47, 335, -225, 295, 97, -21, 85, -34, 313, -244, -228, 113, -79, 11, -3, 214, 28, -24, 96, -66, -185, -332, -129, -30, 147, 72, 16, 101, -127, -7, 147, 264, 63, 50, 75, -63, 259, -8, -177, -105, -180, 213, -113, 136, 69, -156, -69, -153, -138, 96, 129, -152, -230, 104, 204, 123, 111, 13, 178, -270, -246, -56, -201, 295, 0, 124, 96, 6, -24, -51, 135, -133, -146, 17, 10, 192, -113, 373, -47, 314, -277, -67, -99, 29, 201, -272, 165, 28, -92, -40, 147, 72, 138, -75, -56, -28, 5, -205, 64, -167, 40, 96, 43, 205, 142, -50, 3, -263, -43, -215, -258, 37, -120, -110, -276, -13, 269, 66, 68, -14, 122, -436, -64, -374, -35, 49, -156, -8, -77, -65, 7, -77, -94, 89]
5406H9j62J96j42J38k53K12J8j03J48m33M08l06j73L94j4N4J5Jj13J0j74J05p6
5429a61K51k35K93l32K59j6m5o4M4J52m23L06k91J63L61P4k88k49J31M4j64K66
5451G6O5k99r0j38N41j61J72k25J27J1rJ6P2r0Jn7J72k78K12J0k47k21M84p8l61
5476b95M23j05L4j05q9j18L10Jj41Qj08j28M09l0j21k40L24j96K24l2k12K37j60
5499a10K89L0n12L60M3j67k3L90k20K08j36k69K81k27j6K62j39k46J39J66N5m5
5521A13j96K10k90L40r5R4l20N9L27l55j20J74j02O1rJ2JK69j69j87J46M5K21
5544B29k60j8rN2jP7q9J01k02J48k19M6N5K31j21n3k4O0j36J90J5R5p4j61L0Q
5570c0L4J10l59j11N00j30j37j12K46k7o8O3L9k58n1K95j02j07K78J43j69j47
$$ y = [89, -73, 123, -19, 119, -134, 78, 96, -7, 141, -292, 116, -190, -363, 31, 17, 71, 86, 87, -26, -16, -190, -85, -161, 90, -145, 148, -184, 75, 59, 14, -50, -6, 146, -277, 29, -262, -99, 262, 336, 48, -201, -70, -26, -190, 76, 141, -158, -248, -386, 155, -6, 166, -59, 68, 79, 70, 86, 158, 68, 69, 12, 184, -94, 118, 128, -119, -340, 144, 66, -295, 128, 23, 57, -48, -137, -255, 55, 56, -85, -77, -185, -313, 96, 66, -55, -295, 29, -167, 57, 25, -187, 50, -110, 179, 209, -303, 57, 100, -67, -90, 300, 80, 288, 152, -117, 164, -63, -79, 183, 44, -202, -63, 103, 158, 113, -83, 127, -163, 177, 82, 176, -144, -85, 242, -113, -233, -59, -161, -100, -109, -97, -96, 173, 4, -183, -37, 8, 229, -31, -49, -58, -6, -7, 70, -19, 82, -120, 28, -191, -145, -90, 141, 20, -33, -57, 3, -133, 57, 72, 167, 93, -68, -38, -30, 4, 114, -245, -356, 144, 14, -123, -235, 11, -16, -84, -21, 18, -240, -291, 4, -98, -205, 73, 216, 47, -100]
5592a00K96r1q8J52o2j59j25J19J17q5J2L53k80Lp7L6K80k10N0k15J94K7j32q2
5616f7O2J54m08N40j84k34j05K57j74L10J04j99J06Q6o1k38J59k62P2M80l10n9
5638B9j2l9K97o12M27o4L7k95R1P5K76l16j40M0K41j17j33J14J02R3k62J08L21
5661B61j33k63L9P8k0L7p1J68J83k81K20M7r7j99J8m2J10ol91K10K53j7K22m46
5685a20J3J82k6q7p9M8O2PJ48l77K80L2j51p8L47j07O3n7o7K54j9l66J23o8n7
5710a00j44J47J89J56j22r8Nj04K5J31o4j38L09j44j22p4L9J12K3O0o6L60k80
5733A00k57K45j70Q1m22M84r1J79j75J36k37K63P6n19L99Q5k82J30n2j9J8K24
5755A96j1k30J20k80L39k93L80r0m64K53k69K51P0J33j39K83m07M6O1l0k14j70
$$ y = [-100, 196, 105, 17, 169, 107, -52, -177, -58, 59, -26, -14, 339, 59, 62, -15, 21, 301, 91, 141, -74, 120, 147, 15, -67, -5, 149, -259, 281, 97, -137, -242, 15, -159, 151, 255, 56, 162, 248, 187, -51, 108, -154, -82, 398, 88, 29, 17, -22, 275, -337, 90, 26, 63, -232, -141, -66, 210, -106, -246, -206, 35, -82, -215, -101, 1, 94, -168, -60, 261, 128, -135, -96, -18, -38, -1, -72, 96, 279, -2, 218, 265, 168, -31, -13, -55, 55, 49, -342, -132, 121, 104, 326, -120, -107, 75, 49, -38, -117, -69, -7, 0, 148, -229, 51, 83, -68, -146, 201, 94, 157, 100, 33, 287, 268, -98, 25, -43, -100, -244, -97, 92, 248, 126, 28, 33, -71, -46, 85, 21, -117, 192, 48, -74, -148, -109, 3, 26, 86, 20, 380, 100, -157, 88, -82, -1, -423, 61, -30, 149, -26, 110, -127, 136, 212, -307, 92, 177, -105, 25, -27, -46, -28, 196, 185, -45, 75, -205, 134, -159, 221, 131, -333, -80, -349, -98, -28, 105, -34, 249, -158, -112, -51, -81, -295, -465]
5777d65M23j84M68l66J41O9k77K10k2j25J70R9j22m6k05M15l69J90L56n82J37
5798h5K44l4k52K62o9k9l34K12n5K4J18J09O2k66k2O6l6o3N3j22L73j25P3j44
5822d0O3k58J26J66j83o7K46n5K1N2k45k2K99j68O1k40J77K2j2p4o6J61L7J31
5846A32j51j9L3J2L28j91l62J64o3J20k68K65j97L92k75J91m5p4J55m11K74j01
5868i1K52L6j99n0J26K0k77K00%PP8r7j47K36k35K5kR4QR8J8k64J15J81k89k20
5894c77L17N2J92k39n2k00M19j47Q7O0j79Q3p2M2J5K18l9k81K73j2l19J30M12
5917C83m51J66k31L1R1J54l93M67j49j11j56L80q4l23M04l32K53j39k6J26J3l4
5939C9j51M9n0q7K25k09L49m57L03P2k68J47L12k47k9M0r8R3r3J6N4l2J10k26
$$ y = [-465, -42, -226, 242, -124, 17, 86, -191, 19, -3, -128, 42, 141, 19, -27, -232, 183, -186, 4, 360, -222, -85, 159, 125, -127, 135, 66, 37, -297, -85, -140, -116, 2, 111, 173, -93, -115, -49, -85, -148, -95, -217, 156, 31, 104, -40, 23, -235, -109, 57, -126, -193, 53, -2, 19, 71, -174, -196, 103, -65, -4, -244, -67, -45, -57, -131, -197, -36, 1, 132, -19, -38, -5, 7, 335, 144, -218, -54, -117, 3, -265, 0, -197, 195, -80, 111, 66, -8, 147, -264, 10, -91, 161, 197, -2, -52, 74, 94, -183, 17, 17, 24, 102, 5, -142, 94, -141, -116, -118, -24, -16, 82, 100, -164, -49, 132, -157, -377, -60, -8, 184, -55, -107, -307, 112, -35, 52, 112, -67, 16, -56, -14, 1, 219, 180, -101, 172, 160, -159, -29, 383, -68, 98, -133, -102, -11, 143, -250, 217, 68, -43, -199, 181, 97, -226, 178, -154, 99, -40, -66, 60, 73, 39, -112, -63, -113, -200, 25, -184, 165, -292, 11, 83, -185, -38, 274, 27, -2, 38, -60, 33, -60, -44, 10, -22, 88, -138]
5963a38J66L0R0n5j95o1M19k39r7l2R6Q3N3j16N3J08k96K08j42p7r2L66k68J50
5987A4k07J50R9PjL01n25R2P5J21J4j45l2K6j27j03J80j2J62M8k20K17l99K43
6011b2K54j57k9j35qM4K39p9l1J69k71j86K40o4R9P1J25j51j26r7J19o8J20m8
6035Hk32K86J93k50J54k3l72L91j65q0J83p6K49l08K55J16k21Q2j20nj43N1P6
6058D9j7J91k94K32n9l6j43j13L75l40K11o9O7l16J64J59o7Jj78M49j42n4j90
6081a20N4K9J9J22O8L7j27P1l53Q3J47q2L36j69p9m2K2M0j09K28j85K2R2J97l33
6106c2N1J23j59j10J00K34k18r9r3J24J48q0J4l8L04k77M0j97J04J00k15K19m1
6129BJ90J33k14Mq4rNJ1k61J98J9j13K05n3j62L53k73L5J05l8L03k86k52J37J11
$$ y = [-138, 28, 58, 148, 93, -102, -163, 256, 17, -80, -112, -16, 67, 120, 4, 57, 165, -131, 77, -65, -142, -234, 132, -136, 14, -193, -43, 56, 63, 62, 363, -162, -70, 5, 126, 140, -5, -37, -11, -138, -241, -61, -73, 89, 137, -83, 134, -265, -22, 232, 75, 46, -89, -97, -53, 186, 107, 76, 245, -26, -212, 28, -36, 63, 134, 259, 108, -18, -115, 4, -64, 56, 8, -224, 62, 255, 5, 159, 136, -236, 155, -10, -90, 93, 17, 266, -42, 213, 329, 108, 190, 70, 65, -78, -27, 49, 32, 223, -71, 161, 102, 66, -77, -190, 185, -155, 56, -13, 54, -262, -98, 61, -6, -5, -183, 266, 124, 70, -120, -66, -37, -18, 104, 172, 209, 82, 153, -200, -117, 30, -52, 284, 115, 36, -6, 16, 56, -53, 175, -10, 12, 104, 301, -32, 19, 142, -17, -127, -27, 207, -11, -110, -203, -79, 69, -11, 3, -35, 269, -8, 32, -165, -61, 39, -176, 43, 2, 192, 325, 111, 115, 31, 22, 27, 38, -223, -25, -6, -119, 86, 33, -129, 224, -49, -14, 91, 53, 356, 70, -182, -45, 66]
6154F6m13K22o9J8Q0Q4j54K79q8J41k69p7K51q4P0k94J34L11n5k20N2J61r0O4
6178A20Q6q5k80R8J01Q0o6j70j05J28o7J57P0P4J08k71R8l2r5J04k11J13J47j4
6202H8k95J42m0J29j51K69M8j05r9J89lk58n7L9L02j27P7j56J03R3o3j14l4p3
6226i6J44l92M07rK59m02j84J74j10L59jp6N9q9r2J26m90N07j96J39r3J21k9M8
6250H4j29J04n1J71j35P9j23q5J95pM8j28J73j05p6j11M0L22k17p1J83j43J09
6273A27j68p8M7j48J76m8k59L84Nl5M6P7q9J90j13k24P0J28k67L96j81K29r1n6
6297A18q5J44k99nL84k31J81j25q5j87K93k05L69o1k42k9J19j23J93l3k05P5K41
6320B02j68J68o2m09J19J29P8q2J04j10J66m84J17L07J26j18k08L79m24M6j08
$$ y = [66, -347, -125, -194, -176, -96, -12, -166, 113, 25, 166, -103, -180, 71, -13, 57, -237, -103, 208, 153, -67, -15, 146, 56, 120, 206, 121, -159, -61, 40, 120, 54, -116, -221, -93, -160, -3, 67, 141, 249, -22, 76, 44, -51, 53, -158, -45, 102, 88, -207, -65, -105, 24, -127, 142, 190, 85, -14, 175, 172, -86, -143, -104, 198, 71, 148, -8, 95, 188, 125, 11, -23, -96, 48, -344, 63, 54, 313, -89, -273, -99, -209, 150, 149, 73, 132, 43, -49, 77, -413, 94, -102, 37, -56, 65, 36, 84, -45, 59, 8, 179, 44, 123, 0, -85, 110, 103, 151, 23, 196, 91, 15, -96, -56, 266, 49, -22, 161, 18, 127, -41, -119, -72, -220, -44, -92, -351, 33, 38, 3, 49, 126, 37, 227, 114, -110, -40, 88, -179, 217, 36, 265, 174, 118, 33, 177, -122, -127, 257, 26, 207, 82, -3, -190, 103, -102, 267, 206, -36, -65, 54, -69, 124, 91, -114, -39, 202, 34, 202, 140, -269, -150, -21, 57, -25, 79, -31, 135, -349, -232, 75, 201, 83, -125, 254, -170, -124, -232]
6341b32L26jJ12p4N2l01rM0J41o6p7m8N8R8j74K15Q8j37q4L6l4oPl85P01j34j93
6368h1kp8J86n7j36J4R8N2J81l7j58K74K5k53l9O2J07K6k55J16J28N0l5RL2l06
6394g7O9oJ23q4l3Lq7M5J6j30m0j4J73j46J58j06J89lj71Q0J26j39j76L63o3q
6420F2j51k6o2K22K6k1P6l3j56P4j55J59J2P2L0j83m2K08L4Mk66NQ0p4j43L29
6446H1k16J27K24k04n6l8K24j81J94k23J13j05k61M91M8j52o4k71J17K15P0j92
6468e9K18l38jK43j29mk78M14Q2j31Q3O2J37l30L04j06j60J49l21K81j04j4M8
6491D6j57J06J27j32k04J30l5J67J77l15J74L8l3j34J70R1k53K02p2k2l57q0O08
6514B42l33J4n7J07J23j83l7MK9L49k65o0l5RL63j39o0n3q5K98j61j94J11r6j41
$$ y = [-232, 94, 93, 205, 131, 183, -118, -127, -87, 54, -12, -89, -137, -79, 19, -155, 60, 148, 11, -73, -37, -71, -77, -70, -455, 246, 112, -81, -83, -161, 25, -32, -168, -154, -56, -4, 177, 140, -18, 256, 281, 28, -11, 51, 158, 184, -71, 45, 173, 223, 188, 197, 229, -77, -8, -14, 109, 25, -8, -5, -92, -47, -31, -161, -201, -215, -42, -188, -30, -136, 53, 50, -121, -41, 85, -54, -230, 133, 70, 62, -89, -115, -177, 45, 71, 50, 126, 93, -63, 11, -144, 15, 27, 99, 129, -54, -96, 112, 146, 150, -116, -111, -31, -105, -248, 81, -135, -8, 216, 12, -44, -82, 142, -39, 155, -68, 45, -60, -321, 170, 218, 66, 2, -269, -152, 63, 133, -59, 159, -179, -180, 63, -66, -70, -348, 66, 148, 17, 100, 162, 299, -31, 273, 167, 7, 156, -165, 116, 12, -2, 46, -111, -5, 122, -10, -214, -84, -119, 48, 225, -90, 84, 122, 89, -45, 125, 216, -37, 165, 93, 71, -286, -366, 242, -91, -77, -134, -27, 96, -87, -124, -120, -91, 258, -7, -67, -102, -93, 270, 131, 71, 18, -67, 231, 70, -124, -13, -109, -250]
6539b50K33J90j71q6j80J46J63J33Ppr7k14j29L69j46k19M84r5l77M06m8l31O5
6562a54K37M1k69J01k56J85J78J55l50N8L09l28K6J20j71J66J17l8k09L15k32
6583AK4j61L69m5j61l2r3M7K6L70l38j04J11M3l1k97k8M23J53l43m8K0L9l1J11
6608B5j65L8J00J03n1j05L1r3j6K55n6q9j12j2J37p2K09n5j58K42o9k5k62L61
6632A61q1J04r3k94L89L0k15J07r2J10L7m15L02j64n9J13m1K1J58k44j6M2J23
6655a7k18K76q7J94J83n78J62k21L51O9P8j82J49k1j28K16j85J03m41L44k0J23
6677A50N6k67mL5K77j59o2Mj62r7P5J0J32L48j91l18p2Q5J94j87o8R2J18Q3j30
6702e8L17m18M24m8k74K15j18qR0j17j44o9P4O9J85k81J93J16j2O2n0k31kJ14
$$ y = [-250, -17, 173, 2, -84, -264, -118, 45, 178, 185, 178, 81, -133, -262, 107, -39, -258, 226, 131, -246, 160, 112, -219, -154, 83, 124, -145, -44, -300, -115, 63, 218, -132, -74, 235, -93, -67, 53, -118, 48, 165, 127, -82, 233, 1, 25, -136, 233, 188, 27, -5, -98, -51, -25, 345, 7, -97, 14, 57, 26, -271, -299, 124, 277, -66, -114, -94, -55, -86, 25, -140, -102, -2, 101, 50, -55, -24, -117, -133, 122, 66, -23, -135, -147, -10, -82, 127, 72, -86, 156, 87, 62, -200, 161, 80, 184, 91, -203, 186, 216, 1, 108, 16, 126, 163, -252, 50, -114, -173, -60, -101, -80, 78, -166, -182, -140, -17, -235, 41, -46, 148, 331, -247, -85, -306, 45, 114, 192, 10, 159, 138, 10, 226, 41, 144, -297, 47, 27, 150, 206, -61, -65, -30, 247, 88, 26, 30, -132, -229, -154, -144, -12, 336, 145, -173, -245, -160, 34, -153, -221, -129, -11, 72, -58, 259, -159, 265, 217, -57, 158, 40, 32, 122, 5, -139, -208, -134, -65, 120, -161, 32, 148, 136, 198, 148, -83, -85, 29]
6726B9n0l2J18mknl34M48r9J8O6k93M6J28k44J44Q3n6j82M60r1n2j88K18J17l38
6752i5m0j9N5N15m99kK20o5lj01J19k76K87r4m7%K02k7l76L55Q9l56j89N94k28
6777A9J89o8k47R7pR7O9k00K91k72j31K7k8K22J99k27O4L33l87j25M2L4j58R2
6801g5O9L09l15j39P0L46j68k57M01k16N4J07O2o45J92M67j60k38J75p6n5J51
6823E9Nk42L88l76O7R8M2n1j67K86k36K64m4l36N00l39k6N6p0J46j13L80k76J44
6847A59qm8k78R4K44j03J34n0k3l30O8J38l8M5J22k07J54P0Mr3M9k46J57m3k1
6872e0p4k9L80J2m02K34k66L55j00m3m5L73l44Q4k35K12Q8r2J48m35Q6K3MJ17
6896AK68j56l9j72k5Q4j7J70n1j44K11K0l00N4O2j58k24N99r7l03o1M64k66L19
$$ y = [29, -21, -53, 65, 61, 59, 54, -280, 168, 69, 87, 153, -140, -94, 34, -210, -66, 17, -39, -221, 239, 148, 96, -92, 126, 243, -95, -135, -154, -99, 416, -83, -85, 135, 70, 67, -34, 85, -191, 96, 2, -45, -45, 157, 130, -246, 109, 198, -158, -347, 247, 19, 208, 140, -107, -10, -17, 80, 149, -51, 240, -32, -163, -136, -164, 58, 257, 30, 94, 427, 40, -85, -43, -9, -167, -75, -6, 303, -12, -151, -81, 265, 97, -160, 241, 25, 79, 186, 248, -397, -205, 262, 102, -136, 39, -37, -92, 59, 64, -178, 210, -166, -99, -1, 41, -10, -177, 109, -127, 137, 93, -243, 257, -82, -108, -52, -122, 24, -89, 291, 15, 159, 151, 103, -175, -81, 163, 60, 194, 144, 121, -209, -141, -3, -41, 4, 126, -81, 73, 143, 147, 54, 103, -143, 14, -29, -50, -124, -153, 227, 239, -163, 71, -195, 160, 60, 17, -28, 345, 1, 85, -150, 62, 150, 58, 206, -229, -143, -120, -116, 1, 269, 113, 74, -98, -123, -39, -56, 114, 63, -81, 130, 150, -150, -96, -34, -192, -416, 183, 86, -217, -278, 186, -80, 239]
6920B39k31K5k0M0K17l09n4J88m4KK40m26K33j59J90K31m12n5O7J44k74M74k08
6943I8q0O1l30K49q9M23k31L3j17Lm3l36L51n90P00m01J14K72r9J11Rj76J70J26
6967B28k40q4J41j0j03m6L88r4l61J79jJ1m0K54k35p2J01q6j00j3J88L09l29P4
6991E9k57K43k89K41j3j61K22m6J25P5n8k84J34L7l2J16p1j00J63J3n7j07O7k09
7015a89J37j3K74m24R2m3J52k46R7K36k57R7K12l52j1J68K59k03l38M13q2j53
7037a74O2K38J8j65j2K80j09j29j46K30n5m9kk6p2K08k31J34Q6o6p9o9M0J2q3
7062a59K93m48K82K21q9k9K5j7P0k49j51J69K69m11J41J30k00J83j14o6K76p1
7084E5o6j7K18k44P6m9J83p7P5k55j79M53J31m75J2J08J88l84J48J45L31m25n1
$$ y = [239, 8, 33, 13, 53, 270, -39, -93, 95, 51, 53, 293, -133, 100, -59, 131, 362, -50, -105, -38, 106, -168, 306, 98, 18, 79, -251, -2, -91, 332, 101, 134, 17, 20, -23, -359, -8, -598, 102, -299, -185, 87, -12, 99, 108, -68, 102, 228, -12, -96, 45, 35, -68, -114, 274, 180, -181, -2, -3, 8, -32, 222, -13, -85, 16, -70, -170, -183, 5, 314, -15, 59, -198, 45, -244, -3, -16, -177, 45, -1, 124, 199, 141, -143, -9, 28, -4, 112, 41, -59, 104, 117, 60, -47, 20, -189, -52, -65, 209, -215, -123, -166, -14, -260, -163, 73, -184, -87, 125, -227, -238, -70, 189, -14, -352, 61, -21, -174, -112, 126, 144, -21, -33, 247, 138, 9, -137, 93, 38, -11, -13, -39, -111, 97, -134, 0, 86, 20, -59, -128, -88, -76, -159, 134, -314, -32, 189, 100, 71, 96, 79, 149, -100, -251, -82, 187, -224, -83, 47, -153, 30, -84, -150, 126, 55, -11, -28, 190, -54, 22, -27, 156, 79, 154, -101, -280, 173, 304, -171, -159, -51, 137, -247, -99, 46, 377, -48, -99]
7107i9J56j91J29N3k35L15Q9j28j52J78p4n1r5L41k80k3O4K7j18JK79j77O8k08
7131a31lK57j62j90L66k52J52RR6j65J88j07j85K9J34j15K9j27J40K83l36J28
7153C8J02k31j11K62j12J08J75r6q4j03L72l65R9m0j37j00J26p6J90j99K19J85
7175B22k51L52k89pq7J25J76l59l5K27q5J53o0j15j48L35l4J47m00J62J62J2l98
7198a95P6J28j16P6L6J62j40R5Q5j69k06K03J52n2k23K42j43R7j96K22J48l66
7220h4J44p1L24k12m0j16m6M7J65k66L79m32j20K14J02L14m17j28L99j15J5j62
7242a06l5J67j17K69j09j52K77k74K8k03N4L94m37M96l98J54M3M5j95J60M1Q2
7264A84K2k10J24j08m5K51l16r0L63l40K78n9J4j55K9J07M2j26K40l14K55r9j97
$$ y = [-99, 57, -134, -5, 48, -187, 128, 217, 89, -63, 115, 41, -10, -105, 236, -44, -67, -3, 24, -94, -93, 186, 9, 77, -131, -134, 123, -39, -229, 137, -115, 37, 46, 142, -23, 165, 58, -127, -98, 36, -79, -50, -177, -37, 246, -90, 38, 140, -91, -202, 60, -52, 56, 231, 135, 51, -52, 320, -45, 54, 14, -123, -223, -97, -173, 17, -182, 37, 222, -29, 323, 34, 27, -60, 65, 241, -118, -153, 74, -11, 142, 82, -33, -181, 154, 120, 267, -133, 29, 191, 203, -195, -119, 9, -107, -31, 5, 167, 27, 122, 207, 38, -168, 35, 187, 135, -88, 154, 11, 108, -88, 134, 282, -84, 60, -11, 313, 101, 61, -55, -101, -54, 111, -155, 224, -208, -328, -114, -12, 302, -115, -243, 156, 41, 56, -106, -141, 26, -91, 178, 69, -83, 194, -80, -52, -255, -201, 193, -244, 252, -146, 8, 51, 96, -99, 61, 102, 184, 206, -4, 120, 12, -33, 218, -98, -188, 175, -165, 113, 54, 68, -87, -58, 49, 91, -35, 205, -109, 146, 47, -150]
7287a50l1J43N9j12k6L13j43k3P5j31J51N2l46R1O2J3K9L6j20j62K80J92l07k03
7311b58J15K1p0P2k16K93nk4J5k79K70Q9j78k8K52o2J21K3n0j26K25k5O0j38k31
7336a34J93j53j6qj67L57r1QJ64k28J56j04J0N6R7P9j25k78P2m1Q9qL4j48LM25
7362B42j63j80j72L69j47K18j68J41j15l62M40j10J5K7j78K8J04K0Qj0J67k27
7384e3P0j83Q9p0K13P3k34J26j16m4L22j89j66j57J57oj5J44J31k44P3J52k25
7407a52J49k0j17J40J5J14j23L15j48M1j04m3j94L5R4J37J38l46K19Kj22J14l22
7430a78J83m4J20j66J22r3J16J35k82j24J5K17j2j80L12j94R7p1j07K92or1J44
7453B05k63J45j27j6K03j81P2q3j0MO5O8l22J60J04J6m4p2j43M28k75o2N9R8k06
$$ y = [-150, -181, -38, 21, -91, -117, 196, 53, 30, 105, -26, 125, 177, -169, -78, -16, -3, 26, 62, -58, -220, 60, 252, -55, -258, -143, -122, -192, -120, -336, -43, -48, -72, -57, -336, -66, 23, -155, -183, 69, 7, 128, 151, 101, -25, 200, 175, 235, 97, -134, 59, -94, -110, -118, -285, 72, -19, -11, 153, -75, 81, -23, -13, 43, 140, 219, 94, -184, -112, -153, -64, -72, -38, -186, -183, 242, 79, -101, -273, 96, -51, 167, -1, 140, 25, -337, 103, -7, 8, 35, -143, -115, -11, 9, 17, 7, 174, -53, 17, -166, -77, -147, 66, 139, -95, 31, -85, -129, 193, 4, -162, -319, -162, -168, -183, -39, 92, -152, -79, 73, -152, -3, -23, -140, 0, 15, 129, 6, 321, 173, 214, 110, 67, -127, -92, 2, 139, 277, -69, 150, 152, 30, 144, -178, 5, -39, 81, -85, 37, -56, 60, 195, -87, -211, -196, 21, 9, -171, 141, -53, 44, -27, -134, 158, 152, 61, 205, -58, 87, -40, -56, 147, -34, 38, -45, -55, -51, 14, 82, -240, -80, 24, 40, -4, -76, -219, 209, -66, -128, -69, 29, -177]
7478a77L72k72K33P5k67q1K88k84J39R5J53k35J99n5k53lk66J02K66K13l09o7
7500a34M37j24j94k28K02J59J4R2j44L2l85N04p6k09J54j10RL90j98k27j97K78
7522D5j66K56j40r7j68M57k42K7J25q7j70K65q5k81M05j16J61j68r4P0k61J37
7544a27Q9J6j44K78r4Q8k44K90k87J10K31j80l0Ml00K40j25J68J78LP5k92J46
7567I3k64K50k65L96r9k13P5P9r2j01J2J33j65L30m03J13M6l48P06k47K41m06
7589a29J95r5j48N2L0J03j40J72o3o6J69q2j96M13J00m81L09n9l8J42r4k8lj0
7613E3l30L71k07N7J27r3j02J94j38J27L2j37J95l91L42M7q7J34k85K78m84K71
7635b6J20j59M9K02k83M3J40j35nP0Q0J35N5o5k06j33J44R4r8p0N0J17j18R5L6
$$ y = [-177, 195, -77, 156, 231, -36, -117, 171, -113, 26, 121, 274, 39, 238, 183, -70, -73, -339, -237, 29, 242, -67, -134, 303, 179, -15, -243, -41, 118, 132, 224, 80, 112, -273, 231, 155, -54, 100, -10, -1, 389, 191, -36, -233, 45, -121, 135, -5, -102, -270, 187, -55, -28, 97, 10, -160, 105, 20, -261, 144, 28, 189, 21, -73, -3, -264, -127, -38, -22, -166, 112, 18, 106, -138, 152, -135, -25, 206, 26, -4, 0, -300, -60, -185, -17, 161, 164, 239, -53, 93, -171, 79, -186, 210, 111, -102, -27, 52, -40, -141, -129, 4, -161, 169, -234, -121, -75, -423, 283, 36, 277, -129, 66, -29, -177, -125, -95, 8, -132, 40, -23, -89, 80, -2, -198, 215, 315, -166, 143, 84, 46, 188, 94, 66, 63, 53, -277, 94, -113, -56, 71, -22, -124, 70, -68, 59, 91, -46, 149, -242, 100, 147, 60, 194, -91, 187, -297, -26, 94, -65, -16, 186, -97, -54, 86, -49, -54, 16, 96, 231, 286, 221, 15, -118, 26, 120, 22, -48, 2, 119, 1, 96, 132]
7660A32N9j48k16K54l3m0j02N2o3J80j45L47k97o6K4J00j36J33Q5N7k41J18pM5
7684I2p4oM0J97k17K3k3k7L62k55j94o2J97j72M52k96K40k92p4l9L33j30J10j7
7708A68l66K61j23K54r5j6m23L36r1K33j66J97j05k76K72k96L56p1Q5j49j37K76
7730A24j89O8L04n00P4K23K39l47J13q5l81K87L9j90K62J20k43l6L21k71J10K70
7752C12j84j10O9P9j45j41J95n19P7M85R0o8k67J85j41J24q0k83L38J12k00Rj52
7775b15P0J43l2j75K39q4L3J74o3K81m28K20k00m9J40j48j5L16J21l52N9n7l6
7798e8J99j40J96j92J56j91n0Q8J2j24K54l45L23m51N22k18k9j00J79n9R8k10
7820a40O0J51rr5p7K42k80J38J15R2n70L30j0J8j45K44l9J47J03m14K35Q1k74
$$ y = [132, 191, 43, -173, 81, 48, 8, -94, -42, -105, 75, -70, 277, -20, -86, -62, 38, -98, 35, 120, 177, -64, 54, 47, 92, 18, 12, 52, 249, 32, 55, 32, 5, 367, 112, -82, -144, 53, -119, 333, 37, 277, -15, -89, -128, 205, 75, 185, 168, -198, 63, -60, 194, 99, 83, -340, -4, -95, 138, -28, 169, 64, -212, 60, -236, 120, 49, 134, -15, -152, 124, -65, 3, 307, -193, -119, 104, 343, -4, 109, 24, -357, -70, -31, -221, 41, 161, -82, -118, 203, -68, 42, 312, 128, 18, 87, 166, 21, -120, 75, -444, -367, 118, 208, 140, -127, 58, -83, 41, -39, -322, 16, 128, -72, -63, -215, -145, -2, -34, -209, 30, -54, -21, 153, 90, 371, -57, 163, -37, -86, 54, -94, -109, 207, 328, -24, 35, -22, -58, 141, 1, 197, 5, 161, -30, -80, 8, 20, -104, 150, -195, 128, -323, 199, -19, -48, -148, 31, -28, 70, -140, -80, 71, 62, -33, -110, 132, -148, -10, 105, 197, -373, -43, -53, -35, -180, 64, 25, 172, 275, -139, 96, 177, -97]
7843i7J13j33K07K41o40K52J30q0J59j66J73k76R7L7J5J41j13q6j65l4J90K92
7865B57l58o1j49K85r8K07L2k22Q3j90L68J1o7q4j02K43j26J31m5k35J64J39j72
7888A1j67K03K97l01PK00j35j07K9L1n7K02j18k30L32p7j93l2j7K84o4j78LK6
7912e1k06P7K5M88l75J71p8o8NJ37k58L5K83k22K08m9p7l00J16J69j80J09K59
7935B18j40l39J51L34k04K42j23j86J8j64J82k17K89J4r4J55j67O7k15L05q0J24
7957A70k85p6pP2J60R0pn1J56j61qM4m15J89r1K37Kl9J28m48L42P6j53J34J80
7982B39k94r1L54k97m9m6P6k1P5l3M9N4j7O0q7L05l78J40k66J58J38l0m2O1j08
8007e0j57L9K46j1L1rj95m4M1K88l48K87j06j85k40M06j0j00J37J59j92j55J89
$$ y = [-97, 16, -117, 90, 331, -309, -57, 73, -7, 152, -14, 159, -117, -20, 17, 32, 173, 60, -26, -191, -225, -35, 257, -101, -162, -311, -26, -124, 83, 115, -107, -24, -214, 154, 165, 98, 14, -88, 155, 29, 160, 115, -120, 44, 183, 11, -156, 47, 344, 43, 50, 250, 115, 8, 37, 68, 11, 213, 95, -135, 197, 120, -73, -105, -122, 162, 98, -80, -77, -51, -257, -180, -155, 333, -42, 129, 51, -17, -12, 125, -133, -98, 185, -37, 171, 122, 45, -255, -139, 30, -150, -41, 218, 78, -261, -110, 224, 20, 262, 139, -47, -29, -193, -11, -228, 61, 75, -19, 136, -31, 36, -179, 126, 46, 170, -115, -191, -198, -126, 34, 124, 117, 66, 222, 61, 53, 97, -318, -129, -220, 17, 19, -20, 108, -340, 2, 78, -75, 59, 239, -55, -146, 208, -89, -138, -184, -108, -129, -54, -87, -38, 16, -1, 59, -28, 277, -101, 39, -227, -69, 69, 39, -3, 58, -50, -207, -168, 78, 67, 98, 89, -106, -150, -109, 179, -169, 118, 12, -173, -413, -7, -17, -117, 20, 179, -13, -168, 21]
8030B1k8P8k0Q2k18L7K20n7j66j08Q1K59l56J17J05n7J37k58J62l07K58k72L36
8053D6J2O4l2j66j54L36o1k70K76k46P4J65J92k62k02J43J5J49l11J70n8L35l92
8076a77J12N2j0j2J61P3o4j24K7j73J64O2l55K86J31j9l13N2K2K45k18j46J52
8099g2O2P2J1k77K67K05j01l34J23LJ04K0J46k24p1j1j5J45J62k10K08k28M9j53
8123a19J0J92l20M16l52L36k49J16N9j15J21l34L66j15J87j04l74M43m11L56k97
8144a88L61j58k70J40P9p3P7k1K1J4r2l9K79p9l4Kk28L16j90K81k84J66j13O7
8168C4O1j57J01j40J5K75j23P5k07r9j20Q7M20o0k8rk75L45j57n6m5j17K72
$$ y = [21, -7, 71, 51, 133, -85, -48, 172, 115, -51, -159, -78, 181, -175, -58, 47, -10, 127, -131, 31, -276, -18, -290, 46, 58, 122, 90, -76, -230, 106, 45, -225, 51, -195, -121, 44, 236, -26, -228, -85, -70, 79, -232, -62, -120, 215, -177, -65, -13, -23, -35, 126, 199, 135, 11, 38, -135, 29, 91, -264, 22, 153, 134, -179, -127, -105, 140, -78, -224, -72, -10, 62, 73, -204, 63, 268, 167, -167, -44, -41, 63, 83, 229, 5, -66, -77, -92, 53, 215, 5, 213, -15, 34, -119, -109, 83, -237, 179, -173, 163, -86, 30, 89, -26, 95, -239, 127, 12, 199, 95, -279, 164, -247, 109, -188, 173, 15, -255, -115, -36, -109, -32, -53, -32, -18, -110, -149, 130, 51, 17, 19, -209, 107, -83, 198, -86, 80, -33, 34, 95, -62, 39, -101, -86, 189, 66, 141, -66, -165, -285, -198, 222, 162, 134, 125, -150, 195, 38, -18, -63, -180, 92]
8191I2
$$ Imaginary data points
##PAGE= N=2
##DATA TABLE= (X++(I..I)), XYDATA
0@%%%%%%%%%%Qj6J6j6K4l2L8m6N6p2Q7j03J20j36J60j92K24k56K96l42L90m46
32b38N08n76O51p34Q26r25J035j155J287j434J592j763J950k157K383k628K895
49A517l188L513l871M267m705N194n746O372p086P910q878J0030j1429J3173j5413
64h340J8409k2657K9188m0631O6492k34732N322L02631k09123l5530J29309O2606
76F2944m7438L8188O856L3145L1182n3459r5478O3728L0432j05689j1471J01645
88E4585o2887r3856L2019L6343j3831J1322j211J0590K8344j972m227O2213M2551
101I9983n0710m0788M0479J71m5508L37j2203m4963M422p757l3418L9614M8009
114b332j9119J2262N2202j15k2468L9484M1924l9021m7917k540k1897k0554J7780
$$ y = [0, 0, 0, 0, 0, 0, 0, 0, 0, 0, 0, 8, -8, 8, -8, 16, -16, 22, -24, 32, -40, 47, -56, 64, -72, 88, -104, 120, -136, 160, -182, 208, -238, 270, -306, 345, -389, 437, -488, 547, -608, 679, -755, 837, -926, 1024, -1133, 1250, -1378, 1517, -1671, 1842, -2029, 2238, -2467, 2727, -3019, 3353, -3733, 4177, -4701, 5329, -6100, 7073, -8340, 10069, -12588, 16600, -24031, 42461, -192271, -186949, 115682, -93441, -128971, 338, 62944, 15506, 53694, 60550, 93695, 124877, 71418, -24060, 39668, 70100, -35589, -47060, 54585, -8302, -102158, -70139, -33796, -47627, -36305, -37516, -26926, 1418, -554, -4781, 57432, 99983, 49273, 8485, 48964, 49135, 3627, 3964, -8239, -53202, -48780, -56537, -89955, -50341, -2332, -21451, -9189, 43013, 42898, 20430, 59914, 101838, 62817, 14900, 12360, -9537, -30091, -12311]
127a2311j0767k8311Q804Q506m444R928K0030J8503j56p838R464O006J779J7228
141C6421N950j1931q870p778o971r375m187K696k0561k3656Q171M934P461K8804
155A108M692r215J5564J1631k858O880P145n144j9417j5117o792j0028M144R841
169g566j1717l138J2426n089R091K2580J476J033P68j5648k706J2097J28j1583
183B152q241o11o507q233J1402L653q513J0652j884j6197J7184J9424l887O409
197A6803P507p868m221M023R78q477o315m409k2329j1338J8126K017n932J4177
211g258J044m567J5519R233R76P831J721r986j2979j513N274n087l347J034j2156
226a4261k770P731l741O938J2826p672o950N264L909P205N882Jk345n699L41j038
$$ y = [-12311, -23078, -51389, -42585, -34079, -38523, -28595, -8565, 9938, 9782, 1944, 11408, 17414, 19193, 36421, 42371, 30440, 21570, 13792, 6821, -2554, -6741, -4045, -24606, -48262, -40091, -35157, -27696, 1108, 5800, -3415, 12149, 23780, 20922, 27802, 34947, 29803, 10386, -4731, -11523, -21551, -17407, -7566, -19283, -22421, -9995, -15084, -5993, 16587, 18063, 19096, 19864, 4216, 1510, 13607, 13735, 2152, -6089, -6700, -13207, -21440, -10038, -6385, -14898, -4246, -6130, -22327, -5143, 14281, 10394, 16803, 24310, 16442, 12221, 16244, 17222, 8745, 2430, -1979, -24308, -35646, -17520, -15503, -21435, -7258, -6214, -10781, 4738, 13971, 14947, 22778, 24499, 14513, 1534, 21, 5295, 208, -3139, -2105, -14261, -17031, -9300, -13041, -6103, 6723, -949, -7899, -2635, 1274, 8479, 14361, 14362, 12017, 6318, 6659, 5621]
242E621o481M279j280j5936m628n55l985J1680Q705j037M393N094L526N494L562
257A8452N336k821j3027p620o710m105O041m172q735L864J121P00P228N309O938
272G799K564q373j154L513J659L257k543k366J300o402k091N598j037n45l489
287b310j0570j036M166J751N587J208L84L878K89M588P338k322p82l173j1560
302b564l538p5j848J566k583k465M291J342M360Q409K730K394l180r091J810L561
318E119k776j954l882k354J223k326L088O681l65m77k878m604M407L120k308K020
334A734o36k125J397q03L697N767l157m082k776m499K060Q03k219J306k211j054
350f798M680J591M782N254j892k192j926m068K509K39l958j537k892j092K664
$$ y = [5621, -860, 3419, 2139, -13797, -18425, -18980, -22965, -11285, -2580, -3617, 776, 5870, 9396, 14890, 18452, 23788, 20967, 7940, 320, -6390, -10495, -4454, -8626, -17361, -13497, -12376, -11676, -4448, 861, 7799, 10363, 1990, 836, 4349, 6008, 9265, 6722, 4356, 5656, -746, -2837, 2761, 1724, 1179, -2310, -12880, -13916, -9750, -7999, -2412, -1204, -820, 3058, 3347, 7935, 15273, 12951, 12169, 8996, -2564, -6102, -6177, -8025, -6459, -9042, -11507, -7216, -5874, -1514, 6895, 9625, 12019, 8839, -252, 1558, 5119, 2343, 389, -3493, -5847, -4624, -6950, -3862, 2819, 2454, 1977, -901, -5505, -1098, 2022, -286, 1734, 1098, -1027, 370, -433, 3264, 9031, 5874, 1792, -984, -5483, -3423, -2620, -4839, -3533, -5744, -6798, -2118, -527, 4255, 9509, 7617, 5425, 3499, -569, 1940, 2179, -1779, -3316, -6208, -7300, -4636]
365d636J37M675N287k691j320l98j013L935M66m294J67j924k120J014O39L767
381A691K836n205j799Q12L2L218j84k801J440j553j510L307J329L051P82m943
397E03r32L02j333K445q16l162J11j378j28L508K628K900K18m410L64J063j314
414E69K389j397m326N92j228j431K975K139K285k21m317J507K196n96K060j038
430B158l186J054j949j064L938J240l98j752l371J843J461l87J772j118j945J917
446B13j619J014M322l50m55j164m259J017J557j847M27j165k065M39o2K741M044
463B788J14Q01j242k348L478J564l669M92j282l194r00p27R21K980n30o55r66
480b375n26L556Q54r86K665j729k361K157m5J326K466k938k304Q3j381M50L34
$$ y = [-4636, -4499, 176, 5463, 2772, 1452, 1054, 41, 3976, 4442, 148, 315, -1609, -3729, -2715, -2076, 1691, 4527, -678, -2477, -1665, -1633, 1585, 1401, -1400, 40, -1513, -3023, 284, 1613, 4664, 5446, 503, -429, -127, -1460, 985, 169, -2993, -2882, -4260, -4388, -880, 1748, 4648, 4866, 456, 820, 1883, 569, 2958, 1561, -2765, -2173, -3401, -4832, -1857, 282, 2567, 2346, -1971, -464, 1732, 1136, 3196, 2158, -1028, 26, -1923, -2987, 951, 2191, 1793, 41, -3330, -1487, -26, -413, 1359, 241, -1704, 213, -1406, -392, 3930, 3580, 3125, 1961, -2298, -1281, 276, -1571, -1144, -2309, -4374, -3935, -3997, -1256, 2788, 2902, 3703, 2461, 113, 3591, 5155, 1486, 1978, 696, -2498, -3398, -4125, -3204, -224, -754, -1409, -2375, -2901, 655, 1509, 523, 3188, 1459, -902, 1255, 1210, 2536, 5002, 2064, -240, -157, -1538, -1088, -754]
497g54j828k01j433r6J997k04L897L896k358k03J230k305K063L94l727j163j275
514b070k324k80P97K557J138k640J073K212N65K339n3j422J428k080k350J788
530F78J2M79P19l227j286J566q91R97K5j136P51j659M25L510K06P82J883k305
548A529K79J555j206N71r51l026q95j549j031K159M53R09J167j487J188K675O54
565B994P62j148j328N90k772j289K601n92j039j59j274P90K599o29R09K00r34
582B81J93j495J174K665j270j184M49k141J454N71j344R58m54k298L50r3N63K338
600G17k23J06O05r59J963J101o66J87j744k755Q61j489k31J701r32j043L70N07
618a924K085J732m70R39J49j358m7k79M06J401k724j594R57j297O60M61r04N01
$$ y = [-754, -2582, -2783, -4216, -4312, -2315, -2519, 1378, 5274, 2916, 2713, 3943, 1638, 3701, 4095, 368, -795, -2070, -4394, -4674, -3877, -1320, -182, -2822, -1749, 463, 1028, 3367, 3314, 1892, 3320, 1240, -1110, 678, 690, 1169, 1888, -1339, -2625, -1059, -1950, -953, -928, -2064, -1313, -2972, -2547, 963, 1169, 1951, 3834, 1529, 1808, 3363, 2157, 2728, 1777, -1249, -2144, -3693, -4724, -2565, -2112, -1203, -36, -1523, -335, 2340, 2994, 3756, 2608, 1280, 1870, -902, -2191, 410, -182, -1221, -1380, -2654, -1864, 735, 106, 1015, 1215, 281, 474, -1021, 153, 2818, 1548, 364, 813, -1328, 126, 697, -647, 311, -143, -2441, -2091, -2184, -1621, 717, 494, 600, 1205, 246, 2209, 3310, 2644, 2831, 1087, -1668, -807, -2296, -2527, -826, -1758, -2801, -2431, -1924, 161, 1893, 1423, 2362, 2511, 1153, 1106, 827, 1233, 2634, -90, -1684, -727, -2024, -1364, -903, -1807, -1306]
636a306J24j236J151J157J885L73j248Q13Q60j507J248O29k360k24r61k575j10
653c287N03M62N64p91Q59J034N48K132J178j510J301o29j686R86k37q14J12k737
671b012n33J308m02J41M83k23O97p37k65J885P14J060K24j839R05J738j818J56
689A482M99j792j127j354n43P92j80K55P53j031J407J752l2J640N59j483J39m01
707A335q34N42p86p64n32j452M11J255j97M44N06l59M96m33J25J620l40n02M02
726I37q35O53O47j162P60K36j960l17o32K99J037q92m35J253q61J457J187k22
744A150Q13l87j038K99k81l88K78j322p84L05l68R22J178m78Q94K41j008R16k58
763F84k18R21j310r01M19n10P47M93p47N66O5q14N8P08j3N45j101j54R13n36M36
$$ y = [-1306, -1182, -2418, -1267, -110, 1775, 2148, 900, 1713, 2573, 1066, 2314, 2943, 583, 359, -602, -3177, -3287, -2784, -2322, -1758, -2549, -1690, -656, -108, 2024, 3202, 1692, 2993, 2364, 678, 1664, 1427, 613, 725, -2012, -2545, -1237, -1639, -1498, -1015, -1238, -541, -1278, -1543, 342, 1056, 2116, 2340, 501, 1406, 3144, 1326, 1482, 1981, 189, -938, -2292, -2835, -2043, -2223, -1968, -1215, -2246, -839, 913, 881, 2521, 3080, 1597, 1736, 1335, 501, 1043, 257, -507, -1039, -2491, -2080, -825, -1022, -578, -72, -431, 65, -368, -243, 1377, 1037, 535, 937, 102, 755, 1402, 240, 1000, 1236, -724, -1041, -1673, -1374, -337, -1229, -1664, -411, -1272, 185, 1372, 1150, 1963, 1576, 538, 837, 556, 168, 446, -876, -1660, -1355, -1723, -801, 377, -101, 793, 1034, 26, 942, 684, 466, 1387, 77, -824, -405, -915, -168, 325, -422, 144, 209, -605, -547, 161, 148, 693, -408, -562, 351, -185, 251]
784B51R43q17N00m30j259P57R3l07r7p43m56Q70k86R99P82k48N39n6o89O81j3
805A014m20j31j256m92M52k74rQ96p20Q71r9k64J436K10m88J0n21J2O58p20M2
826B07K58q45K14n18l98J184l34p20K46l21K60J062j52L12R46p44M06l08o8Q31
846A518q66r34r6n78k44O50m88J88M84p21O89O36m51J160j78k14J06o65K8O79
866G03q32M52m09l63m9j84j9O96k84m50J12J52N50N97n15N54L79r70O49M8m12
887D05O62j345l26N08m41j61N54m83O14n6m52P26K5J68L42l26l80M89o05K34K40
908C92o51L36pn75L50J34q4K25l40k34Q54n56K33M36m84K38n8l67N80L7m79M20
930D00p20l16N23m04O9P18j07J96L9l37P20n1p96N15q36l24P01n75J92K63q4J77
$$ y = [251, 1194, 377, 877, 447, -812, -55, 38, -269, -366, -1109, -1565, -695, -981, 18, 800, 552, 1091, 1035, 346, 1027, 1014, 594, 463, -793, -1285, -833, -1107, -1116, -220, -940, -69, -168, -432, 1004, 1214, 726, 736, 215, 227, 885, 165, 207, 465, -380, -166, -684, -1082, 102, -232, -952, -706, -1027, -767, 295, 143, 455, 1401, 657, 1063, 755, 687, 1518, 652, -282, -378, -956, -1200, -550, -1038, -850, -366, -1087, -398, 238, -213, 947, 769, 555, 661, -4, 24, 703, -129, 323, -86, -449, -498, -682, -701, -5, -289, -739, -627, -475, 75, 672, 157, 711, 1090, 120, 769, 817, 405, 1067, -278, -604, -96, -537, -698, -144, -627, -13, -69, -521, 205, 230, 398, 740, 414, 34, 523, -82, 152, 392, -259, 77, 70, -505, -155, -21, -105, 120, -220, -454, 400, -156, 77, 513, 29, 267, 209, -158, 422, 459, -20, 400, -320, -636, -113, -517, -448, 270, 163, 359, 398, 61, 781, 730, -66, 449, -387, -711, -10, -585, -393, -130, -214, -37]
952c7Lq6O38J91l22K08p61J24j21k76P08l9o82J39O8j31M27p0m82P08o58j48O65
975F6k02J82L30l53K81J66K8N40m45o40L82p73m20K72j46K18M12l91Q68k39j31
996EO96j25p7P8j54l27K62o99M35j87q07N17N40n33P50n10j63M15n88K87L42m55
1018b98N51L28o02M89k8J4l7j89l95M28o38j42K74n72M84m8j18M00O58k75M22
1039G06k98j89N03q24J38K41o10K33j25m29N15K6k29M48J62l66N27m35k70N82
1059C06p33M84M3o71R17P7j94J82l99k06M26m73j1N51l73K04m4j44J77O6K71j31
1081C25j27n1L38p83O0N35o13N29J03m26K92k3l4L44k55q5K51n72L25L19o91l
1103b42q3k0L27K01l71L32o1j85L23m89J60N24m82M78k86q7L59k25k22N9j49R3
$$ y = [-37, -34, -120, 518, 709, 387, 595, -166, -42, -163, -439, 269, 230, -452, -313, -245, -376, 51, -19, -501, 207, -451, -599, 66, -136, 46, 376, 23, 304, 470, 498, 1038, 593, -47, 335, -438, -858, -586, -732, -514, -102, -493, 375, 136, 5, 701, 576, 499, 577, 423, 96, 358, -341, 94, -93, -900, -383, 157, -376, 374, -136, -299, 116, -472, -185, 157, -298, 253, 581, -21, 468, 440, 454, 417, 228, -167, 261, -377, -519, -245, -817, -333, -381, -499, -99, 559, 284, 706, 408, 219, 722, -102, 36, 277, -333, -100, -225, -654, -139, -113, -342, 106, 268, -98, 429, -6, -276, 306, -427, 57, 100, -571, 346, 423, 229, 411, 12, -194, 232, -241, -252, 299, -74, 130, 86, -58, 119, 185, 456, 325, 198, 147, 485, -298, -238, 297, -316, 213, 316, -110, 182, 159, 125, 469, 214, 129, 380, -192, 133, 452, -239, -242, -325, -345, -18, 183, -188, 144, 83, -102, 221, -268, -108, 416, -66, 412, 126, 39, 398, 173, -49, 10, -139, -46]
1125d6K98p52J32N53n55L16N4N7J45J56o0L81n24j56L86k67l49q5l05K33J42k47
1147d93P41n75J20N85l63m5K86k10L07j56j98Q0K65k08k6j58l64L22k55j75K02
1168c18j19k6L06j97M07P5K0L22QK5L21o95j18k5j33q1n5j59K3L51m34K81L63
1191A42k11K68j13K6L22j89J15l8m52J84J88k49J52r0l86K32J62k60K44l95K79
1212f9o6k27N38P2RlJ68r6m1l33k40M47o55J66k38J21M79J45l51N74k36N0Ln6
1236A61j60q2p7O1J35n81O03m91J49L41k92L36M8l58L18L2j18K19o4j72l11L40
1258C7l65N38l19rL32l13q8L74k46R1J46n27M59K1j95L46l3O4k28k10Q4K51m98
1281b88n2K0J1J21J9J00L02K3l7K08l46M09j29j30J2k44l33J75K15l83L64l45
$$ y = [-46, 252, -500, -368, 185, -370, -54, 0, 57, 202, 358, 298, 679, 155, -1, 385, 118, -231, -316, -621, -388, -246, -493, 248, -327, -207, 378, 15, -30, 256, 46, 353, 197, -1, 79, 344, 136, 110, -48, -412, -90, -345, -520, -318, -437, -463, -157, -354, 53, 128, 148, 470, 478, 503, 824, 129, 11, -14, -147, -228, -283, -442, -419, -68, -502, -221, 142, -69, 199, 86, 112, 434, 245, 360, 322, -130, 54, 242, -7, 145, 55, -331, -99, 63, -197, 47, -348, -69, -135, -362, 176, 248, 257, 254, 422, 326, 285, -48, -288, 159, -496, -330, -568, -447, 32, 177, -174, 400, 164, 214, 217, 161, 1, -81, -158, -97, 38, -543, 60, -431, -282, 59, -233, 103, 151, -207, 111, 143, 25, 244, 180, 8, -303, 37, -328, 210, -109, -118, 214, -99, -187, 187, -59, 32, 178, -349, 110, 131, -64, 282, 249, 313, 85, -125, -41, 210, -288, -340, -320, -309, -188, -169, -69, 233, 256, 219, 427, 81, 490, 361, 231, 243, -1, -334, -159, 56, -327, 37, -308]
1303c08N4K28k36J45N4m4O32k60j27PK43k08M21m57RJ14l10l3l36j11K33R4k54
1326d50K37n2M48J07k0k7K33J10j86k41q5%m8l84J10Qq1K1JO1M67l00lK3K44p8
1352A15Q9k27P38p24J28M61n58Q1j15l50M41O0o44L08J62l86N86Kj23Q0j62K25
1374A87m4o7N3j08j67O5J77j84J84Kk11L19l48L08K12l56L31k81L4J20j22l8j06
1397d0j08N4M7J75j14J06l12j7K06k13L69k22q1K88J24k23n3J10j68J38k01j01
1419b36L33j23j90M16k57J32j52J4j6K06R6j82k83K38J35k49j55j09J4Q9m8J29
1441a98K37m30P27k17q9n8L89l35J36K16l45K05p8k71J28k45J67O5k99P5j49J8
1463c51K52K26j46p0J10K03K06m87J05N15o51J44J35o62L57N9m47K77J33p7R8
$$ y = [-308, -254, -26, -262, -117, -63, -107, 525, 265, 138, 145, 388, 180, 601, 144, 153, 267, -43, -76, -412, -523, -290, -196, -450, -213, -265, 183, 290, 270, 243, 476, 586, 400, 159, 74, 74, 26, -358, -248, -240, -321, -300, -299, -238, 229, -71, -74, -51, 193, 115, 204, -23, 715, -9, 119, 580, 22, 103, -12, -362, 79, 139, -505, -197, -35, -421, 165, 167, 44, 124, -38, 187, 143, 76, 129, 21, -146, -81, 96, -88, 96, 98, -113, 206, -142, 166, 378, 22, 353, 72, 106, 226, 104, 66, -40, -148, -94, -47, 128, 14, 120, -192, -209, -3, -216, 153, -69, -150, 138, 262, 39, -14, 96, -72, 66, -135, -236, 97, -26, -216, 200, -57, 75, -77, -63, -79, 127, 223, 41, -242, -4, 131, -118, -273, -382, -368, -279, -327, -198, 39, -391, 336, 119, 30, -28, 361, 26, 162, 378, 33, 238, 160, -111, 17, -228, -61, 4, -295, -220, -369, -351, -99, 127, -19, -89, 21, 224, 430, -57, 48, 563, -88, 56, 191, -471, -114, -55, -502, -225, -92, -169, -71]
1484g1K96o7j13L08oN3l90K56k09j19J61j80k9n5R7N0J9o8r4J18M9K08l20J64
1508E8M04n20j22N45j77j32K08m33J96j99q7M11l14J37L4q6k2M23k98K5OK11n39
1531b71J35PK43O6m78K21J86k41K88k04n6M95m79J15O9k2J33j80j28P9k4J8J11
1554H3j52q5M99m49p3q6J37J98l82O07j56j93J2K10k44J24k6j91L09k63J61k29
1576a89J21j17K49j82J87k4pN6J37o1q3O6j43l3j74p2J45l45M51MM37m74k54L13
1600Hq9J64P2j47L37j22J0j49J47r7k66q1K00oo9K38l71J01j32L42j57J27k84
1623b24J77L07M4o1m33O28j94o25L93j43n9n6K67q6KJ10K21l95j70M71k25k5J0
1646f6L19p4J3k86J77K31n19J70R6l30M9J26j36J88n2j6K10j1n8L13k63o8J10
$$ y = [-71, 225, 158, 45, 353, 347, 400, 10, 266, 57, -62, 99, -81, -110, -165, -68, -18, 1, -67, -161, -43, 6, 214, -106, 58, 462, -58, -180, 365, 188, 56, 264, -169, 27, -172, -259, 152, -162, -25, 9, -77, -99, 324, 26, 51, 57, 268, -271, -136, -129, 114, 180, -298, -77, 109, -132, 156, -48, -104, 391, -88, 27, 96, 74, 207, 27, -101, -22, -46, -28, 83, -69, -154, 345, -104, -177, -263, -126, 72, -310, 297, 141, -52, -40, 170, -74, 50, 24, -167, 142, -121, 40, -189, -68, -185, 64, -118, 69, 45, 38, 94, 231, 170, 87, 153, 10, -23, -197, -269, -124, -469, -18, -14, 423, -51, -305, 8, -81, 83, 155, 8, 345, 223, 233, 84, 231, 134, -132, -213, -13, -19, -88, 150, -221, -120, -252, 90, -67, 60, -224, -47, 260, 304, 243, -190, 438, 244, -381, 12, -131, -190, -246, 21, -65, -63, 47, 268, -127, -297, 174, -51, -76, -66, 253, 179, 192, -94, 83, 314, -205, -35, 61, -269, -220, -94, -230, -42, -94, -110, 100, 89, 31, 344, 81, 13, 123]
1669A23k3R8j34n06N10j78k02K83j01n2L73k14K6M3J29l5q5k91L60k06j62M35
1691A91l10K55M6k44K43m1j38J44k38J65J3m4n6J53l48L77j86j26N6m5L2J5L4
1714e2j17J63P5j51K29N0r2J06K5k66J36m5m1j95j55k5J26K08k05p1K61K69n23
1737b90K85l7K3L09k62L8l83L02k03K35j40j46K67l60K50J77k42J0L87j01P2J24
1759C15k14N9R9k91K32k3j64J30k41o2J37r7jj88K43j3k8J69J80k91L86r0j22
1782A25r6p4K29j57m3L9r8LR1k34n0J71J15P0l77J13J25K60Q2j11q4k63K42j89
1806a11J02r6K39k35p4Q0k91M17k90L80j10k14M81N5j72j34p3J81n2j79Q2m7L58
1829B97k74J48m46O6K72k49O4J04J34l00J70K20k29J28p6Q9j80J20K4k89J16K44
$$ y = [123, 100, 198, 64, -442, 68, -110, -312, -29, -130, -182, 191, -23, 3, 46, 175, 140, 55, -236, 124, -82, -244, 191, -119, 136, 182, -62, 181, 140, 2, 146, -92, 73, 86, 42, -14, 139, -209, 168, -18, -144, -88, -133, -101, -86, -52, -169, -6, 69, -82, 147, 197, 105, 211, 236, -30, 106, 61, 20, -175, -330, -355, -229, -21, -226, -297, -36, 233, -290, -5, -42, -19, 290, 28, 66, -317, -15, -218, 17, -123, -269, -2, -362, -112, 65, -177, -167, 220, 119, 191, 315, 101, 160, 259, -32, 200, 177, 13, 143, -98, -160, -23, -120, -121, -309, -66, -79, -107, 62, 242, -49, 337, 247, 125, 29, -45, 184, 27, -16, 23, -75, -72, 19, -215, -265, -94, 21, 91, -286, -173, -48, 212, 294, 183, 99, -164, 78, -111, -9, -105, 134, -101, -175, -95, -386, 31, -259, 121, 11, -203, 278, 333, 161, 27, -46, 135, 83, -96, -14, -61, 297, 23, 171, -275, -209, 63, -186, -122, -18, 116, -184, -14, 206, -23, 105, 29, 118, -62, 58, 82, -207, -91, 153]
1851A53r9J36l00K38r6q8L36k63j64p2M02m22L50Rj42J96j52qL7j12Q6J70m36
1874b41k2M37K14j82j56J44o8k64N4L76l55Q6K14k13M0M5m27L70N5j29J26j58
1896e4m2M93n79J98K2r1K51m9j95r1L03j77K1j90L19n42M09P3K55l96K86p4p5
1919G5K45j41o7m6j81K6J68k06J12j39J12J65q0J53j87k20M03K4k31L07l63m4
1941a15M1R2K07m28N25p33M03K0j81L46m41K43j32Q0J73j47R5J26k68R6J18l26
1963b06M3K32j60N8j55P5M2J88l32J41L8J49P5l50L55j84j06K65k51O2k07K39
1985A1o9K3j86J18j12k7L58p0N8k24K14J07j17m4R2k8P5q0j54j39L61p8j85rR6
2010il38N31k6k93o1Q3O2K51Kj95q7j49L52j93J68j29j63L54J07Q2j72k82Q3M3
$$ y = [153, 54, 190, -110, 128, 32, -56, 280, 17, -147, -219, 183, -239, 111, 120, -22, 174, 22, 14, 51, -61, 25, 195, -241, -263, 174, 388, 206, 50, 194, 126, -138, -84, 292, -63, 23, 237, 24, 64, 109, -318, 52, 107, -22, 104, -54, -96, 397, -182, 16, 38, -53, 198, 149, -46, -137, 166, -11, 10, -180, 139, -403, 6, 79, 334, -62, 224, 150, 75, 320, 179, 112, 66, -115, -89, 79, -127, -15, -154, -42, 123, 43, 196, 9, -211, 192, 216, -15, 292, -71, -115, -74, 18, 225, -203, 322, -411, -8, 12, -169, 177, -264, -21, -153, -73, 100, -47, 48, 174, -94, 2, 120, -206, -163, 69, -91, -33, -188, -113, -71, 117, -215, -74, -36, 113, 188, -162, 193, 9, -97, 168, -83, -21, -228, 11, -58, -35, -221, -103, -215, -242, 116, 46, 104, -120, 94, 201, 84, 40, 132, 104, 179, 99, -55, -194, 167, 89, -96, -105, -9, -347, 184, 158, -135, -196, -113, -51, 200, 202, 7, -80, -229, 123, -70, 98, -31, -194, 160, 267, 349, 177, -105, -22, 21]
2034B1O2Q3j94Q3j04j63n9K51K01j36l74J08Q8j42L11J53j57J37j94j21M15l9
2056B30l93P1j37L91k01p7n2PO8J06j23M2N5J90k39L17j78K6R8l52K71nj88J86
2080A13k23O0R2k30L27k50J16r9p1P2M8K97j58j14j03K12j09j62K3OP3M6n7l45
2104d36N34N4r0Mk40J67Q3k40K93q6R6pP4j34L4r2m1K36k06J22j20J0k2p9K9K00
2130A43j89J83K18m58m7J3R6J20k02p7M29j11p0k30J82j35K79O4l04K57k33j49
2152b21M94n05J19K46k84L09p1J43j84J60k38j01n2K36p8J81j6j26M6p7K15j33
2174F3j38j39P3J20O9K7q3l00N19j12k02L16r4k98Q9p6K39j5Q5m2J7j34N5l75
2198c36J22L83k10KR3K07j40k7J49k96K08j30j72K27j7k0L2k38J68N8Q2q5j73
$$ y = [21, 83, 166, -28, 55, -49, -212, -271, -20, 181, 45, -329, -221, -133, -275, 36, 189, 32, 169, -25, -146, 269, 230, -163, -92, -229, 162, -39, -116, -168, -161, -93, 13, -110, -68, -13, 177, -62, 255, 77, 103, 201, -151, 120, 115, -73, 113, -110, -50, 42, -188, 139, -111, 5, -94, -165, -93, -45, 252, 94, -20, -123, 89, -20, -182, -159, -153, -80, -34, -91, -436, 98, 152, 62, 66, -174, -7, 76, -164, 129, 43, 139, 132, 206, 72, 106, 14, -27, 209, 3, 125, 5, 15, -7, -86, -57, 143, -46, 137, 355, -103, -150, -137, -41, 79, -123, -200, 229, 118, 48, -182, 0, -135, 144, 208, -96, 161, -72, -221, 273, -232, -113, 133, -151, 158, 87, 230, 46, 206, -32, -133, -185, 51, -27, 154, 138, 12, 58, -19, 196, 63, -75, -214, -141, -21, 48, 75, -8, -308, 211, 99, -103, 213, 119, -179, -90, -166, 73, 58, 143, 101, 118, -16, 39, -336, -214, 169, -41, -39, 54, 261, 121, 94, 243, -53, 155, 25, -147, 80, 63, 43, 75, -163, 5, 63, 145, 60, -113]
2221a13p7J60J11k88M20j71j93M1K23K10o59L56k05J64n2o5R8r3L20l40k5R9K35
2244A56j05J44k10p2j2J19M7j00o2p4M5K82m48K40L3J66j38j07N0nn6K43K07m81
2268a38j53O97o78K04K54l42L85n5l62K54K47j78j87K19J4n7j2q2J40k21J26k28
2290a53k6K72j69jK13l18J46P0j5R8j62m1J13J87l49J96j47j28L82n0q2l70L76
2313D2P9Jj94J5P8j16J50K1k29L8O9j15J28j96K77J2m5r2J13k31J35J46N9j92
2337d7O3N7n7k4J97O3K6l86K52m2j95K80k55O9k16J72J5l25K95O6J43l93L25l23
2361b40J22L10L16o39J30j86P6K51j42n5R4k21J68k38K08J98k28J90J24n72K26
2382a08K9J84j28J23n7O2N8j16K1l62M49K05l76l3M4k97O37m26J7J99k99K49k07
$$ y = [-113, -190, -30, 81, -207, 213, 42, -151, -110, 113, 323, -336, 20, -185, -21, -73, -138, -40, -133, 187, -153, -178, -79, 156, 51, 195, -15, -87, -99, 20, 67, -33, -95, -169, -124, 158, -290, -50, -17, 149, 11, -96, -46, -51, -107, 136, 343, -138, -291, 406, -272, -68, 186, -156, 229, 174, -188, 66, 313, 135, -52, 167, 181, 124, 112, 30, 170, -51, 75, -153, -179, 93, -76, -77, 136, -182, -36, 34, 19, 117, -45, -86, 27, 214, -135, 61, -86, -214, 168, 118, 36, -334, 42, 121, 122, -72, -57, 21, -95, 55, 76, -153, -115, -46, -161, -33, -229, 48, 60, 15, -77, 36, -195, -60, 86, 145, -47, 16, 73, 16, -8, 189, 252, 278, -108, 144, 102, -93, 187, -68, 1, -215, -43, -28, -353, -58, 8, 151, -242, 83, -240, -118, 192, 508, -131, -1, -187, -111, 140, -2, -57, 37, -184, -16, -254, -46, 152, -76, 114, 238, -334, -108, -79, 105, -23, 100, 43, 105, 163, 47, 68, -294, 155, 360, -16, -49, -5, -302, 335, -91, -74, 125, -174, 75, -132]
2405a32k6K14J25J42l47j5j63k1L14j75l12N31l98J44L13k55J27j46J58l30J99
2426e3j12L46k7J3P9j33j81j68J77K2K49K0j25q0N7p4l4M87j93j85N5k15K48L9
2450B12j28j10o4J86l27K27o8M5K20k59K4r8K83j49k10K9J52N5l5M1L0P4l10L85
2474B05k35k17L91j45K29j29j62N5PK51l35j7J9p8J81j4r0J62K38m31R0N5j90
2497a60O2J69l5j51J80K8k47J42k6N3k07J37j04J10oL10k46k30J44R3M3n5K52
2520B56l12K30q0j14J64j68P2L9k38L21j15l9oo7J52o1M2l10K34j0m5M9j71J60
2544a7J30j77l33M40J90m75J28k47N26m97L76J5k47J40K23L7j82p6K70j23j45
2565d4o0J91l14k9J92k88M40j02J90j87k10J18J34L2l7j66O8L45l19n6L19l93
$$ y = [-132, -158, 56, 181, 323, -24, -39, -202, -223, 91, -84, -396, 135, -263, -119, 194, -61, 66, -80, 78, -252, -53, -165, 181, 154, 167, 246, 113, -68, -236, -59, -37, 212, 232, 107, 27, 84, 10, -24, 463, 270, 85, 140, -75, 173, 212, 84, -26, -90, 96, -231, -4, -72, -27, 193, -66, -42, -140, 143, -6, -216, -187, -35, 20, -15, 26, 56, 130, -180, 205, -30, -247, 144, -1, 228, 99, -63, -8, -1, 250, -85, -102, -83, -161, 20, 6, -84, 78, 316, -115, -25, 30, -160, -98, 71, 36, -115, 65, 93, -154, -12, -38, 15, -192, -55, -159, -49, -55, 255, 9, -221, -77, 16, 59, 4, 256, -56, 174, 94, -20, 144, -24, 48, 87, -151, 170, 55, 16, 10, -57, 95, 34, 76, -234, 0, -10, -55, -6, -177, -17, 113, -64, -397, 43, 233, -242, -114, -361, 165, -332, 44, 59, -188, -48, 175, 212, 30, -46, 224, 101, -44, -104, 87, -227, -256, -64, -352, 88, -14, 176, -11, -221, -103, 31, 63, 26, -140, -72, 273, -46, -102, 217, -176]
2587a76J00K18P5k79K31o3j5k92J57J84j57k8J27J38l66J04J85k11K98l34J17
2608A3p4j9J64%L3M28l97k50l2j00K37j60J60L6K0l85J70K53j63J8o4L84l85K06
2632I3q9O3r0J08j02j24J69O6r6k86N44m09K60j69N4M6m5m9K6MJ75k16J23r3m0
2657g7K8k6P0K1J99j81Pj85J31K4j4k77L58j9P8n7k65L13j59q7M6J58Mj65q5J97
2683C7j2Nq6M7N2J48j16n26L81P1q2J36J73k23J37P1j04j66l7k40L85k31L01k32
2707a11L9O1l43L44K00l24j64L00j01K2k9K3L52j28l59L26j00K1k61L5J43o4j05
2730b23K24L3K16l07o9N1k43L26JP8R1j32K0j09M7jR5j48K87j96r0K49l37N9p8
2755a56J67J22j12%l6j35K65k82K02J85n6o1j22J11j43r3Q0o6L4j74J18J49R1
$$ y = [-176, -76, 142, 217, -62, 169, 106, 91, -201, -44, 140, -17, -45, 82, 220, -146, -42, 143, -68, 230, -104, 13, -61, -80, 84, 84, 117, 545, 148, -102, -134, -234, 3, -157, 3, 39, 59, -326, -156, 97, -66, -48, -112, 272, -113, 93, 4, 67, -23, 85, -17, -141, 28, 94, -2, -288, 256, -153, 107, -62, -8, 38, -7, -56, -30, -26, 149, -67, 56, -37, -77, -49, -75, -5, 16, 215, 34, 41, -144, -13, 11, -3, -280, 78, 59, 137, 80, -185, 128, -31, -118, -72, 86, 90, -75, -160, 37, 25, 30, -56, -9, 43, 191, 75, -451, -70, 1, -81, 55, 228, 5, 142, 213, 109, -57, -94, -334, 51, -180, 121, -111, -72, -11, -354, -10, 190, -134, -298, 2, -99, -77, -106, -83, 269, 141, -218, 108, 8, 29, -232, -197, -54, -118, -223, 1, 34, 250, -57, -126, -75, -318, 8, 9, 87, 178, 46, 66, -43, 4, 3, 98, -50, 237, 41, -49, 200, -137, -78, -156, 11, 133, 21, 21, -15, -150, 115, -167, 35, 220, 164, 103, -19, 92, -51, -144, -64, -130, -96, -270, -152, -3, 88]
2778H8k17k09N16P4k11k22K32J96m14K30Q2j31Q1j33O5j6r3K51n1m2J28l60k0
2801a76k7L81j85k40J52J11J4J9k2P0nr2J37j85rj86J06J5oJ01j94n7J98q3L09
2826A46j20J21j01j64l7J37J43q3l92M40Q0k83J3K18J34j51nk0r2K03j2l63M2
2849a46Q6J56j74J60l02J46K5J22r1o9P4J48n03J2J97J48q3R0l8j67J9J04j33
2872b19K80o0J43l19L37k97K39n8m1L67n21Q8N9k11O0L93m82J50J89l1P9j44K10
2895B11l23J39L5j03K05k63J00Q4M1n4J8k25L24k25K93l68J82K11l78J55N7k05
2917h9J01K79m75J23R2N7j37M3K59k34j99K20J97k93L0k08L64l34L51k3k07J8
2939f5K1J13J31k10j8m0J17N9j17N3k00J13K99n41L22j6J61j90J1o8P7l68K52
$$ y = [88, -129, -338, 178, 252, 41, -181, 51, 247, -167, 63, 145, 14, 95, -38, 27, 11, -82, 169, 118, 76, 204, -156, -176, -203, 178, -7, -247, -95, 16, 30, 49, 27, 97, 92, 0, 137, -48, -57, -243, -137, -122, -128, -27, -221, -278, -80, -163, 146, 26, 147, 46, -118, -155, -18, 125, 42, -350, 90, 170, -113, -100, 118, 252, 101, 96, 76, -16, 187, 175, -188, -146, -60, 96, -78, 82, -220, -74, -49, 73, -18, -87, -13, 135, -368, -356, -159, -11, -94, -4, -42, -209, -190, -86, -219, 61, 1, 144, -175, 162, -135, 104, 46, 5, 372, -149, -61, -2, -213, -153, 240, -242, -92, 97, 66, 145, 1, 211, -112, 27, 62, -41, 164, -99, 1, 85, 126, 72, 90, -135, 189, -36, 257, -111, 71, 282, -96, 59, 116, -89, 12, 291, -184, -61, 31, 88, -49, -6, 253, 19, -180, 40, 237, -56, -26, -234, 130, -204, 147, 124, -83, -65, -44, 69, 200, -10, -28, -68, 49, 108, -9, 44, -156, -43, 256, -285, 37, 21, 182, -8, 3, -65, 12, -356, -104]
2962a04K95j81k12N9J42J00m21M20L1Ll05J8Q3k15K38k13J75k01m8L91q6j0r4
2985a35J50O3p5k30L59o9n2K3J27j48J88k97K09l87J48J18J35k23j66L63pn3l94
3008c53M82q7ml01M38j11k62J99mN0mK13k42j21j52K32J50J1k41o2j65J84M88
3031C38p0m26K28j41J30j42J37k6K4j87L7L66l24j1J14j19K8M57o13L71j41KP4
3054A06j12J5o1j47J79o9J63M1n0N8k52O5R9J5k37K93pj91J11J34j67J97m13L62
3078A32j41Lk11L4R0K41Jm54L19O5j22o1j12M05%J70l25L3l79M78k43j39J04K95
3102A83l41R9k7N4J34q1J16r6j85J14o8K53l39K89j14j52J64P4j62J95on1Q1j12
3126B2J6j31J68j39l7J02OQ2R6j99J20j70K18p3l9j57k1K83k01K06k21L00l87
$$ y = [-104, 191, 10, -202, -143, -1, 99, -322, 98, 129, 132, -173, -155, -72, -287, -49, -262, -87, -288, -336, 55, -31, -41, -135, 15, 78, 3, -227, 132, 63, 11, 34, 161, 13, 201, -96, 113, -274, -126, -8, 127, -96, -262, 101, 94, 41, -353, 129, 42, 38, -263, 175, 64, -198, 1, -3, 47, 43, 256, 14, -107, -259, -27, 123, 134, -107, -169, -334, -150, 338, 268, -158, 70, -71, 59, -83, 54, 28, 52, -135, -98, 268, -56, -67, 47, -72, -44, 413, -200, 171, 30, 32, 106, -6, 9, -52, -199, -20, -89, 74, 115, 65, 123, -129, -64, 35, 50, -187, 106, 99, -92, 19, 153, -14, 183, -230, 132, -9, -6, -217, -183, -93, 148, 149, -305, 14, 79, -43, -104, -216, 189, 189, 359, 34, 67, -312, 166, -77, -216, -112, 183, -158, -59, -86, -32, 102, 21, 137, 41, -144, -30, -98, 155, -184, 105, -9, -161, 3, 77, -85, 110, 104, 53, 134, 22, 38, -93, 75, -64, -101, 1, 7, 89, 185, -14, 106, -64, 154, 81, 42, -115, -136, 147, -54, 152, -69, 231, -156]
3149a56K55j34K17l00K27k30J92k5J72j56j49J83r9l77J63L16r9P0oJ0J24j48
3171E0j67Q4p4l4o9K95kJ77m34K91J27l62J70p6L46n82J68K74l10J11J52m2k79
3194a86J01J89j97L68m96pK41k60K09j80Q6P1j03J16j5Q5K32l45Q6J6j42P6K79
3217B24k52q4l7K75n3k93M91j02j84K41n8k39J60l71J28K58k60J66n2O0j10j9
3239a11J32r5K7j26P4O5k8m0Q2O6j6o6q0P5kj37K44r1j63J96l1J15n6k74J53R8
3265A1K0k12n5M27l50K64K0k35J4q9L4J40L25l68N2j7j02J48q3j11K97j06L62
3288C86m15K7K92j59m17L07l7j0j68L9J79j18j34J82k0p8k7Q4J18k7J23n5k08
3311a36J38M4J8k22K23l97L45p0J48K5j41k66L17j90M78n51J51J10Q9P0j50Q6
$$ y = [-156, 99, -35, 182, -118, 109, -121, 71, 46, 218, 62, -87, 96, -3, -380, -217, 99, 0, 70, 64, 74, 198, 50, -117, -33, -107, -141, -210, 85, 83, 260, -174, 117, 244, -118, 52, -24, 322, -260, -92, 182, -128, -17, 135, 93, -186, -85, 104, -93, 275, -221, -228, 13, -247, -38, -218, -132, -61, -164, -48, -63, 22, 254, -91, -5, 11, -131, -55, 224, -28, -112, -149, 126, 73, -220, 271, 169, -15, 226, 168, -71, 89, -282, -154, 104, -156, 10, -42, 18, -92, -111, 21, -74, -47, -173, -99, -34, -62, -102, -20, 46, 30, -36, -116, -41, -43, -180, 64, -27, -190, 6, -25, 90, 34, -240, -87, 11, 31, -181, -236, 191, -159, 105, 125, -110, -96, -185, -151, -11, 314, -54, -2, -19, -121, 27, -56, -167, 130, 24, 386, -29, -2, 290, 131, -286, 21, -16, -26, -194, -155, 24, -94, -228, -46, -66, -144, -171, -87, 31, 4, 127, 72, -136, 2, 46, 64, -158, 65, -332, 13, -57, 91, 116, -25, -291, 26, -164, 314, -237, -86, 24, 113, 183, 33, 119]
3333A19L7k72K4J87r4j31J88o2r4K0K12j49J29l0r8L8J23m04J70K55k53k1J00
3356fJ2J35j68J43l11J50J14J02k7K1r4J16r7j26Q2j14J59p7K1r1j75J97j0J33
3380H9k54J86j59J44l00N24l71N6r0L34p9k87P1R6O8j43p8O6%O5j52L18k95K28
3404C7J29j77M9PJ10j00j78P7K94k42j51L50rj90Q3l50N06r9j19J0j8J39k14J03
3428D7J56p6m2Q5j76j15L55k59J04r8j04K86Q6m96P8K26M4J3n2j83K97k34nJ51
3452H8J9Q8m34J27P6q1L4J58k72L19M1r1R0R6l49K0Q5Q2k66L67l08j13K65J69
3476B10j69j17NL0P1k34J71J07K7j03J97m46L23Rk73L07N1l65K01R8k14j27J37
3499a04K8j57M23j85K9K16l18p7J84q2J01m17K96J97j65J52j28K08k58J46k11
$$ y = [119, 156, -116, -92, 95, 1, -130, 58, -4, -98, -78, 134, -15, 114, 84, -14, 24, 147, -257, -87, 168, -85, -106, -6, 6, 141, -27, 116, -195, -45, 69, 171, 144, 165, 71, 187, 90, -36, 46, -68, 91, 14, 35, -56, -231, -34, -44, 89, -165, 21, -138, 6, -294, 230, -141, -85, -175, 159, 80, -207, -136, -40, 28, -115, -193, -127, -127, -62, -214, 104, -191, 37, 166, -11, 38, 45, 155, 55, -123, -46, 248, 6, -145, 205, 196, 6, 89, -261, 245, 146, 27, 37, 19, 158, -56, 47, 203, 127, 85, 170, -6, -121, 234, -25, 79, -19, -123, 163, 249, -247, -169, 57, 101, 114, 62, -121, 176, -58, -63, 88, 107, 195, -239, -112, -36, -117, -83, 75, -197, 122, 163, 72, 162, 258, -91, -71, 14, 96, -170, 197, -111, -224, 41, 210, 41, -76, -71, -41, 30, -204, -33, 74, 101, -2, 195, -251, 72, 81, -192, 115, 166, -199, 2, 100, -114, -241, -104, -76, -233, 190, 5, 34, 250, -68, -145, 39, -43, 58, -359, -63, 134, -31, 121, -7, 201, -57, 89, -122]
3520a22LJ18J86k61J07PK21l83K26j50p9P1M75l37k38J21P9N7M8k43LK17j12J9
3544C3L2j5K42l06J5L6N2j16M0n1L5J38l15L23p7qn1L49r8j78k79J69j04j92L67
3569D1j59L1NP8L78n34J63J43N7q9k58L5N9lL9p8k0l0J40j78L46K5l14J93p6O2
3595E6l46K81l8n6K07r9Lj03J99n2k18R2j59J10J96P7k3k00j9k6j70L32k52L67
3619A59j34j25J72N3k25J72J74l19j23j3N48l72r3o2J42J76K2O6j69o6j52K04
3641C5J3j22l2J97j26pj21J03K72o0k31M5O4j11L63m95K17K53k42j5K06k49k4
3664f7j2m7n1L39j12k29K45m6o9p9J0k3j90N65j60j70Q1j31K14J56k90r4K07j39
3688i2L7l8J37k40N4K55l90M08N2Om24J35Q1Q5j08k5j29M4K12j64J7nP8J9o8L2
$$ y = [-122, -119, -1, 185, -76, 31, 38, 259, -124, 102, -48, -127, -56, 419, 82, -156, -35, 44, 101, 149, -94, -91, 126, 14, 33, 65, 50, 292, -14, 1, 37, 89, -27, 13, -38, -3, 135, -180, 143, 66, 58, 7, 356, 258, 80, -199, -30, -134, -326, 41, -118, -87, -82, -4, 374, -160, 3, 146, 203, 114, -144, -109, -50, -53, -14, -92, -112, -142, -2, -180, 166, 191, -123, 70, -6, 56, -290, -9, -47, -103, 104, 5, 8, -95, 104, 52, -166, -74, -233, -123, 73, 150, 127, -73, -92, -118, -288, 44, -208, 159, 25, -100, 72, 125, -100, 72, 246, -73, -196, -209, 339, -33, -126, -188, -46, 130, 152, 218, 49, -17, -169, 35, 48, -74, -106, 91, -35, -42, -163, -60, 212, 152, -79, -34, 30, -81, 282, -213, 4, 257, 15, 0, 206, -43, -67, -79, -126, -177, 162, 50, -179, 66, 20, -49, -128, -118, -141, -331, 234, 74, -96, -15, -146, 68, 224, -66, -160, 47, -92, -55, -93, 44, -196, -142, 113, -277, 131, 183, 189, -235, -100, -19, 66, -42, -67, -196, -152, 60, -104, -87, -92, -14, 5, -63, -31]
3714c1J35j21k9K73j18r5j40K53n5k21K84l87L06m4J36k04L49m85J44j85K09J32
3736A06J4j07J30o4l4n9Q1M1q3J34k60O8p9K0J12p0J31j48J06j12N1L3m5K28l87
3761a93K57k8j21J38L4j04J95n3k05J21Q0j7k31j68M49l00J17jK77m34Q7j69L20
3784E1mk67Q7K0J37K8j63L14kM3j26J08n98K28Qp7M15n65L30jj52J51O6O5l81
3809b85L02n5p3M6J6k9r7J13P7QR0l9J83k55J02j21K3o5J19r3K57k24mr7J44J14
3835A57j35k40J46j57K32Q4r7J16n1k20l1L48l04Q2J86j47j8J04j32L21k40l9
3857c5J39Q2j37k05K76M2j76J27j18J73l15J65j16L83J0m83q6K57P3K17l56L54
3879B71l70P5J25o9j5N9j06J33Q6j10r0J50m66L28m1j23J4J68J74l95M66p6p7
$$ y = [-31, 104, -17, -46, 227, 109, 14, -126, 127, 72, -149, 135, -252, 54, 10, 146, -58, 291, -194, -50, -235, -26, 106, 120, 13, 143, 79, 45, -14, 67, 108, 25, 159, -101, -33, -112, -92, 20, -50, 81, -67, 39, -73, -22, 11, -34, 194, -193, 64, 36, -85, 53, 87, -17, 178, 125, -80, 41, 121, 104, -127, -295, 154, -146, -29, -30, 247, -187, -100, -269, 51, 47, -220, -133, -113, 24, 52, -111, 203, 201, 244, 118, 226, -372, -144, -136, -213, 202, -363, -33, -34, -186, -35, 31, 96, -285, 17, -38, -111, -65, -49, -78, -175, -62, 15, 23, 113, 74, 257, 2, 104, -17, 6, -59, 60, -33, 224, 0, -4, -101, 43, 157, 22, -218, -72, -229, 3, 87, -10, 106, 55, -165, -196, 152, -152, -70, 116, -31, -49, 55, -77, 244, 4, -35, 104, 186, 49, -156, 120, 162, -14, 113, -5, 168, -147, 18, -98, 285, 295, -188, -274, -17, 56, 273, -83, 271, -99, -24, 101, 32, 17, 76, -30, 103, 189, 79, -11, 139, -327, 1, -40, -163, -149, 19, 193, -202, 264, 188, 111]
3902A11lq1k53J77mL00l20J35N0m0J43k10j54J17L8P1J06j07l17M8k9K32N5K34
3926B99m56J90m1n9L79l13k75K85j83N8L1J31R0m48K04J49l06N33l06N4j44N04
3948C76j66j87o3J34j34l9%o7K96j41O5J18j67M3J8k21M80k88j49R6K05j49Pk87
3972b20K43q1K7j11J44Q8j17rn3n2J67j20J53m64L95J01Q4j58j64J9J02p0N8J27
3996H9J35j71K05k03l31L01p8pK51r3j79J96j29P6m2j87O53l99p9L8K3j44J7O5
4020GK28k48J96Rk4m51L15J65k46L37k24J68k99j6j17K15j17J13k10K04J12j96
4042g9k9o1J71J69%j8o6M2k0p4K7o9O7m1L3l49J89J05l69L41L7j30J82Q0K09j40
$$ y = [111, 108, 27, -226, -49, -53, 247, -73, 62, 112, 72, 215, 5, -149, -32, 6, 77, 183, 76, -241, -193, -222, 10, 65, 299, -157, 33, -8, -67, 312, -1, -276, 9, -174, -116, -85, 46, 136, -312, -108, 41, -265, 268, -38, 16, -128, 376, 210, 23, -40, 94, -40, -79, -79, -146, 150, 9, 74, 192, 25, 68, 86, -135, 345, 57, -92, 4, 209, 60, 67, -220, 23, -58, -31, -142, 2, 90, -27, -36, -89, -141, 26, -94, 59, -405, -10, 91, 175, 17, -147, -128, -26, -96, -38, 89, 224, 53, 258, 55, -276, 25, -53, -60, 191, 98, -81, 115, -14, 62, 20, -167, 486, 87, 8, 46, 69, -75, -58, 7, 235, -13, 183, 192, 168, -283, 32, 197, -49, 288, 64, 232, -67, -83, -200, 15, -102, 11, -199, 5, 117, -79, -108, -169, 2, 171, 171, 153, 87, 129, 109, 35, 62, -7, 60, 19, 52, -297, -108, -3, -372, -31, 6, -124, 58, 138, 347, 207]
$$ [...]
8191c8
##END NTUPLES=NMR FID
##END=
