##TITLE=1H_DE-91_3_oil
 200.13MHz,CDCl3 ,
 8 sc
 
 18.4.2025
##JCAMPDX= 6.0         $$ Bruker NMR JCAMP-DX V2.0
##DATA TYPE= NMR FID
##DATA CLASS= NTUPLES
##ORIGIN= UXNMR, Bruker Analytische Messtechnik GmbH
##OWNER= pz
$$ XWIN-NMR		Version 3.5
$$ Fri Apr 18 14:51:50 2025 Russian Standard Time (UT+4h)  she@DPX200
##.OBSERVE FREQUENCY= 200.1313
##.OBSERVE NUCLEUS= ^1H
##.DELAY= (6, 6)
##.ACQUISITION MODE= SIMULTANEOUS
##.ACQUISITION SCHEME= undefined
##.AVERAGES= 8
##.DIGITISER RES= 18
##SPECTROMETER/DATA SYSTEM= spect
##.PULSE SEQUENCE= zg30
##.SOLVENT NAME= CDCl3
##.SHIFT REFERENCE= (INTERNAL, CDCl3, 0, 14.3821)
##AUDIT TRAIL= $$ (NUMBER, WHEN, WHO, WHERE, WHAT)
$$ ##TITLE= Audit trail, XWIN-NMR		Version 3.5
$$ ##JCAMPDX= 5.01
$$ ##ORIGIN= Bruker BioSpin GmbH
$$ ##OWNER= she
$$ F:/spectra/data/she/nmr/H-C/1/audita.txt
$$ ##AUDIT TRAIL=  $$ (NUMBER, WHEN, WHO, WHERE, WHAT)
(   1,<2025-04-18 14:50:33.75 +0400>,<she>,<DPX200>,
      <created by zg, POWCHK disabled, PULCHK disabled
       configuration hash MD5:
       00 E9 B6 7A A2 85 ED C7 34 08 36 98 17 FE 4E 26
       data hash MD5: 16K
       74 33 1F 78 04 01 79 72 14 98 EB F7 3F 3D 00 AE>)
$$ ##END=
$$ 
$$ hash MD5
$$ A0 EA 38 E0 4F E6 40 65 3F 3F 58 C1 9A 68 2F FC
##$RELAX= 
##$RELAX= 
##$RELAX= 
##$RELAX= 
##$RELAX= 
##$RELAX= 
$$ Bruker specific parameters
$$ --------------------------
##$DU= <F:/spectra>
##$EXPNO= 1
##$NAME= <H-C>
##$PROCNO= 1
##$TYPE= <nmr>
##$USER= <she>
##$AMP= (0..31)
100 100 100 100 100 100 100 100 100 100 100 100 100 100 100 100 100 100 
100 100 100 100 100 100 100 100 100 100 100 100 100 100 
##$AQSEQ= 0
##$AQ_mod= 1
##$AUNM= <au_zg>
##$AUTOPOS= <>
##$BF1= 200.13
##$BF2= 200.13
##$BF3= 200.13
##$BF4= 200.13
##$BF5= 200.13
##$BF6= 200.13
##$BF7= 200.13
##$BF8= 200.13
##$BYTORDA= 1
##$CFDGTYP= 0
##$CFRGTYP= 5
##$CHEMSTR= <none>
##$CNST= (0..31)
1 1 145 1 1 1 1 1 1 1 1 1 1 1 1 1 1 1 1 1 1 1 1 1 1 1 1 1 1 1 1 1 
##$CPDPRG= <>
##$CPDPRG1= <>
##$CPDPRG2= <>
##$CPDPRG3= <>
##$CPDPRG4= <mlev>
##$CPDPRG5= <mlev>
##$CPDPRG6= <mlev>
##$CPDPRG7= <mlev>
##$CPDPRG8= <mlev>
##$CPDPRGB= <>
##$CPDPRGT= <>
##$D= (0..31)
0 0.7 0 0 0 0 0 0 0 0 0 0.03 0 0 0 0 0 0 0 0 0 0 0 0 0 0 0 0 0 0 0 0 
##$DATE= 1744973433
##$DBL= (0..7)
120 120 120 120 120 120 120 120 
##$DBP= (0..7)
150 150 150 150 150 150 150 150 
##$DBP07= 0
##$DBPNAM0= <>
##$DBPNAM1= <>
##$DBPNAM2= <>
##$DBPNAM3= <>
##$DBPNAM4= <>
##$DBPNAM5= <>
##$DBPNAM6= <>
##$DBPNAM7= <>
##$DBPOAL= (0..7)
0.5 0.5 0.5 0.5 0.5 0.5 0.5 0.5 
##$DBPOFFS= (0..7)
0 0 0 0 0 0 0 0 
##$DE= 6
##$DECBNUC= <off>
##$DECIM= 32
##$DECNUC= <off>
##$DECSTAT= 4
##$DIGMOD= 1
##$DIGTYP= 9
##$DL= (0..7)
0 120 120 120 120 120 120 120 
##$DP= (0..7)
150 150 150 150 150 150 150 150 
##$DP07= 0
##$DPNAME0= <>
##$DPNAME1= <>
##$DPNAME2= <>
##$DPNAME3= <>
##$DPNAME4= <>
##$DPNAME5= <>
##$DPNAME6= <>
##$DPNAME7= <>
##$DPOAL= (0..7)
0.5 0.5 0.5 0.5 0.5 0.5 0.5 0.5 
##$DPOFFS= (0..7)
0 0 0 0 0 0 0 0 
##$DQDMODE= 0
##$DR= 18
##$DS= 0
##$DSLIST= <SSSSSSSSSSSSSSS>
$$ [...]
##$SUBNAM0= <"">
##$SUBNAM1= <"">
##$SUBNAM2= <"">
##$SUBNAM3= <"">
##$SUBNAM4= <"">
##$SUBNAM5= <"">
##$SUBNAM6= <"">
##$SUBNAM7= <"">
##$SUBNAM8= <"">
##$SUBNAM9= <"">
##$SW= 18.0517328524113
##$SWIBOX= (0..15)
0 0 2 0 0 0 0 0 0 0 0 0 0 0 0 0 
##$SW_h= 3612.71676300578
##$TD= 16384
##$TD0= 1
##$TE= 0
##$TE2= 300
##$TE3= 300
##$TEG= 300
##$TL= (0..7)
0 120 120 120 120 120 120 120 
##$TP= (0..7)
150 150 150 150 150 150 150 150 
##$TP07= 0
##$TPNAME0= <>
##$TPNAME1= <>
##$TPNAME2= <>
##$TPNAME3= <>
##$TPNAME4= <>
##$TPNAME5= <>
##$TPNAME6= <>
##$TPNAME7= <>
##$TPOAL= (0..7)
0.5 0.5 0.5 0.5 0.5 0.5 0.5 0.5 
##$TPOFFS= (0..7)
0 0 0 0 0 0 0 0 
##$TUNHIN= 0
##$TUNHOUT= 0
##$TUNXOUT= 0
##$USERA1= <user>
##$USERA2= <user>
##$USERA3= <user>
##$USERA4= <user>
##$USERA5= <user>
##$V9= 5
##$VALIST= <valist>
##$VCLIST= <CCCCCCCCCCCCCCC>
##$VD= 0
##$VDLIST= <DDDDDDDDDDDDDDD>
##$VPLIST= <PPPPPPPPPPPPPPP>
##$VTLIST= <TTTTTTTTTTTTTTT>
##$WBST= 1024
##$WBSW= 4
##$XGAIN= (0..3)
0 0 0 0 
##$XL= 0
##$YL= 0
##$YMAX_a= 146295
##$YMIN_a= -185518
##$ZGOPTNS= <>
##$ZL1= 120
##$ZL2= 120
##$ZL3= 120
##$ZL4= 120
##$ABSF1= 10
##$ABSF2= 0
##$ABSG= 5
##$ABSL= 3
##$ALPHA= 0
##$AQORDER= 0
##$ASSFAC= 0
##$ASSFACI= 0
##$ASSFACX= 0
##$ASSWID= 0
##$AUNMP= <proc_1d>
##$AZFE= 0.1
##$AZFW= 0.1
##$BCFW= 1
##$BC_mod= 2
##$BYTORDP= 1
##$COROFFS= 0
##$CY= -3
##$DATMOD= 1
##$DC= 2
##$DFILT= <>
##$DTYPP= 0
##$F1P= 0
##$F2P= 0
##$FCOR= 0.5
##$FTSIZE= 0
##$FT_mod= 4
##$GAMMA= 1
##$GB= 0.15
##$INTBC= 1
##$INTSCL= 1
##$ISEN= 128
##$LB= 0.25
##$LEV0= 0
##$LPBIN= 0
##$MAXI= 10000
##$MC2= 0
##$MEAN= 0
##$ME_mod= 0
##$MI= 1.114404
##$NCOEF= 0
##$NC_proc= 0
##$NLEV= 6
##$NOISF1= 3.799351
##$NOISF2= 2.8
##$NSP= 1
##$NTH_PI= 0
##$NZP= 0
##$OFFSET= 14.38212
##$PC= 1
##$PHC0= -835.9644
##$PHC1= 16.99221
##$PH_mod= 1
##$PKNL= yes
##$PPARMOD= 0
##$PSCAL= 0
##$PSIGN= 0
##$REVERSE= no
##$SF= 200.129724274929
##$SI= 16384
##$SIGF1= 3
##$SIGF2= 2
##$SINO= 400
##$SIOLD= 16384
##$SREGLST= <1H.CDCl3>
##$SSB= 0
##$STSI= 0
##$STSR= 0
##$SW_p= 3205.1282051282
##$SYMM= 0
##$S_DEV= 0
##$TDeff= 0
##$TDoff= 0
##$TI= <>
##$TILT= no
##$TM1= 0
##$TM2= 0
##$TOPLEV= 0
##$USERP1= <user>
##$USERP2= <user>
##$USERP3= <user>
##$USERP4= <user>
##$USERP5= <user>
##$WDW= 1
##$XDIM= 8192
##$YMAX_p= 0
##$YMIN_p= 0
$$ End of Bruker specific parameters
$$ ---------------------------------
##NTUPLES= NMR FID
##VAR_NAME=  TIME,          FID/REAL,        FID/IMAG
##SYMBOL=    X,             R,               I
##VAR_TYPE=  INDEPENDENT,   DEPENDENT,       DEPENDENT
##VAR_FORM=  AFFN,          ASDF,            ASDF
##VAR_DIM=   8192,          8192,            8192
##UNITS=     SECONDS,       ARBITRARY UNITS, ARBITRARY UNITS
##FACTOR=    0.0002768,     1,               1
##FIRST=     0,             0,               0
##LAST=      2.2672688,     0,               0
##MIN=       0,             -185518,         0
##MAX=       2.2672688,     146295,          0
$$ Real data points
##PAGE= N=1
##DATA TABLE= (X++(R..R)), XYDATA
$$ plain form
0 0 0 0 0 0 0 0 0 0 0 0 0 0 0 0 0 0 0 -8 8 -8 8 -8 8 -12 16 -16 18 -23 24 -28 32 -36 41 -46 52 -60 65 -74 83
39 83 -91 100 -110 123 -137 151 -165 182 -201 222 -244 269 -295 325 -361 400 -443 494 -556 625
59 625 -709 814 -946 1120 -1354 1692 -2216 3126 -4990 10283 -55874 -185518 21102 107822
73 107822 15688 72512 146295 70665 59893 111803 61177 12940 45694 -18812 -124410 -86050
85 -86050 -56467 -122090 -76888 2595 -42670 -45714 30024 34601 30266 70672 67287 32817 23845
98 23845 18015 17664 39206 22925 -46157 -56658 -5086 -13361 -40941 -19555 -25616 -41363 -14323
111 -14323 -13885 -12246 37690 40433 4834 26281 57465 36975 25666 48922 30179 -29122 -41947
124 -41947 -33241 -52558 -41584 -22069 -47126 -44102 -4570 8058 23834 48840 37159 16787
$$ packed form
0@%%%%%%%%%%%%%%%%%qJ6j6J6j6J6k0K8l2L4m1M7n2O0o8P7q7R8j12J25j39J57
39H3j74J91k10K33k60K88l16L47l83M23m66N13n64O20o86P61q43R37j050J181
59F25j334J523j760K066k474L046l908N342q116J5273o6157j29644K06620Q6720
73A07822r2134N6824P3783p5630j0772N1910n0626m8237L2754o4506j05598L8360
85h6050K9583o5623M5202P9483m5265l044P5738M577m335M0406l385l4470q972
98B3845n830l51K1542j6281o9082j0501N1572q275k7580K1386o061j5747K7040
111a4323M38J639M9936K743l5599K1447L1184k0490j1309K3256j8743n9301j2825
124d1947Q706j9317J0974J9515k5057L024L9532J2628J5776K5006j1681k0372
$$ plain form
136 16787 21063 29843 20455 8002 11306 2945 -20408 -16622 -6035 -13405 -14110 -15361 -24885 -27225
150 -27225 -25699 -12083 8052 8596 10284 14648 9601 24013 42719 29701 13547 6921 -4701
163 -4701 -15693 -16096 -9846 -14438 -27760 -21982 -14072 -12846 9361 20471 6323 10476 16306 3835
177 3835 3673 10150 5254 -2641 -9849 -12107 -10030 -3541 6448 -1786 -14155 -5661 -2298 -4441 5723
192 5723 7439 5267 9477 5960 10822 22794 17107 6936 547 -8292 -12106 -14622 -17015 -17023 -20387
207 -20387 -16768 -11783 -11070 4704 18335 10902 11354 14752 8439 13284 17479 7458 787 -1131 -3226
222 -3226 -5669 -6220 -955 -4229 -14471 -11467 -9781 -10778 -624 -174 -6834 1864 8076 6402 11879
237 11879 16945 16826 9169 -694 318 82 -5893 -7540 -13626 -16915 -10649 -7864 -4461 4733 5197 4841
$$ packed form
136A6787M276Q780r388j2453L304q361k3353L786J0587p370p05j251r524k340
150b7225J526J3616K0135N44J688M364n047J4412J8706j3018j6154o626j1622
163d701j0992m03O250m592j3322N778P910J226K2207J1110j4148M153N830j2471
177C835j62O477m896p895p208k258K077O489R989q234j2369Q494L363k143J0164
192E723J716k172M210l517M862J1972n687j0171o389q839l814k516k393ql364
207b0387L619M985P13J5774J3631p433M52L398o313M845M195j0021o671j918k095
222c226k443n51N265l274j0242L004J686r97J0154M50o660Q698O212j674N477
237A1879N066j19p657r863J012k36n975j647o086l289O266K785L403R194M64l56
$$ plain form
253 4841 5796 4306 8433 10024 4458 2376 -1353 -3104 1356 437 -373 976 -3529 -5464 -6049 -7929
269 -7929 -2410 -1743 -7680 -5494 -2419 1967 9367 9333 8416 10042 6562 4338 3124 581 486 -5645 -13126
286 -13126 -9258 -6198 -4639 -1079 -1280 -312 2551 892 2643 5086 2937 2013 -1228 -4337 1296 4152
302 4152 3041 3498 719 604 2557 -196 -690 -729 -4695 -5838 -7083 -6019 1568 2240 196 2338 2363
319 2363 4082 5043 3087 2646 928 -3949 -3854 -2870 -1900 2421 307 -2201 1083 1406 2122 2943 49
336 49 -1084 -2437 -5266 -2864 -1237 -51 1916 -203 -946 3331 4351 3874 3079 -853 -932 -1164 -3649
353 -3649 -1399 395 -1013 -1474 -3155 -896 3802 1922 -145 99 -2063 -1614 -1329 -926 2497 1822 -912
370 -912 677 1025 2716 4737 1472 -841 -1384 -3608 -2365 -1589 -2377 -841 -1567 -2291 261 1225 3293
$$ packed form
253D841R55j490M127J591n566k082l729j751M460r19q10J349m505j935n85j880
269g929N519O67n937K186L075M386P400l4r17J626l480k224j214k543r5o131p481
286a3126L868L060J559L560k01R68K863j659J751K443k149r24l241l109N633K856
302D152j111M57k779j15J953k753m94l9l966j143j245J064P587O72k044K142K5
319B363J719R61j956m41j718m877R5R84R70M321k114k508L284L23P16Q21k894
336D9j133j353k829K402J627J186J967k119p43M277J020m77p95l932p9k32k485
353c649K250J794j408m61j681K259M698j880k067K44k162M49K85M03L423o75k734
370i12J589L48J691K021l265k313n43k224J243P76p88J536p26p24K552R64K068
$$ plain form
387 3293 4859 642 -711 1209 391 836 759 -1050 -286 -2141 -3074 126 1167 1044 -755 -3726 -1747
404 -1747 803 -236 809 1585 -2 642 799 1681 4414 2767 25 -814 -2675 -1367 -328 -1658
420 -1658 -1177 -2344 -3287 -783 -259 1006 3229 1351 -271 640 303 2654 3081 240 -423 -203 -877
437 -877 -191 -385 -95 230 -2982 -3432 -1181 -873 489 761 -1384 211 1263 866 2531 2813 1666 319
455 319 -1679 -1165 370 -591 -623 -1723 -2801 -482 107 232 1518 1076 -706 324 -498 363 2278 1415
473 1415 -139 -928 -948 1370 608 -352 465 -1125 -2533 -1755 -1767 77 1108 -1191 -722 995 1253 2744
491 2744 2265 1422 1191 -326 -1105 -401 -761 -624 -974 -2952 -1666 -123 273 1477 834 -397 670 -57
509 -57 56 1293 822 508 -159 -1031 536 1376 849 467 -1088 -1345 32 -1252 -1466 -273 -782 -1301 -752
$$ packed form
387C293J566m217j353J920q18M45p7j809P64j855r33L200J041j23j799k971J979
404a747K550j039J045P76j587O44J57Q82K733j647k742q39j861J308J039j330
420a658M81j167r43K504N24J265K223j878j622R11l37K351M27k841o63K20o74
437h77O86j94K90L25l212m50K251L08J362K72k145J595J052l97J665K82j147j347
455C19j998N14J535r61l2j100j078K319N89J25J286m42j782J030q22Q61J915q63
473A415j554p89k0K318p62r60Q17j590j408P78j2J844J031k299M69J717K58J491
491B744m79q43k31j517p79P04l60J37l50j978J286J543L96J204o43j231J067p27
509e7J13J237m71l14o67q72J567Q40n27l82j555k57J377j284k14J193n09n19N49
$$ plain form
528 -752 -300 1634 2194 1301 1145 711 128 444 -457 -539 -576 -2223 -1958 -545 -456 983 814 -614 314 926
548 926 503 1189 151 255 237 -562 -60 408 663 1178 -199 -906 -496 -362 -684 -524 -1464 -1443 -185 -1001
568 -1001 48 2124 1324 1165 861 457 1359 772 29 -267 -1142 -973 -957 -1797 -180 439 -936 12 190
587 190 -216 1103 779 -216 579 -363 28 583 381 770 503 -495 -44 27 56 309 -1678 -1377 -350 -930
607 -930 -493 453 199 704 1176 -23 720 1324 904 698 -487 -446 -2 -1054 -655 -228 -1007 -546 -181 -652
627 -652 373 743 -194 -2 -52 261 773 425 385 388 349 372 -153 -311 292 -95 -1390 -863 -887 -130 -249 -649
649 -649 -80 567 429 369 952 490 858 214 -408 441 49 172 284 -955 -303 -245 -665 -90 -73 -731 -88
670 -88 -137 -154 538 572 270 440 -11 588 679 83 405 -14 -472 -195 -639 -651 103 -92 -896 -207 -143 451 255
$$ packed form
528g52M52J934N60q93j56m34n83L16r01q2l7j647K65J413Q9J439j69j428R28O12
548I26m23O86j038J04j8p99N02M68K55N15j377p07M10J34l22J60r40K1J258q16
568a001J049K076q00j59l04m04R02n87p43k96q75J69J6q40J617O19j375R48J78
587A90m06J319l24r95P95r42L91N55k02L89k67r98M51P1K9K53j987L01J027n80
607i30M37R46k54N05M72j199P43O04m20k06j185M1M44j052L99M27p79M61L65m71
627f52J025L70r37J92n0L13N12l48m0Ll9K3n25j58O03l87j295N27k4P57j19m00
649f49N69O47j38o0N83m62L68o44o22Q49l92J23J12j239O52N8m20N75J7o58O43
670h8m9j7O92L4l02J70m51N99R1n96L22m19m58K77m44j2P54j95q04O89O4N94j96
$$ plain form
693 255 61 311 274 -86 295 153 372 611 -54 -329 206 -21 -482 -161 -510 33 -442 -770 200 3 86
714 86 250 10 386 1077 558 218 284 -15 33 -210 -358 -72 -121 -12 -244 -469 43 515 -30 -201 -16 -401
736 -401 237 178 -149 354 20 -231 519 146 473 592 -274 -329 -316 -274 -10 -98 -375 86 -98 256 494 689
758 689 494 242 -291 -129 87 -271 -121 -402 -306 40 -243 -210 446 242 223 346 -451 -54 402 -114 159
779 159 -390 -163 180 -6 198 243 -366 -241 -248 -378 83 173 -445 -188 62 -187 434 298 577 739 -271
800 -271 60 68 -30 389 -268 -743 -319 -244 -216 -23 -21 -12 171 -296 -50 364 260 172 123 -109 339 213 678 6
824 6 -207 77 -65 -569 -51 -216 -416 -451 -654 -172 267 313 258 608 431 734 351 -112 425 157 -654 -395
846 -395 -564 -97 -278 -195 -599 -107 -89 63 419 -4 489 523 -52 43 180 318 61 -3 -84 124 -56 -332
$$ packed form
693B55j94K50l7l60L81j42K19K39o65k75N35k27m61L21l49N43m75l28R70j97Q3
714H6J64k40L76O91n19l40O6k99M8k43j48K86m9J09k32k25N12M72n45j71J85l85
736d01O38n9l27N03l34k51P50l73L27J19q66n5J3M2K64q8k77M61j84L54K38J95
758F89j95k52n33J62K16l58J50k81R6L46k83L3O56k04j9J23p97L97M56n16K73
779A59n49K27L43j86K04M5o09J25pj30M61R0o18K57K50k49O21j36K79J62j010
800b71L31Qr8M19o57m75M24P5K8J93KRJ83m67K46M14j04q8m9k32M48j26M65o72
824Fk13K84j42n04N18j65k00l5k03M82M39M6n5L50j77L03l83m63N37k68q11K59
846c95j69M67j81Q3m04M92J8J52L56m23M93L4n75R5J37J38k57o4q1K08j80k76
$$ plain form
868 -332 -171 -256 -228 -612 -501 52 67 73 241 -28 198 289 297 284 191 116 136 -146 -320 132 68 -135 -230 -485 -86
893 -86 262 -81 118 -21 -201 156 -83 93 333 434 -193 270 -129 -97 216 -277 -44 -341 -272 -67 185
914 185 21 56 121 -357 306 148 325 187 -399 -142 -19 -214 128 -166 -99 459 -340 116 76 -113 -95 -346
936 -346 -266 26 131 263 169 145 -112 4 -181 -66 275 51 -316 146 -236 -43 -123 -132 596 27 -208 250
958 250 -77 113 3 -186 -158 -409 -42 -315 80 -151 -32 -125 -113 259 191 159 42 22 -77 202 -42 223 55
981 55 -17 201 -143 -78 110 -365 -216 -387 -390 -298 -16 -193 117 243 279 325 332 97 209 -12 -14 -1 -179 -206 -70
1006 -70 -202 -383 -337 -158 -51 -21 163 287 33 -158 101 77 390 381 -274 245 -87 -97 24 10 -139 -218 -277
1029 -277 -307 -293 -330 29 -148 106 227 363 161 400 276 -64 20 -421 62 -56 -185 145 -227 -197 -27 138
$$ packed form
868c32J61q5K8l84J11N53J5OJ68k69K26R1Qj3r3p5K0k82j74M52o4k03r5k55L99
893h6L48l43J99j39j80L57k39J76K40J01o27M63l99L2L13m93K33k97O9K05K52
914A85j64L5O5m78O63j58J77j38n86K57J23j95L42k94O7N58p99M56m0j89J8k51
936c46Q0K92J05J32r4k4k57J16j85J15L41k24l67M62l82J93q0rP28n69k35M58
958B50l27J90j10j89K8k51L67k73L95k31J19r3J2L72o8l2j17k0r9K79k44K65j68
981E5p2K18l44O5J88m75J49j71lR2K82j77L10J26L6M6Pk35J12k21kJ3j78k7J36
1006g0j32j81M6J79J07L0J84J24k54j91K59k4L13ro55N19l32j0J21j4j49p9n9
1029b77l0J4l7L59j77K54J21J36k02K39j24l40Q4m41M83j18j29L30l72L0J70J65
$$ plain form
1051 138 -169 -24 4 -16 231 -317 -87 273 187 65 169 73 295 46 -289 -49 -26 -304 -89 77 -52 117
1073 117 -257 205 118 185 209 -101 -157 -4 127 -53 157 -36 -14 -244 -314 -217 -111 -42 -52 -45 -61 105 72 -49
1097 -49 169 -103 -30 57 -143 -175 -274 -86 -74 -12 -180 288 31 -96 137 -88 106 16 -28 169 -204 33 143
1120 143 8 -60 127 -174 -219 -38 -20 17 175 -31 49 5 -73 196 95 -62 338 -87 -29 139 75 -123 42
1143 42 -155 139 -192 -313 178 -266 -365 65 -183 260 71 205 343 182 127 103 21 51 131 -326 -65 6 -367
1166 -367 -162 -143 -79 -274 152 -24 207 165 159 258 0 32 105 -58 -281 88 -198 -234 -129 -363 -274 -236 -284 -124
1190 -124 -202 -276 236 -31 160 57 82 94 132 -129 237 -21 158 -216 -188 -60 99 -109 89 -206 -63 -347
1212 -347 85 20 24 -110 -40 100 72 98 -6 -26 -94 248 -19 -207 -110 -144 13 -262 -147 130 289 218 320 -273
$$ packed form
1051A38l07J45K8k0K47n48K30L60q6j22J04r6K22k49l35K40K3k78K15J66j29J69
1073A17l74M62q7O7K4l10n6J53J31j80K10j93K2k30p0R7J06O9j0Pj6J66l3j21
1097d9K18k72P3Q7k00l2r9J88J2O2j68M68k57j27K33k25J94r0m4J97l73K37J10
1120A43j35o8J87l01m5J81J8L7J58k06Q0m4p8K69j01j57M00m25N8J68o4j98J65
1143D2j97K94l31j21M91m44r9M30k48M43j89J34J38j61n5k4q2L0Q0m57K61P1l73
1166c67K05J9O4j95M26j76K31m2oR9k58L2P3j63k23L69k86l6J05k34Q9L8m8J60
1190a24p8p4N12k67J91j03K5J2L8k61L66k58J79l74K8J28J59k08J98k95J43k84
1212c47M32o5Mj34P0J40k8K6j04k0o8L42k67j88R7l4J57k75J15K77J59p1J02n93
$$ plain form
1236 -273 -12 89 175 162 157 -106 -286 12 -79 195 -3 5 53 69 -84 -40 -63 159 7 -244 62 -97 -79 234
1260 234 63 159 -23 -284 101 101 -186 -279 21 -33 -31 69 -239 37 309 -55 100 -51 28 267 -79 132 -99
1283 -99 87 -51 -67 -7 -233 -146 31 -187 41 -204 -20 42 -56 -52 -62 532 -58 -119 -41 49 104 163 67 -160 -1
1308 -1 132 -41 -260 142 71 123 2 110 118 19 29 40 -116 -63 -259 -58 44 -164 -142 -184 99 -66 -123 70
1332 70 -88 -123 256 108 -67 90 130 67 197 -16 90 36 -319 -176 -53 -152 22 -73 -105 -241 -234 -24 243
1355 243 -19 -125 -110 -26 -235 -74 121 -269 -134 -336 -176 -106 207 -31 15 119 -88 72 93 213 -57 106
1377 106 -23 -166 133 234 -95 58 -143 96 259 -186 -31 -273 -264 35 190 -240 -121 -142 152 -138 -110
1398 -110 -79 -163 54 -155 -10 -32 -81 -317 -167 43 12 -28 14 -193 151 -154 117 29 -25 -196 62 -113 -81
$$ packed form
1236b73K61J01Q6j3nk63j80K98r1K74j98QM8J6j53M4k3K22j52k51L06j59J8L13
1260B34j71R6j82k61L85%k87r3L00n4KJ00l08K76K72l64J55j51P9K39l46K11k31
1283i9J86j38j6O0k26Q7J77k18K28k45J84O2r8Mj0N94n90o1P8R0N5N9r6k27J59
1308aJ33j73k19M02p1N2j21J08Qr9J0J1j56N3j96K01J02k08K2m2K83j65n7J93
1332G0j58l5L79j48j75J57M0o3J30k13J06n4l55J43J23r9J74r5l2j36PK10K67
1355B43k62j06J5Q4k09J61J95l90J35k02J60P0L13k38M6J04k07J60K1J20k70J63
1377A06j29j43K99J01l29J53k01K39J63m45J55k42RK99J55m30J19k1K94k90K8
1398a10L1q4K17k09J45k2m9k36J50K10l1m0M2k07L44l05K71q8n4j71K58j75L2
$$ plain form
1421 -81 14 169 143 69 277 143 -40 34 80 80 -115 215 59 44 57 10 165 256 -23 -151 5 -115 -214 106
1445 106 -221 33 350 -33 -116 -86 -61 56 -237 -40 -112 -169 -108 114 197 -55 193 35 -105 75 -118 -177 22
1468 22 -89 113 -183 101 -33 -227 212 121 -190 28 -47 5 -31 79 276 103 -157 121 -65 -99 -151 -130 -31
1491 -31 -218 -70 -12 33 -66 205 -110 75 86 41 -96 69 37 314 -3 -56 -39 322 -175 -110 60 71 -72 5
1515 5 144 205 199 2 -91 -168 78 -396 -76 -117 64 -78 -118 111 141 -190 -254 -56 -135 -436 206 380 -356 19
1539 19 23 -212 -99 100 -298 100 142 57 12 16 243 -382 -96 39 128 41 -143 -239 -219 47 78 -41 -32 -19 83
1564 83 -221 104 209 41 49 -9 -218 -178 -22 10 126 340 -66 -65 -75 -114 47 -60 18 -102 -214 287 -109 61
1588 61 -230 -53 -56 -127 -92 -231 -24 -225 -155 112 -5 37 -129 69 -110 -46 10 -18 47 -75 37 187 -61 96
$$ packed form
1421h1R5J55k6p4K08j34j83P4M6%j95L30j56j5J3m7J55R1k79j28J56j20r9L20
1445A06l27K54L17l83q3L0K5J17k93J97p2n7O1K22Q3k52K48j58j40J80j93n9J99
1468B2j11K02k96K84j34j94M39r1l11K18p5N2l6J10J97j73k60K78j86l4n2K1R9
1491c1j87J48N8M5r9K71l15J85J1m5j37J65l2K77l17n3J7L61m97O5J70J1j43P7
1515EJ39O1oj97r3p7K46m74L20m1J81j42m0K29L0l31o4J98p9l01O42J74p36L75
1539A9Mk35J13J99l98L98M2q5m5MK27o25K86J35Q9q7j84r6K0K66L1j19RJ3J02
1564H3l04L25J05j68Qn8k09M0J56L2J16K14m06Jj0l9J61j07P8j20j12N01l96J70
1588F1k91J77lp1L5j39K07k01P0K67j17M2j66J98j79O4N6k8O5j22J12J50k48J57
$$ plain form
1612 96 232 -72 -108 -43 -38 243 10 265 58 -132 -151 56 -43 166 228 -70 -108 105 -1 -45 21 -172 82 15
1636 15 105 167 -71 37 12 -64 291 -15 -66 -131 -44 71 -129 -65 16 303 -201 -194 5 -201 45 -46 -184 92
1660 92 196 33 -180 -219 79 6 -43 143 131 110 -106 -179 160 389 45 156 114 -135 88 86 -25 -173 -54
1683 -54 129 150 -137 67 68 -139 165 -129 39 2 14 13 311 -53 -21 254 -10 62 -98 -54 -134 -25 -132 -223
1707 -223 252 -2 296 84 7 -125 -42 -23 -159 -214 -67 -80 174 193 78 172 -178 295 -43 144 171 -212 165
1730 165 35 48 58 58 117 -157 -86 105 -9 60 -182 -6 176 29 -293 11 -95 -95 232 222 -264 -96 131
1753 131 -103 94 94 108 -289 9 -60 66 11 150 -89 -207 -45 -139 19 -369 138 -216 166 -1 16 10 87
1776 87 158 129 -84 -133 -182 82 44 -313 -53 73 -134 -195 186 -273 218 361 -33 -135 17 -34 49 77 11 -224
$$ packed form
1612I6J36l04l6O5NK81k33K55k07j90j9K07r9K09O2k98l8K13j06m4O6j93K54o7
1636A5R0O2k38J08k5p6L55l06n1o5Q7J15k00O4Q1K87n04PJ99k06K46r1j38K76
1660I2J04j63k13l9K98p3m9J86j2k1k16p3L39K29l44J11m2k49K23kj11j48J19
1683e4J83K1k87K04Jk07L04k94J68l7J2jK98l64L2K75k64P2j60M4q0J09j07r1
1707b23M75k54K98k12p7j32Q3J9j36n5J47j3K54J9j15R4l50M73l38J87K7l83L77
1730A65j30J3J0%N9k74P1J91j14O9k42J76J82j47l22L04j06%L27j0m86J68K27
1753A31k34J97%J4l97K98o9J26n5J39k39j18J62r4J58l88N07l54L82j67J7oP7
1776H7P1k9k13m9m9K64l8l57K60J26k07o1L81m59M91J43l94j02J52n1Q3K8o6k35
$$ plain form
1800 -224 84 -222 -46 -264 276 -310 54 21 175 253 -164 -280 2 91 -201 -172 42 51 -63 -171 117 168
1822 168 -15 -136 131 -199 98 85 -183 154 110 -61 -73 -113 -21 -52 116 -22 -324 -202 295 81 -103 -26
1844 -26 -77 91 54 -44 45 -16 -68 -62 53 -129 -90 17 34 -16 29 -34 -54 205 193 -239 -117 69 -148 389 98
1869 98 -108 -16 74 -117 43 -31 -153 175 84 -140 77 30 227 132 -331 -2 121 122 -275 115 135 -207 182
1892 182 192 34 136 77 238 -18 98 -110 43 25 92 34 -247 204 163 -2 117 -39 65 -140 -313 336
1914 336 -122 -307 -203 -125 -17 34 -205 71 -200 -32 -122 -89 24 -134 -100 229 -135 -45 -40 -287 -66 105 -24
1937 -24 -77 -214 150 71 296 -72 -27 54 -175 -69 -212 69 -154 39 -64 -37 -297 60 -153 36 -168 -138
1959 -138 27 81 -227 -80 -248 -9 -154 82 -172 91 -190 -61 -355 -5 13 114 -59 -53 -18 -108 14 88
$$ packed form
1800b24L08l06J76k18N40n86L64l3J54P8m17j16K82Q9k92K9K14Rj14j08K88N1
1822A68j83j21K67l30K97j3k68L37m4j71j2m0R2l1J68j38l02J22M97k14j84P7
1844b6n1J68l7r8Q9o1n2OJ15j82L9J07J7n0M5o3k0K59j2m32J22J86k17N37k91
1869I8k06R2R0j91J60p4j22L28r1k24K17m7J97r5m63L29J23Jl97L90K0l42L89
1892A82J0j58J02n9J61k56J16k08J53j8O7n8k81M51m1j65J19j56J04k05j73O49
1914C36m58j85J04P8J08N1k39K76k71J68r0L3J13j58L4L29l64R0Nk47K21J71j29
1937b4n3j37L64p9K25l68M5Q1k29J06j43K81k23J93j03K7k60L57k13J89k04L0
1959a38J65N4l08J47j68K39j45K36k54K63k81J29k94L50J8J01j73OL5r0J22P4
$$ plain form
1981 88 -187 204 -22 55 -98 62 113 -79 56 -103 -111 71 156 30 145 157 -124 -14 -53 -83 -120 -42 -76 -166
2005 -166 31 -7 -170 -210 133 -103 -65 128 84 138 19 267 -93 -73 406 -115 162 127 220 -18 -72 220 -216
2028 -216 -21 11 34 -101 -116 4 177 81 -99 -123 -111 86 -134 118 -102 -16 -62 -17 -19 -138 238 -220 50 17
2052 17 156 -106 56 224 -115 184 0 -36 20 -125 -153 -62 -42 -44 -13 86 -130 -96 17 116 -27 -79 40 92 -226
2077 -226 5 -12 137 -212 -143 197 -105 -127 -245 53 56 275 -81 74 -84 205 40 309 96 57 32 -73
2099 -73 -297 -149 257 198 194 64 361 206 -74 130 179 -54 -60 86 167 75 -46 72 -68 31 93 72 -117 298
2123 298 -30 3 119 83 36 -154 203 -57 41 42 -69 153 153 -64 34 93 43 -18 124 126 6 -85 -3 -227 -120
2148 -120 238 -61 -259 -137 95 -78 218 172 64 224 26 82 -121 83 83 186 -121 -94 -181 37 263 98
$$ packed form
1981H8k75L91k26P7j53J60N1j92J35j59qJ82Q5j26J15J2k81J10l9l0l7P8l4r0
2005a66J97l8j63m0L43k36L8J93m4N4j19K48l60K0M79n21K77l5R3k38n4K92m36
2028b16J95L2K3j35j5J20J73r6j80k4J2J97k20K52k20Q6m6M5kj19L76m58K70l3
2052A7J39k62J62J68l39K99j84l6N6j45k8R1K0kL1R9k16L4J13R9j43n2J19N2l18
2077b26K31j7J49l49O9L40l02k2j18K98LK19l56J55j58K89j65K69k13l9k5j05
2099g3k24J48M06n9mj30K97j55k80K04M9k33oJ46Q1r2j21J18j40R9O2k1j89M15
2123B98l28L3J16l6m7j90L57k60R8Jj11K22%k17R8N9n0o1J42Kj20r1Q2k24J07
2148a20L58k99j98J22K32j73K96m6j08J60j98N6k03K04%J03l07K7q7K18K26j65
$$ plain form
2170 98 24 39 165 -12 -54 -279 83 -56 -105 85 -44 -115 -15 37 384 138 155 27 -162 55 66 -118 239
2193 239 -106 -12 180 -67 -265 -47 109 222 18 44 -12 7 -40 212 95 126 133 -63 -15 216 -98 8 47
2216 47 -154 35 -185 -179 -17 129 -85 -150 91 101 65 21 -95 -228 -101 -55 218 81 -151 65 -31 281 77
2239 77 -75 229 150 19 -41 9 92 -201 175 299 -223 -15 85 43 -51 255 80 109 244 -131 -357 162 23
2262 23 -343 34 156 45 -219 -26 -166 95 -18 -63 106 83 185 -237 21 -2 -97 -146 223 448 229 -141
2284 -141 -223 -138 -193 -30 9 -247 -179 46 -82 -332 -18 29 -35 -36 0 -343 -155 209 160 -127 -51 96 -236 84
2308 84 5 -32 13 -30 49 115 -81 46 -173 -223 -1 -43 -85 140 -99 -76 94 -100 -38 19 115 42 290 -19 -127
2333 -127 -5 -275 -100 -132 -171 -343 199 -3 31 66 113 -72 112 77 131 192 -127 -3 -71 183 -107 -93 -30 -81
$$ packed form
2170I8p4J5J26j77m2k25L62j39m9J90j29p1J00N2L47k46J7j28j89K17J1j84L57
2193B39l45R4J92k47j98K18J56J13k04K6n6J9m7K52j17L1Pj96M8K31l14J06L9
2216D7k01J89k20OJ62J46k14o5K41J0l6m4j16j33J27M6K73j37k32K16r6L12k04
2239G7j52L04p9j31o0N0Q3k93L76J24n22K08J00m2r4L06j75K9J35l75k26N19j39
2262B3l66L77J22j11k64J93j40K61j13m5J69k3J02m22K58k3r5m9L69K25k19l70
2284a41q2Q5n5J63L9k56O8K25j28k50L14M7o4jL6l43J88L64m9k87P6J47l32L20
2308H4p9l7M5m3P9O6j96J27k19n0K22m2m2K25k39K3J70j94O2N7R6p3K48l09j08
2333a27J22k70J75l2l9j72N42k02L4L5M7j85J84l5N4O1l19J24o8K54k90J4O3n1
$$ plain form
2357 -81 103 126 51 13 40 73 -80 -121 128 6 279 60 -21 -66 24 -153 6 -218 -155 87 229 -25 171 47
2381 47 168 -109 175 -62 154 134 69 -197 -118 113 -128 -35 -90 -116 202 146 -72 -107 66 73 74 -47 -108 184 47
2406 47 216 242 -307 -58 31 42 -9 101 -20 116 -142 22 29 214 59 25 -248 41 73 -68 39 57 4 41
2430 41 -241 52 190 -33 -98 -143 -67 -162 209 -135 19 -264 78 -16 -130 215 68 221 -104 215 261 130
2452 130 -118 -272 4 142 52 -55 80 164 20 47 -121 -119 136 -68 -93 111 39 139 141 -27 -55 -42 -17 262
2476 262 -51 -115 79 -80 47 189 -87 -11 191 -91 -120 -142 572 -194 -138 -61 66 143 37 136 -44 -259 -56
2499 -56 25 -40 106 -31 -72 245 243 -89 -109 166 14 25 4 -70 2 -89 -65 -168 -44 73 -113 -100 265 121 75
2524 75 10 68 88 -159 -123 -9 279 132 16 -101 -218 -38 183 -147 -57 -191 74 -52 -21 153 -61 -4 -39
$$ packed form
2357h1J84K3p5l8K7L3j53m1K49j22K73k19q1m5R0j77J59k24O3K42J42k54J96j24
2381D7J21k77K84k37K16k0o5k66P9K31k41R3n5k6L18n6k18l5J73PJj21o1K92j37
2406D7J69K6n49K49Q9J1n1J10j21J36k58J64PJ85j55l4k73K89L2j41J07J8n3L7
2430D1k82K93J38k23o5m5P6r5L71l44J54k83L42r4j14L45j47J53l25L19M6j31
2452A30k48j54K76J38r0j07J35Q4j44K7j68KK55k04k5K04p2J00Kj68k8J3K5K79
2476B62l13o4J94j59J27J42k76P6K02k82k9k2P14p66N6P7J27P7j06R9j80k15K03
2499e6Q1o5J46j37m1L17kl32k0K75j52J1k1p4P2r1K4j03J24J17j86J3L65j44m6
2524G5o5N8K0k47L6J14K88j47j16j17j17J80K21l30R0j34K65j26L1J74k14N7l5
$$ plain form
2547 -39 -18 -271 354 158 30 -97 45 -32 -92 14 64 -12 -25 -175 -32 -72 -12 55 7 23 89 109 -142 31 -141
2572 -141 -108 -66 -44 101 -8 190 -61 -290 71 -268 -60 -118 -88 121 -65 -8 73 -156 -26 -30 -9 -92 -286 -133
2596 -133 138 80 57 -150 -160 -7 85 118 297 -5 103 -82 28 -193 341 -152 -6 -167 97 558 33 74
2618 74 48 66 -28 -99 -190 211 -20 -69 196 239 -136 -99 -195 10 -54 -12 329 -19 86 404 -134 -120 213 -163
2642 -163 229 -203 -181 -13 51 -171 14 -192 -52 46 -50 82 61 -136 -137 -12 -101 279 17 53 -21 41 -113 -186
2666 -186 -85 42 -280 12 5 -165 34 -169 -139 -17 69 192 96 -160 -66 105 162 135 116 118 -76 -26 -48 -11 -52
2691 -52 -126 -66 5 -5 251 -197 -94 14 -65 -48 -71 115 187 57 46 55 230 140 84 -226 -185 -96 -77 -83 -81 -90 11 200
2719 200 -167 12 -68 -18 146 -200 208 -50 52 30 -9 161 -39 379 105 84 -76 -182 236 -113 -127 -64
$$ packed form
2547c9K1k53O25j96j28j27J42p7o0J06N0p6j3j50J43m0O0O7m8J6O6K0k51J73j72
2572a41L3M2K2J45j09J98k51k29L61l39K08n8L0K09j86N7Q1k29J30mK1q3j94J53
2596a33K71n8k3k07j0J53R2L3J79l02J08j85J10k21N34m93J46j61K64M61n25M1
2618G4k6J8r4p1r1M01k31m9K65M3l75L7r6K05o4M2L41l48J05L18n38J4L33l76
2642a63L92m32K2J68O4k22J85k06J40R8r6J32k1j97jJ25q9L80k62L6p4O2j54p3
2666a86J01J27l22K92pj70J99k03L0J22Q6J23r6k56R4J71N7k7j9Kj94N0k2L7m1
2691e2p4O0P1j0K56m48J03J08p9J7k3J86P2j30j1RJ75r0n6l10M1Q9J9oKrJ01J89
2719B00l67J79q0N0J64l46M08k58J02k2l9J70k00M18k74k1j60j06M18l49j4O3
$$ plain form
2741 -64 165 -188 -111 211 -123 88 301 -114 292 -4 72 42 -242 -72 154 112 -248 30 -170 42 4 -44
2763 -44 -104 14 -139 9 -46 -79 -124 331 -35 219 138 -4 -120 -50 -215 83 -68 61 51 -19 59 -515 68
2786 68 -64 15 222 -122 19 37 12 147 -191 115 -32 -32 190 -117 -189 -126 -70 83 -133 -159 41 -272 97
2809 97 104 256 139 -182 203 27 -13 -136 70 -56 -24 84 -147 48 -61 -212 -323 -140 13 -51 -62 -50 -210
2832 -210 117 131 -14 -34 9 -84 275 -338 14 214 -72 54 1 -176 135 127 -117 53 -82 152 157 73 98 49
2856 49 -38 -41 -17 -242 186 36 -144 -185 -86 55 99 -23 -192 180 4 67 197 -152 166 78 -276 121 -199
2879 -199 -24 37 50 -205 -102 370 -82 309 -135 -43 210 173 73 -406 -19 140 -10 138 150 -68 -266 79
2901 79 238 -161 -100 -137 -150 -75 -3 36 83 -32 20 -237 205 151 -67 66 -409 -298 -108 87 -287 -42 161
$$ packed form
2741f4K29l53P7L22l34K11K13m15M06k96P6l0k84J70K26m2l60K78k00K12l8m8
2763d4o0J18j53J48n5l3m5M55l66K54q1j42j16P0j65K98j51J29j0p0P8n74N83
2786F8j32P9K07l44J41J8k5J35l38L06j47%K22l07p2O3N6J53k16k6K00l13L69
2809I7PJ52j17l21L85j76m0j23K06j26L2J08k31J95j09j51j11J83J53o4j1J2j60
2832b10L27J4j45k0M3r3L59o13L52K00k86J26n3j77L11qk44J70j35K34Nq4K5m9
2856D9q7lK4k25M28j50j80m1R9J41M4j22j69L72j76O3J30l49L18q8l54L97l20
2879a99J75O1J3k55J03M72m52L91m44R2K53l7j00m79L87J59j50J48J2k18j98L45
2901G9J59l99O1l7j3P5P2L9M7j15N2k57M42n4k18J33m75J11J90J95l74K45K03
$$ plain form
2924 161 15 60 21 212 -361 237 -83 -119 219 -51 183 307 331 47 -82 -247 13 -228 -45 11 17 40 -127
2947 -127 -60 37 -41 -7 -238 12 248 -4 92 205 171 -119 -84 -193 -6 -188 163 421 89 -72 150 -84
2969 -84 127 -262 -53 -277 -83 -72 -136 -56 1 -52 165 167 228 157 58 62 -9 47 -116 4 53 144 -91 248 131 280
2995 280 204 -66 85 165 -110 -75 55 14 190 -32 320 -13 -106 349 106 -30 104 -33 218 -179 39 48
3017 48 261 -40 -80 98 -197 -77 -188 -133 21 -355 -207 384 -364 -142 39 -103 -57 122 232 0 148
3038 148 -31 25 192 -187 -180 -306 -316 191 8 -77 284 144 -22 -28 -75 125 -113 -31 91 98 52 -87 23 25 118
3063 118 -214 52 93 -93 -37 -32 90 45 117 313 103 -170 -42 166 65 234 35 161 -122 97 -111 -197
3085 -197 219 102 156 -146 -174 -98 67 -53 18 -58 -75 7 62 -308 30 129 -220 166 152 -108 226 265 6 -242
$$ packed form
2924A61j46M5l9J91n73N98l20l6L38k70K34J24K4k84j29j65K60k41J83N6OK3j67
2947a27O7R7p8L4k31K50K36k52R6J13l4k90L5j09J87j82L51K58l32j61K22k34
2969h4K11l89K09k24J94J1o4Q0N7n3K17KO1p1r9Mp1N6j63J20M9R1k35L39j17J49
2995B80p6k70J51Q0k75L5J30m1J76k22L52l33r3M55k43j36J34j37K51l97K18R
3017D8K13l01m0J78k95J20j11N5J54l76J48N91p48K22J81j42M6J79J10k32J48
3038A48j79N6J67l79Pj26j0N07j83q5L61j40j66om7K00k38Q2J22Pm6j39J10KR3
3063A18l32K66M1j86N6NJ22m5P2J96k10k73J28K08j01J69j99J26k83K19k08q6
3085a97M16j17N4l02k8P6J65j20P1p6j7Q2N5l70L38R9l49L86j4k60L34L9k59k48
$$ plain form
3109 -242 -2 -150 134 14 100 35 -25 58 36 -36 125 229 127 -165 192 103 98 66 46 -142 145 7 52 259
3133 259 204 -46 25 57 -71 -166 139 -247 269 177 63 22 83 -133 -1 -239 -111 18 -26 145 74 -31 38
3156 38 -182 -153 145 25 -82 357 -66 133 94 94 322 -44 32 82 -195 -257 -96 -27 -303 29 200 -426 36
3179 36 98 -67 -7 -273 11 105 -123 108 -242 -42 -55 118 -156 50 196 4 -114 -16 30 -108 -63 -70 3 -158
3203 -158 -201 100 345 56 -29 34 46 -63 -53 43 -58 107 -169 174 90 95 -54 -80 -143 -9 -287 -35 17 -263
3227 -263 27 107 91 49 -261 -26 396 134 -9 0 39 -44 42 -121 45 -52 19 -30 40 213 129 61 -90 -116 15
3252 15 211 -106 73 193 -136 140 67 50 -1 -14 -106 69 -19 19 -129 -248 26 -57 -17 -434 -219 -50 106
3275 106 -43 60 78 233 -90 28 -120 132 -79 -99 -68 -161 -121 -75 141 113 -276 75 -146 38 144 -80
$$ packed form
3109b42K40j48K84j20Q6o5o0Q3k2p2J61J04j02k92L57q9nl2k0j88K87j38M5K07
3133B59n5k50P1L2j28r5L05l86N16r2j14m1O1k16J32k38J28J29m4J71p1j05O9
3156C8k20K9K98j20j07M39m23J99l9%K28l66P6N0k77o2J61O9k76L32J71o26M62
3179C6O2j65O0k66K84R4k28K31l50K00j3J73k74K06J46j92j18R8M6j38M5pP3j61
3203a58m3L01K45k89q5O3J2j09J0R6j01J65k76L43q4Nj49k6o3J34k78K52N2k80
3227b63K90Q0j6m2l10K35M22k62j43RL9q3Q6j63J66r7P1m9P0J73q4o8j51k6J31
3252A5J96l17J79J20l29K76p3j7n1j3r2J75q8L8j48j19K74q3M0m17K15J69J56
3275A06j49J03J8J55l23J18j48K52k11k0L1r3M0M6K16k8l89L51k21J84J06k24
$$ plain form
3297 -80 193 -304 -34 52 115 -113 -67 -108 91 220 -18 180 -162 -194 17 39 4 76 24 -83 141 -50 -174
3320 -174 163 -171 72 -81 -32 137 -1 62 -7 -51 108 -332 91 204 218 133 -130 -108 -13 -11 -140 26 -146
3343 -146 -83 95 201 132 9 -70 -149 -148 51 191 -27 -234 -302 -198 64 50 -240 -234 42 338 232 142 131 -19
3367 -19 48 83 -229 34 90 83 -4 46 57 -35 -96 -12 171 219 75 11 -263 252 99 84 76 72 150 -125 11 164 141
3394 141 -238 155 2 117 45 -109 185 199 275 280 -286 -253 82 -91 65 -9 -59 117 -173 -215 -141 -282 -159
3417 -159 -287 -13 -92 10 -9 -226 46 71 -10 71 -117 48 29 -156 368 29 -72 63 -23 29 -19 -23 -106 -23
3441 -23 441 -241 25 26 -232 -46 -133 119 159 -128 151 65 -248 56 -140 -1 95 21 -270 117 -269 311 81
3464 81 22 333 16 105 41 50 -140 -307 1 -149 151 129 125 -88 1 -260 -82 290 -185 113 171 276 190 229
$$ packed form
3297h0K73m97K70Q6O3k28M6m1J99J29k38J98l42l2K11K2l5P2n2j07K24j91j24
3320a74L37l34K43j53M9J69j38O3o9m4J59m40M23J13J4q5k63K2R5Kj29J66j72
3343a46O3J78J06o9j23p9p9JJ99J40k18k07o8J04K62j4k90OK76K96j06r0j1j50
3367a9O7L5l12K63N6pq7N0J1r2o1Q4J83M8j44o4k74N15j53j5qmP8k75J36J53k3
3394A41l79L93j53J15p2j54K94J4P6Nn66L3L35j73J56p4n0J76k90m2P4j41J23
3417a59j28K74p9J02j9k17K72K5q1Q1j88J65j9j85N24l39j01J35q6N2m8mq3Q3
3441b3M64o82K66Jk58J86q7K52M0k87K79q6l13L04j96J39R6p4k91L87l86N80k30
3464H1n9L11l17Q9o4Rj90j67L08j50L00k2mk13Q9k61J78L72m75K98N8J05q6L9
$$ plain form
3488 229 -207 134 29 12 117 85 -127 50 -201 4 105 -148 -374 -90 -83 -140 -248 -111 76 -114 -205 15
3510 15 -22 274 296 41 -72 -132 -170 -9 -29 -152 -63 -125 24 196 161 50 67 -116 -63 154 22 -37 -283 37
3534 37 -16 -183 45 163 51 -148 -114 -204 -145 68 -101 -28 -88 66 88 15 -57 65 104 56 122 -142 23 172
3558 172 181 92 -75 -182 213 206 80 -147 257 -48 -59 26 87 -158 -232 -121 344 137 87 13 -61 -202 -270 67
3582 67 49 -41 -2 224 -113 149 -133 16 -12 104 -103 -120 -117 98 -117 136 -355 -373 311 134 -26 -46 -165
3605 -165 -11 235 -130 98 100 -230 -64 16 166 64 14 -86 145 -30 -164 -32 -90 66 -22 94 -156 40
3627 40 127 -78 1 -131 119 -146 50 -154 318 -53 94 -16 -117 -222 -75 -233 -96 141 -21 209 61
3648 61 -118 19 181 2 181 112 2 240 170 157 -333 13 -343 -143 103 23 138 37 59 90 -106 140
$$ packed form
3488B29m36L41j05j7J05l2k12J77k51K05J01k53k26K84Pn7j08J37J87j90r1K20
3510A5l7K96K2k55j13o0l8J61k0j23Q9o2J49J72l5j11J7j83N3K17j32n9k46L20
3534C7n3j67K28J18j12j99L4r0N9K13j69P3o0J54K2p3p2J22L9m8O6k64J65J49
3558A72Rq9j67j07L95pj26k27M04l05j1Q5O1k45p4J11M65k07n0p4p4j41o8L37
3582F7j8r0L9K26l37K62k82J49k8J16k07j7LK15k15K53m91j8O84j77j60k0j19
3605a65J54K46l65K28Kl30J66Q0J50j02n0j00K31j75j34J32n8J56q8J16k50J96
3627D0Q7k05P9j32K50k65J96k04M72l71J47j10j01j05J47j58J37K37j62K30j48
3648F1j79J37J62j79J79o9j10K38p0j3m90L46l56K00K46q0J15j01K2L1j96K46
$$ plain form
3670 140 180 -227 118 -238 -158 99 4 53 123 -237 -119 -105 -12 103 -81 52 -129 -164 51 83 -259 -122 28
3693 28 212 188 -84 -216 -129 296 -196 -99 -87 150 45 65 -186 -45 81 140 -191 212 102 -19 -18 71 -40
3716 -40 65 -70 188 -50 -40 99 -77 -64 100 169 -38 58 -159 -118 122 176 255 175 -167 -95 -14 -29 16 -29 -4
3741 -4 4 -167 161 44 -136 -6 36 -21 22 170 -43 169 54 167 -200 239 -301 -18 22 -230 171 92 -39
3764 -39 189 -88 53 111 95 -115 152 -87 -233 115 10 -29 104 -47 59 170 95 53 69 102 -241 42 -65
3787 -65 -25 -205 -81 -68 31 307 -46 97 -22 -115 -164 43 59 -95 -27 28 -23 -74 156 20 -30 -169 -292 13
3811 13 271 4 58 -176 -73 -29 49 -248 -44 171 -60 142 -66 -42 -159 -122 -196 139 83 -25 -33 -161 -130 204
3835 204 -52 159 -120 20 94 247 -306 -398 -73 -253 -37 38 146 -92 23 -289 -34 -134 13 -38 140
$$ packed form
3670A40M0m07L45l56Q0K57r5M9P0l60J18J4R3J15j84J33j81l5K15L2l42J37J50
3693B8J84k4k72j32Q7M25m92R7J2K37j05K0k51J41J26N9l31M03j10j21JQ9j11
3716d0J05j35K58k38J0J39j76J3J64O9k07R6k17M1K40N4P9q0l42P2Q1j5M5m5K5
3741dQj71L28j17j80J30M2n7M3J48k13K12j15J13l67M39n40K83M0k52M01p9j31
3764c9K28k77J41N8j6k10K67k39j46L48j05l9J33j51J06J11p5m2J6L3l43K83j07
3787f5M0j80J24J3R9K76l53J43j19r3m9K07J6j54O8N5n1n1K30j36n0j39j23L05
3811A3K58k67N4k34J03M4P8k97K04K15k31K02k08K4j17L7p4L35n6j08qj28L1L34
3835B04k56K11k79J40P4J53n53r2L25j80K16P5J08k38J15l12K55j00J47n1J78
$$ plain form
3856 140 33 96 37 -8 -19 -29 -155 85 -10 45 -4 79 79 6 -9 75 -104 62 205 -61 3 20 -136 -53 -18 -44
3882 -44 56 227 6 -94 29 -98 33 -7 15 -170 -140 119 -182 -9 -315 -280 170 190 -8 -197 123 -256
3904 -256 -226 129 75 236 -99 -310 -326 -15 61 207 55 -91 -329 135 -52 195 -166 -89 -69 38 -247 -61
3926 -61 -89 -163 32 -6 399 154 -147 -190 -16 -104 -164 48 107 -184 94 -4 139 -135 140 203 -192 148 232 208
3950 208 -169 -357 -36 -196 138 211 53 84 16 60 202 74 288 113 -129 -68 -132 -101 76 -55 -75 106 -96
3973 -96 -17 292 -152 -5 32 378 -2 -39 -23 274 -56 -104 -175 -155 184 -290 -24 -38 48 217 -11 25 95 -113
3997 -113 332 -174 -259 -116 -168 71 132 -91 4 123 -176 169 190 -102 -100 -75 130 12 -140 9 96 -222 -128
4020 -128 37 5 -14 -102 -77 40 -84 -97 125 98 71 -283 -72 -238 -84 -136 -176 14 -213 66 141 80 -54 181
$$ packed form
3856A40j07O3n9m5j1j0j26K40r5N5m9Q3%p3j5Q4j79J66J43k66O4J7j56Q3L5k6
3882d4J00J71k21j00J23j27J31m0K2j85L0K59l01J73l06L5M50K0j98j89L20l79
3904b56L0L55n4J61l35k11j6L11P6J46j52j46k38M64j87K47l61P7K0J07k85J86
3926f1k8p4J95l8M05k45l01m3J74q8o0K12N9k91K78r8J43k74K75O3l95L40Q4k4
3950B08l77j88L21j60L34P3j58L1o8M4J42j28K14j75k42O1o4L1J77j31k0J81k02
3973i6P9L09m44J47L7L46l80l7J6K97l30m8p1K0L39m74K66j4Q6J69k28L6P0k08
3997a13M45n06q5J43n2K39O1k23R5J19k99L45K1k92KK5K05j18j52J49Q7l18R4
4020a28J65l2j9q8K5J17j24j3K22k7k7l54K11j66J54n2m0J90k27K79P5o1j34K35
$$ plain form
4044 181 0 158 -154 84 -52 348 -94 -39 232 69 -5 168 97 342 192 91 21 49 -144 53 -5 148
4066 148 170 8 92 -39 25 128 129 180 77 -98 142 271 164 -169 -153 -233 -37 89 -18 -106 68 -243 -21
4089 -21 66 -135 185 -206 -148 -252 246 -124 -101 -17 -84 -246 -23 143 256 165 16 149 93 -13 -165 27 204
4112 204 208 18 -36 192 -32 -348 -34 -51 131 -87 -148 -26 25 68 -119 225 -97 238 168 81 -190 -62 28
4135 28 75 -85 34 -73 98 -21 29 -268 173 24 218 -118 -342 238 -127 -105 -75 129 -18 -80 -52 109
4157 109 -145 133 76 76 -121 319 64 433 153 -51 -28 -163 245 -144 66 227 -41 -2 111 -259 31 3
4179 3 -137 31 104 188 35 245 37 199 49 63 -109 1 165 248 253 80 -109 203 479 -4 206 -82 249
4202 249 59 110 -113 45 -87 42 61 10 59 -53 186 17 267 51 -14 -86 -193 119 -99 161 129 231
$$ packed form
4044A81j81J58l12K38j36M00m42N5K71j63p4J73p1K45j50j01p0K8j93J97n8J53
4066A48K2j62Q4j31O4J03JN1j03j75K40J29j07l33J6q0J96J26j07q8J74l11K22
4089b1Q7k01L20l91N8j04M98l70K3Q4o7j62K23J66J13r1j49J33n6j06j52J92J77
4112B04Mj90n4K28k24l16L14j7J82k18o1J22N1M3j87L44l22L35p0q7k71J28R0
4135B8M7j60J19j07J71j19N0k97M41j49J94l36k24N80l65K2L0K04j47o2K8J61
4157A09k54K78n7%j97M40k55L69k80k04K3j35M08l89K10J61k68L9J13l70K90k8
4179Cj40J68P3Q4j53K10k08J62j50J4j72J10J64Q3Nj73j89L12K76m83K10k88L31
4202B49j90N1k23J58j32J29J9n1M9j12K39j69K50k16o5p2j07L12k18K60l2J02
$$ plain form
4224 231 -193 56 59 -155 -100 41 60 -70 97 253 132 -81 150 297 -48 65 -70 135 -179 309 -103
4245 -103 12 64 277 -29 180 148 -121 -6 98 -139 -104 -184 -208 -7 -411 -75 182 255 -213 -273 96 49 -243
4268 -243 -118 117 -41 -24 47 178 143 -40 -217 13 -100 39 -333 -37 -169 138 74 -142 103 -171 81
4289 81 55 76 -17 -446 -38 129 -189 -143 206 6 -160 -65 5 175 -41 103 145 -54 -102 -3 -79 281 10 -32
4313 -32 77 63 -112 -83 124 -208 -103 197 -62 64 223 2 125 -2 153 47 163 -106 -48 50 -8 265
4335 265 -35 198 -128 334 55 -147 3 -314 49 -94 93 -20 -121 23 240 260 73 -121 304 -1
4355 -1 89 217 81 29 99 173 -323 -100 -12 -99 -197 90 79 -14 -68 -348 -135 57 209 179 -107 185 218 -33 -321
4380 -321 -31 -123 181 5 -47 124 346 -136 -224 66 53 253 -2 117 18 20 -40 -343 -85 -8 -136 418 38
$$ packed form
4224B31m24K49Lk14N5J41J9j30J67J56j21k13K31J47l45J13j35K05l14M88m12
4245a03J15N2K13l06K09l2k69J15J04k37L5q0k4K01m04L36K57P3m68o0L69m7k92
4268b43J25K35j58J7P1J31l5j83j77K30j13J39l72K96j32L07o4k16K45k74K52
4289H1k6K1r3m29M08J67l18M6L49k00j66R5P0J70k16J44M2j99m8R9p6L60k71m2
4313c2J09j4j75K9K07l32J05L00k59J26J59k21J23j27J55j06J16k69N8R8n8K73
4335B65l00K33l26M62k79k02J50l17L63j43J87j13j01J44K17K0j87j94M25l05
4355aR0J28j36n2P0P4m96K23Q8q7r8K87j1r3n4k80K13J92J52l0k86K92L3k51k88
4380c21K90r2L04j76n2J71K22m82q8K90j3K00k55J19r9Ko0l03K58P7j28N54l80
$$ plain form
4403 38 -263 -71 -70 -81 -62 -146 -298 207 -218 -125 139 61 69 -200 -231 -186 11 -114 -2 123 -22 308 -28 -89
4427 -89 127 102 125 95 233 -55 65 1 254 -14 107 -167 85 7 94 -77 77 102 -48 177 -106 -86 -162
4450 -162 -72 -93 24 -41 6 -142 53 124 -103 198 21 58 -74 -93 313 -164 68 -66 -71 70 -198 124 -43
4473 -43 -94 -249 13 -46 29 -89 -122 119 114 96 151 -129 31 191 -143 -58 -99 165 -146 77 22 -169 79 219
4497 219 92 53 9 -7 296 284 128 -196 152 189 134 35 -151 63 197 100 206 118 125 116 75 1 37 -69 11 272
4523 272 -171 12 -229 35 -9 65 -70 -103 -150 264 -262 10 40 -5 73 50 119 119 313 27 -45 -19 54 -104 49
4548 49 122 267 -81 181 -229 -36 161 64 106 -10 77 -74 -61 -193 75 -117 24 -58 -240 115 -65 -99 -64
4571 -64 171 143 21 191 -12 189 -300 66 -7 78 -186 135 27 70 -173 70 75 -35 -92 24 126 -116 -237
$$ packed form
4403C8l01J92Jj1J9q4j52N05m25R3K64p8Qk69l1M5J97j25J12J25j45L30l36o1
4427h9K16k5K3l0J38k88J20o4K53k68J21k74K52p8Q7j71J54K5j50K25k83K0p6
4450a62R0k1J17o5M7j48J95P1k27L01j77L7j32j9M06m77K32j34nJ41k68L22j67
4473d3n1j55K62n9P5j18l3K41nj8N5k80J60J60l34Q5m1K64l11K23n5j91K48J40
4497B19j27l9m4j6L03j2j56l24L48L7n5r9j86K14J34r7J06q8Prm1p4L6j06Q0K61
4523B72m43J83k41K64m4P4j35l3m7M14n26K72L0m5P8k3O9%J94k86p2K6P3j58J53
4548D9P3J45l48K62m10J93J97r7M2j16Q7j51J3j32K68j92J41q2j82L55j80l4L5
4571f4K35k8j22J70k03K01m89L66p3Q5k64L21j08M3k43K43Nj10n7J16J02k42j21
$$ plain form
4594 -237 52 -43 -51 -121 -47 -263 -14 129 27 126 -175 202 -93 -43 55 -37 263 144 -170 -126 322 26 22 86
4618 86 -191 179 150 27 -3 -44 113 -126 -217 -262 101 261 35 129 17 -92 -43 -178 70 124 -256 135 233
4641 233 -169 -269 165 -91 -29 -16 32 76 -39 -161 94 51 109 -190 71 33 12 -56 -196 106 -163 171 15
4664 15 71 -20 -16 41 95 -271 -52 405 92 -226 124 296 -19 327 -346 -151 -173 -98 93 -184 -10 10 38 19
4688 19 -157 -279 60 160 58 54 -104 -146 294 -166 -211 -118 16 62 -64 -268 48 86 -155 396 -193 18 1
4711 1 -23 -121 30 -85 -85 288 -73 -438 -271 59 63 -340 -71 18 -192 72 -221 122 -373 -272 -9 -123 -185
4734 -185 6 11 -355 -119 76 167 16 123 114 231 -69 202 -114 -59 278 30 63 -149 34 120 -3 -253 5
4757 5 -58 95 43 27 -81 -64 -324 164 -42 -321 -191 -7 -2 27 -28 -172 138 240 -30 94 -87 -260 -204 173
$$ packed form
4594b37K89r5qp0P4k16K49J43j02R9l01L77k95N0R8r2L00j19l14M4M48k96mO4
4618H6k77L70k9j23l0m1J57k39r1m5L63J60k26R4j12j09M9j35K48N4l80L91R8
4641B33m02j00M34k56O2J3M8M4j15j22K55m3N8k99K61l8k1o8j40L02k69L34j56
4664A5N6r1MN7N4l66K19M57l13l18L50J72l15L46o73J95k2P5J91k77J74K0K8j9
4688A9j76j22L39J00j02mj58m2M40m60m5R3J34M6j26k04L16L8k41N51n89K11j7
4711Ak4r8J51j15%L73l61l65J67L30Mm03K69Q9k10K64k93L43m95J01K63j14o2
4734a85J91Nl66K36J95R1j51J07rJ17l00K71l16N5L37k48L3k12J83Q6j23k50K58
4757Eo3J53n2j6j08J7k60M88k06k79J30J84NK9n5j44L10J02k70J24j81j73N6L77
$$ plain form
4781 173 -191 -5 178 81 -249 -168 75 -197 125 166 164 -116 -52 38 287 -51 40 -211 -43 -4 211 293 161
4804 161 -150 -87 14 -51 -29 149 137 -52 -137 -203 -226 -99 115 -74 -31 85 -145 167 -158 73 -91 -263 -216
4827 -216 185 114 4 57 -341 -121 57 -50 7 12 -74 138 -36 179 10 202 -43 -6 -105 141 245 -99 -158
4850 -158 -179 -150 86 134 -217 -17 193 41 -52 -26 10 -158 -75 7 185 -74 -325 -121 58 -240 -29 -223 103
4873 103 137 97 62 41 -60 -85 -113 5 174 103 -123 -78 -129 -177 -225 172 276 -3 -83 120 -163 -77 47 -141
4897 -141 14 -98 -56 -402 -192 -168 -40 10 -156 9 -331 116 40 -25 -112 36 25 -47 102 -10 100 -94 -188
4920 -188 -190 -149 -215 -83 313 -312 -66 -194 16 186 177 -13 170 -99 -58 90 127 55 6 -83 -167 143 114 168 82
4945 82 72 177 90 57 121 20 197 -150 -234 -36 -16 124 -73 42 11 36 261 21 213 198 134 -31 -18 409
$$ packed form
4781A73l64J86J83r7l30Q1K43k72L22M1kk80O4R0K49l38R1k51J68L9K15Q2j32
4804A61l11O3J01o5K2J78j2j89q5o6k3J27K14j89M3J16k30L12l25K31j64j72M7
4827b16M01p1j10N3l98K20J78j07N7Nq6K12j74K15j69J92k45L7r9K46J04l44n9
4850a58k1K9K36M8l51K00K10j52r3K6L6j68Q3Q2J78k59k51K04J79k98K11j94L26
4873A03L4m0l5k1j01k5k8J18J69p1k26M5n1m8m8L97J04k79q0K03k83Q6J24j88
4897a41J55j12M2l46K10K4J28N0j66J65l40M47p6o5q7J48j1p2J49j12J10j94r4
4920a88kM1o6J32L96o25K46j28K10J70rj90J83k69M1J48L7p2m9q9q4L10k9N4q6
4945H2j0J05q7l3O4j01J77l47q4J98K0J40j97J15l1K5K25k40J92j5o4j65J3M27
$$ plain form
4969 409 -11 -131 159 -95 8 81 -63 -112 41 -38 148 158 -543 -143 -101 11 320 -279 -55 53 -93 72
4991 72 308 30 -132 159 -103 140 -14 134 -130 -4 -180 47 -63 -74 13 -141 -86 97 263 -234 119
5012 119 13 224 -126 -131 -7 156 142 86 -69 -297 -257 -8 -292 -255 91 -56 -27 -150 -231 -81 -12 24 -279
5035 -279 67 17 -158 -223 -177 -43 -432 -267 -330 -35 -64 -216 -78 211 -36 220 -40 -68 -114 20 -36 25 -20
5058 -20 48 -1 14 -88 -76 171 43 174 -47 -228 -211 -25 -76 214 -10 -47 -77 -98 -208 -322 -86 146 111 135
5082 135 137 -3 172 -50 -162 -56 49 -165 -92 -297 -156 -88 -5 75 43 256 -117 13 122 184 -121 185 -6
5105 -6 152 -136 -49 48 125 201 361 35 142 62 -119 243 -145 -39 -66 130 17 43 -87 32 167 294 171
5128 171 334 214 -74 128 98 184 -141 -111 -37 135 100 33 -9 -137 134 -166 -84 35 -31 40 101 -76 202 10
$$ packed form
4969D09m20j20K90k54J03P3j44m9J53p9J86J0p01M00M2J12L09n99K24J08j46J65
4991G2K36k78j62K91k62K43j54J48k64J26j76K27j10j1Q7j54N5J83J66m97L53
5012A19j06K11l50nJ24J63j4n6j55k28M0K49k84L7L46j47K9j23q1J50O9L6l03
5035b79L46n0j75o5M6J34l89J65o3K95k9j52J38K89k47K56k60k8m6J34n6O1m5
5058b0O8m9J5j02J2K47j28J31k21j81J7J86n1K90k24l7l0k1j10j14K36K32l5K4
5082A35Kj40J75k22j12J06J05k14P3k05J41O8Q3Q0l2K13l73J30J09O2l05L06j91
5105fJ58k88Q7R7P7P6J60l26J07q0j81L62l88J06k7J96j13K6j30J19J35J27j23
5128A71J63j20k88K02l0Q6l25L0P4J72l5o7m2j28K71l00Q2J19o6P1O1j77K78j92
$$ plain form
5152 10 -326 161 -114 -63 -208 -59 -127 -85 14 149 150 59 -8 -226 -64 270 -81 211 201 11 -86 -17 44 -51 -142
5177 -142 -102 136 -187 142 63 -96 279 76 -86 -101 -157 -122 -58 5 -169 -183 -36 -26 -31 15 -154 -152 -154 58 -62
5202 -62 -29 7 -179 -56 -141 103 111 199 41 132 174 277 20 21 0 144 -157 5 -26 194 37 -11 -22 -74 -117 50
5228 50 -171 -265 -111 -117 -175 151 1 -104 -30 7 -275 56 104 -190 76 -93 27 -24 -9 0 -76 -113 126 57 -17
5253 -17 20 168 -3 -72 56 30 145 69 153 274 -18 262 -210 65 -44 -234 138 158 83 59 -246 -7 -292
5276 -292 -25 -15 -170 187 73 105 -51 -21 -166 -61 -64 113 -91 -13 -111 181 81 -180 -113 227 223 11 90 -196
5300 -196 -141 -57 -237 -174 -198 32 -43 -7 -214 317 -112 -160 -61 -82 -9 -63 31 106 -25 -45 128 -218 103 -109 -204
5325 -204 -14 -44 16 66 -104 -240 130 -158 -132 50 -195 211 -113 -232 37 97 82 222 91 225 -13 119
$$ packed form
5152A0l36M87k75N1j45J49o8M2R9J35Jr1o7k18J62L34l51K92j0j90r7O9O1r5r1
5177a42M0K38l23L29p9j59L75k03j62j5n6L5O4O3j74j4J47J0nM6j69KkK12j20
5202f2L3L6j86J23q5K44QQ8j58R1M2J03k57Jk1J44l01J62l1K20j57m8j1n2m3J67
5228E0k21r4J54on8L26j50j05P4L7k82L31M8k94K66j69J20n1J5Rp6l7K39o9p4
5253a7L7J48j71o9J28k6J15p6Q4J21k92K80m72K75j09j90L72K0p5k4l05K39k85
5276b92K67J0j55L57j14L2j56L0j45J05lJ77k04P8r8K92j00k61O7L40mk12P9k86
5300a96N5Q4j80O3k4K30p5L6k07N31m29m8R9k1P3n4R4P5j31k0J73l46L21k12r5
5325b04J90l0O0N0j70j36L70k88K6J82k45M06l24j19K69O0j5J40j31J34k38J32
$$ plain form
5347 119 219 -8 -236 142 -150 37 -151 -209 -87 58 64 160 12 -43 341 168 169 30 -15 187 1 165 -30
5370 -30 53 -426 -21 -196 66 -53 4 44 -44 90 -258 -5 11 328 58 -126 -126 127 93 -242 227 -76 -161
5393 -161 -177 126 151 -149 114 209 -48 3 -209 21 -190 -14 -72 113 464 14 -187 39 -105 -294 94 -64
5415 -64 -102 132 32 148 -28 11 -13 176 121 -143 -190 -197 -9 359 -62 83 87 96 -366 -138 69 9 181 98 -49
5440 -49 131 -174 -362 77 -73 138 -60 48 278 56 -104 -252 -121 -65 140 169 -72 5 -266 -57 83
5461 83 -137 225 8 -18 18 48 378 235 14 -71 -196 202 72 -38 93 241 173 47 -17 82 306 89 59
5484 59 -17 -187 -90 -192 -182 111 -110 51 115 278 -212 -154 -30 58 65 219 44 -248 111 64 -166 65 -157
5507 -157 51 -283 25 73 -71 -114 -107 -38 -102 -64 -246 87 -181 -67 -12 -112 -111 78 22 -138 132 111 25 -18 261
$$ packed form
5347A19J00k27k28L78k92J87j88n8J22J45OR6j48n5L84j73Jj39m5K02j86J64j95
5370c0Q3m79M05j75K62j19N7M0q8J34l48K53J6L17k70j84%K53l4l35M69l03q5
5393a61j6L03K5l00K63R5k57N1k12K30k11J76n8J85L51m50k01K26j44j89L88j58
5415f4l8K34j00J16j76L9k4J89n5k64m7pJ88L68m21J45MRm62K28K07o0J72q3j47
5440d9J80l05j88M39j50K11j98J08K30k22j60j48J31N6K05K9k41P7k71K09J40
5461H3k20L62k17k6L6L0L30j43k21q5j25L98j30j10J31J48o8j26o4R9K24k17l0
5484E9p6j70R7j02J0K93k21J61O4J63m90N8J24Q8PJ54j75k92L59m7k30K31k22
5507a57K08l34L08M8j44m3PO9o4L8j82L33k68J14N5j00JJ89n6j60K70k1q6m3K79
$$ plain form
5532 261 -87 43 124 -33 330 127 -130 146 300 -210 -138 292 -1 -158 -17 -33 -43 -20 148 48 -2 -4 61
5555 61 -151 85 -225 -69 -140 65 -36 20 -73 -87 110 -30 -131 291 -15 -162 215 -140 66 -56 240 228
5577 228 75 -164 30 -40 136 38 -15 69 322 -11 -36 -23 108 163 -108 44 53 38 -255 -251 -36 88 -195 90
5601 90 175 -45 16 -145 -190 11 118 85 11 231 136 -77 -204 -132 6 247 -86 -115 -23 -45 -120 146 -91 44
5625 44 161 114 -128 -120 180 145 -10 157 101 0 74 -55 27 70 252 -10 17 8 -8 106 40 -11 166 -73 210
5650 210 173 -73 -101 111 -164 58 206 167 139 97 42 -106 3 -170 -50 -47 -2 -273 22 -5 -27 -52 85 307
5674 307 -161 198 21 -4 33 101 -143 -333 -390 72 180 -93 1 -133 7 86 25 44 33 41 127 -90 -170 -306
5698 -306 -75 38 207 -154 -39 -28 98 -66 33 0 231 -24 -167 33 -18 -6 44 37 211 5 292 50 -236
$$ packed form
5532B61l48J30Q1j57L63k03k57K76J54n10P2M30k93j57J41j6j0K3J68j00n0kO5
5555F1k12K36l10J56p1K05j01N6r3j4J97j40j01M22l06j47L77l55K06j22K96j2
5577B28j53k39J94p0J76r8n3Q4K53l33k5J3J31N5k71J52Rj5k93MK15J24k83K85
5601I0Q5k20O1j61m5K01J07l3p4K20r5k13j27P2J38K41l33k9R2k2p5K66k37J35
5625D4J17m7k42QL00l5j55J67n6j01P4j29Q2M3J82k62K7rj6J14o6n1J77k39K83
5650B10l7k46k8K12k75K22J48l9k8m2n5j48J09j73J20LM5k71K95k7k2k5J37K22
5674C07m68L59j77k5L7O8k44j90n7M62J08k73R4j34J40P9o1J9j1QQ6k17q0j36
5698c06K31J13J69l61J15J1J26j64R9l3K31k55j43K00n1J2N0pJ74k06K87k42k86
$$ plain form
5721 -236 -18 59 217 -68 -64 -42 -245 -11 -97 -140 223 49 61 -42 -47 -133 86 -54 3 -206 -223 38 202 -11
5745 -11 43 -74 -37 -102 -156 -11 40 104 28 54 -116 72 141 -19 4 -10 -174 167 -99 -186 130 354 -69 32
5769 32 36 -159 114 -70 154 -19 202 87 105 295 117 10 137 5 -143 -160 -138 -79 -40 395 30 62 37
5792 37 34 83 158 122 -152 58 102 -104 -37 3 177 -228 -293 -137 -173 71 -27 47 -81 -111 -220 66 -46 96 -43
5817 -43 267 4 6 49 135 79 168 45 115 19 99 -38 -11 -58 64 42 -138 -45 -118 71 59 -299 -19 217 -249
5842 -249 94 3 165 -169 159 265 126 85 -114 137 -101 -103 -7 -295 -7 281 125 -27 -128 266 39 -99
5864 -99 -181 -93 -17 -45 133 -168 324 130 40 178 -175 -121 149 -145 231 -60 -152 -40 51 -268 161 -8 -114
5887 -114 -271 -132 -81 17 21 88 90 46 -63 -12 134 -173 226 184 -221 332 -279 -52 -33 -194 -110 -82 -24 -2 60
$$ packed form
5721b36K18P7J58k85MK2k03K34q6m3L63j74J2j03nq6K19j40N7k09j7K61J64k13
5745a1N4j17L7o5n4J45N1O4p6K6j70J88O9j60K3j4j64L41k66q7L16K24m23J01
5769C2Mj95K73j84K24j73K21j15J8J90j78j07J27j32j48j7K2N9L9M35l65L2k5
5792C7lM9P5l6k74K10M4k06O7M0J74m05o5J56l6K44r8P4j28l0j09K86j12J42j39
5817d3L10k63KM3Q6n6Q9j23P0r6Q0j37K7m7J22k2j80R3p3J89j2l58K80K36m66
5842b49L43r1J62l34L28J06j39m1j99K51k38kR6k88K88K88j56j52j01L94k27j38
5864i9q2Q8P6k8J78l01M92j94r0J38l53N4K70k94L76k91r2J12R1l19M29j69j06
5887a14j57J39N1R8MO7Km4j09N1J46l07L99m2m05N53o11K27J9j61Q4K8N8K2O2
$$ plain form
5912 60 -153 32 11 96 -3 -82 -9 -110 -14 -173 9 182 -138 206 -178 66 76 -119 -18 325 -28 -153 -82
5935 -82 -51 -1 326 -105 148 80 24 25 -68 26 -122 -227 7 70 -5 -58 -48 63 -160 -28 52 -238 67 -115 99
5960 99 135 132 5 -21 -34 -183 -26 -12 -134 -194 245 -166 -367 -166 -14 -165 -263 -19 -17 -20 60 198 186 99 -162
5985 -162 189 -76 79 -1 159 263 -75 -101 -176 130 -179 -294 71 84 -125 -215 235 248 -196 -319 146 -2
6007 -2 -208 19 92 68 -248 -34 -154 -142 33 -117 -9 20 176 8 -115 -42 -36 48 -22 182 103 152 0 170
6031 170 -9 -120 130 -97 -49 -80 76 -214 -108 88 -122 17 -125 -35 -159 118 -61 -141 -217 76 246 393
6053 393 11 -191 -64 -112 -133 -5 140 117 116 100 166 -115 -9 -61 -79 -78 -8 -114 -177 25 44 45 -109 251 -127
6078 -127 -43 218 114 67 136 108 -100 -403 -121 -129 359 -21 -5 -85 -234 13 -104 65 -14 -226 -30 -17 -17 -144
$$ packed form
5912F0k13J85k1Q5r9p9P3j01R6j59J82J73l20L44l84K44J0j95J01L43l53j25P1
5935h2L1N0L27m31K53o8n6Jr3R4j48j05K34O3p5n3J0J11k23J32Q0k90L05j82K14
5960I9L6lj27k6j3j49J57J4j22o0M39m11k01K01J52j51r8K44KlQ0J38j2q7k61
5985a62L51k65J55q0J60J04l38k6p5L06l09j15L65J3k09r0M50J3m44j23M65j48
6007bk06K27P3k4l16K14j20J2J75j50J08K9J56j68j23P3OQ4p0K04p9M9j52J70
6031A70j79j11K50k27M8l1J56k90J06J96k10J39j42R0j24K77j79q0p6K93J70J47
6053C93l82k02J27m8k1J28J45k3jj6O6k81J06n2j8JP0j06o3K02J9Jj54L60l78
6078a27Q4K61j04m7O9k8k08l03K82qM88l80J6q0j49K47j17J69p9k12J96J3%j27
$$ plain form
6102 -144 -28 -91 74 -235 -156 -87 -47 -96 143 127 -11 -7 -9 145 187 167 276 -135 67 73 36 -60 -88 -88 -156 -43 -10
6129 -10 88 -363 20 240 36 -144 -110 -2 16 218 -44 93 -111 60 -7 -102 83 175 174 234 -345 -61 10 59
6153 59 -175 -57 77 -148 200 232 86 10 144 193 223 29 -129 -94 -146 -271 114 90 95 168 -34 47 20 32 37
6178 37 -31 45 -58 -48 105 -183 -327 -86 -56 -190 -34 119 -86 -163 68 -301 307 -22 -28 189 129 0 -356
6201 -356 -181 98 33 93 -37 -183 113 121 -27 146 -127 -92 32 252 -199 82 -40 68 -261 -169 -356 -251
6223 -251 -111 -96 50 18 -152 -129 -33 -161 95 -65 -145 56 127 120 70 38 -68 -88 347 149 -208 116 -122 -127
6247 -127 -231 -101 78 63 -11 51 -180 -268 -129 -16 -305 3 118 125 -399 29 31 -5 -186 -28 -187 -121 259
6270 259 -121 17 31 202 96 53 152 28 115 105 -172 71 -34 4 37 -262 107 171 -61 99 151 -119 266
$$ packed form
6102a44J16o3J65l09P9O9M0m9K39j6j38MkJ54M2k0J09m11K02Ol7r6k8%o8J13L3
6129a0R8m51L83K20k04j80L4J08J8K02k62J37k04J71o7r5J85R2jO0n79K84P1M9
6153E9k34J18J34k25L48L2j46p6J34M9L0j94j58L5n2j25L85k4NP3k02Q1k7J2N
6178C7o8P6j03J0J53k88j44K41L0j34J56J53k05p7K31l69O08l29oK17o0j29l56
6201c56J75K79o5O0j30j46K96Qj48J73k73L5J24K20m51K81j22J08l29R2j87J05
6223b51J40J5J46l2j70K3R6j28K56j60q0K01P1pn0l2j06k0M35j98l57L24k38n
6247a27j04J30J79j5p4O2k31q8J39J13k89L08J15Pn24M28Kl6j81J58j59O6L80
6270B59l80J38J4J71j06m3R9j24Q7j0k77K43j05L8L3k99L69O4k32J60N2k70L85
$$ plain form
6293 266 -56 6 -151 60 -53 -125 -231 154 303 5 36 94 -138 -173 -202 16 108 161 30 101 -70 48 52 -247
6317 -247 -103 24 87 -188 -91 -61 -116 -34 -26 113 116 49 186 105 -8 160 60 122 31 119 -203 20 101 -57 66
6342 66 177 261 -104 -130 -79 -11 25 -56 6 55 -71 97 -13 -274 -73 -165 -39 -48 42 94 191 -52 255 99 111
6367 111 8 -178 -179 199 -11 177 214 4 147 71 -4 -179 176 90 -189 -53 -26 60 -63 -32 349 149 -136
6390 -136 -86 -163 -122 111 30 94 58 79 31 258 31 -92 44 49 182 -58 -354 95 104 107 304 89 -14 174 -61
6415 -61 -26 -95 -208 285 -188 94 167 155 65 -70 59 146 -205 -87 -127 143 -223 166 -48 -28 155 -73 134
6438 134 234 161 -178 108 -80 -94 2 178 34 178 182 -25 -110 61 73 272 108 217 -303 -27 76 -150
6460 -150 -166 122 -177 -290 30 -93 -258 327 134 79 -118 57 -133 -43 -10 131 20 145 -36 6 182 103
$$ packed form
6293B66l22O2j57K11j13p2j06L85J49k98L1N8k32l5k9K18R2N3j31P1j71J18Mk99
6317b47J44J27O3k75R7L0n5Q2QJ39Lo7J37q1j13J68j00O2r1Q8l22K23Q1j58J23
6342F6J11Q4l65k6N1O8L6q1O2M9j26J68j10k61K01r2J26rR0N2R7k43L07j56J2
6367A11j03j86jL78k10J88L7k10J43p6p5j75L55q6k79J36K7Q6j23L1L81k00k85
6390a36N0p7M1K33q1O4l6K1m8K27k27j23J36NJ33k40k96M49RLJ97k15j03J88k35
6415f1L5o9j13M93m73K82P3j2r0j35J29Q7l51J18m0K70l66L89k14K0J83k28K07
6438A34J00p3l39K86j88j4R6J76j44J44Mk07q5J71J2J99j64J09n20K76J03k26
6460a50j6K88k99j13L20j23j65N85j93n5j97J75j90R0L3J41j11J25j81M2J76p9
$$ plain form
6482 103 108 124 93 30 43 27 -74 68 78 133 484 -8 -27 94 -27 -210 54 -162 -98 14 -170 -16 -88 -40
6506 -40 -25 -17 192 166 73 150 53 -138 -189 -215 -175 -213 112 34 64 53 43 -14 150 -88 69 192 105 209 -41 269
6532 269 366 -64 4 296 -114 -39 -127 -198 -293 -144 102 52 38 155 -32 236 -346 188 119 -89 -230 -195 85
6555 85 150 118 13 -88 -24 83 -66 -128 289 201 -120 96 -39 -147 112 294 -145 -7 -193 -209 -267 41 -112
6578 -112 -173 260 -47 209 201 251 -134 64 41 -197 78 262 -89 103 115 -155 -300 -106 -17 95 213 -10
6600 -10 218 -84 -29 -132 277 -83 -102 -51 129 41 20 349 186 -17 -133 166 171 132 -194 51 113 98 98 107 292
6625 292 123 25 -195 135 192 -193 -358 29 -67 -235 -173 0 145 -191 -17 -43 -164 144 -323 51 108 -40
6647 -40 134 34 -77 -179 278 -14 94 -77 148 -288 64 -125 -65 100 151 185 46 -61 124 220 46 -95
$$ packed form
6482A03NJ6l1o3J3j6j01J42J0N5L51m92j9J21j21j83K64k16O4J12j84J54p2M8
6506d0J5QK09k6r3P7r7j91n1k6M0l8L25p8L0j1j0n7J64k38J57J23q7J04k50L10
6532B69R7m30O8K92m10P5q8p1r5J49K46n0j4J17j87K68n82N34o9k08j41L5K80
6555H5O5l2j05j01O4J07j49o2M17q8l21K16j35j08K59J82m39J38j86j6n8L08j53
6578a12o1M33l07K56qN0l85J98k3k38K75J84l51J92J2k70j45J94Q9J12J18k23
6600a0K28l02N5j03M09l60j9N1J80q8k1L29j63k03j16K99Nl9l26K45O2j5%RJ85
6625B92j69r8k20L30N7l85j65L87r6j68O2J73J45l36J74k6j21L08m67L74N7j48
6647d0J74j00j11j02M57k92J08j71K25m36L52j89O0J65N1L4j39j07J85R6j74j41
$$ plain form
6669 -95 183 32 -88 -40 -143 -31 -316 -618 -65 -178 136 -143 187 71 55 20 43 151 -130 270 83 -80
6691 -80 -82 -95 -52 261 37 88 -247 34 166 -68 -98 19 160 1 -153 -28 -31 43 -186 -52 173 -143 -75 148
6715 148 79 -48 144 428 -129 -226 -23 188 44 -261 189 16 -192 57 152 -133 -262 -74 47 67 84 4
6737 4 -247 6 -47 -65 -17 -88 -251 -345 -80 -5 290 94 -74 108 172 -57 346 204 -169 -52 153 -119 187
6760 187 7 88 -6 90 -112 64 329 86 194 -8 -227 37 -187 59 -140 106 22 -23 -60 46 203 -61
6782 -61 204 152 -122 21 -14 -97 270 -8 61 50 -15 55 159 -1 -86 -139 -44 146 -240 153 124 199 0 48 105
6807 105 -54 87 -34 200 175 276 -196 -183 -129 164 -61 186 -205 -13 -104 -42 75 124 167 191 45 50 4 89
6831 89 -185 -49 277 10 34 34 53 -390 -26 -99 190 138 -51 -41 88 -20 183 64 -259 11 66 -63 107
$$ packed form
6669i5K78j51j20M8j03J12k85l02N53j13L14k79L30j16j6l5K3J08k81M00j87j63
6691h0kj3M3L13k24N1l35K81J32k34l0J17J41j59j54J25lP4k29J34K25l16O8K23
6715A48o9j27J92K84n57r7K03K11j44l05M50j73k08K49R5k85j29J88J21K0J7q0
6737Dk51K53n3j8M8p1j63r4K65P5K95j96j68J82O4k29M03j42l73J17K05k72L06
6760A87j80Q1r4R6k02J76K65k43J08k02k19K64k24K46j99K46q4m5l7J06J57k64
6782f1K65n2k74J43l5q3L67k78O9j1o5P0J04j60q5n3R5J90l86L93k9P5j99M8N7
6807A05j59J41j21K34k5J01m72J3N4K93k25K47l91J92r1O2J17M9M3K4j46Nm6Q5
6831H9k74J36L26k67K4%J9m43L64p3K89n2j89J0J29j08K03j19l23K70N5j29J70
$$ plain form
6854 107 33 -218 291 -79 -7 -189 -176 288 -34 79 -167 -7 -117 -143 37 87 34 -114 -240 -131 -139 78 -131
6877 -131 75 -7 -16 -61 -182 -123 40 26 204 -119 -266 -29 28 125 -49 71 -9 53 -19 -161 128 133 -58 -142 97
6902 97 -124 -255 -154 169 45 -10 -75 159 243 -265 -158 -26 -97 -393 -23 -24 -93 -23 51 159 -390 -279 -46
6925 -46 -91 -32 -93 -101 -55 -1 -59 -8 -198 -64 -117 -42 161 -68 78 -25 -60 156 -128 64 -52 49 -213 -203 15
6950 15 -109 -204 128 98 -2 135 -233 -83 120 75 -43 -129 184 -64 -288 -141 -109 -99 -172 -8 -16 -139 123
6973 123 -43 215 2 -167 -156 225 37 -56 28 -17 -96 165 110 42 78 -41 361 -271 -110 -35 -146 95 -208
6996 -208 -337 -59 -19 -161 -148 -6 82 213 162 110 -153 78 14 -117 312 156 -42 147 54 -69 20 106 -27
7019 -27 142 28 59 64 160 -65 -181 55 -63 18 -28 40 2 19 -47 180 112 -61 -128 -126 33 236 115 -50 5
$$ packed form
6854A07p4k51N09l70P2j82J3M64l22J13k46J60j10k6J80N0n3j48j26J09qK17k09
6877a31K06q2rm5j21N9J63j4J78l23j47K37N7R7j74J20q0O2p2j42K89Nj91q4K39
6902I7k21j31J01L23j24n5o5K34Q4n08J07J32p1k96L70jo9P0P4J08n49J11K33
6925d6m5N9o1qM6N4n8N1j90J34n3P5K03k29J46j03l5K16k84J92j16J01k62J0K18
6950A5j24r5L32l0j00J37l68J50K03m5j18q6L13k48k24J47L2J0p3J64qj23K62
6973A23j66K58k13j69J1L81j88r3Q4m5p9K61n5o8L6j19M02o32J61P5j11K41l03
6996b08j29K78M0j42J3J42Q8J31n1n2k63K31o4j31M29j56j98J89r3j23Q9Q6j33
7019b7J69j14L1NR6k25j16K36j18Q1m6O8l8J7o6K27o8j73o7KJ59K03j21j65N5
$$ plain form
7044 5 32 136 -176 172 99 -10 78 -25 174 13 132 70 -190 -67 -127 -365 -102 -119 -19 -150 17 -6 -1 49
7068 49 161 -15 -1 336 -101 374 30 161 142 -181 75 -184 83 -73 408 -129 70 -131 123 -74 -105
7089 -105 65 211 233 -23 -84 -124 180 335 132 44 -303 55 -204 -145 -249 -106 60 -50 191 -30 -265 126
7111 126 47 -196 52 -201 -314 -64 -17 25 238 170 237 -46 -56 -33 28 -257 183 143 193 -29 40 86 45 -1 138
7136 138 -83 -237 11 183 67 -103 -22 -175 194 -23 -31 -40 38 122 118 -158 -161 8 8 53 233 -45 141 47 154
7161 154 -187 -66 -95 134 7 -141 110 303 -310 -67 -4 69 66 -275 150 99 24 -95 -212 -55 -110 107 101
7184 101 17 -92 -80 -141 -104 138 -255 -129 -200 -74 115 -71 -161 -42 -28 -171 -16 78 106 152 -75 -65 -44 50
7208 50 -223 33 194 -92 -29 -41 92 28 74 69 -9 113 118 -113 243 143 -41 27 -106 -30 235 -477 -6 -155
$$ packed form
7044EK7J04l12L48p3j09Q8j03J99j61J19o2k60J23o0k38K63j7J00j31J67k3NN0
7068D9J12j76J4L37m37M75l44J31j9l23K56k59K67j56M81n37J99k01K54j97l1
7089a05J70J46K2k56o1m0L04J55k03q8l47L58k59N9j04J43J66j10K41k21k35L91
7111A26p9k43K48k53j13K50M7M2K13o8O7k83j0K3O1k85M40m0N0k22O9M6m1m6J39
7136A38k21j54K48J72j16j70Q1j53L69k17qrP8Q4mk76lJ69%M5J80k78J86r4J07
7161A54l41J21k9K29j27j48K51J93o13K43O3P3ll41M25n1p5j19j17J57n5K17o
7184A01q4j09J2o1L7K42l93J26p1J26J89j86r0J19J4j43J55R4K8M6k27J0K1R4
7208E0k73K56J61k86O3j2J33o4M6np8J22Nk31L56j00j84O8j33P6K65p12M71j49
$$ plain form
7232 -155 -14 67 216 -71 20 -30 -141 -46 20 180 7 137 -13 150 -207 71 -9 -198 63 92 -96 184
7254 184 -253 -171 158 -130 -51 -163 -84 -32 409 -149 -24 -28 -215 -38 6 34 147 -169 -29 5 19 -52 267 61
7278 61 -95 94 -81 57 48 56 16 219 116 100 93 -48 -274 -223 -107 -77 73 113 -311 -67 0 152 112 -238 136
7303 136 12 160 -237 2 69 -62 43 -193 111 -51 77 -51 123 58 108 -8 -16 -22 -38 159 -31 1 157
7326 157 23 208 -385 199 10 35 296 242 -15 -26 149 257 179 112 -10 93 96 49 -39 -68 -119 -258 -25 -27
7350 -27 107 -119 -265 -77 -12 174 -76 40 4 214 -68 -48 17 339 -107 154 -335 204 -57 -307 178 133
7372 133 -15 148 -9 57 38 -134 -346 1 42 72 157 -113 93 145 195 -45 10 -13 212 130 116 138 218 -55
7396 -55 188 17 -120 -36 87 209 -44 124 99 -181 -13 -90 -21 175 149 63 -273 287 0 44 -150 -149 -136 381
$$ packed form
7232a55J41Q1J49k87R1n0j11R5O6J60j73J30j50J63l57K78q0j89K61K9j88K80
7254A84m37Q2L29k88P9j12P9N2M41n58J25mj87J77M4K8J13l16J40L4J4p1L19k06
7278F1j56J89j75J38rQm0K03j03j6pj41k26N1J16L0J50M0m24K44O7J52m0l50L74
7303A36j24J48l97K39O7j31J05k36L04j62J28j28J74o5N0j16qoj6J97j90L2J56
7326A57j34J85n93N84j89K5K61n4k57j1J75J08p8o7j22J03Lm7q8k9n1j39K33k
7350b7J34k26j46J88O5J86k50J16l6K10k82K0O5L22m46K61m89N39k61k50M85m5
7372A33j48J63j57O6j9j72k12L47M1L0Q5k70K06N2N0k40N5k3K25q2j4K2Q0k73
7396e5K43j71j37Q4J23J22k53J68k5k80J68p7O9J96k6q6l36N60k87M4j94JJ3N17
$$ plain form
7420 381 -172 -164 -215 -250 173 53 -12 5 100 -21 -137 29 31 -146 -165 68 -79 56 198 -66 -16 50 361 21
7444 21 -22 -61 28 24 138 99 -352 83 -122 47 48 -6 124 82 84 -6 -22 142 -186 -123 -308 65 7 -85 -165 111
7470 111 260 -25 -138 320 16 -71 -12 -50 -210 -136 79 24 -178 13 -128 47 -95 175 -171 -162 161 324
7492 324 194 145 -89 140 224 277 80 250 290 -144 66 -111 89 232 -12 275 241 -182 152 -122 -281 -133
7514 -133 93 -27 166 90 43 -37 -118 69 140 -115 96 -166 86 -22 64 80 45 -221 -116 -4 94 264 -204
7537 -204 -132 -75 30 181 105 132 117 30 84 -111 50 88 284 -97 261 44 23 -135 61 22 104 -39 196 160
7561 160 305 123 -47 32 -166 -212 -180 15 -125 241 29 21 133 4 254 215 60 149 87 -20 76 -329 -276
7584 -276 -66 -149 -66 -223 51 38 -36 106 85 -75 -296 -149 -12 36 -178 -212 -85 83 -320 33 82 -29 -234
$$ packed form
7420C81n53Qn1l5M23j20o5J7R5j21j16J66Kj77j9K33j47J35J42k64N0O6L11l40
7444B1m3l9Q9mJ14l9m51M35k05J69Jn4J30m2Kr0j6J64l28O3j85L73n8r2q0K76
7470A11J49k85j13M58l04q7N9l8j60P4K15n5k02J91j41J75j42K70l46RL23J63
7492C24j30m9k34K29Q4N3j97J70M0m34K10j77K00J43k44K87l4m23L34k74j59J48
7514a33K26j20J93p6m7q0q1J87P1k55K11k62K52j08Q6J6l5k66J05J12R8J70m68
7537b04P2N7J05J51p6K7j5q7N4j95J61L8J96l81L58k17k1j58J96l9Q2j43K35l6
7561A60J45j82j70P9j98m6L2J95j40L66k12qJ12j29K50l9j55Q9o2j07R6m05N3
7584b76K10q3Q3j57K74j3p4J42k1j60k21J47J37M8k14l4J27J68m03L53M9j11k05
$$ plain form
7607 -234 -192 -234 -51 365 -111 -172 64 212 74 -145 -21 22 156 -232 -41 154 -61 -131 -28 -167 -86 72
7629 72 153 146 139 -90 -61 52 0 412 43 150 2 -206 12 131 -118 -49 -84 347 111 144 144 38 -41 293 130
7654 130 94 209 186 125 -36 -29 -170 -76 -219 -45 120 -28 -161 2 110 -218 20 -24 99 254 126 -23
7676 -23 -169 103 -49 -98 110 13 -160 -14 22 -72 110 -29 53 -23 0 -1 -86 153 26 -146 -204 -261 23 -135
7700 -135 13 -329 -194 42 -22 -25 49 120 120 -76 347 106 -61 -39 -81 -113 -90 64 30 154 54 216 -53 -2
7724 -2 240 -155 -209 -21 71 152 -79 79 126 -225 -80 154 38 261 159 127 -142 33 78 -181 71 -175 102
7747 102 -69 -137 128 -60 70 73 -12 -9 28 -211 82 236 178 -363 20 27 -9 41 75 53 -153 -19 5 -168 -103
7772 -103 189 -63 85 56 -7 35 -3 -92 -89 7 -128 41 -44 -202 61 -6 66 47 -69 133 31 278 -63 33
$$ packed form
7607b34M2m2J83M16m76o1K36J48j38k19J24M3J34l88J91J95k15p0J03j39Q1J58
7629G2Q1ppk29K9J13n2M12l69J07j48k08K18J19k49O9l5M31k36L3%j06p9L34j63
7654A30l6J15k3o1j61Pj41R4j43J74J65j48j33J63J08l28K38m4J23J55j28j49
7676b3j46K72j52m9K08r7j73J46L6r4J82j39Q2p6K3jq5K39j27j72n8n7K84j58
7700a35J48l42J35K36o4lP4P1%j96M23k41j67K2m2l2K3J54l4J24j00J62k69N1
7724bK42l95n4J88R2Q1k31J58M7l51J45K34j16K23j02l2k69J75M5k59K52k46K77
7747A02j71o8K65j88J30Lq5LL7k39K93J54n8n41L83Pl6N0L4k2k06J34K4j73O5
7772a03K92k52J48k9o3M2l8q9LR6j35J69q5j58K63o7P2j9j16K02j02K47l41R6
$$ plain form
7796 33 59 65 254 38 -63 -133 27 95 -194 18 -81 176 140 31 -65 262 -113 -104 248 36 21 185 -35 -186
7820 -186 65 8 184 -73 37 319 55 215 242 133 -326 -205 52 -6 158 -123 72 152 -78 -5 45 -14
7842 -14 31 370 25 4 -123 -108 164 -15 133 6 118 51 -85 54 138 64 47 -73 140 427 61 18 -205
7865 -205 100 -232 -142 -77 -158 212 -68 52 41 184 130 236 8 148 -3 159 -41 -9 1 132 47 -9 275
7888 275 -74 140 20 88 31 -121 -69 -187 104 -124 -76 -148 -90 280 92 144 188 -105 -13 135 152 93 80 38
7912 38 66 -395 179 -2 -258 22 361 -82 -18 -216 111 -28 31 78 -107 -170 69 -154 -132 -211 -70 91 -147
7935 -147 48 -115 -24 100 33 50 -143 -198 -5 289 81 4 -174 -80 -140 -139 187 -134 -52 1 -184 -318 174 -3
7959 -3 -11 -64 -124 -197 -157 -79 -270 180 -122 11 -138 -180 -172 16 231 -131 -17 -16 85 -212 -17 95 -150 61 -56
$$ packed form
7796C3K6OJ89k16j01p0J60O8k89K12r9K57l6j09r6L27l75RL52k12j5J64k20j51
7820a86K51n7J76k57J10K82k64J60K7j09m59J21K57n8J64k81J95Q0k30P3N0n9
7842a4M5L39l45k1j27J5K72j79J48j27J12o7j36J39Q4p4j7j20K13K87l66m3k23
7865b05L05l32R0O5q1L70k80J20j1J43n4J06k28J40j51J62k00L2J0J31q5n6K84
7888B75l49K14j20O8n7j52N2j18K91k28M8p2N8L70j88N2M4k93R2J48J7n9j3m2
7912C8K8m61N74j81k56K80L39m43O4j98L27j39N9M7j85o3K39k23K2p9J41J61k38
7935a47J95j63R1J24o7J7j93n5J93K94k08p7j78R4o0JL26l21Q2N3j85j34M92j77
7959cqn3o0p3M0P8j91M50l02J33j49m2QJ88K15l62J14JJ01k97J95J12k45K11j17
$$ plain form
7984 -56 54 78 -230 19 36 -29 402 -67 125 244 29 -287 -131 162 -104 58 218 100 -150 -27 13 -43
8006 -43 -38 191 -132 -174 70 189 -47 -57 5 71 -171 -375 26 54 97 -243 -52 111 103 355 -37 163 145 -81
8030 -81 109 -85 -44 63 184 216 -207 -288 66 -269 352 -192 -51 -185 -73 50 20 58 -131 -33 61 -96 235
8053 235 118 83 272 9 2 104 79 95 97 -9 -54 -153 -24 82 138 17 -235 212 -65 -59 -144 155 159 38 -63
8078 -63 47 161 4 33 41 229 -64 195 -77 52 -29 -44 210 -175 89 167 25 88 -80 72 -6 262 -134
8101 -134 252 -125 72 206 -63 365 96 -22 -33 -87 7 94 -233 -107 -65 -126 211 16 285 78 155 -12
8123 -12 -63 -17 19 -159 -141 58 -107 -29 55 54 148 -78 11 -10 151 121 -15 -70 120 190 274 31 1 58 58 -39 16
8150 16 -59 154 122 -44 16 159 187 37 69 139 -11 118 365 -292 -206 162 41 21 4 -58 4 146 -158 3
$$ packed form
7984e6J10K4l08K49J7o5M31m69J92J19k15l16J56K93k66J62J60j18k50J23M0n6
8006d3NK29l23m2K44J19k36j0O2O6k42k04M01K8M3l40J91J63qK52l92K00j8k26
8030h1J90j94M1J07J21L2m23q1L54l35O21n44J41j34J12J23l0L8j89R8R4j57L31
8053B35j17l5J89k63pJ02k5J6Kj06m5r9J29J06N6j21k52M47k77Oq5K99Mj21j01
8078f3J10J14j57K9QJ88k93K59k72J29q1j5K54l85K64P8j42O3j68J52p8K68l96
8101a34L86l77J97J34k69M28k69j18j1n4R4Q7l27J26M2o1L37j95K69k07P7j67
8123a2n1M6L6j78J8J99j65P8Q4jR4k26Q9k1J61l0j36n5J90P0Q4k43l0N7%r7N5
8150A6p5K13l2j66O0J43K8j50L2P0j50J29K47o57Q6L68j21k0j7o2O2J42l04J61
$$ plain form
8174 3 58 -178 11 -110 -76 62 -122 462 -288 -237 -258 126 -62 154 10 114 -165
$$ packed form
8174CN5k36J89j21L4J38j84N84p50N1k1L84j88K16j44J04k79
8191a65
$$ Imaginary data points
##PAGE= N=2
##DATA TABLE= (X++(I..I)), XYDATA
$$ plain form
0 0 0 0 0 0 0 0 0 0 0 0 0 -8 8 -8 8 -16 16 -24 24 -32 40 -47 55 -64 72 -87 97 -112 132 -151 174 -198 223
33 223 -254 287 -324 363 -406 453 -507 563 -627 694 -770 851 -940 1037 -1144 1261 -1388
50 -1388 1529 -1686 1858 -2052 2266 -2510 2784 -3102 3470 -3904 4424 -5064 5867 -6917 8349
65 8349 -10428 13748 -19887 35147 -161079 -174731 27059 -123709 -69267 35736 16744 -2151
77 -2151 105478 92927 57572 92183 80272 -14087 27180 76165 4019 -14385 42667 -32174
89 -32174 -89424 -37288 -37025 -76904 -44486 -33626 -52171 -30475 11064 37359 69645 70332 28095
102 28095 25498 80252 65914 2995 -4301 -17340 -58977 -51937 -48621 -62801 -29308 -16131 -45952
115 -45952 -16231 38128 34366 25645 54455 50722 4494 1381 30489 17153 7025 15583 -16022
$$ packed form
0@%%%%%%%%%%%qJ6j6J6k4L2m0M8n6P2q7J02j19J36j59J84k09K44k83L25l72M21
33B23m77N41o11O87p69Q59r60J070j190J321j464J621j791J977k181K405k649
50a388K917l215L544l910M318m776N294n886O572p374Q328r488J0931j2784J5266
65H349j8777K4176l3635N5034j96226j3652K01790j50768N4442J05003j8992j8895
77b151J07629j2551l5355L4611j1911r4359M1267M8985p2146j8404N7052p4841
89c2174n7250N2136K63l9879L2418J0860j8545K1696M1539K6295L2286O87m2237
102B8095k597N4754j4338o2919p296j3039m1637P040L316j4180L3493J3177k9821
115d5952K9721N4359l762q721K8810l733m6228l113K9108j3336j0128Q558l1605
$$ plain form
128 -16022 -35702 -7814 -8696 -23963 -17883 -32165 -49865 -30588 -2595 5851 8669 25653 36297
141 36297 26944 33384 47611 32303 14515 3660 -17098 -28889 -30327 -27412 -18139 -23017 -29124
154 -29124 -19211 -12641 2816 25602 17812 3951 10466 12761 10835 15062 19659 12273 -5320 -6005
168 -6005 1306 -5392 -1280 2871 -18264 -21305 -7450 -12474 -9084 7206 8377 5110 7009 10787
182 10787 15633 17158 16761 2462 -17148 -14209 -9395 -18478 -14269 -10376 -14488 -7053 -1217 5065 20052
197 20052 18906 9218 10118 9546 9596 10641 6798 3693 -2661 -6505 -5511 -10706 -8009 -2315 -16077 -21959
213 -21959 -12597 -12078 -5017 6431 3715 3247 11975 16564 17854 17427 17686 11706 -2887 -5652 -4048
228 -4048 -10726 -9150 -9955 -19900 -12835 -3172 -4684 216 7037 7288 3537 61 5297 11426 7145 5103
$$ packed form
128a6022j9680K7888q82j5267O080j4282j7700J9277K7993Q446K818J6984J0644
141C6297r353O440J4227j5308j7788j0855k0758j1791j438K915R273m878o107
154b9124R913O570J5457K2786p790j3861O515K295j926M227M597p386j7593o85
168f005P311o698M112M151k1135l041J3855n024L390J6290J171l267J899L778
182A0787M846J525l97j4299j9610K939M814r083M209L893m112P435N836O282J4987
197B0052j146r688R00n72N0J045l843l105o354l844R94n195K697N694j3762n882
213b1959R362N19P061J1448k716m68Q728M589J290m27K59n980j4593k765J604
228d048o678J576q05r945P065R663j512M900O821K51l751l476N236O129m281k042
$$ plain form
244 5103 2338 -1607 3245 3525 -1029 454 -4136 -10936 -10641 -10735 -6819 -1572 -4483 -2492 2537 5525
260 5525 12520 14476 10487 10487 5219 -527 -1115 -4502 -4132 -5003 -12317 -11498 -5665 -2776 2073 2048 -976
277 -976 1834 1927 932 3738 3676 4279 2467 -1984 2582 7695 4533 3551 771 -3132 -2958 -5658 -6837
294 -6837 -4140 -6367 -6724 -4873 -4483 3315 8277 5604 5481 4134 3020 4627 1794 -781 -475 -4046
310 -4046 -4986 -3726 -2136 3460 3598 -1953 -530 628 -382 656 -1251 -2256 -1745 -3949 -2364 1700
326 1700 3069 5244 3474 -704 2077 2852 542 822 -2364 -3968 -3245 -3879 -1092 1902 938 1802 299
343 299 -1529 2656 2773 -279 -1391 -3258 -2804 -264 -900 1068 3821 1718 1355 454 928 4567 1438
360 1438 -3135 -2651 -3586 -3456 -1575 -1247 452 1004 -1640 379 2460 2497 4169 964 -2060 -404 -832
$$ packed form
244E103k765l945M852K80m554J483m590o800K95r4L916N247k911J991N029K988
260E525O995J956l989%n268n746n88l387L70q71p314Q19N833K889M849k5l024
277i76K810R3r95K806o2O03j812m451M566N113l162r82k780l903J74k700j179
294f837K697k227l57J851L90P798M962k673j23j347j114J607k833k575L06l571
310d046r40J260J590N596J38n551J423J158j010J038j907j005N11k204J585M064
326A700J369K175j770m178K781P75k310K80l186j604P23o34K787K994r64Q64j503
343B99j828M185J17l052j112j867M54K540o36J968K753k103l63r01M74L639l129
360A438m573M84r35J30J881L28J699N52k644K019K081L7J672l205l024J656m28
$$ plain form
377 -832 175 1518 44 219 -105 -2030 -128 1259 67 375 -3277 -4218 -804 88 595 1833 603
394 603 1627 1939 1014 3058 3478 396 -1431 -3774 -2662 264 -1835 -2097 -678 -1979 -650 354
410 354 993 3276 2319 -748 -9 599 1347 2780 1029 42 -192 -1507 -352 267 -807 -179 -2071 -3945
428 -3945 -1998 -835 367 1800 -8 8 2146 1756 2651 2605 1478 1042 -1611 -2547 78 257 -743
445 -743 -818 -2940 -1473 711 -63 491 1223 -311 -869 -993 280 2664 1701 819 552 -983 733 1436
463 1436 -682 -286 -854 -2959 -2225 -1292 -748 1453 1007 -372 351 900 2680 2588 377 292 -331 -1962
481 -1962 -1063 -544 -372 235 -2116 -2361 117 314 939 700 -447 -110 -252 -591 1362 1400 998 1123 -519
500 -519 332 1751 589 271 -738 -2850 -1847 -1233 -1383 -265 -281 -441 23 334 1766 3057 1934 888
$$ packed form
377h32J007J343j474J75l24j925J902J387j192L08l652r41L414Q92N07J238j230
394F03J024L12r25K044M20l082j827k343J112K926k099k62J419j301J329J004
410C54O39K283r57l067P39O08P48J433j751r87k34j315J155O19j074O28j892j874
428c945J947J163J202J433j808J6K138l90Q95m6j127m36k653r36K625J79j000
445g43p5k122J467K184p74N54P32j534n58j24J273K384r63q82k67j535J716P03
463A436k118L96n68k105P34R33N44K201m46j379P23N49J780r2k211q5o23j631
481a962Q99N19J72O07k351k45K478J97O25k39j147L37j42l39J953L8m02J25j642
500e19Q51J419j162l18j009k112J003O14j50J118j6j60M64L11J432J291j123j046
$$ plain form
518 888 -40 -633 655 -655 -1428 124 -762 -1853 -651 -114 1001 1385 -352 -614 -377 -341 382 237
536 237 161 531 -228 -186 1910 1404 810 -108 -1682 -1207 -779 -1158 -766 -1018 -1248 179 311 678 1950 2052
556 2052 1480 787 -102 449 404 -377 -306 -1465 -1540 -498 -778 -448 935 68 -937 -55 -124 639 943 23
576 23 -41 256 416 1027 629 946 1317 -412 -520 -184 -982 -467 -969 -1684 -1042 -311 147 679 782 1025 1009
597 1009 699 695 973 481 230 -414 -1321 -345 -341 -722 80 -545 -480 158 -527 -277 729 77 -151 -82 -80 796
619 796 448 514 963 225 -82 241 -660 -334 40 -1235 -1221 -690 -449 -104 -185 -6 775 591 566 904 521
640 521 918 678 -393 -185 164 -19 146 -833 -784 167 -822 -664 -256 -408 -72 -383 -311 560 734 459 816
661 816 349 531 434 -99 -165 -157 -559 -588 -479 -830 115 -232 -558 -168 -643 256 530 218 148 662 114 395
$$ packed form
518H88r28n93J288j310p73J552q86j091J202N37J115L84j737k62K37L6P23j45
536B37p6L70p59M2K096n06n94r18j574M75M28l79L92k52k30J427J32L67J272J02
556B052n72o93q89N51m5p81P1j159p5J042k80L30J383q67j005Q82o9P63L04r20
576B3o4K97J60O11l98L17L71j729j08L36p98N15n02p15O42P31M58N32J03K43j6
597A009l10mK78m92k51o44r07R76Ml81Q02o25O5O38o85K50J006o52k28O9KQ76
619G96l48O6M49p38l07L23r01L26L74j275J4N31K41L45q1J79P81j84k5L38l83
640E21L97k40j071K08L49j83J65r79M9R51r89J58M08j52L36l11P2Q71J74k75L57
661H16m67J82r7n33o6Qm02k9J09l51R45l47l26L90m75Q99K74l12p0N14n48K81
$$ plain form
683 395 151 131 751 42 -430 -195 -243 -339 -389 -836 -437 -432 -674 -99 513 346 695 62 37 683 726 -188 269
706 269 -82 -258 -224 -418 -69 -290 -519 -276 -291 -197 297 -68 -136 -11 -259 150 378 101 422 200 -235 389
728 389 103 -95 138 -468 -650 -600 -195 104 167 -497 224 311 -85 555 351 420 326 -317 -362 182 106 -432 202
751 202 61 -129 -1 -16 436 118 -124 -7 -287 -341 480 208 243 236 -124 324 277 -21 68 168 -181 -380 -475
774 -475 -362 56 -43 -101 162 22 713 324 145 339 103 -323 -151 -141 -87 -118 -421 -410 -263 9 208 169 186
797 186 -73 -77 -149 86 245 294 128 -265 260 267 215 128 -15 -424 -176 -499 -538 189 -388 -306 -160 -87 179 555
821 555 425 445 282 212 209 180 70 100 -457 -437 -353 -350 165 104 -212 -15 -403 -188 42 159 452 328 -52 82
845 82 204 197 581 175 -346 57 -282 -351 -73 -282 -143 -239 -658 -264 272 170 444 201 5 621 466 73
$$ packed form
683C95k44k0O20p09m72K35m8r6n0m47L99Nk42N75O12j67L49o33k5O46M3r14M57
706B69l51j76L4j94L49k21k29K43j5R4M94l65o8J25k48M09K28k77L21k22m35O24
728C89k86j98K33o06j82N0M05K99O3o64P21Q7l96O40k04O9r4o43m5N44p6n38O34
751B02j41j90J28j5M52l18k42J17k80n4Q21k72L5pl60M48m7k98Q9J00l49j99r5
774d75J13M18r9n8K63j40O91l89j79J94k36m26J72J0N4l1l03J1J47K72J99l9J7
797A86k59mp2K35J59M9j66l93N25Pn2q7j43m09K48l23l9P27n77Q2J46P3K66L76
821E55j30K0j63p0lk9j10L0n57K0Q4LN15o1l16J97l88K15K30J17K93j24l80J34
845H2J22pL84m06n21M03l39o9K78k09J39r6m19L94N36j02K74k43j96O16j55l93
$$ plain form
867 73 434 -213 -72 -437 -465 -51 49 -204 -111 -232 -337 62 -119 -351 -59 44 32 116 219 473 467 40 -71
890 -71 -60 -99 138 -205 -296 -372 -40 79 55 51 317 208 -495 340 594 203 229 -180 -142 207 122 46 242 -97
914 -97 0 -129 -187 67 60 -32 389 -117 142 -48 -39 332 -1 -47 22 8 -286 57 210 -275 -24 -305 104 313
938 313 -24 19 479 -20 78 -276 -6 273 -334 -67 -14 -108 289 137 -190 131 65 -320 219 162 78 206 -66
961 -66 -193 182 45 66 403 135 -25 -48 72 -25 -387 -16 -310 -146 58 302 339 211 268 294 330 21 53
984 53 260 -14 -168 -169 -167 -31 232 -371 -214 130 66 171 -145 -251 97 38 71 140 -4 405 287 39 -154
1007 -154 122 -252 -513 65 -291 -83 -200 -383 -184 97 69 133 100 8 209 176 90 344 -99 -71 124 -113
1029 -113 -28 -205 -59 -110 -115 12 167 -119 -254 -305 96 -7 80 61 306 307 29 22 -87 135 41 -56 -309 -222 -319
$$ packed form
867G3L61o47J41l65k8M14J00k53R3j21j05L99j81k32K92J03j2Q4J03K54om27j11
890g1J1l9K37l43r1p6L32J19k4mK66j09p03Q35K54l91K6m09L8L49q5p6J96l39
914i7R7j29n8K54pr2M21n06K59j90RL71l33m6O9j4k94L43J53m85K51k81M09K09
938C13l37M3M60m99R8l54K70K79o07K67N3r4L97j52l27L21o6l85N39n7q4J28k72
961f6j27L75j37K1L37k68j60k3J20r7l62L71k94J64K04K44L7j28N7K6L6l09L2
984E3K07k74j54jKJ36K63o03J57L44o4J05l16j06L48n9L3O9j44M09j18k48j93
1007a54K76l74k61N78l56K08j17j83J99K81k8O4l3r2K01l3q6K54m43K8J95k37
1029a13Q5j77J46n1nJ27J55k86j35n1M01j03Q7j9K45Jk78pj09K22r4r7k53Q7r7
$$ plain form
1054 -319 -50 -307 0 278 -4 307 325 -53 102 309 -29 217 254 -300 -202 -39 -141 -116 -168 -87 348 -254
1076 -254 4 -30 -66 145 -162 31 187 -155 -19 247 -11 270 214 149 18 -177 233 -122 -198 -232 -109 3
1098 3 -69 133 252 315 22 49 171 -290 62 -7 -297 -145 -19 22 -48 83 136 169 14 -229 94 81 -193 135
1122 135 118 -91 69 15 5 -163 22 -414 -93 -142 103 -109 -62 -38 49 42 -15 131 59 -36 89 87 -105 -35 79
1147 79 -421 -132 5 -285 4 -48 52 185 163 -81 137 6 39 43 150 -43 -142 17 260 -88 -164 -208 -30
1170 -30 -191 -269 -72 -423 81 97 33 181 113 30 139 102 212 174 -28 17 45 -58 5 -355 -397 -34 89 -220
1194 -220 -188 -204 -108 -57 68 145 266 65 -67 158 369 198 227 -283 -30 -182 3 72 -161 -113 153 -172 189
1217 189 305 -102 251 -87 345 223 -55 23 148 -452 5 -7 -241 -102 58 -14 28 -77 -128 139 -245 49
$$ packed form
1054c19K69k57L07K78k82L11J8l78J55K07l38K46L7n54R8J63j02K5n2Q1M35o02
1076b54K58l4l6K11l07J93J56l42J36K66k58K81n6o5j31j95M10l55p6l4J23J12
1098Cp2K02J19O3k93K7J22m61L52o9k90J52J26M1p0J31N3L3j55k43L23j3k74L28
1122A35j7k09J60n4j0j68J85m36L21m9K45k12M7K4Q7pn7J46p2r5J25kj92P0J14
1147G9n00K89J37k90K89n2J00J33k2k44K18j31L3MJ07j93r9J59K43l48p6m4J78
1170c0j61p8J97l51N04J6o4J48o8q3J09l7J10l8k02M5K8j03O3l60m2L63J23l09
1194b20L2j6R6N1J25P7J21k01j32K25K11j71K9n10K53j52J85O9k33M8K66l25L61
1217A89J16m07L53l38M32j22k78P8J25o00M57j2k34J39J60p2M2j05n1K67l84K94
$$ plain form
1239 49 72 173 -14 303 202 228 120 25 -140 -108 -106 439 125 -293 -194 -103 158 27 194 562 -32 164 340
1262 340 -154 -84 43 -197 -74 -136 -132 58 61 53 479 -211 -64 219 17 -126 116 -146 -112 -10 -208 37 95
1285 95 -85 184 -21 -47 -326 34 104 37 -246 -27 241 -17 -81 -322 62 168 -66 289 141 213 150 -119
1307 -119 41 -27 -14 -329 120 42 -180 84 30 -392 -64 -183 113 106 69 99 351 33 98 -39 -33 -96 -78 23
1331 23 -141 -198 149 32 -25 44 131 -45 285 162 65 -46 97 77 -35 -133 238 -115 70 -114 -405 -95 33
1354 33 -157 -137 108 -156 40 -51 167 12 37 -9 404 107 -23 -204 -71 422 -202 -140 -171 -95 -255 -2 32
1377 32 -67 136 -81 113 218 47 191 -20 -28 242 165 211 -141 -166 -117 37 95 -119 -322 -103 213 -88 137
1400 137 36 -30 72 -68 284 -16 305 172 -42 -37 12 -168 -32 -3 -125 -126 148 42 100 -12 -20 244 -93
$$ packed form
1239D9K3J01j87L17j01K6j08r5j65L2KN45l14m18R9R1K61j31J67L68n94J96J76
1262C40m94P0J27k40J23o2MJ90LqM26o90J47K83k02j43K42k62L4J02j98K45N8
1285I5j80K69k05k6k79L60P0o7k83K19K68k58o4k41L84J06k34L55j48P2o3k69
1307a19J60o8J3l15M49p8k22K64n4m22L28j19K96pl7L0K52l18O5j37Oo3J8J01
1331B3j64n7L47j17n7O9Q7j76L30j23r7j11J43k0j12r8L71l53J85j84k91L10J28
1354C3j90K0K45k64J96r1K18j55K5m6M13k97j30j81J33M93o24O2l1P6j60K53L4
1377C2r9K03k17J94J05j71J44k11qK70p7M6l52k5M9J54N8k14k03K19L16l01K25
1400A37j01o6J02j40L52l00L21j33k14NM9j80J36K9j22jK74j06N8j12qK64l37
$$ plain form
1423 -93 43 7 -15 111 35 -244 63 111 119 -33 -369 -37 -10 12 39 -32 113 91 361 235 191 -160 137 117 20
1448 20 -178 -197 9 142 -88 -34 -49 -14 146 184 143 -112 99 -71 76 206 105 159 -166 46 187 -416 11
1471 11 -72 -146 -79 -255 41 -95 23 -45 104 311 15 20 -152 -135 -96 -151 -140 -457 -243 -14 -208 -195 9 173
1495 173 241 -52 -70 56 141 29 -207 -111 -76 191 185 251 6 -33 -122 59 -55 -167 38 -116 154 87 -40 59
1519 59 63 125 -40 -153 166 -86 305 95 -50 138 36 7 -121 95 -184 -180 -277 -262 -103 -164 -135 106 62 -178
1543 -178 58 165 -177 -61 121 190 -85 90 118 60 103 175 73 -1 85 -67 38 196 5 -261 38 31 -65
1566 -65 89 -84 449 57 215 -100 165 -135 -133 -121 74 115 -110 302 12 12 -30 -28 -43 137 -48 161 -48 161
1590 161 17 12 -326 91 3 -197 -55 138 -127 158 7 -248 -76 -261 -297 2 225 -132 -84 -234 -2 70
$$ packed form
1423i3J36l6k2J26p6k79L07M8Qj52l36L32K7K2K7p1J45k2K70j26m4l51K97k0r7
1448B0j98j9K06J33k30N4j5L5J60L8m1k55K11j70J47J30j01N4l25K12J41o03M27
1471A1q3p4O7j76K96j36J18o8J49K07k96Nj72J7L9n5J1l17K14K29j94J3K04J64
1495A73O8k93j8J26Q5j12k36R6L5K67oO6k45l9q9J81j14j12K05j54K70o7j27R9
1519E9MO2j65j13L19k52L91k10j45J88j02k9j28K16k79Mr7J5J59o1K9K41m4k40
1543a78K36J07l42J16J82O9k75J75K8n8M3P2j02p4Q6j52J05J58j91k66K99pr6
1566f5J54j73N33l92J58l15K65l00KJ2J95M1k25M12k90%m2Kj5J80j85K09k09K09
1590A61j44nl38M17q8k00J42J93k65K85j51k55J72j85l6K99K23l57M8j50K32P2
$$ plain form
1612 70 -187 -162 -249 -296 -175 54 36 186 274 -108 23 29 -144 -286 67 26 -105 22 34 1 -80 148 138 -14
1636 -14 180 -21 78 196 -42 -230 54 -274 50 36 -115 -25 -44 109 -160 -74 48 -88 17 -31 -56 157 253
1659 253 32 -144 -195 57 -235 -54 -80 79 144 128 -57 101 36 310 -71 2 -75 271 36 -3 -113 -93 112
1682 112 -61 -47 -92 317 74 146 52 116 -69 -121 135 -140 312 101 -18 342 243 124 -117 -95 -261 124 116
1705 116 68 -35 113 -88 -79 117 56 150 203 106 237 -77 247 -145 112 3 11 172 357 -65 -4 153 51
1728 51 199 13 -145 -6 62 11 -47 -32 -140 -239 116 -13 -74 -165 -30 -75 -165 -69 -118 0 -52 133 20 -29 -103
1753 -103 -61 43 -306 -311 103 -119 -1 -103 -248 -116 255 378 -161 -13 95 -64 -3 196 71 1 -96 123
1775 123 -141 162 -318 -166 214 -2 -7 -21 72 -45 -98 -137 -222 -301 -207 85 -74 -53 -163 101 92 312 161 174
$$ packed form
1612G0k57K5q7m7J21K29j8J50Q8l82J31Oj73j42L53m1j31J27J2l3q1K28j0j52
1636a4J94k01R9J18k38j88K84l28L24j4j51R0j9J53k69Q6J22j36J05m8k5K13R6
1659B53k21j76n1K52k92J81k6J59O5j6j85J58o5K74l81P3p7L46k35l9j10K0K05
1682A12j73J4m5M09k43P2r4O4j85n2K56k75M52k11j19L60r9j19k41K2j66L85q
1705A16m8j03J48k01RJ96o1R4N3r7J31l14L24l92K57j09QJ61J85m22O1J57j02
1728E1J48j86j58J39O8n1n8J5j08r9L55j29o1r1J35m5r0R6m9J18n2J85j13m9p4
1753a03M2J04l49nM14k22J18j02j45J32L71J23n39J48J08j59O1J99j25p0r7K19
1775A23k64L03m80J52L80k16nj4R3j17n3l9q5p9R4K92j59K1j10K64rK20j51J3
$$ plain form
1799 174 -6 142 27 -28 -20 201 101 37 -135 296 38 -10 -171 335 245 97 101 -147 -235 -316 192 -49 -3 -202
1823 -202 307 185 -183 -308 252 -125 11 5 -52 174 118 63 117 -35 -86 240 2 -110 119 4 -343 -286 -57
1846 -57 -39 8 92 185 201 -8 120 37 -116 -55 178 202 -73 125 102 -52 -96 -112 -9 -127 257 291 -414 170
1870 170 -140 -100 9 295 100 62 133 -27 -8 -56 95 -45 -235 47 -172 197 -8 -134 -281 70 2 220
1892 220 -177 161 -53 209 54 280 -179 -8 -64 -72 56 -35 136 -307 -27 30 -198 -9 18 -19 54 21 -9
1915 -9 295 42 38 -20 -62 40 114 321 -176 5 -232 263 19 90 -69 -77 90 99 88 116 225 52 -257 143 247
1940 247 54 380 17 228 44 -40 -65 308 67 -112 -233 -273 -349 -281 -73 1 124 -6 -48 223 -40 -39 180
1963 180 -26 -60 -90 -36 143 27 -72 -168 138 -114 -111 -145 23 -24 -52 -89 46 52 -138 -26 117 -202 -222 161 -74
$$ packed form
1799A74j80J48j15n5QK21j00o4j72M31k58m8j61N06r0j48Mk48q8q1N08k41M6j99
1823b02N09j22l68j25N60l77J36on7K26n6n5N4j52n1L26k38j12K29j15l47N7K29
1846e7J8M7Q4R3J6k09J28q3j53O1K33K4k75J98k3j54m4j6J03j18L84L4p05N84
1870A70l10M0J09K86j95l8P1j60J9m8J51j40j90K82k19L69k05j26j47L51o8K18
1892B20l97L38k14K62j55K26m59J71n6qJ28r1J71m43K80N7k28J89K7l7P3l3l0
1915iL04k53mn8m2J02P4K07m97J81k37M95k44P1j59qJ67Rj1K8J09j73l09M00J04
1940B47j93L26l63K11j84q4k5L73k41j79j21m0p6O8K08P4J23j30m2K71k63JK19
1963A80k06l4l0N4J79j16r9r6L06k52Ll4J68m7k8l7J35Oj90J12J43l19k0L83k35
$$ plain form
1988 -74 -123 -261 -151 -131 -211 -109 143 143 -203 -199 -52 -139 -101 -165 -143 -162 -24 -113 14 147 122 -180 -200 65 -50
2013 -50 57 -191 -241 84 -144 -174 -285 20 -168 64 -160 352 96 59 -88 132 220 -177 -51 -91 53 -109
2035 -109 -52 -7 78 36 111 -173 78 -136 71 95 69 49 118 -203 -105 -16 -56 41 131 104 -59 240 -13 184 425
2060 425 60 -144 34 124 63 328 -69 -56 27 -152 231 99 34 -179 -94 73 -148 112 244 113 245 235
2082 235 -227 -74 195 91 -194 155 -137 167 57 117 -32 94 161 161 130 -138 56 -69 -209 18 96 144
2104 144 109 -68 77 162 180 55 63 -111 64 -247 167 44 -79 -325 -109 91 -189 -12 -340 58 32 56
2126 56 51 -196 -58 -117 -1 -72 178 128 -356 -139 -43 100 -3 2 -249 52 -97 80 -22 -73 77 140 24 29
2150 29 192 -168 61 -385 164 -55 43 -91 -44 -108 -21 81 -365 -164 133 -67 -261 0 -144 69 96 29
$$ packed form
1988g4m9j38J10K0q0J02K52%l46MJ47q7L8o4K2j9J38q9J27J33k5l02k0K65j15
2013e0J07k48n0L25k28l0j11L05j88K32k24N12k56l7j47K20Q8l97J26m0J44j62
2035a09N7M5Q5m2P5k84K51k14K07K4k6k0O9l21R8Q9m0R7R0k7j63K99k53J97K41
2060D25l65k04J78R0o1K65l97J3Q3j79L83j32o5k13Q5J67k21K60J32j31J32j0
2082B35m62J53K69j04k85L49k92L04j10O0j49J26O7%l1k68J94j25j40K27P8M8
2104A44l5j77J45Q5J8j25Qj74J75l11M14j23j23k46K16K00k80J77l28L98k6K4
2126E6nk47J38n9J16p1K50n0m84K17R6J43j03Nk51L01j49J77j02n1J50O3j16N
2150B9J63l60K29m46N49k19R8j34M7o4Q7J02m46K01K97k00j94K61j44K13K7o7
$$ plain form
2172 29 -133 -57 95 -94 148 -1 73 171 -118 93 52 -359 161 -99 -222 -131 -19 -145 52 190 -34 -36 -70
2195 -70 -192 127 -365 -26 -11 94 -25 98 -52 77 149 199 2 -228 -325 72 -270 -102 -128 230 -12 -29
2217 -29 188 -20 184 -1 269 19 -43 84 -207 148 47 169 120 -177 -38 -41 -49 168 -226 102 -192 -296
2239 -296 241 -22 44 -223 -14 -28 29 -135 36 200 55 -315 124 24 -189 -158 41 -24 -188 -155 -127 85
2261 85 -131 53 -74 -44 -147 63 -54 35 120 -226 26 299 -246 365 -108 34 -224 -25 43 197 116 -64
2283 -64 -124 -114 -164 43 29 98 -419 -202 -28 44 -119 -137 211 71 -22 -209 195 253 -88 150 220 -66 35 -214
2307 -214 -173 -94 -24 -273 24 157 -158 361 140 -209 252 297 -468 140 214 -54 237 -101 -165 5 99 -30
2329 -30 132 -139 -142 -81 23 -181 299 174 69 -202 -222 160 45 -222 79 -464 -206 68 -220 40 -12 256
$$ packed form
2172B9j62P6J52j89K42j49P4R8k89K11m1m11N20k60j23R1J12j26J97J38k24kl4
2195g0j22L19m92L39J5J05j19J23j50J29P2N0j97k30r7L97l42J68k6L58k42j7
2217b9K17k08K04j85K70k50o2J27k91L55j01J22m9k97J39lqK17l94L28k94j04
2239b96N37k63O6k67K09j4N7j64J71J64j45l70M39j00k13L1J99o5j64L3K8K12
2261H5k16J84j27L0j03K10j17Q9Q5l46K52K73n45O11m73J42k58J99O8J54q1j80
2283f4o0J0n0K07j4O9n17K17J74P2j63j8L48j40r3j87M04N8l41K38P0k86J01k49
2307b14M1P9P0k49K97J33l15N19k21l49M61M5p65O08P4k68K91l38o4J70R4j29
2329c0J62k71lO1J04k04M80j25j05k71k0L82j15k67L01n43K58K74k88K60n2K68
$$ plain form
2351 256 -139 56 11 32 -60 -282 -86 98 120 19 -401 355 -7 26 -162 24 11 140 260 38 146 -22
2373 -22 44 -98 -222 199 226 35 71 -97 -85 -69 156 -12 -168 41 -192 -49 105 212 129 28 -20 100 -102
2396 -102 -38 57 178 -41 -173 185 -307 -217 168 4 114 -77 166 202 96 271 -35 25 -135 -144 17 -267
2418 -267 65 -121 -19 -8 -178 39 -183 109 282 -63 -41 107 -284 -18 60 240 -53 15 -61 -128 183 37
2440 37 231 -247 27 127 136 -106 188 54 17 91 -40 110 160 38 309 189 -323 -145 44 217 -34 183
2462 183 22 -15 -86 -92 101 3 62 -4 -244 -1 47 189 349 70 189 -109 -22 -255 -77 -25 46 -152 -70 -80
2486 -80 -28 76 134 53 -52 143 -292 -109 -142 82 70 -255 28 142 58 -128 36 243 -136 125 23 167
2508 167 133 30 132 105 -87 126 58 4 -67 -88 -33 81 -93 53 31 -36 177 38 -289 344 -14 149 63
$$ packed form
2351B56l95J95m5K1r2k22J96J84K2j01m20P56l62L3j88J86j3J29J20k22J08j68
2373b2O6j42j24M21K7j91L6j68J2J6K25j68j56K09k33J43J54J07q3j01m8J20k02
2396a02O4R5J21k19j32L58m92R0L85j64J10j91K43L6j06J75l06O0j60rJ61k84
2418b67L32j86J02J1j70K17k22K92J73l45K2J48l91K66P8J80k93O8p6o7L11j46
2440C7J94m78K74J00Rk42K94j34l7P4j31J50N0j22K71j20n12J78J89J73k51K17
2462A83j61l7p1oJ93r8N9o6k40K43M8J42J60k79J19k98Q7k33J78N2P1j98Q2j0
2486h0N2J04N8q1j05J95m35J83l3K24j2l25K83J14q4j86J64K07l79K61j02J44
2508A67l4j03J02k7j92K13o8n4p1k1N5J14j74J46k2o7K13j39l27O33l58J63q6
$$ plain form
2531 63 81 -20 -294 192 216 2 30 -2 -68 69 -219 -20 56 117 23 -159 -243 17 -19 -85 -252 142 31 -42
2555 -42 67 -194 33 -157 -204 199 -34 106 -148 -5 -211 -176 -86 58 -132 47 54 -118 -185 322 -122 -45 286
2578 286 -36 -174 -137 -64 -182 -115 -144 -145 43 12 232 124 -103 -103 -120 -199 33 43 -108 -74 -116 -68 -132 -50 53 333
2604 333 -187 148 97 -5 391 7 342 25 48 45 -2 98 103 -178 144 106 -215 26 86 -141 -78 255 26
2627 26 -166 -238 -137 20 -192 -174 -180 -118 -149 88 196 -58 44 16 144 -336 41 -55 29 -155 -197 21 27 27 172
2652 172 95 357 -255 49 -45 -62 -398 -168 -179 148 58 -49 151 41 -440 -11 -151 -193 -123 -2 -167 -163 -132
2675 -132 -89 56 -99 -44 36 159 -161 -83 -44 145 -241 -67 -63 53 64 -99 -61 37 137 32 -66 79 -189 207
2699 207 96 -5 -49 76 134 -52 76 58 -97 -134 202 142 87 146 -14 100 -61 154 -15 58 -154 -96 132
$$ packed form
2531F3J8j01k74M86K4k14K8l2o6J37k88J99P6O1r4j82q4K60l6o6j67L94j11p3
2555d2J09k61K27j90m7M03k33J40k54J43k06L5R0J44j90J79Pj72o7N07m44P7L31
2578B86l22j38L7P3j18O7k9jJ88l1K20j08k27%j7p9K32J0j51L4m2M8o4Q2J03K80
2604C33n20L35n1j02L96l84L35l17K3lm7J00Nk81L22l8l21K41O0k27O3L33k29
2627B6j92p2J01J57k12J8oO2l1K37J08k54J02k8J28m80L77r6Q4j84m2K18O%J45
2652A72p7K62o12L04r4j7l36K30j1L27r0j07K00j10m81M29j40m2P0J21j65ML1
2675a32M3J45j55N5Q0J23l20P8L9J89l86J74MJ16J1j63L8R8J00j05r8J45k68L96
2699B07j11j01m4J25N8j86J28j8j55l7L36o0n5N9j60J14j61K15j69P3k12N8K28
$$ plain form
2722 132 -268 -209 13 81 7 -135 276 37 113 -207 -98 -25 -140 58 -87 -127 -235 -95 -5 98 116 132 -85
2745 -85 65 -108 -5 -96 -64 17 57 130 -162 -54 -81 24 77 -140 61 157 101 -201 -90 50 21 -87 -7 74
2769 74 171 67 -26 94 -92 278 -17 80 10 -198 68 101 -310 -84 49 -267 -103 -295 -228 20 -92 162
2791 162 138 136 -30 293 24 -125 32 184 -254 -131 -124 -94 -76 41 -81 -123 47 -30 121 200 16 -9 30 -300
2815 -300 -67 225 -122 -175 -56 171 -205 -156 -40 102 77 125 -84 231 -141 -306 -92 186 41 -196 -10
2836 -10 85 211 -309 -178 -96 27 -202 122 107 122 -257 -39 -111 -65 193 -65 252 -27 45 -68 106 217 -145
2859 -145 191 -37 -290 264 202 66 59 -62 -186 78 38 51 120 47 34 169 -32 -153 165 -206 33 343 178
2882 178 -111 43 146 14 -115 -35 -251 80 47 21 26 34 40 -10 13 146 254 101 168 170 -373 306 -132 126 5
$$ packed form
2722A32m00N9K22O8p4j42M11k39P6l20J09P3j15J98j45m0j08J40R0J03J8J6k17
2745h5J50j73J03r1L2Q1M0P3k92J08k7J05N3k17K01R6n6l02J11J40k9j08Q0Q1
2769G4R7j04r3J20j86L70k95R7p0k08K66L3m11K26J33l16J64j92O7K48j12K54
2791A62k4kj66L23k69j49J57J52m38J23PL0J8J17j22m2J70p7J51P9j84k5L9l30
2815c00K33K92l47n3J19K27l76M9J16J42k5M8k09L15l72j65K14K78j45k37J86
2836a0R5J26n20J31Q2J23k29L24j5J5l79K18p2M6K58k58L17k79P2j13J74J11l62
2859a45L36k28k53N54o2j36pj21j24K64m0J3O9p3j3J35k01j21L18l71K39L10j65
2882A78k89J54J03j32j29Q0k16L31l3k6NQOn0K3J33J08j53O7Kn43O79m38K58j21
$$ plain form
2907 5 -74 -50 79 185 -131 -156 182 25 85 109 34 195 -41 -89 100 11 163 -174 101 -116 241 55 -40 -102
2931 -102 -61 -22 -82 -170 136 257 67 -87 -72 -179 -223 -202 -190 61 89 30 -75 -187 -9 -20 65 118 132 -73 42
2956 42 266 -197 -88 136 184 13 -138 73 89 -107 -121 88 110 -130 158 29 199 162 -261 78 -74 11
2978 11 59 164 -212 -234 -81 175 90 102 -6 -364 238 -168 -142 -22 164 147 -269 -112 73 178 -44 0 76
3001 76 63 74 10 -24 -4 -176 -85 142 -59 14 -231 -24 -184 63 -173 -94 -124 182 85 -27 -35 -139 115 112 227
3026 227 -3 -170 233 -255 -45 174 21 -56 -248 223 67 243 -306 -147 255 -126 48 -112 29 -61 245
3047 245 -83 80 82 -23 71 -81 59 -126 -214 -148 -95 -44 102 -163 92 -4 161 -40 77 71 51 37 -82 -159
3071 -159 68 44 -58 -79 23 -23 -96 30 -90 31 83 245 211 81 -114 155 -39 16 -170 53 23 -304 74
$$ packed form
2907Ep9K4J29J06l16k5L38j57O0K4p5J61k36m8J89q9J52l37K75k17L57j86r5o2
2931a02M1L9o0q8L06J21j90j54J5j07m4K1J2K51K8n9j05j12J78j1Q5N3J4k05J15
2956D2K24m63J09K24M8j71j51K11J6j96j4K09K2k40K88j29J70l7m23L39j52Q5
2978A1M8J05l76k2J53K56q5J2j08l58O02m06K6J20J86j7m16J57J85J05k22M4P6
3001G6j3J1o4l4K0j72R1K27k01P3k45K07j60K47k36P9l0L06r7j12qj04K54lJ15
3026B27k30j67M03m88K10K19j53p7j92M71j56J76n49J59M02l81J74j60J41r0L06
3047B45l28J63Kj05R4j52J40j85q8O6N3N1J46k65K55r6J65k01J17ok0j4j19p7
3071a59K27k4j02k1J02m6p3J26j20J21N2J62l4j30j95K69j94N5j86K23l0l27L78
$$ plain form
3094 74 -124 -266 234 89 57 -75 -158 66 -22 122 79 193 -42 176 102 -155 34 263 146 285 -58 -204
3116 -204 -31 25 220 -140 -133 -165 82 60 247 165 2 52 95 62 -45 41 -90 -92 138 -210 -66 33 -116 9
3140 9 20 196 -28 197 153 -230 285 46 -41 304 167 -141 -223 40 28 -30 -70 40 -85 -153 -107 -63 308 205
3164 205 212 90 348 1 -172 201 -22 22 -84 -114 -268 -164 -201 168 193 -78 -78 -315 -87 -33 -142 275 -68
3187 -68 -12 -63 116 -220 356 -124 -21 -188 -129 85 -273 9 -65 -76 -252 127 -24 -72 122 212 37 60 -4
3210 -4 31 215 -51 -22 109 -10 75 225 -151 -317 12 149 3 -92 16 -71 169 -65 10 -290 50 72 -277
3233 -277 -149 -490 69 -33 63 -71 49 29 -43 187 -84 -19 -237 -12 75 97 -149 -91 -28 142 117 123 -197 67
3257 67 117 -423 206 90 25 -161 -40 82 135 157 -60 3 101 47 96 -133 63 -40 -231 167 -112 93 -122
$$ packed form
3094G4j98j42N00j45l2j32q3K24q8J44m3J14k35K18p4k57J89K29j17J39l43j46
3116b04J73N6J95l60Pl2K47k2J87q2j63N0M3l3j07Q6j31kK30l48J44R9j49J25
3140IJ1J76k24K25m4l83N15k39q7L45j37l08q2K63j2n8m0J10j25o8M6M4L71j03
3164B05Pj22K58l47j73L73k23M4j06l0j54J04l7L69K5k71%k37K28N4j09M17l43
3187f8N6n1J79l36N76m80J03j67N9K14l58K82p4j1j76L79j51m8J94R0j75K3o4
3210dL5J84k66K9J31j19Q5J50l76j66L29J37j46r5J08q7K40k34P5l00L40K2l49
3233b77J28l41N59j02R6j34J20k0p2K30k71O5k18K25Q7K2k46N8O3J70k5Ol20K64
3257F7N0n40O29j16o5j86J21J22N3K2k17O3R8n4M9k29J96j03j91L98k79K05k15
$$ plain form
3280 -122 -282 -74 -33 -175 -60 -245 102 12 85 -190 -53 383 -137 -14 -214 258 -26 134 115 81 -43 19
3302 19 16 -173 213 8 125 -172 171 71 88 150 -261 136 149 -70 -16 54 48 -296 -139 120 -389 217 147 -48
3326 -48 104 -99 108 -201 72 327 157 30 -18 56 -166 164 130 1 -11 -163 14 67 -168 216 -161 -29
3348 -29 33 -208 94 -135 16 -53 75 -206 187 12 -213 -89 10 -44 184 -127 35 -45 -11 227 27 175
3370 175 71 -118 -157 129 109 83 -90 -246 -165 172 -177 -82 296 -116 -18 -175 -127 -219 -121 -63 129 143 -26 100
3394 100 170 -91 -13 -19 -113 -281 252 -99 90 200 44 151 30 113 123 -52 179 337 78 -140 -116 -21 181
3417 181 -120 44 90 -14 240 -87 172 -269 43 72 -304 56 -191 8 -16 -61 -94 61 9 -3 19 -105 -8
3440 -8 -148 34 -7 199 257 273 -177 -206 -62 129 15 97 59 -16 -15 -35 162 -224 -70 -199 128 -139 169 17
$$ packed form
3280a22j60K08M1j42J15j85L47r0P3k75J37M36n20J23k00M72k84J60j9l4j24O2
3302A9lj89L86k05J17k97L43j00J7O2m11L97J3k19N4P0ol44J57K59n09O06p0j95
3326d8J52k03K07l09K73K55j70j27m8P4k22L30l4j29j2j52J77N3k35L84l77J32
3348b9O2k41L02k29J51o9J28k81L93j75k25J24R9n4K28l11J62q0L4K38k00J48
3370A75j04j89l9K86k0k6j73j56Q1L37l49R5L78m12R8j57M8r2R8N8J92J4j69J26
3394A00P0k61P8or4j68N33l51J89J10j56J07j21Q3J0j75K31J58k59k18K4R5K02
3417A81l01J64M6j04K54l27K59m41L12K9l76L60k47J99k4m5l3J55n2j2K2j24R7
3440hj40J82m1K06N8J6m50k9J44J91j14Q2l8p5Jk0J97l86J54j29L27k67L08j52
$$ plain form
3464 17 -216 31 37 43 -305 -27 101 95 -41 -141 -162 -166 -266 20 -188 89 55 195 213 -59 -110 -135 180 -12 -164
3489 -164 -121 59 -88 -100 34 -307 -236 -140 234 -75 15 85 -150 -79 70 317 -47 41 -96 -275 -275 254 40
3512 40 92 73 -201 -175 -147 39 -82 -26 233 -128 -273 -203 26 122 353 -194 -73 -117 56 115 -119 9 203
3535 203 280 -84 78 182 -23 125 195 228 -76 10 -75 -77 -73 22 -65 -129 -168 -198 -122 184 -173 3 220 35 154
3560 154 24 -115 2 181 45 73 319 134 24 146 -73 -6 -64 83 20 220 221 -27 113 -228 -36 64
3582 64 -23 103 37 155 -98 187 186 3 -165 273 -10 12 -12 -62 -37 -92 -146 88 25 -31 -97 288 164 -52 -209
3607 -209 34 -2 -57 155 -193 156 -25 -166 205 -204 -167 -73 100 -147 130 -374 57 15 -204 211 -63 190
3629 190 154 -30 25 -41 -98 -63 45 -86 -13 -33 -166 -237 84 102 -106 117 -274 246 52 14 -78 12 40 -32 128
$$ packed form
3464A7k33K47OOl48K78J28oj36j00k1mj00K86k08K77l4J40J8k72n1k5L15j92j52
3489a64M3J80j47j2J34l41P1R6L74l09R0P0k35P1J49K47l64Q8j37j79%N29k14
3512D0N2j9k74K6K8J86j21N6K59l61j45P0K29R6K31n47J21m4J73N9k34J28J94
3535B03P7l64J62J04k05J48P0L3l04Q6q5kMR5q7o4l9l0P6L06l57J76K17j85J19
3560A54j30j39J17J79j36K8K46j85j10J22k19O7n8J47o3K00Jk48J40l41J92J00
3582F4q7J26o6J18k53K85jj83j68M38k83K2k4n0K5n5n4K34o3n6o6L85j24k16j57
3607b09K43l6n5K12l48L49j81j41L71m09L7R4J73k47K77n04M31m2k19M15k74K53
3629A90l6j84N5o6n7L5J08j31P3k0j33p1L21J8k08K23l91N20j94l8r2R0K8p2J60
$$ plain form
3654 128 48 -70 43 44 202 -102 -110 -53 -160 -105 164 147 -6 298 24 194 99 -49 -92 -44 -124 -27 -229 -92
3678 -92 120 26 -150 -28 -378 -15 134 -92 309 98 -27 -85 -37 -90 169 59 -50 -354 -60 181 133 59
3700 59 -235 -28 42 -15 2 39 135 -254 -49 108 63 -46 20 -53 -100 -80 130 -55 6 75 -144 -325 189 -156
3724 -156 77 218 259 98 89 -15 -38 -146 -13 -109 -207 22 139 -63 -49 -307 31 107 145 -43 -59 -46 -159 -90
3748 -90 -323 -145 -56 -91 -35 -259 144 159 -173 203 241 13 -234 -77 -351 217 94 -82 85 114 66 -37 -77
3771 -77 -188 -50 128 -192 74 -23 63 85 -81 139 -86 64 -39 72 -316 146 -157 -45 -151 -85 8 -172
3793 -172 -125 -86 -119 -223 -89 110 -65 -87 -201 150 184 -170 51 -61 -125 -51 -54 -85 150 183 71 -317 -46 -151
3817 -151 96 -148 -256 22 167 0 94 -100 -350 122 96 -14 371 -72 47 170 96 18 -127 -99 -117 -25
$$ packed form
3654A28q0j18J13JJ58l04qN7j07N5K69j7j53L04k74J70r5j48m3M8q0R7k02J37
3678i2K12r4j76J22l50L63J49k26M01k11j25n8M8n3K59j10j09l04K94K41m8p4
3700E9k94K07P0n7J7L7R6l89K05J57m5j09O6p3m7K0K10j85O1O9k19j81N14l45
3724a56K33J41M1j61rj04k3j08J33r6r8K29J17k02J4k58L38P6L8j88j6J3j13O9
3748i0k33J78Q9l5N6k24M03J5l32L76L8k28k47J57k74N68j23j76J67K9m8j03m0
3771g7j11J38J78l20K66r7Q6K2j66K20k25J50j03J11l88M62l03J12j06O6R3j80
3793a72M7L9l3j04J34J99j75k2j14L51L4l54K21j12o4P4ll1K35L3j12l88K71j05
3817a51K47k44j08K78J45j67R4j94k50M72k6j10L85m43J19J23p4p8j45K8j8R2
$$ plain form
3839 -25 -60 50 -237 272 -49 -130 66 -130 -26 -24 -137 38 59 226 194 -162 163 -155 -188 -46 182 -2 -21
3862 -21 -28 -93 -91 -64 168 -140 -358 -83 148 85 135 -74 9 -83 106 356 75 -172 -55 -73 9 -42 182 -56 306
3887 306 31 -83 -62 114 63 -96 198 -227 275 -307 241 -248 165 -44 205 -37 29 33 -96 32 199 106
3909 106 44 -96 161 -56 66 -1 -107 312 -242 -156 -222 -29 87 224 218 -226 -256 -24 -136 -192 91 242 29
3932 29 -55 33 -103 -175 97 -14 8 -28 56 138 -7 -324 -211 -109 167 -228 -128 -37 10 -40 174 49 9 97
3956 97 34 -185 -69 -83 -14 43 69 268 200 -34 55 26 52 -147 278 133 27 -48 -24 -66 83 50 16 97 0 -302
3982 -302 137 202 105 -99 -154 -97 -230 90 60 -113 -73 -223 -71 -57 -84 -53 336 -238 -375 170 -142 139 168
4005 168 -17 -170 290 -9 -43 17 34 -67 -169 -157 212 -120 -176 89 -61 -90 -162 -82 -13 -78 -27 178 -63 -228
$$ packed form
3839b5l5J10k87N09l21q1J96j96J04Kj13J75K1J67l2l56L25l18l3J42K28j84j9
3862b1po5KK7K32l08k18K75K31o3N0k09Q3r2J89K50k81k47J17j8Q2n1K24k38L62
3887C06k75j14K1J76n1j59K94m25N02n82N48m89M13k09K49k42O6Mj29J28J67r3
3909A06o2j40K57k17J22o7j06M19n54Q6o6J93J16J37om44l0K32j12n6K83J51k13
3932B9q4Q8j36p2K72j11K2l6Q4Q2j45l17J13J02K76l95J00R1M7n0K14j25m0Q8
3956I7o3k19J16j4O9N7K6J99o8k34Q9k9K6j99M25j45j06p5K4m2J49l3l4Q1r7l02
3982c02M39O5r7k04n5N7j33L20l0j73M0j50J52J4k7L1L89n74j37N45l12K81K9
4005A68j85j53M60k99l4O0J7j01j02J2L69l32n6K65j50k9p2Q0O9o5N1K05k41j65
$$ plain form
4029 -228 53 -343 -178 -89 222 237 46 37 -82 169 -312 -374 230 210 221 -48 296 -41 8 45 -55 56 141
4052 141 113 73 256 -17 157 -164 -23 -48 -39 146 115 83 -222 219 -51 147 209 -338 250 111 -178 257 -67
4075 -67 35 206 73 145 59 -298 -234 11 -71 252 20 -65 -32 -7 152 -99 -25 -103 -73 152 156 -48 106 -103
4099 -103 14 101 -169 -149 87 -168 256 30 38 25 -53 267 148 -201 -191 147 -284 -60 -157 -51 231 38 0
4122 0 -147 156 -180 31 -203 6 56 -222 -151 -110 -86 -97 44 111 -61 -29 100 78 -151 -157 -20 10 163 167 17
4147 17 30 -53 113 -116 108 128 -190 -313 21 -129 16 152 199 253 -167 54 414 -152 -38 19 111 18 -48
4170 -48 118 -74 60 242 24 -74 126 97 113 56 37 -227 -41 32 -121 -112 -283 -155 -33 -48 -157 29 49 22
4194 22 -128 194 -60 17 123 285 -51 111 -87 80 75 -163 -27 4 141 -10 -242 -10 87 190 44 55
$$ packed form
4029b28K81l96J65Q9L11J5j91rj19K51m81o2O04k0J1k69L44l37M9L7j00J11Q5
4052A41k8m0J83k73J74l21J41k5RJ85l1l2l05M41k70J98O2n47N88j39k89M35l24
4075f7J02J71j33P2q6l57O4K45q2L23k32q5L3K5J59k51P4p8L0K25Mk04J54k09
4099a03J17Q7k70K0K36k55M24k26Qj3p8L20j19l49J0L38m31K24r7J06K82j93l8
4122@j47L03l36K11k34K09N0k78P1M1K4j1J41O7j72L2J29k2k29oJ37L0J53Mj50
4147A7J3q3J66k29K24K0l18j23L34j50J45J36M7N4m20K21L60n66J14N7R2r3o6
4170d8J66j92J34J82k18r8K00k9J6n7j9k64J86P3j53Rj71J28J22j5j09J86K0k7
4194B2j50L22k54P7J06J62l36J62j98J67nk38J36L1J37j51k32K32R7J03j46J1
$$ plain form
4216 55 -208 -97 168 -150 0 -178 -69 269 110 -103 119 -36 22 -111 -106 -103 128 56 -71 92 156 2 128
4239 128 -424 -52 99 -176 35 32 -79 -61 138 234 -92 46 -80 107 -88 50 43 -114 238 -284 -238 122
4261 122 -116 -149 -10 -172 -4 -2 -13 182 67 -136 -124 -91 -159 -122 -175 198 57 253 -128 -119 71 -82 122 -1
4285 -1 -286 -90 -37 294 -35 -101 -257 -154 192 32 55 -48 -96 -112 -93 56 -91 89 -98 -61 19 -117 -42 191
4309 191 -92 389 -127 -100 -5 2 -116 -192 189 -211 74 -106 173 217 191 93 -110 105 139 -213 -124 -113 -87 -141
$$ packed form
4216E5k63J11K65l18J50j78J09L38j59k13K22j55N8j33NLK31p2j27J63O4j54J26
4239A28n52L72J51k75K11lj11J8J99R6l26J38j26J87j95J38pj57L52n22M6L60
4261A22k38l3J39j62J68Kj1J95j15k03J2L3o8L7n3L73j41J96l81RJ90j53K04j23
4285ak85J96N3L31l29o6j56J03L46j60K3j03m8j6J9J49j47J80j87L7Q0j36P5K33
4309A91k83M81n16K7R5Pj18p6L81m00K85j80K79M4k6r8k03K15L4l52Q9J1K6n4
$$ [...]
8191A13
##END NTUPLES=NMR FID
##END=
