##TITLE=1H_DE-91_3_k
 200.13MHz,CDCl3,
 8 sc
 
 23.6.2025
##JCAMPDX= 6.0         $$ Bruker NMR JCAMP-DX V2.0
##DATA TYPE= NMR FID
##DATA CLASS= NTUPLES
##ORIGIN= UXNMR, Bruker Analytische Messtechnik GmbH
##OWNER= pz
$$ XWIN-NMR		Version 3.5
$$ Mon Jun 23 13:54:17 2025 Russian Standard Time (UT+4h)  she@DPX200
##.OBSERVE FREQUENCY= 200.1313
##.OBSERVE NUCLEUS= ^1H
##.DELAY= (6, 6)
##.ACQUISITION MODE= SIMULTANEOUS
##.ACQUISITION SCHEME= undefined
##.AVERAGES= 8
##.DIGITISER RES= 18
##SPECTROMETER/DATA SYSTEM= spect
##.PULSE SEQUENCE= zg30
##.SOLVENT NAME= CDCl3
##.SHIFT REFERENCE= (INTERNAL, CDCl3, 0, 14.3821)
##AUDIT TRAIL= $$ (NUMBER, WHEN, WHO, WHERE, WHAT)
$$ ##TITLE= Audit trail, XWIN-NMR		Version 3.5
$$ ##JCAMPDX= 5.01
$$ ##ORIGIN= Bruker BioSpin GmbH
$$ ##OWNER= she
$$ F:/spectra/data/she/nmr/H-C/1/audita.txt
$$ ##AUDIT TRAIL=  $$ (NUMBER, WHEN, WHO, WHERE, WHAT)
(   1,<2025-06-23 13:52:45.35 +0400>,<she>,<DPX200>,
      <created by zg, POWCHK disabled, PULCHK disabled
       configuration hash MD5:
       00 E9 B6 7A A2 85 ED C7 34 08 36 98 17 FE 4E 26
       data hash MD5: 16K
       6A E8 D9 01 98 8A 05 46 B3 63 F8 70 43 4D 53 0C>)
$$ ##END=
$$ 
$$ hash MD5
$$ F0 00 D9 C6 33 A0 3D 22 22 EF 47 5D CF 0F 4F BB
##$RELAX= 
##$RELAX= 
##$RELAX= 
##$RELAX= 
##$RELAX= 
##$RELAX= 
$$ Bruker specific parameters
$$ --------------------------
##$DU= <F:/spectra>
##$EXPNO= 1
##$NAME= <H-C>
##$PROCNO= 1
##$TYPE= <nmr>
##$USER= <she>
##$AMP= (0..31)
100 100 100 100 100 100 100 100 100 100 100 100 100 100 100 100 100 100 
100 100 100 100 100 100 100 100 100 100 100 100 100 100 
##$AQSEQ= 0
##$AQ_mod= 1
##$AUNM= <au_zg>
##$AUTOPOS= <>
##$BF1= 200.13
##$BF2= 200.13
##$BF3= 200.13
##$BF4= 200.13
##$BF5= 200.13
##$BF6= 200.13
##$BF7= 200.13
##$BF8= 200.13
##$BYTORDA= 1
##$CFDGTYP= 0
##$CFRGTYP= 5
##$CHEMSTR= <none>
##$CNST= (0..31)
1 1 145 1 1 1 1 1 1 1 1 1 1 1 1 1 1 1 1 1 1 1 1 1 1 1 1 1 1 1 1 1 
##$CPDPRG= <>
##$CPDPRG1= <>
##$CPDPRG2= <>
##$CPDPRG3= <>
##$CPDPRG4= <mlev>
##$CPDPRG5= <mlev>
##$CPDPRG6= <mlev>
##$CPDPRG7= <mlev>
##$CPDPRG8= <mlev>
##$CPDPRGB= <>
##$CPDPRGT= <>
##$D= (0..31)
0 0.7 0 0 0 0 0 0 0 0 0 0.03 0 0 0 0 0 0 0 0 0 0 0 0 0 0 0 0 0 0 0 0 
##$DATE= 1750672364
##$DBL= (0..7)
120 120 120 120 120 120 120 120 
##$DBP= (0..7)
150 150 150 150 150 150 150 150 
##$DBP07= 0
##$DBPNAM0= <>
##$DBPNAM1= <>
##$DBPNAM2= <>
##$DBPNAM3= <>
##$DBPNAM4= <>
##$DBPNAM5= <>
##$DBPNAM6= <>
##$DBPNAM7= <>
##$DBPOAL= (0..7)
0.5 0.5 0.5 0.5 0.5 0.5 0.5 0.5 
##$DBPOFFS= (0..7)
0 0 0 0 0 0 0 0 
##$DE= 6
##$DECBNUC= <off>
##$DECIM= 32
##$DECNUC= <off>
##$DECSTAT= 4
##$DIGMOD= 1
##$DIGTYP= 9
##$DL= (0..7)
0 120 120 120 120 120 120 120 
##$DP= (0..7)
150 150 150 150 150 150 150 150 
##$DP07= 0
##$DPNAME0= <>
##$DPNAME1= <>
##$DPNAME2= <>
##$DPNAME3= <>
##$DPNAME4= <>
##$DPNAME5= <>
##$DPNAME6= <>
##$DPNAME7= <>
##$DPOAL= (0..7)
0.5 0.5 0.5 0.5 0.5 0.5 0.5 0.5 
##$DPOFFS= (0..7)
0 0 0 0 0 0 0 0 
##$DQDMODE= 0
##$DR= 18
##$DS= 0
##$DSLIST= <SSSSSSSSSSSSSSS>
$$ [...]
##$SUBNAM0= <"">
##$SUBNAM1= <"">
##$SUBNAM2= <"">
##$SUBNAM3= <"">
##$SUBNAM4= <"">
##$SUBNAM5= <"">
##$SUBNAM6= <"">
##$SUBNAM7= <"">
##$SUBNAM8= <"">
##$SUBNAM9= <"">
##$SW= 18.0517328524113
##$SWIBOX= (0..15)
0 0 2 0 0 0 0 0 0 0 0 0 0 0 0 0 
##$SW_h= 3612.71676300578
##$TD= 16384
##$TD0= 1
##$TE= 0
##$TE2= 300
##$TE3= 300
##$TEG= 300
##$TL= (0..7)
0 120 120 120 120 120 120 120 
##$TP= (0..7)
150 150 150 150 150 150 150 150 
##$TP07= 0
##$TPNAME0= <>
##$TPNAME1= <>
##$TPNAME2= <>
##$TPNAME3= <>
##$TPNAME4= <>
##$TPNAME5= <>
##$TPNAME6= <>
##$TPNAME7= <>
##$TPOAL= (0..7)
0.5 0.5 0.5 0.5 0.5 0.5 0.5 0.5 
##$TPOFFS= (0..7)
0 0 0 0 0 0 0 0 
##$TUNHIN= 0
##$TUNHOUT= 0
##$TUNXOUT= 0
##$USERA1= <user>
##$USERA2= <user>
##$USERA3= <user>
##$USERA4= <user>
##$USERA5= <user>
##$V9= 5
##$VALIST= <valist>
##$VCLIST= <CCCCCCCCCCCCCCC>
##$VD= 0
##$VDLIST= <DDDDDDDDDDDDDDD>
##$VPLIST= <PPPPPPPPPPPPPPP>
##$VTLIST= <TTTTTTTTTTTTTTT>
##$WBST= 1024
##$WBSW= 4
##$XGAIN= (0..3)
0 0 0 0 
##$XL= 0
##$YL= 0
##$YMAX_a= 114948
##$YMIN_a= -149937
##$ZGOPTNS= <>
##$ZL1= 120
##$ZL2= 120
##$ZL3= 120
##$ZL4= 120
##$ABSF1= 10
##$ABSF2= 0
##$ABSG= 5
##$ABSL= 3
##$ALPHA= 0
##$AQORDER= 0
##$ASSFAC= 0
##$ASSFACI= 0
##$ASSFACX= 0
##$ASSWID= 0
##$AUNMP= <proc_1d>
##$AZFE= 0.1
##$AZFW= 0.1
##$BCFW= 1
##$BC_mod= 2
##$BYTORDP= 1
##$COROFFS= 0
##$CY= -3
##$DATMOD= 1
##$DC= 2
##$DFILT= <>
##$DTYPP= 0
##$F1P= 0
##$F2P= 0
##$FCOR= 0.5
##$FTSIZE= 0
##$FT_mod= 4
##$GAMMA= 1
##$GB= 0.15
##$INTBC= 1
##$INTSCL= 1
##$ISEN= 128
##$LB= 0.25
##$LEV0= 0
##$LPBIN= 0
##$MAXI= 10000
##$MC2= 0
##$MEAN= 0
##$ME_mod= 0
##$MI= 1.114404
##$NCOEF= 0
##$NC_proc= 0
##$NLEV= 6
##$NOISF1= 3.799351
##$NOISF2= 2.8
##$NSP= 1
##$NTH_PI= 0
##$NZP= 0
##$OFFSET= 14.38212
##$PC= 1
##$PHC0= -1195.259
##$PHC1= 17.1922
##$PH_mod= 1
##$PKNL= yes
##$PPARMOD= 0
##$PSCAL= 0
##$PSIGN= 0
##$REVERSE= no
##$SF= 200.129724274929
##$SI= 16384
##$SIGF1= 3
##$SIGF2= 2
##$SINO= 400
##$SIOLD= 16384
##$SREGLST= <1H.CDCl3>
##$SSB= 0
##$STSI= 0
##$STSR= 0
##$SW_p= 3205.1282051282
##$SYMM= 0
##$S_DEV= 0
##$TDeff= 0
##$TDoff= 0
##$TI= <>
##$TILT= no
##$TM1= 0
##$TM2= 0
##$TOPLEV= 0
##$USERP1= <user>
##$USERP2= <user>
##$USERP3= <user>
##$USERP4= <user>
##$USERP5= <user>
##$WDW= 1
##$XDIM= 8192
##$YMAX_p= 0
##$YMIN_p= 0
$$ End of Bruker specific parameters
$$ ---------------------------------
##NTUPLES= NMR FID
##VAR_NAME=  TIME,          FID/REAL,        FID/IMAG
##SYMBOL=    X,             R,               I
##VAR_TYPE=  INDEPENDENT,   DEPENDENT,       DEPENDENT
##VAR_FORM=  AFFN,          ASDF,            ASDF
##VAR_DIM=   8192,          8192,            8192
##UNITS=     SECONDS,       ARBITRARY UNITS, ARBITRARY UNITS
##FACTOR=    0.0002768,     1,               1
##FIRST=     0,             0,               0
##LAST=      2.2672688,     0,               0
##MIN=       0,             -149937,         0
##MAX=       2.2672688,     114948,          0
$$ Real data points
##PAGE= N=1
##DATA TABLE= (X++(R..R)), XYDATA
0@%%%%%%%%%%%%%%%%Nj3J6j6J6j6K4l2L2l7M5n0N8o8P6q5R8j13J28j44J60j77
38i3J98k21K45k73L04l36L68m05M50m98N46n99O60p27Q02q85R78j083J203j343
58g09J504j695J927k213K577l055L713m682O250r190J6486o8326r2524J71544
72B1607N2252o3555M8710N5934n5677K402L6816m3470l4425J9271n7203o7448
84h4786K8849L347m7475M2542M4579l5404J1939N4703n978M020L7821p106k2681
97B4370M935n487l903K0902j6514n7540M666M2056k3109l0440J7676o203j6636
110d5227J9062N273J266L2766Q958j3766K1424K4746j1265o596J0396k1929m0952
123a5844p417j188j7487O218Q197j6363P367K9212J0305J2616J3287j1048r748
$$ plain form
0 0 0 0 0 0 0 0 0 0 0 0 0 0 0 0 0 0 5 -8 8 -8 8 -8 16 -16 16 -21 24 -26 32 -36 40 -45 53 -60 68 -76 84 -93
38 -93 105 -116 129 -144 160 -176 192 -213 237 -261 285 -314 346 -381 421 -464 514 -569 634 -709
58 -709 795 -900 1027 -1186 1391 -1664 2049 -2633 3617 -5573 10913 -57413 -149937 21607
72 21607 73859 10304 59014 114948 59271 61673 98489 55019 20594 39865 -17338 -84786
84 -84786 -55937 -52590 -100065 -57523 -12944 -48348 -36409 18294 12316 16336 54157 47051 24370
97 24370 29305 23818 19915 40817 24303 -33237 -28571 13485 -9624 -40064 -22388 -28591 -45227
110 -45227 -26165 -20892 -19626 13140 22098 8332 29756 54502 43237 36641 47037 25108 -15844
123 -15844 -23261 -24449 -41936 -35718 -27521 -43884 -36517 -7305 3000 15616 28903 17855 8107
136H107J0644Q234p296p555L249m895j4168J32M271o016q040j0005o798K83k09
151c0062J2154J7148K29J655J0454N296J1762J2059q326j3711r444q709n127k719
165g341k600p938p671L496M253O578J6229J853p999P986K272p361Q134M996r313
180E574l870m28m254M54P393O49j4971q010O826j164M29J0227j262m3R848K593
196I991N969J0635m539r837m818p470n473k761k685n986n255M521L123N46J4076
211C7Q471q511K277O335k465O028P104p583o749R08K066k639l161J641p248j1867
227a5356N52O78j384O141k92k998Q687P183M226P574M542j174n240o521l77q82
243E359m779n046q388l571N261J900K888N484j819q98K935R37M764K832l094k40
$$ plain form
136 8107 18751 26985 19689 12134 15383 10488 -3680 -3548 723 -5293 -13333 -23338 -30136 -29853 -30062
151 -30062 -17908 -760 -531 1124 11578 16874 28636 40695 32369 18658 9214 505 -4622 -7341
165 -7341 -9941 -17879 -25550 -22054 -17801 -11223 5006 6859 -1140 6846 9118 1757 9891 14887 5574
180 5574 1704 1276 -2978 -2524 4869 5518 -9453 -17463 -10637 -11801 -11372 -1145 -2407 -2450 7398 9991
196 9991 15960 26595 22056 12219 7401 -69 -5542 -8303 -10988 -16974 -22229 -17708 -14585 -14039 37
211 37 8508 -3 2274 8609 6144 12172 19276 11693 4944 5852 7918 5279 2118 3759 -3489 -15356
227 -15356 -14804 -14126 -15510 -9369 -9661 -12659 -3972 3211 7437 15011 19553 18379 13139 6618 6241 5359
243 5359 580 -4466 -12854 -16425 -11164 -9264 -6376 -892 -2711 -3609 -674 263 5027 7859 4765 4525
259D525r78Q40N097J87k726k704o699l284k419l028K738n47n797K346N735P309
275E95Q089J514P7J403j973J82m35l982j780n925p662K275K796o2P23j871m76
292f512J939l64L649K416j685J114j85M7P187M043j145j660m237j783M44l574
308c06k009l475n169r50j86K647Q046K459k080K606J733K734K954j757j367j940
324C940m230k14O22R25K132m235m455J650N0O62J678k105j360K75N79M464K821
341C199J859K259k587k034L790K59k134k794n649j347J13j305K740J171j128O07
357b981q58K507O413l98j969q16j417J074J051J64J335j697m197J40k31J330K259
374A709l738l278N4k0L251K422K89J355m58n09K911N50Q65P83n921l044Q69L83
$$ plain form
259 4525 3547 4387 9484 9671 6945 4241 -2458 -5742 -8161 -11189 -8451 -8998 -14795 -12449 -6714 595
275 595 8684 10198 10275 11678 9705 9887 9452 5470 3690 -2235 -9897 -7622 -4826 -4888 -4165 -6036 -6512
292 -6512 -4573 -4937 -1288 1128 -557 557 372 419 7606 11649 10504 8844 4607 2824 3268 -306
308 -306 -2315 -5790 -10959 -11909 -12095 -9448 -1402 1057 -1023 1583 3316 6050 9004 7247 5880 3940
324 3940 -290 -504 118 1043 3175 -1060 -5515 -3865 -3815 -3153 -1475 -3580 -4940 -4665 -4086 378 3199
341 3199 5058 7317 4730 2696 6486 6745 4611 1817 -3832 -5179 -5066 -6371 -3631 -2460 -3588 -2981
357 -2981 -3839 -1332 5081 4683 2714 1898 481 1555 2606 2770 4105 2408 -1789 -1649 -1880 -550 1709
374 1709 -2029 -5307 -5253 -5273 -2022 400 689 2044 1586 1077 3988 4538 5403 6186 265 -2779 -1910 -1527
392a527R71q35k449P47r00l65M167K140p82q3k709J512L870K43j37p30k359K18
410I92r88k32K458k052l426j250j087K166L143l68Q9l98n21L311J295O31J533
427E296l395k119M91r65J580J646m112j412R3N95J391J50O37Q87l301K89L273
444A024M09J880K72m086M01K304r19J81l44j755j725j881J514K570n11N46p96
461i16j329L304K210p79J401j874k279O70q34j05K098j385k607r42L72K941P18
478F64j236L68j623J50K531n13J202K581l389r27J994M76J79o29k314j414r57
495b857K64Q39k96J253K5k629K128L461k79J593o50k672M21J323o80j52j086j176
513a170p99j078K140J702j323L7j012RK072N06o66J347r88m18N44o13J786J151
$$ plain form
392 -1527 -556 -1391 -3840 -3093 -3993 -4358 -191 1949 1167 1084 -1625 -113 3757 4000 3863 3133 774 992
410 992 4 -228 2230 178 -3248 -4498 -5585 -3419 -276 -644 -555 -953 -1474 1837 3132 3763 5296
427 5296 1901 -218 273 -692 888 2534 -1578 -2990 -2897 -2302 -911 -761 -124 763 -2538 -2249 1024
444 1024 1433 3313 3585 -501 -100 2204 1285 1466 1122 -633 -2358 -4239 -2725 -155 -666 -120 -916
461 -916 -2245 1059 3269 2490 3891 2017 -262 408 -426 -531 1567 182 -2425 -3367 -2995 -54 664
478 664 -572 -204 -1827 -1677 854 341 1543 4124 735 -192 1802 2278 2457 1828 -486 -1900 -2857
495 -2857 -2593 -1754 -2050 -797 -772 -3401 -1273 2188 1909 3502 2852 180 601 1924 1244 1092 6 -1170
513 -1170 -1969 -3047 -907 795 -528 -491 -1503 -1494 578 1084 418 1765 777 359 903 290 2076 3227
531C227k679j691l32k77M59k77k51j45j344J515K480r6J808M78k241P50J227q65
549A746M22j215k029J21n67k68N86J42N62j211j309J937J566N73N23j797j72K250
567A860l79K78J258j707j076l34o83J446p1k519r7n77P90N75r1J321Q14j009J482
586A281L70l94K130l26l106j06J51p18O41n78q90m26K7R35J29L45K151k001j463
605a848L121K23m49Q51j224k38P29q16k99P67m59q46j229m96J749n93K01N83j477
624a750R10J688m97J369R10j750J23j60k06Q27n89j614q27MJ155j47q86R82L54
643a04j390J053J50M82J421r52j695J740K16R8K18n87j09q06r54J387M06r73K99
662a00j450j31J922j62J73K05j256N76N24l37J253j94r09J71j257O11J189m65
$$ plain form
531 3227 548 -1143 -1475 -1752 -1293 -1570 -1821 -1966 -3310 -1795 685 589 2397 2875 634 1384 2611 1746
549 1746 2168 953 -1076 -955 -1522 -1790 -1204 -1062 -500 -1711 -3020 -1083 483 1056 1579 -218 -390 1860
567 1860 1481 1759 3017 1310 234 -100 -783 663 592 -1927 -2024 -2601 -1811 -1236 -1327 -6 808 -201 1281
586 1281 1651 1257 3387 3061 -45 -151 0 -718 -77 -655 -1545 -1971 -1944 -1009 -880 -535 1616 -385 -1848
605 -1848 1273 1496 1047 1898 674 436 1165 349 50 817 358 -488 -1717 -2213 -464 -1057 -856 -273 -1750
624 -1750 -840 848 351 1720 2630 880 1003 843 637 1464 875 -739 -1566 -1562 -407 -554 -1440 -458 -104
643 -104 -1494 -441 -291 191 1612 660 -1035 705 921 1019 1237 650 541 -265 -1219 168 574 -399 -100
662 -100 -1550 -1681 241 79 252 457 -799 -223 301 -36 1217 1023 114 285 -972 -361 828 363
680C63l86p23m36J177l2n11J392k98j493K21K42Q52J019j858J42L2k19Q04J48
699D36m39O50j018n98J015k1P32J36k010L00P21j74P53n1r80M94n32m13J577j47
719D31Q5o82j071J083J103m59L46o28m34Q60o58L2J531j010j337m05k55J219O55
738D06j148J60r2k03R80K10N74Q47j316p17J103p46J030J31j606m34Nj04Q87k91
758c24m64Q19j425K59R51K8J005m66r54O87O87j97R31m88j48m22j374O50J097
777H52j247K7j001o48J104K18Q0P77K08l96N84k78Q10J220j525j46p87k97O97
796B52Nn12j03q36J22O61q60P17P08j354J55Q60K77J282m12k82N56k57k26M58
816A211m29j19n94k095N37J015k98K59p38L6J176k00N77J100o92k2j47j064J155
$$ plain form
680 363 -23 -746 -1182 -5 -37 -548 844 546 -947 -726 -484 368 1387 -471 -329 -297 -516 288 436
699 436 -3 647 -371 -969 46 25 757 893 -1117 -817 -96 -270 483 432 -548 -54 -586 -999 578 431
719 431 516 -166 -1237 -154 949 490 836 208 -226 634 -24 8 1539 529 -808 -1213 -1468 -249 406
738 406 -742 -582 -674 -877 103 313 887 1734 418 -299 804 58 1088 1219 -387 -821 -816 -920 -33 -324
758 -324 -788 31 -1394 -1135 -184 -156 849 383 -571 116 803 606 1537 1049 901 479 -895 -245 852
777 852 -395 -368 -1369 -2017 -913 -695 -615 162 370 -26 558 280 1090 2310 785 639 -148 -445 252
796 252 257 -255 -358 -1194 -1072 -411 -1271 -554 154 -1200 -1045 -185 92 1374 962 680 1236 979 753 1211
816 1211 782 663 69 -2026 -1489 -474 -772 -513 -1251 -1215 -39 -239 338 1438 746 724 577 -487 668
835F68M50p03j87m69k54N36q3l10J52o42l28L52n92J480M37r76N76j14M82R82
855A457o80r5K67j080j74K52o05P79m83j203P77L57J22Q01l47j86L41n43P16J59
875F32m99N39q20n60J115J80k59R7m95j88K48n07L51R6k87L95m83m11J677l57
895D64l72J97l76%M51r04O04J77j186N13J00K12J063j74j070Q90n63J67M44q79
915b42Qj0l99N0J67R0P88n08p49J001K8M49k5n75O45Ko42O88k06k90k82o85k81
938i78J146q73l71M89k02J92L70j33J282l20k11O58p61K23N83q42j9N7r47L28
958c29q7n60O08k47p91Q83m18M58R31l95N8O67L19N19k40m20L43o93j031O84r34
979f75k18J14j115L83P78k14M40O16n1O25j49J65R36o45k7J6q12n4O43j385K62
$$ plain form
835 668 1118 415 228 -241 -495 41 -42 -352 -200 -842 -1170 -818 -1410 70 507 -469 107 -7 475 1457
855 1457 777 682 949 -131 -305 -53 -658 121 -362 -1565 -788 -431 -309 492 145 -41 300 -243 473 632
875 632 133 672 -148 -708 407 587 328 425 -70 -258 -10 -517 -166 -70 -357 38 -445 -856 821 464
895 464 92 289 -87 -87 364 -540 64 241 -945 -432 -332 -120 943 769 -301 589 26 193 637 -242
915 -242 -234 -244 -643 -593 -426 -336 452 -56 -805 196 224 673 648 73 718 720 78 766 560 270 -12 -697 -978
938 -978 168 -705 -1076 -587 -789 -597 -227 -360 922 602 391 1049 288 511 1094 252 233 290 -657 -329
958 -329 -416 -976 -368 -615 -1406 -523 -941 -483 448 53 111 778 1097 1616 1376 956 1299 606 -425 259 -675
979 -675 -893 -779 -1894 -1511 -733 -947 -507 109 58 683 534 699 1635 990 963 979 167 113 756 -629 -367
1000c67m33k81K50l39l20J034k62k49P26M1J306O66q03L44o7k96J5q09j64%j078
1021a086m05N69m45M58M01n84O30L08L77M96n1K50p5o95N26L50o19K59l24j225
1041h85O63J49p78nj09j89M98n60Q92Q97p9J55K46l39R42m86o72J91p27n92N30
1062b58q33O48L77j193O21N00J77P56l85k26K88k50k66O09n42M52k1p53K46L79
1082C26l69K29m55q26N30J14l8O89k55J30L64n55P94N11j056L81o39j14L21o81
1102e99k21L84J05Pp1J39Q65L27j173L53L74n74Q52n62k99R2m49j29J30j14M70
1123i3J16o05K59M12j44Q10l49j88O70l53k88J81j3J26n68m94K7L17n43L24m76
1144h72k5R82o58N06P92k59M09l59o3N35m5p36K65o50l42M82o74Q6K06n07J69
$$ plain form
1000 -367 -800 -1081 -831 -1170 -1490 -456 -718 -967 -241 -200 1106 1772 969 1313 1246 950 965 156 -8 -8 -1086
1021 -1086 -1491 -922 -1367 -909 -508 -1092 -462 -154 223 719 668 918 843 148 674 1024 405 664 340 -885
1041 -885 -222 -73 -851 -856 -965 -1154 -656 -1216 -324 573 494 649 895 556 1498 1012 340 531 -196 -788 -258
1062 -258 -1091 -443 -66 -1259 -638 -138 39 795 410 184 472 222 -44 565 23 475 454 -299 -53 326
1082 326 -43 186 -269 -1095 -565 -451 -489 200 -55 75 439 -116 678 1189 133 514 -125 -239 82 -599
1102 -599 -820 -436 -331 -324 -395 -256 609 936 -237 116 490 -84 768 206 -93 -1 -450 -579 -449 -563 -93
1123 -93 23 -582 -323 89 -55 755 406 218 888 535 247 428 415 541 -27 -521 -494 -177 -720 -396 -872
1144 -872 -897 85 -573 -67 725 466 875 516 453 988 943 207 472 -178 -520 -38 -712 -626 -420 -927 -758
1165g58K39n3Q77j12k96N37J91K62M08q03J34j11p34J36k69l38N51o99n58P04
1185f92rK39M31j85O01n1l43N85M27l71M26m76l99J86ml69Qr43J73j31k90O29
1207e58K17n3M21J77j25R50p9j33J74l16k89Ro33M55l34p88L69j42K43M19o08
1228f24K97K21j37M91Q9l30Q02k14m43N43j92l15L58o68j25J83o45L76o1l54L61
1249c87j3L5P06k12K04P4k82R1M44r29L48L3m24M27j06m31M44J06m01L81n60L75
1271g7J4n27R3P22m29M54J88l90K91o1m33M91o47L34kn59K98J06L5j34l3J63K17
1294A14k95k9J48j46L01j09m57N20J72J99n82K68K81K17j65o90P88p14l9K58m60
1315d20L75o8k89J27J3K17J37l73N42J14l91J05K36l07K73j07l08k48O53k96j04
$$ plain form
1165 -758 -519 -572 305 193 -103 434 625 887 1295 492 626 515 -219 -83 -352 -690 -139 -838 -1396 -692
1185 -692 -701 -462 -31 -216 385 334 -9 576 1003 632 1058 582 183 369 365 -4 4 -939 -766 -897 -1187 -558
1207 -558 -341 -394 27 204 79 1029 950 817 991 675 386 395 -238 217 -117 -905 -536 -678 -435 -16 -624
1228 -624 -327 -106 -243 248 337 7 809 595 152 695 503 188 546 -122 -247 -64 -709 -333 -394 -748 -387
1249 -387 -400 -365 341 129 333 407 125 216 660 -269 79 112 -312 115 9 -422 22 128 -273 108 -452 -77
1271 -77 -63 -590 -497 225 -204 250 438 48 339 278 -155 336 -311 23 21 -538 -240 -134 -99 -233 -266 -103 114
1294 114 -181 -210 -62 -208 93 -16 -473 47 219 418 -164 104 385 602 437 -253 535 -179 -218 40 -420
1315 -420 -45 -113 -402 -275 -262 -45 92 -281 261 375 -16 89 325 18 291 184 -124 -372 281 -15 -119
1336a19j55j28P44p36N7K88l45O73j21m47O15Kk91M60m45J53K29r55N27L46m68
1357a16N9j90m6M44k25j91K99k39J37L57m93K98L94p13O85l52j05M32q6m89K66
1378A26m66J11k1l14L49J62m29J94J75J21M65k91l87N71m69J84R8l52N11k84j26
1399g2j16K98m04L21j9l61N14k10o3K14k77N3N5k07M66j54RK27M2m17M15j16j84
1422A4K90m13q9L30l32N24l15m30K79q5M4K06m0m16N39j74N9K64j16J15Pk38K21
1445B44p0o2j7l55K30k23k80K03L32j93J12p1k53M44J28j31L16l20K48L91l90
1466B83l7q9j06j60k50l30P47k64m55K12j0M33J39j87N56J84l52K14r9J36J90
1487G55l60m03J33l40K77k40l32K76J55o41L80K84k36N05k05k62P77l37L34R2
$$ plain form
1336 -119 -274 -402 342 -394 -337 -49 -394 279 158 -289 326 328 37 497 52 205 434 -521 6 352 -116
1357 -116 -57 -247 -293 151 -74 -265 34 -205 -68 289 -204 94 488 -225 460 108 3 435 349 -140 126
1378 126 -340 -229 -250 -564 -215 -53 -482 -288 -113 8 473 182 -205 366 -103 81 179 -173 338 54 -72
1399 -72 -188 110 -294 27 8 -353 161 -49 -112 102 -175 -122 -67 -274 192 38 47 274 316 -101 314 198 14
1422 14 304 -109 -198 132 -200 324 9 -421 -142 -227 -183 23 -17 -433 106 -68 -9 255 139 254 261 23 244
1445 244 174 112 95 -260 -30 -253 -533 -330 2 -191 -79 -150 -403 41 169 38 354 34 282 673 283
1466 283 246 157 51 -109 -359 -689 58 -206 -661 -449 -459 -26 113 -74 482 666 314 528 429 565 755
1487 755 395 -8 125 -215 62 -178 -510 -234 -79 -720 -340 -56 -292 213 8 -254 523 186 520 612
1507F12k65J01j50k88m8M8m65J59n10K87O21p23O19j2j65O95k50j47L86mk64M53
1529F90m94l00J79l9l63L4l32M38j78j31K94m9k23N50m15O41K88m78k8L57k29
1550B12J87j96k80L68o95k9K87l25J75M0j27K55M44l30M17j32k4K58m83J84J17
1571C23l06r0K59j95j16L79m50J26J18l78L83l66j99P62%k20K10m57L73R9m64
1592b09K45K6j98K31l60O5N91n74L51l01L60j95J3k45K84J06j85p2m69L36L94
1613A94o57L17K08j44N0L10k91K39o7L3LJ91k20j5k66k05K85Q2j78J35k31L00
1635G3l67r7M30J21j48K08Q8j32K50j81R9j22j60oj18m89K80J00j79P1j61K98
1657a42L79k53M0J17o0L51m7k96K66J1m11K71m71q6J23n36M30R9PJ11k58R6K01
$$ plain form
1507 612 347 448 298 10 -38 10 -455 -296 -806 -519 102 -621 -2 -14 -179 516 266 119 505 501 237 690
1529 690 196 -104 75 36 -327 -293 -625 -187 -365 -496 -202 -251 -474 76 -339 302 590 112 84 441 212
1550 212 399 203 -77 291 -404 -433 -146 -471 -296 -256 -383 -128 316 -14 403 271 247 505 22 206 323
1571 323 17 -73 186 -9 -125 254 -196 -70 48 -330 53 -313 -512 250 250 30 240 -217 156 255 -209
1592 -209 36 62 -136 95 -265 -200 391 -183 168 -133 227 32 45 -200 84 190 5 -67 -536 -200 194
1613 194 -463 -146 62 -82 -32 278 -13 226 159 192 195 386 166 151 -115 -320 -35 47 -131 4 -227 73
1635 73 -294 -391 39 160 12 220 308 176 426 245 344 222 62 56 -62 -551 -271 -171 -350 -279 -440 -142
1657 -142 237 -16 24 141 81 432 385 89 355 366 -45 226 -245 -331 -208 -744 -314 -215 -208 -97 -355 -259 -58
1680e8K18m4M20n37K56K62k06k7l7m85m5M01l85K78k49j99L9l0J34L85j66L43
1702B68N9m36O24l20J33K00l21k75n4K37k45L7k36P0L05l59N16j45j49J36l8L6
1724D3K60l32K85M8l83K26J30k76P2l00m6K95k77k78P00p27M77J68m74J50L57
1745A18o7J19N5j90J01k02qK37m04R2J62k13K26L3j86L75m84K57k86K18K18j56
1767A5l76L68K95n68O01n8j46K33k50k95M66n6k14J8l52L31j06n5J53K9j93M1
1789a19k57J34M98k08q9L41J36k88k70J37L08k68l07L39k10J28J57m70p5J92R8
1810i3J32j19j44O23o26p0K98K52j52j11K9J91l27J90m2k50J00J26O3m8K7k28
1832a79J54k66J88M0J38k60K56R1k95M65m06M7J54o5q5m2k1L23j79k90K56j74
$$ plain form
1680 -58 160 116 536 -1 255 517 311 284 247 -238 -283 118 -267 11 -238 -437 -398 -428 -294 91 -75 268
1702 268 327 -109 515 195 328 528 207 -68 -122 115 -130 -93 -329 -259 46 -313 203 58 -91 45 7 43
1724 43 303 -29 256 304 -79 147 277 1 73 -227 -273 22 -255 -533 167 -560 -83 85 -389 -239 118
1745 118 51 170 225 35 136 -66 -74 163 -241 -149 13 -200 26 59 -127 248 -236 21 -265 -47 171 15
1767 15 -361 7 302 -266 335 277 131 364 114 -181 285 229 15 33 -319 12 -94 -149 4 33 -160 -119
1789 -119 -376 -242 256 48 -41 300 436 148 -122 15 323 55 -252 87 -123 5 162 -308 -383 -191 -93
1810 -93 39 -80 -224 399 -227 -297 1 253 101 -10 19 210 -117 73 31 -219 -119 7 70 22 49 -179
1832 -179 -25 -291 -103 -63 75 -185 71 162 -133 332 -74 -27 127 62 -23 -65 -86 237 58 -232 24 -150
1854a50l04P25m82K21L15k45rJ89l80K48M6k32j9L34m15L46j9l26M11n62j0k6
1876c44l1K70J68k03O9J72j48K15j3j53K00j81J17J0j41k5o0l06M55O4l25P0J3
1899a07l1K91l75K69J13k23M56k17j58L78L1m12l6q0L0K67k22Q4Pl67J33P1r6
1922a94M46n51J61L30l20O0K38K2R4o8k88K53j43j29Q2j01J60Kk21j00K03j94
1944b58K54o5j40J16J69k18M10m9j5K86l56j11O0O4j37K6k63K94j70j60J51j21
1966b33k0M49j69l8O1k97J93M53n3l27L32l84L82m8l98%k30K28q7m09M98j91R8
1989a90L57j85j5K85k60J38J23j63k7J70l62L26o8k13P8l20L15k13Q8j24N2K18
2011A0O0K44m82K28J41l76M35k73rJ03j75j44J10P6l28N16m53L12J96n23L48J39
$$ plain form
1854 -150 -454 271 -211 10 325 80 71 260 -120 128 174 -58 -77 257 -158 188 169 -157 254 -308 -318 -344
1876 -344 -375 -105 63 -140 -71 101 -47 168 155 2 202 21 138 148 7 -18 -78 -384 71 135 -190 -120 -107
1899 -107 -138 153 -222 47 160 -63 393 176 18 396 427 15 -21 -101 -71 196 -26 58 65 -302 -169 -98 -194
1922 -194 252 -299 -138 192 -128 -68 170 192 286 218 -70 183 40 -89 -7 -108 52 54 -167 -267 -64 -258
1944 -258 -4 -69 -209 -93 76 -142 268 219 204 490 134 23 83 147 10 36 -227 67 -103 -263 -112 -233
1966 -233 -253 196 27 -11 50 -247 -54 399 346 19 351 -33 349 301 -97 -97 -327 -99 -186 -595 -97 -288 -190
1989 -190 167 -18 -33 252 -8 130 253 90 63 233 -129 197 129 -84 -6 -326 -11 -224 -136 -260 -208 10
2011 10 70 314 -168 60 201 -175 260 -13 -22 81 -94 -238 -128 -52 -380 136 -317 -5 191 -332 16 155
2033A55j89K08J54k91J79j12j20J98m73K46J52k80K53k95J74P3j27R0J74j25k63
2054b19K49j58m0K16l0J71k88j2L6m8Q8K47j14m5L38j84m45K47k41M76k59k91
2076c06M47k16r5K22l04J31K75j24J23k76L7N80m95r2K11r7q5N04n06J40k67p9
2098b72M98k20q3M2J42m46O65l28k00K29k54N35oj28n9K32k03p8k26J92j73K37
2120I6j92k25J87k8J88M1m7M5l6J37K10m64J06J90r3J26k41l96N53l85L87K5n13
2143c29K95lj04J78j04j25J27K73j27K00k63k53M90j29J11j90j50J17k29q7K53
2164d9j28J7L87l86K21j15K16J7m21K21Q0N5M0J81k19j92P1j98L79k79l34O06
2186A70k25j01J21r9K4K38l21K99J17l10K19K78l37P9pj91K79p2l53P9m15K71
$$ plain form
2033 155 -34 174 328 37 216 104 -16 182 -291 -45 107 -173 80 -215 -41 32 -95 -5 169 44 -219
2054 -219 30 -128 -168 48 18 189 -99 -111 -75 -123 -35 212 98 53 391 207 -238 9 -232 244 -15 -306
2076 -306 141 -75 -170 52 -252 -121 154 30 153 -123 -86 494 -1 -93 118 21 -64 440 -66 74 -193 -272
2098 -272 226 6 -77 -35 107 -339 326 -2 -202 27 -227 308 302 174 115 347 144 66 -160 32 -141 96
2120 96 -96 -321 -134 -162 26 67 20 65 29 166 376 -88 18 208 115 241 0 -396 157 -228 159 184 -329
2143 -329 -34 -37 -141 37 -67 -192 -65 208 81 281 18 -235 255 126 237 47 -103 14 -215 -302 -49
2164 -49 -177 -160 227 -159 62 -53 163 180 -241 -20 60 115 155 336 117 -75 -4 -202 177 -102 -436 170
2186 170 -55 -156 -35 -134 -110 128 -193 106 223 -87 132 410 73 152 145 -46 233 161 -192 -113 -528 -257
2208b57M40n21L5L21q1J63k4r5O3k24K05K00l56J99k45l9K49j30P9j10j57K36
2230d9O7J13k14L1j42K2J48j44K32j72K74N5k03J42j64J81j31n4p3K75l64j86
2252c56J78J18r2L38k95m49N66j34n4M48j99P4Q4m18K90r0L72j09J5k36n2j04
2274a05P6jj41j1K07k34J00K00l37J47k73N24k05j28K15j35P8l21M36l26K21K8
2296A5j37l09M02j93J97k41K80LJ3K10L4m36K44k51K02K15m32J89Q1j84o0L61
2318B03k59p8M80k44p4j60J14J31P2l46J58j37L99j36r1M50n63j41M44r4l7J2
2340A03l9l19J77K91n76N10l18R0J16k9j21K2k23K88o0K10k54P6L0L8l21K67r0
2363a32NJ3O4l62L30J48k03J84k28O8P6j78M44j25k82PJ50O2J18k26K22k1k16
$$ plain form
2208 -257 183 -338 -303 18 -63 100 76 -19 44 -180 25 225 -131 68 -177 -216 33 -97 -18 -128 -285 -49
2230 -49 18 131 -83 -52 -194 -172 -24 -168 64 -108 166 221 18 160 -4 177 46 -8 -81 194 -170 -356
2252 -356 -178 -60 -152 186 -109 -558 8 -126 -180 268 69 143 227 -191 99 9 381 272 287 51 -1 -105
2274 -105 -29 -30 -171 -182 25 -209 -109 91 -246 -99 -372 152 -53 -181 34 -101 -23 -344 92 -234 -13 15
2296 15 -122 -431 -29 -222 -25 -266 14 17 30 240 274 -162 82 -169 33 248 -184 5 86 -98 -158 203
2318 203 -56 -134 346 102 28 -132 -18 113 185 -161 -3 -140 259 123 32 482 -81 -222 222 128 91 103
2340 103 64 -255 -78 213 -363 147 -171 -81 35 6 -115 -93 -316 -28 -88 122 -132 -56 -26 12 -309 -42 -132
2363 -132 -127 -114 -50 -412 -82 66 -137 47 -181 -113 -37 -215 229 104 -178 -171 -21 41 159 -67 155 134 -82
2386h2k76J51J03P1l1l07M93j03J12L1k89J18R2q5K42N3j97Q4M7k5j00r3o8J46
2410H7k60j15K74k8Qo8p3J63q0J83j54J48K32o7j3j12rj90L50k90j15J73Q5k60
2434a31k3pk06L73J44k72J37K23q4r3o1L1q2J02K47l50J1j4o5Q3k97K11K5q4j26
2459c08M48j35j98J13J90n6J46k23J48Kq7J07k65J21m1k11j31M03k01L01j94J94
2481A23j00J12k82L53n0k52K25k04K1J23m7k9L0l01K76k72K25NK4J57j09j30J82
2504H0K70j10j44M0l55M22j48q3Q6L8m11N18l18r2M04l01L91k14p2j34J11R8l4
2527D2q4l48J01J08J92K06j94J1K75l53o9M2P9K08k38P0J1j11J8J9r4J31Q2j69
2551f5j02j01J44L25r4p8k04L50K0m3o9p4M1L7j57m8R5p5K83l93R8k20K44K6r8
$$ plain form
2386 -82 -358 -207 -104 -33 -64 -371 122 19 131 162 -127 -9 83 -2 240 293 96 180 227 202 102 9 -59 87
2410 87 -173 -288 -14 -42 -34 -102 -175 -12 -92 91 -63 85 317 250 237 125 116 -74 276 -14 -129 44 129 -131
2434 -131 -154 -161 -367 6 150 -122 15 238 154 61 0 31 -51 51 298 -52 -41 -55 -120 -37 -334 -123 -98 -182 -308
2459 -308 140 5 -193 -80 110 54 200 -23 125 127 40 147 -118 3 -38 -249 -380 23 -178 123 -71 123
2481 123 23 135 -147 206 156 -96 129 -75 -54 69 22 -7 23 -278 -2 -274 -49 -44 -20 137 28 -102 80
2504 80 350 240 96 136 -219 203 55 -28 58 96 -315 203 -115 -207 197 -104 287 73 1 -133 -22 76 42
2527 42 -42 -390 -289 -181 11 217 23 34 309 -44 -113 -71 8 216 -22 48 59 -52 -34 -15 -109 22 104 -65
2551 -65 -167 -268 -124 201 107 29 -175 175 195 152 83 9 50 87 -70 -118 -23 -98 185 -208 -110 -330 -86 -60 -158
2576a58n9J31L19q2k44L0K95m55K50m8q2Q2J61j38l55J66J07j88J36j01K03k50
2598b80N5M24k32k47N34j89J62l37q5M89j70j42J63j72j39r7K18J40j61k60N30
2619B04k99K70J42l98M7K48l02N19l90o8J09R3l75N0K21k99K58K31l41J33K5J32
2641B10k52k01K35K40k08J09P5k2R9l31J63J1k2k6k60K3L22o3l55L18K24l70j85
2664b66M49j81j13n3K81p8Q8o4N4j32N9k21J18O9L06j46j43K4N8L3j32J14J3n9
2688G8j40L3M4L26m23J53p9N5J84j86p8l2J69j38J16p0K0o3j53J52L43l91K09
2711A29nj61K28k5k89J29j5j83K34J86k19J23m63J29N49l99L56l37O8K9K87k14
2733A37k89Q2J04l10M43j86n2j82L61j05K79j88J04l98J95n8j62M67k41nJ09j10
$$ plain form
2576 -158 -217 -86 233 151 -93 -63 232 -223 27 -21 -103 -21 140 2 -353 -187 -80 -268 -132 -233 -30 -280
2598 -280 -225 199 -33 -280 254 65 227 -110 -195 294 124 -18 145 -27 -166 -263 -45 95 -66 -326 204
2619 204 -95 175 317 -81 -34 214 -88 431 41 -27 82 175 -200 -150 71 -228 30 261 -80 53 78 210
2641 210 -42 -243 -8 232 24 133 208 186 285 -46 117 128 106 80 -180 -157 165 102 -253 65 289 -81 -266
2664 -266 183 2 -111 -164 117 39 127 63 117 -15 44 -177 -59 10 316 170 27 51 109 142 10 124 137 78
2688 78 -62 -29 15 341 -82 71 -8 47 231 45 -33 -65 104 -34 82 12 32 -31 -184 -32 311 -80 129
2711 129 124 -37 191 166 -123 6 -9 -192 42 228 9 132 -331 -202 347 -52 304 -33 35 64 351 137
2733 137 -152 -70 34 -276 167 -19 -71 -253 108 3 282 94 198 -200 -5 -63 -225 242 1 -4 105 -5
2755ej93K27J05k08O6P4j5J64k79J30j50R5j44M3j43J37Q8j71j30M05l35M65k19
2778GJ13k6q2j6K15J1l34L5K64j56l05J85j27K20o8r3j30J89J2n9K62r8L7J85
2802B41l77J86m2J61m63o4M80r0l1m25N05k44K05Nj85P09o77j29L48O3k29L8K87
2825B72J03k87k29J9L57l17N28l19j11P6l42L1J31R3j50K21l52M41k78J50o5j19
2847a47Q8K35j0m09K33K04P9l36o1j51J34k2L47l7O1n3j97m1J36j36j69J38J7
2870i7L23k19M1J62n82L64L09k01%l70NL88l89N3K01M09m43J91L0j25O0k64K1
2893a33J77Qj80J05q0K37j74l8J95q9K0k84L55j06J02Q7k8j40O6Jj90J6J61Q1
2917A69k77l7j28M37k54rj7j32J94j14J97M2j50J55M5k65M11j66M7N8m83L26k3
$$ plain form
2755 -5 -198 29 134 -74 -8 66 51 215 -64 66 -84 11 -133 -90 -233 -96 -8 -179 -309 96 -239 226 7
2778 7 120 94 12 -4 211 222 -112 -77 187 31 -274 -89 -216 4 -64 -157 -287 -98 -86 -145 117 19 56 241
2802 241 -136 50 8 169 -294 -358 122 32 1 -424 81 -163 42 47 -138 571 -106 -235 113 176 -53 -15 272
2825 272 375 88 -141 -122 235 -82 446 127 16 92 -250 -219 -88 5 -145 76 -276 165 -113 37 -28 -147
2847 -147 -59 176 166 -243 -10 194 273 -63 -124 -275 -141 -163 184 147 208 155 -42 -83 53 -83 -252 -114 -97
2870 -97 226 7 48 210 -372 -8 301 100 100 -270 -265 123 -266 -213 -12 397 -46 145 175 50 110 -154 -133
2893 -133 44 52 -128 -23 -103 134 -40 -78 117 28 48 -236 119 13 115 202 174 34 100 101 -89 -73 88 169
2917 169 -108 -145 -273 164 -90 -99 -116 -248 -54 -168 29 71 -79 76 121 -144 267 101 148 206 -277 49 26
2940B6p4K4m3k57L07n2J33j72j20L28l70K56J72l4jj24K50l37J89m70M52j85n9
2963a61L98j79r4q9M9O5j89J78j91K04p0M95l78O5Q4qj37J12k19L24l89Q4j23
2986a69J51j24k8M9o4K39n52N75kj24J39j78L4mj41L64j72j94J18K60k24j2R1
3009C2k02L02j36jp1%k46J23L43j52K50l40kj55K30j0n7J3L3J50r2k0Q8j42J22
3034F0j15K69n9j32l5K19l48J24J26k2m02K14j12L9P1n5Q2m8K11j99k9J72k27
3057a96J79J0j94J89R7j56L55k26J3q3J35k79J12k11K05q7J79Q2J00m16L09j51
3079c4j46L24j01k47n2Q9J27J03Kj09NK18R9k06k38Q3K2J36J4k60J71O3Kj26j0
3104g1K62k68K28k62K73k12K59j6l27J67K0P4o4K1K12k93OJ48Q6m04K4k7K70r2
$$ plain form
2940 26 -48 -24 -67 -324 -17 -69 64 -108 -228 100 -270 -14 158 124 123 -1 249 -88 101 -369 83 -102 -161
2963 -161 237 58 -36 -125 -76 -11 -200 -22 -213 -9 -79 416 38 103 187 179 42 154 -65 259 -130 -46 -169
2986 -169 -18 -142 -170 -121 -185 54 -498 77 75 -49 90 -88 -54 -58 -199 165 -7 -201 -83 177 -47 -59 32
3009 32 -170 132 -4 -5 -76 -76 -322 -199 144 -8 242 -98 -100 -255 -25 -35 -92 -79 -46 104 12 -8 80 -62 60
3034 60 -55 214 155 23 -12 207 -141 -17 109 87 -315 -101 -213 -174 -103 -158 -76 -124 87 -112 -141 31 -196
3057 -196 -17 -7 -201 -12 85 -71 284 58 71 -12 123 -156 -44 -255 -50 -137 42 124 224 -192 117 -34
3079 -34 -180 144 43 -204 -256 -167 -40 63 65 -44 -39 179 278 72 -166 -83 -61 75 89 -171 0 63 65 -61 -71
3104 -71 191 -77 151 -111 162 -50 209 193 -134 33 53 127 63 84 296 3 9 157 243 -161 -137 -164 106 14
3128A4p0J1K4K01k71J87O1j72NQ0O0j79K45P4k60J03Q6l75j25M80j87M5O7j43
3152c9R9j8j22K21k44j00K87M4j08K36l55%J29q9K95j81j35J51j81p7L59k34J79
3175A17k30J23l48N94k10m3J63k82L87k5l15K27j07J18Q3J6l77R7J33k10J74p9
3197FO2m72P58l13k50J82K1j25K2J57j08Q8N5j24O2Q7k97L79k05j7k04L41m7j28
3221g0J59K54k87j72L20J68m11N4j31L51k18j44L27k76%K35p0j02j96J79J47J8
3243A35q2r5mJ58j7P3j6Q1k42j9J43o2J6r7O6k77M30l70L78k56J88O6j88pk3J07
3269H6k48J27R5K74k84J15J18J67q20K33L30k27O8oR6l4p2M6k75L98Qq2k50l7
3293a74K21j7p7l7j03K70O4l45Q5J28J27l18J91j24q8l9L41j29N4p8n5j01L17
$$ plain form
3128 14 -56 -45 -21 180 -91 96 157 -15 -10 70 130 -49 196 270 10 113 199 -176 -301 179 -8 37 104 -39
3152 -39 60 42 -80 141 -103 -203 84 128 20 256 -99 -99 30 -59 236 55 -80 71 -110 -187 172 -62 117
3175 117 -113 10 -338 256 46 3 166 -116 271 246 -69 158 51 169 252 268 -109 -12 121 -89 85 6
3197 6 68 -404 354 41 -209 -27 -6 -131 -109 48 -60 28 83 -41 21 108 -189 190 -15 -32 -236 105 58 -70
3221 -70 89 343 56 -116 204 372 -39 15 -116 235 17 -127 200 -76 -76 159 89 -13 -209 -30 117 135
3243 135 53 -42 -46 112 95 168 152 233 -9 -28 115 53 69 -28 38 -239 191 -179 199 -57 131 197 9 2 -21 86
3269 86 -162 -35 60 334 50 165 283 450 -370 -137 193 -34 34 28 124 90 18 64 -211 187 195 113 -137 -174
3293 -174 47 30 -47 -84 -187 83 147 -198 -113 15 142 -176 15 -109 -197 -236 105 -24 30 -48 -103 -204 113
3316A13k41K77N4m94M66j20Q9m5K8l51K3J04J16J0l2J70j79j14J62J66k60K36
3338A78J22k98o7L31k88o9J54k7K01l56r5K38j45J2R4o5J73R1l35K18k1M6j79
3361h7K0K60j40j37k3M86m73k00K48L10m22J97R5r7k0j55J13o5N0J16K0L4k80
3384a50j17K59j25L2k39L51M05n22K68k73J27J15m64K75j22K8K37j28k7n5o1M72
3406B86l07J26Q6k00L14k09M7j02j78Q9M5J9o0J90j81q1m7k18L89Q7M4j13p2P8
3430C2j4j99O9O5k15L31L0m3l51L65r7J21n8Nk71M23l15K22Q9q8j66l4K74j79
3454dj87M22k61PK83j72q3k03J78J3K17k24j35J64m4J42N7Pj41j46j14k4M05J96
3478C53n30J5J96k04L67k40J03k7K55k14j04J27k89K52J30j99j25J15K40k77j36
$$ plain form
3316 113 -128 149 203 -291 175 55 144 99 127 -224 -201 -97 19 29 -3 167 -12 -126 36 202 -58 178
3338 178 300 2 -65 266 -22 -91 63 36 237 -119 -214 24 -121 -109 -15 -80 93 184 -151 67 46 92 -87
3361 -87 -67 193 53 -84 -107 379 -94 -294 -46 264 -158 39 134 37 17 -138 -25 -90 -40 76 96 130 -150
3384 -150 -267 -8 -133 -101 -340 11 416 -106 162 -111 16 131 -333 -58 -180 -152 85 -43 -70 -125 -186 286
3406 286 -21 105 191 -9 305 96 143 41 -137 -48 -3 16 -44 146 -35 -116 -163 -381 8 95 139 26 -46 32
3430 32 18 -181 -112 -47 -262 69 99 56 -295 70 -27 94 36 41 -230 193 -122 100 189 101 -65 -99 175 -4
3454 -4 -191 231 -30 -23 260 88 5 -198 -20 -7 210 -14 -149 15 -29 113 170 177 36 -110 -224 -248 157 353
3478 353 -177 -162 34 -170 197 -43 60 33 288 74 -30 97 -192 60 190 -9 -134 -19 221 -56 -192
3499a92J27l79M58K26m27RM8n9J62k18L32j45J39k85R5L5L3L0j14L19q5O8r6n3
3523B8k40K23k21k46NL59p8K24R2j16k47K45j55J75K8r1L47l06Q3K22l19J02l32
3546b18M17M9j69k16J02q6J97M1L8n2j36p2R0O6l82J80L30J83j25j59%J0j35m8
3570i5J33J00J21j36m82L35r7L03j14M0l5r3Q8J9j52P9k35L78n0J95m22q1K47
3593D6j29K7r4P5k4oj03p4M67M6k86k87J58J62k81N9K70J01j79RK20j16j35k5
3617i9J15Q8J0l13K7j06L40n0Kk8J64j24J74j99q9K07l0j32l08M71Ok26j01R7
3641a04K4K25Q6j93k7j03j43L83K26n49Q6n8J21l2n6J45J6k83J36Q7p8k4J36Q0
3665A01j24K7L56j04n9p2j02J55l7k79K82O8k57J68l08L26k98K66j60R6j42KJ30
$$ plain form
3499 -192 -65 -444 14 240 -187 -178 -130 -189 -27 -245 87 -58 81 -204 -109 -74 -41 -11 -125 194 109 177 81 28
3523 28 -212 11 -210 -456 -451 -92 -170 54 146 30 -217 28 -127 48 76 -15 332 26 109 331 12 114 -218
3546 -218 199 248 79 -137 -35 -121 76 117 155 103 -33 -105 -15 51 -331 -151 179 362 237 78 78 88 -47 -95
3570 -95 38 138 259 123 -359 -24 -121 182 68 108 73 -20 68 87 -65 14 -221 157 107 302 -120 -201 46
3593 46 -83 -56 -150 -75 -99 -105 -208 -282 185 231 -55 -342 -184 -22 -303 -244 26 127 -52 -43 177 61 -74 -99
3617 -99 16 104 114 -199 -172 -278 62 12 14 -14 150 26 200 1 -88 119 89 -43 -351 120 126 -100 -201 -104
3641 -104 -80 145 231 38 11 -92 -235 148 374 -175 -89 -147 -26 -58 -114 31 47 -236 -100 -13 -91 -115 21 101
3665 101 -23 4 360 256 197 125 23 178 141 -138 144 212 -45 123 -185 141 -157 109 -51 45 -97 -95 35
3688C5m08N54R1r3j20J13k91Q8j3J36k47Q7J75J8m05N7J49J89j39L14j64l36P2
3711a38R6K27k86O1J37K2l3j35J66K1k46R4k01K76j05N5j97K40l2p6p6L28j64
3734C4j03K06l15K49j02J6q7N00n35l2L19r2j35r2L10n1k48L38n02L28j7p6j11
3757a98K13K18k31K51l00N5K50m97K13k7J04o4j93K89k27o0k60M00K1K2R8j94
3779a17K17k11m1J86r2K11j20N0P9j38k9p1J39j32n8J29J31J27n34J08J52L7J12
3802A35k25L11j70P6k24N0L5K7j00J52J7j7P1j17K03m81R6L99n57K59q0L41l60
3825a59RK76l70M54j49mL1k2q0j3K69l13K76j31K5k20O3KQ0m2j60O6k91L71L17
3850B85l48j0k30M24r4j94J70j52K03l6N8j61J06j59r9Q7K79p0K16j54j96j02
$$ plain form
3688 35 -373 181 272 179 59 172 -119 -31 -44 92 -155 -68 107 125 -280 -223 -74 115 -24 290 126 -210 -138
3711 -138 -42 185 -101 -40 97 119 86 -49 117 138 -108 -14 -215 61 -44 11 -186 54 22 -54 -130 198 34
3734 34 -69 137 -178 71 -31 -15 -102 398 -137 -169 150 58 -77 -169 141 90 -158 180 -322 6 -11 -87 -198
3757 -198 15 233 2 253 -47 8 258 -239 -26 -53 51 -13 -206 83 -144 -204 -464 -64 -43 -21 77 -117
3779 -117 100 -111 -152 34 -58 153 33 83 162 24 -5 -76 63 -69 -127 2 133 260 -274 -166 -14 23 135
3802 135 -90 221 51 127 -97 -47 -12 15 -85 67 84 67 138 21 224 -257 -161 238 -319 -60 -140 201 -159
3825 -159 -150 126 -244 210 61 57 88 66 -14 -27 242 -71 205 74 99 -121 -58 -56 24 -18 -178 -112 -403 -32 285
3850 285 -63 -73 -303 121 27 -167 3 -149 54 18 76 -85 21 -138 -237 -150 129 59 275 121 -75 -177
3872a77K87m3j08L75o55L34m3j53N09k35j44K3K62k20J38k36j8J69k23K19j33
3893g2J10n4Q0k06J67j3k2P8j4oj57L0J52p5K68m90M18m29L8L79m16L97j99N6
3917B0Q6j19R5o0R6p9J12j54M0K5Q3j45o8j1k26L39J31j92j92Q0J26K45j52pq3
3942a0J48n1n7L1j56J37P5R6K1k79R3M9R8k41p8pK15j67j83J88L02nl52K22k3
3967F6p1L4J27j7l13M9K08k33L02K17n40J09Q0M9q2J11j84P0J22R8j70J31J22
3990B85m06m9K57j76J95J8K5l04K8L70k91J40j78o1J04k2K26n5K08l47K20k15
4012b8k8pJ15o6n1M9k17L93o2l3m8l63J97M94l36q2l1K84l0j24l08P35l18K13
4036C48o10N72k14Kj08j23J46k53J34j07J90L17l71L2O9M1nk39J31J4l35L72n1
$$ plain form
3872 -177 110 67 -41 334 -321 13 -30 -183 326 91 -53 -30 232 12 150 -86 -104 65 -158 61 -72
3893 -72 38 -16 64 -142 25 12 -10 68 54 48 -109 -79 73 -2 266 -224 194 -235 -197 182 -234 163 -36 20
3917 20 106 -13 82 22 118 39 151 -3 37 62 145 0 -68 -79 -305 34 165 -27 -219 -139 -13 232 80 73 -10
3942 -10 138 87 30 61 -95 42 117 213 234 -45 48 97 195 -46 -124 -131 84 -83 -266 -78 224 219 -133 89 66
3967 66 -5 29 156 139 -174 -125 83 -150 152 369 -171 -62 18 67 -15 96 -88 -18 104 202 32 163 285
3990 285 -121 -170 87 -89 106 124 149 -155 -127 243 -48 92 -86 -147 -43 -65 161 106 314 -33 187 -28
4012 -28 -56 -63 52 -14 -65 -16 -233 160 98 65 17 -346 -149 345 9 -73 -104 180 150 26 -282 453 135 348
4036 348 -262 310 96 98 -10 -133 13 -240 -106 -213 -23 294 -77 -45 24 65 60 -179 -48 -34 -369 3 -48
4059d8l0r0J00j93j15M54l29M04j51O9j12J43j45J3m6J83j20O6j61K09j01k46
4081b46J55P4J10l21J78j9K18m85M06j79K04k63J01J77M7j14M0J40j27n4j96Q8
4103f6L5K6J38n7nl0L7P7j85J2j62K68k59j1O04o47J0L87m4n5j55L04k68J59J6
4128A29k4l4k32J43m7j30N3L58m12L50j09K6n5r9p0m5R0J29j05J41K86l43Q6K1
4152A07k32j34m5K83J56k86j49M1NK52O0n03M96j73n2J57p7J63j62J19q4r9L5
4175a22K28j52L7J15j36K93j91p7M2n1K95l72L29k02j77K83k85l2L45k38Q9L0
4197E1N4k85K6N03l70K48n19J1K13K4Q7k5m3j52M83k05r0J04j34j37K58jj74R8
4221B5%j87J42o0K05Qk35j45M06p4P7o7l78N9M83j58k94L73l89K74j00l6R5J03
$$ plain form
4059 -48 -78 -168 -68 -261 -376 78 -251 153 2 71 -41 102 -43 -30 -76 107 -13 53 -108 101 0 -246
4081 -246 -91 -17 93 -228 -50 -69 149 -336 70 -109 95 -168 -67 110 157 43 83 223 96 42 -154 -66
4103 -66 -31 -5 133 76 71 41 78 155 -30 -18 -180 88 -171 -182 422 -225 -215 172 128 73 -82 222 -46 113 129
4128 129 105 71 -161 -18 -65 -195 -142 216 -196 154 45 71 16 -83 -153 -198 -108 21 -84 57 343 0 86 107
4152 107 -125 -259 -304 -21 135 -151 -300 -259 -254 -2 58 -445 51 -122 -174 -17 -94 69 -93 26 -58 -157 -122
4175 -122 106 -46 -9 106 -30 263 72 -5 37 -14 281 -91 238 36 -141 142 -143 -175 170 -68 21 51
4197 51 105 -180 -154 349 -21 227 -292 -281 -68 -44 43 18 -25 -177 306 101 11 115 -19 -156 102 101 -73 25
4221 25 25 -162 -20 -80 125 133 -102 -247 159 85 162 95 -283 -224 259 101 -193 180 -209 65 -35 -71 24 127
4245A27j07k8K8O2m06K18J33J30j76p1L1j77J46J73l43J49J65J10N7l52L16r1
4267I4q9N0m2N2j37j39J76J59l16L22j07M0K68j42j82k02L38o4N2m6p0N6k3k77
4291b29J17O7j08M30k69j0k82L26lJ08k37J44J6j77J89j02M4j68K11K1j20J42
4313A10r9k7K06q5j96k06L79k18J62n7j88K95K21k57o8j1Rj95K33K60l99R1j55
4336a95K05J1J10ol92L46j23k0K3K98l46j76K76r0Q5o1lJ1j58L28j12j52K2J66
4360D7J57j44j62J87l32K71jk1k4M0J05n0j7m1N2J6k04K50K46l51j83K59m11N46
4384B35k96N4j98K52m04N04k67L78m69J78j9L6P1j50J35K01l03j37P3J07K20j05
4406I6mq2l0k6L20l28K2O1j04j5j52L74j70mK7j01j8K58pN3k07Q0k65K27n8n9
$$ plain form
4245 127 20 -8 20 82 -324 -106 27 157 -19 -90 -59 -236 -90 83 -260 -111 54 164 221 -131 185 94
4267 94 5 55 13 65 -72 -211 -35 124 -192 130 23 63 331 189 7 -195 143 79 131 85 15 71 48 -229
4291 -229 -112 -45 -153 277 8 -2 -284 42 39 147 -90 54 70 -107 82 -20 24 -144 67 88 -32 110
4313 110 11 -16 190 105 -91 -297 82 -136 26 -31 -219 76 297 40 -28 -39 -30 -225 8 268 -131 -40 -195
4336 -195 10 21 131 125 -267 79 -44 -64 -41 257 -89 -265 11 -79 6 -55 -58 -47 -205 123 11 -141 -119 47
4360 47 204 60 -102 85 -247 24 23 2 -22 18 123 73 56 15 67 83 -121 129 375 24 -159 100 -311 235
4384 235 -61 -7 -205 47 -357 147 -120 258 -211 -33 -52 -16 55 -95 40 241 -62 -199 -126 -19 201 96
4406 96 92 10 -20 -46 274 -54 -32 29 -75 -90 -242 132 -38 -42 -15 -116 -134 124 117 170 -37 43 -222 5 -53 -112
4432a12j24K01J44l52J94R3m1K20k86N4j91p7L62k56K89k34K71j50K6k3J41j72
4454b3P7p1M4Q9k68J59M9j37J04o6J0j40J51m5qM3r6K23p5P8O1r4J21l3l7M8k26
4481f2lQ0l7k4J81k99M68m64o3K20nL52j29k77K82l32J60j34l35N42j44k8J2Q7
4505D8j30R6M6j83J58K1J45l40O0K52J91l90K1kQJ65n1N9m35J42QJ21k19M78l06
4530c7r0J19o3J1k86J86M3O0R2Q8j8J01j16J62j81n0K59k16j89M08l11j42J33
4553c7j37K10M4j7j49j10K20P2k20K0p8K39N4J0k02J66k95J82J73j46J41k81O04
4576D63m21k71P0K36k8K92m77kJ27k25K06Q5J12j18j1j60m1K29o8rK62j42rk49
4600a49L14l54M04k18q9J13J01o77M44K40j94q6n1K53m1k0N0k86J70J87l27n1
$$ plain form
4432 -112 -236 -35 109 -243 -49 44 3 223 -63 -9 -200 -277 85 -171 118 -116 155 5 31 8 149 -23
4454 -23 54 -17 27 116 -152 7 56 -81 23 -43 -33 -173 -22 -67 -75 -32 -128 95 20 98 159 65 186 153 116 164 -62
4481 -62 -65 15 -22 -46 135 -164 304 -160 -223 -3 -8 344 215 -62 220 -112 48 -86 -421 121 -23 -51 -39 48
4505 48 -82 14 60 -123 35 56 201 -139 -79 173 364 -26 -5 -7 1 166 115 174 -261 -119 -111 10 -209 269 -37
4530 -37 -127 -8 -71 -60 -346 -160 -117 -57 35 123 105 206 90 252 71 21 280 64 -125 283 -28 -170 -37
4553 -37 -174 36 80 63 -86 -196 24 96 -124 -104 -182 57 111 121 -81 85 -210 -28 145 -1 140 -141 463
4576 463 42 -229 -159 77 49 341 -136 -138 -11 -236 -30 55 167 49 38 -122 -163 66 -2 -11 251 109 100 -149
4600 -149 165 -189 215 -3 -92 21 122 -555 -111 129 -65 -151 -202 51 10 -10 40 -246 -76 111 -216 -267
4622b67L22J15j07l17J46J1K20k9j18M6R9L0j19l5J46k89K21k17J48l1J29j47
4644d3J25n10O67k35j12J85k03K54m45O49m84P4r5p1K56J24Q8j05j64o0K24o4
4666E5k8O2j76K34q1q5M7Q6k41rO0J12j78J46R5m7k3Q7j13j34O9M0r6q3J34N8
4692iM4j15K24O2k16k03p7K04j4P6k2O6J55P4l35K66r8K77j16j10j49j77kL29
4716A34j36K46m17L30k74J89jJ9k4K78l92J92k92J94l4Q4j59kL27m10L20l7l0
4739A05j10L88k84j08L2J54j67Q8J40j30j08%j2k3j27K28j51L2R4J52nk24L49
4762C13l24N1J55j31k56R3J08J07l45J81J22l7J4J40q5j3J00j20l32K56l6J8L1
4785A0J7j69J30m3J82j08j17J2l5K40p1N4J33k49l2j76J51K0M6K69K01k12k88
$$ plain form
4622 -267 55 170 63 -254 -108 -97 123 94 -24 22 121 151 32 -3 143 -146 75 -142 6 -25 104 -43
4644 -43 82 -428 239 4 -108 77 -126 128 -317 332 -152 -78 -173 -244 12 136 224 119 -45 -105 119 55
4666 55 27 89 -87 147 66 -19 28 114 -127 -136 -76 36 -142 4 99 52 29 116 3 -131 -62 -22 -118 -201 -67 -9
4692 -9 35 -80 144 206 -10 -213 -290 -86 -100 -24 -46 20 175 249 -86 180 82 359 243 133 -16 -193 -195 134
4716 134 -2 244 -173 157 -117 72 71 90 66 344 -48 144 -148 46 12 96 -63 -65 262 -148 172 135 105
4739 105 -5 383 99 -9 23 177 10 98 238 108 0 0 -12 -35 -162 66 -85 -53 41 193 188 -36 313
4762 313 -11 40 195 64 -192 -99 9 116 -229 -48 74 37 51 191 106 93 193 73 -259 -3 -39 -21 10
4785 10 27 -142 -12 -55 127 19 -98 -86 -121 119 48 102 235 -14 -46 -222 -71 -51 -5 264 465 253 -35
4808c5j57o5K95j09K6O6K6o8j9Lm8N3Jr7J03J08q5o5R1J48j55q5j00j16L23j00
4834f1j53J64L5M1J43j66p1q3M45k54mk11K54k83L9L52k13pQ2k46O65j13k86k45
4858a76J06J2J97j44K16J47k52p2j72M71m27N4J02J79l92k4Q4J03J40j61j55K52
4880H8Jj56L6j56L72K11k57l68K04j8j43K46l07J34R2N6j14K35m57K08M8j98K45
4903BP2J30j95Q2k17K58j68O8jJ12j25J4k71M00p4N5l06K43P7l25N09l90q7L1
4927a06O4l3K70j29j47J21p0j76K67j36l2n9Q9J21l1J02k14J94o3r5J58l55J68
4950i2K7n7K48l73M00l89M9J90j05Q9k9r6J38k2N7j98J37r8L08j03k08K10J02
4973A85l6j83J50k73K58j85j06J82j6q0J99m18O73q4k2r4k98L05l33K8K5J78J1
$$ plain form
4808 -35 -192 -257 38 -71 -45 21 47 -21 -40 -37 -85 -32 -31 -128 -25 83 -2 -67 24 172 17 -68 -168 -284 39 -61
4834 -61 -214 -50 -15 26 169 3 -68 -151 294 40 36 -175 79 -204 -165 187 -26 -33 49 -197 468 355 69 -176
4858 -176 -70 -58 139 -5 211 358 106 34 -138 333 -94 -40 62 241 -151 -175 -91 12 152 -9 -164 88
4880 88 89 -67 -31 -187 185 396 139 -229 -25 -43 -186 60 -247 -113 -21 35 -79 156 -301 -93 -45 -243 2
4903 2 74 204 9 91 -126 132 -36 32 31 143 18 32 -239 161 87 142 -164 79 156 -169 340 -50 -137 -106
4927 -106 -42 -75 195 66 -81 40 -30 -206 61 -75 -107 -166 -77 44 13 115 -99 95 32 -63 95 -260 -92
4950 -92 -65 -122 126 -247 153 -236 -187 3 -102 -13 -42 -138 0 -22 35 -163 -26 -124 184 81 -127 83 185
4973 185 149 -34 116 -157 101 -84 -190 -8 -24 -104 95 -323 350 266 244 150 -148 157 -176 -148 -123 55 66
4996F6J3k67N56l07R3j28j11k1j13K56J36m8l51n9J90jk36M45j55K72k1j90J04
5019A23J83k30R9j59q2ojM5j63p4N15k33k43L4J45j25R0j82j36O71k52j01L31
5042B49k42r3N3k6J48j45L49k83J28k5j26l0j8K40k24K43o7k11n3K52J12l67j9
5065a55K01L6j51m4J70j52P8p8k43K00J21j16j50p9M14J96k49O7k04P0K70K2j12
5088A12j42J49l09j15L00PJ03n69L85K97k94L32k48l7J86Kp4q5J49j19Lk79K44
5111bk52J75J9K04l79P7L60j83Q7K8k25n6J58j04K13j35M3O5o9K60k14r5k8%J66
5136A13K02j76j62L18n83L39j05N9l3j85K97L0k9N9l71L57j72N5M8j33J78M4p5
5159G5j36P1j93J94J03m02l8M23p7M1j50P6jk10Q3M22m68J44qP6k31K92j08J00
$$ plain form
4996 66 79 -188 368 61 154 26 -85 -106 -219 37 173 125 -226 -285 -95 -96 -332 113 -42 230 209 19 123
5019 123 306 76 175 16 -66 -72 -73 -28 -191 -265 250 17 -226 -192 -47 -172 -82 -264 -400 271 19 -82 249
5042 249 7 -86 -33 -59 89 -56 293 10 138 113 -13 -43 -61 179 -45 198 131 -80 -133 119 231 -136 -155
5065 -155 46 82 -69 -113 57 -95 -17 -95 -338 -138 -17 -133 -283 -362 52 248 -1 66 -138 -68 202 224 112
5088 112 -30 119 -190 -305 -5 2 105 -464 -79 218 -76 256 8 -29 157 159 85 0 149 30 33 -246 -2
5111 -2 -254 -79 -60 144 -235 -158 202 19 106 134 -91 -147 11 -93 120 -15 28 93 24 284 70 -25 -53 -53 113
5136 113 315 139 -23 295 -288 51 -54 5 -28 -213 84 114 85 144 -227 130 -42 13 61 -72 106 150 75
5159 75 -61 10 -183 11 114 -288 -326 97 20 61 -89 -13 -14 -224 -141 281 -187 -43 -51 25 -206 86 -22 78
5183G8r3pr3K06j24j53J37l4J37m9j21K07j17K21LJ26j77n7j87K7K86m54q3K40
5207h1P9q1J66p2L6j04j66J49J88j86P8J33j73R6J11j58j26J05K14k76O9k22J08
5230a13L01Kl57P2K19p2j37J45L6j39m2K53m05J86J02J15j23p3k62L72q6Q5K15
5253B94k20k23PR1J97j36J39j54j89j67L71r3J5n4M1o1R6j12J29j99K79J01m46
5276b94K72Q4o8K75k64j29J92Q2q5p3O9Q5j00o6j08r7M33l41p5K18K60j87j74
5299i1j93L36j28k10K28K26r6q8j04J06p7M9M7P3J23l51J64rmQ3j79J07L0j69
5323a27M3K85o5j92j37Q8J74o5N1l54M01l91N11k05J03K04m57p4L30QJ11q9k75
5346a22M13k26l2l24L89k14J92k57J62J14L1l80L46l22K61L27l33j25n9K16o8
$$ plain form
5183 78 -15 -22 -115 91 -33 -186 -49 -83 54 5 -116 91 -26 195 198 324 147 90 -97 -70 216 -238 -321 -81
5207 -81 -2 -83 83 11 47 -57 -223 -74 114 -72 6 139 -34 62 173 15 -111 -6 208 -68 1 -221 -113
5230 -113 188 190 -167 -95 124 52 -85 60 96 -43 -85 168 -237 -51 51 166 43 -30 -292 80 -6 79 294
5253 294 74 -149 -142 -51 146 10 149 -5 -194 -361 10 -83 -68 -122 -81 -142 -46 -158 -29 -228 51 152 -294
5276 -294 -22 62 -6 269 5 -124 68 150 65 -8 61 146 46 -20 -128 -225 208 -133 -208 10 270 83 -91
5299 -91 -284 52 -76 -286 -58 168 72 -16 -120 -14 -91 -42 5 78 201 -150 14 5 1 84 -95 12 42 -127
5323 -127 -84 201 136 -56 -193 -105 69 4 55 -299 102 -289 222 17 120 324 -133 -207 123 131 242 153 -122
5346 -122 291 65 33 -291 98 -116 76 -181 -19 95 126 -254 92 -230 31 358 25 -100 -159 57 -11
5367a1n3M9K90m10k09L69K4n5j38M64n90M37m0j13J02k40J44MN5j79N1m1j27L53
5391A36q8m6j54m0J38N3R1J85l49k3k8O9k2Lo8K38m02N31l37k0K95k13mj47J45
5416e7J74l59L11m7j43P0lO3j02O6m6J97k93L88l00J89j96M1K97j81o5L2K9L3
5440I8j26nJ61j19k01K57j70K15j94j7j4K2O8p0J93j2j93J9J7J26K41l43O0o9
5464e6K4R6k16L09nn2j24J81o6l17L3J36K01k76R9O9N0j66K99q1r0r9J31j83K48
5489A45j80J99k29k27P34o73o0L57k5N9k25J93K81k09k05j05n3j6j02O17q2K07
5511D01l37o2N6j34J26q1L1k00K32j92J08Rk26N51l09Q5p4k58J1K9J24J4K85l74
5535a85M19l71K23J53k02o7J58k64K9K45q1O0l4k03K17j22J61J33j31k61L9K69
$$ plain form
5367 -11 -64 -15 275 -135 -344 25 49 -6 -144 320 -270 167 127 14 116 -124 20 24 79 -100 -49 -90 -217 136
5391 136 48 2 -152 -192 -54 -1 90 275 -74 -97 -125 -56 -78 -75 -143 95 -307 224 -113 -133 162 -51 -55 -202 -57
5416 -57 117 -242 69 22 -121 -51 -54 9 -93 -27 -73 124 -169 219 -81 108 -88 -47 250 69 4 36 65 98
5440 98 -28 -33 128 9 -192 65 -105 110 -84 -101 -115 -93 -25 -95 98 86 -107 -88 -71 55 296 -47 13 -56
5464 -56 -32 64 -152 157 152 100 -24 157 91 -226 -193 -57 144 -132 -33 36 86 -80 219 138 48 -51 80 -103 145
5489 145 -35 164 -65 -292 442 -231 -291 66 41 100 -125 68 349 140 -65 -170 -223 -239 -341 276 194 401
5511 401 64 2 58 -76 50 -31 0 -200 32 -160 -52 -43 -269 282 -27 58 -16 -274 -263 -234 -110 -96 189 -185
5535 -185 234 -137 86 239 37 -30 128 -136 -107 138 57 117 83 -120 97 -25 136 269 138 -123 -84 185
5557A85k93K25l10J16J24j11p7r3L5L01q4L06l27J28r3q7p0N8L85j10k81K6P0
5580B3j54M3n4N24k37j7j96m4j67K83o3P7j14o2K68k39jK43l32L01k00j21N05
5603B66Q7l80r0J45J60j24J41j28j50K80p3p9MR9k9j38L38j28k93K85j56j44L11
5626B04m9M1j72j88J88L09l84L05n74L89j2j3j36j45M74j71J67j29j3o3R1m08
5648b89J75J84Mp9k16K30O2p8l48Q1M89r9p6o7J96M2M9l98K59k7n6q3K34K5l03
5673h9J21R5J5m8l12K62k22J63J03j99J68p4r8l2K44p1m2l2k81J75j28K59l65
5696c88J63K62O5P3j50j70J58J54O7j05j47l3O5R1l7j88N0LM3j84j12N82o21J56
5720b03P1K62MJ0p7j44K7j81K49l91N14m5N4P1j13k39J20j30L83r0k7j55k78J9
$$ plain form
5557 185 -108 117 -193 -77 47 -64 -141 -234 -199 102 18 324 -3 125 32 -55 -125 -67 318 208 -73 -47 23
5580 23 -131 -88 -142 382 145 128 -68 -112 -279 4 -59 18 -96 -158 110 -129 -130 113 -219 82 -118 -239 266
5603 266 353 -27 -117 28 188 64 205 77 -73 207 134 55 59 158 129 -9 329 201 -92 193 37 -107 204
5626 204 155 196 24 -164 24 333 -51 254 -320 69 57 44 -92 -237 237 66 233 104 91 28 119 -289
5648 -289 -114 70 74 -5 -221 9 71 -7 -355 -274 215 116 40 -27 169 211 260 -138 121 94 38 -45 189 214 -89
5673 -89 32 127 142 94 -218 44 -178 -15 88 -111 57 -17 -115 -147 97 26 -16 -48 -329 -154 -282 -23 -388
5696 -388 -225 37 102 175 25 -145 13 167 234 129 -18 -51 14 105 68 -120 -70 -67 -24 -208 -320 262 -359 -203
5720 -203 -132 130 134 144 67 -77 -50 -231 18 -373 141 96 150 221 108 -131 -11 -141 242 152 125 -30 -308 -289
5744b89K79K39k40PJ40k06M42l37J56J49n24J83J01q0P8J56k23K72j32j04k37
5765a70J90j03l1Q1K4k3j42l4K76K8j89j53P0K48O0j89J39O4k25l2K17j01k59
5788b54K18P5k88J94J53j18k03L70l13K29K43k48k7J15j11mm9L0K8kl0kR8m46
5812c42M02O0J09m89K53j4J44j37m5J96l22L67j94J06k15J91m6j12J28R5K11k45
5834A01l18J55j12K95m9p2j09j4K73l72L19O3k04O3q6J77K9j58K40l75j9K15j13
5857g1J2k05J33M8j5R5O5Q3l19M2K69o1J06n00K30J24j93m3L14l21R4J18R6k27
5881a26Q2K8L1j3j71K13k15K75p2r3J67k41L12j87j28J69j22K19O6j29j8l4j43
5904a30n0J64q4J65k18Q9m3J14k4K85k31j58J0M9P3K30m4k14K18m10Q3M00j56
$$ plain form
5744 -289 -10 229 -11 -4 136 -70 372 35 191 340 -184 -1 100 20 98 254 31 303 171 67 -170
5765 -170 20 -83 -114 -33 -9 -32 -174 -208 68 96 -93 -246 -176 72 132 -57 82 146 -79 -111 106 5 -254
5788 -254 -36 39 -249 -55 98 -20 -223 147 -166 63 306 58 31 146 35 31 -18 12 40 38 8 6 104 -342
5812 -342 60 120 229 -260 -7 -21 123 -14 -59 137 -185 182 -12 94 -121 70 24 -88 40 135 346 101
5834 101 -217 -62 -174 121 72 0 -109 -123 150 -222 97 160 -44 19 -67 110 139 -19 221 -154 -173 42 -71
5857 -71 -59 -264 -131 -83 -98 -3 62 145 -174 -132 137 76 182 -318 -88 36 -157 -200 114 -207 -113 5 101 -126
5881 -126 -44 -16 15 2 -169 44 -171 104 32 -61 106 -135 177 -10 -138 31 -91 128 194 65 47 13 -130
5904 -130 -180 -16 -100 65 -153 -64 -107 7 -17 268 37 -121 -111 -62 11 241 197 -17 201 -209 -126 274 118
5927A18j77L28m87MJ46K0m6K21j72J59L9o3p8N1l4k08K37j51L56o16K14J70p4
5950d3j05N08m28k7j36P4K07M8J53l39j22J73ML3ko5N2j80K59J49l03J7J48j59
5974h4R0j7k2N3k32K75j57M0L02k87l2N9N8J85m45K16q7r0K18J32j99Q4k5P7k17
5999a05O7Q1q1o6J97j61ql3L86o13L32J00K56m24L0m4j15P9r8K83J07J87n07L3
6023a17L80m29J93j9J39j9l7K0l10K51k52O0O3R6N5j28L0o2J52j44J03j08k24
6046c07J97L81q1l32J21J6K4k3oo4J57j93N8J47J36r3k10n9J81J44j98K46k25
6069A7o1l43L41Q2J57k06j65J09j42K77j04J32K13l22J71l4j20K74l46J02k25
6090a93K08L0j14j3N4l8l2r9NJ78J10m2q8J56mK23l90l19L34l8K29j57o1P1J68
$$ plain form
5927 118 -59 269 -218 -214 -68 -48 -94 127 -45 114 153 90 12 63 29 -179 58 -93 263 -353 -139 31 -43
5950 -43 -148 360 -68 -95 -231 -157 50 98 251 -88 -210 -37 -33 0 -2 -67 -15 -195 64 213 -90 -73 75 -84
5974 -84 6 -11 -33 20 -212 63 -94 -54 248 -39 -71 -12 46 231 -214 2 -85 -175 43 175 -24 60 35 112 -105
5999 -105 -38 43 -38 -104 93 -68 -76 -109 277 -336 -4 96 352 -72 -42 -86 -201 -122 -220 63 170 357 -150 -117
6023 -117 263 -166 27 8 147 128 91 111 -199 52 -200 -140 -77 19 74 -54 -24 -86 66 -78 25 -83 -307
6046 -307 -110 271 190 -142 -21 -5 19 -4 -10 -74 83 -110 -52 95 231 138 -72 -131 50 194 -4 242 17
6069 17 -44 -387 -46 36 193 -13 -178 -69 -211 66 -38 94 307 -15 156 122 2 276 -70 32 -193
6090 -193 15 45 -69 -82 -28 -66 -98 -197 -192 -14 96 54 -34 122 118 341 -49 -368 -34 -72 157 0 -61 10 178
6115A78n8k73O9p0M5L02m56M0Q5L49l57J76K45k73J00j11N1K57k83Kj47O1J32
6138F4pO5j67J07NJ56k36j16NN6lJ43j68M87o29K56J28l14J37k47K45J42j61p8
6162a30K61Q1m16L07P1j61N7L8n8p7K0K63l06J29k9q6L15k21p5K65k60m5J73k07
6186i1J4K12J20k04P6m0l7j42M55m02L6j81L56r3J0j36K67j20n4k00K15j13k05
6209b57J82R2l12K23j33J0J65K0J71J04k57k0j03M74m03O9o6l2p3PJ21l42L34
6232b6J47j58q0P3j70M78k12j44LJ16J43j80q4P8j71J91J22o4j81K01k30O5j74
6255b57M43j11q9J30k61K90n1l26J35P9L85m54M1j12J20K20l36o7K53r2K68k51
6277d3j01J12n1j24L29m8m2p8k8p6q3K37j89M44j47l5J17l71J38M4r3m3L30j03
$$ plain form
6115 178 120 -153 -84 -154 -109 193 -263 -223 -138 211 -146 30 275 2 102 -9 42 299 16 18 -129 -68 64
6138 64 57 122 -45 62 67 223 -13 -129 -124 -68 -71 72 -96 391 -238 18 146 -168 -31 -278 -33 109 -52 -130
6162 -130 131 212 -204 103 174 13 70 108 50 -27 -7 256 -50 79 50 -36 279 58 -17 248 -12 -57 116 -91
6186 -91 -77 135 255 51 127 87 50 -92 363 -39 -3 -184 172 79 89 -47 220 100 46 -154 61 -52 -257
6209 -257 -75 17 -295 -72 -205 -195 -30 -10 161 265 8 -12 -115 359 -44 25 -41 -73 -146 -139 -18 -360 -26
6232 -26 121 -37 -117 -44 -214 264 52 -92 -89 27 170 -10 -94 -16 -187 4 126 62 -119 82 -148 -83 -257
6255 -257 186 75 -14 116 -145 145 94 -232 -97 -18 367 -87 -46 -158 -38 182 -154 -221 32 -60 208 -43
6277 -43 -144 -32 -83 -207 122 74 32 -46 -74 -150 -233 4 -185 259 112 77 194 -177 -39 5 -88 -131 199 96
6301I6Q6j57j73J67J91K6m02K72j59K27O3j88j33M04l73p4L37k6k73Q9P9o8J83
6324A94j18k31J49j22N2km6K99k28l12M50j06J17q5P6l93R0J39j09K30j22j8J56
6347F0N3m47K85K81j36J26k19Q1k7Kk92L8K62q1L5J44r3j91Q2j2K41j83J03k79
6371a67K1J81k63J98j37jJ40k44L64J44j04k7K01j69j0k54j20K67r3O5j00J33
6393B5J01o6J72l16K09j16m3N7j52L7j02J60L10m94K8K21l1j6j96P0J69n7J82
6416A52j80J23k13k7kO2J29J47j17j55J12J2j01j48R0J71o3Q7K5k94l1L70p9o3
6440Gj9n4J28mNm94L44J91j58J2J90J35p7l29L57k30k02M7L68l21j23L87l48L57
6464A69j77J17m34J44K26k08K27p3J73k79K91l24N3K6j52J39K39j74j20r8K44
$$ plain form
6301 96 182 25 -148 19 210 236 -166 106 -53 174 237 49 -84 320 -53 -127 210 184 -89 0 79 11 194
6324 194 76 -155 -6 -128 -76 -78 -124 175 -53 -365 85 -21 96 11 87 -306 -216 -77 -186 44 -78 -96 60
6347 60 113 -334 -49 232 96 222 3 84 57 59 -233 -195 67 -14 21 165 72 -119 -37 -49 192 9 112 -167
6371 -167 -146 35 -228 -30 -167 -168 -28 -272 92 236 132 105 306 137 127 -127 -247 20 -73 -8 -108 25
6393 25 126 60 232 -84 125 9 -34 23 -129 -92 -194 -34 276 -218 -190 31 0 -16 -212 -142 27 -30 152
6416 152 -28 95 -118 -145 -147 -85 44 191 74 -81 31 43 -58 -206 -116 55 -8 79 104 -190 -221 149 70 7
6440 7 -12 -66 62 58 63 -431 -87 104 -54 -42 148 283 206 -123 234 4 -198 -151 217 -104 -227 160 -188 169
6464 169 -8 109 -325 -181 45 -163 64 -9 164 -115 176 -148 -95 -69 -221 -82 157 -17 -137 -235 9
6485Ik29J61K60J03m14K66K7j83J77m69J31J05lJ92j31K53j35j4j08l1J27jn0
6508D3j00l8p9j47M96j10r5j97J53K94m61j69M63n2J96k51J24k44J34j13L08p1
6530H4o8K89k82k7J88P1q1j47k20K00l42K94n2j28J70J28p7q6R4N9k42N12l04
6553C3j2K99n35K40K13l02O0j57KL0J67o1L8Nk0j32P7j1j67L33j93K54j63mJ5
6578IR6K0l0p4k96N02p5k54Q7j70M4K07J8p5K5j10n3K49j61P6j05L50l82L39j51
6603H6P3%l67R2K09j83P5J88J21k28o9j8K2lN6O2J02l21Q1jM0J25k56J75j21p5
6629a35J28nj01J1L10Jj89N5j60J14L2K01q7m3k61j66L9J61K7Kk0j5N9J87l10
6654a65L4Q1l32Q0L62K28l10J02q8m0K03k34O9K52j23p5J26j65k88L96k44K7R5
$$ plain form
6485 9 -220 -59 201 304 -110 156 183 0 177 -292 -161 -56 -59 133 2 255 120 106 -2 -33 94 93 43
6508 43 -57 -95 -174 -321 175 65 -30 -227 -74 220 -241 -410 53 1 197 -54 70 -174 -40 -153 155 84
6530 84 16 305 23 -4 184 255 174 27 -193 7 -335 -41 -93 -221 -51 77 0 -86 8 67 -175 337 33
6553 33 21 320 -215 25 238 -64 -4 -161 -159 -129 38 -23 15 20 0 -132 -55 -66 -233 100 -93 161 -2 -6 9
6578 9 105 125 95 21 -275 227 152 -102 -15 -185 -141 66 84 9 34 -76 -129 120 -41 35 -70 280 -102 237 86
6603 86 159 159 -208 -116 93 -90 -15 173 294 66 -3 -21 1 -2 54 116 218 -103 -22 -23 17 142 -114 61 -60 -135
6629 -135 -7 -12 -113 -102 208 209 20 75 -85 29 61 262 175 132 -129 -295 -256 -95 -68 -66 -86 -101 -42 145 -165
6654 -165 -131 -50 -382 -302 60 288 -22 80 -8 -48 155 -79 -10 242 119 44 170 5 -283 113 -131 -104 -9
6677iK75l19m8J29k37J71K82l40nJ56j44K24n8j08K13P0r2J1j16NK70k78k13q
6701a69L33k70K05Lk8L3l98J98K53n2J51l00J6L16k42k17k0J96k39K86m4j18J78
6724G1K19m49K49r1l47K48m5K91k50M59m64J66M1j81K63m18M7J5J25J71k67N2
6746i5J8j1K49J14n25K21j48L17j63J12J93l2o0jl62L97k39J73l9K9l25K11k5
6769Ik8J59k23J14J93k89J09k17J65M9l8J1K8j0o7Q2L1Mk49M15l30j02M61l31
6793e4J28J22j67j27K81j21K12l68J25j30K30j56q4O3M8n6R0l0j53K27k27J32
6815a5J2OJ8O3n4l71K09q5J02J78K07j62m1k30K45r7p4N0r3J79m5J62r2k60L48
6840A60j22j92K59j3L1M3Q1k29l85M18q4n9L8K88l38k8J16j38J03J87M8l23L10
$$ plain form
6677 -9 266 -53 -101 28 -209 -38 244 -96 -101 55 -89 135 77 -31 182 252 160 171 55 60 330 52 -161 -169
6701 -169 164 -106 99 102 74 107 -291 -93 160 108 259 -41 -25 291 49 -168 -188 8 -231 55 11 -107 71
6724 71 290 -159 90 -1 -348 -100 -145 146 -104 355 -109 57 98 -83 180 -238 -191 -176 -51 120 -147 -95
6746 -95 -77 -88 161 275 -250 -29 -177 140 -23 89 282 250 190 189 -173 224 -15 158 119 148 -177 34 9
6769 9 -19 140 -83 31 224 -65 44 -173 -8 41 3 14 42 32 -35 47 78 82 -167 248 -82 -184 277 -54
6793 -54 74 196 29 -98 183 62 274 -94 31 -99 131 -25 -109 -46 2 -54 36 6 -147 80 -147 -15
6815 -15 -3 3 21 84 30 -341 -132 -217 -115 63 270 108 67 -163 82 -15 -89 -39 -132 47 2 164 72 -188 160
6840 160 38 -154 105 92 123 166 247 18 -367 51 -33 -92 -54 234 -104 -132 -16 -154 -51 136 184 -139 171
6863A71q2j81k27N69m21P5k19L36J34M2q1j28K26q9J16l8J00l37K49k70j1r5L52
6886A91k32k8l5p1J4J08K6K2M3K52l06l0K16k58m1K06j17r0MM7J27k93J57r5K17
6911C4K33l36K47j11L0o6KJ71m5L1j96k04K42j55K26l81L03j91M51m85J82K78
6933B60l37K43k27J81l30K21K54o1l96N2J98m4J19j19P8p2p2j14L73Q9k54O7j97
6956h8k8k7o5K44K1J9p5J24n23L62N3j29K41l46Q3n2Q7J50n9J76m5k87j36K24
6980g6K11l08K91k21%M2O5J5k76L64m5k39M67j0l2L5l90K36j81n0J05r8j03R0
7004a08K5K78j26o5k53K22K38j44N0j80K38j53k02J20j72J03J24j21O9K14l27
7025a70J65j82m6L20K1p6k83O40l75J24l46J36K60j92k1O5m6p9K26j52j37K2J79
$$ plain form
6863 171 89 -92 -319 250 -171 -96 -315 21 155 197 116 -12 214 125 241 203 303 -34 215 -55 -66 -161 191
6886 191 -41 -69 -104 -175 -161 -53 -27 -5 38 290 -16 -46 170 -88 -129 77 -40 -130 -126 -79 48 -245 -88 -183 34
6911 34 267 -69 178 67 97 31 33 204 159 190 -6 -210 32 -123 103 -278 25 -166 285 -200 -18 260
6933 260 -77 166 -61 120 -210 11 265 204 -192 -140 58 14 133 14 92 20 -52 -166 207 296 42 109 -88
6956 -88 -116 -143 -208 36 57 76 1 125 -398 -36 17 -112 129 -217 -134 -186 -99 51 -8 168 123 -164 -300 -76
6980 -76 135 -173 118 -103 -103 -61 4 19 -257 107 62 -177 290 280 248 283 -107 129 -52 -102 3 -95 -198 -108
7004 -108 -83 195 69 4 -249 -27 211 67 117 -63 175 22 -180 -60 -232 -129 -5 -126 -57 157 -170
7025 -170 -5 -187 -233 87 108 32 -251 389 14 138 -208 -72 188 -4 -25 40 -6 -85 141 -11 -148 -126 53
7048E3R9j35q2J13j00Nj71M64k47L63m16N6k7j52K07L0nK02J50m44J16j71L76
7071B84j93n9L9M7j68J61l28k63K23L83l13J39k4J06K6j68J66j02k25K78L3P1
7093A13o4j61L7P4K81n70K59L5m9Q1j7J85j66J88k23k46K29j19J98J92n72K80
7115c5J05j13l8O8J19m03M66l05J62p1J0J93j59j40M2J41N8n8j99L27j89K7J91
7138A99j42R5j87j9J57j25Nk84K01J41R2n1r5R8nk8q7QK70m39K63k43K60J00m84
7163c00R6L73j01k03P8n2K16j55J49k74J76K31k62L3k06J02L55r5k83K04j21J54
7185A15j83m12L80J03J35l5j18J5J5nJ00j77K30k08l07L75o2o4L40k35n2J78o5
7208F3N9n47O25l61M65m78L85J03n19L60k04J77k85L32q4J13k44o0J06k25K75
$$ plain form
7048 53 152 17 -65 48 -52 -47 -218 246 -1 362 -54 2 -25 -177 30 60 55 257 407 -37 79 -92 284
7071 284 91 32 71 118 -50 111 -217 -480 -257 126 -187 -48 -72 34 60 -108 58 -44 -269 9 42 113
7093 113 49 -112 -75 -1 280 -290 -31 4 -45 36 19 204 38 226 3 -243 -14 -133 65 257 -315 -35
7115 -35 70 -43 -81 -13 106 -297 169 -136 26 -45 -35 158 -1 -141 -99 42 100 42 -157 170 -19 8 199
7138 199 57 152 -35 -54 103 -22 -17 -301 -100 41 133 82 -13 85 80 52 -35 -27 243 -196 67 -176 84 184 -300
7163 -300 -204 169 68 -135 -57 -109 107 -48 101 -173 3 234 -28 5 -201 -99 256 161 -122 82 -39 115
7185 115 -68 -480 -100 3 138 103 -15 0 15 10 110 -67 163 -45 -352 23 -39 -103 237 2 -50 128 63
7208 63 122 -425 200 -161 304 -174 211 314 -205 155 -49 128 -157 175 91 204 -40 -100 6 -219 56
7229E6J33n0o5r1Q2j47j32L97l46L68l34J51J12k03qj79Q8n9K62n8J19j7j39J04
7253D4%p4L14j60j92M58l73O7q0l05M49j28L5j51p2p7K11J90j47K12k99R8k44
7276b24J53L52k94J31o9J35j86pO4J53k48n0J5J74k38J54j01L8O7j25N8J39k51
7299a60P8j40J69J26Kj76K07o9mj73K63j77J70k34J52m71L37J80k70L52j36k08
7321a82K87J05j83j58m6K60p4J63j00j42J65j21K27m01j6Q9K64m1k03MJ03m7J39
7344I2lj53J48k53LK15nj00J08m89M12o3K67n0j88K98l51j62L26j04j02J04j08
7367a58M6L49k66Q3l1o0J11n4j72J18J11n4l26M02k33J32m8J85m4Qj24J23K08
7390C06p17M03O6k87J87J44j12L9j12J22K3r6Q3l34L44P2j01J59l02J79N3K04
$$ plain form
7229 56 189 139 74 -17 65 -82 -214 183 -163 205 -129 22 134 -69 -77 -256 -168 -227 35 -23 96 79 -60 44
7253 44 44 -30 284 124 -68 390 17 84 4 -301 148 20 55 -96 -168 -245 -34 156 9 221 -78 20 -224
7276 -224 -71 281 -13 118 49 184 -2 -9 55 208 -40 -90 -75 99 -139 15 -86 -48 19 -106 -48 91 -160
7299 -160 -82 -222 -53 73 75 -101 106 37 33 -140 123 -54 116 -118 34 -437 -100 80 -190 162 26 -182
7321 -182 105 210 27 -131 -177 83 9 172 72 -70 95 -26 201 -200 -216 -127 137 96 -107 -103 0 -47 92
7344 92 89 -64 84 -169 -166 49 44 -56 52 -437 -25 -88 179 129 -59 239 -112 -274 52 -52 -154 -50 -158
7367 -158 -112 237 -29 54 23 -37 74 20 -152 -34 77 23 -303 99 -134 -2 -50 135 91 99 -25 98 306
7390 306 -411 -8 58 -229 -42 102 -10 29 -83 39 62 -34 49 -285 59 131 30 189 -113 66 119 323
7412C23l54q1R7L02L4j86n27L37K0K46R4m97K03L08m23K4R9o6O7J63j95J15j20
7435a7k0%Q2K17n12K29j40J55m9K1K0J24L3j51Q5k03j00j0L72l88L99k49L83l49
7459f8K90k09o8J4P8J24j99J81j01L42m27n2R6j58M2K0J1K78l13J97O6l6K65l64
7483IK1j77J30K35j38o4j83R6j49K81p0n2N7L6k19r4K94Lk01R5J68l23K03J33
7507I1p3N4k58J49m01L78j32L33m15P0L04L4k17k8J56O8j36j20K15j87J61q8K76
7530B34j86J93l23K03j81ml7J78l48K92p1PQ9n0J09j87M01j78k74j35J42J98k17
7553a45L62k1k96J17J54J21m74K25J43o5j28L2J84lm74J04O1L23k20J70J9j88
7575Ak72J12K9lK82J80l75J93j78j5k93L65l03L66k3k49L8L3J46L4j71K62k40
$$ plain form
7412 323 -31 -112 -15 287 321 135 -392 -55 -35 211 305 -192 11 319 -104 -80 19 -47 20 183 -12 103 -17
7435 -17 -37 -37 45 262 -250 -21 -161 -6 -55 -34 -14 110 143 -8 77 -126 -226 -236 136 -252 147 -102 281 -68
7459 -68 222 13 -55 -41 37 161 -38 143 42 384 -43 -95 1 -157 -115 -95 -84 194 -119 78 144 108 373 9
7483 9 30 -147 -17 218 80 16 -167 -71 -220 61 -9 -61 -4 32 -187 -281 13 16 -185 -90 78 -245 -42 91
7507 91 18 72 -186 -37 -438 -60 -192 141 -274 -204 100 134 -83 -111 45 113 -23 -143 72 -115 46 -42 234
7530 234 48 241 -82 121 -60 -64 -101 77 -271 21 -50 -43 46 -4 105 -82 319 141 -133 -268 -126 72 -145
7553 -145 217 196 -100 17 171 292 -182 43 186 121 -7 25 209 206 -268 -164 -103 220 0 170 189 1
7575 1 -271 -159 -130 -133 149 329 -46 147 -31 -46 -339 26 -277 89 66 -183 -145 -112 34 68 -103 159 -81
7598h1r9J23n9L0L81k21j39j16o4L50l32N18l06K56m19J4L41k11k65K74r6L07
7620A86j15lj08P0j12J89p5N9L7l50K30l38M31k12K66l17L01j83R6k34K06Mqj70
7644a50l8L27Qm89J45j96L11J03j68P7j68J74J98l5n0L8P9j31j24J2k9l73L81
7667i8J27J33o2o2j56K38j16M5J99l24j29N4J12j01l8K59n9R4L4l23K36k80J93
7690b4m3J49l9k67K26K19j60l69M86j47J27k28J54K2l5nJ00j91p4Q0P4l5J05k64
7714a39K53q4J87jm52o4k8M70j68J20j03k8j12JL75k15p7L29j50k23J42l52L94
7737G5j92O3J37J34j61P1k35k28l8L47R4l7J83O7j58p1m1P4M1m2j25M55l43k49
7761a79M80m57j02J15J11J15j31k56O43m21K25l85L16k30M8L32j85j53J48J67
$$ plain form
7598 -81 -180 -57 -116 -86 295 74 -65 -181 -245 105 -227 291 -15 241 -178 -164 177 -34 -299 -25 -121 186
7620 186 71 68 -40 30 -82 107 32 91 128 -222 8 -330 101 -111 155 -162 139 -44 52 -182 24 28 20 -150
7644 -150 -188 139 147 -342 -197 -393 -82 21 -147 -70 -238 -64 134 99 49 87 166 35 -89 -77 -106 -479 -98
7667 -98 29 162 100 38 -118 120 4 49 248 -76 -205 -151 -39 -140 -178 81 22 116 150 -173 63 -217 -24
7690 -24 -67 82 43 -224 2 221 61 -308 178 31 158 -70 84 106 71 66 166 -25 -99 -19 55 20 125 -139
7714 -139 114 30 217 216 -236 -300 -328 142 -26 94 -9 -37 -149 -148 227 12 -65 264 114 -109 33 -319 75
7737 75 -117 -54 83 217 56 127 -108 -336 -374 -27 67 30 213 280 122 51 10 84 125 83 -42 413 70 -179
7761 -179 301 -156 -258 -143 -32 83 -48 -304 339 -82 143 -242 74 -156 -108 224 39 -114 34 201
7781B01o8l00M91j63N9l4j72J55L1Q9k94l88L62J83l05N8N08m73J73N2j76j48
7803a59L32l58K94j41Q5j45PJ31Rk48pK45K04j2k65j35M22k04j30k20L76O7j25
7826B3r6K15j89j3J05k14L16j96q4K79m24O30k79j79P0K89k73K02l09L0J67Q4
7848A54j17J44l36P3j11M51j57l30M13j70J67k93J37R9P9j54J21j17nj20M38l51
7870A5K16m75J52K31n4q8Q0l0n6k57L55N4k02L40l71K08j88K83l64M50n97N03
7892B05j58J81k64P2m0K64k81L9k36K78k0J89j23p0l8Q3J47l11K11j48K28k04
7914Dj48L57j66k50L10N6k38K27j12k11n5J6J24O9l2l6j94L3K07K40j13j18p4
7937a04J64J55m82L39l80M82j39j95M5N8K07nn29M39J09j47o4J24K2j56K11K4
$$ plain form
7781 201 133 -167 324 161 220 186 14 169 200 289 -5 -393 -31 152 -153 -95 413 -60 113 165 -11 -159
7803 -159 173 -185 109 -32 53 -92 -85 46 55 -193 -200 45 249 237 -28 -163 259 55 -75 -295 81 148 23
7826 23 -73 142 -47 -60 45 -169 147 -49 -133 146 -278 352 73 -106 -36 253 -20 182 -127 -97 70 154
7848 154 37 181 -155 -82 -193 258 101 -229 184 14 181 -112 25 124 203 49 170 53 48 -72 366 15
7870 15 231 -244 -92 139 85 -3 77 47 -9 -266 89 143 -59 281 -90 118 -70 213 -151 299 -298 205
7892 205 47 228 -36 36 -4 260 -21 18 -218 60 40 229 106 36 -2 81 228 -83 128 -20 208 4
7914 4 -144 213 47 -203 107 163 -75 152 40 -171 -226 -210 -86 -17 -49 -85 -279 -246 -39 201 88 -30 -104
7937 -104 60 215 -267 72 -308 174 35 -160 -115 -57 150 145 -384 55 164 17 -47 77 99 -57 154 178
7959A78l4l96M8RJ79r7J33o2n6P3o1J05j89K4K63l5j07M3M5J17J12j34J16j42
7983A32j59j31K33q4Nm8L1j88L68j56p1J54j26K56Q9l03j05K17j47MR8J93m55
8006a93M3L43k36k36N18k47m6m2Q0J14l65M78j72J17o4j3j21J05J42k6l0m2l1
8029G6j57J75m82M10p1j0j06j0J84M9j75K09J66m88K15j66L40J13o6l25j69K93
8051Eq6o3j4K32J71l04K10p8j11k72N18k10J44N0l21L1P8l3J04J88m34P9K62l27
8075a81K58k8K39k60J47j07j74J34J56k70J96om61K42L25l01K88k71K02k94K87
8096A21j22J68M7m27r4J57N54k26K0K6q6k84o5n0J55O4j90J58K22j1k49j28K60
8119B0m9M1q5O2N6k4l0J32l20J66k18L22n8p0j56J22J76m56M27r5O4J34j40p2
$$ plain form
7959 178 144 -252 -204 -195 -16 -113 20 -42 -98 -25 -86 19 -170 -146 117 82 -25 18 63 180 292 158 274 132
7983 132 -27 -158 75 -9 -4 -52 -21 -209 159 3 -68 86 -40 216 305 2 -103 114 -33 -29 69 262 -193
8006 -193 -150 193 -43 -279 239 -8 -54 -96 -16 98 -267 211 39 156 92 79 -42 63 205 179 149 107 76
8029 76 -81 94 -388 22 -49 -59 -165 -175 9 58 -117 92 258 -230 -15 -181 159 272 206 -119 -288 5
8051 5 -81 -144 -158 74 245 -59 151 73 -38 -310 208 -2 142 192 -129 -98 -20 -53 51 239 -195 -116 146 -181
8075 -181 77 49 288 28 175 68 -106 28 184 -86 110 104 -357 -115 210 -91 197 -74 128 -166 121
8096 121 -1 167 214 -213 -307 -150 404 178 198 224 138 -146 -211 -261 -106 -42 -232 -74 148 137 -112 -240 20
8119 20 -29 12 -73 -11 45 21 -9 123 -197 -31 -249 73 15 -55 -211 -89 87 -369 58 -37 27 161 21 -51
8143e1j88J22m0J14j4Q2n2j95J52M3P0j9R2k65J98K9j59j58J81K10q7K3j18%r2
8168a22O2j46M10N0l40J07j34k2JK78k24N1l9n1J69J08k18J5J24j86m9L21l83
$$ plain form
8143 -51 -239 -117 -157 -43 -57 25 -27 -222 -70 -27 43 24 116 -149 49 78 -81 -239 -58 152 65 88 -30 -30 -122
8168 -122 -60 -206 204 254 -86 21 -113 -135 -134 144 -80 -29 -68 -119 50 158 -60 -45 79 -107 -156 165 -218
8191b18
$$ Imaginary data points
##PAGE= N=2
##DATA TABLE= (X++(I..I)), XYDATA
0@%%%%%%%%%%%%Qj6J6j6K4l2L2m0M9n7P2q8J04j20J36j59J84k09K41k75L13l57
34a90M04m54N11n74O42p17P99q90R88j095J213j340J478j629J796j980K183k406
52a261K652k924L229l572L957m400M912n510O224p091Q168r550J1398j4011J8025
67A0246k5050M0938j48142m389J33520j15380N2132P9495j4757o712Q0077j6207
79F5771k2223K9718j1383n8408L8316K1232n3666j909L0348o5783l2830L2277
91b8540j6820k8465L0996K125j4540K7410L3264J5811L2333N756l3383J0230M7232
104H3409k6153n5345J403q105l7086J419K936j4284J6986J1176j4026K1108L5468
117A8906j924l356J9467k770k4364Q300J9310j0785m062L622k4548j2158J4426
$$ plain form
0 0 0 0 0 0 0 0 0 0 0 0 0 0 8 -8 8 -8 16 -16 16 -24 25 -32 40 -48 56 -64 72 -87 97 -112 129 -146 167 -190
34 -190 214 -240 271 -303 339 -378 421 -469 519 -576 637 -703 775 -854 942 -1038 1145 -1261
52 -1261 1391 -1533 1696 -1876 2081 -2319 2593 -2917 3307 -3784 4384 -5166 6232 -7779 10246
67 10246 -14804 26134 -122008 -126397 7123 -108257 -56125 23370 8613 1901 81978 65771
79 65771 43548 73266 61883 3475 41791 63023 9357 7448 37796 -27987 -60817 -28540
91 -28540 -45360 -73825 -42829 -40704 -55244 -27834 5430 21241 53574 59330 25947 36177 83409
104 83409 57256 1911 3314 -4791 -41877 -40458 -37522 -51806 -34820 -23644 -37670 -16562 18906
117 18906 16982 13626 33093 30323 5959 14259 33569 22784 18722 22344 -2204 -14362 64
130F4q331j6515l337j4694p144J9949K1355O075N450J7598J1662k215N472Q061
144D3450j0788j6020j4146j2436n024m945p85N500q391o972J0127Q126Q639J2024
158H359l920o640N577P428O408N015p6n956q746n72J85n533o29p563j7947J316
174b3294O929m364R555J3156k302J929J0270L877K635M512l639j7363j1703N437
188d365k016p432L510k632n556R472N515K389R884j348p378L539M349K252L619
203A3802O08l831n077N68j87p642m31r93j6822o252Q181kM730J0607j447M24J1515
220G751R742K294m72R92n546j1512j453J483o735j865l713q097M042O281j196
235h004L701K376j842o14J015O612O515k92o47j784o23N801j66n693k843q189
$$ plain form
130 64 -8267 -24782 -28119 -42813 -49957 -30008 -8653 -2578 2872 20470 32132 29917 35389 43450
144 43450 32662 16642 2496 -9940 -14964 -19909 -20694 -15194 -23585 -30557 -20430 -12304 -3665 8359
158 8359 4439 -2201 3376 10804 17212 22227 22151 16195 7449 6877 7062 1529 900 -6663 -24610 -23294
174 -23294 -16365 -20729 -11174 1982 -320 1609 11879 15756 18391 22903 19264 1901 -9802 -4365
188 -4365 -6381 -13813 -10303 -12935 -18491 -9019 -3504 -1115 8769 7421 43 3582 7931 10183 13802
203 13802 14410 10579 5502 6070 5883 -1759 -2190 -3183 -20005 -26257 -18076 -18078 -13348 -2741 -4188 -3764 7751
220 7751 17493 19787 19315 20307 14761 3249 1796 3279 -3456 -5321 -9034 -17131 -13089 -6808 -8004
235 -8004 -4303 -1927 -3769 -4383 -3368 3244 9759 9467 8820 7036 6413 12214 12048 6355 3512 -4677
251d677p985o9q32J239K879k027K718O266N682Q264L055k753r29l340k454J9l134
268A922q46k489p789l72M694J492J370k499l918J965J209J872M818L49K272J388
284E438j533N931N434l117l484n089n061j840l678j691j8l762K94K621K250P886
300E81N758j549n40L08N16L167j010k597j358m119J21J305m50K826j899p476q67
317g283J493K58J877j146o55K368R76L521N392J819J858l106m892J552K74l011
333A295j622m751l037N99P57K865L075r38J150j008j051N813K225k253j110k105
349i6P71L271m61L91M7l871j389j418o49L439j807n196P69J157K278L859J100
366B195K063k91k684K158J663l20M95m712m521R50M58Q68J304k081q55J69o66
$$ plain form
251 -4677 -12662 -12731 -13563 -12324 -9445 -11472 -8754 -2488 3194 11458 14513 11760 10831 7491 5037 5056 1922
268 1922 1076 -1413 -9202 -9574 -4880 -3388 -2018 -4517 -8435 -6470 -5261 -3389 1429 1778 4050 5438
284 5438 3905 9836 15270 12153 8669 3580 -1481 -3321 -6999 -8690 -8708 -12470 -12176 -9555 -7305 581
300 581 6339 4790 4250 4558 5074 8241 7231 4634 3276 -843 -722 583 133 2959 1060 -6416 -7283
317 -7283 -5790 -5532 -3655 -4801 -5456 -3088 -2112 1409 6801 8620 10478 7372 2480 4032 4306 1295
333 1295 -327 -5078 -8115 -7516 -6759 -3894 -819 -1757 -607 -1615 -2666 3147 5372 3119 2009 -96
349 -96 675 3946 3485 3876 3923 52 -1337 -2755 -3404 35 -1772 -6968 -6199 -5042 -2764 1095 2195
366 2195 4258 3967 1283 3441 5104 4784 5279 567 -3954 -3004 -2546 -1678 -374 -2455 -3310 -3141 -3807
383c807L140K195m55J295k560j708M589K158m73p85k761m11J72j763J179J79l296
400c112j759j336J669M905m1n02Q66p09J787J742J22J795j949l938m05J16R03
417A54J914k559k428n76n34K328J583j176R64r13j576L036K238R69J599l247k373
434e97K141M69n26j083j200o42k802k89L809Q77j79O62k753P43M382j21p53m7
452B091j681r52m54J218J841j421k265j50j278J585K848j988K8n43j496K157J767
469A307M94J846q17k163m27J006J244m91l288j341q91n42K732j98q7K271j915
486a260o61L963J223q52j49j436k92M9J25P57j132p30K32k763O04L450j820n33
504a225K54k242J312K689N30K81k46o18O49l81R96J563k952j887p24r05J779M3
$$ plain form
383 -3807 -667 1528 1073 2368 -192 -1900 2689 4847 4374 3589 828 417 589 -1174 5 184 -3112
400 -3112 -4871 -6207 -4538 367 326 -176 690 -19 1768 3510 3632 5427 3478 -460 -865 -749 154
417 154 2068 -491 -2919 -3495 -4029 -1701 -118 -1294 -330 -1243 -2819 217 2455 3424 5023 1776 -597
434 -597 1544 2013 1487 404 -796 -1438 -4240 -4529 -720 157 -22 640 -2113 -1370 3012 2891 2138 2091
452 2091 410 -542 -996 222 2063 642 -1623 -1773 -3051 -1466 1382 -606 -578 -1121 -2617 -460 1307
469 1307 1801 3647 2830 667 240 1246 2490 1999 -1289 -2630 -3521 -4063 -1331 -1529 -1616 655 -1260
486 -1260 -1921 2042 3265 2413 2264 828 536 585 710 1467 335 -395 -163 -2926 -2322 1128 -692 -1225
504 -1225 -971 -3213 -1901 788 1318 1599 1353 735 1384 1003 1999 3562 610 -1277 -2001 -2906 -1127 -1084
522a084j702J284N38n16J888O94J069J530k303j543J166M0M10p49j485l57r75
539b095J24J916p10k15J91k141R25K640l69P86k42r38J611P89j97N32r27n09j450
558b79k118J090J336j663l90j037m55K719Q51J0J885j013m47Q92K91J030J30k556
576B76j088O22m83N65r12n46N05j012N64J415j217J584R96k762P57K720n78L90
594A796K67j308j44j63M80n75j247Q92j997j762K496J546j843R49L78n66K006
611A205L22J7N90m30o53p53q01J573q47j227L59j233k99K098n65m9Q69j112k07
630a143J586l32J557j27j406L68M15P49J26j706MK34j991M48J045o84O55p04j620
649b526J924J249k95K51j57J22K61r48J314M23j517m1l98o42J601l52n25n5r76
$$ plain form
522 -1084 -2786 -1502 -964 -1480 408 1102 2171 3701 1398 -145 1021 1061 1471 722 -763 -1120 -2095
539 -2095 -1971 -55 -765 -980 -789 -2930 -2005 635 266 1052 810 -128 1483 2272 2075 2607 1680 1171 -279
558 -279 -2397 -1307 29 -1634 -2024 -3061 -3516 -797 54 64 1949 936 489 1381 1672 2702 2832 276
576 276 -812 -190 -673 -108 -1020 -1566 -1061 -2073 -1509 -94 -1311 273 1269 -1493 -736 1984 1406 1796
594 1796 2063 755 611 448 928 353 -894 -2 -1999 -3761 -1265 281 -1562 -613 -235 -801 1205
611 1205 1527 1544 2134 1704 1051 298 -503 1070 223 -1004 -645 -1878 -2177 -79 -644 -693 176 -936 -1143
630 -1143 443 111 1668 1541 135 503 918 1667 1793 87 91 325 -1666 -1218 -173 -857 -202 -906 -2526
649 -2526 -602 647 352 603 446 568 829 -119 1195 1618 101 60 -338 -980 621 269 -256 -311 -1287
668a287J83J412p59J069j24r30J7P6M22J730q61j472J20k89J017K86l55pk33j270
688a255P01P14K10Q97k114k90J147k4M12M27j026K40k22m99J033K62l11K14j248
707g32O1J209k99M59P0j328L60L87p21Q97L40q96m47p66N14J529p27j02k80l6
727e08J129o1j46J095n43j707L44L17M01R34j541o77J80m37J024L49l63M93q91
746f08q25J500K19M30O53j417n9R86MM59l12q35O7q49p72J293l91k69l17j136
766b179J131J349l28N68J18q0K19n26J59J249o76j476L61n99P21P18j248J90m70
785g99o84R71m09K94R80p51n18P21L48J185M59j006K95k03p53Q00q03m36J75j724
805a858m93J589K55L65l06o19J031K38k30J270k84k16p7j099O78J339j091Ll05
$$ plain form
668 -1287 -1104 308 -451 618 494 -436 -419 -343 79 1809 948 -524 -404 -693 324 610 255 248 15 -1255
688 -1255 -554 160 370 1267 -847 -1137 10 -14 398 825 -201 39 -183 -682 351 613 302 516 -732
707 -732 -671 538 239 698 768 -560 -200 187 -534 363 703 -193 -640 -1406 -892 637 -90 -192 -472 -508
727 -508 621 560 414 1509 966 -741 -397 -80 321 1255 -286 -963 -783 -1220 -196 153 -210 283 -608
746 -608 -1433 67 286 716 1369 -48 -107 879 883 1342 1030 195 262 -587 -1359 -66 -457 -726 -1043 -2179
766 -2179 -1048 301 -27 541 659 579 798 272 431 1680 1004 -472 -111 -710 11 729 -519 -329 -799
785 -799 -1483 -512 -921 -627 353 -398 -916 -195 153 1338 1797 791 1086 883 130 930 127 -309 -134 -1858
805 -1858 -2351 -762 -507 -142 -448 -1067 -36 202 -28 1242 958 742 665 -434 244 1583 492 495 190
824A90q93O34j80j47K80q52o30N87j28Q91J201m46n6O3j24J390o81m35O8r83n96
845h47L35l39O57M67j725N85K97L76R10l89n55O67n09j45O94j02N33m85j106Q45
865A64N66o64K71n27p50L98m87K14Q74l6j60L53o91Q35R29o21Mq02m73M94R1n58
887e76N85m16jL19m55J194Jj024L19J6L0K50m98J69M60r29j76R57k01L04k45r99
909i16J074l9j32O47l38m18N47n31M00N22p83M54o61j009O92L28o10K47j33M28
929b31L40n98P20P56k77j07K1n24P84m6j258N47p32L11j73n14N33J36p30N67p8
950e53J37J343l31p06J167p2L81J20p55j96Kj389M42j16m69N49o53n29R42K17
970d69J19O32k99R77j27n88J062R8o48L51p06k39L85p51p75N0n53j72J65K81N25
$$ plain form
824 190 -703 -69 -249 -396 -116 -968 -1598 -1011 -1139 -248 953 507 451 514 390 1780 1099 664 732 -251 -847
845 -847 -512 -851 -194 273 -1452 -867 -570 -194 716 327 -228 439 -70 -215 479 377 910 425 -681 164
865 164 730 66 337 -190 -940 -542 -1029 -815 59 23 -137 216 -475 360 1289 668 672 -130 -603 -109 -18 -576
887 -576 9 -407 -408 -89 -544 650 651 -373 -54 -38 -8 242 -256 -87 373 -556 -732 225 24 328 83 -916
909 -916 158 119 -13 634 296 -122 425 -106 294 816 33 487 -174 -1183 -491 -163 -773 -526 -659 -231
929 -231 109 -489 231 987 710 603 624 100 884 838 -420 127 -605 -294 -467 -981 -448 -312 -1042 -475 -553
950 -553 -416 927 596 -110 1057 985 1366 1486 731 535 537 -852 -410 -526 -995 -446 -1099 -1628 -686 -469
970 -469 -350 282 -17 960 833 245 1307 1405 757 1108 402 163 548 -203 -978 -928 -1481 -1653 -1488 -1207 -682
991f82M72n78R70J11P68J082q48j46J24q20J90p1j490O84q75q00R33l19N55M92
1011b48o00K63R41K7M18o8p8M02k22n89J115l02p47l5j173L09J48o45J29k03j83
1032a341P91J08N43J056l21RN47n75j11O84r44m43l10j04k0k09k68N80k08l81
1052i17P40k77Q14N33r46J48J02o5Q55l09l0Nm50p24Q00o16q5j98p07N20J66k55
1074h96Q56M54m0N47p29K56Q00r12Q3k54j025N66M2n35P46j28j82M43m42N99O66
1095I15n58m87N19n10P97j89q48O47k14k82N3R9M25k1j195P4N06j29N76L19m06
1116I1M49k81j31Q21n23k07m9q87M5L01l45L01J24m11O84J71R3N27k05K22j68
1137F22o56O97L39o74j08k49p38N26k97k45O88o61n1K93n7O75O29r53Q78j25j62
$$ plain form
991 -682 -210 -788 182 293 1061 2143 1295 1149 1273 453 643 572 -918 -234 -1109 -1909 -976 -1295 -740 -248
1011 -248 -848 -585 356 383 801 733 655 1057 835 246 1361 1059 312 277 -896 -587 -439 -1084 -955 -1158 -1341
1032 -1341 -550 -442 101 1157 836 845 1392 817 706 1390 446 3 -307 -411 -431 -640 -908 -328 -536 -917
1052 -917 -177 -454 360 893 -53 95 197 132 987 678 648 653 203 -521 279 -337 -422 -620 -1327 -807 -641 -896
1074 -896 -40 414 374 921 192 448 1248 336 419 165 -860 -294 -252 -787 -41 -169 -351 92 -350 249 915
1095 915 357 -130 389 -121 676 487 -361 286 72 -210 -157 -58 367 346 -849 -775 -269 -398 178 497 91
1116 91 540 259 128 949 426 219 170 -717 -672 -371 -716 -415 -291 -702 -18 153 246 773 568 790 622
1137 622 -34 663 1002 328 220 -29 -767 -241 -538 -783 -95 -756 -807 -514 -571 104 733 -220 658 533 371
1158C71N20J50n43J72r37k38O7n31O32j03p37o0O16N27M56l80J82N96o03K15P08
1179A080n14L59m20r37N99j7l58n80k80J16N01n16N00N18m13L80M08k17J018N4
1199A281n41K52p05n7J89p36K37Q9n40K89l75k54M63J45j49N19o7J7O34j24R8
1220F65K42p68K80r5j91J2k23p72M00k25q6L10j95J04N26k50M59M97k57R7k34
1241B96l14P53p11kK28p91L15M35p51K47K48k45J81m37n0P81k55j67M34k74K09
1262A30L28m50N42j4n46K11l07j13N8m51L02M20l42J95q0j83N25j55l32L22j77
1283a17l60J017q06J90J91jj10L48k82L16l83k89K77o3k71l6j20L08L32m65L29
1304EK61l37L01k69k12O49l60m40O66l66K7L31k51L31j52j21J2m19j48M72l54
$$ plain form
1158 371 891 1041 498 670 -267 -505 -438 -969 -337 -440 -1177 -1237 -621 -94 362 -18 164 760 157 372 1080
1179 1080 566 925 505 -432 167 150 -208 -788 -1068 -952 -451 -967 -467 51 -362 18 426 209 1227 1281
1199 1281 740 992 287 230 419 -317 -80 9 -531 -242 -617 -871 -408 -263 -412 107 40 57 691 567 665
1220 665 907 139 419 324 133 145 -78 -850 -450 -675 -761 -451 -646 -542 -16 -266 193 690 433 530 296
1241 296 -18 735 24 22 250 -541 -226 209 -542 -295 -47 -292 -111 -548 -598 183 -72 -239 195 -79 130
1262 130 458 8 550 536 -10 201 -106 -219 -161 -612 -310 110 -232 -37 -117 -300 225 70 -262 60 -117
1283 -117 -477 540 -266 -76 115 114 4 352 70 386 3 -286 -9 -72 -343 -379 -499 -191 141 -324 5
1304 5 266 -71 230 -39 -251 398 38 -402 264 -102 -75 256 5 336 184 63 75 -344 -492 -20 -374
1325c74j37N08k35L56J65m69N03J55k42K29l37p7L65n47l41M12j03j04K13k53
1345c13L28l3l02L63k70qQ09m76QK46j40j84m2j24M53k2m16M34l48n79M03J39
1367g4m15P00m73K04J78J45J98j68l89K51L57m24J48k33k1L79r03J57L95l0J87
1388A69m69l57Q26l62j22L10J69j30K34j76l65P46m46M2J2k01M03l89J51J11k29
1409g3j57K82l46K30K54l50j58L5K13K50j25m5N3J60k43M16l85L85r2n06K14l8
1431b6k69L08k15K4j1M5j04M04j05Q2K8o40O12j18L16nJ62n36N14l07nj89j15
1454a50N3M0m96J17l4L36p8r0K47N32m99K19L55l44K11N5n95P04k11p22J93L0
1476a27j63J74k28L4K15m71J70K4J39L53K77m27L26J71q7M06q07l0P5l02K10j26
$$ plain form
1325 -374 -511 -3 -238 118 283 -186 317 472 230 459 122 45 410 -137 -478 -66 -169 -273 -60 -313
1345 -313 15 -18 -320 43 -227 -235 574 98 106 352 212 28 -14 -138 315 293 -123 311 -37 -616 -213 -74
1367 -74 -489 211 -262 -58 120 265 463 295 -94 157 514 90 238 5 -16 363 -540 -383 12 -18 169
1388 169 -300 -657 169 -193 -315 -5 164 34 268 92 -273 473 27 69 81 -120 283 -106 45 156 -73
1409 -73 -230 52 -294 -64 190 -160 -318 -283 -70 180 55 10 63 223 -20 396 11 396 304 -202 12 -26
1431 -26 -295 13 -202 -178 -189 -144 -248 156 51 133 161 -479 133 15 331 326 488 -48 466 159 154 -35 -150
1454 -150 -97 -57 -553 -436 -470 -134 -212 -302 -55 477 -22 197 552 208 419 474 -121 583 372 -350 -157 -127
1476 -127 -290 -116 -344 -310 -95 -566 -396 -372 -233 120 397 -30 296 467 380 786 -21 -51 24 -278 -68 -194
1498a94j28P2m70j70Q68m6l00P06k32L04J18n61M00R6j73j58O5P1L2m24n3oLn25
1522g05K76J03j20J50J4J49M63j17M54k77K02n1m87J00p5l81M66k07n24K22J51
1543a94k67K50o0j9N67m47K65K00l7j78L21l54M62k86k90L07k80q0K35m89K52
1564a22Lj28K84J5m07N33Q5L0Nk01J01J91l63k0l98K1L35m8n90P92j41m4J23j38
1588h2K34L8j92o5K14j76K16l27L9O16m81j36N45m09QK27m16k09P34n82K11R3
1610A00m4J03j95k40M50l59j91K93J9k11J94k12K43K84m2j2n4J43J34k91k23K01
1632I0m08J74O8j10N3j87O0K16k41J62J94J52M1j87p2L74j86L3qj78q6J63n06
1655c89K83r4n3m5J04LP8L7j81L76L50n71L07J26l28O53n01j38J84l31J9j39n5
$$ plain form
1498 -194 -322 -250 -720 -890 -22 -68 -368 338 106 410 528 -33 367 463 290 132 197 268 300 -124 -177 -183 -180 -705
1522 -705 -429 -326 -446 -296 -282 -133 330 213 667 390 592 541 54 154 79 -302 164 -43 -567 -345 -194
1543 -194 -461 -211 -271 -290 277 -170 95 295 258 80 401 47 509 223 -67 240 -40 -120 115 -374 -122
1564 -122 -119 -247 37 52 -355 178 263 293 298 97 198 389 26 6 -392 -371 -36 -84 -674 118 -23 -67 56 -82
1588 -82 152 190 -2 -67 147 -29 187 -140 -101 515 34 -102 443 34 42 269 -147 -356 378 -204 7 100
1610 100 56 159 -36 -276 174 -185 -376 -83 -64 -275 -81 -293 -50 234 192 180 126 269 403 112 -111 90
1632 90 -318 -144 -76 -186 -133 -320 -260 -44 -285 -123 71 223 264 77 5 379 193 226 218 40 -46 117 -389
1655 -389 -106 -200 -253 -298 -194 -191 -113 -76 -257 119 469 -102 205 331 3 656 155 17 201 -130 -111 -250 -305
1678c05K29m26j12L59J45k38M97k99N47O8k47PK58k50j31Q2m39M24l63j34L97
1699F9n35J11O5j63M0K86q7L54j03k35O70k22J38j90k04K22M4m06qK77l41J44
1721g4m23J30J27n5J68j63K51K39M4l41O89j53m65J69j58OL38n70J03K95l87Q1
1743a49k22N7K80o8j75J00L22k10L44l80L8M26m17L10j29l5q6K13l84K48l02P6
1765a43M2j28J1K66K0q8L43k16Lj13k7K37k97K15L55l26k73K12k23K89J16n48
1787b73M62k33J08j78Lk12K03j63L08K3o2J04P6k30j69N66l86J97k1m72O18m09
1809a40oJ78o4k7k5K64k27J86n27L09K47k72L31l27K30J42j17K0l22M4K21r7m05
1832c84K94J47m34M79j19k97J76LK71j47j94L32p1j67J92J36m3n8K0q8K57l75
$$ plain form
1678 -305 -76 -502 -614 -255 -110 -348 149 -150 397 465 218 225 483 233 102 184 -255 169 -194 -328 69
1699 69 -466 -355 -290 -453 -413 -127 -214 140 37 -198 472 250 388 198 -6 216 260 -146 -154 123 -218 -74
1721 -74 -497 -367 -240 -295 -127 -290 -39 200 244 -97 592 439 -26 143 -15 -9 329 -241 -138 157 -230 -149
1743 -149 -371 -314 -34 -102 -277 -177 145 -65 279 -101 -63 363 -54 256 127 92 6 219 -165 83 -219 -143
1765 -143 -101 -229 -218 48 68 -20 323 107 110 -3 -30 207 -90 125 480 154 -119 93 -130 159 275 -273
1787 -273 189 -44 64 -114 -111 -323 -120 -283 25 48 -14 90 166 -64 -233 333 -53 144 123 -349 269 -140
1809 -140 -146 32 -32 -59 -84 180 -47 139 -388 -79 168 -104 227 -100 130 272 155 175 -147 -103 118 21 -384
1832 -384 -90 57 -377 102 -17 -314 -138 -135 136 -11 -205 127 56 -111 81 217 174 116 136 48 305 -70
1854g0J15K76o23L57n3j98J95l12M02Q7k66J11K4j57P8J46j07L67k03R6j03j63
1876aj15o0j50J84J11k51O0K71m49N52j85J33J14m4N0m05J26l5J70j51R0N9J04
1899A78j55l9J8L4r6l08L10l91N64l54K14k16K52k72L23j34J16L24k11j83J08
1920H2K9j26q2k25j74K67R7J24J30n19M92r9j02J26J66m4KO4k04K27j08Q4k31
1943b4p9Q5k14k75K94J87k46J70j45J80j65L92q8k50K81J2K13j92J1j39j00k21
1965c13J48j17Q3J06K44k58m3N0j17j23N04j43J23J11l84M54j79P6n1j22m4L5
1987D0k15n9L66n03K85J02m30L13J00J89j1L25j87N9l21Q2j69j88M42l27p3L05
2009A25l90K20J22l23K52L0j21n6P0j5K7K60k00M03r3m25l7m5J80K93l51K20k99
$$ plain form
1854 -70 45 321 -302 55 2 -196 -1 -313 89 176 -90 21 45 -112 -34 112 5 372 169 265 162 -1
1876 -1 -116 -176 -326 -142 -31 -282 -222 49 -400 152 -33 100 214 170 220 -185 -59 -94 76 -75 15 74 178
1899 178 23 -16 2 36 -60 -368 -58 -449 115 -239 -25 -241 11 -261 62 -72 44 368 157 -26 82
1920 82 111 -15 -97 -322 -496 -229 -132 -8 122 -397 95 -4 -106 20 186 142 144 208 4 231 123 207 -24
1943 -24 -103 -18 -232 -507 -213 -26 -272 -102 -247 -67 -232 160 72 -178 103 115 328 136 147 8 -92 -313
1965 -313 -165 -282 -199 -93 151 -107 -150 -100 -217 -340 164 21 144 255 -129 325 146 222 171 49 5 40
1987 40 -175 -234 132 -371 -86 16 -414 -101 -1 188 177 502 315 374 53 135 -34 -222 220 -107 -180 125
2009 125 -265 -45 77 -246 6 36 -85 -141 -71 -86 -59 201 1 404 311 -114 -151 -196 -16 277 -74 146 -153
2032a53M3J79j02n9R4j7n2L45l92J49J20k18m4K38k91J74j08J8Q4j4J15j13K33
2055B29k67R4k53L0K21k70J71J46k14n2M64p31N88k50l4J48lJ0k64M17j41K2k82
2078b21N62m57q9M98m15o3O5n0rQ5oL0M20o43L09j65L85K13l68j91K23lK39j80
2102A69J6l24NNK0J9J01J08m18O3J85K47m16M71l44L64l5lj19k23J73k3j33o7
2126a59R7k48j34M86l37L67k76j26K11J52J96k88N3J4kk9L30j78k42K4M1k23K32
2149c9j43LK92j91J96J36m75R4L65n5j08J85n38L47O9p1j22j29Q8m4l6J84j56
2172a48j68K71M7M7M2k37KP5J55K5o6N9R5j62j18J76k88K83J18k61j87K19m83
2195e04N97J8m94P19k98kj71K03k3J01j92l4M27m47K01l1k63R2l07K07R4J03j74
$$ plain form
2032 -153 -110 69 -33 -92 2 -15 -67 278 -114 35 155 -63 -107 131 -160 14 -94 -76 8 -6 109 -4 229
2055 229 -38 56 -197 -167 54 -216 -45 101 -113 -165 299 -432 156 -94 -128 20 17 27 -237 180 39 61 -221
2078 -221 341 -116 -205 293 -122 -185 -120 -170 -179 -94 -100 -70 350 -293 16 -149 236 449 81 -110 113 110 349 169
2102 169 185 -139 -134 -129 -109 -90 11 119 -299 -236 -51 196 -220 251 -93 271 236 233 114 -109 64 41 -92 -159
2126 -159 -62 -310 -444 42 -295 72 -204 -330 -119 33 229 -59 -6 8 6 -23 307 129 -113 -89 -48 -271 -39
2149 -39 -182 -179 113 -78 118 254 -221 -127 238 183 75 260 -278 69 138 67 -55 -184 -96 -140 -176 8 -148
2172 -148 -316 -45 2 49 91 -146 -144 -69 86 111 45 104 199 37 -81 95 -193 90 208 -53 -240 -21 -504
2195 -504 93 111 -383 336 38 36 -135 68 45 146 -46 -80 347 -100 101 70 -193 -101 -408 -201 -107 -4 -178
2218a78J09k3Q8P3k54J22J50K74p0k65L7m0l6k9K09j99j72J81m1k59J81J66L0
2241E4l06J45K7O2mK83j52K5M1n6k47J66J62j00r7j81K66m69n0N05k14J32K14
2264B06m49K51j9j97L99K13o36M42J0j57j99J60P5j87J44k78J36N6l02L41j98
2285a89p9J99OOJ42j21K31l49N82n5m27J25n5l1L24l69K03l7j67Rk6n8N0Q3j4
2310a7k9m0K06j57k44J67K42j58p0K2L46m59K01j4J54O8m94K98jn0J35j55L12
2333B63k7k61j29L19k22jJ28k93K56L3j73K74jj74P9k76M25K11l71j49q8K20j85
2356a42K2j20L62l01J54J60J38N2l5j44p3M3j12L20m48P3l7q8J73J5k43L39pk35
2380a34L13m3lJ84j68o2L3k85K20ql67O36l81J29p4K01l92j5J00L2J05R0m6j68
$$ plain form
2218 -178 -69 -92 -4 69 -185 -63 87 361 291 26 63 23 -13 -42 167 -32 -204 -23 -64 -323 -142 24 54
2241 54 -252 -107 -80 -18 -22 261 109 134 175 119 -128 38 200 100 3 -178 88 -381 -431 74 -140 -8 206
2264 206 -243 8 -11 -208 191 404 -232 210 220 63 -136 24 99 -88 56 -222 -86 -30 -332 9 -189
2285 -189 -268 -69 -63 -57 85 -36 195 -154 428 373 -54 71 16 -15 309 -60 143 106 -61 -52 -78 -136 -86 -3 -17
2310 -17 -46 -86 120 -37 -281 -114 128 -30 -100 -78 268 -191 10 -4 150 218 -276 22 21 -29 106 -49 263
2333 263 236 -25 -154 165 -57 -58 70 -223 33 66 -107 167 166 -8 71 -205 220 431 60 -89 -177 43 -142
2356 -142 -120 -240 122 -179 -25 135 273 325 290 146 73 116 4 324 -124 -51 -88 -176 -3 12 -231 108 101 -134
2380 -134 179 136 133 317 149 87 120 -165 55 47 -320 316 -65 64 -10 191 -201 -216 -116 -84 21 111 65 -103
2404a03r3K60m6m7K66m0k05q7j38M30Nl20J99k39M00l73j12J35J27J38m22K69
2426DJ64%j58n0J81K49j20k68J00l8j8N8k49K83o2j17k63J64L67k80J93m8o5J92
2450B19p9P0j69L90n37J72m1j16k13J10L30j58J3k55K08o7J11J50K79m65N21j98
2472B75K4j39n6N7J53l78J09N3N8o1l04K00l0L4P8j68K24l03M26l95m0M65j16
2495A66k68q8P3J2k95K36L07k82L60j73K06l87L3J71j37K30J83j33Ml28K50O1
2517B01k31J32Q7k23r0J22l1n9J39J06l44j00L67o2j46J28j43J4J98j9M4%l4J3
2541F9l24K92K0j14R4j51L37p6n0j34J20q0r2j25j50M58p3j89L92k18J24j7L6
2564A49kj34p8K54j35m0J28j76Q3m4j20l8K94l40J30J95K4l10M65l25L41l81L12
$$ plain form
2404 -103 -196 64 18 -29 237 197 -8 -95 -233 197 202 -118 81 -158 242 -131 -243 -108 19 157 -265 4
2426 4 168 168 10 -40 141 390 270 2 102 64 46 104 -145 138 76 -41 -304 -140 227 -53 140 92 27 219
2450 219 140 210 41 431 -106 66 25 -91 -304 -194 136 -22 -9 -264 -56 -123 -12 138 417 -48 473 275
2472 275 299 160 104 161 314 -64 45 98 156 95 -209 -9 -39 -5 73 -95 129 -174 252 -143 -183 282 166
2495 166 -102 -190 -117 -105 -400 -164 143 -139 221 48 254 -133 -100 71 -66 164 347 214 218 -110 140 201
2517 201 -30 102 189 -34 -124 -2 -33 -92 47 153 -191 -291 76 14 -132 -4 -147 -133 65 46 90 90 56 69
2541 69 -255 37 57 -57 37 -114 223 147 97 -37 83 3 -89 -214 -364 94 21 -168 224 6 130 113 149
2564 149 147 13 -65 189 54 14 142 -34 49 5 -115 -153 141 -199 -69 126 150 -160 305 -20 321 -60 252
2587B52j24l53J37J39M8k82K79j43L6k78K86qK6j67L40J26m42L27O5l49J14K22
2609B51ko7k43j20J96j18j7P2j08Rp3L44%nk09Q6J16k88K76j11J82J05m76L98
2633A98j71k4N2rj06k61K80r7K53l03L18k25L5J54ONl8r7J49j92J68j1j86J64
2657F2R4j01m51J15K85m5o2J32K8j18Q0j35P4r1M6J54j51L55l58J5L1j23J29j99
2681b34Q8o8M83m26J57l43M97j86J4K31k4k34K24j31k23L14N1k66L09l54J58N6
2703I3j31L77o31K00J18Lj44K65nj54K09j18l6p0J17l10M69l08O6K60m65L72Q
2726A85l57J83n1N8j21J26J01m8m53M26j51K01k0k58L02J3l92K66j06Lo3K36l50
2749b70J76J73j03K64l29o2K15k07M5K39j41j91J25l5K18o7K3K17n27M80k64j09
$$ plain form
2587 252 128 -225 -88 51 99 -183 96 -47 -11 -289 -3 -11 15 -152 188 314 -128 199 264 -85 29 251
2609 251 249 182 -61 -181 15 -103 -120 -48 -156 -147 -220 124 124 119 -90 -4 112 -176 100 -11 171 276 -200 198
2633 198 27 3 55 46 -60 -321 -41 -138 115 -188 130 -95 -60 94 100 105 67 -30 119 -73 95 84 -102 62
2657 62 156 55 -396 -281 4 -41 -103 29 57 -61 19 -116 -42 -133 -87 67 -84 271 -87 -72 -41 -164 -35 -234
2681 -234 -146 -214 269 -157 0 -343 154 -32 -18 213 189 -45 179 48 -175 139 190 -76 233 -121 37 93
2703 93 -38 339 -292 -92 26 29 -115 150 145 -9 200 82 46 -24 93 -217 252 -56 10 270 -195 177 185
2726 185 -172 11 -40 18 -103 23 124 76 -377 49 -102 99 79 -179 123 136 -256 10 -96 -93 -156 80 -270
2749 -270 -94 79 -24 240 -89 -151 64 -143 -98 141 0 -191 -66 -101 117 50 73 290 -237 243 -21 -130
2771a30R3L5k5J88r3m09L38J27M1q2k71K91k9J55l07K99k98M2K29k29LJ19k39
2794a52K90m80L05K10l62K97l68J4K94r4k67K69K7q6l9L60k68J76j73K51l34r1
2816b21%M21k61J30L4k95M70k06k28R0qJ68Oj56j1J23o0j3l4N9nk57j42M24r3
2841f5J80k03Q5j00K69n37L31j76K60j64K91j75J57pk64L6K20k07P8J18lm6k71
2864a93L93m32J42o5O4K61k49m77Q36k14j12J79N3k17j59K23J43n6Mn9n1J59j19
2887E4j76j1K99j03o1J35k17J89Ok61K35k84M23j78J05l52K17L16k23N0j48k16
2909b01o1J94j11M32l44L60M5l3p5m15L87m37M67n15L54K82k60k5Q3Q3r9j98J49
2932F2l1o9K76j57j44j26K67n6n8Q8k0k76M30N2k84K60j77n3qK3k38J63J34j03
$$ plain form
2771 -130 -37 -2 -27 161 68 -341 -3 124 165 83 -188 103 74 229 -78 221 -77 -35 194 -35 -32 87 -152
2794 -152 138 -342 -37 173 -189 108 -260 -246 48 -46 -313 -44 -17 -103 -142 218 -50 126 -47 204 -130 -221
2816 -221 -221 200 -61 69 103 -192 278 72 -156 -66 -74 94 100 -56 -67 56 -4 -17 -51 8 3 -254 -396 28 -65
2841 -65 115 -88 -3 -103 166 -371 -40 -216 44 -120 171 -4 153 146 -118 -82 138 -69 9 127 124 78 -193
2864 -193 200 -232 -90 -155 -91 170 -79 -556 280 66 -46 133 186 -31 -190 33 176 120 124 65 14 173 54
2887 54 -122 -133 166 63 2 137 -80 109 115 -146 89 -195 228 50 155 -197 20 336 113 163 15 -201
2909 -201 -262 -68 -179 253 -91 269 314 281 206 -209 178 -259 208 -307 47 329 69 44 127 210 111 -87 62
2932 62 31 -38 238 81 -63 -189 78 22 -36 52 32 -244 186 238 -46 214 37 -16 -24 -1 -239 -76 58 -45
2956d5N0r3J4J24O9k19K6Lj67L78k63J39j34P5j06L7L37k50k11MJ96k62K30K6
2980d2j85J74p2J28N8J57n9j57l9J6j04j16J24K24k07J5J41k71L7L98l41L36j88
3003B7K02k4k73j69J17K86o1k42L1L44r7Q5j4j2j56k19J65j02J69J72k2l66O7
3026i2j03O3J92o4k21N14m71k1K24K9m33M06J9l2j53L1L21l38K81k65m1J87j80
3049a47J22r2L13m46L66j0n9k3k64M97k32j34J76Pk52l6L86m7k44M7J60L60n56
3072a08J26O1j62J0N5j4J26J54k47n0O2k62L06q9J7R0L0j15j53R7K19j91J75q
3096A29k5l79M92j08m0k64L31o4j13J52j32j78L37l58L95j27K64j8j72j39Oq7
3118i8J01k13J34J07J61m1K4j87j13K27j88L78n71N93l07J08O3J88k27m22L56
$$ plain form
2956 -45 5 -88 -74 50 119 -100 -74 -71 -238 140 -123 16 -118 -43 -149 -112 225 -25 -236 -232 -36 -298 -68 -42
2980 -42 -227 -53 -125 3 61 218 159 2 -37 -21 -125 -241 -117 107 -100 -85 56 -215 -178 220 -121 215 27
3003 27 229 205 -68 -237 -120 166 105 -137 -106 238 141 226 212 200 44 -175 -10 -112 57 229 207 -159 -92
3026 -92 -195 -132 60 -4 -225 289 -182 -203 21 50 -383 23 42 10 -143 -112 209 -129 152 -113 -154 33 -147
3049 -147 -25 -117 196 -250 116 106 47 24 -240 257 25 -109 67 74 -178 -214 172 125 -119 -72 88 448 -108
3072 -108 18 79 -83 -73 -18 -32 94 248 1 -49 13 -249 57 -32 -15 75 105 -10 -163 -66 153 -38 137 129
3096 129 104 -275 217 109 69 -195 136 72 -41 111 -21 -199 138 -220 175 48 312 294 122 -17 -11 -98
3118 -98 3 -210 -76 31 192 151 175 -12 -125 102 -86 292 -279 314 7 115 178 366 139 -283 73
3139G3Q4k34K74j92J00j06l6O9k11K54N6J9l6L4k36K61j70lL2q8q1K90j9o7j51
3164h4k14K88K11k85J00J67j65o6R9k71K70K42l97K09k89J57J12J47m07K40k98
3185b34L14q9K5K2PQ2k35j27Q9M26m37R6K77j65j63J63k39K36J37r1L9j91J62
3208A04qj5K99k23k59N6J82m58M03K5k70R0L7j97K21q2j91L13j42Q0Q8j38J50
3231F5K87m29K03j44n2J13K4m9j24L7p2j86K56P7j3O4k9j94k9q8p6K67kJ62J9
3256H7K8k76M3J88k70J77k17L53k4N2j93o0n0l3K28m26M85m73L58J56l5r5J16
3279A19K43l50k00M34j64k17J72j26q6r7L07j01J71n4rl43N51j54n8J32j68p1
3301f9K76M0k57p1M2J39k48J74j64K98O2m70L65j1k45J67k62L7K84P1j89Oj7N4
$$ plain form
3139 73 157 -77 197 5 105 -1 -37 32 -179 75 131 150 114 148 -88 173 3 0 32 -56 -137 153 134 67 -84
3164 -84 -298 -10 201 -84 16 183 18 -48 51 -220 50 292 -105 104 -185 -28 84 231 -176 64 -234
3185 -234 80 -9 16 38 45 127 -108 -235 -146 280 -157 -61 216 51 -112 51 -188 48 185 94 133 -58 104
3208 104 96 81 380 157 -102 -46 136 -322 81 106 -164 -74 -37 -234 -13 -95 -286 27 -115 -35 53 -85 65
3231 65 352 -77 126 -18 -70 43 67 18 -106 -69 -141 -327 -71 6 -7 57 28 -166 -195 -283 -359 -92 -94 68 87
3256 87 115 -161 -118 70 -200 -23 -240 113 89 141 -52 -112 -162 -195 33 -393 92 -381 -23 133 98 3 119
3279 119 362 12 -188 246 82 -135 37 -89 -175 -272 35 -66 105 51 42 -301 250 96 38 170 2 -69
3301 -69 207 247 -10 -81 -39 100 -148 26 -138 160 222 -248 117 106 -139 28 -234 -197 87 158 -31 -25 -42 12
3325A2Q3r4J11k22K63j64j14K86k83K67n57K45K10j37K50k18J40J35m0Ok09J34
3347A04q3j5Lj09j51J12K42k69M6K35l0n9J54k74k1J44r8OJ16j3o8K9q1M7R6m9
3373A4J26k93j29N02o06M26q0N4M3p8n3l7K53j74P8L7j49j65L16P1j57lJ95j93
3397bJ36k64j70L99k68L16j59j34K74j54j34K62J00kj68N7l21M88j95J44k85p8
3419a58K68J00k79j49L81k73K09J97l19q5K15o7K02r9J67k85J73j81j04J7Q7L0
3441D7j71J36K0m1k49M76l43j36J51J26J10k00J97q5pj59K50j96K76j81j27O0
3463d6J32j64J99k41J96n9k87K83k72L87j49K35j45K3k21J1M74k42j94J98l0j14
3485b6J04m21N36M6k79M0m8%p0M8J39J2j13k72K18J43k4R3k88P1R8M5k81J69j9
$$ plain form
3325 12 95 1 112 -110 153 -11 -125 161 -122 145 -412 -167 43 -94 156 -62 78 213 173 179 -30 104
3347 104 21 6 9 -100 -251 -139 103 -166 -120 115 85 26 180 -94 -115 29 -69 -63 53 40 -28 1 -80 -33 63 14
3373 14 140 -153 -282 220 -386 40 -40 14 57 -21 -74 -111 142 -32 46 83 -66 -231 85 156 -1 -4 191 -2
3397 -2 134 -130 -300 99 -169 147 -12 -146 128 -26 -160 102 202 200 32 89 -232 256 61 205 -80 -158
3419 -158 110 210 -69 -218 163 -110 99 296 -23 -108 107 40 242 143 310 25 198 17 -87 -70 17 47
3441 47 -124 12 32 -9 -258 218 -125 -261 -110 16 126 -74 123 38 31 -128 122 -74 202 21 -106 -46
3463 -46 86 -78 121 -120 76 17 -270 13 -259 128 -21 214 69 92 -129 -118 356 114 -80 118 88 -26
3485 -26 78 -343 193 239 -40 0 -48 -48 -118 -70 69 81 -32 -304 -86 57 33 126 -162 -91 7 52 -229 -60 -79
3510g9K46k89j27L52o0J28k59P6k3K48j67R4m74N14l25L63o25J60L50o1Rl32j0
3533b91L36q8Q2K22l95J89j36j97L90j84r8K91j47K29m00O7J50K09k03R6j83J25
3555F4l9J5k09j47L62N7j69M3L37m01L3K07p9J35l2l20l10L86P2K9M3O6j85R1
3579D9j50J07J65k22Q6J02j90M22k36q3J20r0k45J41J82k00k7J10q5K1J00r4l6
3602e3K49k62M5r1K15l2j7q6j70J69j31K14j15J97l36J02K39m7k65J58L0j0K0
3625B3k4L1j99L16l10K35k31J47j26k22N43n5j84K13j25K35k74R2j09M9n1k7l4
3648h7M7j15J92j7J48j15j67k1q3L8M47K1k32N7O0kk51p8K60j39O7j2J40J06l96
3673a32L7p3L24j91j86K68j02n4K51k03J60k2k1R8j61n1R3k54J42J18MN6R8l52
$$ plain form
3510 -79 167 -122 -249 103 43 171 -88 -12 -35 213 46 140 -334 180 -145 218 -407 -247 103 42 51 -281 -291
3533 -291 45 -43 39 261 -134 55 -81 -278 112 -72 -170 121 -26 203 -197 -130 20 229 26 122 -61 64
3555 64 25 40 -169 -316 46 103 -66 -23 314 -87 -54 153 74 209 177 -143 -453 -67 5 34 77 143 -42 49
3579 49 -101 6 171 -51 35 137 -53 369 133 50 170 80 -165 -24 158 -42 -69 41 -44 -23 77 -17 -53
3602 -53 196 -66 -21 -112 103 71 54 -32 -202 -33 -164 50 -65 132 -204 -102 137 90 -175 -17 13 3 23
3625 23 -1 30 -169 147 -163 72 -159 -12 -138 -360 183 128 -56 157 32 267 -7 85 -24 25 -26 -53 -87
3648 -87 -40 -155 37 20 168 53 -114 -135 -218 -180 267 288 56 113 173 171 -80 -158 102 -37 30 18 158 264 -132
3673 -132 -95 -168 156 -35 -221 47 -55 -109 142 -61 99 77 56 154 -7 -58 35 -219 -77 41 45 101 199 -153
3697a53J54j23l70N83J55m82K21Q9j28j47J75r1J87j41J13L2Q3j37j28q5L19l1
3719I5p6L46l05l3J05o1K2K6L8l09J00J9K03l08J8M78l77k08K95Q2n9p1J8J95
3743B33l01J53m0j16N9j56J80J24l1k3j89J72j32K9j0L4j65N2J13k49K36%M52
3766D25l11n0J55j82P1k47K97k72K55l97J04J49k63K85o2K81k18m8M0N9k38J81
3788A4q4r0R9j47J33J05Q3O3j94K0q6J70j20J35P2m38L27j15j7K52l84L37k05
3811g0nK93J06m00M11k35J3o1K91l80K35k74J33N6k73K31n8L7L7M3q2J38l17K56
3835A25j17J24l74K12K06m8k97J48j0J17j14J37k6J35k22J38j39R8j12r7J01j77
3857a92K06jJ15L2K0j25k54J58O5n5k37L59q8j8K11K97l65J5J28o27M16J60n32
$$ plain form
3697 -153 1 -122 -492 91 246 -236 -15 74 -54 -201 -26 -117 70 -71 42 74 157 20 -108 -193 126 95
3719 95 19 365 60 27 132 71 93 119 157 -152 -52 -33 170 -138 -120 358 -19 -227 68 150 91 20 38 233
3743 233 -68 85 45 -71 -12 -168 12 136 105 82 -107 65 -67 -38 -48 -14 -179 -127 -14 -263 -27 -27 425
3766 425 114 64 219 37 108 -139 158 -114 141 -256 -152 -3 -266 19 -43 238 20 -28 12 71 -167 14
3788 14 -70 -160 -61 -208 -75 30 113 176 -18 2 -84 86 -34 101 173 -265 62 -53 -70 182 -202 135 -70
3811 -70 -75 218 324 -76 335 100 113 52 343 -37 198 -76 57 113 -160 71 13 50 87 130 48 186 -131 125
3835 125 8 132 -242 -30 176 128 -169 -21 -31 86 -28 109 83 218 -4 134 -5 93 -19 -116 -15 -192
3857 -192 14 13 128 160 180 55 -199 -41 24 -31 -268 91 3 -15 196 493 128 143 271 -356 60 220 -312
3880c12M46k20rj1K34P3j95j49J49k2k22L26n5j99L64k67J56O5l55j20L95L1k37
3903a34p9K19J87k98M6p2J21J04K2j12K77k37l59M25j44R8o5M4R7r9K06j65l54
3926b72L31J17l12L94j99l91M70mj43j5P7j8rq5J43J9k2mL00k88m0j02k8j92J91
3951h2J4J73k3l13L88m14M82k61L9j11j66J57n7J16P3j77J43m4N4k7M0J40l29
3974a85L75k51k4m8J05K8j84J76O0j10O2j6m4J90k9k09n6K14m7K02m66K98m3M6
$$ plain form
3880 -312 134 -86 -95 -106 128 201 6 -143 6 -16 -238 88 33 -166 198 -69 87 152 -203 -323 72 103 -134
3903 -134 -213 6 193 -105 -59 -131 -10 94 116 4 281 44 -315 110 -34 64 -1 43 140 41 247 82 -272
3926 -272 59 176 -136 258 59 -332 138 134 -9 -24 53 35 26 -59 84 103 81 77 377 89 49 -53 -81 -273 -82
3951 -82 -68 105 82 -231 157 -257 225 -36 3 -108 -274 -117 -174 -58 15 -162 -19 -63 -9 -36 4 144 -185
3974 -185 190 -61 -85 -133 -28 0 -184 -8 52 -58 4 -12 -56 134 105 -104 -160 54 7 209 -257 41 -2 44
$$ [...]
8191i9
##END NTUPLES=NMR FID
##END=
