##TITLE=1H_DE-90k
 200.13MHz, CDCl3,
 8 sc
 
 7.5.2025
##JCAMPDX= 6.0         $$ Bruker NMR JCAMP-DX V2.0
##DATA TYPE= NMR FID
##DATA CLASS= NTUPLES
##ORIGIN= UXNMR, Bruker Analytische Messtechnik GmbH
##OWNER= pz
$$ XWIN-NMR		Version 3.5
$$ Wed May  7 13:54:25 2025 Russian Standard Time (UT+4h)  she@DPX200
##.OBSERVE FREQUENCY= 200.1313
##.OBSERVE NUCLEUS= ^1H
##.DELAY= (6, 6)
##.ACQUISITION MODE= SIMULTANEOUS
##.ACQUISITION SCHEME= undefined
##.AVERAGES= 8
##.DIGITISER RES= 18
##SPECTROMETER/DATA SYSTEM= spect
##.PULSE SEQUENCE= zg30
##.SOLVENT NAME= CDCl3
##.SHIFT REFERENCE= (INTERNAL, CDCl3, 0, 14.3821)
##AUDIT TRAIL= $$ (NUMBER, WHEN, WHO, WHERE, WHAT)
$$ ##TITLE= Audit trail, XWIN-NMR		Version 3.5
$$ ##JCAMPDX= 5.01
$$ ##ORIGIN= Bruker BioSpin GmbH
$$ ##OWNER= she
$$ F:/spectra/data/she/nmr/H-C/1/audita.txt
$$ ##AUDIT TRAIL=  $$ (NUMBER, WHEN, WHO, WHERE, WHAT)
(   1,<2025-05-07 13:53:04.35 +0400>,<she>,<DPX200>,
      <created by zg, POWCHK disabled, PULCHK disabled
       configuration hash MD5:
       00 E9 B6 7A A2 85 ED C7 34 08 36 98 17 FE 4E 26
       data hash MD5: 16K
       66 16 12 B0 8C 9B 7D 7C C1 E2 34 EE 29 D6 F4 02>)
$$ ##END=
$$ 
$$ hash MD5
$$ 44 6C BB BF B1 34 D0 57 5D 3C A1 F5 32 69 D1 53
##$RELAX= 
##$RELAX= 
##$RELAX= 
##$RELAX= 
##$RELAX= 
##$RELAX= 
$$ Bruker specific parameters
$$ --------------------------
##$DU= <F:/spectra>
##$EXPNO= 1
##$NAME= <H-C>
##$PROCNO= 1
##$TYPE= <nmr>
##$USER= <she>
##$AMP= (0..31)
100 100 100 100 100 100 100 100 100 100 100 100 100 100 100 100 100 100 
100 100 100 100 100 100 100 100 100 100 100 100 100 100 
##$AQSEQ= 0
##$AQ_mod= 1
##$AUNM= <au_zg>
##$AUTOPOS= <>
##$BF1= 200.13
##$BF2= 200.13
##$BF3= 200.13
##$BF4= 200.13
##$BF5= 200.13
##$BF6= 200.13
##$BF7= 200.13
##$BF8= 200.13
##$BYTORDA= 1
##$CFDGTYP= 0
##$CFRGTYP= 5
##$CHEMSTR= <none>
##$CNST= (0..31)
1 1 145 1 1 1 1 1 1 1 1 1 1 1 1 1 1 1 1 1 1 1 1 1 1 1 1 1 1 1 1 1 
##$CPDPRG= <>
##$CPDPRG1= <>
##$CPDPRG2= <>
##$CPDPRG3= <>
##$CPDPRG4= <mlev>
##$CPDPRG5= <mlev>
##$CPDPRG6= <mlev>
##$CPDPRG7= <mlev>
##$CPDPRG8= <mlev>
##$CPDPRGB= <>
##$CPDPRGT= <>
##$D= (0..31)
0 0.7 0 0 0 0 0 0 0 0 0 0.03 0 0 0 0 0 0 0 0 0 0 0 0 0 0 0 0 0 0 0 0 
##$DATE= 1746611583
##$DBL= (0..7)
120 120 120 120 120 120 120 120 
##$DBP= (0..7)
150 150 150 150 150 150 150 150 
##$DBP07= 0
##$DBPNAM0= <>
##$DBPNAM1= <>
##$DBPNAM2= <>
##$DBPNAM3= <>
##$DBPNAM4= <>
##$DBPNAM5= <>
##$DBPNAM6= <>
##$DBPNAM7= <>
##$DBPOAL= (0..7)
0.5 0.5 0.5 0.5 0.5 0.5 0.5 0.5 
##$DBPOFFS= (0..7)
0 0 0 0 0 0 0 0 
##$DE= 6
##$DECBNUC= <off>
##$DECIM= 32
##$DECNUC= <off>
##$DECSTAT= 4
##$DIGMOD= 1
##$DIGTYP= 9
##$DL= (0..7)
0 120 120 120 120 120 120 120 
##$DP= (0..7)
150 150 150 150 150 150 150 150 
##$DP07= 0
##$DPNAME0= <>
##$DPNAME1= <>
##$DPNAME2= <>
##$DPNAME3= <>
##$DPNAME4= <>
##$DPNAME5= <>
##$DPNAME6= <>
##$DPNAME7= <>
##$DPOAL= (0..7)
0.5 0.5 0.5 0.5 0.5 0.5 0.5 0.5 
##$DPOFFS= (0..7)
0 0 0 0 0 0 0 0 
##$DQDMODE= 0
##$DR= 18
##$DS= 0
##$DSLIST= <SSSSSSSSSSSSSSS>
$$ [...]
##$SUBNAM0= <"">
##$SUBNAM1= <"">
##$SUBNAM2= <"">
##$SUBNAM3= <"">
##$SUBNAM4= <"">
##$SUBNAM5= <"">
##$SUBNAM6= <"">
##$SUBNAM7= <"">
##$SUBNAM8= <"">
##$SUBNAM9= <"">
##$SW= 18.0517328524113
##$SWIBOX= (0..15)
0 0 2 0 0 0 0 0 0 0 0 0 0 0 0 0 
##$SW_h= 3612.71676300578
##$TD= 16384
##$TD0= 1
##$TE= 0
##$TE2= 300
##$TE3= 300
##$TEG= 300
##$TL= (0..7)
0 120 120 120 120 120 120 120 
##$TP= (0..7)
150 150 150 150 150 150 150 150 
##$TP07= 0
##$TPNAME0= <>
##$TPNAME1= <>
##$TPNAME2= <>
##$TPNAME3= <>
##$TPNAME4= <>
##$TPNAME5= <>
##$TPNAME6= <>
##$TPNAME7= <>
##$TPOAL= (0..7)
0.5 0.5 0.5 0.5 0.5 0.5 0.5 0.5 
##$TPOFFS= (0..7)
0 0 0 0 0 0 0 0 
##$TUNHIN= 0
##$TUNHOUT= 0
##$TUNXOUT= 0
##$USERA1= <user>
##$USERA2= <user>
##$USERA3= <user>
##$USERA4= <user>
##$USERA5= <user>
##$V9= 5
##$VALIST= <valist>
##$VCLIST= <CCCCCCCCCCCCCCC>
##$VD= 0
##$VDLIST= <DDDDDDDDDDDDDDD>
##$VPLIST= <PPPPPPPPPPPPPPP>
##$VTLIST= <TTTTTTTTTTTTTTT>
##$WBST= 1024
##$WBSW= 4
##$XGAIN= (0..3)
0 0 0 0 
##$XL= 0
##$YL= 0
##$YMAX_a= 89342
##$YMIN_a= -159686
##$ZGOPTNS= <>
##$ZL1= 120
##$ZL2= 120
##$ZL3= 120
##$ZL4= 120
##$ABSF1= 10
##$ABSF2= 0
##$ABSG= 5
##$ABSL= 3
##$ALPHA= 0
##$AQORDER= 0
##$ASSFAC= 0
##$ASSFACI= 0
##$ASSFACX= 0
##$ASSWID= 0
##$AUNMP= <proc_1d>
##$AZFE= 0.1
##$AZFW= 0.1
##$BCFW= 1
##$BC_mod= 2
##$BYTORDP= 1
##$COROFFS= 0
##$CY= -3
##$DATMOD= 1
##$DC= 2
##$DFILT= <>
##$DTYPP= 0
##$F1P= 0
##$F2P= 0
##$FCOR= 0.5
##$FTSIZE= 0
##$FT_mod= 4
##$GAMMA= 1
##$GB= 0.15
##$INTBC= 1
##$INTSCL= 1
##$ISEN= 128
##$LB= 0.25
##$LEV0= 0
##$LPBIN= 0
##$MAXI= 10000
##$MC2= 0
##$MEAN= 0
##$ME_mod= 0
##$MI= 1.114404
##$NCOEF= 0
##$NC_proc= 0
##$NLEV= 6
##$NOISF1= 3.799351
##$NOISF2= 2.8
##$NSP= 1
##$NTH_PI= 0
##$NZP= 0
##$OFFSET= 14.38212
##$PC= 1
##$PHC0= -1561.096
##$PHC1= 37.19221
##$PH_mod= 1
##$PKNL= yes
##$PPARMOD= 0
##$PSCAL= 0
##$PSIGN= 0
##$REVERSE= no
##$SF= 200.129724274929
##$SI= 16384
##$SIGF1= 3
##$SIGF2= 2
##$SINO= 400
##$SIOLD= 16384
##$SREGLST= <1H.CDCl3>
##$SSB= 0
##$STSI= 0
##$STSR= 0
##$SW_p= 3205.1282051282
##$SYMM= 0
##$S_DEV= 0
##$TDeff= 0
##$TDoff= 0
##$TI= <>
##$TILT= no
##$TM1= 0
##$TM2= 0
##$TOPLEV= 0
##$USERP1= <user>
##$USERP2= <user>
##$USERP3= <user>
##$USERP4= <user>
##$USERP5= <user>
##$WDW= 1
##$XDIM= 8192
##$YMAX_p= 0
##$YMIN_p= 0
$$ End of Bruker specific parameters
$$ ---------------------------------
##NTUPLES= NMR FID
##VAR_NAME=  TIME,          FID/REAL,        FID/IMAG
##SYMBOL=    X,             R,               I
##VAR_TYPE=  INDEPENDENT,   DEPENDENT,       DEPENDENT
##VAR_FORM=  AFFN,          ASDF,            ASDF
##VAR_DIM=   8192,          8192,            8192
##UNITS=     SECONDS,       ARBITRARY UNITS, ARBITRARY UNITS
##FACTOR=    0.0002768,     1,               1
##FIRST=     0,             0,               0
##LAST=      2.2672688,     0,               0
##MIN=       0,             -159686,         0
##MAX=       2.2672688,     89342,           0
$$ Real data points
##PAGE= N=1
##DATA TABLE= (X++(R..R)), XYDATA
$$ plain form
0 0 0 0 0 0 0 0 0 0 0 0 0 0 0 0 0 0 0 0 0 -2 8 -8 8 -8 8 -8 13 -16 16 -18 22 -24 28 -31 36 -39 44 -49 54 -60 67
41 67 -75 83 -91 101 -111 123 -136 150 -165 182 -198 220 -242 270 -300 333 -372 419 -474 541 -627
62 -627 736 -885 1096 -1419 1964 -3075 6166 -33607 -102135 1843 62225 36922 51140 89342
76 89342 88727 84148 76619 37141 -10448 -15098 -32128 -92658 -104595 -65147 -66408 -74821 -52039 -22218
90 -22218 13214 40889 50921 65826 72507 72410 65088 30991 9768 18905 -3553 -43624 -43050 -19832
104 -19832 -21679 -46282 -46872 -25715 -23923 -20944 -9676 -13283 7852 42247 27458 16862 50711
117 50711 62003 34154 15525 17680 15266 -6498 -27833 -44355 -56240 -42081 -29560 -41917
129 -41917 -29288 8133 24493 26255 28661 35212 42254 29327 9210 4867 2993 -1436 -10345 -25958
$$ packed form
0@%%%%%%%%%%%%%%%%%%%kJ0j6J6j6J6j6K1k9L2l4M0m6N2n9O7p5Q3r3J03j14J27
41F7j42J58j74J92k12K34k59K86l15L47l80M18m62N12n70O33p05P91q93J015j168
62f27J363j621J981k515L383n039R241l9773o8528J03978O0382k5303J4218L8202
76H9342o15m579p529l9478m7589m650j7030o0530j1937L9448j261q413K2782K9821
90b2218L5432K7675J0032J4905O681r7p322l4097k1223R137k2458m0071N74K3218
104a9832j847k4603n90K1157J792K979J1268l607K1135L4395j4789j0596L3849
117E0711J1292k7849j8629K155k414k1764k1335j6522j1885J4159J2521j2357
129d1917J2629L7421J6360J762K406O551P042j2927k0117m343j874m429q909j5613
$$ plain form
143 -25958 -23099 -11531 -18017 -26686 -20149 -2612 4338 -4893 432 19434 19325 15301 16676 12432
157 12432 18266 23629 6716 -6040 -1833 -2810 -16975 -30366 -26527 -16493 -17566 -14748 -7296 -837
171 -837 15379 20742 8946 12745 26077 22118 8803 803 4294 5395 -8292 -17483 -15353 -13007
185 -13007 -10123 -12486 -16324 -5526 4776 1978 91 5310 15155 16922 7779 8434 14264 8141 1634
200 1634 -3853 -11642 -9125 -7465 -15686 -17489 -8198 1012 196 -4208 4656 14125 9672 6675 7365 6465
216 6465 9757 6136 -4894 -4450 1102 -1639 -8945 -11832 -4210 -1279 -8515 -8663 -2544 -543 2139
231 2139 2096 1796 8516 13609 11169 6419 4838 7978 4627 -7347 -9691 -6711 -9376 -11044 -11230 -9210
247 -9210 -1206 3000 1788 2830 8198 13217 9044 1093 3959 6481 -439 -4769 -4398 -3466 -1164 -2717
$$ packed form
143b5958K859J1568o486q669O537J7537O950r231N325J9002j09m024J375m244
157A2432N834N363j6913j2756M207r77j4165j3391L839J0034j073K818P452O459
171h37J6216N363j1796L799J3332l959j3315q000L491J101j3687r191K130K346
185a3007K884k363l838J0798J0302k798j887N219R845J767r143O55N830o123o507
200A634n487p789K517J660q221j803R291R210q16m404Q864R469m453k997O90r00
216F465L292l621j1030M44N552k741p306k887P622K931p236j48O119K001K682
231B139m3l00O720N093k440m750j581L140l351j1974k344K980k665j668j86K020
247i210Q004M206j212J042N368N019m173p951K866K522o920m330L71R32K302j553
$$ plain form
263 -2717 -4996 -2421 669 696 -3262 -5431 261 2432 -2109 -1248 3111 5058 6639 5142 3208 5117
279 5117 4630 909 -4778 -6731 -3306 -4705 -10272 -7546 -1318 534 1115 1758 4866 8278 6853 3264
295 3264 970 1204 2070 -2542 -7099 -3009 -186 -2111 -2542 -535 1578 2942 556 -1039 -279 157
311 157 290 -2354 -3101 1513 3437 449 774 2556 3957 2263 -1063 -2251 -1072 -1623 -3355 -4847
327 -4847 -3728 1370 1523 -1424 1619 4906 4171 2219 166 632 830 -2083 -3266 -3295 -2163 603 -620
344 -620 -1707 1545 3609 1973 359 61 1357 1379 -1614 -2076 -1419 45 783 -1502 -1464 2062 2440 -419
362 -419 -1033 405 1224 -156 -2336 -1121 663 638 314 -666 217 2771 1037 -1406 -357 610 -252 -1675
380 -1675 -2302 -803 120 -398 -1 124 997 2404 526 -595 1094 1203 1 -1535 -1226 466 209
$$ packed form
263b717k279K575L090K7l958k169N692K171m541Q61M359J947J581j497j934J909
279E117m87l721n687j953L425j399n567K726O228J852N81O43L108L412j425l589
295C264k294K34Q66m612m557M090K823j925m31K007K113J364k386j595P60M36
311A57J33k644p47M614J924k988L25J782J401j694l326j188J179n51j732j492
327d847J119N098J53k947L043L287p35j952k053M66J98k913j183k9J132K766j223
344f20j087L252K064j636j614k98J296K2k993m62O57J464P38k285L8L526L78k859
362d19o14J438Q19j380k180J215J784k5l24r80Q83K554j734k443J049R67q62j423
380a675o27J499R23n18L97J25Q73J407j878j121J689J09j202j536L09J692k57
$$ plain form
397 209 -1591 -1446 -395 284 575 -991 -878 1626 1353 -47 -251 592 1814 546 -1195 -115 113
414 113 -625 -709 -1392 -1074 662 -310 -892 -128 1001 1235 -35 -591 1119 1083 137 -455 -803 86 463 -711
434 -711 -969 -82 733 16 -1277 -475 1017 202 -1064 -49 376 839 863 -176 279 1422 935 -377
452 -377 -945 -775 92 -1507 -1981 -635 -144 220 150 180 1532 2100 1255 267 89 782 352 -1402 -1493 -620
472 -620 -453 -1068 -980 -290 439 750 -24 250 622 1004 308 -461 92 951 276 -286 396 565 603 119 -667
493 -667 -808 -762 -749 -1325 -1858 -646 581 206 160 1088 1897 1516 1466 439 768 614 -504 -1274 -1424 -769
513 -769 -1065 -1611 -985 79 123 294 679 454 981 810 -2 31 517 564 -88 -243 100 532 -208 -739 -560
534 -560 -650 -189 -910 -1360 -363 -150 4 46 140 1014 1641 806 465 966 832 0 -926 -1106 -777 -679 -1229 -1077
$$ packed form
397B09j800J45J051O79K91j566J13K504k73j400k04Q43J222j268j741J080K28
414A13p38q4o83L18J736r72n82P64J129K34j270n56J710l6r46n92l48Q89L77j174
434g11k58Q87Q15p17j293Q02J492q15j266J015M25M63K4j039M55J143m87j312
452c77n68J70Q67j599m74J346M91L64p0L0J352N68q45r88j78O93m30j754r1Q73
472f20J67o15Q8O90P29L11p74K74L72L82o96p69N53Q59o75n62O82J69L8m84p86
493f67j41M6J3n76n33J212J227l75m6R28Q09l81n0j027L29j54j118p70j50O55
513g69k96n46O26J064M4J71L85k25N27j71q12L3M86M7o52j55L43M32p40n31J79
534e60r0M61p21m50R97K13J54M2R4Q74O27q35l41N01j34q32r26j80L29R8n50J52
$$ plain form
556 -1077 -720 205 395 122 310 863 431 551 354 427 691 365 -178 -207 -45 72 -146 -706 -99 61 -555
577 -555 -562 -661 -351 321 0 178 559 793 1076 281 245 676 250 -414 -563 -416 -508 -657 -991 -628 -99 -8
599 -8 194 302 396 805 900 185 415 555 248 -271 -333 -143 35 -243 -607 -232 -500 -52 -172 -593 58 541
621 541 -132 166 350 601 605 138 157 338 149 87 -320 -199 -16 -105 -610 -499 93 -26 -84 -309 136 579
643 579 153 167 1 -79 377 217 -105 -267 -102 -193 -690 -872 -358 223 -210 -223 -129 460 578 267 11 398
665 398 484 8 -207 -63 -7 -77 -400 -234 -194 -116 -221 -241 -151 25 181 80 117 149 99 138 -249 39 367 231
689 231 -143 -117 -58 -183 -122 -430 -372 -83 119 5 -55 251 185 263 402 221 97 234 85 -287 253 -10 -449
712 -449 -240 -344 -151 25 -36 -56 32 212 114 123 -19 401 81 92 -134 -220 220 -239 -22 -211 66 -178 -469
$$ packed form
556a077L57R25J90k73J88N53m32J20j97P3K64l26n43k9J62J17k18n60O07J60o16
577e55pr9L10O72l21J78L81K34K83p95l6M31m26o64j49J47r2j49l34L63N29R1
599hK02J08R4M09R5p15K30J40l07n19o2J90J78k78l64L75k68M48j20m21O51M83
621E41o73K98J84K51Mm67J9J81j89o2m07J21J83q9n05J11N92j19n8k25M45M43
643E79m26J4j66q0M56j60l22j62J65r1m97j82N14N81m33j3R4N89J18l11k56L87
665C98Q6m76k15J44N6p0l23J66M0P8j05k0R0J76J56j01L7L2n0L9l87K88L28j36
689B31l74K6N9j25O1l08N8K89K02j14o0L06o6P8J39j81j24J37j49l72N40k63m39
712d49K09j04J93J76o1k0Q8J80r8Rj42M20l20J1k26q6M40m59K17j89K77k44k91
$$ plain form
735 -469 -249 -225 -209 -380 11 -23 302 266 335 294 359 313 197 94 -58 23 -446 -310 -87 57 58 81 6 -156 304
760 304 220 -88 61 -122 9 -116 124 -84 7 215 -309 -41 -243 -92 -155 -173 134 31 -116 -189 127 58
782 58 219 140 108 199 135 50 43 194 96 64 67 -189 -92 -67 74 -222 -88 36 223 121 104 -92 483 -2 -145
807 -145 -147 -109 87 50 -57 -20 -5 235 20 36 -8 444 -154 -71 179 4 -24 -114 -37 33 185 -49 79 -116 -43
832 -43 115 151 -95 -113 -13 -7 -57 188 56 185 -339 72 -149 46 -52 -354 -219 143 -52 -27 -10 -139 93
855 93 117 -26 -124 12 -76 90 43 66 -259 76 175 -111 -111 58 -178 81 67 -138 -160 -119 33 41 421 204 -50
880 -50 75 5 -126 -97 -141 55 87 -77 146 -280 -82 -65 138 -35 98 134 -62 -157 101 115 -166 -43 -166
903 -166 -134 -67 -317 -244 114 -93 -35 151 -186 -53 -141 92 198 46 319 -139 67 202 -179 58 122 164 69
$$ packed form
735d69K20K4J6j71L91l4L25l6O9m1O5m6j16j03j52Q1m69J36K23J44JK3p5j62M60
760C04q4l08J49j83J31j25K40k08R1K08n24K68k02J51o3j8L07j03j47p3L16o9
782E8J61p9l2R1o4q5pJ51r8l2Lk56R7K5J41k96J34J24J87j02j7j96N75m85j43
807a45kL8J96l7j07L7J5K40k15J6m4M52n98Q3K50j75k8r0P7P0J52k34J28j95P3
832d3J58L6k46j8J00On0K45j32J29n24M11k21J95r8l02J35L62j95K5J7j29K32
855I3K4j43r8J36q8J66m7K3l25L35R9k86%J69k36K59j4k05k2M1J52QL80k17k54
880e0J25p0j31K9m4J96L2j64K23m26J98J7K03j73J33L6j96r5K58J4k81J23j23
903a66L2O7k50P3L58k07N8J86l37J33q8K33J06j52K73m58K06J35l81K37O4M2r5
$$ plain form
926 69 -261 -26 236 219 -80 87 27 -64 85 176 -95 -124 30 -6 200 -97 79 -187 34 113 -66 152 81
949 81 345 54 0 235 -281 82 -15 15 3 50 -62 119 19 16 164 -33 -140 156 27 190 -4 191 240
972 240 16 -6 -96 65 -11 -197 -79 -31 -236 -258 -311 13 147 47 42 -83 44 61 -15 124 12 107 -55 -47 -56
997 -56 -300 -191 189 -109 -59 33 428 -59 -97 115 -155 136 139 52 -62 35 42 -125 -208 14 -21 101 -43 -122 138
1022 138 -191 -285 147 -209 386 94 284 149 111 -79 -192 -143 -105 -101 -237 133 -71 -25 181 152 49 -43 129
1045 129 137 305 0 -29 -5 -121 101 -105 154 68 -175 53 -224 86 137 185 188 -86 -39 -215 104 75 72 -205
1069 -205 89 24 -20 -98 10 95 -191 65 161 -179 -320 -135 320 35 77 85 -275 -11 -42 -136 37 111 -16 193
1093 193 129 -192 178 167 -96 35 -125 -40 24 5 88 65 195 56 -5 126 -3 20 197 51 -7 134 138 65
$$ packed form
926F9l30K35K62j7k99J67o0r1J49R1k71k9J54l6K06k97J76k66K21P9j79K18p1
949H1K64k91n4K35n16L63r7L0j2M7j12J81j00lJ48j97j07K96j29J63j94J95M9
972B40k24k2r0J61p6j86J18M8k05k2n3L24J34j00nj25J27J7p6J39j12R5j62Qr
997e6k44J09L80k98N0R2L95m87l8K12k70K91Lq7j14R7Pj67q3K22l5J22j44p9K60
1022A38l29r4M32l56N95k92J90j35l8j90j13M9L8Mj36L70k04M6K06k9j03r2J72
1045A29QJ68l05k9K4j16K22k06K59q6k43K28k77L10N1M8Lk74M7j76L19k9lk77
1069b05K94o5m4p8J08Q5k86K56R6l40j41J85M55k85M2Ql60K64l1r4J73P4j27K09
1093A93o4l21L70j1k63J31j60Q5O4j9Q3k3J30j39o1J31j29K3J77j46n8J41Mp3
$$ plain form
1117 65 30 3 327 -149 32 -17 -283 128 94 50 233 55 -54 -87 27 -393 68 -33 -70 -91 181 108 -66
1140 -66 -65 -183 15 -33 130 -73 161 -62 -36 167 99 131 286 129 169 -108 -130 8 -48 -142 -58 219 82 177
1164 177 -61 27 -232 101 -240 -26 281 -54 311 78 163 -17 95 -187 39 76 116 -27 -334 -149 -235 -68
1186 -68 -182 160 77 -100 -17 129 195 -115 135 386 335 -154 7 207 12 64 143 -16 -3 -111 -153 -52 -367
1209 -367 85 -23 -226 108 -153 -93 -233 30 -28 -35 -94 131 132 -26 -222 -61 29 -102 -92 -129 59 19 131 -106
1233 -106 -2 108 122 28 154 -118 -62 135 -291 24 -3 -85 27 139 72 191 14 -60 -125 -32 45 7 87 101
1257 101 -197 -21 104 93 -94 -221 221 -9 -141 -127 325 -42 -82 -16 -153 85 -79 -220 45 -61 4 -40
1279 -40 76 -63 -71 -123 173 -538 49 -248 79 59 -162 69 152 -42 140 -190 193 56 -185 151 -335 238
$$ packed form
1117F5l5k7L24m76J81m9k66M11l4m4J83j78j09l3J14m20M61j01l7k1K72p3j74
1140f6Jj18J98m8J63k03K34k23K6K03o8L2J55j57M0k77k2J38n6r4Q4K77j37R5
1164A77k38Q8k59L33l41K14L07l35L65k33Q5j80J12k82K26L7M0j43l07J85q6J67
1186f8j14L42q3j77Q3J46O6l10K50K51n1m89J61K00j95N2P9j59J3j08m2J01l15
1209c67M52j08k03L34k61O0j40K63n8pn9K25Jj58j96J61R0j31J0l7J88m0J12k37
1233a06J04J10J4r4J26k72N6J97m26L15k7q2J12J12o7J19j77p4o5R3P7l8Q0J4
1257A01k98J76J25j1j87j27M42k30j32J4M52l67m0O6j37K38j64j41K65j06O5m4
1279d0J16j39qn2K96p11N87k97L27k0k21K31Q3j94J82l30L83j37k41L36m86N73
$$ plain form
1301 238 -89 50 -187 37 167 147 -63 217 -19 15 168 -97 63 178 -248 -70 -55 31 -56 51 -169 171
1323 171 -199 33 -116 -75 101 -163 33 -213 29 -51 57 8 -97 57 -102 -131 215 24 -62 146 -48 -108
1345 -108 178 121 -99 2 140 37 122 -102 256 -127 -48 -73 31 49 -287 -19 94 -127 158 -12 -69 59
1367 59 167 183 -41 42 -47 -378 -121 21 115 10 -166 -228 -74 -19 -124 85 168 145 79 123 113 -107 126 -152
1391 -152 20 -89 -164 -99 -42 -138 79 -159 6 -44 15 26 -7 118 -84 369 -179 9 40 -197 -28 -126 -199 4
1415 4 -156 254 37 23 245 104 -39 -22 -110 -135 62 -24 62 205 -80 149 20 -128 -34 43 145 -79 -63 -160
1439 -160 46 -309 -30 -1 58 91 83 -15 -59 76 -27 -112 214 -160 29 -68 -50 -45 -79 16 -197 -75 32 -142 -8
1464 -8 -329 -239 -103 -399 285 -18 136 -38 125 -45 209 25 54 106 -69 -3 76 174 -29 273 -201 -36 240
$$ packed form
1301B38l27J39k37K24J30k0k10K80k36L4J53k65J60J15m26J78J5Q6q7J07k20L40
1323A71l70K32j49M1J76k64J96k46K42q0J08m9j05J54j59k9L46j91q6K08j94o0
1345a08K86n7k20J01J38j03Q5k24L58l83P9k5J04J8l36K68J13k21K85j70n7J28
1367E9J08J6k24Q3q9l31K57J42R4j05j76o2J54N5j05K09Q3k3o6M4j0k20K33k78
1391a52J72j09p5O5N7r6K17k38J65n0N9J1l3J25k02M53n48J88L1k37J69r8p3K03
1415Dj60M10k17j4K22j41j43J7q8k5J97q6Q6J43k85K29j29j48R4P7J02k24J6r7
1439a60K06l55K79K9N9L3qr8m4J35j03q5L26l74J89r7J8Nl4R5k13J22J07j74J34
1464hl21R0J36k96O84l03J54j74J63j70K54j84K9N2j75O6P9R8k03L02m74J65K76
$$ plain form
1487 240 -326 -121 -46 -133 48 -39 112 131 101 -111 99 -217 34 -33 45 -55 -59 20 170 -40 -18 242 -108 116
1511 116 -313 -19 228 -11 9 79 -246 -249 20 102 211 41 34 77 98 35 23 -164 83 -42 -237 235 202 193 -290
1536 -290 -49 115 -84 313 64 55 139 281 72 -270 -11 7 192 -139 -35 375 4 108 67 8 288 49
1558 49 42 -121 437 76 249 297 127 -55 4 -52 36 101 -87 161 150 53 249 -248 15 180 102 -120 28 -124
1582 -124 -192 145 -237 97 -81 197 -182 63 53 -69 -53 135 -119 -40 172 41 183 -37 -28 150 -86 29
1604 29 82 -108 -14 -94 -13 252 -161 188 39 -143 -34 -63 33 -1 -75 -103 -84 6 -87 -150 130 338 106 12 28
1629 28 -5 115 73 -68 -151 19 194 -125 -355 136 77 250 218 -34 -105 -63 109 14 -40 -373 -14 -16 -60 322
1653 322 -170 35 -81 -255 204 99 -168 68 120 -56 -216 -3 160 241 -86 -49 118 43 -189 161 15
$$ packed form
1487B40n66K05P5q7J81q7J51J9l0k12K10l16K51o7P8j00mP9J50k10K2K60l50K24
1511A16m29K94K47k39K0P0l25lK69Q2J09j70pM3K1o3j2j87K47j25j95M72l3rm83
1536b90K41J64j99L97k49rQ4J42k09l42K59J8J85l31J04M10l71J04m1n9K80k39
1558D9pj63N58l61J73M8j70j82N9n6Q8O5j88K48j1r7J96m97K63J65p8k22J48j52
1582a24o8L37l82L34j78K78l79K45j0j22J6J88k54P9K12j31J42k20RJ78k36J15
1604B9N3j90R4q0Q1K65m13L49j49j82J09k9R6l4p4k8J9R0r3o3K80K08k32r4J6
1629B8l3J20m2j41q3J70J75l19k30M91n9J73l2k52p1M2J72r5n4l33L59km4L82
1653C22m92K05j16j74M59j05k67K36N2j76j60K13J63Q1l27L7J67p5k32L50j46
$$ plain form
1674 15 77 -419 120 94 -98 -177 209 -5 -17 62 -31 87 -120 35 -151 206 -36 -51 -99 -222 191 63 95
1697 95 -24 -285 -55 140 258 -46 -122 -182 -160 112 -85 156 29 111 92 -175 -10 -71 38 -227 -5 -171
1719 -171 -11 42 -96 -68 125 -204 277 229 84 -161 272 279 -174 182 213 285 -98 -23 21 231 -40 -296 -229
1742 -229 -68 15 39 -197 -29 -97 -164 -137 -16 81 175 -153 82 -286 -211 -142 69 -58 69 23 -114 16 71 177
1766 177 -206 -203 -173 114 37 237 157 261 -52 -110 169 -65 -204 90 87 -41 -112 36 -88 0 -36 67 82 44
1790 44 -128 70 50 -15 34 178 32 -282 89 37 -49 149 73 50 -54 -11 65 -29 4 7 -154 75 39 -116 147
1815 147 -237 152 185 -31 -95 -2 52 -60 -121 21 -164 -25 -122 76 343 14 7 -385 19 -37 -1 -96 -3 145
1839 145 346 -152 -60 22 6 -46 147 -31 -48 146 -262 90 -234 -52 -145 -32 -111 -45 -51 -79 45 21 203 -278
$$ packed form
1674A5O2m96N39k6j92p9L86k14j2P9r3J18k07J55j86L57k42j5m8j23M13j28L2
1697I5j19k61K30J95J18l04p6o0K2K72j97K41j27Q2j9k67J65o1J09k65K22j66
1719a71J60N3j38K8J93l29M81m8j45k45M33Pm53L56L1P2l83P5M4K10k71k56O7
1742b29J61Q3K4k36J68o8o7K7J21R7R4l28K35l68P5O9K11j27J27m6j37J30N5J06
1766A77l83LL0K87p7K00q0J04l13n8K79k34j39K94lj28p1J48j24Q8l6J03J5l8
1790D4j72J98k0o5M9J44j46l14L71n2q6J98p6k3j04M3P6r4L3Lj61K29l6j55K63
1815A47l84L89L3k16o4R3N4j12o1J42j85J39r7J98K67l29pl92M04n6L6r5R3J48
1839A45K01m98R2Q2j6n2J93j78j7J94m08L52l24J82r3J13p9O6ok8J24k4J82m81
$$ plain form
1863 -278 166 34 -138 -186 158 95 -31 -16 56 365 -44 -201 -308 -69 5 -29 31 -22 150 -69 -65 96 -204
1886 -204 -166 245 -147 1 146 54 -133 -277 -137 106 -24 -37 207 102 -26 -69 117 -149 25 122 -209 -119
1908 -119 187 24 -141 -134 -47 -41 -195 235 0 84 -11 -178 -82 -76 -38 88 64 -57 -304 132 74 -160 -14 372
1932 372 60 157 21 -67 262 89 -221 164 72 233 38 134 -222 149 103 -119 53 -201 20 -105 166 119
1954 119 25 195 24 120 -71 285 403 6 95 13 16 157 -68 54 -34 270 205 -31 -107 48 -351 159 185
1977 185 -127 57 -167 28 12 69 -38 -49 -134 196 222 229 73 -39 104 -48 154 32 108 -222 331 -147 -81
2000 -81 41 -101 -163 205 120 -272 -22 91 -117 90 -69 156 60 -129 -99 81 -151 143 99 291 -25 61
2022 61 -108 -199 104 -10 -71 -90 -69 84 -7 346 -1 -268 -4 -97 5 -84 271 -68 86 -102 61 -63 47
$$ packed form
1863b78M44j32j72m8L44o3j26J5P2L09m09j57j07K39P4l4O0n3J72k19MJ61l00
1886b04L8M11l92J48J45r2j87j44J40K43j30j3K44j05j28m3J86k66J74R7l31R0
1908a19L06j63j65PQ7Oj54M30k35Q4r5j67R6OL8J26k4j21k47M36n8k34J46L86
1932C72l12R7j36q8L29j73l10L85r2J61j95R6l56L71m6k22J72k54K21j25K71m7
1954A19r4J70j71R6j91L56J18l97Q9q2LJ41k25J22q8L04o5k36p6J55l99N10K6
1977A85l12J84k24J95j6N7j07j1q5L30K6Pj56j12J43j52K02j22P6l30N53m78O6
2000h1J22j42o2L68q5l92K50J13k08K07j59K25r6j89L0J80k32K94m4J92l16Q6
2022F1j69r1L03j14o1j9K1J53r1L53l47k67K64r3J02q9L55l39J54j88J63j24J10
$$ plain form
2045 47 -220 152 -130 52 128 10 161 -37 356 -52 -97 128 -3 -98 40 -211 -6 157 -210 -10 235
2066 235 -17 129 -36 22 111 132 48 100 -44 -138 72 -41 -163 -119 -124 119 202 19 101 -169 236 18 98 67
2090 67 246 261 225 -170 -221 22 -63 61 -12 144 -64 -186 10 196 432 49 -368 160 196 -40 26 -204 12
2113 12 103 -166 -37 63 -94 96 44 62 -143 117 -67 -51 165 137 -61 -150 100 29 43 161 -145 -121 -168 290
2137 290 87 -3 103 52 -1 90 -78 -107 219 137 -64 -155 2 -72 -47 83 9 80 -65 65 59 89 91 155 94 71
2163 71 -213 -29 -37 12 -245 261 288 -55 20 99 131 -35 -110 122 0 168 58 54 -151 165 235 68 103 -34
2187 -34 -277 181 -216 -72 -82 -309 45 -80 64 -286 60 -13 -88 -60 -52 60 -126 -133 8 -85 -205 -188 -225 -73
2211 -73 -87 -68 193 -38 203 29 -100 -56 -94 44 288 129 -109 -63 -156 268 191 -98 -128 108 -12 165 -75
$$ packed form
2045D7k67L72k82J82P6j18J51j98L93m08m5K25j31r5J38k51K05J63l67K00K45
2066B35k52J46j65N8Q9K1q4N2j44r4K10j13j22M4nK43Q3j83Q2k70M05k18Q0l1
2090F7J79J5l6l95n1K43q5J24p3J56k08j22J96J86K36l83m17N28L6k36O6k30K16
2113A2R1k69J29J00j57J90n2J8k05K60j84J6K16k8j98q9K50p1J4J18l06K4m7M58
2137B90k03r0J06n1n3R1j68k9L26q2k01r1J57p4K5J30p4P1j45J30oL0KO4o1k3
2163G1k84J84qM9k57N06K7l43P5P9L2j66p5K32j22J68j10mk05L16P0j67L5j37
2187c4k43M58l97J44j0k27L54j25J44l50L46p3p5K8QJ12j86pJ41r3j20J7l7J52
2211g3j4J9K61k31K41j74j29M4l8J38K44j59k38M6r3M24p7k89l0K36j20J77k40
$$ plain form
2234 -75 75 -166 59 -44 64 66 -2 -38 -289 -179 -238 146 -76 168 172 -26 -103 -142 -152 -125 -307 166 -171 -80
2258 -80 -144 -2 -38 23 -37 28 -129 -94 253 -134 4 58 -273 246 84 -127 70 -29 -33 -116 -105 47 -63 78
2282 78 -74 -97 51 -13 83 13 -188 235 -47 -41 -66 -104 -39 27 -36 67 -6 -43 188 97 -162 134 210 96 -37
2307 -37 -137 -223 54 -172 -99 -11 14 -53 148 77 128 -178 -176 46 314 -76 159 104 -184 -234 0 138 58 -36 -133
2332 -133 53 33 133 304 -169 51 17 -155 33 -110 93 48 -6 95 74 230 -29 280 82 -118 0 238
2354 238 115 -339 -264 65 -31 -51 93 -138 -80 -39 -129 -160 -481 13 -167 12 76 155 -150 -91 71 79 97 211
2378 211 -43 9 -76 -58 130 30 1 -106 173 -79 59 173 -41 -238 -25 15 29 -58 -61 191 216 40 -28 206
2402 206 -221 -118 32 -14 -90 -166 271 -21 93 51 94 -27 89 -105 0 -251 58 18 35 31 -149 -136 -146 -100
$$ packed form
2234g5J50k41K25j03J08Ko8l6k51J10n9L84k22K44Mj98p7l9j0K7j82M73l37R1
2258h0o4J42l6O1o0O5j57L5L47l87J38N4l31N19j62k11J97r9mq3J1J52j10J41
2282G8j52k3J48o4R6p0k01M23k82Ok5l8O5O6o3J03p3l7K31r1k59K96P6j14j33
2307c7j00q6K77k26P3Q8K5o7K01p1N1l06KK22K68l90K35n5k88n0K34J38q0r4r7
2332a33J86k0J00J71m73K20l4j72J88j43K03m5n4J01k1J56k59L09j98k00J18K38
2354B38j23m54P5L29r6k0J44k31N8M1r0l1l21M94j80J79O4P9l05N9J62QJ8J14
2378B11k54N2q5J8J88j00k9j07K79k52J38J14k14j97K13M0J4q7lK52K5j76o8K34
2402B06m27J03J50m6p6p6M37k92J14m2M3j21J16j94J05k51L09m0J7mj80J3j0M6
$$ plain form
2426 -100 -269 -133 52 -117 -113 -274 36 193 17 -31 11 210 144 -151 3 -6 -283 10 40 47 10 -32 -239 182
2450 182 -282 -221 -212 -37 42 42 51 207 -58 93 114 55 -34 266 -69 -11 -38 -142 60 57 -162 258 99 -67 -61 -31
2476 -31 190 -36 178 -13 21 -22 11 -177 -241 48 -88 176 308 5 -141 121 -29 -206 134 214 92 196
2498 196 -65 51 104 38 -161 11 231 46 99 -13 -195 -79 53 44 102 136 39 -64 120 -376 -67 -6 135
2521 135 -13 140 5 -248 97 99 -173 176 -133 -102 75 -22 2 23 -96 111 49 35 -87 -372 -290 69 138
2544 138 -39 -239 18 310 9 52 88 284 0 -259 156 167 218 -85 30 -206 102 277 96 -44 -125 56
2566 56 -95 -34 116 -64 -368 -36 26 -379 -67 56 -10 164 -136 26 126 8 98 -13 267 -225 -128 -134 134
2589 134 139 67 264 -186 -164 -27 -69 148 -88 17 146 -83 75 35 -286 161 225 -74 -81 -107 -187 -218 -189 -140 -45
$$ packed form
2426a00j69J36J85j69Mj61L10J57j76m8M2J99o6k95J54rk77K93L0Pl7m2k07M21
2450A82m64O1RJ75P9%RJ56k65J51K1n9q9L00l35N8k7j04K02lk19M20j59j66OL0
2476c1K21k26K14j91L4m3L3j88o4K89j36K64J32l03j46K62j50j77L40Q0j22J04
2498A96k61J16N3o6j99J72K20j85N3j12j82J16J32rN8L4r7j03J84m96L09O1J41
2521A35j48J53j35k53L45Kk72L49l09L1J77r7K4K1j19K07o2j4j22k85Q2L59O9
2544A38j77k00K57K92l01M3L6J96k84k59M15J1N1l03J15k36L08J75j81j40q1J81
2566E6j51O1J50j80l04L32O2m05L12J23o6J74l00J62J00j18R0j11K80m92R7oK68
2589A34Np2J97m50K2J37m2K17k36J05J29k29J58m0l21M47O4k99pk6q0l1K9M9R5
$$ plain form
2614 -45 109 174 209 145 -153 2 82 1 -30 2 97 177 -105 78 -39 179 4 -30 204 156 -324 -158 -115 47
2638 47 61 68 32 -111 -210 -54 -216 -130 -144 168 160 133 393 301 124 -24 46 80 -41 -121 -145 -129 -73 335 38 -186
2664 -186 -6 240 -42 -38 44 154 65 16 70 156 -186 189 79 -126 121 11 17 118 -260 -273 98 154 149 -96
2688 -96 160 -108 11 113 -33 170 -178 -142 -5 -88 -3 128 -199 168 -116 58 201 -74 317 231 -253 -253
2710 -253 276 -163 -2 61 65 -36 48 184 34 18 -89 16 -35 250 -89 75 -47 -74 338 -189 5 55 -177
2733 -177 31 -58 -257 -119 113 -85 35 41 20 -53 -60 -5 -21 -50 -42 130 170 53 -301 81 -46 -11 360 171 62
2758 62 100 -172 -141 112 -182 -22 -47 -153 -187 -143 87 66 -20 78 -135 24 -117 -45 74 114 -24 -91 5 148
2782 148 -2 -5 -9 460 144 56 -204 58 152 165 75 -202 -87 187 92 -65 69 -60 -110 -186 77 37 -167 -213
$$ packed form
2614d5J54O5L5o4k98J55Q0q1l1L2R5Q0k82J83j17K18j75l4K34m8m80J66M3J62
2638D7J4Pl6j43r9J56j62Q6j4L12qk7K60r2j77j48P0L4j21q0k4J6N6M08k97k24
2664a86J80K46k82MQ2J10q9m9N4Q6l42L75j10k05K47j10OJ01l78j3L71N6nk45
2688i6K56k68J19J02j46K03l48L6J37q3Q5J31l27L67k84J74J43k75L91q6m84%
2710b53N29m39J61O3Mj01Q4J36j50j6j07J05n1K85l39J64j22k7M12n27J94N0k32
2733a77K08q9j99J38K32j98J20Ok1p3pN5j6k9QJ72M0j17l54L82j27L5L71j89j09
2758F2L8k72L1K53k94J60k5j06l4M4K30k1q6R8k13J59j41P2J19M0j38o7R6J43
2782A48j50lmM69l16q8k60K62R4J3r0k77J15K74r5j57J34j29n0p6K63m0k04m6
$$ plain form
2806 -213 -104 16 126 -201 -183 -189 -186 154 -77 -51 -15 157 -89 -130 -60 -34 -164 19 194 304 -201 156 -12
2829 -12 134 115 -1 168 33 225 37 60 26 -15 136 104 -102 74 162 -2 -3 -90 119 -129 11 -5 -285 -55
2853 -55 -110 84 -36 -7 49 -177 -60 64 92 -120 2 -91 174 67 -147 92 41 46 -220 -18 313 396 149
2876 149 199 -158 158 -74 34 160 -32 45 -238 -39 -176 -238 79 196 51 -210 415 282 135 -16 -192
2897 -192 53 -34 -4 -97 110 108 -58 -181 -254 -186 201 -8 187 -142 -100 -84 -153 153 67 -68 67 14 -30 -123 145
2922 145 11 12 -63 -7 -101 -304 8 5 201 8 -93 -258 -150 -227 259 262 -158 95 20 92 183 -21 -76 -23 19
2947 19 -34 -5 99 -60 -6 -37 -95 60 32 112 -86 127 209 -25 13 125 389 244 43 -107 -86 -31 -114 -184 2
2972 2 -82 -343 -57 -17 -187 -38 279 -195 -105 59 74 -148 -80 -136 -321 145 35 58 118 -248 47 113 -47 118
$$ packed form
2806b13J09J20J10l27J8oLL40k31K6L6J72k46m1P0K6j30J83J75J10n05L57j68
2829a2J46j9j16J69j35J92j88K3l4m1J51l2k06J76Q8j64jq7K09k48J40j6k80K30
2853e5n5J94j20K9N6k26J17J24K8k12J22r3K65j07k14K39n1Nk66K02L31Q3k47
2876A49N0l57L16k32J08J26j92P7k83J99j37o2L17J17j45k61O25j33j47j51j76
2897a92K45q7L0r3K07kj66j23p3O8L87k09J95l29M2J6o9L06q6j35J35n3m4r3K68
2922A45j34Jp5N6r4k03L12lJ96j93j01j65J08p7M86Lm20K53p5P2R1k04n5N3M2
2947A9n3K9J04j59N4l1n8J55k8Q0j98K13Q2k34L8J12K64j45k01j50K1N5q3p0J86
2972Bq4k61K86M0j70J49L17m74R0J64J5k22O8n6j85M66j10K3O0l66K95O6j60J65
$$ plain form
2996 118 -205 -82 -11 -17 75 112 -118 21 -61 -134 70 -146 -179 -183 304 -268 -89 -98 -13 71 -124 165 -5 -239 -28
3021 -28 -11 15 179 19 -329 -176 102 122 -67 -14 282 -111 -191 179 114 288 -114 104 88 -23 -34 -208 -273
3044 -273 133 -95 204 263 188 -10 -72 -135 -86 -95 -56 -37 73 -125 -151 -114 -117 87 151 159 50 2 -161 137 3 138
3070 138 149 54 -28 -195 15 -194 134 138 351 -62 -77 -143 -54 92 -2 -58 62 -216 69 101 17 -221 -75 90
3094 90 -146 -49 -129 136 109 231 45 -61 -1 -70 181 123 36 -78 -23 168 -12 -86 -6 -40 105 -92 6 -168
3118 -168 -3 -7 -93 -82 97 34 -286 188 -102 -217 87 -270 72 -142 133 -249 228 35 -178 118 -21 38
3140 38 -131 -235 133 -34 74 -81 45 -162 -24 -141 109 65 308 9 280 -80 -209 -204 383 10 92 287
3162 287 -230 -156 -122 155 -278 155 316 223 -164 130 243 -39 122 104 61 -115 61 73 -33 103 174 211 -198
$$ packed form
2996A18l23J23P1oR2L7k30J39q2p3K04k16l3mM87n72J79rQ5Q4j95K89j70k34K11
3021b8J7K6J64j60l48J53K78K0j89N3K96l93q0L70o5J74m02K18j6j11j1j74o5
3044b73M06k28K99N9p5j98o2o3M9rL9J9J10j98k6L7lK04O4Qj09m8j63K98j34J35
3070A38J1r5q2j67K10k09L28MK13m13j5o6Q9J46r4n6J20k78K85L2q4k38J46J65
3094I0k36R7q0K65k7J22j86j06O0o9K51n8q7j14N5J91j80p4Q0l4J45j97R8j74
3118a68J65mq6J1J79o3l20M74k90j15L04l57L42k14K75l82M77j93k13K96j39N9
3140C8j69j04L68j67J08j55J26k07J38j17K50m4K43k99K71l60j29NN87l73Q2J95
3162B87n17P4L4K77m33M33J61r3l87K94J13k82J61j8m3j76J76J2j06J36P1L7m09
$$ plain form
3185 -198 146 -269 -252 -71 -78 89 85 15 160 -180 -223 -86 -269 -61 109 115 -102 -108 22 178 125 36 105 50 -185
3210 -185 76 -123 -96 27 46 -28 -87 58 -52 84 84 -115 12 178 -99 -144 42 0 71 -297 62 -12 -267
3233 -267 332 152 -66 -137 -78 -6 -145 200 149 -318 154 65 128 -56 -47 199 -296 101 -36 -28 -61 -42 368 -85
3257 -85 -102 -124 -222 81 -84 72 252 -98 166 -84 -246 -293 98 2 50 6 -102 -90 105 -74 198 -31 -38 -60
3281 -60 -66 32 94 106 -90 166 -30 164 9 -294 29 116 18 -153 323 210 -227 -59 168 -60 -16 49 36 -222
3305 -222 23 -41 217 -77 -204 -64 -36 -130 191 91 -39 171 102 124 23 -60 -6 -210 -73 -91 20 75 86
3328 86 30 164 164 72 -246 202 101 -25 -17 173 81 165 -17 132 34 -49 89 -88 114 138 -6 -284 67 -135
3352 -135 -44 200 208 -109 -134 3 178 280 -105 -188 -38 -115 27 -25 -155 53 -32 187 -119 144 82 52 32 82
$$ packed form
3185a98L44m15J7J81pJ67mp0J45l40m3J37j83K08J70Ok17oJ30J56n3q9O9n5k35
3210a85K61j99K7J23J9p4n9J45j10J36%j99J27J66k77m5J86m2P1l68L59p4k55
3233b67N99j80k18p1N9P2j39L45n1m67M72q9O3j84RK46m95L97j37Ql3J9M10m53
3257h5j7k2r8L03j65J56J80l50K64k50j62m7L91r6M8m4j08J2J95j79K72k29pk2
3281f0oR8O2J2j96K56j96J94j55l03L23Q7r8j71M76j13m37J68K27k28M4O5j3k58
3305b22K45o4K58k94j27J40K8r4L21j00j30K10o9K2j01q3N4k04J37j8J11N5J1
3328H6n6J34%r2l18M48j01j26QJ90r2Q4j82J49r8q3J38j77K02K4j44k78L51k02
3352a35R1K44Ql17k5J37J75J02l85q3J50p7J42n2j30K08q5K19l06K63o2l0k0N0
$$ plain form
3376 82 129 -64 98 108 -116 -51 -127 47 127 161 -101 -124 284 22 -71 -6 -89 -206 97 118 67 233 -98 -146 271
3401 271 -53 -93 23 349 -42 -105 -57 -53 42 -127 -125 -7 -69 -20 94 -136 133 -183 -159 -202 5 73 259 -135
3425 -135 -76 -16 185 33 97 -76 31 -150 46 37 30 166 -20 -2 218 96 179 -107 193 89 -244 40 24
3448 24 -10 -250 8 78 135 -39 297 -96 -16 101 -214 24 133 -146 -89 217 186 -60 -109 91 -187 -67 113
3471 113 32 -97 105 12 -186 -34 119 9 -7 237 57 -120 23 31 55 116 -56 -287 -78 241 -123 -11
3493 -11 237 95 -283 392 -46 165 -220 73 -154 321 -90 151 -68 -102 116 -211 41 31 241 -2 -70
3514 -70 -272 -14 -141 41 30 19 111 66 31 216 76 49 -170 30 -131 -144 -67 -90 53 115 -139 3 386 -50
3538 -50 178 -64 12 -81 35 214 5 -175 -200 77 -232 143 -55 -275 -34 -72 232 -248 212 -57 278 -155
$$ packed form
3376H2M7j93J62J0k24O5p6J74Q0L4k62k3M08k62r3O5q3j17L03K1n1J66l31m8M17
3401B71l24m0J16L26l91o3M8MR5j69KJ18o2M9J14k30K69l16K4m3K07O8J86l94
3425a35N9O0K01j52O4j73J07j81J96rpJ36j86J8K20j22Q3k86L00j04l33K84j6
3448B4l4k40K58P0N7j74L36l93Q0J17l15K38J09k79N7L06l1k46m9K00k78J20J80
3471A13q1j29K02r3j98J52J53j10j6K44j80j77J43QK4O1j72k31K09L19l64J12
3493a1K48j42l78O75m38K11l85K93k27M75m11K41k19l4K18l27K52j0K10k43o8
3514g0k02K58j27J82j1j1R2m5l5J85j40k7k19K00j61j3P7k3J43O2k54J42L83m36
3538e0K28k42P6r3J16J79k09j80k5K77l09L75j98k20K41l8L04m80M60k69L35m33
$$ plain form
3560 -155 64 15 -168 87 196 118 -32 -28 21 68 178 100 148 -238 23 138 45 38 -166 191 15 231 -56 50
3584 50 15 -17 38 -312 267 -12 83 -306 198 183 -28 87 230 110 93 84 210 91 46 69 -26 -12 300 151
3608 151 53 18 182 -96 -313 104 25 -144 -214 -47 -178 -152 -211 53 85 -239 -7 258 81 -74 -71 -57 82
3631 82 -338 101 -149 26 -258 56 116 185 100 254 159 174 -36 171 -33 -123 -161 -86 -112 75 12 44 200 39
3655 39 14 -330 -78 -40 152 22 -62 70 223 16 -128 71 -25 66 -211 -234 231 -182 -110 -148 131 -108 -69
3678 -69 -67 -225 -105 55 -131 37 50 43 -36 18 2 32 67 -189 11 -73 69 -203 -298 -18 41 280 7 -38 43
3703 43 -75 109 -37 -101 -128 -47 140 -262 40 -2 -67 3 97 72 137 -81 29 -62 -261 222 67 -190 187 171
3727 171 -119 -134 92 8 91 -22 17 291 -11 -51 -171 -66 -205 48 65 45 -83 -160 72 -78 -61 9 56 -159
$$ packed form
3560a55K19m9j83K55J09p8j50MM9M7J10p8M8l86K61J15r3pk04L57j76K16k87J06
3584E0l5l2N5l50N79k79R5l89N04j5k11J15J43j20j7rJ26j19m5K3r5J4L12j49
3608A51r8l5J64k78k17M17p9j69p0J67j31K6n9K64L2l24K32K65j77j55LJ4J39
3631H2m20M39k50J75k84L14O0O9q5J54r5J5k10K07k04r0l8P5k6J87o3L2J56j61
3655C9k5l44K52L8J92j30q4J32J53k07j44J99r6R1k77k3M65m13P2l8K79k39L9
3678f9Kj58J20J60j86J68J3pp9N4j6L0L5k56K00q4J42k72r5K80N9K39k73m5Q1
3703D3j18J84j46o4k7Q1J87m02L02m2o5P0R4k5O5k18J10r1j99M83j55k57L77j6
3727A71k90j5K26q4Q3j13L9K74l02m0j20J05j39K53J7k0j28p7K32j50J7P0M7k15
$$ plain form
3751 -159 -64 151 -267 -18 130 -151 304 -31 -234 43 -39 216 236 -20 217 228 -2 162 13 108 166 63
3773 63 67 -130 181 97 54 -117 221 125 39 226 33 -140 106 -108 58 -431 -43 -213 -55 253 -176 -74
3795 -74 96 169 -188 10 -32 149 -12 28 -252 94 -180 11 118 -293 -6 -189 -38 74 160 -30 -61 97
3817 97 212 -50 -91 58 41 44 -75 113 -152 -21 115 173 27 -118 36 -15 -108 59 145 134 58 148 138 -43
3841 -43 146 87 -47 -92 -105 107 131 199 -317 -182 -97 -271 -79 -187 -337 35 -52 -66 -55 35 211 -50 -317 -51
3865 -51 138 -186 -173 65 49 90 -85 -97 234 -181 -166 -139 22 84 -65 161 -90 -119 -27 22 -102 -37 -171 242
3889 242 180 -98 162 -123 -73 189 -533 -115 247 -64 -46 322 120 -207 -29 -89 230 18 -61 37 54 -22 173
3912 173 -15 134 -45 115 71 -63 214 -249 111 198 -92 149 175 -44 214 -131 7 209 106 12 -97
$$ packed form
3751a59R5K15m18K49J48k81M55l35k03K77q2K55K0k56K37J1k30J64j49R5N8j03
3773F3Mj97L11q4m3j71L38r6q6J87j93j73K46k14J66m89L88j70J58L08m29J02
3795g4J70P3l57J98m2J81j61M0k80L46k74J91J07m11K87j83J51J12Q6j90l1J58
3817I7J15k62m1J49j7Lj19J88k65J31J36N8j46j45J54n1r3J67Q6j1p6R0j0j81
3841d3J89n9j34m5j3K12K4O8n16J35Q5j74J92j08j50L72q7j4J1R0J76k61k67K66
3865e1J89l24J3K38j6M1j75j2L31m15J5K7J61O2j49K26k51k9R2M9j24O5j34M13
3889B42o2k78K60k85N0K62p22M18L62l11J8L68k02l27J78o0L19k12p9R8J7p6J95
3912A73j88J49j79J60m4j34K77m63L60Q7k90K41K6k19K58l45J38K02j03r4j09
$$ plain form
3933 -97 -34 195 -174 54 -116 314 50 89 -104 -13 229 -142 111 165 -26 -105 -139 153 365 -129 10 -143
3955 -143 -147 150 33 -291 -67 13 -87 199 -121 49 37 -95 -63 -159 9 -69 -106 -237 -51 196 -124 70 134
3978 134 152 62 -191 -101 143 138 119 -42 4 159 4 -37 -90 213 -102 34 3 -158 -216 200 -22 -29 -50 -38 36
4003 36 -262 80 50 113 66 55 -20 34 55 -61 -288 170 72 150 -7 39 282 -83 51 -70 276 -6 -102 -147
4027 -147 -123 -85 -41 56 -6 -24 38 122 -51 15 189 28 150 -316 -147 -247 -377 111 -43 -225 -25 94 67
4050 67 -135 -138 -10 -26 164 -95 199 -90 -90 -73 -146 -185 266 -126 31 187 150 114 103 35 -205 -134 -106 124 55
4075 55 78 -25 -135 -57 -87 -55 -288 -126 5 -121 -38 49 -73 280 -181 -318 -67 -24 82 -184 -183 266 -111
4098 -111 1 157 -26 135 137 -122 -164 181 -19 -60 109 -148 -216 -279 -1 -184 -107 -128 -295 96 -292 -156 -154
$$ packed form
3933i7O3K29l69K28j70M30k64L9j93R1K42l71K53N4j91p9l4K92K12m94J39j53
3955a43mK97j17l24K24Q0j00K86l20J70j2j32L2r6J68p8l7j31J86K47l20J94O4
3978A34J8r0k53R0K44nj9j61M6J55j55m1n3L03l15J36l1j61n8M16k22pk1J2P4
4003C6k98L42l0O3m7j1p5N4K1j16k27M58r8P8j57M6K43l65J34j21L46k82r6m5
4027a47K4L8M4R7o2j8O2Q4j73O6J74j61J22m66J69j00j30M88j54j82K00J19k7
4050F7k02lJ28j6J90k59K94k89%J7p3l9M51l92J57J56l7l6j1o8k40P1K8K30o9
4075E5K3j03j10P8l0L2k33J62J31j26Q3Q7j22L53m61j37K51M3J06k66JM49l77
4098a11J12J56j83J61Kk59m2L45k00m1J69k57o8o3K78j83P7k1j67L91l88J36K
$$ plain form
4121 -154 9 57 -283 -63 135 164 159 178 105 393 -215 52 -124 256 -307 -126 -29 207 239 -286 78 -71 -36
4144 -36 -64 -81 67 151 7 217 -156 112 246 -71 -33 -82 43 -44 20 -294 71 139 -167 47 249 222 -41
4167 -41 -216 -17 150 59 -30 24 71 -229 -79 20 16 -88 134 155 46 -79 -64 -111 -292 -21 -56 -279 -120 242
4191 242 -96 -194 -1 272 103 33 -255 87 282 -22 373 -134 -161 -86 -222 0 -82 41 -140 -224 176 -26
4213 -26 -94 134 -92 -90 64 -43 184 40 42 -28 -135 -81 15 -25 6 143 261 -148 40 36 -256 36 97 -213 171
4238 171 56 267 -104 78 -87 -285 230 283 65 104 70 -28 113 -92 160 121 -123 -37 52 43 28 -238 -27
4261 -27 226 22 -32 -24 221 131 -51 -77 36 94 120 -140 -375 -139 -146 50 97 139 126 38 64 -30 -127 39 228 -7
4287 -7 -217 119 -243 -5 44 -50 107 -180 288 -199 -210 -142 -249 304 12 273 205 251 -4 -290 -127 -45 30
$$ packed form
4121a54J63M8l40K20J98K9nJ9p3K88o08K67j76L80n63J81R7K36L2n25L64j49L5
4144c6k8j7J48Q4j44K10l73K68J34l17L8m9J25q7O4l14L65O8l06K14K02k7k63
4167d1j75J99J67r1q9N4M7l00J50R9mj04K22K1j09j25J5m7j81K71l5k23J59L62
4191B42l38r8J93K73j69p0k88L42J95l04L95n07k7P5j36K22q2J23j81q4M00k02
4213b6o8K28k26KJ54j07K27j44Kp0j07N4R6m0L1J37J18m09J88mk92K92O1l10L84
4238A71j15K11l71J82j65j98N15N3k18L9l4r8J41k05K52l9k44Q6Q9rj5k66K11
4261b7K53k04n4QK45r0j82k6J13N8K6k60k35K36pJ96M7M2j3q8K6r4r7J66J89k35
4287gk10L36l62K38M9r4J57k87M68m87j1O8j07N53k92K61o8M6k55k86J63Q2P5
$$ plain form
4310 30 98 72 -77 -182 -11 11 19 84 -170 43 -120 -111 15 -110 18 -26 33 86 31 26 48 -138 -88 61 -82 147
4336 147 14 34 -41 148 -42 -183 -67 -47 267 -97 -130 13 89 -66 63 198 31 -45 131 -190 -130 139
4358 139 15 169 207 -33 52 9 -140 -37 -16 -73 -103 104 93 27 -114 65 224 -366 -95 43 -144 -313 -166
4381 -166 -162 13 87 -345 44 38 85 -138 -245 220 -186 -21 199 158 82 -12 150 129 -327 213 50 -263 210
4404 210 44 13 229 -19 131 48 57 42 -16 -170 -248 -89 -167 -30 339 4 -76 -415 164 1 -198 -107 -39 -29
4428 -29 190 -22 108 183 -238 77 -206 0 -226 220 151 49 47 -128 -116 188 -121 8 260 53 -157 180
4450 180 -237 -294 69 224 168 -181 15 95 -228 -230 -82 -22 -27 26 -32 160 -116 -43 -118 -543 -149 -62 124 38 -28
4475 -28 -70 -142 66 -2 54 96 68 12 -90 -34 -68 57 -175 -87 4 69 159 -153 146 -114 -106 5 41 170 38 135
$$ packed form
4310C0O8k6j49j05J71K2QO5k54K13j63RJ26j25J28m4N9N3n5nK2j86N0J49j43K29
4336A47j33K0p5J89j90j41J16K0L14l64l3J43P6j55J29J35j67p6J76l21O0K69
4358A39j24J54L8k40Q5m3j49J03K1n7l0K07j1o6j41J79J59n90K71J38j87j69J47
4381a66MJ75P4m32L89oM7k23j07M65m06J65K20m1p6r4J62k1m56N40j63l13M73
4404B10j66l1K16k48J50q3Rj5n8j54p8J59p8J37L69l35q0l39N79j63j99R1O8J0
4428b9K19k12J30P5m21L15k83K06k26M46o9j02kj75J2L04l09J29K52k07k10L37
4450A80m17n7L63J55n6l49J96Q0l23kJ48O0nN3n8J92k76P3p5m25L94Q7J86q6o6
4475b8m2p2K08o8N6M2k8n6j02N6l4J25k32Q8R1O5R0l12K99k60QJ11L6J29j32R7
$$ plain form
4501 135 -69 37 -515 50 -59 151 78 235 -131 -114 -180 -89 5 -180 10 15 -43 -239 -80 188 -20 -141 51
4524 51 175 104 159 84 132 -59 -194 -229 -231 55 -109 234 -24 -16 -167 -130 -7 93 -106 37 430 137 -150 -12
4548 -12 -191 124 163 202 106 70 -279 -33 125 226 175 -82 -138 -10 -400 -58 -36 -77 151 -20 106 43 22 -21
4572 -21 -21 6 75 145 -359 152 50 58 89 74 -77 -23 174 -211 419 106 -47 7 96 -94 379 133 80 -137 -110
4597 -110 64 -333 348 82 -118 24 234 53 28 -45 -309 94 15 94 93 144 156 33 223 -95 -37 -199 9
4620 9 -12 275 16 275 -136 52 23 -49 -164 -94 -139 153 -10 -181 75 -80 132 79 -58 -62 96 127 -25 -26
4644 -26 13 113 355 97 -38 245 -28 76 6 -117 222 449 -203 97 243 -247 180 -153 -44 -15 16 -158
4666 -158 -174 46 309 -183 -94 73 -30 -247 -376 -215 -50 -70 102 -261 -70 122 -241 -87 243 157 -195
$$ packed form
4501A35k04J06n52N65j09K10p3J57l66J7o6R1R4j85J90Nn8j96J59K68k08j21J92
4524E1J24p1N5p5M8j91j35l5kK86j64L43k58Qj51L7J23J00j99J43L93k93k87J38
4548a2j79L15L9L9r6l6l49K46J58J01n1k57n6J28l90L42K2m1K28j71J26o3k1m3
4572b1%K7O9P0n04N11j02QL1j5j51N4J97l85O30l13j53N4Q9j90M73k46n3k17K7
4597a10J74l97O81k66k00J42K10j81k5p3k64M03p9P9jN1J2j23J90l18N8j62K08
4620Ik1K87k59K59m11J88k9p2j15P0m5K92j63j71K56j55K12n3j37mJ58L1j52j
4644b6L9J00K42k58j35K83k73J04p0j23L39K27o52L00J46m90M27l33J09K9L1j74
4666a58j6K20K63m92Q9J67j03k17j29J61J65k0J72l63J91J92l63J54L30q6l52
$$ plain form
4687 -195 73 83 393 -32 38 221 -29 95 109 49 -121 166 -111 -275 -132 143 -49 -2 -116 73 233 -111
4709 -111 -114 20 86 -33 67 164 284 -17 23 -318 156 43 144 -79 -38 111 -81 -8 42 26 192 81 -118
4732 -118 -244 87 -81 -153 17 -37 100 -19 91 -118 -219 70 -93 -32 -150 83 74 -80 250 30 -96 -126
4754 -126 152 -12 127 58 -67 -173 -3 -91 188 -158 113 83 41 33 340 8 -133 303 56 72 -52 51
4776 51 -87 17 -125 184 4 29 9 -195 -2 308 5 -36 59 -107 49 -62 32 -275 -391 -121 -166 -62
4798 -62 196 96 -70 107 49 -59 -122 43 62 234 38 25 -110 -181 -141 141 -125 173 77 72 37 -132 148 -114
4822 -114 112 -19 94 -68 28 366 -178 -264 -17 19 263 -397 204 43 32 150 56 -90 -120 -74 -19 131 9
4845 9 -14 65 -25 4 346 84 -238 144 -348 27 68 503 107 -142 -82 -79 371 -109 222 -81 111 -224 64
$$ packed form
4687a95K68J0L10m25P0J83k50J24J4o0j70K87k77j64J43K75j92M7j14J89J60l44
4709a11lJ34O6j19J00R7J20l01M0l41M74j13J01k23M1J49j92P3N0j6J66j11j99
4732a18j26L31j68p2J70n4J37j19J10k09j01K89j63O1j18K33rj54L30k20j26l0
4754a26K78j64J39o9j25j06J70q8K79l46K71l0m2qL07l32j41M36k47J6j24J03
4776E1j38J04j42L09j80K5k0k04J93L10l03m1R5j66J56j11R4l07j16K70m5J04
4798f2K58j00j66J77n8j08o3J65J9J72j96j3j35p1M0K82k66K98r6nl5j69K80k62
4822a14K26j31J13j62R6L38n44q6K47L6K44o60O01j61j1J18r4j46l0M6N5J50j22
4845Ik3P9r0K9L42k62l22L82m92L75M1M35l96k49O0LM50m80L31l03J92l35K88
$$ plain form
4868 64 50 60 -147 200 -298 28 353 -23 4 -285 -195 173 -51 140 59 -26 96 142 -10 -181 -13 -259 -180
4891 -180 278 -222 -58 -212 -142 -135 33 287 61 -123 21 171 84 -131 -9 15 75 62 32 -7 59 100 -109 -99
4915 -99 56 109 -262 -135 -29 118 -148 73 39 -92 329 -247 -67 135 -54 104 -103 -283 -18 2 -124
4936 -124 32 -110 207 -152 -21 74 217 -233 19 105 0 214 -102 65 6 42 -99 -122 25 -62 139 178
4958 178 -220 -12 -39 -466 98 -154 -140 -184 -59 132 -400 -48 -110 81 122 -126 -114 135 -30 -147 4 -103
4980 -103 -14 70 214 83 137 -117 -9 151 -23 176 57 9 -20 -25 3 -150 -26 -97 23 -89 177 121 -51
5003 -51 -23 -115 -215 -183 2 5 -180 77 -32 -37 -124 157 19 -199 24 -53 80 -150 -65 -27 -57 -99 165 -53 186
5028 186 46 -58 -116 -24 365 -307 -11 -230 15 -4 -143 46 20 289 227 -2 -36 115 -32 274 53 8
$$ packed form
4868F4j4J0k07L47m98L26L25l76K7k89R0L68k24J91q1q5J22M6j52j71J68k46P9
4891a80M58n00J64j54P0PJ68K54k26j84J44J50q7k15J22K4O0j3l0l9O6M1k09J0
4915i9J55N3l71J27J06J47k66K21l4j31M21n76J80K02j89J58k07j80K65K0j26
4936a24J56j42L17l59J31R5J43m50K52Q6j05K14l16J67n9L6j41k3J47q7K01L9
4958A78l98K08k7m27N64k52J4m4J25J91n32L52o2J91M1k48J2K49j65j17J51j07
4980a03Q9Q4J44j31N4k54J08J60j74J99j19m8k9nK8j53J24p1J20j12K66n6j72
5003e1K8r2j00L2J85Lj85K57j09nq7K81j38k18K23p7J33k30Q5L8l0m2K64k18K39
5028A86j40j04n8R2L89o72K96k19K45j9j39J89k6K69o2k29l4J51j47L06k21m5
$$ plain form
5050 8 83 12 -53 23 224 -1 -106 -30 -63 3 -25 -158 55 -410 71 -40 133 113 90 47 -33 9 138 160 -226
5075 -226 -90 -217 -45 153 -149 24 -22 -39 154 -66 33 -119 11 359 102 -11 -81 -158 -12 -13 -47 40 -102
5098 -102 -385 88 -27 250 -65 206 64 56 54 -44 483 635 15 46 76 -191 110 -40 -222 172 111 -218 122
5121 122 -5 52 -105 -125 177 225 -107 -255 -8 -63 44 72 -7 34 287 179 -243 113 -170 -125 -264 -199 27
5144 27 256 -235 24 68 58 70 -157 273 -102 -137 -13 -165 143 -34 46 205 -121 125 56 -30 -39 -440 224
5167 224 -340 -142 59 174 202 -99 -61 -97 -21 -93 -19 -138 -153 10 142 -83 -104 -268 -7 103 17 71 -23 -54
5191 -54 -81 -84 148 76 -16 92 -61 -44 31 151 166 -68 11 61 12 -35 -120 -58 91 -66 414 -37 83 -61 111
5216 111 -103 209 -52 -73 -98 -175 256 -31 -46 -55 67 -14 -129 257 98 42 -133 213 -170 -51 -80 -11 -225
$$ packed form
5050HP5p1o5P6K01k25j05P6l3O6k8j33K13m65M81j11J73k0k3m3q0M2J29K2l86
5075b26J36j27J72J98l02J73m6j7J93k20R9j52J30L48k57j13p0p7J46jl4Q7j42
5098a02k83M73j15K77l15K71j42qkr8N27J52o20L1L0k67L01j50j82L94o1l29L40
5121A22j27N7j57k0L02M8l32j48K47n5J07K8p9M1K53j08m22L56k83M5j39O5K26
5144B7K29m91K59M4j0J2k27M30l75l5J24j52L08j77Q0J59l26K46o9q6rm01O64
5167B24n64J98K01J15K8l01L8l6P6p2P4j19j5J63J32k25k1j64K61J10q6N4r4l1
5191e4k7lK32p2r2J08j53J7P5J20J5k34P9N0m9m7q5O2J49j57M80m51J20j44J72
5216A11k14L12k61k1k5p7M31k87j5rJ22q1j15L86j59n6j75L46l83J19k9O9k14
$$ plain form
5239 -225 -309 60 -93 145 -112 -47 70 6 79 -203 286 -182 81 -126 -97 -61 107 13 -145 -149 -99 -167 -52 89
5263 89 -57 104 100 -279 -13 10 101 -192 -80 -159 -130 21 -289 -97 149 134 -35 -14 115 154 260 37 -78
5286 -78 201 196 125 77 -215 48 88 118 168 -196 -126 -80 -49 -137 -117 -159 -169 -58 -35 -113 -19 121 77 -444 -36 24 382
5313 382 -18 -212 -31 -220 -323 86 -149 -35 214 89 82 11 58 -25 3 -258 50 281 -14 -67 130 -24
5335 -24 129 -4 144 -23 -249 206 11 -79 -64 -62 397 -82 -32 50 -110 286 -161 279 -49 -77 43 -161 -183
5358 -183 -60 -171 -249 38 71 136 41 3 31 -31 130 -100 84 40 20 -93 263 6 -13 -55 96 291 -120 -71
5382 -71 87 -206 -47 -80 73 4 3 -168 -3 3 50 -86 13 -11 164 -188 264 -146 23 -30 -139 62 206 180
5406 180 -308 -58 -29 56 -401 15 -188 41 -76 229 -258 130 216 84 -90 -148 121 224 158 147 -22 -40
$$ packed form
5239b25q4L69j53K38k57O5J17o4P3k82M89m68K63k07K9L6J68r4j58mN0o8J15J41
5263H9j46J61ml79K66K3R1k93J12p9K9J51l10J92K46j5j69K1J29L9J06k23j15
5286g8K79np1m8k92K63M0L0N0l64P0M6L1q8K0m2j0J11K3p8R4J40m4n21M08O0L58
5313C82m00j94J81j89j03M09k35J14K49j25pp1M7q3K8k61L08K31k95n3J97j54
5335b4J53j33J48j67k26M55j95r0J5KM59m79N0Q2j60L96m47M40l28k8J20k04k2
5358a83J23j11p8K87L3O5r5l8K8o2J61k30J84m4k0j13L56k57j9m2J51J95m11M9
5382g1J58k93J59l3J53o9jj71J65OM7j36R9k4J75l52M52m10J69n3j09K01J44k6
5406A80m88K50K9Q5m57M16k03K29j17L05m87L88Q6j32j74n8K69J03o6j1j69j8
$$ plain form
5428 -40 -131 -33 -4 164 -52 95 101 134 98 -123 -108 -28 174 -169 -143 187 -85 -114 -48 -102 15 12 122 -325 326
5453 326 -160 207 -3 -3 -67 98 82 216 138 337 96 67 54 -54 42 182 26 180 83 26 -175 -137 139 130
5477 130 -141 -25 73 130 -133 244 -45 -212 -29 206 -34 89 -21 159 -180 247 23 -215 159 43 -30
5498 -30 10 -125 110 -130 151 144 40 -123 14 34 -205 279 -37 -1 6 -49 -171 -16 -112 -82 -68 39 -29 -313
5522 -313 -46 140 174 12 205 138 -214 42 131 -215 255 335 63 -341 -78 -10 -135 -26 -90 -150 68 306
5544 306 143 -275 -197 -71 -53 -137 -27 28 -178 80 184 183 -148 -79 -78 142 -144 220 -56 -115 -38 157 -10 -150
5568 -150 76 43 184 62 -116 86 49 -53 26 159 -60 19 0 146 37 99 85 7 56 115 98 70 95 27 25
5593 25 66 18 -110 97 -212 -51 135 -118 16 157 125 154 -107 -307 -165 269 -138 -171 -204 -107 -111 -75 50 -314
$$ packed form
5428d0r1R8K9J68k16J47OL3l6k21J5Q0K02l43K6L30k72k9O6n4J17lJ10m47O51
5453C26m86L67k10%o4J65j6J34p8J99k41k9j3j08R6J40j56J54r7n7k01L8K76r
5477A30k71J16R8N7k63L77k89j67J83K35k40J23j10J80l39M27k24k38L74j16p3
5498c0M0j35K35k40K81pj04j63J37K0k39M84l16L6Pn5j22J55r6L0J4J07o8k84
5522c13K67J86L4j62J93o7l52K56Q9l46M70Q0k72m04K63O8j25J09o4o0K18K38
5544C06j63m18P8J26J8q4J10N5k06K58J04jl31O9JK20k86L64k76n9P7J95j67j40
5568a50K26l3J41j22j78K02l7j02P9J33k19P9j9J46j09O2j4p8M9N9j7k8K5o8k
5593B5M1m8j28K07l09J61J86k53J34J41l2K9k61k00J42M34m07l3l3R7mL6J25l64
$$ plain form
5617 -314 9 -103 -113 33 -41 188 338 244 -198 -12 -129 28 -93 -200 207 133 54 -34 -7 169 93 57 -117
5640 -117 226 -131 -95 179 -210 42 394 120 -218 -129 -1 -113 -328 275 36 -42 89 45 -103 223 -50
5661 -50 -73 -217 -44 -7 96 119 -58 67 56 110 -116 352 142 53 102 -105 -3 -250 -173 -74 -190 35 -120
5684 -120 -199 66 -138 -1 -12 71 -72 -170 230 69 -247 -77 48 28 -60 3 -169 -80 -139 69 176 -99 197
5707 197 106 130 195 -104 16 -292 -66 86 19 105 -221 -148 99 -81 98 -60 11 -62 36 -50 70 193 97 140
5731 140 -178 -304 -53 198 13 150 -51 12 -153 88 -48 169 23 87 117 -144 -48 20 -79 102 -54 -166
5753 -166 144 -170 135 -198 -139 -81 -44 73 -270 109 -288 20 -99 277 -233 -120 -147 47 -38 -292 -119 -1
5775 -1 217 -151 -303 124 240 -17 91 -140 -7 -276 -223 73 20 27 206 46 -23 1 -313 3 -124 219 -30
$$ packed form
5617c14L23j12j0J46p4K29J50r4m42J86j17J57j21j07M07p4p9q8K7J76p6l6j74
5640a17L43l57L6K74l89K52L52k74l38Q9J28j12k15O03k39p8J31m4j48L26k73
5661e0k3j44J73L7J03K3j77J25j1N4k26M68k10q9M9k07J02k47P7R9j16K25j55
5684a20p9K65k04J37j1Q3j43r8M00j61l16J70J25k0q8O3j72Q9n9K08J07k75K96
5707A97r1K4O5k99J20l08K26J52o7Q6l26P3K47j80J79j58P1p3R8q6J20J23r6M3
5731A40l18j26K51K51j85J37k01O3j65K41j36K17j46O4L0k61R6O8r9J81j56j12
5753a66L10l14L05l33N9N8L7J17l43L79l97L08j19L76n10J13k7J94q5k54J73J18
5775aK18l68j52M27J16k57J08k31J33k69N3K96n3PJ79j60o9K4l14L16j27L43k49
$$ plain form
5798 -30 -104 127 49 -88 -51 -223 -200 103 86 -60 95 -96 -26 74 -159 21 -228 -6 37 -22 73 -158 -169 -3
5822 -3 -246 14 76 -50 -212 105 36 329 227 25 -65 62 185 85 -26 -236 -96 232 208 136 133 90 -130
5845 -130 -193 60 -9 141 199 5 7 -73 -60 34 -134 279 -81 -235 84 -249 102 125 -37 16 -3 -43 35 91 -45
5870 -45 -33 80 126 -172 -65 -57 24 196 58 31 26 65 202 81 -163 62 -1 167 -68 166 128 -162 5 -160
5894 -160 -17 10 158 146 -62 299 226 22 -244 -133 178 102 12 -87 -26 -20 -77 8 6 -35 53 34 -65 -9 -97 -101 63
5921 63 -116 101 -199 -146 -79 -9 -56 -162 -195 -138 99 -179 -348 150 -347 -209 17 -83 57 89 -14 -287 82
5944 82 303 65 149 -27 -56 107 -140 103 255 -205 16 190 253 -213 -258 -116 -220 100 22 -83 9 -277
5966 -277 83 46 37 192 143 -137 151 -198 -42 87 -176 44 68 157 -113 161 139 -64 67 -217 -78 55
$$ packed form
5798c0p4K31p8j37L7j72K3L03j7j46J55j91P0J00k33J80k49K22M3n9R5k31j1J66
5822ck43K60O2j26j62L17o9K93j02k02r0J27J23j00j11k10J40L28k4p2lm3k20
5845a30o3K53o9J50N8j94Kq0J3R4j68M13l60j54L19l33L51K3j62N3j9m0P8N6j36
5870d5J2J13M6k98J07QQ1J72j38k7nL9J37j21k44K25o3J68k35K34l8k90J67j65
5894a60J43K7J48j2k08L61p3k04k66J11L11p6r0r9O1On7Q5km1Q8j9r9N6q8mJ64
5921F3j79K17l00N3O7P0m7j06l3N7K37k78j69M98m97J38K26j00J40L2j03k73L69
5944H2K21k38Q4j76k9J63k47K43J52m60K21J74O3m66m5J42j04L20p8j05R2k86
5966b77L60l7rJ55m9k80K88l49J56J29k63K20K4Q9k70K74k2k03J31k84J39J33
$$ plain form
5988 55 -422 22 82 137 193 26 -154 57 -48 -43 135 65 173 -158 90 7 -72 -82 -118 182 -52 294 -74 197
6012 197 113 -52 -35 106 -220 39 -51 27 -151 -380 -13 -300 -87 40 39 285 -102 139 96 221 -111 162
6034 162 -86 159 -253 101 -91 -89 163 73 8 -37 -45 19 -125 -53 315 -13 -116 -39 -50 80 140 93 315 -139
6058 -139 -200 130 -61 -70 74 25 257 -293 -387 -48 61 63 -125 127 4 178 124 -195 67 -84 -62 -262 -53
6081 -53 -239 -160 -27 57 -227 -80 -14 -5 58 -149 96 4 47 -73 -260 53 151 -54 -138 181 -30 -152 48 90
6105 90 220 56 -26 68 122 155 -132 -90 -146 37 -10 107 27 -153 -247 192 -53 -82 -120 -134 -66 -100 22 -139 231
6130 231 -123 -26 59 -219 -78 29 -6 -188 105 18 -6 91 141 -56 -77 -50 86 117 -157 -84 10 -16 -26 -97 125
6155 125 118 150 140 106 194 -94 -124 -77 161 224 -205 -113 -351 165 -251 23 173 89 -65 41 -214 62 20 22 -227
$$ packed form
5988E5m77M44O0N5N6j67j80K11j05NJ78p0J08l31K48q3p9j0l6L00k34L46l68K71
6012A97q4j65J7J41l26K59r0P8j78k29L67k87K13J27jK46l87K41m3J25l32K73
6034A62k48K45m12L54j92KK52r0o5m5qO4j44P2L68l28j03P7j1J30O0m7K22m54
6058a39o1L30j91rJ44m9K32n50r4L39J09Kj88K52j23J74n4l19K62j51K2k00K09
6081e3j86P9J33Q4k84J47O6RO3k07K45r2M3j20j87L13R8k05q4L19k11j22K00M2
6105I0J30j64q2R4N4L3k87M2n6J83m7J17q0j80r4M39k45k9l8j4O8l4J22j61L70
6130B31l54R7Q5k78J41J07l5j82K93q7k4R7N0j97k1K7J36L1k74P3R4k6j0p1K22
6155A25pL2j0l4Q8k88l0M7K38O3m29R2k38N16m16K74J50q4j54J06k55K76m2Kk49
$$ plain form
6180 -227 -199 272 45 178 -243 97 125 -155 97 113 22 73 11 -13 62 75 -218 -117 14 -75 -37 137 45 18
6204 18 262 -32 -12 44 93 -48 217 46 58 -54 -181 -23 102 176 -9 223 -37 -226 -194 103 -287 -36
6226 -36 20 255 -276 -77 151 -18 -65 124 -83 -16 -39 -36 -26 220 319 286 -3 -148 120 -46 132 -121 -126 -328
6250 -328 346 281 -13 126 -44 -190 -17 47 -113 -34 -199 58 146 -28 28 -54 -19 -141 -197 88 -8 -293 -85
6273 -85 54 158 66 135 67 84 129 19 40 -332 309 64 13 -157 -98 -16 90 47 -32 23 -129 132 81 -404 171
6298 171 166 -32 54 -42 -24 -57 308 164 310 22 95 -235 112 29 -206 -131 -116 -220 -140 -196 27 228 -187 77
6322 77 -102 15 204 258 96 273 -30 30 30 -107 -170 -8 100 -94 84 -3 259 -39 118 -42 -203 28
6344 28 -81 -59 -192 123 -142 68 89 -168 -51 37 -20 -343 56 227 256 16 126 9 7 -269 135 49 -57
$$ packed form
6180b27K8M71k27J33m21L40K8k80K52J6r1N1o2k4P5J3k93J01J31q9L8J74r2k7
6204A8K44k94K0N6M9j41K65j71J2j12j27J58J25P4j85K32k60j89L2K97l90K51
6226c6N6K35n31J99K28j69m7J89k07O7k3LJ0K46R9l3k89j45K68j66J78k53nk02
6250c28O74o5k94J39j70j46J73O4j60P9j65K57Q8j74N6q2L5j22n6K85r6k85K08
6273h5J39J04r2O9o8J7M5j10K1l72O41k45n1j70N9Q2J06m3p9N5j52K61n1m85N75
6298A71nj98Q6r6J8l3L65j44J46k88P3l30L47q3k35P5J5j04Q0n6K23K01m15K64
6322G7j79J17J89N4j62J77l03O0%j37o3J62J08j94J78q7K62k98J57j60j61K31
6344B8j09K2j33L15k65K10K1k57J17Q8n7l23L99J71K9k40J10j17kk76M04q6j06
$$ plain form
6367 -57 205 54 -117 70 -17 43 76 116 29 -50 44 -108 -162 154 -193 -52 -102 59 144 102 -159 134 -4 114
6391 114 50 29 -124 226 -258 200 -249 -340 -57 -59 -34 -181 36 170 -180 -122 -72 -128 76 17 -105 -434 -61
6414 -61 -46 -94 -144 135 31 -361 119 -13 28 330 130 -68 159 -109 -184 78 50 19 73 69 249 106 266 -49
6438 -49 -91 180 -14 -8 109 -31 69 -143 -84 85 -199 20 -173 44 -167 -50 113 143 69 149 142 -9 146
6461 146 -128 -235 -177 155 166 -280 -24 124 -45 65 -93 -60 -78 -101 -87 -38 -265 -156 32 266 12 118
6483 118 109 -114 203 -209 -55 37 393 72 202 -32 191 -116 136 -191 -294 -63 118 87 -71 -471 469
6504 469 -140 -192 -2 -298 4 -98 160 -8 -47 111 -263 138 56 -147 -147 33 -265 -28 77 -135 306 52
6526 52 -285 -84 81 -8 198 -66 -129 45 -65 100 45 -37 -102 -184 -316 204 44 -150 17 104 -242 51 40
$$ packed form
6367e7K62j51j71J87q7O0L3M0q7p9R4j52n4L16l47J41n0J61Q5m2k61K93j38J18
6391A14o4k1j53L50m84M58m49r1K83kK5j47K17J34l50N8N0n6K04n9j22l29L73
6414f1J5m8n0K79j04l92M80j32M1L02k00j98K27k68p5K62k8l1N4mJ80j43J60l15
6438d9m2K71j94OJ17j40J00k12N9J69k84K19j93K17k11J17J63L0p4Q0pj51J55
6461A46k74j07N8L32J1m46K56J48j69J10j58L3j8k3J4M9k27J09J88K34k54J06
6483A18rk23L17m12J54R2L56l21J30k34K23l07K52l27j03K31J81l1j58m00R40
6504D69o09n2J90k96L02j02K58j68l9J58l74M01q2k03%J80k98K37J05k12M41k54
6526E2l37K01J65q9K06k64o3J74j10J65n5q2o5q2j32N20j60j94J67Q7l46K93j1
$$ plain form
6549 40 15 58 -267 98 122 -66 52 -340 131 -102 -66 -197 -74 -7 203 21 -133 -175 43 77 -95 391 -108
6572 -108 -92 197 163 296 72 75 460 -235 -312 210 -110 188 64 149 -251 -282 -75 222 27 -238 -271 -82 143
6595 143 54 -149 85 80 22 -38 31 231 -150 -140 -52 -57 -8 -56 -88 -231 0 28 -70 -114 -121 279 -146 111 73 141 36
6622 36 41 -10 124 -55 -27 29 52 39 -158 -73 -76 -70 243 -387 -29 124 -35 171 261 -85 -180 -128 191 -51 -182
6647 -182 216 59 -19 -287 197 -117 -34 267 -256 -11 131 -103 -111 -219 -37 250 -39 130 -170 204 14
6668 14 -14 29 -181 226 -341 99 -158 202 58 -30 1 20 -129 -87 168 -214 -51 -48 10 -123 -31 -122 30 -109
6692 -109 -62 257 -102 -169 -130 0 53 144 382 -193 -223 -170 10 21 69 2 179 112 39 251 -55 -65 -47 47 162
6717 162 -302 258 92 -96 19 -110 -185 -110 125 410 309 26 -242 -177 -22 -4 343 -208 -198 172 -153 -174
$$ packed form
6549D0k5M3l25L65K4j88J18l92M71k33L6j31J23O7K10j82j54m2K18L4j72M86m99
6572a08J6K89l4J33k24LL85o95p7N22l20K98j24Q5m00l1K07K97j95k65l3J89K25
6595A43q9k03K34nn8o0O9K00l81J0Q8nM9m8l2j43K31K8r8m4pM00m25K57l8O8j05
6622C6Nn1J34j79K8N6K3j3j97Q5lOL13o30L58J53j59K06R0l46r5N2L19k42j31
6647a82L98j57p8k68M84l14Q3L01n23K45J42k34qj08J82K87k89J69l00L74j90
6668A4k8M3k10M07n67M40k57L60j44q8L1J9j49M2K55l82J63LN8j33R2r1J52j39
6692a09M7L19l59o7L9J30N3R1K38n75l0N3J80J1M8o7J77o7p3K12l06j0J8R4J15
6717A62m64N60j66j88J15j29p5P5K35K85j01k83k68O5J55J8L47n51J0L70l25k1
$$ plain form
6739 -174 -100 -110 179 128 104 26 261 259 -168 18 -71 -45 -114 198 65 50 188 -67 -217 37 23 -142 211 -155
6763 -155 -175 46 -374 -200 34 359 -222 199 -269 -40 -62 -99 253 -89 35 -119 -185 227 122 -242 -89
6784 -89 -136 -123 299 -108 64 73 246 27 119 224 -50 154 29 -295 14 -180 41 -86 101 -2 -327 16
6806 16 293 -172 66 56 214 92 -33 -93 7 295 14 15 -277 6 -229 -226 -223 39 20 -30 -4 32 -58 33 232
6831 232 108 81 -176 38 82 27 -144 -127 -80 -155 -204 -12 82 89 -54 -49 185 27 20 88 28 -55 -452 -178 -135 318
6857 318 134 -129 12 -342 84 80 -75 -47 -25 129 40 113 -21 -44 -154 137 -1 144 167 -255 -100 -2 -168
6880 -168 234 -192 239 -109 -246 -11 47 -69 -77 63 80 -70 -328 -14 15 139 -199 -19 -30 43 -142 -147 -149 -125
6904 -125 -351 -253 -150 148 310 -25 -160 -95 -29 235 318 109 44 1 209 167 -31 -48 215 43 79 -28 -29 66
$$ packed form
6739a74P4j0K89n1k4p8K35km27J86q9K6o9L12j33j5J38k55j50K54j4j65L53l66
6763a55k0K21m20J74K34L25n81M21m68K29k2l7L52l42J24j54o6M12j05l64J53
6784h9m7J3M22m07J72RJ73k19R2J05k74K04j25l24L09j94K21j27J87j03l25L43
6806A6K77m65K38j0J58j22j25o0J00K88k81Jk92K83k35LLK62j9n0K6L6r0R1J99
6831B32j24k7k57K14M4n5j71J7M7p5m9J92R4Pj43NK34j58pO8o0q3l97K74M3M53
6857C18j84k63J41l54M26mj55K8K2J54q9P3j34k3j10K91j38J45K3m22J55R8j66
6880a68M02m26M31l48j37K35N8j16qJ40J7j50k58L14K9J24l38J80j1P3j85nkK4
6904a25k26R8J03K98J62l35j35O5O6K64Q3k09o5m3K08m2j98j7K63j72L6j07jR5
$$ plain form
6928 66 279 91 194 -22 -88 -153 -84 -34 -83 93 -122 146 -391 117 -166 -88 -98 84 96 23 -110 -70 26 122
6952 122 -7 41 198 212 83 -130 20 -135 132 63 -230 -100 -277 70 70 92 -52 388 186 -42 324 -5
6974 -5 30 -67 17 60 -28 -196 162 15 -220 296 261 82 -53 155 32 -87 8 -47 140 62 65 -211 161 89 -148
6999 -148 -227 43 199 -25 333 307 280 -152 146 -7 12 137 10 8 65 -207 -231 113 -56 -169 19 230 -46
7022 -46 121 -71 -169 -12 74 -70 164 -210 -57 169 72 13 -199 -51 -219 -19 -42 101 -27 64 104 239 -50
7045 -50 -52 30 -229 153 -33 -67 237 -269 162 -212 -18 15 24 101 -203 -37 -2 -68 -360 -21 68 133 -4 -36 -35
7070 -35 -32 -108 -45 99 -176 -182 -63 -78 -224 -4 -203 -112 176 155 69 -204 22 174 299 195 76 110 8 159
7094 159 282 35 -39 -154 -172 -27 -176 -55 292 -202 -79 247 -127 18 265 84 -273 39 255 30 -113
$$ packed form
6928F6K13j88J03k16o6o5O9N0m9J76k15K68n37N08k83P8j0J82J2p3j33M0R6R6
6952A22j29M8J57J4j29k13J50j55K67o9k93J30j77L47%K2j44M40k02k28L66l29
6974eL5r7Q4M3q8j68L58j47k35N16l5j79j35K08j23j19R5n5J87p8Lk76L72p2k37
6999a48p9K70J56k24L58k6k7m32K98j53J9J25j27kN7k72k4L44j69j13J88K11k76
7022d6J67j92r8J57Q6j44K34l74J53K26r7n9k12J48j68K00k3J43j28R1M0J35k89
7045e0kQ2k59L82j86l4L04n06M31l74J94L3RP7l04J66L5o6k92L39Q9O5j37l2J
7070c5Lp6O3J44k75oJ19j5j46K20j99R1K88k1q6k73K26J52J25j04j19L4j02J51
7094A59J23k47p4j15j8J45j49J21L47m94J23L26l74J45K47j81l57L12K16k25j43
$$ plain form
7115 -113 58 -219 -28 127 -237 -159 -169 -90 -39 -105 -36 231 191 24 -73 -25 -103 -15 -12 304 194 -71 232 21
7139 21 218 -31 -31 -356 -44 -20 -4 206 -135 92 -50 -80 -24 -129 -101 9 194 213 228 -174 -18 -44 107 156
7163 156 277 138 24 31 142 -42 -39 -79 -42 -151 185 30 41 -52 -223 6 296 92 106 -81 18 -119 -138 -83
7187 -83 -108 42 146 -74 109 -64 148 -244 51 178 18 126 79 205 91 -184 40 -57 77 -126 86
7208 86 -55 253 -142 -89 255 150 -293 -137 -177 -118 -168 -37 116 37 -183 -4 -61 -32 81 112 52 -145 -40
7231 -40 89 -95 -284 -5 -62 -131 -38 29 -32 2 -51 132 73 120 -2 -147 163 -95 -26 146 41 -54 77 80 31
7256 31 86 60 209 -47 253 -305 -92 -227 292 115 -52 -16 -11 -116 108 214 -203 182 -218 52 -355 147
7278 147 39 181 19 125 -101 -45 26 3 -117 -44 4 -190 75 194 62 102 30 123 212 -219 -224 -191 194 357
$$ packed form
7115a13J71k77J91J55l64P8j0P9N1o6O9K67m0j67r7M8p8Q8LL16j10k65L03k11
7139B1J97k49%l25L12K4J6K10l41K27j42l0N6j05K8J10J85J9J5m02J56k6J51M9
7163A56J21j39j14PJ11j84Lm0L7j09L36j55J1r3j71K29K90k04J4j87R9j37j9N5
7187h3k5J50J04k20J83j73K12l92K95J27j60J08m7J26j14k75K24r7J34k03K12
7208H6j41L08l95N3L44j05m43J56m0N9n0J31J53p9k20J79n7K9J13L1o0j97J05
7231d0J29j84j89K79n7o9R3O7o1L4n3J83n9M7j22j45L10k58O9J72j05r5J31Lm9
7256C1N5k6J49k56L00n58K13j35N19j77j67L6Nj05K24J06m17L85m00K70m07N02
7278A47j08J42j62J06k26N6P1k3j20P3M8j94K65J19j32M0p2R3Q9m31nL3L85J63
$$ plain form
7302 357 -60 -147 -168 -27 61 -56 -107 4 50 -145 -46 74 72 138 334 124 -251 -242 10 120 -1 298 72 -29
7326 -29 355 -136 80 -73 -126 34 4 51 -106 9 216 166 -231 34 43 138 -35 -204 193 340 -70 12 192
7349 192 -87 65 -230 187 -117 61 36 6 -215 11 476 -61 -179 57 -46 64 271 6 -195 -96 81
7370 81 155 54 -101 -145 -134 -77 243 -24 -2 -265 194 -27 -81 -11 -286 154 310 22 -105 163 -133 -153 -111
7393 -111 60 -66 283 -24 37 -87 93 17 -164 -74 349 32 -25 -191 49 -85 243 188 -59 155 -31 -54
7415 -54 -131 12 -8 63 -21 -332 84 -70 -183 -136 -42 -155 -97 259 -143 130 37 -201 149 -256 -17 22 -46 142
7439 142 -205 0 -100 29 -68 3 195 108 210 -59 -11 198 -46 105 146 18 -31 -92 -42 65 -26 -6 -95 112
7463 112 -170 158 3 62 -62 8 15 -8 -121 300 32 119 12 -267 42 -53 -154 -38 211 10 77 9 -25
$$ packed form
7302C57m17q7k1J41Q8j17n1J11M6j95R9J20kO6J96k10l75RK52J10j21K99k26j01
7326b9L84m91K16j53n3J60l0M7j57J15K07n0l97K65RR5j73j69L97J47m10Q2J80
7349A92k79J52k95M17l04J78k5l0k21K26M65n37j18K36j03J10K07k65k01R9J77
7370H1P4j01j55m4J1N7L20k67K2k63M59k21n4P0k75M40J56k88j27K68k96k0M2
7393a11J71j26L49l07O1j24J80p6j81R0M23l17n7j66K40j34L28n5k47K14j86k3
7415e4p7J43k0P1q4l11M16j54j13M7R4j13N8L56m02K73r3k38L50m05K39L9o8J88
7439A42l47K05j00J29r7P1J92q7J02k69M8K09k44J51M1j28m9o1N0J07r1K0q9K07
7463A12k82L28j55N9j24P0Pk3j13M21k68Q7j07k79L09r5j01J16K49k01O7o8l4
$$ plain form
7486 -25 -5 -123 -38 116 262 -54 -68 -60 -164 2 -69 171 -200 -15 -6 17 46 -97 4 -106 2 9 67 307 -216
7511 -216 -179 -142 -108 -112 155 -53 -38 80 -113 176 132 -46 132 276 -121 139 34 -501 87 -74 57 -148
7533 -148 -230 11 -122 -101 -47 -6 -189 -49 -235 -221 261 247 108 -143 187 -243 -13 -159 84 -64 16 57 71
7556 71 -11 62 -2 -250 359 75 -25 -114 -277 -229 -92 86 55 -39 62 -58 147 -39 -87 -113 -107 -155 16 266
7580 266 199 124 -69 -124 -218 -25 -45 10 -203 68 -195 60 -148 -49 -18 -150 -61 198 111 153 257 -29 118 -38
7604 -38 122 -85 35 150 -40 -148 -64 173 -90 -94 -143 -26 -61 -236 -104 -153 80 -75 140 -316 -88 167
7626 167 -156 -86 122 0 -29 -30 10 9 -4 -234 -40 46 21 88 -4 -48 -238 19 -87 138 103 194 -198 12 185
7651 185 -157 41 -36 -121 290 71 -193 19 -29 -16 -193 0 -85 291 -256 91 304 -52 -11 14 -178 -234 46
$$ packed form
7486b5K0j18Q5J54J46l16j4Qj04J66p1K40l71J85RK3K9j43J01j10J08PN8K40n23
7511b16L7L7L4mK67k08J5J18j93K89m4j78J78J44l97K60j05n35N88j61J31k05
7533a48q2K41j33K1N4M1j83J40j86J4M82j4j39k51L30m30K30j46K43j48Q0M1J4
7556G1q2P3o4k48O09k84j00q9j63M8J37J78l1r4J01j20K05j86m8k6Om8J71K50
7580B66o7p5j93n5r4J93k0N5k13K71k63K55k08R9L1j32Q9K59q7M2J04k86J47j56
7604c8J60k07J20J15j90j08Q4K37k63mm9J17l5j75J32m9K33j55K15m56K28K55
7626A67l23P0K08j22k9jM0jj3k30J94Q6k5O7r2m4j90K57j06K25l5R1l92K10J73
7651A85l42J98p7q5M11k19k64K12m8J3j77J93q5L76n47L47K13l56M1K5j92n6K80
$$ plain form
7674 46 68 -86 27 -16 -26 141 -258 -244 -172 184 -80 156 -120 128 14 -33 412 -248 21 -4 -3 -267 15
7697 15 59 58 44 39 -34 -76 66 -25 331 -108 11 135 224 -17 -62 -129 -28 137 100 -171 -93 -270 91 77 55 -147
7723 -147 119 55 25 112 8 102 -9 -49 39 55 401 15 -376 82 55 -86 178 67 -83 -36 -14 -29 46 -19
7747 -19 -41 117 148 -48 128 -6 86 48 -94 78 -109 -100 431 -340 43 14 -119 -73 -71 -361 102 -161 -146 84
7771 84 67 -64 255 -129 -136 97 23 -32 -48 10 107 129 -80 -33 -93 -123 201 156 17 -4 28 -248 -31 188 -243
7796 -243 -284 -108 340 146 -79 46 -151 76 225 -151 107 -58 -3 -82 172 5 42 61 -12 209 -110 209
7818 209 366 -210 -92 81 -94 88 165 -46 -102 223 -77 -196 -10 58 -208 338 -90 -84 45 77 93 0 113
7841 113 -106 -52 37 -78 8 -49 84 199 -66 144 -123 18 -147 261 -53 -35 -44 203 -54 -124 -310 -137 -23
$$ packed form
7674D6K2j54J13m3j0J67l99J4P2L56k64K36k76K48j14m7M45o60K69k5Jk64K82
7697A5M4jj4np3m2J42r1L56m39J19J24Q9k41m5o7J01J65l7k71P8j77L61j4k2k02
7723a47K66o4l0Q7j04R4j11m0Q8J6L46l86l91M58k7j41K64j11j50M7K2j5P5o5
7747a9k2J58L1j96J76j34R2l8j42J72j87RN31p71L83k9j33M6Kk90M63k63J5K30
7771H4j7j31L19l84pK33p4n5j6N8R7K2k09M7o0l0L24m5j39k1L2k76K17K19m31
7796b43m1J76M48j94k25J25j97K27J49l76K58j65N5p9K54j67L7J9p3K21l19L19
7818B09J57n76J18J73j75J82P7k11n6L25l00j19J86O8k66N46m28OJ29L2J6r3J13
7841A13k19N4Q9j15Q6n7J33J15k65K10k67J41j65M08l14J8rK47k57p0j86J73J14
$$ plain form
7864 -23 70 -19 -38 68 158 236 -263 382 -48 237 -109 -22 -115 5 395 -55 -40 -23 42 -81 108 67 -137 -455
7888 -455 -245 -95 -254 -131 59 -104 33 -109 -190 108 -126 29 187 -76 120 188 155 35 -79 -136 -111 174
7910 174 -94 -102 199 -21 95 -136 -94 -3 79 -121 -57 -23 4 49 153 -10 -60 228 168 -55 40 -138 68 58
7934 58 14 72 -112 -73 -208 17 -49 -144 -114 99 -217 206 33 -45 1 -53 27 -6 -23 -125 141 -254 -12 99
7958 99 1 -46 13 105 -355 81 34 143 -79 30 336 70 20 23 55 67 11 -161 1 42 -50 -43 197 134 -154 -113
7984 -113 -236 -56 36 18 -12 125 126 79 -198 -24 -324 -189 186 -110 -98 49 -295 -246 -242 54 -191 31 316
8007 316 -119 -283 38 170 -11 238 -105 178 147 151 -293 -77 191 199 -6 -77 88 -89 -387 69 81 -125
8029 -125 -51 88 -138 84 -80 -110 80 -208 113 153 132 -189 -122 93 54 -170 -200 -112 -114 -41 230 -185 -100 -156
$$ packed form
7864b3R3q9j9J06R0P8m99O45m30K85l46Q7r3J20L90m50J5J7O5j23J89m1k04l18
7888d55K10J50j59J23J90j63J37j42q1K98k34J55J58k63J96O8l3j20j14n7K5K85
7910A74k68qL01k20J16k31M2R1Q2k00O4L4K7M5J04j63n0K88o0k23R5j78K06j0
7934E8m4N8j84L9j35K25o6r5L0K13l16M23j73p8M6n4Q0l3j7j02K66l95K42J11
7958I9r8m7N9R2m60M36m7J09k22J09L06k66n0LL2J2n6j72J62M1r2PK40o3k88M1
7984a13j23J80R2j8l0J37Jm7k77J74l00J35L75k96J2J47l44M9MK96k45K22K85
8007C16m35j64L21J32j81K49l43K83l1Mm44K16K68Qk05p1J65j77k98M56J2k06
8029a25P4J39k26K22j64l0J90k88L21M0k1l21O7K15l9k24l0Q8kP3K71m15Q5n6
$$ plain form
8053 -156 -273 5 51 -19 79 -78 93 -250 185 -334 41 -17 -109 172 -43 -111 276 -69 -120 135 24 -177
8075 -177 -6 365 199 2 351 -73 -131 292 134 311 -87 -109 108 9 -59 22 102 129 28 55 -17 -311 11
8098 11 98 32 175 64 -317 -66 -92 -49 -5 -53 75 130 -73 77 51 -123 4 -69 54 -124 75 -41 -149
8121 -149 -139 -253 51 -10 -26 63 -8 -281 -77 157 101 149 114 -84 -119 -125 -15 -183 20 -201 -83 10 -40 176
8145 176 88 -132 54 -128 -108 85 317 224 -20 -220 51 -1 -167 7 -85 210 75 124 -249 101 113 -43
8167 -43 -14 -107 196 339 -149 160 -50 -229 83 -17 -49 102 -4 -163 233 226 209 -103 -101 217 209 -372 25 -174
$$ packed form
8053a56j17K78M6p0R8j57J71l43M35n19L75n8r2K81k15o8L87l45n1K55j11k01
8075a77J71L71j66j97L49m24n8M23j58J77l98k2K17r9o8Q1Q0K7j01K7p2k94L22
8098A1Q7o6J43j11l81K51k6M3M4m8J28N5k03J50k6j74J27p3J23j78J99j16j08
8121a49J0j14L04o1j6Q9p1k73K04K34n6M8l5j98l5oJ10j68K03k21J18R3n0K16
8145A76q8k20J86j82K0J93K32r3k44k00K71n2j66J74r2K95j35M9l73L50J2j56
8167d3K9r3L03J43m88L09k10j79L12j00l2J51j06j59L96pj7l12KL18qn81L97j99
8191a74
$$ Imaginary data points
##PAGE= N=2
##DATA TABLE= (X++(I..I)), XYDATA
$$ plain form
0 0 0 0 0 0 0 0 0 0 0 0 0 0 8 -8 8 -8 8 -16 16 -24 24 -32 32 -40 48 -56 64 -76 88 -101 114 -130 150 -168
34 -168 191 -215 240 -270 301 -337 374 -417 461 -510 565 -623 687 -759 837 -920 1015 -1119
52 -1119 1231 -1360 1504 -1663 1847 -2058 2302 -2593 2939 -3363 3903 -4605 5565 -6967 9215
67 9215 -13416 24031 -115911 -159686 -29568 -83440 -46129 15957 54946 57796 84387 72416
79 72416 59663 66100 74287 22906 6536 32475 14562 -35780 -37591 -35421 -36794 -40924 -50761 -52051
93 -52051 -39979 -34003 -20325 -17204 -2387 39700 55248 40166 57081 83293 68913 25274 1570
106 1570 -470 -22241 -51411 -57931 -66484 -59203 -28740 -30616 -34496 12705 43350 28674 26618 47312
120 47312 55414 37127 15240 4474 -6135 -5188 -4245 -27724 -34991 -12130 -10981 -26548 -27813 -18873
$$ packed form
0@%%%%%%%%%%%%Qj6J6j6J6k4L2m0M8n6O4p2Q8j04J20j40J64j89K15k44K80l18
34a68L59m06M55n10N71o38P11p91Q78r71J075j188J310j446J596j757J935k134
52a119K350k591K864l167L510l905M360m895N532o302P266q508J0170j2532J6182
67I215k2631L7447j39942m3775J30118n3872L7311O2086L8989K850K6591j1971
79G2416j2753O437Q187n1381j6370K5939j7913n0342j811K170j373m130r837j290
93e2051J2072N976J3678L121J4817M2087J5548j5082J6915K6212j4380m3639k3704
106A570k040k1771k9170o520q553P281L0463j876l880M7201L0645j4676k056K0694
120D7312Q102j8287k1887j0766j0609R47R43k3479p267K2861J149j5567j265Q940
$$ plain form
134 -18873 -6464 -4966 -8140 7224 25794 31271 31109 23863 24318 30299 15605 -5935 -9906 -7001
148 -7001 -13913 -32788 -36019 -19226 -17188 -22234 -10866 -1076 10752 25744 19922 13862 25175 27571
162 27571 13167 -189 678 4627 -5688 -16118 -15872 -16951 -13150 -10820 -21208 -15551 4994 7667
176 7667 1501 5915 17507 23922 14503 6130 10113 9968 3870 -4004 -13643 -11426 -6666 -15066 -20284
191 -20284 -13065 -3380 669 -3898 293 12825 12225 7707 8914 7176 9080 11419 2434 -3235 1218
206 1218 2525 -5621 -15604 -12517 -4866 -10421 -13809 -6823 -1476 4910 7953 4129 8661 17693 15099
221 15099 6492 2446 5448 4304 -8332 -14007 -9293 -9395 -10809 -9388 -8130 -325 6383 4755 3069
236 3069 5337 10033 9387 846 -370 5779 3212 -1548 -1938 -2401 -137 15 -5911 -7818 -3965 -2113
$$ packed form
134a8873J2409J498l174J5364J8570N477j62p246M55N981j4694k1540l971K905
148g001o912j8875l231J6793K038n046J1368R790J1828J4992n822o060J1313K396
162B7571j4404j3356Q67L949j0315j0430K46j079L801K330j0388N657K0545K673
176G667o166M414J1592O415r419q373L983j45o098p874r639K217M760q400n218
191b0284P219R685M049m567M191J2532o00m518J207j738J904K339q985n669M453
206A218J307q146r983L087P651n555l388O986N347O386L043l824M532R032k594
221A5099q607m046L002j144j2636n675M714j02j414J421J258P805O708j628j686
236C069K268M696o46q541j216O149k567m760l90m63K264J52n926j907L853J852
$$ plain form
252 -2113 -4945 -9690 -3673 4943 1872 924 6641 9600 11120 8536 3498 2787 2486 -2341 -8336 -11585
268 -11585 -7387 -4536 -8806 -7023 224 3093 4414 4449 4030 6471 6587 2767 -836 -1613 1394 716
284 716 -5312 -3434 2147 1523 -1723 -1690 -843 817 -1124 -4587 -4023 -1185 1205 366 -1431 3619 7657
301 7657 4360 2311 2905 2427 645 -3117 -5717 -4582 -3762 -3262 -3703 -3487 1965 5101 2161 1875 4340
318 4340 4276 2157 -1000 -2222 -534 -1105 -2680 -3150 -1724 2252 2035 -1598 456 3579 1522 -1512
334 -1512 -2089 -787 692 -1093 -1646 -178 1130 2567 1578 -680 1200 2546 -427 -2500 -2014 -1003
350 -1003 -446 -2030 -1725 690 1727 2233 1319 93 2617 2335 -1427 -2455 -671 -313 -1560 -2842 -1383
367 -1383 1172 948 451 602 853 2656 1388 -1628 -251 1051 -199 -1210 -1728 143 663 -425 -693
$$ packed form
252b113k832m745O017Q616l071r48N717K959J520k584n038p11l01m827n995l249
268a1585M198K851m270J783P247K869J321L5m19K441J16l820l603p77L007o78
284G16o028J878N581o24l246L3Q47J660j941l463N64K838K390q39j797N050M038
301G657l297k049N94m78j782l762k600J135Q20N00m41K16N452L136k940k86K465
318D340o4k119l157j222J688n71j575m70J426L976k17l633K054L123k057l034
334a512n77J302J479j785n53J468J308J437r89k258J880J346k973k073M86J011
350a003N57j584L05K415J037N06r14j226K524k82l762j028J784L58j247j282J459
367a383K555k24m97J51K51J803j268l016J377J302j250j011n18J871N20j088k68
$$ plain form
384 -693 -302 152 1159 -319 -1678 465 1231 410 -716 -60 1638 1286 -499 -259 349 491 -364 -1448
402 -1448 -1623 583 482 -1553 -1004 500 1496 427 -419 859 1428 907 148 -380 -246 1225 140 -1255
420 -1255 -833 304 -10 -1044 -1213 41 673 -698 -417 209 973 1574 366 -372 986 1100 -234 -1590
438 -1590 -1038 108 -562 -1937 -797 266 525 517 122 698 1560 1043 -224 -270 112 675 -555 -1454 -324
457 -324 582 -150 -99 -111 91 745 79 -1093 -375 387 498 -350 -169 1407 1405 526 283 336 409 72 -1092
478 -1092 -1735 -871 -705 -1266 -1652 -814 1123 788 621 1504 1949 1479 793 -347 -191 84 -584 -1115 -1403
497 -1403 -437 0 -738 -921 -162 453 36 120 -493 318 663 26 97 438 1228 1098 278 -89 1154 565
517 565 -909 -1358 -1069 -1028 -834 -1532 -725 215 919 741 927 1353 1930 1265 297 461 83 35 -912 -1415 -923
$$ packed form
384f93L91M54J007j478j359K143P66q21j126O56J698l52j785K40O08J42q55j084
402a448j75K206j01k035N49J504R96j069q46J278N69n21p59n28J34J471j085j395
420a255M22J137l14j034j69J254O32j371K81O26P64O01j208p38J358J14j334j356
438a590N52J146o70j375J140J063K59ql95N76Q62n17j267m6L82N63j230q99J130
457c24R06p32N1j2K02O54o66j172P18P62J11q48J81J576kq79k43N3P3l37j164
478a092o43Q64J66n61l86Q38J937l35j67Q83M45m70o86j140J56K75o68n31k88
497a403R66M37p38j83P59O15m17Q4o13Q11L45o37P1L41P90j30q20l67J243n89
517E65j474m49K89M1J94o98Q07R40P04j78J86M26N77o65r68J64l78m8r47n03M92
$$ plain form
538 -923 -430 -912 -636 -795 49 792 -68 -27 550 733 322 -71 -9 796 605 286 401 -179 405 -266 -1165
559 -1165 -1044 -332 -636 -1027 -796 -239 274 462 351 787 1149 718 923 -68 -8 291 -541 -969 -714 -797 -192
580 -192 -893 -751 72 22 272 322 -27 551 794 -84 174 601 447 -115 -326 -109 46 -303 -238 -495 -370
601 -370 -122 -139 -683 -333 110 296 352 305 399 716 395 240 -84 21 3 -321 -824 -311 -96 -669 -511 -203
623 -203 -30 151 324 145 645 390 381 320 264 181 343 -245 -558 -106 -50 -483 -474 -85 38 -14 -87 156 205 483
647 483 365 -187 436 525 219 -193 -553 91 224 -126 -310 -212 -342 -80 -185 -217 -318 199 200 -55 246 201
669 201 441 -123 362 474 301 186 -201 -509 -110 -440 -525 -480 -67 121 234 51 265 482 551 294 159
690 159 122 251 77 -416 -101 65 -182 -250 -123 -100 139 -162 -320 -34 141 -18 -45 -14 204 438 4 131
$$ packed form
538i23M93m82K76j59Q44P43q60M1N77J83m11l93O2Q05j91l19J15n80N84o71q99
559a165J21P12l04l91K31N57N13J88j11M36L62m31K05r91O0K99q32m28K55q3O05
580a92p01J42Q23n0K50N0l49N78K43q78K58M27j54n62k11K17J55l49O5k57J25
601c70K48j7n44L50M43J86N6m7R4L17l21j55l24J05j8l24n03N13K15n73J58L08
623b03J73J81J73j79N00k55ro1n6q3J62n88l13M52N6m33RL89J23n2p3K43M9K78
647D83j18n52O23Q9l06m12l60O44J33l50j84R8j30K62j05l2j01N17Jk55L01m5
669B01K40n64M85J12j73j15l87l08L99l30q5M5M13J88J13j83K14K17O9k57j35
690A59l7J29j74m93L15J66k47o8J27K3K39l01j58K86J75j59k7L1K18K34m34J27
$$ plain form
712 131 57 591 324 -404 -110 -355 -298 -262 -346 -305 -31 232 140 -71 222 387 336 94 387 403 -113 -120 -203 215
736 215 -29 -95 -339 12 -61 -233 -248 -220 -46 288 -11 -92 21 -56 56 210 -223 142 91 -70 -264 -35 -112
759 -112 20 -207 -325 -161 26 30 -175 74 243 416 165 290 26 137 82 41 -217 -289 4 -148 -350 -75
781 -75 8 -6 -152 104 -165 140 -78 -138 293 116 91 -63 275 49 205 -88 89 179 227 -167 -466 9 146
804 146 -217 -240 55 15 37 118 -54 150 -7 -153 -475 -3 -100 5 86 9 -150 12 -66 41 64 257 61
827 61 12 21 -199 -26 102 -16 12 405 -45 -242 -165 134 -49 323 -227 281 80 -70 13 -95 -272 285 210
850 210 -140 -95 -44 -308 -120 -89 -14 103 -63 15 -63 -33 435 0 -35 134 128 121 -71 61 186 62 6 95 21
875 21 25 191 -41 193 242 107 165 -86 -264 -20 134 170 222 -99 98 42 -92 212 83 -122 128 -224 79
$$ packed form
712A31p4N34k67p28K94k45N7L6q4M1K74K63r2k11K93J65n1k42K93J6n16pq3M18
736B15k44o6k44L51p3j72j5K8J74L34k99q1J13p7J12J54m33L65n1j61j94K29p7
759a12J32k27j18J64J87Mk05K49J69J73k51J25k64J11n5m1k58p2K93j52k02K75
781g5Q3j4j46K56k69L05k18o0M31j77k5j54L38k26J56k93J77R0M8l94k99M75J37
804A46l63k3K95m0K2Q1j72K04j57j46l22M72r7J05Q1p7j59J62p8J07K3J93j96
827F1m9Rk20J73J28j18K8L93m50j97P7K99j83L72n50N08k01j50Q3j08j77N57p5
850B10l50M5N1k64J88L1P5J17j66P8p8L0M68m35l5J69opj92J32J25j24n6Q9p4
875B1MJ66k32K34M9j35N8k51j78K44J54L6N2l21J97n6j34L04j29k05K50l52L03
$$ plain form
898 79 -71 167 -16 265 -191 -140 32 126 106 -91 -95 -242 113 189 -130 -84 -81 -171 -149 -279 138 -2 -43 -66 -250
923 -250 -117 86 19 21 -196 248 -180 -58 87 -232 -62 -182 -346 134 20 1 -228 82 -242 269 73 -86
945 -86 -142 -36 -60 -399 -20 113 58 -161 9 -246 -19 110 281 21 -377 8 -187 -5 178 -21 -177 -77
967 -77 -228 256 100 243 -58 -223 -49 -80 -199 -126 47 152 138 130 -68 -259 -13 108 -391 -11 204 -158
989 -158 -158 60 -56 246 -137 -14 137 89 169 96 137 -3 -171 82 -46 -89 -116 249 168 45 66 -394 168 -142
1013 -142 117 103 296 91 48 -13 148 -51 -264 184 -40 -315 -40 -133 -120 -98 -46 -69 -2 264 -205 84 -191
1036 -191 -163 -141 119 11 -71 -106 -15 -173 -260 -2 -208 89 -307 150 -84 -8 -190 68 49 22 5 143 11
1059 11 -115 -194 -60 -266 71 -21 -169 5 67 -73 -83 100 162 78 325 -113 -120 127 241 419 -51 -56 -332 82
$$ packed form
898G9j50K38j83K81m56N1J72R4k0j97mj47L55P6l19M6Lr0K2j30M17j40m1k3j84
923b50J33K03o7Kk17M44m28J22J45l19J70j20j64M80j14j9k29L10l24N11j96j59
945h6n6J06k4l39L79J33n5k19J70k55K27J29J71k60l98L85j95J82J83j99j56J00
967g7j51M84j56J43l01j65J74l1j19P3J73J05j4qj98j91K46J21m99L80K15l62
989a58%K18j16L02l83J23J51m8Q0p3M1j40j68K53j28m3k7L65q1j23K1m60N62l10
1013a42K59j4J93k05m3o1J61j99k13M48k24k75K75r3J3K2N2k3O7K66m69K89k75
1036a91K8K2K60j08q2l5R1j58q7K58k06K97l96M57k34P6j82K58j9k7j7J38j32
1059A1j26p9J34k06L37r2j48J74O2j40j0J83O2q4K47m38pK47J14J78m70nk76M14
$$ plain form
1083 82 -246 -111 -136 23 -292 -53 -239 -142 -17 4 83 299 274 116 -315 37 154 28 39 -234 74 -171
1105 -171 75 45 19 -116 163 -75 -72 -78 186 -281 151 -32 -31 116 -13 -97 -85 -226 -19 -158 -35 -78 0 -244
1129 -244 196 143 236 139 23 -55 -392 96 124 14 169 112 10 65 -253 2 -374 -103 29 -227 45 122 37
1152 37 245 85 -69 -56 164 123 196 -150 -40 -19 253 143 41 107 47 103 58 156 53 237 27 82 -165 -167
1176 -167 175 217 158 -123 -193 142 140 190 95 -132 -112 10 -189 -12 -19 -44 -170 111 -131 -231 -213 -123 -27 97 132
1201 132 -175 154 -44 78 -244 394 -91 -98 -133 62 -51 -150 74 -384 273 -121 -276 211 438 12 -322
1222 -322 75 -61 -119 -129 53 -30 79 79 -12 -210 -137 -269 -37 -141 -70 -102 -170 71 -196 4 -157 161 -81
1245 -81 143 55 -155 72 -11 -110 -264 -237 -105 -92 68 -108 -160 -160 -41 -221 143 178 81 -234 -17 10 140 -159
$$ packed form
1083H2l28J35k5J59l15K39j86R7J25K1P9K16k5j58m31L52J17j26J1k73L08k45
1105a71K46l0k6j35K79k38LoK64m67M32j83JJ47j29q4J2j41K07j39J23m3P8k44
1129b44M40n3R3r7j16p8l37M88K8j10J55n7j02N5l18K55l76K71J32k56K72P7q5
1152C7K08j60j54J3K20m1P3l46J10K1K72j10j02O6o0N6m5R8j03J84k10N5k47k
1176a67L42M2n9k81p0L35kN0r5k27K0J22j99J77pk5j26K81k42j00J8R0R6J24L5
1201A32l07L29j98J22l22O38m85pl5J95j13r9K24m58O57l94j55M87K27m26l34
1222c22L97j36n8j0J82q3J09%r1j98P3j32K32j04P1l2o8K41k67K00j61L18k42
1245h1K24q8k10K27q3r9j54K7J32J3J60j76n2%J19j80L64L5r7l15K17K7J30k99
$$ plain form
1269 -159 -209 -85 136 73 -166 -191 -66 19 70 -245 -82 90 -167 -14 -89 73 403 130 128 303 180 -226 -7
1292 -7 -35 225 277 146 2 140 72 330 -91 358 191 -124 -147 -93 113 -235 18 134 -108 52 200 -74
1314 -74 5 -282 324 312 -64 253 369 95 190 -17 -154 -32 16 -84 110 -87 21 148 -38 -111 -199 -59
1336 -59 103 37 -33 40 284 15 33 10 157 -10 25 -176 -115 -126 28 178 230 -185 119 115 -19 84 278 -10
1360 -10 -296 -31 -247 -216 97 197 131 351 -93 188 22 158 247 -112 -184 38 -55 -251 99 -56 -19 -156
1382 -156 75 184 2 -95 31 63 -74 -213 -57 51 -172 -145 140 -13 22 94 -70 114 -45 44 93 69 -23
1405 -23 -113 -69 -178 -208 192 196 99 -33 -81 192 -38 -235 -96 -107 115 -37 99 81 371 212 109 -52 -91 1
1429 1 10 234 157 -163 -103 229 35 67 -263 117 -5 -301 -276 107 85 95 53 61 -28 167 -88 -95 -13 -43 -76 -80 -42
$$ packed form
1269a59n0J24K21o3k39k5J25Q5N1l15J63J72k57J53p5J62L30k73kJ75j23m06K19
1292gk8K60N2j31j44J38o8K58m21M49j67l15k3N4K06l48K53J16k42J60J48k74
1314g4P9k87O06j2l76L17J16k74R5k07j37J22M8j00J94j97J08J27j86p3q8J40
1336e9J62o6p0P3K44k69J8k3J47j67L5k01O1j1J54J50N2m15L04mj34J03J94k88
1360a0k86K65k16L1L13J00o6K20m44K81j66J36Q9l59p2K22r3j96L50j55L7j37
1382a56K31J09j82r7J26L2j37j39J56J08k23K7K85j53L5P2j64J84j59Q9M9k4r2
1405b3r0M4j09l0M00Mr7j32m8K73k30j97J39j1K22j52J36j8K90j59j03j61l9R2
1429ARK24p7l20O0L32j94L2l30L80j22k96K5L83k2J0m2Qq9J95k55pQ2l0l3mL8
$$ plain form
1456 -42 182 -243 -136 55 130 117 -2 132 -99 -117 -281 75 -247 162 -273 -42 130 104 1 102 -192 88
1478 88 -176 -72 -186 104 -244 90 5 -16 137 -36 109 -81 -291 32 120 -132 602 139 -278 254 154
1499 154 -135 114 -103 -179 -4 12 201 -30 -13 -38 185 13 71 -12 154 107 -209 -95 24 -75 108 139 85
1522 85 62 -334 -62 2 132 -158 -51 171 -365 64 -122 -177 -222 106 -130 -164 68 123 6 241 -253 60
1544 60 137 -103 51 148 40 136 -237 72 243 -320 151 -100 -103 140 91 177 -354 6 -310 -65 204 -60 -163
1567 -163 -173 31 77 181 -5 -130 45 11 -58 -102 67 -131 23 173 162 167 15 -343 171 -226 -52 178 235
1590 235 126 35 -17 93 -167 -25 -153 23 244 29 -358 -2 28 120 90 -290 -147 -191 76 -106 139 -360
1612 -360 37 -285 -77 192 -40 135 164 -342 -163 19 -93 40 -231 104 -139 -251 -2 301 -26 -29 49
$$ packed form
1456d2K24m25J07J91P5j3j19J34k31j8j64L56l22M09m35K31J72k6j03J01k94K80
1478H8k64J04j14K90l48L34q5k1J53j73J45j90k10L23Q8k52P34m63m17N32j00
1499A54k89K49k17p6J75J6J89k31J7k5K23j72N8q3J66m7l16J14J19r9J83L1n4
1522H5k3l96K72O4J30k90J07K22n36M29j86n5m5L28k36l4K32N5j17K35m94L13
1544F0P7k40J54R7j08R6l73L09J71n63M71k51lK43m9Q6n31L60l16K45K69k64j03
1567a63j0K04M6J04j86j25J75l4o9m4J69j98J54J50j1Nj52l58N14l97J74K30N7
1590B35j09r1n2J10k60J42j28J76K21k15l87L56L0R2l0l80J43m4K67j82K45m99
1612c60L97l22K08K69k32J75K9n06J79J82j12J33k71L35k43j12K49L03l27lP8
$$ plain form
1633 49 -26 -108 91 -165 88 -158 -82 8 -162 -228 -33 222 114 188 208 -125 -171 37 88 -84 -53 -209 -137 277
1657 277 -129 -153 -69 -248 53 -94 -168 -216 -94 190 -128 -103 -26 140 -172 -94 -19 -111 -54 270 105 -228 140
1680 140 -176 -283 -44 102 224 -126 -119 -122 99 34 376 -191 -21 -268 -150 56 -231 273 231 62 -29 416
1702 416 60 160 90 268 236 28 -230 -12 4 -79 -15 88 -20 152 -46 -74 -48 -38 -151 -2 -97 -194 195
1725 195 -209 -19 -91 45 201 -19 104 167 134 304 6 64 -76 60 -80 96 -42 65 7 24 43 -65
1747 -65 37 -145 -98 -85 -102 96 185 15 32 -52 -220 65 78 -203 71 -38 -269 -198 -59 57 34 -168 -55
1770 -55 -55 18 169 114 -155 -17 -162 -152 319 -159 -54 202 -76 3 47 -256 -127 -14 98 393 -298 84 445
1793 445 -113 -8 -155 47 134 242 -7 -169 -11 -10 126 -25 -71 -22 184 113 106 -162 33 -257 94 -174 232
$$ packed form
1633D9p5q2J99k56K53k46P6R0j70o6J95K55j08P4K0l33m6K08N1j72L1j56P2M14
1657B77m06k4Q4j79L01j47p4m8J22K84l18K5P7J66l12P8P5r2N7L24j65l33L68
1680A40l16j07K39J46J22l50PlK21o5L42n67J70k47J18K06k87N04m2j69r1M45
1702D16l56J00p0J78l2k08k58K18J6q3O4J03j08J72j98k8K6J0j13J49r5r7L89
1725A95m04J90p2J36J56k20J23O3l3J70k98N8j40J36j40J76j38J07n8J7J9j08
1747f5J02j82M7J3j7J98Q9j70J7q4j68K85J3k81K74j09k31P1J39J16k3k02J13
1770e5%P3J51n5k69J38j45J0M71m78J05K56k78P9M4l03J29J13J12K95o91L82L61
1793D45n58J05j47K02Q7J08k49j62J58JJ36j51m6M9K06p1pk68J95k90L51k68M06
$$ plain form
1816 232 -190 -46 93 -90 -52 11 -146 -224 -244 -16 -67 -353 124 -48 -91 -70 202 -99 261 80 230 174 -213
1839 -213 37 196 195 -15 125 182 89 -94 -160 156 6 116 122 -70 40 -184 54 90 138 30 29 -309 -7 -57
1863 -57 -42 -189 -144 -189 105 -59 -27 -42 -92 -38 89 309 -299 251 -230 -113 -61 -41 -17 -43 42 33 76 -96 -36 -65
1889 -65 -54 102 -44 1 151 -111 -163 117 239 -90 23 166 -44 -41 156 -111 -26 -156 34 32 103 35 -57 128
1913 128 -246 194 -63 -41 232 -107 59 305 143 -147 -137 170 -22 -55 -108 -51 104 -307 -30 59 8 -131
1935 -131 264 22 57 -45 97 16 203 -16 -49 110 -111 11 -1 -40 -258 -39 -110 9 203 -92 -3 -112
1957 -112 -44 97 -78 134 194 -162 256 -42 251 231 90 12 -1 21 242 -224 87 -278 23 150 -35 -149
1979 -149 -237 5 62 151 87 233 64 59 -130 206 -83 245 -76 -15 -254 -72 -279 98 -12 46 -142 90 -77
$$ packed form
1816B32m22J44J39j83L8O3j57p8k0K28n1k86M77j72m3K1K72l01L60j81J50n6l87
1839b13K50J59jk10J40N7r3j83o6L16j50J10Oj92J10k24K38L6M8j08jl38L02n0
1863e7J5j47M5m5K94j64L2j5n0N4J27K20o08N50m81J17N2K0K4k6Q5rM3j72O0k9
1889f5J1J56j46M5J50k62n2K80J22l29J13J43k10LJ97k67Q5j30J90kP1o8r2J85
1913A28l74M40k57K2K73l39J66K46j62k90J0L07j92l3n3N7J55m11K77Q9n1j39
1935a31L95k42L5j02J42q1J87k19l3J59k21J22j2l9k18K19p1J19J94k95Q9j09
1957a12O8J41j75K12O0l56M18k98K93k0j41p8j3K2K21m66L11l65L01J27j85j14
1979a49q8K42N7Q9o4J46j69nj89L36k89L28l21O1k39J82k07L77j10N8j88K32j67
$$ plain form
2002 -77 49 82 196 -25 206 -186 -41 18 143 122 -46 281 280 35 354 113 -45 84 375 -24 -232 129
2024 129 7 55 -11 107 209 90 189 60 206 -53 160 187 76 -141 -20 -25 -32 58 107 -39 101 5 54 15
2048 15 -106 164 -206 -105 88 24 16 55 -238 -249 -20 -88 -102 -23 -124 147 -12 86 8 -81 -181 162 -105 95
2072 95 203 -54 74 -101 130 -408 -1 52 -186 56 89 -18 16 -153 11 -232 73 28 -264 -65 79 114
2094 114 31 199 -210 -64 -328 -222 -218 29 92 -174 -194 84 55 -7 -243 81 2 -280 -91 -246 126 -34 -129
2117 -129 -91 -108 87 67 28 96 -131 213 106 -24 -306 -269 101 158 124 -34 -30 197 -24 -196 -41 -1 -249 -294
2141 -294 -36 -83 -43 -100 -53 33 -209 82 -32 230 -127 -14 49 204 91 25 -42 -132 -59 -77 -369 8 7 -15 61
2166 61 16 -479 -187 212 -160 -353 243 -1 90 312 -122 155 -55 315 -58 -248 107 -163 40 218 309
$$ packed form
2002g7J26L3J14k21K31l92J45N9J25k1j68L27jk45L19k41j58J29K91l99k08L61
2024A29j22M8o6J18J02j19R9j29J46k59K13K7j11k17J21npR0M9j46J40r6M9l9
2048A5j21K70l70J01J93o4qL9k93j1K29o8j4P9j01K71j59R8p8q9j00L43k67K00
2072I5J08k57J28j75K31n38M07N3k38K42L3j07L4j69J64k43L05m5k92J99J44L5
2094A14q3J68m09J46k64J06MK47O3k66k0K78k9o2k36L24p9k82J89j55L72j60r5
2117a29L8j7J95k0l9O8k27L44j07j30k82L7L70N7l4j58MK27k21j72J55M0k48m5
2141b94K58m7M0n7M7Q6k42K91j14K62l57J13O3J55j13o6o7r0P3j8k92L77jk2P6
2166F1m5m95K92L99l72j93N96k44R1K22m34K77k10L70l73j90L55k70K03J78R1
$$ plain form
2187 309 101 -228 72 156 -104 22 75 99 -9 10 -35 -130 68 162 -55 -98 77 47 83 36 -251 116 8 4
2211 4 117 93 188 61 201 54 259 274 -133 -76 -70 -31 -79 118 -192 150 -31 -153 -23 193 -139 97 74 -316
2235 -316 104 18 -235 -52 22 -41 -188 297 -33 178 -29 85 47 31 40 -92 -62 -113 322 184 -45 -93 66
2258 66 90 13 -66 44 67 72 -132 110 185 84 154 -99 81 176 42 -196 2 44 217 -35 81 -15 -68 -124 -2
2283 -2 14 -33 -153 -58 -124 127 -221 -343 181 50 104 -155 67 209 -133 20 -100 -20 123 8 -192 -336 246
2306 246 -108 108 -208 -269 113 76 -44 -29 -21 80 183 22 60 -16 247 -220 -82 66 307 -169 29 195
2328 195 -8 139 97 35 -80 38 83 -7 41 134 199 63 192 -392 160 107 122 104 -60 -274 -25 89 -89
2351 -89 70 -53 130 4 -241 109 237 -220 9 245 29 -159 -242 212 129 -134 -5 -119 -38 -9 68 80
$$ packed form
2187C09k08l29L00Q4k60J26N3K4j08J9m5r5J98R4k17m3J75l0L6m7k87L67j08m
2211DJ13k4R5j27J40j47K05J5m07N7OL9m8J97l10L42j81j22J30K16l32K36k3l90
2235c16M20q6k53J83P4o3j47M85l30K11k07J14l8j6Rj32L0n1M35j38k29m8J59
2258F6K4p7p9J10K3Nk04K42P5j01P0k53J80R5j34k38J98M2J73k52J16r6n3n6J22
2283bJ6m7j20R5o6K51l48j22N24j31N4k59K22J42l42J53j20Q0J43j15k00j44N82
2306B46l54K16l16o1L82l7j20J5QJ01J03j61L8p6K63m67J38J48K41m76J98J66
2328A95k03J47m2o2j15J18M5r0M8R3O5j36J29n84N52n3J5j8j64k14K49J14j78
2351h9J59j23J83j26k45L50J28m57K29K36k16j88q3M54q3k63J29j14Q1K9P7J2
$$ plain form
2373 80 -147 -52 57 197 138 204 117 47 -354 -187 -156 -78 -86 260 -166 86 -168 79 -9 36 25 -123 -83 -12 3
2398 3 164 -91 -184 -132 -53 278 -203 104 97 129 -15 -12 -19 107 156 -6 -21 0 304 -104 -138 0 91 109 78 169 56
2425 56 216 2 -1 109 -34 -53 103 132 156 66 31 -178 98 64 151 135 -46 169 -182 217 -123 -146 -44 36
2449 36 -80 -77 -131 140 -110 213 221 83 -2 -23 21 174 95 117 -72 -64 127 3 -165 -139 91 157 175 91 -54 117
2475 117 -39 -148 132 -240 -132 -16 -47 32 39 82 -275 -216 204 -78 -34 204 159 176 -18 169 -152 -45 20
2498 20 -92 11 -83 -48 -63 -65 -169 -88 75 349 -221 -102 197 -48 12 76 126 93 -233 25 28 379 173 84 -140
2523 -140 -36 -145 -309 -203 22 128 -7 -35 100 -59 119 141 -176 63 223 259 -21 17 125 -237 -32
2544 -32 -53 -36 222 -64 -25 52 236 -31 2 -89 181 216 142 80 -139 179 121 -130 -112 84 -34 -70 -56 -219 -62
$$ packed form
2373H0k27R5J09J40n9O6q7p0m01J67L1P8qL46m26K52k54K47q8M5j1j48M0P1J5
2398CJ61k55r3N2P9L31m81L07pL2j44LpJ26M9j62j5K1L04m08l4J38R1J8l1R1j13
2425E6J60k14lJ10j43j9J56K9K4r0l5k09K76l4Q7j6j81K15l51L99l40k3J02Q0
2449C6j16Ln4K71k50L23Qj38q5k1M4J53p9K2j89QJ91j24j68K6K30O6J8q4j45J71
2475A17j56j09K80l72J08J16l1P9PM3l57N9M20k82M4K38m5J7j94J87l21J07O5
2498B0j12J03r4L5j5kj04Q1J63K74n70J19K99k45O0O4N0l3l26K58LL51k06q9k24
2523a40J04j09j64J06K25J06j35k8J35j59J78K2l17K39J60L6k80L8J08l62K05
2544c2k1J7K58k86L9P7J84k67L3r1K70L5p4o2k19L18n8k51J8J96j18l6J4j63J57
$$ plain form
2569 -62 110 407 48 304 66 -209 -7 199 97 99 -272 11 -62 -68 104 157 -46 2 -212 -217 157 -375 -99
2592 -99 -296 21 160 180 464 128 18 72 -9 43 -73 337 42 -63 109 100 373 -239 31 113 -18 -268 43
2615 43 105 -82 -313 369 -190 187 255 -115 -97 73 85 142 194 321 -42 -23 25 71 -177 202 -145 -160 25 -43
2639 -43 -118 96 -126 -9 35 -40 -117 -123 128 -83 50 12 -264 -87 -82 -84 21 -131 -83 14 135 -100 110 -20 -74
2664 -74 -31 -54 -81 -313 225 41 -160 -27 329 -134 -86 0 210 121 40 122 114 56 -172 -190 -112 -56 211 295 54
2689 54 69 -40 330 -44 -258 -157 -109 -40 -109 121 -15 20 14 -13 16 13 98 175 -38 -148 11 131 -25 405 -84
2714 -84 -351 267 -8 36 -171 -239 79 55 -70 -234 -109 -31 139 167 8 -15 -160 58 31 -115 216 137 60
2737 60 230 -108 -10 211 -96 215 -104 -92 124 175 238 -3 -166 147 265 -146 27 -287 119 223 -180 33
$$ packed form
2569f2J72K97l59K56k38k75K02K06j02Kl71K83p3oJ72N3k03M8k14nL74n32K76
2592i9j97L17J39K0K84l36j10N4q1N2j16M10k95j05J72rK73o12K70Q2j31k50L11
2615D3O2j87k31O82n59L77O8l70J8J70J2N7N2J27l63J9M8M6k48L79l47j5J85o8
2639d3p5K14k22J17M4p5p7oK51k11J33l8k76J77NkJ05j52M8R7J21k35K10j30n4
2664g4M3k3k7k32N38j84k01J33L56m63M8Q6K10q9q1Q2qn8k28j8P8N6K67Q4k41
2689E4J5j09L70l74k14J01M8O9o9K30j36L5ok7K9lQ5P7k13j10J59J20j56M30m89
2714h4k67O18k75M4k07o8L18k4j25j64J25P8J70K8j59k3j45K18k7j46L31p9p7
2737F0J70l38R8K21l07L11l19J2K16N1O3k41j63L13J18m11J73l14M06J04m03K13
$$ plain form
2759 33 -84 99 -282 98 -33 66 59 -1 74 -76 -170 21 174 -289 -144 133 22 4 66 67 -13 115 -328 -138
2783 -138 -116 -43 -220 -150 -121 -46 -206 -102 20 84 43 8 67 -31 6 -9 -208 20 -48 -261 62 -44 -147 -29
2807 -29 -60 109 34 -41 -27 134 112 -198 135 37 -79 -100 168 10 -59 11 -54 147 40 38 275 9 3 -98 178
2832 178 -126 1 -61 7 68 -88 -102 -106 126 43 -42 137 165 -112 -103 -127 227 63 -55 16 112 123 -130 96 323
2857 323 160 -113 -211 -16 206 264 189 225 -217 166 47 -111 91 -152 49 173 -161 63 441 -258 -71
2878 -71 27 -39 11 97 155 20 165 16 88 -38 -213 -61 -55 194 -63 -62 164 109 -93 20 82 -153 -109 106 -32
2903 -32 -173 267 163 171 49 -94 -236 204 -2 -386 -174 -260 -237 -105 -73 3 -72 -135 -166 -64 -345 150 -74
2926 -74 135 220 -106 -215 29 -162 -11 -8 -7 -56 -159 195 36 -53 -227 7 6 145 -70 -172 110 -31 57 82
$$ packed form
2759C3j17J83l81L80j31R9po0P5j50r4J91J53m63J45K77j11j8O2Jq0J28m43J90
2783a38K2P3j77P0K9P5j60J04J22O4m1l5N9r8L7j5j99K28o8k13L23j06j03J18
2807b9l1J69p5p5J4J61k2l10L33r8j16k1K68j58o9P0o5K01j07kK37k66oj01K76
2832A78l04J27o2O8O1j56j4mK32q3q5J79K8k77Rk4L54j64j18P1R6J1k53K26K27
2857C23j63k73r8J95K22N8p5L6m42L83j19j58K02k43K01J24l34K24L78o99J87
2878g1R8o6N0Q6N8j35J45j49P2j26j75J52OK49k57JK26n5k02J13O2k35M4K15j38
2903c2j41M40j04Qj22j43j42M40k06l84K12q6K3J32L2P6p5o3l1J02k81M95k24
2926g4K09Q5l26j09K44j91J51LJm9j03L54j59q9j74K34jJ39k15j02K82j41Q8K5
$$ plain form
2950 82 135 216 70 -39 -107 27 -105 -178 13 77 -108 79 125 6 -68 83 120 138 107 111 -82 -3 116 -248 -146
2975 -146 115 327 90 0 78 18 162 37 -166 223 90 -145 -123 42 -196 -15 -89 260 18 -238 -48 35
2997 35 -266 223 116 -42 191 36 -319 18 133 -58 152 41 -196 41 138 -81 69 -66 -383 145 -21
3018 -21 -95 16 -135 296 127 -187 -63 -102 -101 -29 -324 -213 -17 -113 -3 206 128 80 -260 -235 80 33 22 209
3042 209 -354 51 -76 -211 193 203 340 212 -79 -21 -180 47 285 -100 -16 118 32 -112 -200 -4 65 -75
3064 -75 242 64 -26 -193 -319 -51 106 -306 21 -109 142 -71 -116 20 128 -26 -258 37 -216 88 -106
3085 -106 -21 59 -198 85 50 161 -117 14 18 -33 137 40 132 -50 80 -171 43 -22 -3 129 8 -213 85
3108 85 -48 -115 100 -27 -171 -71 -383 -30 8 72 -21 -31 -237 -29 -89 83 87 55 -93 -131 -160 41 -7 67 -129
$$ packed form
2950H2N3Q1j46j09o8J34j32p3J91O4j85J87M6j19p4J51L7J8l1Mj93P9J19l64J02
2975a46K61K12k37r0P8o0J44j25k03L89j33k35K2J65k38J81p4L49k42k56J90Q3
2997C5l01M89j07j58K33j55l55L37J15j91K10j11k37K37R7k19J50j35l17N28j66
3018b1p4J11j51M31j69l14J24l9JP2k95J11J96r6J10K09p8m8l40K5L15m7j1J87
3042B09n63M05j27j35M04J0J37j28k91N8j59K27K38l85Q4J34q6j44q8J96O9j40
3064g5L17j78r0j67j26K68J57m12L27j30K51k13m5J36J08j54k32K95k53L04j94
3085a06Q5Q0k57K83l5J11k78J31Mn1J70r7R2j82J30k51K14o5J9J32j21k21K98
3108H5j33o7K15j27j44J00l12L53L8O4r3j0k06K08o0J72Ml2j48l8k9K01m8P4j96
$$ plain form
3133 -129 -37 123 -52 -155 38 261 -155 162 -135 118 235 -78 -206 133 -36 220 39 2 73 16 337
3154 337 106 -150 96 -21 -52 76 -177 -124 12 -225 -89 -242 -29 513 36 -125 -76 51 -248 155 198
3175 198 232 -20 133 5 106 4 -129 -21 38 163 173 247 -11 -112 -289 99 63 -218 -122 64 42 72 175
3198 175 -121 -186 -40 -89 -86 121 -107 96 42 -50 10 89 1 75 -187 -244 54 -285 402 -160 3 162 -201 -94
3222 -94 -61 101 39 129 -119 -91 -19 66 -51 7 119 156 -20 149 135 -15 -70 112 -113 -107 -103 324 67 22 42 59
3248 59 260 -208 119 -115 97 240 -225 -63 -87 -83 2 -37 192 63 -153 -92 102 149 182 -167 -189 5 -58 67
3272 67 73 -10 -81 206 126 174 21 54 88 194 255 46 -182 -11 143 -56 -116 -171 42 -199 -35 -147 -182 -222 -261
3297 -261 -128 152 -13 252 112 109 111 -95 98 -134 -304 187 19 87 15 -158 -15 43 -37 318 95 4 134
$$ packed form
3133a29R2J60j75j03J93K23m16L17k97K53J17l13j28L39j69K56j81l7P1n7L21
3154C37k31k56K46j17l1J28k53N3J36k37J36j53K13N42m77j61M9J27k99M03M3
3175A98L4k52J53j28J01j02j33J08N9J25J0P4k58j01j77L88l6k81R6J86k2L0J03
3198A75k96o5J46m9LK07k28K03n4r2O0P9q8P4k62n7K98l39O87n62J63J59l63J07
3222i4L3J62o2R0k48K8P2Q5j17N8J12L7j76J69j4j50n5J82k25OMM27k57m5K0J7
3248E9K01m68L27k34K12J43m65J62k4MQ5l9K29j29k16O1J94M7L3l49k2J94o3J25
3272F7Oq3p1K87q0M8j53L3L4J06O1k09k28J71J54j99o0n5K13k41J64j12l5m0l9
3297b61J33K80j65K65j40lKk06J93k32j70M91j68O8p2j73J43N8q0L55k23r1J30
$$ plain form
3320 134 -54 60 -53 -45 -142 -91 135 56 116 209 -190 -28 -56 -103 100 -39 -90 -93 66 -102 148 -180 -65 -106
3344 -106 44 -109 -1 89 107 99 -42 101 57 98 84 38 100 -25 -142 13 55 200 -12 189 62 -419 -50
3367 -50 178 -156 87 -149 128 -144 -16 -9 -238 6 4 40 -19 396 207 -277 47 82 25 -318 -14 99 107 55
3391 55 258 -108 79 87 250 -140 78 128 -108 -87 157 -223 -75 102 -209 265 -41 -8 200 -198 130 -116
3413 -116 -163 -215 175 79 320 113 50 -25 38 46 -16 128 -392 56 -22 23 -65 122 -183 -109 -21 141 103 119 37 -294
3439 -294 -205 -13 -164 -2 -28 33 107 197 80 99 22 -270 -158 -98 166 109 95 -226 -78 88 -340 91 316
3462 316 92 213 88 79 98 261 31 63 95 -42 -2 52 220 98 -139 -79 30 -107 103 -25 395 10 -20
3485 -20 187 -89 -194 -206 78 102 -72 154 45 -93 231 110 143 -255 -27 -31 -182 -42 -42 -45 54 125 247 -145
$$ packed form
3320A34j88J14j13Qr7N1K26p9O0R3l99J62k8m7K03j39n1lJ59j68K50l28J15m1
3344a06J50j53J08R0J8qj41J43m4M1j4m6O2j25j17J55M2J45k12K01j27m81L69
3367e0K28l34K43k36K77k72J28Pk29K44kL6n9M15j89m84L24L5n7l43L04J13Qn2
3391E5K03l66J87QJ63l90K18N0k36K1K44l80J48J77l11M74l06L3K08l98L28k46
3413a16m7n2L90r6K41k07o3p5O3Qo2J44n20M48p8M5q8J87l05P4Q8J62l8J6q2l31
3439b94Q9J92j51J62k6O1P4R0j17J9p7k92J12O0K64n7j4l21J48J66m28M31K25
3462C16k24J21j25rJ9J63k30L2L2j37M0N4J68j22k37O0J09j37K10j28M20l85l0
3485b0K07k76j05j2K84K4j74K26j09j38L24j21L3l98K28mj51J40%lR9P1J22l92
$$ plain form
3509 -145 -285 82 157 124 413 3 50 -148 61 -61 -17 42 209 119 106 62 -107 -36 124 147 -243 -214 -129 -334
3533 -334 19 65 231 -1 57 -673 -41 -6 24 -8 -5 331 243 -10 -2 -240 -92 -23 -50 -110 89 117 65 77 9 -3
3559 -3 147 -92 -95 17 -71 -141 225 82 176 65 -158 -139 -81 -62 147 -91 -83 157 -41 -158 -8 -88 -12 10 -109
3584 -109 61 188 -92 -124 301 165 -11 -16 -10 87 -142 25 -177 -311 -32 -11 5 -99 -76 209 16 -9 -12 -181
3608 -181 -109 126 124 52 -180 73 139 238 -147 -74 -61 -140 297 8 -85 214 -15 23 -153 41 184 137 80 247
3632 247 -280 -18 -251 -39 -19 156 71 69 78 8 -257 -9 60 63 -129 137 31 -233 -121 107 -143 91 164 38
3656 38 -152 -71 -259 6 -156 24 -208 -152 79 84 97 -743 52 -45 40 133 -87 143 148 -136 -116 318 -1 -65
3680 -65 239 198 -106 -89 63 -63 -46 155 -73 -19 34 -140 -41 -172 326 -56 -6 -33 -174 -225 116 159 -48 68
$$ packed form
3509a45j40L67P5l3K89m10M7j98K09j22M4N9J67r0j3m4j69P1J60K3l90K9Q5k05
3533c34L53M6J66k32N8p30O32L5L0l2LL36q8k53Qk38J48O9k7o0J99K8n2J2o8j2
3559cJ50k39lJ12q8p0L66j43R4j11k23J9N8J9K09k38QK40j98j17J50q0P6K2j19
3584a09J70J27k80l2M25j36j76nOR7k29J67k02j34K79K1J6j04K3K85j93k5lj69
3608a81P2K35kp2k32K53O6R9l85P3J3p9M37k89r3K99k29L8j76J94J43m7n7J67
3632B47n27K62k33K12K0J75q5kRp0k65K48O9Lj92K66j06k64J12K28k50K34P3j26
3656C8j90Q1j88K65j62J80k32N6K31NJ3q40P95r7Q5R3k20K30Nk84K0M34l19o4
3680f5L04m1l04J7J52j26J7K01k28N4N3j74R9j31M98l82N0k7j41n1L41M3k07J16
$$ plain form
3704 68 52 -62 71 -149 -392 -140 192 -47 54 47 175 -1 -171 -36 0 350 184 11 85 -40 -15 156
3726 156 -122 5 -127 -75 -225 181 138 -61 -155 25 169 84 -61 -90 -95 -13 182 -197 121 -169 48 -227 267
3749 267 -73 -27 -149 -120 -33 -254 13 -338 77 122 190 -48 -10 49 59 276 41 -32 233 98 -112 169 124
3772 124 -113 -137 415 86 241 -27 -52 151 -88 -149 -127 -107 -82 -117 1 -98 185 38 -144 -193 22 -179 -42
3795 -42 -120 56 -37 125 -29 130 -100 -43 -179 -72 153 43 60 -372 -86 32 65 -146 56 -294 54 -93
3817 -93 -160 26 -63 46 -219 72 -232 -279 -229 49 -72 243 53 -89 -53 -19 -51 62 -52 197 -138 52 21
3840 21 51 31 -29 -111 76 -35 1 280 -83 -15 -153 -171 -55 -12 -3 -229 101 -153 -17 37 45 -62 -112 33 -149
3865 -149 -81 -40 -139 165 -2 -27 -172 -33 -203 -286 -278 -162 -49 225 -106 -7 102 -25 -94 126 71 232 98
$$ packed form
3704F8j6j14J33k20k43K52L32k39J01pJ28j76j70J35L6L50j66j73P4j25K5J71
3726A56k78J27j32N2j50M06m3j99r4J80J44q5j45k9nQ2J95l79L18k90K17k75M94
3749B67l40M6j22K9Q7k21K67l51M15M5O8k38L8N9J0K17k35p3K65j35k10K81m5
3772A24k37k4N52l29J55k68k5K03k39o1K2K0K5l5J18r9K83j47j82m9K15k01J37
3795d2p8J76r3J62j54J59k30N7j36J07K25j10J7m32K86J18L3k11K02l50L48j47
3817i3o7J86q9J09k65K91l04m7N0K78j21L15j90j42L6L4l2J13j14K49l35J90l1
3840B1L0k0o0q2J87j11L6K79l63O8j38j8J16M3Rk26L30k54J36N4Qj07n0J45j82
3865a49O8M1r9L04j67k5j45J39j70q3QJ16J13K74l31R9J09j27o9K20n5J61j34
$$ plain form
3888 98 3 88 -25 118 -198 37 123 5 51 126 56 225 154 -104 50 -126 -39 129 26 66 -19 -10 56 85 -27
3913 -27 -247 174 12 92 -161 76 142 46 111 -81 -78 64 144 301 -32 -56 148 107 74 -136 141 -23 170 -28
3937 -28 51 92 -232 -77 -103 -82 55 141 -273 -11 -102 -33 -110 -238 -206 -66 -84 141 216 -70 -85 -139 14 -80 -157
3962 -157 -98 -313 -143 -5 -162 193 -421 -287 -211 -79 87 318 -99 67 55 -42 127 10 191 32 -32 111
3984 111 478 130 -94 -110 169 226 45 28 23 39 35 -89 -47 242 240 182 -62 -3 -63 238 82 -29 61 -129 -77
4009 -77 -118 -45 74 -262 206 92 68 94 373 25 -332 -54 -69 241 -398 247 62 266 179 -63 -354 -3
4031 -3 -46 122 265 -129 -45 -105 68 -79 9 20 46 -86 125 39 -20 75 -80 132 137 227 80 -198 -141 -157 -57
4056 -57 199 164 -269 -30 287 -186 89 -147 -13 125 -26 11 -132 130 176 243 -139 2 -44 49 37 -72 -84
$$ packed form
3888I8r5Q5j13J43l16K35Q6j18M6P5p0J69p1k58J54j76Q7J68j03M0q5RO6K9j12
3913b7k20M21j62Q0k53K37O6r6O5j92LJ42Q0J57l33k4K04m1l3k10K77j64J93j98
3937b8P9M1l24J55k6K1J37Q6m14K62r1O9p7j28L2J40j8K25P5k86j5n4J53r4p7
3962a57N9k15J70J38j57L55o14J34P6J32J66K31m17J66j2r7J69j17J81j59o4J43
3984A11L67l48k24j6K79N7j81j7nJ6mj24M2K89kn8k44N9o0L01j56j11R0j90N2
4009g7m1P3J19l36M68j14k4K6K79l48l57K78j5L10o39O45j85K04q7k42k91L51
4031cm3J68J43l94Q4o0J73j47Q8J1K6j32K11q6n9R5j55K12NR0j47k78N7j6J00
4056e7K56l5m33K39L17m73K75k36J34J38j51L7j43K62M6O7l82J41m6R3j2j09j2
$$ plain form
4079 -84 -196 167 191 19 99 -46 -69 14 -87 218 -56 -48 -307 -224 -191 193 -62 -48 -41 -62 50 204 78 64 189
4104 189 -294 -53 -68 147 -224 139 98 -90 -65 -51 27 -294 -187 -100 -316 -129 14 97 253 300 -53 -39 -257
4127 -257 135 -79 -192 45 -14 2 -123 240 -134 -95 -159 6 -88 -113 128 -52 -12 -115 155 242 -122 -286 5
4150 5 -51 30 9 -152 149 72 126 268 269 110 252 25 -98 287 -52 -29 -23 135 -279 226 -80 -310 -44 -40 -42
4175 -42 -1 115 217 -1 0 -88 -116 100 -170 -5 -29 -173 -68 82 277 -26 -4 -94 19 240 190 -11 -304
4198 -304 -264 -31 3 -26 189 -288 175 186 111 85 92 31 -29 -131 -246 -211 104 104 247 -27 92 194 56 122 -29
4223 -29 180 114 75 112 65 26 44 -205 -135 -67 -63 18 -201 179 31 -182 -164 -259 161 113 50 22 165 -63 -3 -128
4249 -128 -184 45 -141 176 262 479 -222 173 421 167 -94 290 -69 -151 -58 42 264 -231 80 -122 -50 -230
$$ packed form
4079h4j12L63K4j72Q0j45k3Q3j01L05k74Qk59Q3L3L84k55J4Pk1J12J54j26j4J25
4104A89m83K41j5K15l71L63m1j88K5J4P8l21J07Q7k16J87J43Q3J56M7l53J4k18
4127b57L92k14j13K37n9J6j25L63l74L9o4J65r4k5K41j80M0j03K70Q7l64j64K91
4150En6Q1k1j61L01p7N4J42Jj59J42k27j23L85l39K3OJ58m14N05l06k30K66Mk
4175d2M1J16J02k18Jq8k8K16k70J65k4j44J05J50J95l03K2r0J13K21n0k01k93
4198c04M0K33L4k9K15m77M63J1p5k6Po1o0j02j15L5L15%J43k74J19J02j38O6j51
4223b9K09o6l9L7m7l9J8k49P0O8MQ1k19L80j48k13J8r5M20m8o3k8J43k28O0j25
4249a28n6K29j86L17Q6K17p01L95K48k54k61L84l59q2R3J00K22m95L11k02P2j80
$$ plain form
4271 -230 233 -299 -156 -164 -168 121 -19 -6 -143 -189 87 19 -89 38 108 190 -204 127 -31 83 215 18 168
4294 168 24 16 -190 23 -114 -167 119 -222 130 -66 -16 82 42 76 -133 -151 148 -33 270 -174 -223 -164 -30
4317 -30 -16 124 51 -202 95 45 -144 2 -94 23 -71 -354 -354 -150 -20 258 -90 99 -15 -68 -203 52 -66
4340 -66 -215 69 -169 147 -169 57 -48 160 -27 -149 149 89 132 257 -34 67 64 120 -133 -59 -159 -9
4362 -9 44 -70 -227 -7 100 -79 49 -87 -77 22 -130 -49 28 49 54 57 -142 124 26 0 -107 -92 -160 -218 140 -49
4388 -49 -331 176 59 -82 26 250 -86 -25 -117 3 18 150 -45 278 -30 54 64 -55 166 -172 -31 100
4410 100 -236 146 -110 -162 -58 -248 26 -120 -54 -202 -34 -55 17 98 -101 37 218 55 -31 203 296 265 -114
$$ packed form
4271b30M63n32J43qmK89j40J3j37m6K76o8j08J27P0Q2l94L31j58J14J32j97J50
4294A68j44qk06K13j37n3K86l41L52j96N0R8m0L4k09j8K99j81L03m44m9N9J34
4317c0J4J40p3k53K97n0j89J46r6J17r4k83%K04J30K78l48J89j14n3j35K55j18
4340f6j49K84k38L16l16K26j05K08j87j22K98o0M3J25k91J01lN6k53P4j00J50
4362iN3j14j57K20J07j79J28j36J0R9j52Q1P7K1NLj99K66r8k6j07J5o8n8L58j89
4388d9k82N07j17j41J08K24l36O1r2J20J5J32j95L23l08Q4J0j19K21l38J41J31
4410A00l36L82k56n2J04j90K74j46O6j48J68k1P2Q1j99J38J81j63q6K34R3l1l79
$$ [...]
8191H7
##END NTUPLES=NMR FID
##END=
