##TITLE=1H_DE-89K3_TFA
 200.13MHz,CDCl3,
 8 sc
 
 7.7.2025
##JCAMPDX= 6.0         $$ Bruker NMR JCAMP-DX V2.0
##DATA TYPE= NMR FID
##DATA CLASS= NTUPLES
##ORIGIN= UXNMR, Bruker Analytische Messtechnik GmbH
##OWNER= pz
$$ XWIN-NMR		Version 3.5
$$ Mon Jul  7 15:14:05 2025 Russian Standard Time (UT+4h)  she@DPX200
##.OBSERVE FREQUENCY= 200.1313
##.OBSERVE NUCLEUS= ^1H
##.DELAY= (6, 6)
##.ACQUISITION MODE= SIMULTANEOUS
##.ACQUISITION SCHEME= undefined
##.AVERAGES= 8
##.DIGITISER RES= 18
##SPECTROMETER/DATA SYSTEM= spect
##.PULSE SEQUENCE= zg30
##.SOLVENT NAME= CDCl3
##.SHIFT REFERENCE= (INTERNAL, CDCl3, 0, 14.3821)
##AUDIT TRAIL= $$ (NUMBER, WHEN, WHO, WHERE, WHAT)
$$ ##TITLE= Audit trail, XWIN-NMR		Version 3.5
$$ ##JCAMPDX= 5.01
$$ ##ORIGIN= Bruker BioSpin GmbH
$$ ##OWNER= she
$$ F:/spectra/data/she/nmr/H-C/1/audita.txt
$$ ##AUDIT TRAIL=  $$ (NUMBER, WHEN, WHO, WHERE, WHAT)
(   1,<2025-07-07 15:12:43.98 +0400>,<she>,<DPX200>,
      <created by zg, POWCHK disabled, PULCHK disabled
       configuration hash MD5:
       00 E9 B6 7A A2 85 ED C7 34 08 36 98 17 FE 4E 26
       data hash MD5: 16K
       F5 49 C9 38 A0 85 42 A3 D4 09 E5 93 11 0B D5 B9>)
$$ ##END=
$$ 
$$ hash MD5
$$ 13 12 9C 09 7D 53 33 1F 2B 53 9C E4 A6 CE 4D AD
##$RELAX= 
##$RELAX= 
##$RELAX= 
##$RELAX= 
##$RELAX= 
##$RELAX= 
$$ Bruker specific parameters
$$ --------------------------
##$DU= <F:/spectra>
##$EXPNO= 1
##$NAME= <H-C>
##$PROCNO= 1
##$TYPE= <nmr>
##$USER= <she>
##$AMP= (0..31)
100 100 100 100 100 100 100 100 100 100 100 100 100 100 100 100 100 100 
100 100 100 100 100 100 100 100 100 100 100 100 100 100 
##$AQSEQ= 0
##$AQ_mod= 1
##$AUNM= <au_zg>
##$AUTOPOS= <>
##$BF1= 200.13
##$BF2= 200.13
##$BF3= 200.13
##$BF4= 200.13
##$BF5= 200.13
##$BF6= 200.13
##$BF7= 200.13
##$BF8= 200.13
##$BYTORDA= 1
##$CFDGTYP= 0
##$CFRGTYP= 5
##$CHEMSTR= <none>
##$CNST= (0..31)
1 1 145 1 1 1 1 1 1 1 1 1 1 1 1 1 1 1 1 1 1 1 1 1 1 1 1 1 1 1 1 1 
##$CPDPRG= <>
##$CPDPRG1= <>
##$CPDPRG2= <>
##$CPDPRG3= <>
##$CPDPRG4= <mlev>
##$CPDPRG5= <mlev>
##$CPDPRG6= <mlev>
##$CPDPRG7= <mlev>
##$CPDPRG8= <mlev>
##$CPDPRGB= <>
##$CPDPRGT= <>
##$D= (0..31)
0 0.7 0 0 0 0 0 0 0 0 0 0.03 0 0 0 0 0 0 0 0 0 0 0 0 0 0 0 0 0 0 0 0 
##$DATE= 1751886763
##$DBL= (0..7)
120 120 120 120 120 120 120 120 
##$DBP= (0..7)
150 150 150 150 150 150 150 150 
##$DBP07= 0
##$DBPNAM0= <>
##$DBPNAM1= <>
##$DBPNAM2= <>
##$DBPNAM3= <>
##$DBPNAM4= <>
##$DBPNAM5= <>
##$DBPNAM6= <>
##$DBPNAM7= <>
##$DBPOAL= (0..7)
0.5 0.5 0.5 0.5 0.5 0.5 0.5 0.5 
##$DBPOFFS= (0..7)
0 0 0 0 0 0 0 0 
##$DE= 6
##$DECBNUC= <off>
##$DECIM= 32
##$DECNUC= <off>
##$DECSTAT= 4
##$DIGMOD= 1
##$DIGTYP= 9
##$DL= (0..7)
0 120 120 120 120 120 120 120 
##$DP= (0..7)
150 150 150 150 150 150 150 150 
##$DP07= 0
##$DPNAME0= <>
##$DPNAME1= <>
##$DPNAME2= <>
##$DPNAME3= <>
##$DPNAME4= <>
##$DPNAME5= <>
##$DPNAME6= <>
##$DPNAME7= <>
##$DPOAL= (0..7)
0.5 0.5 0.5 0.5 0.5 0.5 0.5 0.5 
##$DPOFFS= (0..7)
0 0 0 0 0 0 0 0 
##$DQDMODE= 0
##$DR= 18
##$DS= 0
##$DSLIST= <SSSSSSSSSSSSSSS>
$$ [...]
##$SUBNAM0= <"">
##$SUBNAM1= <"">
##$SUBNAM2= <"">
##$SUBNAM3= <"">
##$SUBNAM4= <"">
##$SUBNAM5= <"">
##$SUBNAM6= <"">
##$SUBNAM7= <"">
##$SUBNAM8= <"">
##$SUBNAM9= <"">
##$SW= 18.0517328524113
##$SWIBOX= (0..15)
0 0 2 0 0 0 0 0 0 0 0 0 0 0 0 0 
##$SW_h= 3612.71676300578
##$TD= 16384
##$TD0= 1
##$TE= 0
##$TE2= 300
##$TE3= 300
##$TEG= 300
##$TL= (0..7)
0 120 120 120 120 120 120 120 
##$TP= (0..7)
150 150 150 150 150 150 150 150 
##$TP07= 0
##$TPNAME0= <>
##$TPNAME1= <>
##$TPNAME2= <>
##$TPNAME3= <>
##$TPNAME4= <>
##$TPNAME5= <>
##$TPNAME6= <>
##$TPNAME7= <>
##$TPOAL= (0..7)
0.5 0.5 0.5 0.5 0.5 0.5 0.5 0.5 
##$TPOFFS= (0..7)
0 0 0 0 0 0 0 0 
##$TUNHIN= 0
##$TUNHOUT= 0
##$TUNXOUT= 0
##$USERA1= <user>
##$USERA2= <user>
##$USERA3= <user>
##$USERA4= <user>
##$USERA5= <user>
##$V9= 5
##$VALIST= <valist>
##$VCLIST= <CCCCCCCCCCCCCCC>
##$VD= 0
##$VDLIST= <DDDDDDDDDDDDDDD>
##$VPLIST= <PPPPPPPPPPPPPPP>
##$VTLIST= <TTTTTTTTTTTTTTT>
##$WBST= 1024
##$WBSW= 4
##$XGAIN= (0..3)
0 0 0 0 
##$XL= 0
##$YL= 0
##$YMAX_a= 80041
##$YMIN_a= -140239
##$ZGOPTNS= <>
##$ZL1= 120
##$ZL2= 120
##$ZL3= 120
##$ZL4= 120
##$ABSF1= 10
##$ABSF2= 0
##$ABSG= 5
##$ABSL= 3
##$ALPHA= 0
##$AQORDER= 0
##$ASSFAC= 0
##$ASSFACI= 0
##$ASSFACX= 0
##$ASSWID= 0
##$AUNMP= <proc_1d>
##$AZFE= 0.1
##$AZFW= 0.1
##$BCFW= 1
##$BC_mod= 2
##$BYTORDP= 1
##$COROFFS= 0
##$CY= -3
##$DATMOD= 1
##$DC= 2
##$DFILT= <>
##$DTYPP= 0
##$F1P= 0
##$F2P= 0
##$FCOR= 0.5
##$FTSIZE= 0
##$FT_mod= 4
##$GAMMA= 1
##$GB= 0.15
##$INTBC= 1
##$INTSCL= 1
##$ISEN= 128
##$LB= 0.25
##$LEV0= 0
##$LPBIN= 0
##$MAXI= 10000
##$MC2= 0
##$MEAN= 0
##$ME_mod= 0
##$MI= 1.114404
##$NCOEF= 0
##$NC_proc= 0
##$NLEV= 6
##$NOISF1= 3.799351
##$NOISF2= 2.8
##$NSP= 1
##$NTH_PI= 0
##$NZP= 0
##$OFFSET= 14.38212
##$PC= 1
##$PHC0= -1202.303
##$PHC1= 14.79238
##$PH_mod= 1
##$PKNL= yes
##$PPARMOD= 0
##$PSCAL= 0
##$PSIGN= 0
##$REVERSE= no
##$SF= 200.129724274929
##$SI= 16384
##$SIGF1= 3
##$SIGF2= 2
##$SINO= 400
##$SIOLD= 16384
##$SREGLST= <1H.CDCl3>
##$SSB= 0
##$STSI= 0
##$STSR= 0
##$SW_p= 3205.1282051282
##$SYMM= 0
##$S_DEV= 0
##$TDeff= 0
##$TDoff= 0
##$TI= <>
##$TILT= no
##$TM1= 0
##$TM2= 0
##$TOPLEV= 0
##$USERP1= <user>
##$USERP2= <user>
##$USERP3= <user>
##$USERP4= <user>
##$USERP5= <user>
##$WDW= 1
##$XDIM= 8192
##$YMAX_p= 0
##$YMIN_p= 0
$$ End of Bruker specific parameters
$$ ---------------------------------
##NTUPLES= NMR FID
##VAR_NAME=  TIME,          FID/REAL,        FID/IMAG
##SYMBOL=    X,             R,               I
##VAR_TYPE=  INDEPENDENT,   DEPENDENT,       DEPENDENT
##VAR_FORM=  AFFN,          ASDF,            ASDF
##VAR_DIM=   8192,          8192,            8192
##UNITS=     SECONDS,       ARBITRARY UNITS, ARBITRARY UNITS
##FACTOR=    0.0002768,     1,               1
##FIRST=     0,             0,               0
##LAST=      2.2672688,     0,               0
##MIN=       0,             -140239,         0
##MAX=       2.2672688,     80041,           0
$$ Real data points
##PAGE= N=1
##DATA TABLE= (X++(R..R)), XYDATA
0@%%%%%%%%%%%%%%%qJ6j6J6j6J9k7L2l2M0m8N6o7P5q8J02j15J30j48J67j88K12
37A12k37K66k98L31l67M09m54N01n52O08o72P40q15Q98r89J090j203J330j470
56g72J630j815K029k280K579k942L398l988M785n929P712j0908J8417p1115m1139
71a00338J10624L0045J7924J5150r922l1698K5052K0680m6219o0059K5081K0776
83A7096o1826m3980M3732J7829k8967J1275M6726j54j0327M7585M1052m8771l9977
96h707M6117L2732m3736l4115J3539K161k7457p504J7570P0j1417O001L506p290
110a8530O424J3914L801m43J593M340M886M672Q61j0565q544N218J659j0955r246
125a0915m176j652J609M721O108J401N67N844L709p82L518K324m005m073k533
$$ plain form
0 0 0 0 0 0 0 0 0 0 0 0 0 0 0 0 0 -8 8 -8 8 -8 11 -16 16 -16 24 -24 32 -35 40 -48 54 -61 69 -79 88 -100 112
37 112 -125 141 -157 174 -193 216 -238 263 -289 319 -353 387 -428 470 -519 571 -632 698 -772
56 -772 858 -957 1072 -1208 1371 -1571 1827 -2161 2624 -3305 4407 -6501 11916 -59199 -100338
71 -100338 10286 40331 58255 73405 63483 31785 56837 77517 31298 -28761 -3680 17096
83 17096 -44730 -88710 -44978 -27149 -56116 -44841 1885 1731 -8596 38989 80041 31270 -8707
96 -8707 37410 70142 26406 -7709 5830 7991 -19466 -26970 -9400 -9330 -20747 -14746 -11240 -18530
110 -18530 -12106 1808 5609 5166 6759 11099 15985 20657 21518 10953 2409 7627 9286 -1669 -10915
125 -10915 -15091 -16743 -15134 -10413 -4305 -2904 -2337 3507 7216 6434 9952 12276 8271 4198 1665
140A665k324k780n81J650l459m952M135N693j563l303J677L868K099J033J781
155D639J32j231J471J823k543j956j67j825k997k151m55M22R2O33j21r6L204K699
173A573K8l03Q20P00M94J4q69p15m81r9k07j324l11n1p53m09l36J07O95J5J37
194a275m7J131J005O10n15J77Q4K97P5o17l87k21j56j23l43m81K92p2l6l5m28
215a065M62K15j40J89N02L46M54j54n4K32o00L54m26o40m46L80l03l40M73M2M21
236i8j14M07N6m31P26L14o81K8Q62n41Rl21J36l99j96k48k34n64L20J1l56O89
258f25K63M07M66O05J29O1l38L76k21p81j49j43o70k15j29l04K19L56kN9R3K84
280b59M45R8J87M31n17O29Rk47K46n17k11m62m63k87J72m25O6J0Q0M79O84Q6L82
$$ plain form
140 1665 -659 -3439 -4020 -2370 -5829 -10781 -6646 -953 -2516 -5819 -4142 -274 1825 2858 4639
155 4639 4771 3540 5011 6834 4291 2335 2168 343 -2654 -4805 -5260 -4838 -4746 -4113 -4234 -4330 -1126 1573
173 1573 1601 1298 2118 2818 3312 3326 2457 1742 1261 1162 955 -369 -680 -731 -1484 -1893 -2229 -2122 -1427 -1412 -1275
194 -1275 -1322 -191 814 1424 909 1086 1170 1467 1542 925 538 317 161 38 -305 -786 -494 -566 -602 -637 -1065
215 -1065 -603 -388 -528 -339 163 509 963 809 755 987 387 741 315 -325 -771 -391 -694 -1034 -561 -519 -98
236 -98 -212 195 251 -180 546 860 179 207 1069 528 537 216 352 -47 -243 -491 -725 -1289 -969 -958 -1314 -625
258 -625 -362 45 511 1116 1245 1306 968 1344 1123 342 193 50 -620 -835 -964 -1268 -1049 -693 -695 -636 -543 -259
280 -259 186 284 471 902 385 1014 1023 776 1022 505 294 -168 -631 -918 -746 -1171 -1105 -1095 -1015 -536 148 234 616
303F16K17j52L95m04L4j63n34j5j87k54j6Nk47J89K7p2M19j17L43J83p5L57q0
326D69R6r3j05l09L66k90j38o8k26rrm16L95J91J5K8J14L68PJ98k78o8N6l5k04
351E5o4K07j43r4o8j46J49J50k82m4J32L52n35L70L25k18J2j0j18j40K3L90m67
374a64J52m3j30J19Pl37J72O1L52l6k48K0K82K4j94K40k04r3R5k1M8j56L3k64
398b85P6M38l1k88Q9K62j79j08m1J5Q7K48m10L41m11K70j1N9m01M26k27J24L1
421G4j26J08Q2J1l8J70k28K4j88K17q9J03n7N5m9L32n18j5K16j63j05J23k02L16
445E3j96J42J72p6n8j62J90k32L8K64N1k07K4r0L0J36k44J85J70p3k50J19O1r6
469d9K88j82j29J29Q3J02k47L59k95j06Nl08L65j96K38J10k38r9J23P1rN5k24
$$ plain form
303 616 833 681 1076 672 706 543 9 -6 -193 -447 -463 -458 -705 -516 -489 -561 -142 -259 84 267 192 549 469
326 469 565 472 367 58 424 134 -4 -72 -298 -307 -316 -732 -337 -146 -131 -103 11 379 386 584 306 238 294 259 55
351 55 -9 198 55 -39 -107 -253 -104 46 -236 -280 -148 204 -331 39 364 146 158 148 30 -110 -87 303 -164
374 -164 -12 -55 -185 -66 -59 -396 -224 -163 189 153 -95 -75 207 231 37 277 73 -20 75 54 102 -54 -21 -285
398 -285 -209 229 198 -90 -1 261 82 -26 -67 -52 35 283 -127 214 -197 73 62 121 -280 146 -81 43 74
421 74 -52 56 138 149 111 281 53 77 -111 106 17 120 63 118 69 401 -117 -132 84 -79 -184 -61 -263 53
445 53 -143 -1 171 95 37 -125 65 -167 -129 135 186 -21 3 -87 -57 79 -165 20 190 117 -133 -14 47 -49
469 -49 239 57 -72 57 140 242 -5 354 59 -47 -42 -350 15 -181 57 167 -71 -170 -47 24 15 70 -154
492a54J71J41o4R2nj97J45o0Q6j93K8j32Q5J89m25J59J57J04k99J35l1L33k49
515A6R6J1N6Kl72J05Q9j64M4K42k91o3k9L97R4k02J30j46qK51k01k27J11M0J72
540A53j36m8L8o1l03K36j97K96l7J12j60Q2j65PL58j65J98J4j67J2j88P0K05n0
564A04k68L1J16K81k93j1j8m0L9K97lj40O3Q0l78K14LL5j95RJ57k08m6R8K62j36
590E3j06J4j4r5J35O6o4o0M52n63K58k22k74J80K18q9j58L55q5o0j3j03L68k00
614gK2J7j20J48k82j6K75O7j54q5K03k12J54l9j39J87j59J34op2j54K64J55j23
638E8l93K51pp1J29jJ6r5J94K2l39L34j50J0J55L3k97j46K64k8Q0o1J08r9j9K0
664c2Q4j94P8k17L21m4R3k70K59k50K09j52P3J15r9N8J35l84K17L6p7M4N4j59
$$ plain form
492 -154 17 158 94 186 181 -16 129 69 155 -38 -10 -142 -57 132 -293 -134 23 127 -172 -37 -68 265 16
515 16 112 123 179 181 -191 -86 3 -161 -117 125 -166 -229 -258 139 233 31 161 15 7 258 57 -170 -59 -19 153
540 153 17 -31 7 -54 -357 -121 -318 -22 -59 53 -107 -25 -190 -183 175 10 208 222 55 67 -121 -51 154 104
564 104 -164 -133 -17 264 -29 -40 -58 -98 -59 238 235 95 158 238 -140 74 77 112 -83 -74 83 -125 -171 -73 189 53
590 53 -53 -39 -53 -148 -13 53 -11 -71 381 -182 76 -146 -420 -240 -22 -111 -269 86 1 -59 -72 -175 193 -7
614 -7 15 32 -88 60 -222 -238 37 104 -50 -135 68 -144 10 -29 -168 19 -140 -6 -12 -84 -238 26 181 58
638 58 -335 -84 -91 -162 -33 -34 -18 -113 81 103 -236 98 -52 -42 113 146 -151 -297 -33 -61 19 -42 66 -33 -52 -32
664 -32 52 -142 -64 -281 40 -4 89 -181 78 -172 37 -115 -42 73 -26 32 167 -217 0 36 -41 3 57 -102
688a02Q1l0m3K20M3k83J38l6j06Q8K26j71k07K97j47k9oK53j02k63K43k4j29k13
712c02M36N9j55M8k53J72Q0m31J98K30j46K49r0p5J47k94L72j01l74J47J04r3
734g2K57k20j77J49J3j9q1K97m96N80k36P1N4n6N8j59Q5J50j82j05K65k16q5K93
758A68Q6p1k71L41l13j7K63j5k6p1M7k07J88j32p1p0J84k4j74K21lk22L41j24
782B8P6k98L06Q7k31m8OoN4J67k9l53J9L48q5K06o5j12K85l25q6k2Q3M4N1k33
808a33O2L00j36M6K3k39m9O19l37m9R3m5l18M3LJ80k08K61N1k23O5M7k91K3N5
833a57M00l67p5K52J04j43j52K70l72K51K34n5m1k6l56L73k42o6K89J39k90J46
855A16O2m55M39l4k66J62k56L06j51J60k16j63J96N9R7o0K3K6mk1L58m32J42k13
$$ plain form
688 -102 -21 -51 -94 126 169 -114 24 -12 -118 -30 196 25 -182 115 -32 -61 -67 186 84 -179 64 40 -89 -302
712 -302 134 193 38 86 -167 5 85 -346 -148 82 -64 185 95 20 167 -127 245 144 -230 -83 21 -72
734 -72 185 -35 -212 -63 -50 -69 -150 147 -349 231 -5 66 120 64 122 -37 48 198 16 -89 176 -40 -125 168
758 168 254 183 -88 253 -60 -77 186 171 145 74 121 -86 102 -30 -101 -171 13 -11 -185 36 33 -189 152 28
782 28 104 -194 112 199 -32 -80 -74 -80 -26 141 112 -241 -222 126 41 247 182 70 355 30 -56 -78 5 49 100 -133
808 -133 -71 229 93 139 162 -77 -126 493 156 107 200 155 -163 -120 -117 63 -145 116 167 -56 9 56 -235 -212 -157
833 -157 243 -124 -199 53 157 14 -138 132 -240 11 245 190 149 123 -233 140 -102 -168 121 260 -30 116
855 116 178 -277 162 128 -138 24 -232 74 -77 83 -133 -296 -100 -41 56 -4 19 45 41 20 378 -54 88 -125
879a25K46j86n7M36n08K03K26k30J73q0j05K1r8O2M1kJ5j51J39J60j36O3j46J55
903A16j54O9N1j72M1j27J28K51j0m16J90j54K03j46lM13k33j3o7M55n00j07J30
926e5N8J8l81L56K06k59K84O6K1j15k18N4K9o8J44m3l37J41Q2J89l93M29l03j11
950b06K46r2j7O9j15ok49L38J22p2k31J98Q4k14L92L5j75j02lP0l45K20J93m00
974b60L08Q6k70P9J65r7p4p9P1K13k00k46L37Np9N6N1j45P8j08J10M7Nk66j14
999c27L51k73L95k46L36l37K06L2m0o8j15K44j68K4N1j42L33l62lK15k56O7L86
1022C03m49J81O6j78p8Q1J03L3J12Jq4J14k56J40PJ8O8K0l1j22K06k60n5J6j2
1047e6L09J0l61K46p9k93L43n4m52M36l95P39j03l75k0L6J76k64l3J93K3k28J64
$$ plain form
879 -125 121 -65 -122 314 -194 9 235 5 178 98 -7 14 -84 -22 19 17 32 -119 20 180 44 107 -39 116
903 116 -38 31 82 -90 -49 -176 -48 203 193 -223 -33 -187 16 -130 -133 280 47 34 -33 422 -78 -185 -55
926 -55 3 21 -360 -4 202 -57 227 293 314 199 -19 35 64 -4 140 97 -240 -99 -17 172 -221 208 -95 -206
950 -206 40 -52 -69 0 -115 -121 -370 -32 90 18 -213 -15 69 -145 247 282 107 5 2 72 -273 -53 140 -260
974 -260 48 134 -136 -57 108 11 -63 -142 -71 142 -58 -304 33 38 -41 15 66 -79 -1 -109 1 48 53 -213 -327
999 -327 24 -249 146 -100 236 -101 105 137 97 29 -86 158 -10 14 65 -77 256 -106 -109 106 -150 -83 303
1022 303 -146 35 101 -77 -155 -74 29 62 174 175 91 205 -51 89 96 114 182 202 171 49 255 -5 -60 -44 -56
1047 -56 253 263 -98 148 69 -224 119 65 -387 49 -346 393 290 -85 -105 -69 107 -157 -190 3 26 -202 -38
1070c8O0L5j39M8J52j90r4Q8ok7p2N4l7o2K49J78n8k77K32mj33Q5q4J0q6p0p6
1097b62M74k4j45j59p7J5L52o0K8j48K36m12K55%J21j82j18p0J25Nm7j24K62P2
1121A17l42J96K0j1J85M5j40K08m24J23n4J9M3j79K71J3K5j64N6N2l6J57m50K89
1145A9k9O8m1j6N2j4J2k4j88M01r5k48n0J94n1l4j29J45K89j89J47p3j26j62J96
1170E4K80k04k58L57l69n0J64P6j11Q5m8J85Q1j67P4j21k5R2k10L2P5J89m35M00
1194A46j10k61L37l4J9l01J29j78K11J85j07K20n01J05J21k05L52q1j30J36L7
1215I0k23OL45k98j6Q7j44K49l06J18k46P6K98o3R2k62J73K73j40J48k47j13K44
1238A41L5j63k08L02j2K00l64Q7j75K26j6J9j63K40L6J5j97k3Q6J77k55p2J07
$$ plain form
1070 -38 22 57 -82 -34 118 -72 -166 -78 -84 -111 -183 -129 -166 -228 21 199 141 -136 96 92 -41 44 -40 -30 -116 -186 -262
1097 -262 212 188 43 -116 -193 -178 174 114 142 -6 230 -182 73 73 194 12 -106 -176 -51 -46 -93 -217 45 117
1121 117 -225 -29 -9 -20 165 210 70 278 -146 -23 -77 -58 -15 -194 77 90 115 -49 7 59 23 180 -270 19
1145 19 -10 58 17 1 53 39 51 27 -161 240 145 -103 -153 41 -10 -44 -173 -28 261 72 219 146 20 -142 54
1170 54 334 130 -128 229 -140 -190 -26 50 -61 24 -24 161 242 75 149 28 3 95 -115 -83 -8 181 -254 146
1194 146 36 -225 112 78 97 -204 -75 -253 -42 143 36 256 -245 -140 -19 -224 128 47 -83 53 90
1215 90 -133 -127 218 -80 -96 -9 -153 96 -210 -92 -338 -262 36 -27 65 -197 -24 249 109 257 10 -103 141
1238 141 176 13 -195 107 95 295 -69 18 -157 69 53 72 -91 149 185 200 3 -20 66 243 -12 -84 23
1261B3j36J56N7J5k45K44r8J0n9m8J16J95k65R4L9L2j39R9K93m24R7l1J68m95
1285c02M23j51j73M28m55K11J13m6k7n2n1K92l52L27Nj17j28L40k41l52M64j28
1307B8O9j33L0l0j88K44j59Q0M0o7J89Nn4k51o6L67o8l8mm4q3K98j08j86j3Ro4
1334a97ML75O1k03j09j3J67M5j07k9k47K36J30k9j21j12R4O7k38L04k28J09k7
1357f8m8L38Q1l69j40R4j17L19l93O15k47j96J60p6J90k91J36K28k78K56k19J7
1379hp3L9O2j62L13j98J80j32O0p0j00J44j54K8j36N35m16Q7R4k21P0K41k53Q7
1403A7l23L76j48j7Q6J12k58J17K4K99m01j04K73j02r4L64m29K06L3J61j29q2
1425a9%Q9m9j42J41l5R3k21J41k29Q6J37m4K92j64j82N0M40k87j36J64j82Q5p
$$ plain form
1261 23 -113 43 100 115 -130 114 16 26 -33 -81 35 230 -35 59 98 130 -9 90 383 -41 56 25 193 -302
1285 -302 121 -30 -203 225 -230 -19 94 48 21 -31 -82 210 -142 185 190 73 -55 285 44 -308 156 28
1307 28 97 -36 -6 -36 -224 20 -139 -59 -19 -86 103 108 54 -197 -263 104 36 -2 -6 -50 -133 165 57 -129 -142 -133 -197
1334 -197 -193 182 243 40 -69 -82 85 130 23 -6 -253 -17 113 84 -37 -149 -55 12 -226 78 -150 -41 -68
1357 -68 -116 222 303 -66 -206 -112 -229 90 -303 312 65 -131 29 -47 143 -148 -12 216 -62 194 -25 -8
1379 -8 -81 -42 20 -142 171 -27 153 21 81 11 -89 55 -99 -71 -207 328 -88 -1 93 -128 -58 183 -70 17
1403 17 -306 70 -78 -95 -9 103 -155 -38 -14 285 -116 -220 53 -49 -143 221 -208 -2 31 192 63 -19
1425 -19 -19 70 21 -121 20 -15 78 -143 -2 -231 -145 -8 -52 240 76 -106 -56 384 97 -39 125 -57 28 21
1449B1j26NJ01k09J65j56J88P9K2j11J42M0j27k00M44l89J71j36j79J67j54L30
1471H8j22J78j39j02K80k84L30l28L7K46j60p0J78l31K73j02K62k83k9j75L13
1492F0K7J18k35P9N0q5r1K14j53J1J13o1Q1mo6l1k3J43l0k3L4l28M30l17M1o6
1518a12NJ04J44l72K07p7k08K22J5mm3L09l37j3M28l27J51k15ml6M63n66K47j00
1542a19J00Jo7L77k30K56j14j69j11o7Po2M1L78r2l37M16r0k50K75k25J31j40
1565i1J22m3J81m06K60J27j86K23l37K12J65j85k94J70K29j22Mo9k02J09J66j38
1587a05m0J02m18L50QK0J77J03l34J60k91M70k27J27j26M7n1j92L03j15J71j38
1609Aj21M71n3k82k77K16j23K86mJ00l00K31M4k25q6J77l94J87K66r0P9J36j86
$$ plain form
1449 21 -105 -100 1 -208 -43 -199 -11 68 90 -21 121 161 34 -166 278 -111 60 -76 -255 -88 -242 88
1471 88 -34 144 5 -97 183 -101 229 -99 -62 184 24 -46 132 -199 74 -28 234 -49 -78 -253 60
1492 60 87 205 -30 49 99 14 -77 137 -16 -5 108 47 128 124 58 27 4 147 117 94 128 -200 230 -87 -46 -112
1518 -112 -107 -3 141 -231 -24 -101 -309 -87 -72 -76 -119 190 -147 -160 268 -59 92 -123 -127 -163 300 -266 -19 -119
1542 -119 -19 -18 -85 292 62 318 204 35 -76 -143 -136 -198 -157 221 129 -208 208 118 -132 143 -82 49 -91
1565 -91 31 -12 169 -237 23 150 -36 187 -150 62 227 42 -252 -82 147 25 29 -40 -242 -133 33 -105
1587 -105 -145 -43 -461 -111 -103 -83 94 197 -137 23 -268 202 -25 102 -24 23 -28 -220 83 -32 139 1
1609 1 -120 351 298 16 -261 -45 -168 118 114 214 -86 145 189 -36 -122 55 -339 -152 114 24 103 239 53
1632E3k5k6O4K06j64Q6k44j03K26j64M06j93l48J81J23l22j3Q2J76J34Qk66J95
1655G2m2j56K41l08k6K09j08o0J42k23L00k12K33j00L28j12j6j92j19K56M3l30
1677a80L29j97k25R4J80M3j93J25j66J09j01k8Q0K80l69P3R2J07J89M3n12J96
1699c1k3n3J7P8L10k49p6kl8N4oo0k25N10L8k01K6O0j18j8K51n5l55l5K33J1R5
1726A38l83K11J18k64K66N5r8J1j24j49J45J79m6j87J42K73k08R3l32K69k62M4
1748a09NJ69R0j66K89l34K44pM2l21NJ40j23J51o8j30Q1J78j34j12q9K17k62n2
1772b96K70j72P3K7K31m5L6K3m54K91n6J72j64j84J17qL57j93p4Q8K71k68K69
1795C11k37j75J63j03n1J45p5J80l0j8p8k7j66J04o1K33k03p7J87J1K94j63n7
$$ plain form
1632 53 28 2 66 272 108 194 -50 -153 73 -91 315 122 -226 -45 78 -244 -257 -175 1 135 143 -123 72
1655 72 30 -126 115 -193 -219 -10 -118 -178 -36 -259 41 -171 62 -38 290 178 162 -30 -149 107 150 -180
1677 -180 149 -48 -273 -179 1 44 -149 -24 -190 -81 -182 -210 -130 150 -219 -146 -54 53 242 285 -227 -31
1699 -31 -54 -107 -90 -12 298 49 -27 -29 -67 -13 -19 -79 -304 206 244 43 69 129 11 -7 244 189 -166 -201 32 43 138
1726 138 -245 -34 84 -180 86 141 43 54 -70 -219 -74 105 59 -128 14 287 79 172 -160 109 -153 -109
1748 -109 -104 65 155 -11 278 -56 188 181 223 -98 -93 47 -76 75 7 -123 -42 136 2 -110 -199 18 -244 -296
1772 -296 -26 -198 -125 -98 133 88 124 147 -307 -16 -72 100 -64 -248 -131 -139 218 25 -49 39 310 42 311
1795 311 74 -101 62 -41 -92 53 -22 158 128 110 32 5 -161 -57 -118 115 -88 -165 22 33 327 164 107
1818A07q8J40j83J39M4NO3j48k6N5p7m1J01j54j11O0N5J46J1L8j8j69J06J06n91
1843d30N12J03r5O8O2q9J4j38j64K19J25k13K9n7OpO8J96k77J1K34J19k83k2Q6
1868G7j07j86J7p3J00j0M68m65K27j09l5L03k46j93M08k68k8O5J77%M8j43J35
1891A62rj62J78j47K4J69k15j2j56L91k68L1J18k4k2Q1j89M5n8J72r2r5M9K77
1915B48k11m0k91L29p2J40P7k07Q6o9L33m46j24K49l6l33L50L00l37R9K0o3mQ8
1939H6k84L95k41J0J59Rj85L9K1r4K40j39r4J89jj75J70m41J03K47J41m77L95
1962G3k32J60L6R8K0Mm92N36q6k67L66J6m8p4j96p7L00j00j70J47Ok1K13l61K51
1987A02k01J97k3j9p9m4Q4k9m1J24j82K17k51K60M3l7qK5l08J94j91J95k20K65
$$ plain form
1818 107 19 159 -24 115 159 164 227 79 53 108 31 -10 91 -63 -174 -114 -59 87 98 136 118 -51 55 161 -430
1843 -430 82 185 90 158 220 131 145 7 -157 62 187 -26 3 -54 -48 -55 13 209 -68 -57 177 296 13 -9 77
1868 77 -30 -216 -199 -272 -172 -182 286 -179 48 -61 -96 207 -39 -232 176 -92 -120 -55 122 122 170 27 162
1891 162 153 -9 169 22 46 215 0 -12 -168 223 -45 -14 104 80 58 139 -50 -5 -63 109 17 -78 -29 248
1915 248 37 -3 -294 35 -37 103 180 -27 59 -10 323 -123 -247 2 -34 -367 -17 283 -54 45 65 2 -2 86
1939 86 -198 197 -44 -34 125 134 -51 -12 9 -85 155 16 -78 111 110 -65 105 -336 -233 14 155 -322 73
1962 73 -159 1 37 135 155 159 -333 203 117 -150 216 232 184 110 -86 -163 137 37 -133 14 20 -1 212 -149 102
1987 102 -99 98 75 56 -23 -67 17 -12 -53 71 -111 106 -145 115 158 121 113 138 -170 24 -167 28 -192 73
2011G3j25J36j34p7K47J2k62J19J86l6n7N2l8k27K01P5J72l05l2L7k48j88L32
2034h7J83j38MK2J46k5k56R3K74l7J25k07kLO0j51J62k87n5K62k2o7L24j55l40
2059a71L17K54k63nj26K04j70k23M55k32R5r1k7J9j58J57k4J57l54M05j99k05
2081a85K16k58J63J51j26L5m8k08L90j47J10p9M2lk04L04k54kK1q0J83j83j35
2104b97K68J77k81J06o5O8Q9k06J67j98K8O5%m4Q2K70o0j61k82L1M8J16J98j0
2128A09k16J95J52k27O2k4p3J91m00J17J32j71M02k90N1P2L7j70Q6J02Q0k51j21
2151a55K96k52O8p9O5j32P7K86l22K75k70M48l64K03j19j14L83l33j7K8J78j90
2173d0p7K46kj32N0Q3k27P1M9n2L3j14L52j72O4n1K2o7J26l85QM99k10k31K91
$$ plain form
2011 73 -52 84 -50 -127 120 132 -130 -11 175 139 82 134 96 -131 70 145 317 12 -20 17 -231 -419 -87
2034 -87 96 -42 -38 -16 130 105 -151 -58 216 179 304 97 95 98 158 7 169 -118 -173 89 67 0 324 169 -171
2059 -171 146 400 137 132 6 210 40 -183 272 40 135 44 17 36 -122 35 11 168 -186 219 20 -185
2081 -185 31 -227 -64 87 -39 -4 -52 -260 130 -17 93 14 56 53 -151 153 -101 -103 -82 -162 21 -162 -297
2104 -297 -29 148 -133 -27 -92 -24 65 -141 26 -172 -144 -79 -79 -123 -41 229 169 8 -274 -243 -195 -79 119 109
2128 109 -107 88 240 13 75 51 -22 169 -231 -114 18 -153 249 -41 10 82 119 -51 35 137 217 -34 -155
2151 -155 141 -111 -43 -122 -57 -189 -112 174 -148 127 -143 305 -59 144 25 -89 294 -39 -56 -28 150 -40
2173 -40 -117 129 127 -5 45 128 -99 -28 21 -31 2 -112 240 68 132 81 103 36 162 -223 -215 284 74 -157 134
2198A34j31k27J42J90k91j5L07l76M32o8k73R8j6N1N7j10L23k71j36K8J4j5J64
2221A1j65J92L6J53j60k2K8j05j81k53N09k2Pj9j59K78k52L08k42J62J4J4P1k45
2245d2J00L05l44j56K98r4J6k64L77p4J2k84pL27j99J16j81M80n90K82L8j75j06
2268a65K6p7L15pn2K8j11p8r0OJ34J38j67n9L9N2K21k11J42O0j5k76J57L3j62
2293a19K61o8k89K79j38P8K30l37P4ro4N4M5k58L26Nj26j70K55J08l5J77n1k85
2317e7J55o1J21J5J08j53j2J58k30O0M9l80J45R5R8J47j58m00L41OJ02r9M9j92
2341i3r0L92%m5k25O9n4q0L30q2j31k70K24J06j81J82l92M83J16l5k0l51L87k52
2365a2k6N2j06P8r8L50l22j7lM3KK03j58p2J05q4M84m41p6L96l66J73o6j32l4
$$ plain form
2198 134 3 -224 -82 108 -183 -198 109 -267 165 97 -176 -78 -94 -43 14 -96 227 -44 -180 -152 -138 -153 11
2221 11 -154 38 74 227 67 45 73 -32 -213 -466 43 21 28 9 -150 128 -124 184 -58 104 118 132 203 -42
2245 -42 58 363 19 -137 161 67 83 -181 196 122 134 -150 -157 170 -29 87 -94 386 -204 78 116 -59 -165
2268 -165 -139 -216 99 92 40 68 -43 -121 -211 -205 -71 67 -100 -159 -120 -68 153 -58 84 144 129 -147 10 43 -119
2293 -119 142 74 -215 64 -74 4 234 -103 -29 -38 -102 -48 -3 -261 65 70 -56 -226 29 137 102 279 228 -57
2317 -57 98 37 158 173 281 128 116 274 44 104 153 -227 -82 13 111 258 100 -300 41 47 149 50 99 -93
2341 -93 -183 209 209 164 -61 8 -46 -126 204 122 -9 -279 -55 51 -130 52 -340 143 259 224 204 -147 240 -12
2365 -12 -38 14 -92 -14 -112 238 -84 -101 -104 -61 -59 144 -14 -86 19 -65 419 -22 -98 298 -68 105 39 -93 -127
2390a27R0J02R1k40j23J50l9J13l4K62j81j01K00j7m8k31n5K04J16O5j47k04K04
2413E0J64j29j64K13j71o9Np1J02K32k6m79N42j25J10o8m72M26o0J92p0r2j24
2436h4J94k60J32M0q2J02l16M09p7k98N09J05m62m5L77k34p2K91n12J79M4Q3K04
2459B27j77r7j75L79o0k7K15j2M5l34n9K11j42j57L20m69O01l58K37p5l62J54
2481a15r8M16m60J32R3J54j76j36L28k91L02J34j49l15o2J55J06M1mm2J60l9l22
2504a88O6K63Kl8J02k25%J87q2k38J31R1m1l9k05P9K00j1P9n0%k50J64L7j2L49
2530C71n17K34R0k66q2L64jj29j51J22k7j6kr4J68k49L51k15R9m1K38j50K41k88
2554E0k1N4j88K78j43R3k82J01K88j29o9j31O7k5j0M2l3K20k09P7m13M57K3K13
$$ plain form
2390 -127 -37 65 156 -84 -207 -57 -96 17 -17 245 64 -37 163 146 98 -133 -188 16 132 197 50 -154 50
2413 50 214 85 -79 134 -37 -106 -101 -172 -70 162 136 -343 199 74 184 116 -356 70 10 202 132 40 -84
2436 -84 110 -150 -18 22 -60 42 -274 135 58 -240 269 374 -88 -133 244 10 -62 229 -283 -104 -60 23 227
2459 227 50 -47 -222 157 97 70 285 273 318 -16 -75 136 -6 -163 157 -312 289 -69 168 93 -269 -115
2481 -115 -213 203 -257 -125 -32 122 -54 -190 138 -153 149 283 134 -181 -243 -88 18 59 55 13 173 134 -188
2504 -188 -122 141 143 105 207 -18 -18 169 87 -151 -20 71 30 -9 -214 -135 65 54 133 83 83 -167 -3 34 22 371
2530 371 -146 88 178 -88 -170 194 193 64 -87 35 8 -8 -10 -104 64 -185 166 -49 50 9 247 97 338 50
2554 50 29 83 -105 173 30 123 -159 -58 230 101 32 -99 -32 -57 -67 -25 -58 162 -47 30 -383 74 97 310
2578C10m22L5L8K92m23L64J06l53J13J7M0l69K45MJ19k03J47j17k17K76K31j36
2600I7J86m31J52M3l0n9N7k64K61%l24K52K41j50k9j11J47m4n6K34k06L3o4L8
2624b7ok1L22l65J26J37l43K6j3L41r9K7J50k16k19Q0O7J12j37J05P7k1M0j06
2648C7J25j5m68L80j97k5K19l5k1N2j39L7n9k02L37k20K27k30J51r7K05J25k71
2671h4J06J02r4J65j96j0p3l3J18J56Q4j28K07l07J8j6k27j0K04Q7j67J50M0o7
2695B5P4j57N8J02q0J44k42L32l49O5J95k16nm0L35r2J4k13n3J7O2l4Q8K06j11
2720A25m0J8J32l60K60m3k38Q7M7J39r3j52J46p7J60rK8J74m89J94P7j7j90n2
2744a73p7K19p9J3J12n1m7J17K27j88l33L45O5o8l4O9j96N7Q3J37m3j24K33k50
$$ plain form
2578 310 -112 -77 -39 253 -170 194 300 -53 60 77 117 -252 -7 -3 116 -87 60 -57 -274 2 233 97
2600 97 283 -148 4 47 17 -42 15 -249 12 12 -312 -60 181 31 2 -109 38 -6 -62 172 -34 -1 -65 -27
2624 -27 -33 -54 268 -97 29 166 -177 -151 -164 177 78 105 255 39 -180 -100 -33 79 -58 47 124 103 143 37
2648 37 162 147 -321 59 -138 -163 56 21 0 52 -87 -50 -109 -311 26 -194 33 -197 -46 -143 62 187 -84
2671 -84 22 124 30 195 -1 -11 -84 -117 1 157 241 113 320 13 31 15 -212 -222 -18 69 -98 52 92 25
2695 25 99 -58 0 102 22 166 -76 256 -93 -28 167 -49 -54 -94 241 149 163 -50 -103 -86 -24 -58 30 236 125
2720 125 85 103 235 -125 135 92 -146 -59 -12 127 34 -118 28 -49 111 102 130 304 -185 9 86 69 -121 -173
2744 -173 -250 -31 -110 -97 15 -36 -83 34 261 73 -260 85 150 82 48 117 -79 -22 61 198 155 31 264 14
2768A4R7J02j28j10J81k75J9j8J70k2Q6k06O5l9L35m96L1J61m6j8J12o2J85n2
2792H6N1nm78L15j01K59j29j7j83J84j18J1K92p8j38J78m8q4J3Mk10J12j08J11
2816h1j44M57l17K0J16q8J02j5j82J90j04j48K98q5K06k44k4p9J85m0k4nL2l4
2840hr5L2J6R2j44K62o6k34R9n5Q1m0l1J47q0J52J11n30K17J4j24M38k0k82J38
2865I0k6J6l17M38k58j80K63j20M3J08o8J60l73K40O7J8k08j13L97j84k2J53l56
2888b32P2K6J78j85k63O08j63j65R6K12l14Q5k61J71j00J52Q8J60Q6k08r6K18
2910A65P4q0L2j60Q1j55J14p9Oj30L06k25Q8o2K11r1j89K6J87j33J71j94J81j91
2934d7K0k28J11L24j66r2M5L03k33k01k7L04k50k9p0L73l02J36J0r2j45J28j6
$$ plain form
2768 14 111 213 85 -25 156 -119 -100 -118 52 30 116 -90 -25 -64 271 -225 -194 -33 -79 -97 15 -47 138 86
2792 86 137 132 -346 -31 -132 127 -2 -19 -202 -18 -136 -125 167 89 -49 129 81 -3 10 14 -196 -84 -192 -81
2816 -81 -225 232 -85 -65 51 -37 65 50 -132 58 -46 -194 104 19 225 -19 -43 -122 63 23 -1 -6 26 -8
2840 -8 -103 -71 -55 37 -107 155 89 -145 -46 -101 -20 -60 -91 56 -24 128 239 -291 -74 -60 -184 254 234 -48 90
2865 90 64 80 -237 201 -57 -237 26 -94 -51 57 -11 149 -224 16 83 101 -107 -220 177 -7 -29 124 -232
2888 -232 -160 -134 44 -141 -404 204 41 -124 -28 184 -130 -45 -306 -135 -235 -83 5 165 251 43 -53 165
2910 165 239 159 191 31 112 -43 71 -8 -2 -132 174 -51 37 -25 186 95 -94 -68 119 -14 157 -37 144 -47
2934 -47 -27 -255 -144 180 14 -78 -33 270 37 -164 -191 113 -137 -166 -236 137 -165 -29 -19 -111 -256 -128 -144
2957a44J39J12q5J29q8J4q2J78j53m3J9k60K20j24O0J68j2j37j10K44n7Q8j32
2980e6J45j44O4K1r0M5l19L08K79m55K05k2k50J11p1J03K27j0k2j41K90k16j4
3003a2J12j92K60k47N3J21k09L78l23p3J33J86p9j29l1K00k52J46J70l97J48J92
3025A55k39p9J75r0O8j58J28L83l08J65k4k14j40L1J28K90k16l00N42m23L82n55
3047b99L39m1K07l72J1M06m07L84j81L4k64J58k7r1J62J35k41L23k12ok19L72
3069A71j21j10L63l81J17l29K40J2pj58J64K4J42m18L65j63N4K26Ol85J55K03
3091A70l67M77j50K07k97J32j17K45k06n2n7J56n0k69q4L70p9J4j66N00m87R2
3113a8Q6o6J48l42K29K7p8j3qJ92l39L16n6N5m60N65K1l04rJ34l7k28Jl9L39j85
$$ plain form
2957 -144 -5 107 22 151 63 77 -5 173 20 -23 -4 -264 -44 -168 -108 60 48 -89 -199 45 -12 76 -56
2980 -56 89 -55 9 30 -60 -15 -334 -26 253 -202 3 -19 -269 -158 -229 -126 101 91 69 -72 218 2 -12
3003 -12 100 -92 168 -79 -26 95 -114 264 -59 -132 1 187 108 -21 -52 148 -104 42 212 -185 -37 155
3025 155 -84 -163 12 -78 -10 -168 -40 343 35 200 176 -38 -178 -147 -19 271 55 -245 297 -126 256 -299
3047 -299 40 -1 206 -166 -155 251 -156 228 47 81 -183 -25 -52 -143 19 154 -87 236 24 18 -201 171
3069 171 50 -60 303 -78 39 -290 -50 -38 -45 -203 -39 -15 127 -291 74 -89 -35 191 197 -188 -33 170
3091 170 -197 280 130 337 40 172 55 300 94 42 -15 141 91 -178 -262 108 29 43 -123 377 -110 -18
3113 -18 68 2 150 -192 37 64 -14 -27 -35 157 -182 134 78 133 -327 238 259 -45 -54 80 43 -185 -184 -223 116 -69
3139f9j08J77q6J06j4l12L87j38QJ5q0J8Q5J23q7j50K68m5k19M8nJ53k57J1K75
3164A04r5l28K73J92k65J96k78q4J97J53l5J54l96j4J48K5P5j76m9M43l58J29
3186A1p8N9m1l13L14K05j48j09J03q0L97j5j30n43L42j40J80J31l68O3L09k8N8
3209A79l76L46k12K92o0j54O9K54j30k01j21J91J38m12M53P8j47k11M81m69q1
3230i3j64M86k96L07k54n6N3m8J27J53j77k13j12J31K28n1l6r7O1n2j69M33k26
3253f5J34j69q7K24m9j07J87k8j8R4l15J50J40k38L14k76L7L3O8K10m26K66N0
3276A29q8k00J30K17k52j94J08K53j72j96L35NM2n8kj86j12N5N26o5m24L0K75
3299A56k21Q1L11m38K50o4K6j83J1M07m56K2j89L94Nr7J49m0m25L06j28l3K96
$$ plain form
3139 -69 -177 0 -86 20 6 -306 81 -57 -49 -34 -114 -96 -11 112 25 -125 143 98 -121 -73 -78 75 -182 -171 104
3164 104 9 -319 -46 146 -119 77 -201 -285 -88 65 30 184 -212 -226 -78 -53 22 -154 -203 240 -118 11
3186 11 -67 -8 -49 -362 -48 157 9 -100 3 -77 320 305 175 -368 -26 -166 14 145 -223 -160 149 121 179
3209 179 -197 149 -63 229 169 15 84 338 208 7 -114 77 215 -197 256 334 187 -24 457 -12 -93
3230 -93 -257 229 -67 240 -14 -70 -17 -65 62 215 38 -175 -287 -156 72 21 -15 -112 -51 -103 -272 161 -65
3253 -65 69 -100 -187 37 -12 -119 68 40 22 116 -199 -49 91 -147 167 -109 -72 -39 29 239 -187 79 129
3276 129 41 -159 -29 188 -64 -258 -150 103 -69 -265 70 75 117 59 57 -129 -241 -186 340 275 -149 -119 156
3299 156 -65 16 327 -111 139 75 101 -82 -71 336 -120 -98 -287 107 112 15 164 124 -301 5 -123 -156 140
3322A40j59j3K47m3l25M04k63j05l9J99j73J01j65O4J51N3J06k78L81k35J21r2
3344G7O5Q3k16l07P8N1J99N6j68L10j21J05l66K35Qj48N5Jj04N0j52Q6R6j6j0
3369e3k2k51M01j37L7n3J58P0J77k77Q5k02j04J98MKJ4k0o2O3J13k02n4r8Q6J24
3395ck1j71L06Q0l1R9j10n71O44j67K16J26l93k8J97o1q1r4K5N6QJ83J1q6k61
3420a27j72N63k23k09K16j78K08J83j44Qj64J29j13L8L23j87k61q2L34j23L7j04
3442d8L55l65J79Q3j70L9j91M39j51n77K80O9k79P2K50pK24q9k03L26k16j20j01
3465b01M98j68j97J86Mn7q6j09J79M0j57R8j11K50j58N9OJ52m95L76m5M6O0j11
3489E9j73J45k6R6R8j03kl3o3l8o4Q2P0L2k56J45J62k76K8LL7l4O4L6J03J44o18
$$ plain form
3322 140 -19 -32 215 172 -153 251 -12 -117 -156 43 -130 -29 -194 -130 21 74 180 -98 283 48 169 77
3344 77 142 225 9 -298 -220 -169 30 86 -82 228 107 212 -154 81 89 -59 -4 -3 -107 -57 -209 -123 -27 -43 -53
3369 -53 -75 -326 75 -62 -25 -78 80 150 327 50 135 -67 -171 27 31 33 47 27 -35 28 141 -61 -115 -213 -127 -3
3395 -3 -24 -195 111 191 160 259 149 -422 222 55 271 397 4 -24 173 112 31 -63 -38 18 26 209 220 134 -127
3420 -127 -299 264 41 -168 48 -130 78 261 117 125 -39 90 -23 15 338 151 -110 -192 142 19 56 -48
3442 -48 307 -58 121 204 34 73 -118 321 170 -407 -127 -58 -337 -265 -15 -22 202 113 -90 236 20 -100 -201
3465 -201 297 129 -68 118 122 65 -21 -130 49 89 -68 30 -81 169 11 70 76 228 -267 109 64 110 170 59
3489 59 -114 31 5 101 199 96 94 61 -2 -40 -104 -22 48 80 -176 -31 131 -145 -117 -114 -77 -111 -47 -11 92 236 -382
3516c82M17K6J9K8L3k59J62L8j58L79l15J17j05J27l15J86r6J03r2J74p2J0K8
3539E3k5l86L85O6j20l89K85N0Qj02jM69j90j09L5K52m04N1l8Q7J27j40K38l47
3563a45M9J79Q4l35J91R8l59J55k12K06o4J76P6o0k88M35j60J07l07J29J01j53
3585i7j45J60pm1R8J37o7P0J1J05j13K8j38K3j64L66j50n4l33L01r6J82j44j22
3609a90O1J73p8r1m9K82J88k05Po5q7K24p1R1j31q6J26j85k20J81Q1k8L10l76
3633a38J54k33K56Q5j46J99k08K64j38J3j51J00o3r4K2L85n12K60N6j02M3J61
3655B13l11J0J12j20K36l20K34K9l57L23j20j67K98p7L8o5p2R5R3q5k4J38J79
3678B80l41J31N7j48j69K30J79j24k60J71k48M66k56k21L60m41N48m72J36M6K3
$$ plain form
3516 -382 35 61 80 108 141 -118 44 82 -76 303 -12 105 0 127 -188 -2 -98 5 -87 87 15 25 53
3539 53 28 -358 27 93 -27 -416 -131 -81 -73 -175 -176 293 103 -6 29 281 -123 -72 -110 -23 104 -36 202 -145
3563 -145 -96 83 167 -168 23 121 -238 -83 -295 -89 -153 23 99 39 -249 186 26 133 -174 -45 56 -97
3585 -97 -242 -82 -89 -130 -32 105 38 108 119 224 111 139 1 24 -140 226 76 22 -311 -10 -106 76 -68 -190
3609 -190 -129 44 -34 -125 -174 108 296 91 98 33 -54 170 99 190 59 -27 99 -86 -306 -125 -44 -72 238 -138
3633 -138 16 -217 39 124 -22 177 -31 233 95 108 -43 57 -6 -100 -78 307 -205 55 111 9 52 213
3655 213 -98 -88 24 -96 140 -180 54 83 -274 49 -71 -238 60 -17 21 -44 -116 -21 72 -13 -37 101 280
3678 280 -61 70 127 -21 -190 40 219 95 -165 6 -242 224 -32 -253 107 -334 214 -258 -122 -76 -53
3699e3K05Pk97J49o0K08l76Q7M50l05oM3j11R7j66M11j44p7K2R1k60K34j18j41
3723a10J97l07K99j7M1j44L85o85O00k93j70L18k39K88k90J03q1J93P1j49J29
3744A39j62L0Q9n8p3K78j61J42k81Q6K7q7K39k48J66k35j37M73j58o8q7nM3PQ
3769c3j6j23r2K55K59m28o4J78K48l08J89k98L44P9n15L38j0j34J94j64O8Q9k33
3792a77K62r8j43J53M5m33M51o1Q5j46P3L40m03p4J14K17r9k31O6L8J60J73m12
3815a00J11n09L05K29jj20r5M35r2j93p9j39J24J68l50L47l3l5m9L48j43j42j08
3838a21J22K9K45k43m16M66N8m28M05q9J9M8k95P2j08Q3J36j68k2L25K3k35J06
3861A2O8q7l2l9J12r2N3J1m9r6N67k12m19K19j22K08r3j60R4n5N8k91M49k65K73
$$ plain form
3699 -53 152 159 -138 11 -49 159 -217 -130 320 15 9 52 -59 38 -128 283 139 62 84 175 -85 149 31 -110
3723 -110 87 -220 79 62 103 -41 344 -341 259 -34 -204 114 -125 163 -127 -24 -105 88 159 10 139
3744 139 -23 7 96 38 -35 243 82 224 -57 29 56 -31 208 -40 126 -109 -246 227 69 1 -86 -91 -48 -41 -33
3769 -33 -49 -172 -264 -9 250 -178 -242 -64 184 -124 65 -233 111 190 -325 13 3 -131 63 -101 -33 56 -177
3792 -177 85 -13 -156 -3 42 -391 60 -1 84 -62 11 351 -52 -126 -12 205 106 -125 -59 -21 139 312 -100
3815 -100 11 -498 -193 36 35 -85 -180 255 163 -30 -109 -248 -124 44 -306 41 8 -27 -76 272 129 -13 -121
3838 -121 1 30 275 32 -384 82 140 -288 117 28 47 95 -200 -128 -236 -153 -17 -185 -207 118 141 -94 12
3861 12 80 -7 -39 -78 34 -58 -5 6 -43 -139 428 216 -203 16 -106 102 9 -151 -57 -112 -54 -345 104 -161 112
3886A12k68J14j63K29o5n1k6K92q2j88M4j76L00r5M2K0k76M94n94N37k45M4k52
3909b53M72l02K15n1P6j66L34m03J22j80K95R0m46J45l8J60l30L5K08J71j61J45
3931A38R4l59M09k6k48k38J17K54k47O0k5rr4M1L35m23p9L61p1J61n4r9m2o1O6
3956c9J09J59l60K34o4j43O9J92o4o6J20k28j02J28k08L21K9m2j14J52lj22M4
3979BJ73j27k42J91j48J26q1k36L56o0J54j79p6k1K55j43J94L3P0Q1l66L5K3j84
4003a70JJ05k02L05k4k18K69p1j97L29n5O1l78K00r7P9N4J5j13P0K81j77q2P3
4027E8M4l2J7p6m0K08k41J23J5Q9j55K52p30L40J50l07Q2L05j69P0r3J0N0J10
4051H0j13L2N3l09K78j48r6J93J73k9J96k98j60K29n8J09m7j60M0j45J01K26O9
$$ plain form
3886 112 -156 -42 -205 24 -41 -92 -118 174 92 -96 -52 -228 72 -23 19 39 -237 257 -337 200 -45 -1 -253
3909 -253 219 -83 132 81 157 -9 325 -78 44 -136 159 249 -197 -52 -90 70 -260 -225 -17 154 -7 138
3931 138 232 -127 282 256 8 -230 -113 141 -106 -46 -71 -80 -174 -133 202 -221 -300 61 -10 151 97 -2 -44 -105 -39
3956 -39 70 229 -131 103 39 -104 -35 157 93 27 147 -81 -183 -55 -263 58 87 45 -69 83 80 -42 2
3979 2 175 48 -194 -3 -151 -25 -106 -342 14 -46 108 -71 -147 -168 87 -56 138 171 241 322 -44 -9 14 -170
4003 -170 -169 -64 -266 39 15 -203 66 -5 -202 127 72 133 -245 -45 -142 -63 -9 6 -107 -37 244 67 -15 58
4027 58 102 70 87 11 -29 179 -62 61 76 165 10 262 -468 -128 22 -285 -203 102 -67 3 -90 -80 -30 80
4051 80 -33 -1 52 -257 21 -127 -223 -30 143 114 310 12 -148 81 23 132 85 -75 -35 -180 -79 147 216
4074B16k96mJ21k7M3n3j94L06n3L2k51j0m0L44j45K49k46Q6l9K09k93k7n3M07
4098B82m50LM7K2J23n6J03l39L49K6k01k20K87q1K57k02J32k64J75K66Qp9l49
4121a61K59Nk78P4Ro5J51L19k94j72K46j28J13j73M1P4L40n92M63l42J46K9L0
4144I4q0j37M9k52J81J96J0j65P4M24m28r2K89j68l7k04L23k54K11j94m7J94J08
4167I5j52J69l99J32L63j99n9j85R0r3J73n6J9J54o5J0k31J52M5j4jK61l05L01
4191B05l18p4J68j5m9o8M14m05J61m00L68l4l4J15m7j48J12K3J33Q3n95N73K7
4214A95l56J74j17K30j45K48k55Q5m2J6k18QK29l8p3p3K91q0q0nJ3k09j29O36
4238C05m47k8k6L47k58q0o3L37l9q9R9j9j31K76j93J37r7K34k76P3j72M15k63
$$ plain form
4074 216 -80 -84 37 10 53 0 -194 112 59 91 -160 -170 -210 134 -11 238 -8 78 39 248 -45 -72 -125 282
4098 282 -168 -165 -118 -96 27 -29 74 -265 84 110 -91 -311 -24 -105 152 -50 82 -182 -7 259 267 188 -161
4121 -161 98 103 -175 -101 -92 -157 -6 313 19 -153 93 -35 78 -95 -54 20 360 -232 231 -111 35 64 94
4144 94 14 -123 -74 -326 -145 51 61 -104 -30 394 -34 -126 163 -5 -42 -246 77 -177 34 -160 -207 -13 95
4167 95 -57 112 -287 -155 208 9 -50 -235 -145 -238 -65 -121 -102 52 -13 -3 -234 -82 -37 -51 -52 209 -96 205
4191 205 -113 -187 -19 -34 -83 -151 263 -142 19 -381 -13 -47 -81 34 -13 -161 -49 -26 107 190 -405 168 195
4214 195 -161 13 -104 126 -19 229 -26 59 17 33 -185 -177 52 14 -59 -132 159 79 -1 -6 7 -202 -331 305
4238 305 -142 -170 -196 151 -107 -187 -250 87 48 -41 58 39 -92 184 -9 128 31 265 -11 62 -110 305 42
4261D2j16N8NJ48l16J15J99j37J39j4j67J38q9K73m13K69J63l02j35J71n2K99
4283B78m80K86J03m22J49j07K59k1m8j28K61J2k96Q5O5O8k09M8K54pk19J10K02
4306B43j25r0M3K69l45J24n5O9l46K86j48o3J45n0J15R2j70p1K20n0J19k83J87
4329A16j86J14j00j23L95j86J06J8k83J48N5O0j24j06K2P0j6L9Q5l27K23M0R8
4352A38l67RK10J25k75k21L73J43j55M8J29n3k83r2O2L83l65nJ78K26k78J24m6
4375Hj79K57P3K46l65J07n4J9J01l28Jq2K57j29L18k45k8j0k84K20L22r0k43L42
4399B34k13q6J15q2oJ75k8j74J21r4M6J86j56o0Q8j84J56o3j17K66r1l60M41k82
4423a68N1k53M15J29k43M3Q9J31l11K93m50L22J26k20K54k03J8K8k61J64J1J47
$$ plain form
4261 42 -74 -16 -11 137 -179 -64 135 -2 137 123 -44 94 5 278 -135 134 297 -5 -140 31 -21 278
4283 278 -202 84 187 -235 -86 -193 66 45 -3 -131 130 142 -154 -69 -4 64 -145 -97 157 150 -69 41 243
4306 243 118 28 71 340 -5 119 64 133 -213 73 -75 -138 7 -43 72 164 -6 -77 143 93 212 -71 116
4329 116 -70 44 -56 -179 216 30 136 154 -129 19 74 134 10 -96 -74 -4 -20 19 104 -223 0 40 138
4352 138 -229 -220 -10 115 -160 -381 -8 135 -20 28 157 104 -179 -271 -209 174 -191 -196 -18 208 -70 54 8
4375 8 -171 86 159 405 40 147 93 112 213 -115 -114 -196 61 -68 250 5 -23 -33 -317 -97 225 135 -108 234
4399 234 21 -65 50 -32 -38 137 109 -65 56 -38 8 194 38 -22 66 -118 38 -25 -142 124 33 -327 114 -168
4423 -168 -117 -370 45 174 -69 -26 63 194 -117 176 -274 48 174 -46 208 5 23 51 -210 -46 -35 112
4445A12k6J29l16P4l7J6o1R2j1j43L78k59l4K98K5k24j2J42L0j28k60q2K38Q1
4469B2j35n6K78k45K79j10J0Rr4J04M7p7k76J35J32k0J28l26J85L6k24P1K19j6
4493G6n2M5J30L4l63J30j95K73P8k28K04k50K75J21m12P7L9j06K71K1P4j36k54
4516a48r6L00j0k53L66j38pq5kn6p0n2M14l13O8K87q1l61Q4L71m53J65K3j0k1
4541g8M2j82M07J09k41m7n4J14R5k47n3J85M3l4O2Q3K0j86q6L9K4Mj77N8k24L58
4567C4q3RJ29l6o9J88N1j94j23K38j81K40k86p0j81M16L5mk82K29l0o6J97k35
4591g4l3L7k34N86n25L36K29j13J4k60j06J68J1J63j85K4j07j19J37J50J64j99
4613F4K6J52k43J1n2j97L29J7o1N5l56R2J38q1L1L6J26J39k39K25k32J07O3k48
$$ plain form
4445 112 86 215 -101 -27 -64 -48 -109 -17 -28 -171 207 -52 -86 212 237 13 1 143 173 45 -215 -297 -59 22
4469 22 -113 -169 109 -136 143 33 43 52 -42 62 109 32 -244 -109 23 3 131 -195 -10 26 -198 -127 92 76
4493 76 24 69 199 233 -130 0 -195 78 156 -72 132 -118 157 278 -134 -57 -18 -124 147 168 242 106 -148
4516 -148 -244 56 46 -207 159 21 14 -71 -73 -129 -199 -251 163 -150 -82 205 124 -237 -153 218 -235 -70 -47 -57 -78
4541 -78 -36 -218 189 298 57 10 -44 70 165 -82 -135 50 93 59 121 204 224 38 -48 -9 15 19 -158 -100 -324 34
4567 34 -49 -40 89 53 -16 172 223 29 -94 144 -37 203 -83 -153 -334 82 117 113 -169 60 30 -36 161 -74
4591 -74 -107 -70 -304 282 -243 93 322 209 223 -37 -143 25 36 199 14 38 -69 -188 -51 99 263 64
4613 64 90 242 -1 10 -42 -239 90 107 46 101 -255 -163 -25 -106 -75 -39 87 226 -13 212 -20 87 150 -98
4637i8J13k13J88j13j21M02j84j02Q5j8k5K65k37m2J67j52j12K62m11J70L32l27
4659a71K21J25l25J44L20j71k26j5L1J81j56j4o9Q2J56l41o3J05K73R0l56K4L22
4682A67k39J09p2n1K64j63J66k16j5L4m8K0L01j13N7o0l77L29j87K47j82J60j35
4705do4j28k10L36K5P5l9L0M5n0k99K86J27l69K27N0j29P6k0O9P1J18k16N3j50
4730i0n8K01j24K12j61P0J60j50J12k80QJ67j50K29j53j01J4J66k23K73l4j07
4752a9K37l21n5J16J5NLo7j51J92j14q1J61K47p6K4k53RR3J06l99J90L11k25J52
4777A00n8Q3m4j90j91J12J81J90l48J4J43j38K86l8J5j20q6K22j11j03J42Q3K
4800A46j96L7OkR8lR8J1m01K17p1L3N6j9j41J9omM93m78K39MMok5J40j78P3l44
$$ plain form
4637 -98 15 -198 -10 -123 -244 158 -26 -128 -43 -61 -86 179 -58 -100 67 -85 -197 65 -346 -176 156 -171
4659 -171 50 175 -150 -6 314 143 -83 -98 -67 114 -42 -56 -125 -43 113 -228 -291 -186 87 177 -179 -155 167
4682 167 -72 37 -35 -86 178 15 181 -35 -50 -16 -64 -44 257 144 201 141 -236 93 -94 153 -29 131 -4
4705 -4 -68 -196 -406 -70 -45 30 -9 21 66 16 -283 3 130 -239 -12 38 -91 -15 -35 34 105 223 7 60 -90
4730 -90 -148 53 -71 141 -20 50 210 60 172 -108 -100 67 -83 146 -7 -108 -94 72 -151 122 88 -19
4752 -19 218 -103 -158 -42 -27 -22 -19 -86 -237 -45 -159 -240 -79 168 92 116 -137 -128 -35 71 -328 -138 173 -52 100
4777 100 42 125 81 -109 -300 -188 -7 183 -165 -151 -8 -146 140 102 117 -3 -89 133 22 -81 61 144 146
4800 146 -50 -13 -7 -9 89 86 184 195 -206 11 -60 -27 29 10 -131 -112 -118 -122 371 -107 132 136 140 134 109 249 71 144 -200
4829b00K76R1k45J6K46k64K13K0j7k52J25J89j76K52j65p6J14o5q9J57j95p6K00
4852G9M7j48r5J76j7O9j64L2J25J57k51M5k80J51m7K68j9l1m6j82p7J50J60j20
4876a8J05j62l7j82L49q9k9m2q4K03l27J7N00j33K72l42J21j08k0q8J28P3r5l7
4900b5o8K70q5k22K59m28K83R8k15K26O3r5j08j3n3R8J25j39N8j5j2N6K80m09
4924g1Nm7m8J29J16r3L7L59l92l45K27K23K23l28J57J9O3l07R1J29j49J03J14
4947B15j78l14L52q0J58l16L54j86j23oK20m4l53M38q0k28M58k98O8j57MJ7K09
4970A30k72K66p8J50j51J14j78qR0j2k1O2n1q6Mo1Q0K3k61M60j65J55l03J26J3
4995B6m6n9O4J19j98N9j12O0J19m5k63L85l4J17n58L85j50J50L4K6l37K06J32
$$ plain form
4829 -200 76 167 -78 -62 184 -80 133 153 136 -116 9 198 22 274 109 33 147 82 -7 150 -45 -121 79
4852 79 126 -22 -117 59 42 111 -53 -21 104 261 10 55 -225 -74 -121 147 128 97 51 -131 -208 -58 102 -18
4876 -18 87 -75 -112 -294 55 -34 -63 -105 -189 14 -313 -296 204 71 343 1 122 14 -6 -94 34 107 12 -25
4900 -25 -93 177 92 -130 129 -299 -16 82 -133 93 156 61 -47 -60 -113 -15 110 -29 29 14 2 58 338 -71
4924 -71 -66 -113 -161 -32 84 -9 28 387 -5 -350 -123 100 323 -5 152 171 234 -73 18 147 -2 101 215
4947 215 37 -277 75 -5 153 -163 191 5 -118 -124 96 52 -301 137 57 -171 287 -11 57 -100 -96 -79 130
4970 130 -142 124 46 196 45 159 -19 -27 63 51 30 92 41 -45 -41 -102 -22 1 -260 200 35 190 -113 13 26
4995 26 -20 -79 -15 104 -94 -35 -147 -87 32 -13 -276 109 75 192 -366 19 -131 19 53 79 -258 -52 80
5018H0j84L62l03L3K12m4l3j24N2r9L1n9J66r7q2j07L03J39k27K48p3l18J5k5
5042a34K56L4j65P1r6P6j10j49K02N9r4r2J16N9nk43L76j32K18l29J80k06J2O5
5066c1L6j06K55j09n6L5J20j56k87L14k78M10n07L90l0N6J60j14j80O2l6P3J06
5089A27j36J75k87m3j4N14m72J72O2N1l6k27L92l81R6%j88L0K1J47l1m3L51k80
5113@q5j40K98l8O1L0L3k49K10j39J0O7j81J90j91J21pR8O4k11%J64j17J80j95
5138b7K70l5k71J13j46r8L05k37J12L5Oj29L40j71j37j20K92k76L14N7o2j21J2
5161B6R1p6J62k73j01P0Q7n4J6m1R7l7M6k53K76m7J23R3N1k78k11K06m6N7j41
5186a57J47k24r3K88l1K87k17Q5m8j26J17j87K80o6K47k71q7O0K98m40K20m3j99
$$ plain form
5018 80 -104 258 -45 -12 200 156 123 -1 51 -48 -17 -76 90 -7 -89 -196 107 246 19 267 194 -124 -109 -134
5042 -134 122 156 -9 62 -34 42 -68 -217 -15 44 -50 -142 -26 33 28 -215 161 29 247 -82 98 -108 -96 -31
5066 -31 5 -101 154 45 -11 24 144 -12 -299 15 -263 147 -360 30 0 56 216 102 -78 -16 -52 21 127
5089 127 -9 166 -121 -164 -178 336 -136 36 98 149 113 -114 278 -103 -7 -7 -195 -165 -144 3 -28 -71 280 0
5113 0 -85 -225 73 35 96 126 159 -90 120 -19 -9 58 -123 67 -124 -3 -10 88 152 -59 -59 105 -12 168 -27
5138 -27 243 208 -63 50 -96 -194 111 -126 -14 21 27 -102 238 67 -70 -190 102 -174 140 197 135 14 26
5161 26 117 41 203 -70 -171 -101 -14 -68 -52 -93 4 -33 13 -240 36 -11 112 205 256 -22 -233 -27 -73 -16 -157
5186 -157 -10 -234 -327 -39 -70 217 0 85 37 -89 28 -159 121 55 302 31 -56 4 302 -138 82 39 -160
5209a60K13k09L75k54LJ48o4J53k89J71j13K14j24o5M4j26J07J7J16l4o7J07k96
5232a33Kp0N1K78K3j92J95k30N8O8k7o4J63J90m35L62k06M3j10k3j02J17RQJ8
5257gN3Pj36J22j05O6jM9j67j33J58J50J2q9K17j82J90k00j80J18j13Q4j40K84
5281E7J8N2Q8on82L73j28M9k8m6Q7O6k57K94O2k31L49l21J40k27P7R2J16j97M0
5306f3j18L48l63K60O9j38k40J28J21n0L4J84o9p1P7K1j29J29l07j35M37l10K36
5329E1J4j00k9Kp6M00m61L16j19j35k6N0L36n27N4J79O1J9j07J37j69M33m09J68
5353F2j55M15m29J1j69J44J35l1J12o7L1k38P9J74j66K07j28r0K59j90P1j68M7
5376h4K01pk07l2Pr6J67k9O9K7j5r3k05L76K21l35r6K03j35M7k78L30j18J72j17
$$ plain form
5209 -160 53 -156 219 -35 -32 116 52 205 -84 87 -26 188 64 -1 43 -83 24 41 157 123 56 163 -133
5232 -133 -131 -201 -150 128 151 -41 154 -76 -18 50 23 -41 122 312 -123 239 33 76 -34 -57 -159 -42 -33 -25 -7
5257 -7 46 53 -83 39 -66 0 -1 48 -119 -252 -94 56 68 -21 196 14 204 4 -176 -58 -171 -87 -227 57
5281 57 75 127 215 209 -373 0 -128 -79 -107 -153 -66 0 -257 37 99 -132 217 -104 36 -191 -114 -22 94 -103 -63
5306 -63 -181 167 -196 64 133 -5 -245 -117 4 -46 -12 172 103 32 109 130 1 130 -177 -312 125 -185 51
5329 51 65 -35 -64 -62 -138 262 -199 117 -2 -137 -163 -113 223 -304 -250 -71 -10 9 -98 39 -130 303 -106 62
5353 62 -93 322 -107 -96 -265 -121 14 -17 95 28 59 -179 -100 74 -92 115 -13 -103 156 -34 37 -131 -84
5376 -84 117 110 -97 -129 -122 -218 -51 -80 -11 16 1 -92 -297 79 300 -35 -131 72 -63 -16 -294 36 -82 90 -27
5401b7J73j1Nl15Q4K18J3N4j00J0j31j59R4K31j39J63j12l3l5j64L29j41k34O61
5425D34n25j54L98k03p1K5M20m65J88l1J09m1o6P9O3l79J42J27j12J58p8L65k54
5448A29kN3j96j4O1QR2n5Q8j33J4j86K67p0L3k30L22J00n08J19R9j0R9l8k31K89
5474A00j29k6j43P1K47k64N7M8J60j22K43N9l88j01r3M13l76M14j53K6o8Q3j37
5497g9L2Q4m6J44k36K12k5j28J06Q9j36O4o4J78j95j0r5K41k17J29j07J81l25
5520b03L37l60j0L34l23J86J82M7l60K72O3J23j47m9r1J01l3L3l64K00J60o5l03
5543b70M60k49L08k77J32K6q6N5j8l52J89l8k5Q3M3j55J45K11k50R9O6j28L1K97
5567B97m88J43M0l5O9n9J48K35k97m2J34j02L7J11n3j63K06l31J86q6O1j14J6
$$ plain form
5401 -27 146 135 140 -175 -91 127 140 194 94 104 -27 -186 -92 139 0 163 51 18 -17 -181 148 7 -227 434
5425 434 -91 -245 153 -50 -121 -96 324 -141 47 16 125 84 18 97 160 -219 -77 50 -62 96 18 383 129
5448 129 127 180 -16 -30 31 39 131 76 164 31 45 -141 126 56 89 -141 181 281 -227 -108 -9 -19 80 42 -189 100
5474 100 -29 -55 -198 -127 120 -144 -87 -39 121 -1 242 301 -87 -188 -281 132 -244 170 17 43 -25 58 -79
5497 -79 -47 37 -9 135 -101 111 86 -42 64 153 17 81 17 195 0 -10 -105 136 -81 48 -59 122 -203
5520 -203 134 -226 -236 98 -225 -39 143 190 -170 102 165 288 141 92 1 102 69 102 -262 -62 98 33 -270
5543 -270 190 -59 249 -28 104 130 44 99 81 -271 -82 -120 -145 -62 -19 -174 -29 182 -68 31 97 -31 0 297
5567 297 -191 -48 -8 -43 26 -33 115 350 53 11 145 43 80 191 138 -25 181 -150 36 -50 11 -103 -87
5590h7l1PK34l03K60q7K0j42J64J94k12j06J29l22K90J26k5k10L64l72J9q3K70
5613I7j96j25J55P3J81J35m24K82k50N1K46j93R6k31Q2L3o1M4k0oJ67j86JJ17
5637F8k52P1L16Ml27J24o7K85l02p2j22M88j75j2M9j58J94l23J84L81l34p7J71
5660A14k51J84J15j16j97J95P8r3j21k1J20k7P9Qj02M3J6O3J42j7k32j12n5M60
5684B73k05Ql4M0K09k10l04J19J17k12J03K35J4k72J64k49K97p4K41l35o3K05
5706F7k65K64l45M33r1j46M0j63J66O9j0j02K24o3J09j26Mk57P4K3J09p0pJ13
5730E0J62M8k7j75p7k6J10R3k4k82O1m8J02n5M6J9J45n3j74K79o3j47O5r1j8K61
5756A81l47L60q4M3m63M83o8k98q0K16l7KK25J44k24l43M51j22J0L0L2j40K6j7
$$ plain form
5590 -87 -118 -111 123 -180 80 -7 13 -129 35 229 17 -89 40 -282 8 134 109 -101 263 -109 -90 -173 97
5613 97 -99 -224 -69 4 185 320 -104 178 -72 -21 225 32 128 -103 -21 12 -49 -5 -25 -31 136 -50 -49 68
5637 68 -184 -113 203 207 -120 4 -63 222 -80 -152 -274 214 39 27 76 -82 112 -211 -27 354 20 -57 114
5660 114 -137 47 162 46 -151 44 122 29 -92 -113 7 -20 59 67 -35 8 24 87 229 212 -20 -132 -187 273
5684 273 68 76 42 82 291 81 -223 -104 13 -199 -96 139 153 -119 45 -204 93 19 260 -75 -138 67
5706 67 -198 66 -279 154 63 -83 -43 -206 -40 29 19 -83 141 78 187 61 65 -192 -118 -95 14 -56 -63 50
5730 50 212 260 233 58 -19 -45 65 158 134 -148 -87 -135 -33 -88 -42 -23 122 69 -105 174 111 -36 29 -62 -80 181
5756 181 -166 194 110 153 -310 173 105 -193 -273 -57 -94 -92 133 277 53 -290 161 39 49 79 111 -29 -3 -20
5780b0J9k17L17J85n89K89o8k9J90Pr1m7K82k06k2k4K89k13q7o7J9Jq2K49k11
5805a26R7l84K77J86k7J20l30L17l37M0P6M4k13J89J86k38J45J82k93K34j39p0
5827f4j43J32Mn9J44n5j88R9J71n0Kq7K03M7k25K82l71J29m2M9O1j06q5n5J18
5852h9O2j12q6L79k36j28K18j74J37k49K08j05K31J90k63J85R0M5j7j18m10K25
5874a7J56m90J34M36l79K8K48m5k93L42j99L52k71n1j48L21j91J34j21J26k21
5895a49KJ59r2J53J16k87P9j1j57P6J49j25K03j68N9J08l41N3K21j16J0j6K92
5918B18l21K12j42J17L4j28K36j22P2k90q4o4K34L9J23r6n8J92j27k6k3J04j6
5941H4O2l63K07k8p8k8k4J06K29q0p1L4j06N3o0M6k9J87q7J29k1j72O3P5l31L60
$$ plain form
5780 -20 -1 -218 99 284 -305 -16 -84 -113 77 84 -7 -54 228 22 0 -24 265 52 -35 -102 -83 -82 -164 85 -126
5805 -126 -29 -413 -136 50 23 143 -187 130 -207 -167 -91 -47 -260 -71 115 -123 22 204 -89 145 6 -64
5827 -64 -207 -75 -71 -130 14 -41 -229 -130 41 -9 -7 -94 109 156 -69 213 -158 -29 -71 -22 39 -67 -152 -207 -89
5852 -89 -27 -139 -225 154 -82 -210 8 -166 -29 -278 -70 -175 56 246 -17 168 258 303 286 168 -242 -17
5874 -17 139 -351 -217 219 -160 -132 116 71 -222 120 -79 273 2 -49 -197 124 -67 67 -54 72 -149
5895 -149 -147 12 -80 73 189 -98 -19 -30 -187 -111 38 -87 116 -52 7 115 -226 -173 48 -68 -58 -74 218
5918 218 -103 109 -33 84 118 -10 226 104 176 -114 -198 -262 -28 11 134 38 -20 172 45 19 -4 100 84
5941 84 146 -217 -10 -38 -116 -144 -168 -62 167 87 16 50 -56 -3 -63 -17 -46 141 54 183 162 -10 53 128 -203 157
5967A57l92j15K55J3K2J66j03l3J42l01K38N1j47J16m90L24J68L10l04k5k71J11
5989a08J41J01jp0j50N1J86L0k15l52M14k61L83l22J12J19j0R5m7j9q1M5M1l1
6013E1l12K88J2r3p5K86j85j19P2J39J77j05j91PK88j98m27N71k08J05k47P8J63
6036G7L03p38L40J22j35K31k4j95p8j31M68m48Q4K84j07o4P8J01K7j18l4O7N6
6059A66o52N09j6k8M0J57J6l8m01L51n2r2J11J20n4%l35Q8J70M4n7l2N7r5J31
6084A08j49m9J11J45j15P4j83K68j18j42l6K39j45K29m42k2K00l2M2J61k59K25
6106A10j8J16j17l77N40m06K53j24j7j13J49j71J21J39j88mj6L4J17l3j50L50
6128A95j67j9k03L22q0m1k05M99l38L25m08J30J11m4R9j35MO7n5r4M0K15j67M6
$$ plain form
5967 157 -235 -350 -95 -82 -60 106 3 -30 112 -189 49 100 -47 69 -421 -97 71 381 77 52 -219 -108
5989 -108 33 134 133 63 -87 -36 150 180 -35 -387 27 -234 149 -173 -61 58 48 143 96 77 -4 41 82 51
6013 51 -261 27 39 -54 -129 157 -28 -147 -75 64 241 136 -55 -48 240 42 -385 186 -22 83 -164 -86 77
6036 77 380 -358 -18 104 -31 200 176 -19 -97 -228 240 -208 -124 160 53 -11 67 168 195 77 43 110 166
6059 166 -486 23 7 -21 19 176 192 154 -247 104 52 -40 71 191 137 137 -198 -110 60 104 47 15 72 -23 108
6084 108 -41 -90 21 166 51 125 -58 210 92 -50 -86 153 8 237 -205 -227 -27 -59 -17 144 -115 110
6106 110 92 208 91 -286 254 -152 101 -23 -40 -153 -4 -175 -54 85 -103 -107 -123 -89 28 -5 -155 195
6128 195 28 9 -194 128 48 7 -198 301 -37 288 -120 10 121 77 176 41 45 112 57 -37 3 218 51 97
6152I7k4Nk07P9p3r9K64qk18K87r7j38M45l6l75J09R7r4o7Ll2O8jk67J30J72L9
6179E9j18K9j12%K54k85L60l41L06k17K90m53K59q3kJ55j96J40q7LK01k95L32
6202A99k0j79J5j1k3R0p0k11R5j90M28n5K3r7p2R2J19P1p8j72p5K61J0j21J88
6227B17m58K81j12J22J11j20j41l3J58j14K56k60K04l61J40L29j84ONM2n8Mk40
6250b06M38n7k5jj23j47K42j03K0l66L53nr1MK59Pj01J10l02j2K28k95L93o7k81
6275a28K51j88J64J3j13J19k86L48k98O5L6K21l8j98J9K52j99q4J42j86J60q1
6297iJ65Lj0l47qk59L39J94R6k6l35J06Q7l85M06J32k32L06j57k48L62l84J80
6320b4l7OQ1r3K23k64m1P9J0l2K14l00O28k08l96J46J94J36j69r8r9J56L4j61
$$ plain form
6152 97 73 78 -129 -50 -123 -222 42 34 -184 103 6 -132 313 277 -98 11 108 14 -53 -50 -82 -14 -15 -282 -152 20 59
6179 59 -59 -30 -142 -142 112 -173 187 -154 152 -65 225 -228 31 -52 -54 101 -95 45 -42 -39 162 -133 199
6202 199 179 0 15 4 -19 71 1 -210 -115 -305 123 68 91 -6 -78 14 133 204 126 -46 -121 140 150 29 217
6227 217 -241 40 -72 50 161 41 -100 -133 25 -89 167 -93 111 -250 -110 219 35 41 46 88 30 34 -206
6250 -206 232 175 150 149 26 -121 121 18 38 -328 25 20 -71 -67 192 199 98 208 -94 -106 122 -173 220 153 -128
6275 -128 123 -65 99 112 -1 118 -168 180 -118 -53 -17 204 166 -32 -13 239 40 -44 98 -88 72 -9
6297 -9 156 159 149 -198 -206 -465 -126 68 164 138 -197 -91 -4 -389 17 149 -83 223 66 -182 180 -204 -24
6320 -24 -61 -55 26 -67 156 -108 -149 -70 -60 -92 122 -178 450 242 -154 -8 186 322 153 55 -44 112 146 -15
6344a5j9l3K39k48K36m61L30L8j73K90k18P2p1R2L8p0j45L9J87n0lJ21l12J9L34
6369B17j94j38J54R8K1m7l34L90k45K96p3J42k93K95m77K53J29o0o1j78K11k25
6391a19L35l16J53l3k22L38l18N06l28O7l16J64L4j56K53j13l8Q3n7L21n57M06
6413H7Q8l61J97j76J56q3L1J39k2m44M62o2O0J61j58j4Jj12P5j96K41j7m2J42
6437A53r5j14j67K15j17K25PK18n68K43N1Q6l00J11p7L11k89K29l30J40q0Q4L0
6460c4J5O4j69K46J14j64k68l6L22k09K62j3j82J65r4K8j6o4J06J03j10J30j91
6483Ej5M8O5j63M1l3N9l11J80N4qn5L61r5j37o0K27K3j41P3j50nK1M6q8R2j14
6510h0m3j11K56j6j0J35k39Q7k05Q5J71l3K29k25K20P2j57n55O20K06n35R2J93
$$ plain form
6344 -15 -34 -67 172 -76 160 -301 29 67 -106 184 -34 38 -33 59 97 27 -118 -79 108 58 55 176 -136 -117 217
6369 217 23 -115 39 137 158 111 -223 167 -78 218 145 287 -6 289 -188 65 194 134 73 -105 106 -119
6391 -119 216 -100 53 20 -202 136 -182 324 -4 63 -253 -89 -55 -211 42 -71 -109 -26 -83 238 -319 87
6413 87 175 -186 11 -165 -9 -92 -61 78 56 -388 74 12 72 233 75 61 62 -50 25 -171 70 53 11 153
6437 153 58 -56 -223 -8 -125 100 107 325 -243 0 51 137 -163 -52 -129 182 -107 122 -208 -68 -148 -64 -34
6460 -34 -19 45 -124 122 236 72 -196 -232 90 -119 143 130 -52 113 19 47 31 -33 73 176 66 196 5
6483 5 -10 38 103 -60 -19 -52 7 -304 -124 -70 -78 -133 228 133 -4 -64 163 186 45 118 -32 -37 -16 30 -58 34 -80
6510 -80 -123 -234 22 6 -4 131 -108 -21 -226 -141 30 -3 226 1 221 293 136 -419 201 407 -128 -36 157
6533A57j1q2O4m7J64k79J77j83J1K06k26q5j9K19Km19J68K51j89q2J90j19K44
6556A12J47k60J9j28k12J91J01JJ32k9j10m2K30R0l47M6l31M60J22j44q2l8k9
6579a01J81p1j40Q5k19K46j19l3K80k30l7J54N06o49J56j98L19J61k78j04k78
6600c69L96j80N6J41K3j07P4N0K11L3j73k96J10j3mk2K08k1m05K57K41l42J46
6623A4k04J10m4J45k70L69l30M93j91k9j88K27j74K48l16J70o6l2Q8q0J11k30
6645a79K84r9r1o2r0M5J20L87r1k42m1M1K55k04J36j13j01J43Rj03R2J08k37K6
6669gK32l02L31m07o2k4L70m3m0J2K4j58Q2L9j00J47j20J02LL0l46J09J44N1l49
6694b82K63k46N5N1n6K80j16K41l72K06K4l8J0p7O5J2m1J21m3l2J25k3J9j13J29
$$ plain form
6533 157 146 64 128 81 245 -34 143 -40 -29 177 -49 -134 -153 66 68 -351 -183 68 -121 -203 -13 -132 112
6556 112 259 -1 18 -110 -322 -131 -30 -29 103 74 -36 -78 152 242 -105 -59 -390 70 192 48 -34 -72 -101
6579 -101 80 9 -131 -46 -265 -19 -138 -171 109 -121 -158 -4 502 -147 9 -189 130 291 13 -91 -369
6600 -369 27 -153 -97 44 67 -40 34 84 295 328 155 -141 -31 -44 -48 -70 138 117 -288 -31 210 -132 14
6623 14 -190 -80 -124 21 -249 120 -210 283 92 63 -125 102 -72 176 -140 30 -36 -68 20 -60 51 -179
6645 -179 105 6 -85 -147 -237 -192 -72 315 224 -18 -59 -18 237 33 169 56 -45 98 107 4 96 204 -33 -7
6669 -7 225 -77 254 -153 -215 -239 131 88 48 60 84 -74 8 47 -53 94 -26 76 79 109 -237 -128 16 67 -282
6694 -282 -19 -265 -210 -159 -215 65 -51 190 -182 24 48 10 20 -57 8 20 -21 100 57 25 150 127 146 33 162
6719A62k56n0P0%K38q1J60k13p2Qj90J50j22N38l59P0M5L2m02L70k77L19j16k3
6743Ak37L95J09l39K7P7Jk11J34J22j95K2K13nj35j48K09J4l02K03J58p2Pn4J55
6768A49j97K84l98K0P2O8L59k35L3q1M7p3q2J66K04l52K62k21P4J40k51r8K75
6791A65j22j19L69l93o8L61k05j29J77j77J51J28j32K45j99J72j38J31m19M86
6811B84l07K63l08J12J00j73q2o1K82m8p3n8j04R0J32q4ro8J95p3n7N8j30J97
6835G8l60J52J67J91j43r7N5n2j37J07j44pK73j70K52k42J87o0j18l6J75p9L7
6858B9o4M8l42L51k04L46r9k1R1l26J29L04O0k18Q0j67j08N1J57j02j10J84j55
6881h6k02K37Q4p7K0p5M6J71q0K6q4L23l82j58K84J58k84K63l91R9K86k25J60
$$ plain form
6719 162 -94 -144 -74 -74 164 83 243 30 -42 -34 -224 -74 -196 342 -17 53 98 130 -272 98 -179 140 24 1
6743 1 -236 159 268 -71 -44 33 34 -177 -43 79 -116 -94 119 114 -21 -169 40 54 -248 -45 113 41 48 -6 149
6768 149 -48 236 -162 -142 -70 -2 357 122 155 74 121 48 -34 132 336 -16 246 25 99 239 -12 -110 165
6791 165 43 -76 293 -100 -168 193 -12 -141 36 -141 10 138 6 251 52 224 86 217 -202 284
6811 284 -23 240 -68 44 144 -29 -111 -172 110 62 -11 -69 -173 -83 49 -35 -44 -112 83 10 -47 11 -119 78
6835 78 -282 -130 37 228 85 -12 43 -9 -146 -39 -183 -190 83 -87 165 -77 110 50 -68 -104 71 -8 29
6858 29 -35 13 -329 22 -182 164 65 44 135 -191 -62 242 302 84 164 -3 -111 -60 97 -5 -115 69 -86
6881 -86 -288 -51 33 -44 -24 -99 -53 118 38 64 -20 303 -79 -237 47 205 -79 184 -207 -108 178 -47 113
6904A13k76J42J6J54J33l34p1PK63k29J17k3j22J14J56j85J27J58k68j3k6q0J9
6927a08M7K09J66m07L93l82K73j31J62j74N6l46n1lM46j11J69o4j65P0l42K17
6949g6J17j41J50j60J43j10J35L6j89j20L6L81j41P6k00k0rK43j17j20J34L15
6971C63m18L20l44o8N9k26K02J63R1k25J2J14M3P3k47J95k13K47k64l6P7J64k63
6994a81K66j26K09k30Nk11K81K39m38K27o3q8K4J93P9r0j43m1r6N3q4K49r4R0
7018C0l0J33j10NJ44l26R2K02P2l82Q4q5K80M8p1k7q7J51J39l95K15k59J73O2
7042E8k23J12J15q1m9R0j92K43n7k4j4m3K99l85j8K07J64j86M0j00K53l06j27
7065b24j86L43Kmj8L5j59M4k99K61j4J55K5j7r0j03K26j26O5m6K98k47J33k50
$$ plain form
6904 113 -163 -21 -5 149 282 -52 -123 -116 147 -82 35 12 -110 4 160 -25 102 260 -8 -21 -47 -127 -108
6927 -108 -61 148 314 -93 300 -82 191 60 222 48 104 -242 -293 -296 150 39 208 144 -21 49 -293 -76
6949 -76 41 -100 50 -110 33 -77 58 94 -95 -215 -179 202 61 137 -63 -83 -92 151 34 -86 48 363
6971 363 -55 265 -79 -147 -88 -314 -112 51 142 -83 -71 43 86 159 -88 107 -106 141 -123 -159 -82 82 -181
6994 -181 85 -41 168 -62 -57 -268 13 252 -186 41 -22 -110 -86 107 186 96 -47 -88 -184 -131 -215 34 -60 30
7018 30 0 133 23 28 172 -154 -62 140 212 -170 -86 -171 109 157 86 59 -28 123 262 -133 82 -177 -4 58
7042 58 -165 -53 62 -19 -68 22 -170 73 16 -8 -22 -65 234 -151 -169 38 202 16 56 -44 209 -97 -224
7065 -224 -410 -67 -65 -69 -87 -52 -211 -167 -466 -205 -219 -64 -39 -56 -146 -249 -23 -149 -84 -130 168 -79 54 -196
7089a96K89R0l44J53K76m85N40n12J53J02k7J10j5L9%Qk13J84J8M0k91r6J42J35
7113A00l9j36M7j5Q1j26K69k86K41K54o20L60j92k7K3L45k90O1j32K15k03r4J37
7136b7K43j29k13p3L40j55J16k7j26L12l50k7K35q3J44j39J28k7J22m24n5J85
7158c0n0N5l0k75K66L43j66k9mK12k40j83L15l8j74K36k02j09K43l1l46K21m0
7181e6k6n6R9J02j86J66l63K97O2p1k6r2J77j86L18n5q1l2rk78PL47j97K77j5
7206A23j22J92l93P1K36J6p6m1L9j12l6k0L66l96JJ58L5k62K46r5K82k80K21j50
7230CJ94k08j24n1J89j61J81J38k94M5J1N8J61Kl28J10J11L2q5m5J92j88o6L1
7254i2j58N88k51k34L42k02n8J28k79J83q7R9K84l07j23LL39%j20kp2k2L34k97
$$ plain form
7089 -196 93 183 -161 -8 268 -217 323 -189 -36 66 39 149 134 173 173 181 -32 152 170 210 -81 -177 -35 100
7113 100 61 -75 -28 -43 38 -88 181 -105 136 390 -230 130 -62 -89 -66 279 -11 50 -82 133 -70 -164 -27
7136 -27 216 87 -126 -199 141 -14 102 75 -51 261 -89 -116 119 36 180 41 169 142 264 -160 -215 -30
7158 -30 -80 -25 -55 -330 -64 279 113 84 80 292 52 -131 184 146 -28 208 6 -103 140 109 -237 -16 -56
7181 -56 -82 -138 -39 63 -123 43 -320 -23 39 -32 -58 -150 27 -159 159 104 23 -9 -18 -296 -289 58 -139 138 123
7206 123 1 193 -200 -129 107 123 47 6 45 -67 -103 -123 243 -153 -152 6 41 -221 25 -70 212 -68 153 3
7230 3 197 -11 -135 -186 3 -158 23 161 -133 -88 -77 -19 142 144 -184 -74 37 69 -16 -61 131 -57 -123 -92
7254 -92 -250 338 87 -147 195 -7 -65 63 -216 -33 -120 -21 263 -44 -167 -164 175 175 55 53 -19 -41 293 -4
7278dj79Q3MR6j34M51l18K42l78K02j02l4o2K06k7k39K93Oj18k56K15nN2K51k59
7303a4P4j51m0L59j27k6j49k4r4K46j27%M90m47k64N50l44p2m5J98P3P3k86Q3
7327f4j05J76o3L6j07K02J69m98K75L0K41m46K22J1p9L7j98n1K49j55K40J12m77
7350b43J54J65p4k38L59j43PN3l18L11J25k51k7K06j69jK06n7l9p8O2oK10j61
7374E3j10j67N21m30J74q1J14O7l06M21m61J60K74j78p9L9O5o6K4Q8k06N1J17
7397H4Kj30K92l33K61j0k97L49l7k99J81J2L0K43m26k9J29j84J49N7M7O0j71j10
7421a30M5j51L54j30J08j89j26M50l75J88M6o1m3p8L75l10PM06k50K88o12M19
7443B31k46P3K34j08P0l09Q9J34O6K78p51M42q6j57j58K70K11l06j11MK36K9K41
$$ plain form
7278 -4 -183 -100 -96 0 -134 317 -1 241 -137 65 -37 -71 -133 73 46 -193 100 106 -12 -268 -53 -58 -6 245 -14
7303 -14 60 -91 -131 228 101 75 -74 -98 -192 54 -73 -73 417 -30 -294 256 -88 -160 -205 -7 66 139 -147 -64
7327 -64 -169 7 -56 -20 -127 75 244 -254 21 51 292 -154 68 79 0 37 -161 -212 37 -118 122 234 -243
7350 -243 -89 76 2 -236 123 -20 -13 40 -278 33 158 -93 -120 86 -83 -84 122 65 26 -52 10 4 214 53
7374 53 -57 -224 297 -133 41 -40 74 141 -165 256 -205 -45 229 51 -28 11 76 10 34 122 -84 -33 84
7397 84 86 -44 248 -85 176 166 -131 218 181 -118 63 75 105 348 -78 -107 22 -162 -13 44 91 151 -20 -130
7421 -130 -85 -236 118 -12 96 -93 -219 231 -144 44 90 29 -14 -92 283 -27 -20 386 136 424 -188 231
7443 231 -15 58 292 184 254 -55 34 168 234 512 -239 203 117 -40 -198 72 283 -23 -134 -130 106 135 376
7466C76m08K7k1J67M5j99k8Jk4k38L54l2M9n6n5j6m9L61j19l1Nk09K19j52J25
7491I2J45l84J66q8M5O1o7L2n0p1K53j03JR0k42O7K71m36M27j72m22M33m2J5k07
7516a86M83l14J61n6k18k2k50L31JK14r2m8J30j15K28k60K1J73j24o0J24N0Qk88
7540a09K89j12J50k79K00l76L62m2k23K47p9K21k18j86L1Q3j9P3q6K73m09J03
7562a06n0R8K51M1k14k57M97J84m51J92l18r8J14n8J74R7n0K26l1j83j10P4j05
7585h3L47o18J02M83k43k3L23k39j59M2j17Q2L71m67K66j40J58m0J7J06m44L79
7607A03k50J32k35K94j67K00J78l84J24J75j16J35k10PL6Q1j87J8M9j95J05J09
7629BJ07j72k1K07j25r2J98k03J09J8J22o2p5N9l44M46j61q0J88k46L9k30L96
$$ plain form
7466 376 -32 -5 -26 141 186 -13 -41 -40 -64 -302 52 20 69 13 -42 -58 -107 254 135 104 109 -100 119 -33 92
7491 92 237 -147 19 -69 -24 37 -30 2 -48 -119 134 31 32 122 -120 -53 218 -218 209 37 -385 48 6 21 -186
7516 -186 297 -17 144 88 -130 -152 -402 -71 -70 144 52 4 134 19 247 -13 8 181 57 -3 121 171 179 -109
7540 -109 180 68 218 -61 139 -237 125 83 -140 107 28 249 31 -155 -124 -41 -60 13 -73 200 -209 -106
7562 -106 -156 -58 193 234 20 -237 260 444 -7 185 -133 -231 -117 -175 -1 96 46 272 241 58 -52 22 -83
7585 -83 264 -354 -252 231 -12 -35 288 49 -110 -68 -185 -103 268 -199 67 -73 85 45 62 168 -276 103
7607 103 -147 -15 -250 44 -123 77 255 -129 -5 170 54 189 -21 -14 22 103 -84 -66 -17 -212 -107 2
7629 2 109 -63 -84 123 -2 -94 104 -99 10 28 150 88 13 72 -272 174 13 -67 121 -125 -86 -316 80
7652H0J35q1j27J02k2r9j24L19k08m4J62J37l72P8lp6J74k3J04m40L69j97J67
7675A1j1j35K7j5L9k1K92j34R9k04J59j99N1P0j05K55k82J55j70j90L79n4j4M4
7699D7p3q5k2K57j07j49K66n3K0n2k78J87j40L74j09l0k86L9j25M32l24K02j6
7722b5l06M74J14m44LK18j49M68k81K37l62n6J2J42L24l91J83k69J63j8J01l10
7744a72J52L3J68q4j57k34L31J5M7k57K05j1j71L07j64J28Q9j38Q7M2m04K76l47
7767b59L28m16L23J50k6j95k12M32j25l3O9J10j94J32j68P0K2k96L71j37r8RJ90
7790D7L84l96j55J68J55m19N1K87n6j14L23n28K13R9p8m3n5L59j96N8p0q4k22
7813b72K45m4J53r4%k97L54Qn0J15k44L71Nm40J50J53r2l0P1n68O66j26j79N00
$$ plain form
7652 80 215 134 7 109 87 -12 -136 183 -25 -69 93 230 -142 -64 -67 -143 31 8 112 -328 41 -156 11
7675 11 0 -135 -108 -123 -84 -105 187 53 152 -52 107 -92 -41 29 -76 179 -103 52 -118 -308 71 17 3 47
7699 47 -26 -111 -133 124 17 -132 134 81 101 49 -229 -42 -182 192 83 53 -233 -194 -319 113 -211 -9 -25
7722 -25 -331 143 257 -187 -184 34 -115 353 72 309 -53 -109 -97 45 369 -22 161 -108 55 37 138 -172
7744 -172 -20 13 181 97 -60 -294 37 52 99 -158 47 36 -135 172 8 136 225 87 174 216 -188 88 -259
7767 -259 69 -347 -24 126 100 -95 -307 125 0 -33 36 146 -48 84 -84 -14 8 -288 83 -54 -152 -143 47
7790 47 431 35 -120 48 203 -216 -165 122 66 -48 275 -253 -40 59 -19 -62 -117 242 46 104 34 -50 -272
7813 -272 -27 -71 82 -12 -12 -309 45 53 3 118 -126 245 250 -190 -40 113 21 -9 62 -506 160 34 -145 355
7837C55k83j68J62j44J10N7j08j26K48J91l76k5j01K36J5r4Q8q9Q3j23m3Q2L5
7860a8n2P3l5P5K50l23K76j63m4j15K31l46K83r7j11R6J5j77L72j02j99K43m75
7883c43M04n9m4J19j7r8K16o7l01M56n16K70J19j97K01j2k56K42O5m68L64L8l27
7906b11L12j84K25k60R1J83j13k18K14j29J1J61l45K49j21J87K10j79P8l19P7
7927h1L20m25J43L21k66O9R0j51j31K37j68k49K53M9j69K05j10J19k3mk2O6J2
7950H5j38k2J36R7k17l1J89k15J12K68n9l63J17M1J0K0m9L26j82j0k44K45j63
7973d7j1M7j84L86m60M01j52k8J52j4L6m7o7J27n4j27N8j82L57k02J76mk55K87
7997A93j43j33J09O1Nj09Q3j6j93K49j15j13J14J82k34J17j73k6R2K59r0j38R6
$$ plain form
7837 355 72 -96 66 -78 32 89 -19 -145 103 294 -82 -107 -208 28 43 -51 37 -52 31 -92 -135 -53 -18
7860 -18 -70 3 -32 43 293 -30 246 83 39 -76 155 -191 92 -5 -116 -20 -5 -182 190 88 -111 132 -343
7883 -343 61 2 -42 77 60 -38 178 111 -190 266 -250 20 139 -58 143 131 -125 117 182 -286 78 116 -211
7906 -211 101 -83 142 -118 -27 156 43 -175 39 -90 -79 82 -263 -14 -135 52 262 83 161 -158 -81
7927 -81 239 -186 -43 278 12 81 171 20 -111 126 -42 -291 -38 11 -158 47 -63 56 33 29 7 73 85
7950 85 -53 -75 61 158 -59 -90 99 -116 -4 264 205 -158 -41 0 10 30 -19 307 125 115 -129 116 -47
7973 -47 -58 -11 -195 191 -269 132 -20 -48 104 90 126 79 12 139 85 -42 16 -166 191 -11 165 161 -94 193
7997 193 50 -83 26 87 92 -17 66 50 -143 106 -9 -122 -8 174 -60 57 -116 -142 -50 209 119 -19 77
8020G7J61j53l0L3Q4m9L3j3k94J83J03k40O2o6Q8j34J41J32Jo4O6j10l7P3n6M1
8046C2k27K56N0j88NK23m8k06M38l34j64k7L03J10l05R6mJ22j28o4R4J5J30k21
8070d2K09M2l39J35l1J03o8K24l10J18j03J7m4L57j16j39r9N4j77M78l14K01o4
8093I2l7k00j68L60j41K13k05K57K1l20o0J85k09N9L67l27J28j02k9K13k22N6
8115f9J22k12n4K72j91J5J83m5K36m26J19j91L77L2j97j53J15K19jl32L09Lq9
8138D2K1k82L91q0K4o0N5l5k65j6J5J87Q0j14l4L57n35K05M6J48q7j23O7L0J76
8163B13q2j81j54L07k57J24O5n96N93j4j54M03j62r5j45N6j34L12l42L94j9k13
8185h1J73m9R5j44J39o1
$$ plain form
8020 77 238 85 55 88 172 123 156 143 -151 32 135 -105 -43 -109 -21 -155 -14 118 119 55 121 11 -26 47 -9 32
8046 32 -195 61 111 -77 -72 151 103 -103 335 1 -163 -190 113 223 -82 14 10 132 4 -60 34 49 179 -42
8070 -42 167 209 -130 5 -26 77 9 233 -77 41 -62 -45 -89 268 152 13 -86 -32 -209 269 -45 156 92
8093 92 55 -145 -313 47 -94 119 -86 171 192 -128 -188 -3 -212 -153 214 -113 15 -87 -116 97 -125 -69
8115 -69 53 -159 -213 59 -132 -117 66 21 257 -169 -50 -241 136 168 -29 -182 -67 152 151 -181 128 131 42
8138 42 63 -219 172 92 116 56 111 76 -189 -205 -190 -3 77 -37 -71 286 -249 -44 2 150 63 -60 7 37 213
8163 213 131 -50 -204 103 -154 -30 35 -561 32 18 -136 267 105 10 -135 -79 -213 99 -243 151 132 -81
8185 -81 92 43 138 -6 133 72
8191G2
$$ Imaginary data points
##PAGE= N=2
##DATA TABLE= (X++(I..I)), XYDATA
0@%%%%%%%%%%%pJ5j6J6j6K4l2L2m0N6o4P2q8J04j20J40j64J90k18K50k86L24l66
34a94M14m66N24n88O58p37Q19r10J011j118J238j369J511j667J838k025K232k461
52a290K710k989L301l651M049m502N027n642O375p269Q380r807J1723j4443J8642
67A0614k6034M2879j55621j2077K00645j22287n9256R0516R0159n1798Q188N9774
79G5702L210n2794K1018J0944m3288l2959K1970Q99k3926k2117N051R540P698
92a9052p929k0896k852M1656K6419j0734n487J5648Q232L819M486q60j1913o514
106A4023m526j9774j8397J1847P121j4791l645J4883O346n36J0339J3152o540
119I502q860J4880J1243j4773j3613L819L772n261l305L398k662r621L57O035
$$ plain form
0 0 0 0 0 0 0 0 0 0 0 0 0 -7 8 -8 8 -8 16 -16 16 -24 32 -32 40 -48 56 -64 76 -88 102 -116 134 -152 172 -194
34 -194 220 -246 278 -310 348 -389 430 -480 531 -587 651 -718 793 -874 964 -1061 1171 -1290
52 -1290 1420 -1569 1732 -1919 2130 -2372 2655 -2987 3388 -3881 4499 -5308 6415 -8028 10614
67 10614 -15420 27459 -128162 -140239 60406 -61881 -121137 -30621 59538 7740 15928 75702
79 75702 78912 26118 47136 58080 14792 -18167 3803 4702 -19224 -41341 -36290 -26750 -19052
92 -19052 -26981 -47877 -50729 -9073 17346 6612 1125 16773 25005 28824 33310 32450 20537 14023
106 14023 9497 -10277 -28674 -16827 -9706 -24497 -28142 -13259 -6913 -7449 2890 16042 9502
119 9502 642 15522 26765 11992 -1621 2198 5970 709 -2596 802 -1860 -11481 -11124 -5089
133e089j192j063M931J875l71J622L922M167J157j9k089m383Q3J349n381o797
149g278r37J258J019j52L87J083J183L428L598j33M1J926o89j728p57L24m2j520
167A011j158j537j554R09J409k203j796J358J368P00K81M81J097O32J311P46p12
184B343k64M41j097p56k97m31j11n84p70j32J99M40J22p43J68Q47k3L60K79L9
204C0R53M02l0l60k85J69k33n11j15k72l99K77n35m77O76N30M4m61K02J96L29
225A30k0P21q39J24Q64j62p30M21l20k58j79k29j11o46K06L88l3L71P39P2J08
246F17N31k20K11j88P1m85m98l85K74m23n73N89m54j12N08lK44k18N05P56o55
267I2L54O91l9j76K40k58j07l91m77o14j13k83j32k32j62N81M19N97M89o4N76
$$ plain form
133 -5089 -6281 -7344 -2413 -538 -909 713 4635 8802 9959 9940 7851 3468 3551 4900 -481 -7278
149 -7278 -8215 -6957 -5938 -6090 -5703 -4620 -3437 -9 3589 3456 3497 5423 4734 3006 2249 2573 2531 1011
167 1011 -147 -1684 -3238 -2329 -920 -3123 -4919 -3561 -2193 -1493 -1212 -731 366 998 2309 3055 2343
184 2343 2079 2520 1423 667 370 -61 -172 -756 -1526 -1658 -1459 -1019 -897 -1640 -1472 -625 -648 -288 -9 30
204 30 983 1385 1355 995 710 879 646 135 20 -252 -651 -374 -909 -1386 -710 -180 -136 -597 -395 -199 130
225 130 110 831 -8 116 980 818 88 509 189 -69 -248 -477 -588 -1234 -1028 -640 -673 -302 437 509 617
246 617 1148 928 1139 951 1022 537 39 -346 -72 -495 -1068 -479 -933 -1045 -537 -540 -296 -514 -9 747 92
267 92 446 1137 1098 922 1162 904 797 406 -71 -685 -798 -1081 -1213 -1445 -1607 -1026 -607 -10 479 415 991
288I91K21j43pm98J5k84l19M4Pp35L38j79k38J40J28k31P00p5j1M85O0K4K41o4
312F10J28K0n27j98l1m48n3jm30K22J80o8K84L24J14K47n5N7L03l12j91L01k28
335B48n0k08K6l1m17K35J7q6j9k29M29o9K38J6L2L97J15l72K43l55J54j99m9J14
359A80l49n3J8K1j37j23K32M0J02R2J06k24L74j81r5j37K86l94J49J28j39qrJ00
383b1N7m18K23J72o9K8K32n7K7q2K80m33J41k21L94k96L65n04K9M9qLl2q2L19
408I6O7J65l45k8K5k3R4j72J35J34l22L9M7K0J57l14K59l40K04M3L5k08L47k55
432a40J60J10m0j7q0o0K3K84k27mJ51l54K23j21k16K1J06K19L0k14M22j28k67
455a19J14J24M1j22p6q7J38P7l05L29k54J58j47J91R2k74n6J97l19M64l7j82k7
$$ plain form
288 991 1212 1069 1062 564 579 295 -24 20 27 -708 -370 -549 -787 -647 -519 -750 -50 -125 -136 349 409 433 674 610
312 610 738 758 231 33 2 -446 -499 -500 -930 -708 -528 -596 -312 12 126 373 318 375 678 366 175 476 248
335 248 198 -10 16 -15 -432 -197 -180 -266 -285 -514 -85 -154 84 100 132 529 644 272 515 160 314 115 66 180
359 180 -169 -222 -204 -183 -320 -443 -211 -171 -69 23 129 -95 279 98 3 -134 152 -242 -93 35 -104 -112 -121 -21
383 -21 36 -382 -159 13 -56 -28 204 147 174 92 372 -61 80 -141 253 -43 322 -182 -153 -104 -112 -109 -141 -223 96
408 96 163 328 -17 -45 -20 -43 51 -121 14 148 -174 -135 -88 -68 89 -225 34 -306 -102 -59 -24 -232 115 -140
432 -140 20 130 90 73 -7 -67 -44 240 13 9 160 -194 29 -92 -308 -287 -181 38 68 -146 276 148 -119
455 -119 -5 119 160 38 -38 -125 13 90 -215 114 -140 18 -129 62 154 -120 -176 21 -298 166 129 -53 -80
478h0O1K11j18J50k53J18j20Mk27N7M5K88l88K66j18j85M62j84R2l02J20M42J
501C42k46M6j12j8J56m25J54K48k7o9MJ8p8M3kr9P3n3K09k78J89j60K60k57K24
526A42k39k56K34K09o0l53M86j32J13k15J49m6oK9o7J46k80r3J62J13N2L6J82
549C06k57k58R2K02l9j05J73r0m0j04Q9K89m01K00j01L1J97k8j03r7j61L35l85
572b55J97m0j28q7L49K30j57k41J96J25k59j24Q9O2R9j2j49K09r0P8o1j49J73
595E5Q3j39L7j91P8o7K68p5l65K13J12o4L42l45P8k2J75k70O1N5k15J38q6K5L02
620A83j82j6Q4l22N3J03J40k37K89M1l0j49lP9j19M9J33j22J23j47J36j80R9n2
644d7j8J09l9J92k59l4J35r6M11m79M8J29J91j77j52J10J33j71M4J9Q5J08k43
$$ plain form
478 -80 -19 192 74 224 -29 89 -31 -27 -254 -197 -152 136 -252 14 -104 -289 173 -11 81 -221 -101 341 342
501 342 96 142 30 12 168 -257 -103 145 118 49 53 71 -7 36 34 -65 8 -45 164 -114 75 -85 175 -82 142
526 142 -97 -353 -119 90 30 -323 163 31 144 -71 78 32 26 55 -12 134 -146 -239 -77 36 88 124 306
549 306 49 -209 -117 85 46 -59 114 24 -16 -120 -31 258 -143 57 -44 -13 184 156 53 -44 -205 130 -255
572 -255 -58 -98 -226 -313 36 266 109 -132 64 189 -70 -194 -105 -43 56 44 -105 104 14 92 31 -118 55
595 55 138 -1 36 -155 -77 -144 124 49 -316 -103 9 -55 287 -58 20 -2 173 -97 -36 19 -196 -58 -144 -119 183
620 183 1 -15 69 -253 -200 -97 43 -194 95 136 106 -43 -46 33 -86 -37 96 -26 97 -50 86 -94 5 -47
644 -47 -65 44 5 197 -62 -96 39 -57 354 -125 -77 52 243 66 -86 24 157 -14 30 49 134 242 -1
667aO7k66K03J04o6K6J57k45J65J63m06K46m38J87J2j51J60K26j64P3J13m91M32
690A06M8k20J60q7O9k87J62Jj15K95J3k12J30J03j10K58k28k0O3m0K24l61K41
713A93j91k06k01M34M1p8P3k5r3J09J48j87o8O8K68l73J03n1J74k56J98K28j55
736A53k20m6K20k16k1K33k2M9l92M78k6r4P9j40j93M09J52l53p0L92k61j22q4
759i5K95k78P3j02J67Q1k06j77J98j81K81j92K12L77l51l86L72m33J70L32j76
780a9ok05L2J57n5J02n6O2k1n6K08k3K45o28N07m94M12k00J61pk28K94j92m6k9
805h5J43j39M7j00K04Q0QM4k84J75n4l15L93j14k18J61k69L80J9k96J40j2J34
828D2k8M1k01J37n6K46q8l68O9K22J03N8m21L85K9j73J64k06j08K15j61J61l63
$$ plain form
667 -1 66 -200 3 107 41 67 224 -21 144 307 -99 147 -291 -104 -92 -243 -83 143 -21 52 165 -326 106
690 106 154 -66 94 7 76 -211 -49 -48 -163 132 145 -67 63 166 56 314 86 66 129 89 313 -48 193
713 193 2 -204 -405 29 70 -8 65 40 -53 56 204 17 -51 17 285 -88 15 -36 138 -118 80 308 153
736 153 -67 -113 107 -109 -130 103 81 130 -262 216 190 96 175 35 -158 251 403 50 -20 372 111 -11 -95
759 -95 200 -78 -5 -107 60 141 -65 -242 -44 -225 56 -136 76 453 102 -284 88 -345 -175 157 -19
780 -19 -25 -230 -198 -41 -96 6 -50 12 -9 -65 143 120 365 -263 244 -250 162 -38 123 116 -112 182 -10 -56 -85
805 -85 58 -81 -34 -134 70 150 158 202 -82 93 39 -276 117 3 -215 -54 -323 57 76 -220 -80 -92 42
828 42 14 55 -146 -9 -65 181 93 -275 -206 16 119 177 -244 141 170 -3 161 -45 -153 62 -99 62 -301
851c01M08k35L7K04l23L2L84k61k0RJ11k90L18j69RL7rK61p0J42l19k80J0L50
875C5J08K4Q0k80j2J28q0l20J87j3O8J37j04N8J14q4jJ50k03l3K6Q4k66K45k84
900b36J46L60k96K1m1q1P9K85k72l4j24K56J52l55P6J00O9k76N8j66N3J18j3K04
924H3p5j31J67N8m77L09J74j2M0n11L72j16J59j95J47J09j23m4O7J75m29k4M31
947A54k80J95j19J30k6j10k6L9j7R7j1l4p0K65k58J2L31k57M7r8j07K25j34l8
971i0j25K71j72L19k08k44K00K43j20k34M80n22J58M37k34k33J9O2J36J35p0j35
993G3R5o9m7j18J99j40j04J05K1K23m15J81m7P4M1j26M3j21J64P6j00j14K72k75
1017a09R2K93k61j71L32l87L21RL1r8k75K56K61l79j49J50L7J26l15J74J41j82
$$ plain form
851 -301 107 -128 -91 113 -210 -178 206 -55 -75 -66 45 -245 73 -96 -87 -50 -59 202 132 274 -45 -325 -315 35
875 35 143 167 247 -33 -45 83 3 -317 -130 -143 -75 62 -42 16 130 46 45 195 -8 -41 -15 69 -197 48 -236
900 -236 -90 270 -26 -5 -46 -127 -48 237 -35 -69 -193 63 215 -140 -64 36 105 -171 -113 -279 -226 -108 -121 83
924 83 8 -123 44 102 -375 -66 108 96 136 -375 -3 -119 40 -155 -8 101 -22 -66 1 176 -253 -277 154
947 154 -126 69 -50 80 54 -56 -82 -43 -60 37 26 -8 -78 187 -71 -59 272 15 62 -36 -143 82 -52 -90
971 -90 -215 56 -116 203 -5 -249 -49 194 74 -160 320 -202 -44 393 159 -74 -55 7 143 278 208 73
993 73 168 99 52 -66 133 -7 -111 -6 15 238 -177 4 -43 31 72 -54 -11 -132 32 108 8 -106 166 -109
1017 -109 -17 276 15 -156 176 -211 110 119 150 52 -223 33 294 -85 -234 -84 -47 79 -236 -62 79 -103
1039a03K46Q5l86j28M33j06k55N56m19p3Q0k02K48J72q2k57J20m9K26j83p0L01
1061A54r4j93L81n91L90K00k19Q4j50j4n8nJ41m6l7o0M07j28l67M91l31K20j64
1084A1j35J49J24j82k05J16J8p2M9P1p3J98o3K17l24N4o6N94m25n4l2K8k86N52
1108B64p4j45j53J72j94J72Q9k44J0K7K15k76J91j57J89k8K81l69k21L31o6R6
1130A10j94k2J94j7M9j48q2j05P6J48J12j82o5J54L9o8j31K84n3j9j32L1L08m23
1154a36R5NP8J31j71r6lJ76l98M39j55p2n5n9J73j81J35M77j56j41n4j22j43L07
1178G4p3j6n3J12o3j90L10L5k06K99J5k34j93PJ30Q7r6J5Q4n3l3m0q0K59l4j07
1204d4Q9j27J94l9j15J67l21J16J77l09N60k73j08O1l5k31L77kj73k7L14l2l4
$$ plain form
1039 -103 143 228 -158 -286 147 41 -214 342 -77 -150 -70 -272 -24 148 66 -191 -71 -120 106 -77 -147 154
1061 154 60 -133 248 -343 47 247 28 112 -38 -52 -110 -115 26 -20 -57 -117 290 162 -205 286 -45 175 11
1084 11 -124 25 149 -33 -238 -122 -104 -176 -127 -56 -129 69 6 223 -101 -47 -113 481 56 2 -30 -2 -288 264
1108 264 190 45 -108 64 -130 42 131 -113 -103 -76 139 -137 54 -103 86 58 339 -30 -251 80 14 110
1130 110 -84 -106 88 71 120 -28 -110 -215 -139 9 121 -61 -126 28 67 -1 -132 152 99 80 -52 -21 287 -136
1154 -136 -41 -36 42 173 2 -94 -97 79 -319 120 -35 -107 -162 -221 -48 -229 -94 383 227 86 32 -90 -233 74
1178 74 1 -15 -68 44 -19 -209 101 136 -70 229 244 10 -183 -176 -46 41 -55 -40 44 -9 -42 -82 -162 97 63 -44
1204 -44 45 -82 112 73 -42 125 -196 -80 97 -212 348 75 -33 28 -7 -238 139 137 -36 -63 251 219 185
1227A85m7J65l35J74l28J07P8q3L2lJ51l3j85K36q2j17J46o9P2p7L17j98J60l06
1251d0J40p9K6l47J85J26q0j70K76J57j62k71L37j60R4j11M8j96K02O9n0j56K67
1274A05k71L6K41j71L23l43kK0M9O6j22l8K99j38K8j48M3p9J29j87M02l24J6o3
1298a29R3l5j41J00NO8Q4J1J7n0O1k92L33l77J96j37L2K35L7q1QK0j07J12O1k95
1324a71R2L02p6k0q3l37K07K17j17R9m15J37J10J04mk48R6k2J67J92j74j48J32
1347D0k49M50k57q5j81K60M9Q9o4J5M5k77O6O8L12k42l59L85j45J28O9kJ55k76
1371fj0j5J64j43J9KPo0j12M5J86k17K89k32j11J46K44q3k63J66J20K4m21L16
1395E5J12m09L15j93K04j11J09j26J91j74R6j04L23k46k06L76j06k46J08J80k24
$$ plain form
1227 185 138 303 -32 142 -186 -79 -1 -84 -52 -55 96 63 -122 114 32 -85 61 -8 64 -13 304 106 266 -40
1251 -40 100 21 47 -300 -115 11 -69 -239 37 194 32 -239 98 -62 32 -79 -31 -227 -25 44 -6 -162 105
1274 105 -166 -130 111 -60 263 -80 -82 -62 -13 53 -69 -107 192 54 82 -66 -23 -102 27 -160 242 -82 -66 -129
1298 -129 -36 -71 -212 -112 -107 -39 45 56 73 23 84 -208 125 -252 -56 -193 -161 74 111 30 38 58 -49 63 124 -171
1324 -171 -79 223 147 127 44 -293 -86 131 14 113 -302 -165 -55 49 45 -203 -107 -129 38 230 56 -92 40
1347 40 -209 241 -16 -101 -282 -22 27 116 52 67 112 -165 -99 -31 281 39 -320 65 -80 48 117 115 270 -6
1371 -6 -16 -31 133 -10 9 11 18 -42 -154 -109 77 -140 149 -83 -194 -48 196 113 -150 16 136 160 -261 55
1395 55 167 -242 73 -120 84 -27 82 -44 147 -27 69 -35 288 42 -164 212 106 -140 -32 148 -76
1416g6J62l08J99J99l53K36j2k42K02L9j30J71r2l2j7K49Oj16J06J77n01J10k4
1439d7L40k67j73m4L86k85J79r4l42K30J71k9N4l40L35j7R4k79K37n6J98n05M85
1462B31l23K04j36P8k75L26o8j95K08k83K68M9k76P7K09Jj3k90K61j90K53j18
1484bK13k42r0Ln0o3L48P6n9k29P2J1L8k02L30k00J20Mj03J97j07R9q0j88Q6J86
1510A68j88j39K02j85K44j41r5M19n27J77K58l03J03j14K98j62o2Q9j38L6K30
1531A70l93J73K42m19J7K04J80J3j2L6j66k27O5n0K60M0ol8j19p5p6Q1K52k48
1555i6J84j84J12L3k31J97J6j80J46mj43j08K89k0J21k62r6J70j71L93j26M7J71
1578B58l45j23K34o6p3l4QJ95O5l74K08j79N87l70j75k0J48P1O3o9P8j1l69N23
$$ plain form
1416 -76 86 -222 -23 176 -177 59 47 -195 7 46 -84 87 -5 -37 -54 195 201 85 191 368 -133 -23 -47
1439 -47 293 26 -147 -191 195 -90 89 -5 -347 -117 54 25 79 -261 74 57 151 -128 109 53 251 -254 231
1462 231 -92 112 -24 54 -221 105 37 -158 50 -233 35 84 -192 -115 94 95 82 -208 53 -137 116 -2
1484 -2 211 -31 -121 -118 -168 -231 117 193 134 -95 -23 -12 26 -176 154 -46 74 78 -25 172 65 164 84 -104 -18 168
1510 168 -20 -159 43 -142 102 -39 -134 285 -242 -65 193 -110 -7 -121 177 15 -47 42 -96 -60 170
1531 170 -223 -50 192 -227 -210 -6 174 187 175 211 45 -182 -117 -167 93 133 127 89 -30 -105 -181 -100 152 -96
1555 -96 88 -96 16 49 -182 15 31 -149 -3 -7 -150 -258 31 11 132 -130 -226 -56 -227 166 40 87 258
1578 258 -87 -210 24 -42 -115 -149 -141 54 119 -255 -47 -226 361 -9 -184 -204 -56 15 78 9 87 76 -293 230
1602B30l55N3L17k84p6J02J23O5m79R8J59J09rj96L86m04K51k55J31J84k10K64
1624B04r9j49q2L92q7n8q5j31K37kq3j04Q7k88L38k19qJ37L8J44K4k92M4L49j35
1649A72l5k78K69k64J3J40J18k06J58j23l8j04J49J66J07k24J56j30j12J94q0
1670D8j27P5P4k08M0l7L10k66J4j13K72q5l8j21K00k84L79k52J35m1l27M90j87
1693d9J29o0q1%l9R3l4K12k28p6J8J24P8j73K03M2k61l06J9K10L77k15q7J89r4
1718ij64j04L79j46J76n0j57L10n32K02K16j17R6j18k5j32J93l06j80O79n14J63
1740a40L07k69K38R8l10J27On16N07k39J18N3L11l42k72N20j89J16J31J2k35j
1762C1M1j35J39m5P4j26P0Q7j85O0O7k08K6K30m33K1M78j78j60J63k3r4J04R2
$$ plain form
1602 230 -125 -72 245 -39 -115 -13 110 175 -304 -206 -47 62 53 -143 243 -161 90 -165 -34 150 -60 204
1624 204 105 -44 -126 266 179 121 36 -95 142 140 57 -47 40 -248 90 -129 -137 0 38 182 206 -86 -42 307 172
1649 172 137 -141 128 -136 -123 17 135 -71 87 -36 -74 -178 -29 137 244 20 176 46 -66 128 48
1670 48 -79 -4 70 -138 -98 -135 175 -91 -77 -190 82 -3 -41 -162 38 -246 133 -119 16 -25 -352 138 -49
1693 -49 80 20 -61 -61 -100 -7 -41 171 -57 -133 -115 9 87 -86 117 159 -102 -408 -389 -179 198 -17 -104 85 -9
1718 -9 -173 -277 102 -44 132 82 -75 235 -297 -95 121 4 100 -18 -43 -175 18 -288 -468 211 -303 -140
1740 -140 167 -102 136 234 -76 51 57 -459 48 -191 -73 -20 291 -51 -323 197 8 124 255 267 32 31
1762 31 72 -63 76 31 105 -21 49 136 -49 11 78 -130 -104 126 -307 -286 192 14 -146 17 -6 -100 4 96
1786I6j21j35M26j99J93l90L77o2k01K27k54N3q2j96L60k54Q6J86nl36L72q7K05
1809B59l08j85M17k74K73p2j70J14N7j34J61j60j82J55J60l03K6J43P1j14l0L74
1831B78k18j00P9m23O09P8j09j33k58J70j0Mj80K39j73K45L9k47j87N50l29K4
1853e2P4N4K1j2m0L9jq9j30Q0N1mj50J38j73K87k46J55k25J12K98k49L88o68K61
1878h1K9P6k01J69J34m0k90K51K12k96J07k47K12J1j82j07kK57k24N00j42k4m9
1901G3n3r4O8K18k03j63K29q6J19n6k52J5L54j90k19J74J42r4j78M02k27j24M78
1924C33m97k5J54O7j49J36o2k81N66k78K9LJ18o4R5p6j6j89R0K97j49k01M5R0
1948C6o1n1K83k72o6L15k53R9j10N4J64k78L12m12J88P4j12JL63l77K83k40L49
$$ plain form
1786 96 -25 -160 266 67 260 -130 247 185 -16 211 -43 10 -72 -268 92 -162 -76 110 105 -231 141 54 259
1809 259 -49 -234 183 -91 182 110 -60 54 111 -23 138 -22 -204 -49 111 -192 -166 -23 48 -66 -96 278
1831 278 60 -40 39 -384 225 303 194 61 -197 -27 -37 -33 -213 26 -147 98 137 -110 -297 253 -76 -52
1853 -52 22 76 97 85 45 84 83 -6 -136 -56 -5 -9 -159 -21 -194 93 -153 2 -223 -111 187 -62 326 -342 -81
1878 -81 -52 24 -177 -8 126 86 -204 47 259 -37 70 -177 35 46 -136 -243 -245 12 -212 288 146 122 73
1901 73 20 -74 -6 212 9 -154 75 -11 108 52 -200 -185 169 -21 -240 -66 76 -18 -196 206 -21 -145 333
1924 333 -164 -189 -35 32 -117 19 -43 -324 242 -36 -7 -4 114 50 145 69 53 -136 -46 251 102 -99 -54 36
1948 36 -25 -76 207 -65 -131 184 -69 30 -80 -26 138 -140 172 -240 -52 22 -90 -89 274 -103 180 -60 289
1971B89k73o7L85l60r6K31P0K64p42K48L11m17L04j92Q4J64k55k43K70o6o9K15
1993E5N1l42N74n66K9K50N4M7j8k69L35j68L1p6k07L42k71J35K27l58J89K5l24
2016b55J90J57r9P0k62N7j4J9K55j15J38j29O9j79N3m9J87j6n7j63M13j13m79
2039c22M32j13r3J07j6j46K02J64p2p3j46J00k10j10L71L6m48J91m0Q6J25p5L33
2062B83k92L12k33l2r8q7K92O8n75L29J14j54q7P4K57k50J74J42k69q6K87k76
2084a07Nj2p3J48oK9j78K92m23K80K53k19lo1j53K32J40N6k55K33r0j37K42p9
2108A14j50p5K21M2k92K47M0j19K1l8j28Q1k21j21J97L92j63J57l58k7J3K04j98
2131a61K82m8K83j20k66qR9N3j02j80L44j94o2J21P8pp5P1n3j66J6L50l50M4R
$$ plain form
1971 289 16 -51 334 -26 -122 109 179 443 -299 -51 260 -157 147 -45 39 203 -52 -295 -25 -91 -160 55
1993 55 106 -236 338 -228 -199 51 105 152 134 -135 200 32 63 -13 -220 122 -149 -14 213 -145 44 69 -255
2016 -255 -65 92 -7 63 -199 -142 -156 -137 118 3 141 12 81 -98 -45 -94 93 77 20 -143 270 157 -322
2039 -322 110 -3 -96 11 -5 -151 51 215 143 70 -76 24 -186 -296 75 111 -337 -146 -186 -100 25 -50 283
2062 283 -9 303 70 38 -60 -147 145 213 -362 -33 81 -73 -160 -86 171 -79 95 237 -32 -118 169 -107
2084 -107 -102 -114 -187 -39 -45 -16 -194 98 -325 -45 208 -11 -14 -75 -228 4 144 200 -55 178 88 -49 193 114
2108 114 -36 -111 110 152 -140 107 147 28 49 11 -117 -36 -257 -378 -181 211 48 205 -153 -180 -167 37 -161
2131 -161 121 73 356 236 -30 -38 61 114 12 -168 176 -18 -80 41 119 112 37 108 55 -111 -95 255 -95 -51 -42
2156d2%K69l12L2K20k66mK12j09J68k44J9J33j03J43n4k30K8QQ5j88M53k78j03
2180a63K99l86L69l25L26k47K26l31L89k3k09N9J32j9K64l63K2R1k52N41l95r1
2202h6Q8Q6P6j00p1K38k40q4K49n53M42j8J71k47j55K62K6m2N2n6K13J1m39M71
2226B94j37l61L12j18k07K33P9q3K33l68o2L68m9l45M17k11k04O4J83j62N5K01
2248A32n6j38J68o2j28k6J14J5l04K72J79k30K57nj45K31j17n6R4k07k79M67%
2271A76j11k14K61J3j91M5K4P1r1K00l04nK17k24J14K73j61P8r2J23l48K49j20
2294a7m3K69l32J93k95L92j15m6P1l75J55L81m06O7J17J20J18l23J92M4j49q0
2316f2R5j5n0N9j94J30r6J45j92K04p7k08K21o9R2L4j19P6q2J72o8n0M94m61J62
$$ plain form
2156 -42 -42 227 -85 -53 167 -99 -103 109 0 168 -76 -57 76 -27 116 62 -168 -140 -132 -47 -235 218 -60 -163
2180 -163 136 -250 119 -206 120 -127 99 -232 157 134 -75 -16 116 97 361 -2 20 111 -141 400 5 -86
2202 -86 2 88 164 64 -7 231 -9 -93 156 -397 45 27 198 -49 -204 58 84 42 94 38 251 262 -177 294
2226 294 157 -204 108 -10 -217 16 95 12 245 -123 -185 183 134 -211 206 -5 -209 -145 38 -124 -69 132
2248 132 76 -62 106 44 -84 -110 4 19 -285 -13 166 -64 193 188 43 274 157 101 195 -12 -291 176 176
2271 176 65 -149 112 125 -66 -21 3 74 -17 183 -121 -126 91 -133 -19 254 93 171 79 202 -146 103 -17
2294 -17 -60 209 -123 70 -225 167 52 6 77 -298 -143 238 -168 -101 16 136 254 -69 123 167 18 -62
2316 -62 33 18 -32 27 -167 -37 -133 12 -180 24 -53 -261 -40 -109 -17 17 -102 -26 -108 64 -4 -54 440 -21 141
2341A41k04j69J81k75N39k91J5q5J41J31n4j47J12j12J43j28o5k3J95J03rj53
2363a4j21L87l60Lo0K36m48L36K9M0k1m00L28r5M15j34j59M9l43K59K47j69J8
2386B3n9J45j24J1r7q3J57R4j26P0J99j77l22K75L2j10Nk15M51lo3N4j15jl10
2411b89J10j7K09ql38L24Q2r7l0n0q9J87J52k34M7N3j28K09p1N1K00M0j62j50
2435Aj6l6J8O6l8q0O5mL45m34NK63k7l87M43n19J73J15l4l9J23J4l8K14k26j80
2461b13K98k65N8J05Q0k18K59k05j8o4J77K1k20K53m7j86q1J26K11j22J12l5O4
2484I0r6J78j20k46L51k70L70j20j31n1l6J94lj50j09J89j7k16J46K13j47J70
2506A89nk71j30J82q6L26N7J00m62K85p0p4J07p2j49J25rl78L72J08k32J04m3
$$ plain form
2341 141 -63 -232 -51 -326 213 -78 -63 -148 -7 124 70 -77 35 -77 66 -62 -127 -150 45 148 139 -14
2363 -14 -135 252 -108 -105 -165 71 -377 -41 -12 28 7 -393 -65 -160 255 121 -38 11 -332 -73 174 5 23
2386 23 -36 109 -15 -4 -101 -184 -27 67 -59 11 210 33 -289 -14 18 -92 -87 -302 149 146 83 137 22 21 -289
2411 -289 -179 -196 13 5 -333 -9 73 -24 -54 -104 -193 -6 146 -88 -41 12 -116 93 22 73 273 313 151 1
2435 1 -15 -51 -33 33 -5 -85 -20 -24 321 -113 -108 155 128 -259 184 -335 -162 -47 -81 -120 3 17 -21 193 -33 -213
2461 -213 85 -180 -122 -17 63 -155 104 -101 -119 -183 -6 15 -205 48 1 -185 -266 -140 71 -51 61 26 90
2484 90 -6 172 52 -194 157 -113 257 137 6 -45 -81 113 110 -40 -149 40 23 -193 -47 166 19 189
2506 189 184 -87 -217 -35 -121 205 262 362 -100 185 115 41 148 76 -73 52 43 -335 37 145 -87 17 -26
2529b6Q5r4q1J95j36J75o3j13J0K53k71j97K12J26j9RM0J4j37k68J85M7k13M02
2553A35j29J0m4J6r0K01k57M4L45O0l53KL48j71j2k51J71J76k64j3R7j98K11l39
2577c05J67J64j64O1J44q3k71J80K2K77j74j63K43j49K99j78k09L1J66J39l10
2598a13J13j7j21r2L27KL32m20L52l92j0M23l26J9M7m5J4O5P2r2k71J54N4K8m13
2623c10L44k5k34K00j19m5J14K26m10L73j35n5K20m58M78n6Q6m64pJ23m2J49J25
2646G8k11K92l28J44p1o6J62j66PL24l63L04m49K57K11l94L51j39J91L43n83M02
2668B96k42k05J1n3J68kN5m3R8k2k22K80JM9j32l5K80k19j15n5K55j68n1j01Q4
2693h8J48k19k8O7K47K58l30J07k06J12k00K75k81K68J22k87j50J24J07l00N07
$$ plain form
2529 -26 59 -35 -116 79 -57 118 55 -58 -48 205 -66 -263 -51 75 56 65 105 119 -18 -286 -101 -54 -267 135
2553 135 6 16 -28 -12 -102 99 -158 -114 231 291 -62 -60 288 117 105 -146 25 201 -63 -76 21 -177 34 -305
2577 -305 -138 26 -138 -77 67 -16 -287 -107 -85 192 18 -145 98 -51 248 70 -139 -108 58 197 -113
2598 -113 0 -17 -138 -230 97 99 431 11 363 -29 -39 384 58 77 124 79 93 158 230 138 -133 21 75 103 -310
2623 -310 34 9 -225 -25 -144 -189 -75 151 -259 114 -21 -76 144 -314 164 108 194 -270 -277 -154 -196 -47 78
2646 78 -133 159 -169 -25 -96 -162 0 -166 -159 165 -198 106 -343 -86 125 -269 82 -57 134 477 -106 296
2668 296 54 -151 -140 -193 -25 -27 28 -15 83 61 -161 119 120 169 37 2 282 63 -52 -107 148 -20 -71 -172 -88
2693 -88 60 -159 -187 -120 127 385 55 162 -44 68 -132 143 -138 130 252 -35 -185 -61 46 -254 253
2714B53k94j86K45j04J04J79j7j21j68P0r5L28l15J19l6o5J55J5k00J75k2k7K65
2737B58m10M97n53M38k57J19j1J4k05Q0J55n6q5k19M18k86M9P0M1r0Jq8j70M26
2761A36k88J18M3L9j03j15K74j0J08l55L49l83L24q5PoJ9j81m6O3j65K59J18K0
2785A40j84L4J81j35Ro4j07L95j00Q2m47L46k61oO2j50o8L11No5r7J16j1K44l61
2810a31K83m38J54L59j04j85J0J58j00ll1%m8J99J3j84R6j67N5O9j40n3K05j12
2834i5K73j90j28j6J44k3p7L26j65J77j43k62K16k10K19j59J56J33N3k46K98m14
2856a33K99l2k55K15r2m9p6J64j42j0L32m52R8Q0l5J38j1o1J12ql82N76l52J1
2880f5J97j98J79j27J09j60J51J38l76J73K23l66Q2J03N7j97O2o0l7q3K46rJ4
$$ plain form
2714 253 -41 -227 18 -86 18 197 180 59 -109 -39 -134 194 -121 -2 -38 -103 52 67 -133 42 20 -7 258
2737 258 -152 345 -208 230 -27 92 81 95 -110 -30 125 69 -16 -235 183 -103 -54 16 57 -33 -32 -120 -290 136
2761 136 -152 -34 9 48 -55 -170 104 94 202 -153 196 -187 137 52 59 53 72 -109 -155 -92 -257 2 120 140
2785 140 -44 -10 171 36 45 -19 -126 269 169 251 -196 150 -111 -117 -55 -205 -273 38 43 -22 -119 -3 -14 230 -131
2810 -131 152 -286 -132 227 123 -62 -52 106 6 3 -28 -28 -76 123 136 -48 48 -119 -64 5 -135 -188 17 -95
2834 -95 178 -12 -140 -156 -12 -35 -112 214 49 226 83 -179 37 -173 46 -113 43 176 229 -17 281 -133
2856 -133 166 134 -121 94 2 -47 -123 41 -101 -111 221 -231 -133 -53 -88 50 39 -22 90 82 -300 276 -76 -65
2880 -65 132 -66 113 -14 95 -65 86 224 -152 21 244 -122 -40 63 120 -77 -15 -75 -112 -195 51 42 56
2903E6j63q9K07nL3K4J1j24J05J27k37NJ66n3k2j85K0k5J46m8K38k86K09j95k9
2928a14J68o0j56J08r3K31j75P%K5J83r6n7L20j97k54K54k47L11J12k87L4j03
2951h6j67K44L1l0k5j26Nk0M1J32o8J91j7pj2q0J20j29J32l10q5L68k08J94k3
2976F5j41J71r5Q9l2RN5j49L78l21k38K6p8L56j07n0j0P1L3M5J49k27j03K93k48
3001e9l6J02K8M8j95N9J60lj91m4J95j44L3j94M51k21l17L91p9j00P4J65l77L19
3025F5l4J06k28L37l81p3L40m78M60P2K9k82J46K6j10k83L81m33L79l0nj82K35
3048E7j73N68k72k19K79o8j11j03OQ3P9k17P7k7o0N5P3J80m11J71Q4k25L33j77
3072a8J70j2j00o8J18q3j06J95j25r4J53J8k02L01l52M2nJ12k26J53M4J44L5N8
$$ plain form
2903 56 -107 -196 11 6 39 63 74 -50 55 182 -55 -50 116 63 41 -144 -124 -149 -3 -51 187 -99 110 -85 -114
2928 -114 54 -6 -162 -54 -147 84 -91 -84 -84 -59 124 28 -29 291 94 -160 94 -153 158 270 -17 17 -86
2951 -86 -253 -9 22 -8 -33 -159 -154 -174 -133 -1 -69 122 105 98 86 6 126 -3 129 -181 -266 102 -106 88 65
2976 65 -76 95 0 89 57 66 121 -28 350 29 -209 -183 -261 95 -12 -62 -72 -1 32 77 226 -1 -104 189 -59
3001 -59 -95 7 35 83 -112 -53 107 104 -87 -131 64 -80 -47 -241 210 -11 -328 63 -16 -116 -42 123 -254 65
3025 65 31 137 -91 246 -135 -208 132 -346 114 186 215 -67 79 105 -5 -288 93 -340 39 9 4 -178 57
3048 57 -116 452 180 -39 240 172 61 -42 -36 47 126 -91 -14 -41 -101 -46 27 207 -204 -33 51 -174 159 -18
3072 -18 152 140 40 -28 90 7 -99 96 -29 -123 30 48 -154 147 -205 -163 -168 -56 -282 -129 -85 59 94 152
3096A52k30J62M5k76J93L9Kj09Q6j49J48n6l46L59K11Mk98L4k8j36L48k18J61
3119I8M6j43Qr1J99j69J13n6K1r4K03m3k68K99J2k08O2j74J69L7k22M15k28m5
3143e9N7j08J89k02N4J88p2K53n61L55J13k95o5J93L1l4J03j01k08NN6J81j2J17
3167A78l9n2J82l29R1J49j50j95J48m4N2j10J40j37j16K87m5k08J11J32J12J13
3189B70k67j4K3m05L75n0l4J20J20k28r4K37lN8j9J42m7k21J32j81J70j67J48
3212F5O5j35k21K76N9j74k15K35K66j75j30L0J00nj2n2L7j4J53k41K49k60K42
3235A43n2l25J37J67O1k96L00M5j77k19J62L06k54Ok39J82p7O6o6J94K08m20K15
3258F7j75L07l03MR4l25L29J18k39PJ72J1N6n1l64M60K7l05J39j6J31m00K42j82
$$ plain form
3096 152 -78 84 129 -147 46 85 87 -22 64 -85 63 7 -339 20 231 235 -63 -29 -57 -193 155 -63 98
3119 98 144 1 9 -82 117 -52 61 5 26 -68 135 92 -176 123 135 -73 -11 -185 -16 21 -201 214 -14 -59
3143 -59 -2 -110 79 -123 -69 119 47 300 -261 94 207 -88 -153 40 71 37 140 39 -169 -164 -108 73 61 178
3167 178 139 87 269 -60 31 180 30 -165 -17 -61 -9 -119 21 -116 -232 55 10 -198 -87 45 157 270
3189 270 3 -11 12 -393 -18 -68 -102 18 138 -90 -184 53 50 108 89 231 184 -37 95 -86 84 -83 65
3212 65 130 -5 -226 50 109 -65 -280 -45 221 46 -84 -54 46 41 29 -23 14 0 153 -88 161 -99 143
3235 143 91 -234 -97 70 131 -165 135 180 3 -216 -54 252 -2 4 -235 -53 -130 -64 -130 64 272 -148 67
3258 67 -108 199 -104 -100 -6 -331 -2 116 -123 -116 56 67 123 72 -292 168 195 -110 29 13 144 -256 -14 -196
3282a96M8R8K17k13K02j00o8K58m46M1K44qj28j71k2M3J14N8K43k08j81L23q4
3305F4rkn6J68j34j33K03j64N4k7J38j70j32J69K11j66l2jK09j23K42l96q9J03
3329g3K04K1k42K19kP2k67J0J91k30K43l4k13r5L25j80J88k47m9o1L21n1m5J21
3353A26l80L40J74l18Pj46K55J41k70K38k65K38k52M96l57k6j08o8K98n2j9j65
3375a13jM1J25l6k29K42j36J92O0j26N4j21P6m4j90L27l15J82J86p3k17J00j22
3398a38K75j43QK28P8k05M6q2R4j63K12j44n7m1Nr6J24K53n17J89J05j4K14k77
3422d6Q2l40M31j4J30j86o4j25K74j50J22j40K70r6j1k25M3qm8J9j9o1K68j99
3446i3N1jP7rK1j22J45L1k01K49k64J47J4J69m27K31N6J21l20K4J67k4J92k08
$$ plain form
3282 -196 -148 -50 167 -46 156 56 -12 246 -200 -159 85 77 -51 -222 -244 -201 -87 -29 214 6 -175 148 64
3305 64 55 53 -3 165 31 -102 101 -63 -9 -36 102 -68 -200 -31 180 14 -18 -19 190 67 309 -87 -176 -73
3329 -73 131 152 -90 129 127 199 -68 -58 133 -97 146 112 -101 -196 129 -51 137 -110 -159 -220 101 50 5 126
3353 126 -254 86 260 -58 -51 -197 58 199 -71 167 -98 140 -112 384 27 1 -107 -175 123 71 52 -113
3375 -113 -114 -73 52 16 -213 29 -107 85 145 19 73 -48 28 -16 -206 121 -194 -12 174 101 -116 -16 -138
3398 -138 137 -6 2 230 308 103 149 67 161 -2 210 66 9 -32 -27 -123 1 254 -263 -74 31 17 231 -46
3422 -46 36 -304 127 113 243 57 -7 -132 142 -8 114 -26 244 148 137 -88 -45 -53 -101 -82 -101 -162 106 -93
3446 -93 -42 -43 34 25 46 -76 69 100 -101 148 -116 31 45 214 -213 18 74 195 -125 -101 66 42 234 26
3470B6O1J07q7R1k45j94m5J32M52j58k33J73N9l2l7j44kN2M0K35j85j50n2K06
3494G0j26J00J06j35O5j68K45n8k71K46N6m12O17n47m4J62pj72K49k9K34j29n8
3517fj13j52L39j0j05J24k76J04k09M15Rl9j45J10j2j61M21k67l8n6M1JJ63n8
3541H0m7j44J67j11L76j18j00L6k18Q5j45N1R5J93m0RP5n29L06L03l80j60J42
3564g4K92k74M0q1O8J49r5k25J41j31j40M54j18j52QM7K63o2j87J4J45r6K5j47
3588a36L46k78K83l72J91J04k64k4L9J57O2o3q2mJ91m24K00L19m22J56J46r4%
3611C1m20L35j55M10m6j60J18j08J06j96J19J32l92J16K14j49M8J37j42j60m9
3632b11J51m0j34J8L10j01J69l19J22L45n99J57L09j82j8M5j21j4L57j88j04M49
$$ plain form
3470 26 87 194 107 198 -47 -241 -286 -154 298 140 -93 80 139 107 70 -74 -76 -24 16 251 66 -84 -136 70
3494 70 -56 44 150 15 80 -88 157 99 -172 74 130 -282 335 -212 -256 -94 -101 -273 -24 -53 181 52 -6
3517 -6 -119 -271 68 58 -47 77 -199 -95 -304 111 120 81 -64 46 34 -127 294 27 -11 -67 -26 -25 138 80
3541 80 33 -111 56 -55 321 203 103 139 -79 6 -139 -88 7 200 160 169 244 -285 21 324 -56 -216 -74
3564 -74 218 -56 -16 -97 -29 120 25 -200 -59 -190 -330 124 6 -146 -138 -91 172 110 -77 -63 82 -14 11 -136
3588 -136 210 -68 215 -157 34 138 -126 -150 -111 46 108 45 -37 -41 150 -274 -74 245 -177 -21 125 31 31
3611 31 -389 -54 -209 201 155 -5 113 5 111 -85 34 166 -226 -110 104 -45 3 140 -2 -162 -211
3632 -211 -60 -100 -234 -216 94 -7 162 -157 -35 310 -289 -132 177 -5 -23 22 -99 -113 244 56 -48 401
3654D01m74m5M92m36J49j91K3m3Q7P0j92O9n3K61o0k9J12p6k28O5J17k35L17l71
3678b70L50j73Q1J59r4K9j16J06r8L0j39R6J08L37lj55m93j31K62L1J52j90qK88
3702A59j30k28J51K03j99K46k67o0J90j52J8q4O9K06k41J17o7R8J75k26j25J8
3724a29K08K3k9j54K01k52n9J63j81J42kK9J32j38j40K43L1M6p0p3P1O6n6J15
3748A87l5J5j62M7k43N36j65k33N0J10j77N4j77O3L8P3j88K63j20M1j90J36p7
3771a54K55K4k14o0L6J01L07j48l33M9l5K4K60J56j14m43K89M3jj61J41qk66J88
3795f4J55J02j82p0K93j62Q0q2R6p9l5P7j05L2p9J14j39km3KJ12l2K17l01K1J59
3821H5j51j13N6J45j27L86l55J37J22p0k53K6N8P1R9m4j20J48j29r0L81o6r4k20
$$ plain form
3654 401 -73 -118 374 -62 87 -104 -81 -124 -37 33 -159 -90 -143 118 58 29 141 65 -163 -98 19 -216 101 -270
3678 -270 80 -93 -12 147 53 82 -34 72 -26 4 -135 -39 69 406 403 248 -245 -376 -114 -83 69 -121 -129 159
3702 159 29 -199 -48 155 -44 202 -65 -125 65 -87 -69 -153 -84 122 -119 -2 -69 29 204 -22 -147 -129
3724 -129 79 102 73 -81 120 -132 -191 -28 -209 -67 -69 -40 92 -46 -186 57 88 134 64 -9 62 128 72 187
3748 187 152 167 5 52 -191 345 180 -53 -3 107 -70 -16 -193 -130 -92 -19 -207 56 -64 -23 -213 -77 -154
3771 -154 101 125 -89 -149 -113 -12 295 147 -186 -137 -172 -148 112 268 154 -289 0 43 42 -119 22 14 -252 -64
3795 -64 91 193 11 -59 234 72 152 70 166 87 52 129 24 56 -23 91 -48 -50 -93 -91 21 -11 206 -95 -74 85
3821 85 -66 -179 -123 22 -105 281 -74 63 185 115 -138 -112 -54 17 116 72 -48 100 -29 -119 262 196 102 -118
3845a18r9M18k06j83K22j98K58j22j6J71k36L06j89q8LP6P4j6J15M5k8l02J27
3868A4j8j49N0J08ROl20M60r3Q5k69J72m3q0O8J56j42J17k41J20J94k5p0N4j12
3893E1Pj42J31l50M35j70k74L19m2r1J53J32j56R1j32r2J92J42l89N06p8k14J26
3916A55j01q4J3j95l0J40K7L14j50j95Q7o5K57q6k0j25j53K69J3r4j85J39QK81
3940B20j96j93R7J40O2J2j51N9j08J17j4j35R5L08j80n4r7N8K46k68J63J5j37
3963E9j46N3J64o0J94j17j19J55j46r9j1j7j10K25k6K27K58m92r4J57J85j57l34
3986b51L05j21L44l70R7j2J06k05r7k8M8J50o7j77K42j75K98n9m2%l9n6J24j10
4010i5nr1M62m86J71J52j47L11p67N82N9j95k43L28J81l97J86J35n1P9j03k12
$$ plain form
3845 -118 -217 201 -5 -188 34 -164 94 -28 -44 127 -109 197 8 -80 -77 -1 73 57 172 217 189 -113 14
3868 14 -4 -153 -103 5 14 20 -300 160 67 152 -117 55 12 -68 0 156 14 131 -110 10 204 179 109 163 51
3893 51 58 -84 47 -303 132 -38 -312 7 -35 -126 27 159 3 94 -38 -130 62 204 -185 321 243 29 155
3916 155 54 -30 -17 -212 -242 -102 -75 239 89 -106 -19 -84 173 87 67 -58 -211 58 71 -23 -208 -69 -61 220
3940 220 24 -169 -72 68 130 142 -9 50 -58 59 45 -90 5 313 133 79 -18 40 286 18 181 196 59
3963 59 -87 -34 130 70 264 147 28 183 37 -62 -73 -90 -200 25 -1 226 484 -8 -102 55 240 83 -251
3986 -251 54 -67 277 -93 4 -8 98 -107 -204 -232 -184 -34 -101 -278 -36 -211 87 28 -14 -14 -53 -109 15 -95
4010 -95 -100 -191 271 -215 -44 108 -39 272 -495 87 146 -49 -292 36 217 -180 6 141 90 169 66 -146
4032a46L31l78K11r0J18k29K22k17J34J56n7KK78p14M27j11K8K21l14L51j35Q2
4054A70l04K35k99K98k40J56j2K03l10LR2r4j56K07J40l03J92l04M21k48J93q
4076C2r0J61j3r8K60m52J1K45M6J02Jk94L83k2n24K49K44k38j1k33J58j70M03
4099A50j9nj25p3m5J1L15o3J2j63J33k71J67q4R0N9k00K12k03J34K92m32L01j7
4123A76q9K66m46L8j52J87l3K14j56m2K85k79k09L20Mj42j1K37k00K14l18J05
4145c1K9J68l18J37J13P0l48J72j32J67O8k27K07j85Q8J06j61L5R3l1k6O9j8J62
4169B07j93K5J00n4j67J50j05j5J77O1L7l67L31k39O2j27J1K81j6p6k83K04Q1
4192H5P9j50k0k37K23M6j81L9J49j57q2L85l4j66R4P5k76J51n4J02q8L5%Kj1R8
$$ plain form
4032 -146 185 -193 18 -72 46 -183 39 -178 -44 112 55 57 335 -379 48 -63 -35 186 -128 223 88 170
4054 170 -134 101 -198 100 -140 16 4 207 -103 -100 -8 -102 -258 -51 89 -214 -22 -326 95 -153 40 32
4076 32 -58 103 90 -8 252 -200 -189 56 102 204 205 -89 294 272 -252 -3 241 3 -8 -241 -83 -253 150
4099 150 131 126 1 -72 -117 -106 209 146 158 -5 128 -143 24 -60 30 89 -111 101 -102 32 324 -108 193 176
4123 176 87 353 -93 -55 -207 -20 -53 161 5 -37 248 -31 -240 80 84 -58 -69 168 -32 182 -136 -31
4145 -31 -2 166 -152 -15 98 168 -180 -8 -140 27 95 -132 75 -110 -22 84 -77 -42 51 20 -6 63 45 207
4169 207 14 39 139 85 -82 68 -37 -52 125 186 223 -144 187 -52 10 -117 -106 175 159 83 -200 4 85
4192 85 164 14 -6 -243 -20 26 -155 -116 33 -124 -206 179 145 -21 73 148 -128 23 -31 71 -17 18 18 20 9 107
4218A07l33N22l58J43j3k28O9k51N50k03L8O1k23j63L04p6k5J36k99K51k5k07
4240b23K8J61R0j25J21Q9j78J06k07Q3K18k02J41q1N9pl22M24k93l8J36Q3K2k92
4264b07N32j85j4k85K26k37K92j95J87j21j49J57o7N5j46J02K42k25N7j14K48
4285A53j67K22k01J6O1k64J57K35K69k17l58j46L32q8K08k34O8J4l2rq6J19L7
4308H9j0k95M90k08j72L05k37k54K23L51j08j94q8j23O09l30p3j27J42o2MO1k10
4331b17K78m1J36r3j53K39j0Jk85l2j97M26k68J55P6Q7j09N5j56L26r6k71m8M4
4355a53l2K28m60K53m4J44L1oJ28k7j20J49k0J5l5J8J97n59M25k8k16p7J69J32
4379A12J07k14J22j35j20L4J02j44O7J35m2J87l06J71l38K58j07J50R5j11j37
$$ plain form
4218 107 -226 296 -62 81 68 -160 -91 -342 208 5 43 104 -119 -282 22 -54 -79 57 -242 9 -16 -223
4240 -223 -195 -34 56 -69 52 141 -37 69 -138 -55 163 -39 102 21 80 73 -249 175 -118 -156 -20 63 85 -207
4264 -207 325 140 126 -159 67 -170 122 -73 114 -7 -156 1 -66 -11 -157 -55 187 -38 19 -95 153
4285 153 -14 208 7 23 84 -180 -23 212 481 264 -94 -240 92 4 212 -22 46 60 28 19 -67 52 89
4308 89 79 -216 274 66 -106 199 -38 -292 -69 282 174 -20 -108 -231 378 48 -25 -152 -10 -72 -68 -7 -217
4331 -217 61 20 156 63 -90 149 139 140 -145 -177 -374 52 -216 -61 15 102 -7 48 -108 218 122 -149 -197 -153
4355 -153 -185 43 -417 -164 -208 -64 -33 -39 89 62 -58 91 71 86 51 69 266 -293 132 104 -112 -189 -20 112
4379 112 219 5 127 -8 -128 -94 8 -136 -69 66 24 211 -95 76 -262 -4 -111 39 134 23 -114
4400a14J78P4l40J36K26o3j50J61j12P8k14k19L98k09J88j74Q5n5J08J23j11J40
4422A34k8j66K37j41j66J71j91J99j51j34K77K54j67L8l42J97Q8j8j56O9K56l52
4444i2K47Q7l8k48o8L82k89j57K40j54J69l2P3r7L33m72J22j86J08J24l21L43
4466G4k6J1p6m5J48l20L54k9j68k58M37J00k01nk94K30p9K16Pj14RJ82l6kj06
4491Ij8j28J03j20o0L05k7j94J39r9J52qk53K48j65N5R1J03J76n17K18j98J37
4514e1J15j59P1Pk78L26j5L2j62o8L44k61n8L55m4k15om7K49Ok09j44M54k28q
4539FP3K51m86j8pK47R9l03J46k69J29J2j6J66J16R0k06J12m36L48J13k53m1k0
4563a47K00m8k2M3Q1K6J16l62J62Q1k00K9p1N4L69j49J08l96K04j61n6J41j12
$$ plain form
4400 -114 64 138 -202 -66 160 97 -53 108 -4 74 -140 -359 39 -170 18 -156 -71 -126 -18 105 -6 134
4422 134 106 -60 177 36 -130 41 -150 49 -102 -236 41 295 128 166 -176 21 109 91 -65 4 260 -92
4444 -92 155 242 204 -44 -112 270 -19 -176 64 -90 79 47 120 23 356 -116 6 -180 -72 52 -269 74
4466 74 48 59 -17 -62 86 -234 120 91 -77 -335 102 202 1 -4 -298 -68 -147 69 76 -38 -29 153 117 115 9
4491 9 -9 -137 -34 -154 -214 91 64 -130 9 -90 62 54 -199 49 -116 -61 30 133 309 -208 10 -188 -51
4514 -51 64 -95 -24 -17 -295 31 16 48 -114 -182 162 -99 -157 198 154 -61 -67 -114 135 141 -68 -212 242 14 6
4539 6 79 330 -156 -174 -181 66 165 -138 8 -261 -132 -120 -136 30 146 236 30 142 -294 54 167 -86 -127 -147
4563 -147 53 5 -17 26 107 133 249 -113 49 130 -70 -41 -112 -58 311 162 270 -126 78 -83 -139 2 -110
4586a10J03K39J09l31j88J87J37j24K3j5K33l75M8k33M49q9K4j81RJ69j50J04
4608C8m4K89k85o8O3J55M6k65J14K28k72J85j13M0j15L3J09j75R1j41J33J3j29
4631g0q5k6L35j79l4j55L04k61m7K44k78J08L2R4J22k72rJ72m5K7J11j54J06q6
4655d6p8RL07Q9m32J37j9J06OJ08l11K59k22N3L4j06J97Q6j77L82m96K7J67k37
4679a57j52L02J1J46j73%K37j85k23K75k25P0K3P0j84J73l02J80l1J99j71o6K32
$$ plain form
4586 -110 -7 232 341 10 -178 9 146 22 45 30 263 -112 -64 -297 152 63 87 -94 -85 84 -66 38
4608 38 -6 283 -2 -70 -7 148 194 -71 43 271 -1 184 71 111 -4 29 138 -37 54 -87 46 59 -70
4631 -70 -155 -181 154 -25 -59 -214 90 -171 -218 26 -252 -144 -112 -18 104 -168 -177 -5 -50 -23 88 -66 40 -46
4655 -46 -124 -115 192 281 -151 -14 -33 73 79 187 -124 135 -87 -34 0 -106 91 177 0 382 -114 -87 80 -157
4679 -157 -309 -7 4 150 -23 -23 214 29 -194 81 -144 -74 -51 19 -165 8 -294 -114 -145 54 -117 -183 49
$$ [...]
8191F8
##END NTUPLES=NMR FID
##END=
