##TITLE=1H_DE-88solid
 200.13MHz,CDCl3,
 8 sc
 
 8.7.2025
##JCAMPDX= 6.0         $$ Bruker NMR JCAMP-DX V2.0
##DATA TYPE= NMR FID
##DATA CLASS= NTUPLES
##ORIGIN= UXNMR, Bruker Analytische Messtechnik GmbH
##OWNER= pz
$$ XWIN-NMR		Version 3.5
$$ Tue Jul  8 13:45:39 2025 Russian Standard Time (UT+4h)  she@DPX200
##.OBSERVE FREQUENCY= 200.1313
##.OBSERVE NUCLEUS= ^1H
##.DELAY= (6, 6)
##.ACQUISITION MODE= SIMULTANEOUS
##.ACQUISITION SCHEME= undefined
##.AVERAGES= 8
##.DIGITISER RES= 18
##SPECTROMETER/DATA SYSTEM= spect
##.PULSE SEQUENCE= zg30
##.SOLVENT NAME= CDCl3
##.SHIFT REFERENCE= (INTERNAL, CDCl3, 0, 14.3821)
##AUDIT TRAIL= $$ (NUMBER, WHEN, WHO, WHERE, WHAT)
$$ ##TITLE= Audit trail, XWIN-NMR		Version 3.5
$$ ##JCAMPDX= 5.01
$$ ##ORIGIN= Bruker BioSpin GmbH
$$ ##OWNER= she
$$ F:/spectra/data/she/nmr/H-C/1/audita.txt
$$ ##AUDIT TRAIL=  $$ (NUMBER, WHEN, WHO, WHERE, WHAT)
(   1,<2025-07-08 13:44:19.68 +0400>,<she>,<DPX200>,
      <created by zg, POWCHK disabled, PULCHK disabled
       configuration hash MD5:
       00 E9 B6 7A A2 85 ED C7 34 08 36 98 17 FE 4E 26
       data hash MD5: 16K
       9E 4B 34 8A 1D 09 81 F0 87 90 94 9C FC 2E 0F 24>)
$$ ##END=
$$ 
$$ hash MD5
$$ 09 B9 55 2B EF 99 C6 B4 BB EE 4E 72 A5 D1 46 0E
##$RELAX= 
##$RELAX= 
##$RELAX= 
##$RELAX= 
##$RELAX= 
##$RELAX= 
$$ Bruker specific parameters
$$ --------------------------
##$DU= <F:/spectra>
##$EXPNO= 1
##$NAME= <H-C>
##$PROCNO= 1
##$TYPE= <nmr>
##$USER= <she>
##$AMP= (0..31)
100 100 100 100 100 100 100 100 100 100 100 100 100 100 100 100 100 100 
100 100 100 100 100 100 100 100 100 100 100 100 100 100 
##$AQSEQ= 0
##$AQ_mod= 1
##$AUNM= <au_zg>
##$AUTOPOS= <>
##$BF1= 200.13
##$BF2= 200.13
##$BF3= 200.13
##$BF4= 200.13
##$BF5= 200.13
##$BF6= 200.13
##$BF7= 200.13
##$BF8= 200.13
##$BYTORDA= 1
##$CFDGTYP= 0
##$CFRGTYP= 5
##$CHEMSTR= <none>
##$CNST= (0..31)
1 1 145 1 1 1 1 1 1 1 1 1 1 1 1 1 1 1 1 1 1 1 1 1 1 1 1 1 1 1 1 1 
##$CPDPRG= <>
##$CPDPRG1= <>
##$CPDPRG2= <>
##$CPDPRG3= <>
##$CPDPRG4= <mlev>
##$CPDPRG5= <mlev>
##$CPDPRG6= <mlev>
##$CPDPRG7= <mlev>
##$CPDPRG8= <mlev>
##$CPDPRGB= <>
##$CPDPRGT= <>
##$D= (0..31)
0 0.7 0 0 0 0 0 0 0 0 0 0.03 0 0 0 0 0 0 0 0 0 0 0 0 0 0 0 0 0 0 0 0 
##$DATE= 1751967859
##$DBL= (0..7)
120 120 120 120 120 120 120 120 
##$DBP= (0..7)
150 150 150 150 150 150 150 150 
##$DBP07= 0
##$DBPNAM0= <>
##$DBPNAM1= <>
##$DBPNAM2= <>
##$DBPNAM3= <>
##$DBPNAM4= <>
##$DBPNAM5= <>
##$DBPNAM6= <>
##$DBPNAM7= <>
##$DBPOAL= (0..7)
0.5 0.5 0.5 0.5 0.5 0.5 0.5 0.5 
##$DBPOFFS= (0..7)
0 0 0 0 0 0 0 0 
##$DE= 6
##$DECBNUC= <off>
##$DECIM= 32
##$DECNUC= <off>
##$DECSTAT= 4
##$DIGMOD= 1
##$DIGTYP= 9
##$DL= (0..7)
0 120 120 120 120 120 120 120 
##$DP= (0..7)
150 150 150 150 150 150 150 150 
##$DP07= 0
##$DPNAME0= <>
##$DPNAME1= <>
##$DPNAME2= <>
##$DPNAME3= <>
##$DPNAME4= <>
##$DPNAME5= <>
##$DPNAME6= <>
##$DPNAME7= <>
##$DPOAL= (0..7)
0.5 0.5 0.5 0.5 0.5 0.5 0.5 0.5 
##$DPOFFS= (0..7)
0 0 0 0 0 0 0 0 
##$DQDMODE= 0
##$DR= 18
##$DS= 0
##$DSLIST= <SSSSSSSSSSSSSSS>
$$ [...]
##$SUBNAM0= <"">
##$SUBNAM1= <"">
##$SUBNAM2= <"">
##$SUBNAM3= <"">
##$SUBNAM4= <"">
##$SUBNAM5= <"">
##$SUBNAM6= <"">
##$SUBNAM7= <"">
##$SUBNAM8= <"">
##$SUBNAM9= <"">
##$SW= 18.0517328524113
##$SWIBOX= (0..15)
0 0 2 0 0 0 0 0 0 0 0 0 0 0 0 0 
##$SW_h= 3612.71676300578
##$TD= 16384
##$TD0= 1
##$TE= 0
##$TE2= 300
##$TE3= 300
##$TEG= 300
##$TL= (0..7)
0 120 120 120 120 120 120 120 
##$TP= (0..7)
150 150 150 150 150 150 150 150 
##$TP07= 0
##$TPNAME0= <>
##$TPNAME1= <>
##$TPNAME2= <>
##$TPNAME3= <>
##$TPNAME4= <>
##$TPNAME5= <>
##$TPNAME6= <>
##$TPNAME7= <>
##$TPOAL= (0..7)
0.5 0.5 0.5 0.5 0.5 0.5 0.5 0.5 
##$TPOFFS= (0..7)
0 0 0 0 0 0 0 0 
##$TUNHIN= 0
##$TUNHOUT= 0
##$TUNXOUT= 0
##$USERA1= <user>
##$USERA2= <user>
##$USERA3= <user>
##$USERA4= <user>
##$USERA5= <user>
##$V9= 5
##$VALIST= <valist>
##$VCLIST= <CCCCCCCCCCCCCCC>
##$VD= 0
##$VDLIST= <DDDDDDDDDDDDDDD>
##$VPLIST= <PPPPPPPPPPPPPPP>
##$VTLIST= <TTTTTTTTTTTTTTT>
##$WBST= 1024
##$WBSW= 4
##$XGAIN= (0..3)
0 0 0 0 
##$XL= 0
##$YL= 0
##$YMAX_a= 103892
##$YMIN_a= -150307
##$ZGOPTNS= <>
##$ZL1= 120
##$ZL2= 120
##$ZL3= 120
##$ZL4= 120
##$ABSF1= 10
##$ABSF2= 0
##$ABSG= 5
##$ABSL= 3
##$ALPHA= 0
##$AQORDER= 0
##$ASSFAC= 0
##$ASSFACI= 0
##$ASSFACX= 0
##$ASSWID= 0
##$AUNMP= <proc_1d>
##$AZFE= 0.1
##$AZFW= 0.1
##$BCFW= 1
##$BC_mod= 2
##$BYTORDP= 1
##$COROFFS= 0
##$CY= -3
##$DATMOD= 1
##$DC= 2
##$DFILT= <>
##$DTYPP= 0
##$F1P= 0
##$F2P= 0
##$FCOR= 0.5
##$FTSIZE= 0
##$FT_mod= 4
##$GAMMA= 1
##$GB= 0.15
##$INTBC= 1
##$INTSCL= 1
##$ISEN= 128
##$LB= 0.25
##$LEV0= 0
##$LPBIN= 0
##$MAXI= 10000
##$MC2= 0
##$MEAN= 0
##$ME_mod= 0
##$MI= 1.114404
##$NCOEF= 0
##$NC_proc= 0
##$NLEV= 6
##$NOISF1= 3.799351
##$NOISF2= 2.8
##$NSP= 1
##$NTH_PI= 0
##$NZP= 0
##$OFFSET= 14.38212
##$PC= 1
##$PHC0= -1206.63
##$PHC1= 18.99238
##$PH_mod= 1
##$PKNL= yes
##$PPARMOD= 0
##$PSCAL= 0
##$PSIGN= 0
##$REVERSE= no
##$SF= 200.129724274929
##$SI= 16384
##$SIGF1= 3
##$SIGF2= 2
##$SINO= 400
##$SIOLD= 16384
##$SREGLST= <1H.CDCl3>
##$SSB= 0
##$STSI= 0
##$STSR= 0
##$SW_p= 3205.1282051282
##$SYMM= 0
##$S_DEV= 0
##$TDeff= 0
##$TDoff= 0
##$TI= <>
##$TILT= no
##$TM1= 0
##$TM2= 0
##$TOPLEV= 0
##$USERP1= <user>
##$USERP2= <user>
##$USERP3= <user>
##$USERP4= <user>
##$USERP5= <user>
##$WDW= 1
##$XDIM= 8192
##$YMAX_p= 0
##$YMIN_p= 0
$$ End of Bruker specific parameters
$$ ---------------------------------
##NTUPLES= NMR FID
##VAR_NAME=  TIME,          FID/REAL,        FID/IMAG
##SYMBOL=    X,             R,               I
##VAR_TYPE=  INDEPENDENT,   DEPENDENT,       DEPENDENT
##VAR_FORM=  AFFN,          ASDF,            ASDF
##VAR_DIM=   8192,          8192,            8192
##UNITS=     SECONDS,       ARBITRARY UNITS, ARBITRARY UNITS
##FACTOR=    0.0002768,     1,               1
##FIRST=     0,             0,               0
##LAST=      2.2672688,     0,               0
##MIN=       0,             -150307,         0
##MAX=       2.2672688,     103892,          0
$$ Real data points
##PAGE= N=1
##DATA TABLE= (X++(R..R)), XYDATA
0@%%%%%%%%%%%%%%%pJ5j6J6j6J6k0K8l2L6m4M9n7O7p5Q8j01J13j28J44j62J83
$$ 0 0 0 0 0 0 0 0 0 0 0 0 0 0 0 0 -7 8 -8 8 -8 8 -12 16 -16 20 -24 25 -32 35 -40 48 -53 60 -68 76 -86 97
37I7k05K26k51K82l14L49l85M25m71N21n74O33o98P65q42R31j030J137j256J395
$$ 97 -108 118 -133 149 -165 184 -201 224 -247 274 -300 333 -365 400 -442 489 -541 596 -660 735
57G35j556J743j963K226k549K959l497M233n306P025j0207J8000p3642q8508J58229
$$ 735 -821 922 -1041 1185 -1364 1595 -1902 2331 -2975 4050 -6157 11843 -61799 -150307 7922
72G922N6072n0945K8509O2334l9064j6127L9495j4310n2837P021j3002o7161j2643
$$ 7922 63994 13049 41558 103892 64828 48701 88196 73886 21049 28070 15068 -52093 -64736
85f4736L4208j9863j5743L7560J4978k3783J5152M2022p20k1328K8955K3048l8378
$$ -64736 -30528 -50391 -66134 -28574 -13596 -37379 -22227 19795 19075 -2253 26702 49750 11372
98A1372j2499N0991M979n3056j4107K4124n402j7605J096j5629k5425J7948J7579
$$ 11372 -1127 49864 54843 1787 -12320 11804 6402 -11203 -10107 -25736 -51161 -33213 -15634
111a5634k0106J2985L9424j2348j5254L7342K0548j9676K214J3411k6717l0984
$$ -15634 -35740 -22755 16669 4321 -10933 26409 46957 27281 29495 42906 16189 -14795
123a4795J0790P279k0896l395R094j2954o663J6461J2123J747j486k351L12O487
$$ -14795 -4005 3274 -17622 -21017 -11923 -24877 -31540 -15079 -2956 -1209 -2695 -5046 -4734 1753
137A753J5148O498q953J665J0746q127j1069M598j481j9979j3031M710k861r805
$$ 1753 16901 23399 14446 16111 26857 18730 7661 12259 10778 -9201 -22232 -17522 -20383 -30188
151c0188J0648J0707r323M069J7526K988L708J1207m395r494M882N365o483l440
$$ -30188 -19540 -8833 -18156 -14087 3439 6427 10135 21342 16947 7453 12335 17700 11217 7777
165G777K396r916j1908O725N588r246j552K024o382r4P512M087J523J655K981
$$ 7777 10173 257 -11651 -4926 662 -8584 -10136 -8112 -14494 -14588 -7076 -2989 -1466 189 3170
180C170K182J612N706K544n219l479l387o735k92K590k343o400j873O690K127
$$ 3170 5352 6964 12670 15214 9995 6516 3129 -3606 -3898 -1308 -3651 -10051 -11924 -5234 -3107
195c107j587P330K777q505J388P335j639L46L592m394m476L224L012l818k874
$$ -3107 -4694 2636 5413 -3092 -1704 5631 3992 4338 7930 3536 -940 2284 5296 1478 -1396
210a396J585o427p231P384L830m763L314L371l661K900Q387L813k466k839O20
$$ -1396 189 -6238 -13469 -6085 -2255 -7018 -3704 -333 -3994 -1094 7293 11106 8640 5801 6421
225F421k099k777K532j117n776j932j623k175K972L639m47l546o06M882R07j125
$$ 6421 4322 1545 4077 2960 -2816 -4748 -6371 -8546 -5574 -1935 -2382 -5928 -6534 -1652 -745 -1870
241a870P013J742p054P72O434J83l08J090l419o245j209K790k231l385J381l194
$$ -1870 5143 6885 -169 603 7037 7220 6912 8002 4583 -1662 -2871 -81 -2312 -5697 -4316 -7510
257g510m189O604N130j745K538K566k338j269N194M418l625l841J742k119l887
$$ -7510 -11699 -5095 35 -1710 828 3394 1056 -213 4981 9399 5774 1933 3675 1556 -2331
272b331L355K241m312k903k132q21K147L267J425l032j188M468J034K76N797R20
$$ -2331 1024 3265 -1047 -3950 -6082 -6903 -4756 -1489 -64 -3096 -4284 184 1218 1494 7291 8211
288H211n852j237K644l31j936l35j108m939k725L979N85j097K681j93k915K869
$$ 8211 2359 1122 3766 3435 1499 1164 56 -4883 -7608 -3629 -3044 -4141 -1460 -1653 -4568 -1699
304a699L561J112J591K36j872k396J945L869k440l745J327l123l903K249K390
$$ -1699 1862 2974 4565 4801 2929 533 2478 6347 3907 162 1489 -1634 -5537 -3288 -898
319h98j628k446k30Q41J290K759L733q65q81K459q26n14L447l78m217k212l66
$$ -898 -2526 -4972 -5202 -4361 -3071 -312 3421 2556 1675 4134 3308 2794 6241 5863 1646 -566 -932
336i32q07j098Q01M10l699j521L989O47j52L504J042k290R27K750J416l21n26
$$ -932 -1739 -2837 -2036 -1626 -5325 -6846 -2857 -2210 -2362 1142 2184 -106 821 3571 4987 4666 4140
353D140j094l000l37J759k459j583J019k046k818K509K558P8n22R93J324n66J840
$$ 4140 3046 46 -291 1468 -991 -2574 -1555 -3601 -6419 -3910 -1352 -1274 -1796 -803 521 -45 1795
370A795K631p91j432R47j210r98J127m89j967k104n50o0p31R32J531j705m22L973
$$ 1795 4426 3635 2203 3150 1940 942 2069 1580 -387 -2491 -3041 -3101 -3832 -2900 -1369 -3074 -3496 477
388D77P8l32L080R97j449j485J419P85j964j269j77k279q32J437j148j67J471
$$ 477 555 223 3303 4300 2851 1366 2785 3570 1606 337 160 -2119 -2951 -1514 -2662 -2829 -1358
405a358m85j015J837K343K54j094J236J401j571L00J979j699j801L37r14j125
$$ -1358 -1843 -2858 -1021 1322 1576 482 1718 3119 1548 1848 3827 2128 327 664 -250 -1375
421a375n44L49l31j468J99J737K03Q67J493j390N81K356j24n28O19L3j358j615
$$ -1375 -1919 -1570 -1901 -3369 -3170 -1433 -1230 -363 1130 -260 321 2677 2553 2025 2644 2677 1319 -296
439b96J183N85k452j318P71j597K2J376j05n0J107mN23J029J993J61j351M43N55
$$ -296 887 1472 -980 -2298 -1527 -3124 -3102 -1726 -1831 -1881 -774 -778 -255 774 2767 2928 1577 2020 2575
458B575j679L32J180k075j986j79J01m79J82O55j34j440R18K109m6J283O63j027
$$ 2575 896 1228 2408 333 -1653 -1832 -1731 -2210 -2028 -1373 -1507 -2947 -2029 80 34 1317 1980 953
476I53L56J256m57m27K45j62j899j949J460P16j815k54N84j230n4K034Q81k11
$$ 953 1309 2565 2108 1681 1926 1764 -135 -2084 -624 92 -1723 -1977 -1393 -2623 -2677 -643 238 27
494B7L31k20J17K92K025K96k072N09Q1j519K60R87j357j526m05k17k93L79J793
$$ 27 358 138 255 547 2572 2868 796 1305 1386 -133 127 1114 -243 -1769 -2174 -2391 -2684 -2305 -512
513e12N36j699P59J883L04O74O31n59q71j80M9j03m47k59r92j890J363J028j148
$$ -512 24 -1675 -916 967 1271 1945 2576 2017 1146 966 1015 912 465 206 -786 -2676 -1313 -285 -1433
532a433j8R40o81n07J133J323J80m23Q14o63o2J014R10j143l79m95j595N0R58
$$ -1433 -1451 -511 -1192 -1699 -566 757 937 514 1328 665 603 1617 2527 1384 1005 510 -1085 -1035 -77
551g7n03j198K2k89M14L71J959K1j231P64R07o06K72P85k18n94o50J73Q8K4j13
$$ -77 -580 -1778 -1756 -2045 -1631 -1260 699 720 -511 253 1160 554 826 1611 1393 799 149 322 410 434 321
572C21j307o48N01L63r87R29N79m74k54J146R97j38k32R60p21j119P67M42q09
$$ 321 -986 -1634 -1133 -770 -1757 -828 -249 -723 -977 169 1166 1028 796 1756 1035 -84 683 1125 316
591C16l07k04n26l97O1O45j42p2J30o27L27J787R2j421N69N05r51K22J042j8q05
$$ 316 9 -195 -721 -1118 -1057 -412 -554 -626 -496 -1123 -796 991 1083 -338 231 736 -215 7 1049 1031 226
612B26l99N26l79l10N03n38q95N96K04p30Q47N50j17o7O25k46P8j35P99p60q78
$$ 226 -173 353 -26 -336 167 -371 -1266 -670 -466 -1196 -349 201 84 17 642 396 474 339 1138 378 -500
633e00J010j06l08m32J50q2l27J80L99R4k12ko7L1O26j23n19K37L6J2l91O12J37
$$ -500 510 404 96 -336 -186 -268 -595 -415 -16 78 -134 -136 -203 -172 454 331 -188 49 85 97 -294 318 455
656D55o93j44P50m51m7N93p36l25N49j75J48K29k33J5j7L08K90l31m20N10m74
$$ 455 -238 -382 368 -83 -130 463 -273 -598 -49 -224 -76 153 -80 -65 -82 226 516 185 -235 275 -199
677a99m6R41j22q42j69J00O82m31m70Q83l74k67L17N8K15L87n16k61k5L15N2m95
$$ -199 -245 696 574 -268 -437 -337 345 -86 -556 327 -47 -314 3 61 276 663 147 -114 -139 176 228 -267
699b67O18K11r37k13O63L5l84M43k4l90O9M42K53m49nM2o32L31P64n67l28L36
$$ -267 351 562 -375 -588 75 110 -274 169 145 -245 -176 266 519 70 65 107 -525 -194 570 3 -325 11
721A1l61%K89M75k19l42J4M35n74M74M15j87m23j18J46j16J70k9n18J94n43R21
$$ 11 -350 -350 -61 414 195 -147 -133 302 -272 202 617 430 7 -111 35 -81 89 60 -458 -264 -807 114
743A14n54N78J15n65k6N13j80K77K64k04n35M1M19n0O6j1l98j22j73K18j59J75
$$ 114 -440 138 253 -312 -338 175 -5 272 536 332 -203 -162 257 207 273 262 -136 -258 -431 -213 -372 -197
765a97R2n49K38N70J50p2j47M97k84n94P33K36o48m71J43k86K09K35q4j2J47k79
$$ -197 -105 -654 -416 154 304 232 85 582 298 -296 437 673 25 -446 -303 -589 -380 -145 -229 -241 -94 -373
787c73J57l4K40N25m74k50M01o3K03M05l14j63k81K99l77o19O42K99r85P2K60
$$ -373 -216 -250 -10 515 41 -209 192 129 332 737 423 260 -21 278 -99 -718 -76 223 -762 -690 -430
808d30K36M18L9j38K03J46n7K1l2K64m45l69J49K08m42l4K14m30P8p2L44R1k46
$$ -430 -194 224 263 125 328 474 417 438 406 670 225 -144 5 213 -229 -263 -49 -479 -401 -473 -129 -38 -284
831b84L02L28k58J50L16l06L1j5j94L40o7o8m88m49O68k51l52P01j7n20L5M75
$$ -284 18 346 88 238 554 248 279 264 70 410 343 275 -213 -662 6 -245 -597 104 87 -433 -398 77
853G7K36j11Q5L64p2m81K29M1l4K18r17K82J2k43k62MM49J16l25J2L31m0Q7K99
$$ 77 313 202 287 651 579 98 327 368 334 552 -365 -83 -71 -314 -576 -572 -123 -7 -332 -320 11 -29 58 357
877C57P5j51K63K76n07J37l23l66K12m1j54l08P0K89Rl11K61O8J7J2N23l86K86
$$ 357 432 281 544 820 313 450 127 -239 -27 -68 -222 -530 -460 -171 -162 -473 -212 -144 -127 -115 408 22 308
900C08l16K45M9J08q4j36l84L67k57k65N4L43k26j50k78M10J85j31L20l56L2L26
$$ 308 -8 237 286 394 310 174 -210 157 -100 -365 -311 32 -194 -344 -622 -212 -27 -158 162 -194 -162 164
922A64K76n68M53J10l43j08k8L49m28j89Q8O2j92J77M4n8J54k1J29k10MN89n84
$$ 164 440 -128 325 435 92 -16 -44 305 -123 -312 -224 -162 -354 -177 -133 -191 -37 -58 71 -139 -135 454 -130
945a30M6M75k11j44MJ57l19K16m9K5J12k95K51k31n4K14k50K86j91J32n6q0N1
$$ -130 -84 391 180 36 40 197 -122 94 45 70 182 -113 138 -93 -147 67 -183 103 -88 44 -12 -92 -41
968d1Q7K15Q2l78K58m83N41l05j03L6p9K2j58K40L26O7l04j65J02K08J68l73M24
$$ -41 46 261 343 -35 223 -260 281 -24 -127 -91 -170 -148 -306 -66 260 327 23 -142 -40 168 336 -37 387
991C87n1l55K00J40l71O7l0p1p8j6O5K6m07L60J19k57J34L62r7j14J34k50K08
$$ 387 336 -19 181 321 -50 17 -13 -84 -162 -178 -113 -87 -494 -134 -15 -272 -138 224 127 13 147 -103 105
1014A05N5J53k1k06j24L74n74J21J72j54j31o9j01L42J09k6o8j20N4L55j41n7
$$ 105 160 313 292 86 -38 336 -238 -117 55 -99 -230 -299 -400 -58 51 25 -43 -163 -109 246 105 48
1036D8J99r4k04J35l81M2J27K7k06l5L14K65l29K13j3O3q1k72K09j56P7N8n9J10
$$ 48 247 153 -51 84 -297 -255 -128 -101 -307 -342 -28 237 -92 121 108 171 90 -182 27 -129 -52 6 -53 57
1060E7R8P3j14j72K33n67M63j51L51m33k77L55M0j53L51rj36j16L07k16j26M69
$$ 57 155 228 114 -58 175 -392 71 -80 271 -162 -439 -84 -44 -197 154 145 9 -107 200 -16 -142 327
1082C27j91j77j71K32r7j0N9P2k35K92pj20Q0J53Lk69J26N0j54NoM4j02J31J0
$$ 327 136 -41 -212 20 -77 -87 -28 44 -191 101 94 -26 54 207 210 -59 67 117 -37 -32 -38 6 -96 35 45
1107D5m27N04j64r6M33pj57k70J47j41R6j53k7K04J12l29K15J3J49j9J1Q2l88
$$ 45 -382 122 -42 -138 295 288 131 -139 8 -133 -37 -190 -217 -13 99 -230 -15 -2 147 128 139 221 -167
1130a67L08m9L6O8j66k79J10J69j21j70L93m68K6L74K54m21k05N16j10j00J74
$$ -167 141 92 128 196 30 -249 -139 30 -91 -261 132 -336 -310 64 318 -103 -308 208 98 -2 172
1151A72l29L67l1k21mK24J87m85mK35l71j7J49L39l92L6J46J00j94nK46J31j36
$$ 172 -157 210 179 -42 -46 178 365 -120 -124 111 -260 -277 -128 211 -181 -145 1 101 -93 -98 148 279 143
1174A43L2K48k83k9l84J88j06J01m6j80L79J24k42%k05K32j06L42qr2j91L31o3
$$ 143 175 423 140 111 -273 -85 -191 -90 -136 -316 63 187 -55 -55 -260 -28 -134 208 200 108 -83 248 185
1197A85J2k02K38j83P8m9m50O8K31Pl5J8kN4j3p9J29J4q2J90J1l1L4K53l25p1
$$ 185 197 -5 233 50 128 79 -371 -303 -72 -65 -100 -82 -84 -30 -43 -122 7 21 -61 129 140 109 143 396 71 0
1223@j98K33j99K19p2j72K56j85O3J74J31o7Nk9j03J58R7k50J30j83r2K6j69J56
$$ 0 -198 35 -164 55 -17 -189 67 -118 -55 119 250 183 188 159 56 214 311 61 191 8 -84 -58 -227 -71
1247g1P0Q2j7k33L83j93M7o5J17k9l1K6m2Qp0k2j73K71J03J69l87K96l44L9J09
$$ -71 -1 81 64 -169 214 21 68 3 120 91 60 86 44 52 -18 -40 -213 58 161 330 -57 239 -105 -66 43
1272D3j50J13n3j1J68l7M6m9Nr1J1k16K84o0k08L05k91K74Q1l61L85k33j27J50
$$ 43 -107 6 -47 -58 110 73 119 70 75 -16 -5 -221 63 3 -205 100 -191 83 164 -197 188 -45 -172 -22
1296b2j58k28K40J28O6J45l18K91k32J09O1j49J24j27K14j87N8K10l15N8K9j63
$$ -22 -180 -408 -168 -40 26 171 -147 144 -88 21 82 -67 57 -70 144 -43 15 225 -90 -32 -3 -166
1318a66J77k51M43k0m71L83j61J73J22M7l59K1O4J6k4R7J54l22M8nJ33k13R3L46
$$ -166 11 -240 203 183 -288 95 -66 107 229 276 -83 -62 2 18 -6 91 245 -77 -29 -34 99 -114 -21 325
1342C25k62q9q0k3M54m12O6L74n02K72L3j4k70J35K69m77J86K27k56k51M66l42
$$ 325 63 -26 -106 -129 325 -87 -21 353 -149 123 156 142 -128 7 276 -201 -15 212 -44 -295 171 -171
1364a71o8K90L25k73j59J19rj33K46m8J52k45O7J58n26M02n95L04L00k09j1J87
$$ -171 -239 51 376 103 -56 63 54 -79 167 119 271 26 93 251 -275 127 -468 -164 136 -73 -84 103
1386A03j48K23l04J60K52l07J0K1J83J01p6r0l92L34k57J44Q6l0l29K29K07k49
$$ 103 -45 178 -126 34 286 -21 -11 10 193 294 218 128 -264 70 -187 -43 43 13 -316 -87 120 -129
1408a29o6J6K62r7J80j73J26k3K18m34r6R9O3R8j63p2Q8P3N5K7L1j79J58P6k09
$$ -129 -195 -179 83 -14 166 -7 119 96 314 -120 -216 -117 -54 44 -119 -191 -103 -30 25 52 83 -96 62 138 -71
1433g1L09Mr8m33L98k79K37K5j07K03L8m62J28K81k43r2P5k2L11mk46j48K32l08
$$ -71 238 242 144 -289 109 -170 67 92 -15 188 226 -236 -108 173 -70 -162 -87 -109 202 198 -48 -196 36 -272
1457b72J83N4J36r7k68K95k34L11J01j75oj66R5O9P9j03R8J10m64K16o3O1N5Q8
$$ -272 -89 -35 101 4 -264 31 -203 108 209 34 28 -138 -43 26 105 2 100 210 -254 -38 -101 -40 15 103
1481A03j72qP6Kj62j8J57Jk29L48J70m12L24j33m01K26J51l35L22J55l44J26J33
$$ 103 -69 -77 -1 1 -161 -179 -22 -21 -250 98 268 -144 180 47 -354 -128 23 -312 10 165 -179 -53 80
1504H0p2J43j74j02O1k73K82K81k07j06J46j52j61M53k42j94J67J65QJ3k32J58
$$ 80 8 151 -23 -125 -64 -337 -55 226 19 -87 59 -93 -254 199 -43 -237 -70 95 103 116 -116 42
1526D2l05Q6J4J85L3J08n0p0j86j07J30m2J09n3l13K60L43l29J9j4J67J4k78J90
$$ 42 -263 -177 -163 22 55 163 113 43 -143 -250 -120 -162 -53 -106 -419 -159 184 -145 -126 -140 27 41 -237 -47
1550d7K10m91M19N7p2Q4k3l8j60j89K88J12l40J27j94J20J11n6o8K79j4j48L9
$$ -47 163 -328 91 148 76 160 137 99 -61 -250 38 150 -190 -63 -257 -137 -26 -82 -150 129 115 -33 6
1573Fl9O2J82j31L9l49M68k72K09o1k43K74J48k00m49K74L06k14j85N44l77J36
$$ 6 -33 29 211 80 119 -230 238 -34 175 114 -129 145 293 93 -356 -82 224 10 -175 369 -8 128
1595A28M6k57M2Q2j60M3R7r9J56k5l07L22j86n5K96j12K3K50l76J55r4j70L42
$$ 128 174 -83 -41 41 -119 -76 21 -78 78 53 -254 68 -118 -173 123 11 34 284 -92 63 -31 -201 141
1618A41k24K35k96J87r0Q0j16K33k20J1p5L6L55m21L8p6O8J02p9K05k18M06j59
$$ 141 -83 152 -144 43 -47 33 -83 150 -70 -59 -134 -98 257 -164 -126 -202 -134 -32 -111 94 -124 282 123
1641A23j01J85k64j01K48l5M8j63LL00m61J1N8J04q8K87J9j80k50L68k87J73k61
$$ 123 22 207 -57 -158 90 55 103 -60 -57 243 -218 -207 -149 -45 -133 154 173 -7 -257 111 -176 -3 -264
1664b64L56j37Q5j22J45J94j98j20J74j25k05L11k46Q0J6J68k86j42L43R3k11
$$ -264 92 -45 40 -82 63 257 59 -61 113 -12 -217 94 -152 -72 -56 112 -174 -316 27 120 -91
1685i1J63mJ27l15J06RM9J33j88O4j43Q0j33J92m18N60k39J41k21J25P3q3J19
$$ -91 72 68 195 -120 -14 -5 44 177 -11 53 -90 -10 -143 49 -369 191 -48 93 -128 -3 70 -13 106
1708A06k10p6K64k07J77j85kJ35j67K18o1J6j19J71l9J66j56k47L34J7k91J59
$$ 106 -104 -180 84 -123 54 -131 -133 2 -165 53 -8 8 -111 60 21 187 31 -216 118 135 -156 3
1730CJ4l2L7j47J54Q2m60K23K24k41K79j03j16j37J87k33M65k40p6N6K51n3k19
$$ 3 17 -15 22 -125 29 111 -349 -126 98 -143 136 33 -83 -220 -33 -266 199 -41 -117 -61 190 137 -82
1753h2P1l3J92n9j77N1K0l1M11o25L31k37J82J54k63J18k13J11K22j87P7N4m2
$$ -82 -11 -44 148 89 -88 -37 -17 -48 363 -262 69 -168 14 168 -95 23 -190 -79 143 -44 33 87 45
1776D5K15j59j30j70LJ67J54k3l57N78k35o5j50j88L97j9J32l08L41l62L28k05
$$ 45 260 101 -29 -199 -196 -29 125 102 -255 323 88 23 -127 -315 82 63 195 -113 228 -134 194 -11
1798a1o4m4P4J52j67k09K49qM4j29m8J12j63M0o6L16p0L8m2J77m52L31J2j90K73
$$ -11 -75 -119 -45 107 -60 -269 -20 -28 16 -113 -161 -49 -212 -172 -238 78 8 46 4 181 -271 60 72 -118 155
1823A55j9q4L68k75N5j51l0J6j77R6K23o9ll3l5J7j69J60k33L42k90M61l4k12
$$ 155 136 52 420 145 200 49 19 35 -142 -46 177 108 105 72 37 54 -115 45 -188 154 -136 325 291 79
1847G9k40K07n6J98j84l61J76r5L22m4j97j26N93j68n6p4M8M3j01L1M7R2N3l45
$$ 79 -161 46 -10 188 4 -357 -181 -276 46 2 -195 -321 272 104 48 -26 22 65 -36 -5 42 134 187 -158
1871a58K72k21n7%M6K21J19l15j37J88J90k05J17J44k04K3L9j59kQ3Q8j9N3n9
$$ -158 114 -107 -164 -164 -118 103 222 -93 -230 -42 148 -57 60 204 0 23 62 -97 -99 -16 72 53 106 47
1895D7KR9k1l7k04M7L4n1o1M34m45L41j07J82k52P5j94K75q5l8r3J97l26J1M4
$$ 47 49 148 127 90 -114 -67 -33 -84 -145 289 -156 185 78 260 8 83 -111 164 79 41 -52 145 -181 -170 -126
1920a26J89r2k47J61K93r2k01L23j42K9J48k13p4o3J25P3j35n1rM5n6J0J29n9
$$ -126 63 -29 -276 -115 178 86 -115 208 66 95 243 30 -44 -107 18 91 -44 -95 -104 -59 -115 -105 24 -35
1944c5j16J5Q4Q4kP5k48K1J23j09J53j39o7L53l68M53m38O6J05J52k42P5k05J95
$$ -35 -151 -136 -52 32 30 105 -143 -122 1 -108 45 -94 -161 192 -176 277 -161 -95 10 162 -80 -5 -210 -15
1968a5NK11O1l64K35J61k01l60L80j41J83q5k06n1M6J25M8Qj4L8k50M26l63J45
$$ -15 -10 201 262 -102 133 294 93 -267 113 -28 155 70 -136 -187 -141 -16 32 40 26 64 -186 240 -123 22
1992B2j40J70k41L93j58j9M7k32L57r7J5k40J99q4K5P9N6k24j87K80J53m14J83
$$ 22 -118 52 -189 204 46 27 74 -158 199 102 117 -123 76 -8 17 96 152 -72 -259 21 174 -240 -57
2015e7k02O21m97J45J04k64J18O0j99K36J3k44J35q3J7k9J86rK7n2K13l35J03
$$ -57 -259 362 -135 10 114 -150 -32 28 -171 65 78 -166 -31 -114 -97 -126 60 51 78 26 239 -96 7
2038Gj15K57j96J52R8p6R0j79K0K71k20P0j16J6j13j69M85l14J23j28J65j77N8
$$ 7 -108 149 -47 105 203 127 217 38 58 329 109 179 63 79 -34 -203 282 -32 91 -37 128 -49 9
2061In5J26O9J8k72O2R8k50K02j59K27n3K94k28k40J78l6K4lJ55n5j93J27N9K1
$$ 9 -46 80 149 167 -105 -43 55 -195 7 -152 75 22 316 88 -152 26 -10 14 11 166 111 -82 45 104 125
2086A25K4L7r0K0j57p2R2N0k6k5k6J9O0Lk22K50OJ17k17O2J4M9k65M1K64m47J85
$$ 125 149 186 96 116 -41 -113 -21 29 3 -22 -48 -29 31 34 -188 62 68 185 -32 30 44 93 -172 -131 133 -314 -129
2113a29Q5k70N72k94L3j3k37K63R6q9k98M30L1L5k60J05m9L35m32K16J91m11K30
$$ -129 -44 -314 258 -36 -3 -16 -253 10 106 17 -281 149 180 215 -45 60 11 346 -86 130 321 -90 140
2136A40k78J40j96J88j85K50j05pK28j70R3l31L40N9l13RK68l17K62L6K3j9p9
$$ 140 -138 2 -194 -6 -191 59 -46 -53 175 5 98 -233 107 166 -147 -138 130 -187 75 111 134 115 36
2159C6J03J8j04J18j02l04J77K3m7K95k62M7l0q4K15Q0k31J65J8J06l95J42l9
$$ 36 139 157 53 171 69 -235 -58 -35 -82 213 -49 -2 -32 -116 99 179 -52 113 131 237 -158 -16 -55
2182e5N22m85l6J10k35J58k15K33K43j16m3j66m4K69m12J68J5j66L17l32M10r1
$$ -55 467 -18 -54 56 -179 -21 -236 -3 240 124 81 -85 -129 140 -272 -104 -89 -255 62 -270 140 49
2204D9k7l7P3L6j79M6k52K93K47l00K29j29j02q9M2M4o8L02l8j99K95k92J27j56
$$ 49 22 -15 58 94 -85 -39 -291 2 249 -51 178 49 -53 -142 -100 -56 -124 178 140 -59 236 -56 71 -85
2228h5N9M4K6n6O3j82R4M9j81J40m1K91o9j33o1O6q5J59Q8k98k12K72R4j17j12
$$ -85 -26 18 44 -12 51 -131 -37 12 -169 -29 -70 221 152 19 -42 24 -61 98 186 -112 -324 -52 42 -75 -187
2253a87j98M09M0j3J26k30K24k71j4J91k16J20Q6j10J84J31l92L81j28k50j31
$$ -187 -385 24 64 51 177 -53 171 -100 -114 77 -139 -19 67 -43 141 272 -120 261 133 -117 -248
2274b48M2J62J13j5j20N3K4k21J6J80K34O4K8n92K55K23q2q2K00j9j74K8m5l8
$$ -248 -206 -44 69 54 -66 -13 11 -210 -194 -14 220 284 312 -280 -25 198 116 34 234 215 41 69 24 -14
2298a4Q6n2K4j69J98j60R6m0L3R3l4k55l4J51R8r1R4O6j15J9N2K8k03J74k37K09
$$ -14 72 20 44 -125 73 -87 9 -31 2 95 61 -194 -228 -77 21 -70 24 90 -25 -6 46 74 -129 45 -192 17
2324A7l27K63K45k89J64m1r4R1J36k33K35O2l52O4lP9j08n2J55j42K41j88K90
$$ 17 -310 -47 198 -91 73 32 -62 29 165 -68 167 229 -123 -59 -62 17 -91 -143 12 -130 111 -77 213
2347B13k85K5K51k17j41M23k16m3J8j16jj36M64m67N9J68k17l3K50k28R6j92N12
$$ 213 -72 -47 204 -13 -154 269 53 10 28 -88 -89 -225 239 -228 -169 -1 -218 -251 -1 -229 -133 -325 187
2370A87k40r9P2K42j79J53J9k84J13K11L3q8K15j40l60J33q3K53j5k82Q7RO2j24
$$ 187 -53 -152 -80 162 -17 136 155 -129 -16 195 228 140 355 215 -145 -12 -95 158 143 -139 -52 -43 19 -105
2394a05J3K47k31m0OP1R3l16M48k29j10J71PJ06l10K55k6K17j97Q7k12j42k06
$$ -105 -92 155 -76 -116 -110 -39 54 -262 186 -43 -153 18 25 131 -179 76 50 267 70 157 -55 -197 -403
2417d03M51j13P3L28l81k77L57J31K5Q4l84q0K68k46K27j69N6J58j70J10j99M0
$$ -403 48 -65 8 336 -45 -322 35 166 191 275 -109 -189 79 -167 60 -109 -53 105 -65 45 -154 -114
2439a14L31l36K7k5J6J43q3J51k86N70l45R0k85j56K93k2k4J25L6O0j77j59J24
$$ -114 217 -119 -92 -117 -101 42 -41 110 -176 394 49 139 -146 -302 -9 -31 -55 70 106 166 -11 -170 -46
2462d6O2k88M16k61K20l70L89N3k64Q9J18K9q4r4J0p5K92k43j7Q5r0l7M8r6L31
$$ -46 16 -272 144 -117 103 -267 122 175 -89 0 118 147 63 -31 -21 -96 196 -47 -64 21 -69 -106 -58 -154 177
2487A77L5k40O3k12J87K64n60K61Q8k40P0O2R2l71K88J37j9K20l54J16Oj51J4
$$ 177 212 -28 35 -177 10 274 -286 -25 63 -177 -107 -45 47 -324 -36 101 82 302 -52 64 70 -81 -67
2510f7k8J31%o4L17k02J07k64J76N5j54R1o4n0j68L13l77J39k25M40j29Q8l1j1
$$ -67 -95 36 36 -28 289 87 194 -70 106 161 7 98 34 -16 -184 129 -248 -109 -334 106 -23 65 34 23
2534B3J29k61L4J97j34L8j13K63k35q7L0J18m1J6L7N5j68J56j6j72L14m1j10o3
$$ 23 152 -109 -75 122 -12 26 -87 176 -59 -146 -116 2 -39 -23 14 69 -99 57 41 -131 183 142 32 -31
2558c1k3o6Q6J04l05O84k73kK2l73j36K90J62O9j80%J43j58J6K47k13j14Lq8L46
$$ -31 -54 -120 -34 70 -235 449 176 174 196 -177 -313 -23 139 208 28 28 171 13 29 276 63 -51 -48 -136 210
2583B10l73J50J28k78K23L8l45K24oj3r6r6L63jj17J38l78K04m7R2j35Q1K55l71
$$ 210 -163 -13 115 -163 60 98 -247 -23 -29 -42 -138 -234 129 128 11 149 -229 -25 -72 20 -115 -34 221 -150
2607a50K05J59l94L28k56J22j37l8j44K48P8m0k5j39P0j01K62p8j57J07lK69l26
$$ -150 55 214 -180 148 -108 14 -123 -161 -305 -57 21 -19 -44 -183 -113 -214 48 -30 -187 -80 -83 186 -140
2630a40K72k36K8j17P4K74q0k8L2K4J68n95J32K42o3q5pK19m03J70N5K91k27j41
$$ -140 132 -104 -76 -193 -119 155 75 47 79 103 271 -324 -192 50 -13 -98 -105 114 -289 -119 -64 227 0 -141
2654a41J39J28m72K97K34o7j29j46K71j20r9M9R5m4J72m1j15j01M8j23J4K57J
$$ -141 -2 126 -346 -49 185 118 -11 -157 114 -6 -105 -56 39 -5 167 126 11 -90 -42 -165 -151 106 107
2677A07J7j60J58n9j65j56L36q1j99J63O3K79k12j25o1Q8k0R7K36l54j06K20j44
$$ 107 124 -36 122 63 -102 -258 78 -3 -202 -39 24 303 91 -34 -95 -7 -27 70 306 -48 -154 66 -78
2700g8q0J98q4J4n3l1P8k19K06O6J18k60J30k55J83L90j29m6J40k20j21l8O3r9
$$ -78 -158 40 -44 -30 -83 -114 -36 -255 -49 17 135 -125 5 -250 -67 323 194 148 288 68 -53 -91 -28 -127
2724a27J69k52M37j84q9j11P6J5oo1L92k14j33L5k76M10r0Q5j05J08l10K65j36
$$ -127 42 -210 227 43 -46 -157 -81 -66 -72 -133 259 45 -88 -53 -329 81 -9 76 -29 79 -231 34 -102
2747a02L67l68L1l9K4M4J57j70K56m95L62j13Q2j00k49N35l49m0K06J48j55K53
$$ -102 265 -103 -72 -111 -87 -43 114 -56 200 -295 67 -46 36 -64 -313 222 -127 -167 39 187 32 285
2769B85k64j79K7%N0j79J78J04k2r8k05J43K35L8j14l0n4K4j11j05P9M7J01l2
$$ 285 21 -158 -131 -131 -81 -260 -82 22 0 -98 -303 -160 75 113 -1 -31 -85 -61 -172 -277 -198 -151 -50 -82
2793h2K42k00J24j10rj2M4l10J71L93k32J19k44M3J85J4k03l8J16o0J35J39k61
$$ -82 160 -40 84 -26 -35 -47 -3 -313 -142 251 19 138 -106 -63 122 136 -67 -105 11 -49 86 225 -36
2816c6p9O79o13j01J11J89j74j07K78Qp2L0j74J82J53j96o1p3r2m8J68j11Q6k84
$$ -36 -115 564 -49 -150 -39 150 -24 -131 147 155 83 113 -61 121 274 78 17 -56 -148 -196 -28 -139 -53 -337
2840c37K75j72L6L21k39K21l58K13Q8k30K55M9o0J04L4r2N6j74q3J42l03K39P4
$$ -337 -62 -234 -198 123 -116 105 -253 -40 48 -182 73 122 62 166 200 108 164 -10 -93 49 -254 -15 59
2863E9q2l3P1R1o3k9j12M95l79K3k18O5K05k28J18r9K03pl16J58o5J53J42J41
$$ 59 -23 -56 15 106 43 14 -98 397 18 41 -177 -112 93 -135 -17 -116 87 80 -236 -78 -143 10 152 293
2887B93l45j3J64m26O00k17j22k0k1J6J24J68m20M15l02J9Q0K3J45j91j50J68
$$ 293 -52 -65 99 -327 273 56 -66 -86 -107 -91 33 201 -219 196 -106 -87 -7 16 161 -30 -180 -12
2909a2Jk40L23J63l24k45M04k69K94r0J12k15j9o1L86j52n3K36l98O05l62j61
$$ -12 -11 -251 72 235 -89 -334 70 -199 95 5 117 -98 -117 -178 208 56 3 239 -159 446 84 -77
2931g7N1K41K4k53n1J1J87k05K77j50j80J27K29j81j02L0J21k4l76L29K7j2j74
$$ -77 -26 215 239 -14 -65 -54 133 -72 205 55 -125 2 231 50 -52 -22 99 75 -301 28 55 43 -131
2954a31J97J2N8j30O1j35L7J02q7j80K99J31l36j16J65R9L09n00K11j65O2k4R5
$$ -131 66 78 136 6 67 -68 -31 71 -16 -196 103 234 -102 -218 -53 46 355 -145 66 -99 -37 -61 34
2977C4p3J06M6P0l34j6J94j57K22J06k4o9l0k4O2j52J38R2k75qj80L3R8L00j34
$$ 34 -39 67 113 183 -151 -167 27 -130 92 198 174 105 75 51 113 -39 99 191 -84 -92 -272 -239 -141 159 25
3002B5j79J60m6K4j9oK38Pk25jm1N9l5m1P3j10J37J17j69J17j35K02j22j36o9
$$ 25 -154 6 -40 -16 -35 -41 197 204 -21 -22 -63 -4 -39 -80 -7 -117 20 137 -32 85 -50 152 30 -106 -175
3027a75K07k5l6qJ04M3O3j18p8J65j62j18K64k65J23n8K93q5O0m68K41J13n7P6
$$ -175 32 7 -29 -37 67 110 173 55 -23 142 -20 -138 126 -139 -16 -74 219 134 194 -274 -33 80 23 99
3051I9m2L5P7l31L25j47K7J90l09L06l09p3L8J91M5r6k58L28J10k40j05L13j11
$$ 99 57 92 169 -162 163 16 43 233 -76 230 -79 -152 -114 77 122 26 -232 96 206 -34 -139 174 63
3074F3j91J25l28L72P7K39j21k07Q9j89P5k1K2K10l53l5J67j04R3J47j86L12k88
$$ 63 -128 -3 -331 41 118 357 236 29 118 -71 4 -17 5 215 -138 -173 -6 -110 -17 130 -56 256 -32
3097c2K0k59M91l03o5K17k44K72l7j09K03k44p4L2QJ65k38J83j79J3J82p7J23
$$ -32 -12 -271 220 -83 -148 69 -175 97 60 -49 154 -90 -164 -132 -124 41 -197 -14 -193 -180 2 -75 48
3120D8J39m7j17mo1J18N8k42L71j78R1l96L5P2n7J42j04N1L20l50q4L85k06K13
$$ 48 187 140 23 19 -42 76 134 -108 263 85 176 -220 -185 -113 -170 -28 -132 -81 239 -111 -195 190 -16 197
3144A97l87J03O3QL13m38J40K27j23n3NM3L8k88K04Q1q3j35J62j9o8K15k99R0
$$ 197 -190 -87 -24 -16 297 -141 -1 226 103 50 55 98 136 -152 52 133 50 -85 77 58 -10 205 -94 -4
3168dJ9R9k95Q4J98j35l6J59k64L44Q7k40mJ20m5k38j46K86j0l9Pr9K43K36m61
$$ -4 15 114 -181 -97 101 -34 -70 89 -175 169 256 16 12 132 87 -151 -297 -11 -21 -60 -53 -152 91 327 -134
3193a34L66n12M35n4P0k62L48k82r3K15J06o0l25Q5J12j22k2m4M7L46m5j45Mk1
$$ -134 232 -280 155 101 171 -91 257 -25 -118 97 203 143 -182 -97 15 -107 -129 -173 -126 220 175 30 34 13
3217A3j5j27r3J12j03J97J13l2mK14l49J25J74o6j95J87l12L99j65j59K40l71
$$ 13 -2 -129 -222 -110 -213 -16 97 65 61 275 -74 51 225 159 -36 151 -161 238 73 -86 154 -217
3239b17J76J73J00m26J75k55M31l4l40K84j09K62n0k81K02J47l37m2J52Oj46J36
$$ -217 -41 132 232 -194 -19 -274 157 123 -217 67 -42 220 170 -111 91 238 -99 -141 11 17 -129 7
3261Gj86M99r7j24M0pQ7j56n6K0l36K16J1j62K80L0n0Oj27J35J74k46rj78K17
$$ 7 -179 320 223 99 139 132 219 63 7 27 -309 -93 -82 -244 36 66 16 22 -105 30 204 -42 -51 -229 -12
3286a2j16K09K3L8k24L16m21K25J18N3k19Q8K66n09J11j72L53k85Mj7K82j98J36
$$ -12 -128 81 104 142 -82 234 -187 38 156 209 -10 78 344 -165 -54 -226 127 -158 -154 -171 111 -87 49
3309D9J6k23L3J8J69k40J4K20J9R0j70R1m34K26L5r8M52m37M56k82K61p6K2n9
$$ 49 65 -158 -125 -107 62 -178 -164 56 75 165 -5 86 -348 -122 -87 -185 267 -170 286 4 265 189 211 152
3333A52o3o1k80M05k89J15J12qk20r8K61j98K29J10o0j62J77j32O2R7j60l8O4
$$ 152 89 28 -252 153 -136 -21 91 83 -137 -235 26 -172 57 167 107 -55 122 -10 52 149 -11 -49 15
3356A5J64j98J63l72J44J65J85l22n7J2K34k83P9J91m63M75l16L30l35P0k0j01
$$ 15 179 -19 144 -228 -84 81 266 -56 -113 -101 133 -150 -71 120 -343 132 -184 146 -189 -119 -139 -240
3378b40L71P9m24N25l57qJ6J50L9L0l39L01m2j78J55n7l92L51K9j18J79j17k6
$$ -240 131 210 -214 311 -46 -54 -38 112 151 181 -158 143 101 -77 78 21 -371 -20 9 -109 70 -47 -73
3401g3o0p3J75J10k9m33N66k02K3K05j95J73k54J59m6J7L2LM2k20J44L04l22n
$$ -73 -133 -206 -31 79 50 -383 183 -19 4 209 14 187 -67 92 46 63 95 98 140 -80 64 368 46 41
3425D1J32Jj97L2J08j71R1l21J93L7J52R2k59J4K24q0k63J05Q4m7O0N4oQ3k56
$$ 41 173 174 -23 9 117 -54 37 -284 -91 -54 98 190 -69 -55 169 89 -174 -69 15 -32 28 82 76 159 -97
3450i7Q3L9O4k8k45O4L8L34k33L0K5o3L74m59N2J45n6Q7J53m95Q6P9j15J72J6
$$ -97 -14 25 89 61 -184 -120 -82 252 19 49 74 11 385 -74 -22 123 67 154 307 -188 -102 -23 -138 34 50
3475E0l21K08J79k65Q8O0j2J64mj09k33QR4J59l51K79NQ1k02L15K37n50K30l96
$$ 50 -271 -63 116 -149 -61 -1 -13 151 147 38 -195 -187 -93 66 -285 -6 -1 80 -122 193 430 -120 110 -286
3499b86M38j10MQ2J79k08k79OQ8J68p6j84K53m0j74J24j11L07j77O4l03O6K18
$$ -286 152 42 46 128 307 99 -180 -174 -86 82 6 -178 75 35 -139 -15 -126 181 4 68 -235 -169 49
3522D9r8J66J73k70J0K11o1j02J72k1k40r5K4l18L65J28n0K17m33R3JK01M4k11
$$ 49 -49 117 290 20 30 241 180 78 250 229 -11 -106 -82 -400 -35 93 43 260 -173 -80 -79 122 166 -45
3546d5O1Lj49J72m3J37k92J16Q8N2l7K0N9k52K50J30k1m87K32J61j26K41k59L57
$$ -45 16 19 -130 42 -1 136 -156 -40 48 100 63 83 142 -110 140 270 249 -238 -6 155 29 270 11 368
3570C68m44O0j72R7J43J03r7j65K94M3r6k07J96j95nP0J9j92M21m73J5L22J4N1
$$ 368 -76 -16 -188 -91 52 155 58 -107 187 230 134 -73 123 -72 -77 -7 12 -180 241 -232 -217 105 119 170
3594A70l10j40L26J74l73K83j90L6J47k18J47J41j54Q4O7j88n0j8j44K26Q5l3
$$ 170 -140 -280 46 220 -153 130 -60 -24 123 -95 52 193 39 123 190 2 -48 -66 -210 16 101 68
3616F8j42R4K07k38p7k00L68j50P6K16Rk85Rn2lk81L77n8K24k22K20k26n0J50
$$ 68 -74 20 227 -11 -88 -288 80 -70 6 222 231 -54 -45 -97 -100 -381 -4 -62 162 -60 160 -66 -116 34
3640C4n1J60j43r9J43L11m45M4K35k24j0K53j76n8Q8k38R1N24m20n2J89k86O9
$$ 34 -17 143 0 -99 44 355 -90 -46 189 -35 -45 208 32 -26 62 -176 -85 439 19 -33 156 -130 -61
3663f1J85l24L12l1q0K53m2j25j08J61k11jJ01J7p8k05J60K4N3k1J46l56Q2K69
$$ -61 124 -200 112 81 1 254 212 87 -21 140 -71 -72 29 46 -32 -237 -77 -53 0 -21 125 -231 -149 120
3687A20l67J57K22j85r6J5M14r6k91Pj55J93o9KQ9O4K61j30l28K68P6l3q2j9J16
$$ 120 -247 -90 132 -53 -149 -134 280 184 -107 -100 -255 -62 -131 -129 -40 24 285 155 -173 95 171 138 56 37 153
3712A53n0k45L10%j29k81L56M5j62l48M04N1j49J2R9k35J56j08J58q5p1K63j04
$$ 153 103 -142 168 168 39 -242 114 159 -3 -351 53 104 -45 -33 66 -169 -13 -121 37 -48 -119 144 40
3735D0K07m79K91m5j79J26K36j84K6l42N0L64j62L9j17M56l36j49K88j48j27K60
$$ 40 247 -232 59 14 -165 -39 197 13 39 -303 -253 111 -51 -12 -129 327 -9 -158 130 -18 -145 115
3757A15j89J65o4j31Q2m2r1m4K08K88k84L2l03L28j86N0L15r7k35L01r1L4j4j41
$$ 115 -74 91 27 -104 -22 -64 -155 -199 9 297 13 45 -258 70 -116 -66 249 152 -83 218 127 161 147 6
3781Fj21q5R1J70j26k10J27K82k34P9Q6K7m8m2J42l75R5pR2j65N00k36J53j41
$$ 6 -115 -200 -109 61 -65 -275 -148 134 -100 -21 65 92 44 2 144 -231 -136 -143 -51 -216 284 48 201 60
3805F0j08j80R1J38J68P4l94L29l41Q2K08j85J35J88k46O2k10P4l8P6o7P1m9J59
$$ 60 -48 -228 -137 1 169 243 -151 178 -163 -81 127 -58 77 265 19 81 -129 -55 -93 -17 -84 -13 -62 97
3829I7j62k36K79J13K88n32J97j53o2J7Q2m4K80k25Q6r3k64M78r3k31J85p0k05
$$ 97 -65 -301 -22 91 379 -153 44 -109 -171 -154 -72 -116 164 -61 25 -68 -332 146 53 -178 7 -63 -268
3852b68K49J37k48L54j65J84l49p7J84K59m69K00j02K7j8k7M27l53K48j09r3k9
$$ -268 -19 118 -130 224 59 243 -106 -183 1 260 -209 -9 -111 -84 -102 -129 298 -55 193 84 -9 -38
3874c8K08j64k11M9M24o9r4j07j13k6J25M4J52l52L55k9k31J0m3J25J62l83K1
$$ -38 170 6 -205 -156 268 199 105 -2 -115 -141 -16 28 180 -172 183 154 -77 -67 -110 15 177 -206 -185
3897a85lK39L4j25p2K02o6Q7k60J57Jl3q1J53l3K68r0j74j30P1J14j10j24L65
$$ -185 -188 51 85 -40 -112 90 24 111 -149 8 9 -24 -105 48 15 283 193 19 -111 -40 74 -36 -160 205
3921B05l79J93K48k57j03J88k36k09N87J14l28J2O4P2k57L5K00m3l48K35j01j87
$$ 205 -174 19 267 10 -93 95 -141 -350 237 351 23 35 99 171 -86 -51 149 106 -242 -7 -108 -295
3943b95O3J35J26J70j74k6NJ23j28J34q5j21m8K79k7j82P2M6N3m22M44J12j61
$$ -295 -232 -97 29 199 25 -1 4 127 -1 133 48 -73 -121 158 131 -51 21 67 120 -302 142 254 93
3966I3l43J66pO7r1L03K1l04N3K06j39J57k96P2N3J44L8j86K42l03J61j44N7n8
$$ 93 -250 -84 -91 -24 -115 188 209 -95 -42 164 25 182 -114 -42 11 155 193 7 249 -54 107 -37 20 -38
3990c8k6k6K16k40j28L80j16o9J21Q0j8l37K11k19M28j44K62l24k01J74j27K26
$$ -38 -64 -90 126 -114 -242 138 22 -47 74 154 136 -201 10 -209 219 75 337 13 -188 -14 -141 85
4012H5k24L56j27K2k45j8K06j82J34K41l45Q1k9mJ53m00P0O35k84j91Q9j23l2
$$ 85 -139 217 90 112 -133 -151 55 -127 7 248 -97 -16 -45 -49 104 -296 -226 409 125 -66 23 -100 -132
4035a32N6J99m61N35p6pk93mL16j88Q3k32K13j1j51M0P2L7N2o0J32k25O8o5m9
$$ -132 -76 123 -338 197 121 114 -179 -183 133 -55 28 -204 9 -2 -153 -113 -41 -4 48 -12 120 -105 -37 -102 -151
4060a51n8O4K38m03N80k91j34J71r6J34j13p3J34j23J40K10o33L05J51j50k26
$$ -151 -209 -145 93 -310 270 -21 -155 16 -80 54 -59 -132 2 -121 19 229 -404 -99 52 -98 -324
4081c24N66k24j37K17j70J26L2k40J07Q2R2J15k45K0l65K62Q0J46n2M3j05J27
$$ -324 242 18 -119 98 -72 54 86 -154 -47 35 127 242 -3 17 -348 -86 -6 140 88 131 26 153
4103A53j13l1R3j56K03j56j14J49j60N4j0k2J24J36N7k83J84j96j24K20K80o2
$$ 153 40 9 102 -54 149 -7 -121 28 -132 -78 -88 -110 14 150 207 -76 108 -88 -212 8 288 226
4125B26k32k32M7J97j21J32kJ19Ok19J35l2J10k2m30J36L98k50r5n1K20j8P0l0
$$ 226 -6 -238 -191 6 -115 17 15 134 140 -79 56 24 134 112 -318 -182 216 -34 -129 -180 40 22 92 62
4149F2j58J14M8j24J56j23K0M8Q8l01J87l05L33O2q2J72j18N4j99J45o2q9P0n9
$$ 62 -96 18 66 -58 98 -25 -5 43 131 -170 17 -288 45 107 25 197 79 133 -66 79 17 -72 -2 -61
4173f1J15N7k88M8L67n2o2n58M54p7J13P6p3k13J7K49m08O19m84Q9K7K08j58k46
$$ -61 54 111 -177 -129 238 186 124 -434 20 -57 56 132 59 -154 -137 112 -296 323 -161 -72 -45 163 5 -241
4197b41K72k6k6pK63R5l94J63RM9J01l6k42k51K42M9R7j54J34o0j11J43R8l15
$$ -241 31 5 -21 -28 235 330 -64 99 108 157 258 222 -20 -271 -29 20 117 -37 97 37 -74 69 167 -148
4221a48K63L7l25K36k7j98J82M3N8l3k14o1N1q4P2K19J13O3k53J02k00K92j76
$$ -148 115 152 -173 63 36 -162 20 63 121 88 -126 -187 -136 -220 -148 71 184 247 -6 96 -104 188 12
4244A2K83l41l6J52m6K0k12P8J66j18M3L4j1l4L9R5k05K82k64J28p2N6p9j23K11
$$ 12 295 -46 -82 70 24 44 -168 -90 76 -42 1 35 24 -10 29 124 -81 201 -63 65 -7 49 -30 -153 58
4269E8j51J43l56L43o5j13J89K08k84J85J6j28j13kl3K66l72j30M43j84J28k5
$$ 58 -93 50 -306 37 -28 -141 48 256 -28 157 173 45 -68 -70 -103 163 -209 -339 104 -80 48 23
4291B3J85P7K6m46L6J16J27r6j93rL40J54m72K15M6j64K61j38j35J75k03k5o8
$$ 23 208 285 311 -135 -99 17 144 48 -145 -154 186 340 -132 83 129 -35 226 88 -47 128 -75 -100 -168
4314a68K32K4k83K08l44L66l18L14l21K00j8j77J74J44j15L4M6o2j57J00J42n8
$$ -168 64 88 -195 13 -331 35 -283 31 -290 -90 -108 -285 -111 33 -82 -48 -2 -64 -221 -121 21 -37
4336c7K59l89j7J49J35k76J88m4j96K10K0O9l29K71P8k01L60j11J43k81M11m63
$$ -37 222 -167 -184 -35 100 -176 12 -32 -228 -18 2 71 -258 13 91 -110 250 139 282 1 412 -51
4358e1J82n8P7n14K37K80J3k16r6P4oK30k24M9r0K03n2j16J07L0n4k58L11m0j35
$$ -51 131 73 150 -364 -127 153 166 -50 -146 -72 -78 152 -72 -23 -113 90 38 -78 29 59 5 -253 58 18 -117
4383a17L22o09L80L08l98M0n0J28N8K4Q0q4N8l07J64l12K93J00l82J61J97j14
$$ -117 205 -404 -24 284 -114 -74 -124 4 62 86 166 82 140 -167 -3 -315 -22 78 -304 -143 54 -60
4405f0j2N00m60p7J3R9KJ21m7l0l34J91K26k64o1J72j22J19K1j44P7k3J49lJ91
$$ -60 -72 428 -32 -109 -96 3 5 126 79 49 -285 -94 132 -132 -193 -21 -143 -24 -3 -147 -70 -93 56 53 244
4430B44j17J18k00J20n9k62L22j41j19j58O08n92J16R5J24k35k3n7L86l54R0K40
$$ 244 127 245 45 165 106 -156 166 25 -94 -252 356 -236 -120 -25 99 -136 -159 -216 170 -184 -94 146
4452A46l38J94m60O17l70K26M5k83Q1J1J76J90l11K18j07J37k8j19J44j1k20J12
$$ 146 -192 2 -458 159 -211 15 60 -223 -142 -131 45 235 -76 142 35 172 144 25 169 158 -62 50
4474E0K8j77K16J1R4j87L4Jk82j01K89K39l10j40J22P7J22p0j85n1L4L80j89l55
$$ 50 78 -99 117 128 222 35 69 70 -212 -313 -24 215 -95 -235 -113 -36 86 16 -169 -220 -186 194 5 -350
4498c50K49K57j81j81K65k09M4K42j04J96k03L7L2o1j28J88j68mJ05o2O1j83J27
$$ -350 -101 156 -25 -206 59 -150 -106 136 32 228 25 62 94 33 -95 93 -75 -79 26 -36 25 -158 -31
4521c1j64L16Oj29kj29K01j11K3l6r0L65l9J37l13l1j07m4L20j91R2j23j44L37
$$ -31 -195 121 127 -2 -4 -133 68 -43 -20 -56 -146 219 180 317 4 -27 -134 -178 142 -49 43 -80 -224 113
4545A13j9L00m13J46j43m9l2M4J37j55J08J03q7L7nK2o8k8R5j27j32L1M3J33j17
$$ 113 94 394 -19 127 -16 -65 -97 -53 84 -71 37 140 53 90 85 107 39 11 106 -21 -153 -122 -79 54 -63
4570f3R0j08m4L69l09J94m8j12l3J50l3l30R7J94J82j97J21j63J09j86J70j14
$$ -63 27 -81 -125 244 -65 129 81 -31 -64 86 53 -277 -180 14 196 -1 120 -43 66 -120 50 -64
4592f4K4J34j37Q1m7J31k10j12J12L39k50L1l1l48N77l05j65M98k71j56P8Q3m
$$ -64 -40 94 -43 38 -9 122 -88 -200 -88 251 1 32 1 -347 230 -75 -240 258 -13 -169 -91 -8 -12
4615a2j07k5n6M6J68j41J7K90L7kk94nL01k50J19J48l27j02K62J7l65M75k12k53
$$ -12 -119 -144 -200 -154 14 -127 -110 180 217 215 -79 -84 217 -33 86 234 -93 -195 67 84 -281 194 -18 -271
4639b71K46J19qk8m0J3J22k11J5j92L40k08O2oK99m86M25m09n5L04Jr5K49j27
$$ -271 -25 94 86 58 18 31 153 -58 -43 -235 105 -103 -41 -47 252 -234 191 -218 -273 31 32 -63 186 59
4663E9O7j43J39j66o8K14J4r9J12m33K67k5lJ98k78J73p6R0k10J58l23J99K13
$$ 59 126 -17 122 -44 -112 102 116 17 129 -304 -37 -62 -65 133 -145 28 -48 42 -168 -10 -333 -134 79
4686G9o3P6P2M2j56l28RM42j19J26j3j72N3q7q9R8O0P1N4j41P1j9q3J48l8Nl38
$$ 79 16 92 164 206 50 -278 -269 173 54 180 167 -5 48 -39 -128 -30 30 101 155 14 85 66 -17 131 93 98 -240
4713b40K84qN6j69R6k4MJ29j5r1j02J08k29M2kJ35Q6j5n8Q1k37J13k1n3l5l2L12
$$ -240 44 36 92 -77 19 -5 -1 128 113 22 -80 28 -201 -159 -161 -26 60 45 -13 68 -169 -56 -77 -130 -165 -197 115
4740A15j22N2J39j94q8QK17k62J27M5J9J72qj96j42r0O5J91j90J14j00L38k44
$$ 115 -7 45 184 -10 -98 -90 127 -135 -8 37 56 228 220 24 -118 -208 -143 48 -142 -28 -128 210 -34
4763c4k29M9L09o5j13K15k07m7J50l1j6j29J19j7N1K06j07qj70K12k16l7q5K91
$$ -34 -263 -214 95 30 -83 132 -75 -122 28 -3 -19 -148 -29 -46 5 211 104 96 -74 138 -78 -115 -200 91
4787I1K07k22n2K66m39L45j95M0P2n65N32k40K37l9K00j79p4n3J52j87k14L87
$$ 91 298 76 24 290 -149 196 1 41 113 -452 80 -160 77 38 238 59 -15 -68 84 -103 -317 70
4809G0j76j34M25j27l91N96k25k0K9l37J74K49l34K5L5K2L2l3K16j69J27J26j96
$$ 70 -106 -240 185 58 -333 263 38 18 47 -290 -116 133 -201 -176 -141 -119 -87 -120 96 -73 54 180 -16
4832a6kJ28o6J22k79L3R2j70L40M7p5l74K58k01K19k92K03J8o2R0k4O0j44K3Q0
$$ -16 -18 110 44 166 -113 -80 12 -158 182 229 154 -220 38 -163 56 -236 -33 -15 -77 13 -11 49 -95 -72 8
4857HJ63j76P6j82RK63j82Q0l09K79j80K95J04k45J16J62k48j81J12R8m4q3m1
$$ 8 171 -5 71 -111 -102 161 -21 59 -250 29 -151 144 248 3 119 281 33 -148 -36 62 18 -65 -106
4880a06L20l01L9N1j7Ml7J43j92J18M1p3J59l93L04J2j41Q6n3M37m63J53J03k6
$$ -106 214 -87 -48 3 -14 -10 -47 96 -96 22 63 -10 149 -244 60 72 -69 17 -36 401 -62 91 194 168
4904A68j62k7K5J4j84J68P4k59M57n83J63J04J40J90l46l2O1P4k0k56L91j53J59
$$ 168 6 -21 4 18 -166 2 76 -183 274 -309 -146 -42 98 288 -58 -90 -29 45 25 -231 160 7 166
4927A66j31J36l27J15p2j84N36l92J34k2k33M09l19M1K30k92J85k82K13k75L57
$$ 166 35 171 -156 -41 -113 -297 239 -153 -19 -41 -274 135 -184 -143 87 -205 -20 -302 -89 -364 -7
4948gP5k29K83n6l1k05M45J3l37K53j29J30l09R6O5p9j60K52k8k95K28j83O7N0
$$ -7 68 -161 122 66 35 -170 275 288 -49 204 75 205 -104 -8 57 -22 -182 70 42 -253 -25 -208 -141 -91
4972i1j21K95lj36J90l25L05N1l06L26o8j88j09P8K0o0K04k08q8J44J48k59K06
$$ -91 -212 83 80 -56 134 -191 114 165 -141 185 117 -71 -180 -102 -82 -142 62 -146 -234 -90 58 -201 5
4995EJ97j85j30j07L41k3j39K00k15O8K40k08j12J4O0j86N1J00L39k46k9m14N99
$$ 5 202 17 -113 -220 121 98 -41 159 -56 12 252 44 -68 -54 6 -180 -129 -29 310 64 35 -379 220
5018B20k26j21o3L16m5M2o8K1o4Q6j23m1O8L1j47L7M8j17K76k43qm1q1j7P5M24
$$ 220 -6 -127 -190 126 81 123 55 76 12 98 -25 -66 2 33 -114 -77 -29 -146 130 -113 -121 -162 -243 -260 -185 239
5044B39j23J91k70j71J21r4K18l06K29K8K35j10j05j10M89n93L9J24k8P5k33J39
$$ 239 116 307 37 -134 -13 -107 111 -195 34 62 297 187 82 -28 461 -132 -93 31 3 78 -155 -16
5066a6j42J28r4P4j44j01N20n19L07J91p1j81k14J48j3J78K77k03L7k33j34J4
$$ -16 -158 -30 -124 -50 -194 -295 225 -294 13 204 133 -48 -262 -114 -127 51 328 125 162 -71 -205 -191
5088a91M55k44j53RO9K22k39K00J9r6K1l8J21q1l8OP2k5q5J58m87J27J47p1K81
$$ -191 264 20 -133 -124 -55 167 -72 128 147 51 72 34 155 74 36 42 114 89 4 162 -325 -198 -51 -122 159
5113A59J49j39l22J86o7l9k6J93j87O2R7p4Q4p1r4j63K52J23m21jK06O3o5L1j33
$$ 159 308 169 -153 33 -34 -73 -99 94 -93 -31 66 -8 76 5 -89 -252 0 123 -298 -299 -93 -30 -95 -64 -197
5138a97L06k24J00K13k38p0p9K97k13K12r7J37j32J27j75p4J4J10O8p2J13k85
$$ -197 109 -115 -15 198 -40 -110 -189 108 -105 107 10 147 15 142 -33 -107 -93 17 85 13 126 -159
5160a59K07J78l72Q5L9MN1j86P6o6j65K36J58l04j15L54L1r0j24r4K47J00qj54
$$ -159 48 226 -146 -61 -22 -18 33 -153 -77 -143 -308 -72 86 -218 -333 21 52 -38 -162 -256 -9 91 83 -71
5184g1J42J54k49j17L77j46oj15j28o1K20j83L09j05k24M4K5N4J7L01m4J87m65
$$ -71 71 225 -24 -141 236 90 84 -31 -159 -220 0 -183 126 21 -203 -159 -134 -80 -63 238 194 381 -84
5207h4J15J31j53j5jjK01n66K10l0J07j08J03J59j38Q0J30r2K55n8n42K36r4Q9
$$ -84 31 162 9 -6 -7 -8 193 -373 -163 -193 -86 -194 -91 68 -70 10 140 48 303 245 -297 -61 -155 -66
5231f6J46k45LPJ88r3OJ12J2m3J48k31k9K17j94K99k91Q3l5j88K93l21J87J63
$$ -66 80 -165 -162 -155 33 -60 -54 58 70 27 175 -56 -85 132 -62 237 -54 29 -6 -194 99 -222 -35 128
5255A28l62J15J7J98j06o3K8N1J30k49K63k6j90R0k80K47N4k2j17R9J83l9j09
$$ 128 -234 -119 -102 96 -10 -73 -45 6 136 -113 150 124 -66 24 -256 -9 45 23 -94 5 188 149 40
5278D0l03K70l5J52p9q3J43k44J21o0J12R1m87O24k99o2K55j06j00k1j43J47J20
$$ 40 -263 7 -28 124 45 -38 105 -139 -18 -78 34 125 -362 262 -37 -99 156 50 -50 -71 -214 -67 53
5301E3j17M5M4o3M9J54k12k4j30J47J44j57J12M3J95j78l02J19k65N66k68k0l2
$$ 53 -64 -19 25 -38 11 165 -47 -71 -201 -54 90 -67 45 88 283 105 -197 -78 -343 223 -45 -65 -97
5324i7k2K42m5k45J21K69k55j04K72n3P9k37J41j16L4Q9k90L45j98j47J42MK55
$$ -97 -119 123 78 -167 -46 223 -32 -136 136 83 162 -75 66 -50 -16 73 -217 128 -70 -217 -75 -71 184
5347A84P8j30J02Pm17K51k7m6m7R1k57K2K21N9j32o2O3j05O2N5p0K48r9j88O5
$$ 184 262 132 234 241 -176 75 48 2 -45 46 -211 -189 32 91 -41 -103 -40 -145 -83 -28 -98 150 51 -137 -72
5372g2J84k00J79o9j09N7o2K00l09Q3k4K38k67M9L85l81L29k27K73l21l6Q3L0
$$ -72 112 -88 91 22 -87 -30 -92 108 -201 -118 -142 96 -171 -122 263 -118 211 -16 257 -64 -100 -17 13
5395A3j65j00J24Q9J0j73K62J42l22J33J56m08O9nR2O9m9q1Q5j86K86m63N32l6
$$ 13 -152 -252 -128 -39 -29 -202 60 202 -120 13 169 -239 -170 -175 -83 -14 -63 -144 -59 -245 41 -422 110 74
5419G4p2j70J4J91j22k1Q7k96M41M7m31L88l46K48j30K9n4J28O6J19l45K89j52
$$ 74 2 -168 -154 37 -85 -106 -19 -315 126 173 -258 130 -216 32 -98 -69 -123 5 71 190 -155 134 -18
5442a8K82k30J5K53m79L02j59R1J17k36J3J07j87J07J53j73R7l8l6J33pL2k33
$$ -18 264 34 49 302 -177 125 -34 57 174 -62 -49 58 -129 -22 131 -42 55 17 -19 114 107 139 -94
5465i4m7L33j21k93K11j53J13l6J85M8L4p4k95M26J46m22qK41R9k24k5p2o7P4
$$ -94 -141 192 71 -222 -11 -164 -51 -87 98 146 180 106 -189 237 383 -39 -47 194 293 69 44 -28 -95 -21
5489b1j77K15k79J86N5K86l38J13j90K32j19O3j44p2N02k53j04N8r4K06k37J72
$$ -21 -198 17 -262 -76 -21 265 -73 40 -150 82 -37 26 -118 -190 312 59 -45 13 -81 125 -112 60
5511F0J91j00k1p8j22J65K1n5N5k79k4l7K76l13J81j15L30j28O4l90J85K39r1
$$ 60 251 151 130 52 -70 95 116 61 116 -163 -187 -224 52 -261 -80 -195 135 7 71 -319 -134 105 14
5534A4k01L59n43M55j56K25l88K66n0J63k94L04j14Q3j60n3j15k1L64P0m18K92
$$ 14 -187 172 -371 84 -72 153 -235 31 -19 144 -150 154 40 123 -37 -90 -205 -226 138 208 -210 82
5556H2L6j35P6j46O0o7J27j35L17j95j82M8k04K40Q0K3n7J97K33n28J27k69J88
$$ 82 118 -17 59 -87 -27 -94 33 -102 215 20 -162 -114 -318 -78 2 25 -32 165 398 -130 -3 -272 -84
5579h4Lo8K61k06L1J12j9q5J4q3o5KN57m00P0q1j20M21k71L15m22J87l19J59M12
$$ -84 -81 -149 112 -94 -63 49 30 -55 -41 -124 -189 -187 370 -30 40 -41 -161 260 -11 304 -118 69 -250 -91 321
5604C21j28m10J62R2j94K19j60L16q1p5j55J19j40K63J5m55N5K25J4O3p2K4O1
$$ 321 193 -217 -55 37 -157 62 -98 218 137 62 -93 26 -114 149 164 -291 -236 -11 3 66 -6 18 79
5627G9p4q7j66J25J60n8K29j02o1k28J54J50j83L8M1P9J28n9k78J06P4m8j4j6
$$ 79 5 -82 -248 -123 37 -21 208 106 45 -183 -29 121 -62 -24 17 96 224 165 -113 -7 67 19 5 -11
5651a1r7P8q0J29j67J42J6k48K53q8R3M2k1M2j22K86j4p2k74K13l91L16j89J52
$$ -11 -108 -30 -110 19 -148 -6 10 -238 15 -73 20 62 41 83 -39 247 233 161 -113 100 -291 25 -164 -12
5675a2M7j14R7k62J65J58j1J34K19n97P9J91K7j13j07J90k75J63J27K9m7k54O35
$$ -12 35 -79 18 -244 -79 79 68 202 421 -176 -97 94 121 8 -99 91 -184 -21 106 135 88 -166 469
5698D69p06J91j49M25l17K60k06K01k51j33J10J63r4K20j71j83o0J24J88n8j42
$$ 469 -237 -46 -195 230 -87 173 -33 168 -83 -216 -106 57 -37 183 12 -171 -231 -107 81 23 -119
5719a19l1K32q3N7K14J32n77J74n4q9k25M30J66k93k05J05J32r5N0K48j34p1L
$$ -119 -150 82 -1 56 270 402 -175 -1 -55 -144 -369 61 227 -66 -271 -166 -34 -129 -79 169 35 -36 -33
5742c3j1l6J65k1J32j52J31j85j13J00j31j13K42J1k2J11k13P6j06J09j98J29
$$ -33 -44 -80 85 64 196 44 175 -10 -123 -23 -154 -267 -25 -14 -36 75 -138 -62 -168 -59 -257 -128
5764a28L17j22k06M57m03K27j03p3J09N5j25K15l97K70j21P9L2l45J03L4j06L25
$$ -128 189 67 -139 318 -85 142 39 -34 75 130 5 220 -177 93 -28 51 83 -262 -159 -125 -231 94
5786I4j70J37MM2k82L6P0J6n4m2K18j46K76k49J79L2n85L88j78J57R7l2K5j5j31
$$ 94 -76 61 65 107 -175 -139 -69 -53 -107 -149 69 -77 199 -50 129 161 -424 -36 -214 -57 40 8 33 18 -113
5811a13k14K02j40M13n2J89l89jL59r5n2k39p8P05m65m8J2k34J15J03K2m7K60
$$ -113 -327 -125 -265 148 96 285 -104 -105 254 159 107 -132 -210 495 30 -18 -6 -240 -125 -22 0 -47 213
5834B13k89k39J66K74j63K07k48Q1J20j37M4j27K32j03j71M4J15J27j06j54J19
$$ 213 -76 -315 -149 125 -38 169 -79 2 122 -15 29 -98 134 31 -140 -96 19 146 40 -114 5
5855Ek78L45j10J2K6p3l9J29J84j26K31m60J89j11J86l08K36Q9k99R6L35m67M86
$$ 5 -273 72 -38 -26 0 -73 -112 17 201 75 306 -154 35 -76 110 -198 38 127 -172 -76 259 -208 278
5878B78j55k32P5M1p8R6J79k98J03M2k4k1k7K44l31K36k40L25N5j88j25O3k16
$$ 278 123 -109 -34 7 -71 25 204 -94 9 51 27 6 -21 223 -108 128 -112 213 268 80 -45 18 -198
5901a98J5K56l02J56q7L52q0r9m3O4J3j18K83p2j37K4J5j11k9J48o5O4k11J74
$$ -198 -183 73 -229 -73 -160 192 112 13 -30 34 47 -71 212 140 3 27 42 -69 -98 50 -15 49 -162 12
5925A2Q0j33J4j79J90Q7n4j43m6J06J29O4j40L8N0k12n8J76l6j64J77oL08l20
$$ 12 92 -41 -27 -206 -16 71 17 -126 -172 -66 63 127 -13 25 75 -137 -195 -19 -55 -219 -42 -48 260 -60
5949f0J55k25K48l3r7M42m25N9kj77K27j68J20j59P6l5O7j13k4J38k63P7O8L9
$$ -60 95 -130 118 85 -12 430 5 64 62 -115 112 -56 64 -95 -19 -54 13 -100 -124 14 -249 -172 -104 -65
5973f5J55O3m19J04j3J27L51m91M7J19k33L67r4j46J44k2P6k6l24K58J3J41k17
$$ -65 90 153 -266 -162 -175 -48 303 -188 -141 -22 -255 112 18 -128 16 -6 70 44 -280 -22 -9 132 -85
5996h5L8K7K25n34P3L66n4k5P8o3n6J5ll2pn3P6O0j71K86n44M83k95K29j09l9
$$ -85 -47 -20 205 -329 -256 110 56 31 109 46 -10 5 2 -30 -37 -90 -14 46 -125 161 -383 100 -195 34 -75 -114
6022a14J26j9j32J81J8R3Rl33L25m05J57J00J61K4k41K87j40Nj92M9K88j25o8
$$ -114 12 -7 -139 42 60 153 162 -171 154 -251 -94 6 167 191 -50 237 97 102 -90 -41 247 122 54
6045E4k3l34M14k9k38JK89l36J35J44l9k09J39J16N1K3n9l06Q9K61k30J00K3k63
$$ 54 31 -303 111 82 -156 -155 134 -202 -67 77 38 -171 -32 84 135 158 99 -207 -118 143 -87 13 36 -227
6069b27L83j75J67j07j63K58l52L50k08J11l43K27K35j83j21j0O0J15j71R4K2
$$ -227 156 -19 148 41 -122 136 -216 134 -74 37 -306 -79 156 -27 -148 -158 -98 17 -154 -60 -38
6090c8N6J51R0k94n9K93k36%J46j39l5o8J18M9l50K79r0J15j29K92Rk42L05j54
$$ -38 18 169 259 -35 -94 199 -37 -37 109 -30 -65 -133 -15 34 -316 -37 -127 -12 -141 151 160 -82 223 69
6114F9r7M3j3j8K4Pk76J95K23m47K46L12m63L37l05L48j74pl30K08P6P9j36P6
$$ 69 -28 15 2 -16 8 15 -261 -66 157 -290 -44 268 -195 142 -163 185 11 4 -326 -118 -42 37 -99 -23
6138b3K59j83k55K29j3j95K63k46J85J17R4l23O4j14J82n0R7j5P7j62N8o2l3J10
$$ -23 236 53 -202 27 14 -181 82 -164 21 138 232 -91 -27 -141 41 -9 88 73 150 -12 46 -16 -49 61
6162F1n0J82m5j42k22R4J21j09K8K4N9J46j15K20l91O5j24J60k4J65P1l10L10
$$ 61 11 193 148 6 -216 -122 -1 -110 -82 -58 1 147 32 252 -139 -74 -198 -38 -62 103 174 -136 174
6185A74k62L56m06M0n3k3J1L98j52j48J37k05J66o3j02M7L56k31r0R9k00R7j57
$$ 174 -88 268 -138 -98 -151 -174 -163 235 83 -65 72 -133 33 -30 -132 -85 271 40 -50 49 -151 -54 -211
6208b11J00m7K78r7K3J03l08J45M0q3J12N7p3K2j57m7L02j00K5k31K59j26k20
$$ -211 -111 -158 120 23 46 149 -159 -14 26 -57 55 112 39 61 -96 -143 159 59 84 -147 112 -14 -234
6231b34J86K63q2l6k81J92qN6l03N09m34L92k07p6K99k84N1K01k2m5j75J28j4
$$ -234 -48 215 133 97 -184 8 0 56 -247 262 -172 220 13 -63 236 -48 3 204 182 137 -38 90 76
6254G6j19R8j55J47l07K79r1j26k8J26J74k78N8K89n2j92J17j06Q8n4J0J52Q9
$$ 76 -43 55 -100 47 -260 19 -72 -198 -226 -100 74 -204 -146 143 91 -101 16 -90 -2 -56 -46 106 195
6277A95l51L14j56Ok24L33M7j53K36l17R7l0j64J75L29o17J71M7K14k95L39j1
$$ 195 -156 158 2 8 -216 117 164 11 247 -70 27 -3 -167 8 337 -280 -109 -62 152 -143 196 185
6299A85n1l03N3J40j34N9K55m1m45J51j27K53K47l15J25k9K1q3J69j92J48k13
$$ 185 134 -169 -116 24 -110 -51 204 163 -282 -131 -258 -5 242 -73 52 23 44 -39 130 -62 86 -127
6321a27J11k9L6J07j70k2M5J24k23J76o3N9j89J14K03l05N7%J08j73K48k26o4
$$ -127 -16 -45 -9 98 -72 -94 -49 75 -148 28 -35 24 -165 -51 152 -153 -96 -96 12 -161 87 -139 -203
6344b03J84J55k08K04Qj54J92J3m2J22o13K65L73n04L64rL3l8j64j12n6K41K20
$$ -203 -19 136 -72 132 140 -14 178 191 149 271 -342 -77 296 -208 156 147 180 142 -22 -134 -190 51 271
6367B71m1j02Q6J05l17l2j26J23R7j91p2K34k78K23m0k21O13l95J57o5J11Q0k40
$$ 271 230 128 214 319 2 -30 -156 -33 64 -127 -199 35 -243 -20 -60 -281 332 -63 94 29 140 220 -20
6390b0J10j74K64K4j88k38J63m8j03J94J83m05M7L33k22K16k20j27J86J13q4J09
$$ -20 90 -84 180 204 16 -222 -59 -107 -210 -16 167 -238 -191 142 -80 136 -84 -211 -25 88 4 113
6412A13p0j71K6j50J35K94j56L6J03l46L9M9R9J47l32J9J77l2N9j94J80k50M7
$$ 113 43 -128 -102 -252 -117 177 21 57 160 -186 -147 -98 1 148 -184 -165 12 -20 39 -155 25 -225 -178
6435a78J09K51j41j94n0O0J28j05K76k84Q0J76j64j25K28k8K7j6m6J42l7J56l28
$$ -178 -69 182 41 -153 -203 -143 -15 -120 156 -128 -48 128 -36 -161 67 39 66 50 4 146 109 265 -63
6458f3j82M89j15j81J43j18j26P3o9J43j48J93p8n8j37K97k01n7K82p9j45k9K46
$$ -63 -245 244 129 -52 91 -27 -153 -80 -149 -6 -154 39 -39 -97 -234 63 -138 -195 87 8 -137 -166 80
6481H0k8o8k70L32p1J31l5J65j30k02K08k56%QJ82k76n1M15l94K88k64J39M2J02
$$ 80 52 -16 -286 46 -25 106 71 236 106 -96 112 -144 -144 -136 46 -230 -281 134 -260 28 -236 -97 -55 47
6505D7k12K56l63R0J53l3l06M32j03o6L32k64l2K00j46m3K73j51j21Mk2L6j02
$$ 47 -165 91 -272 -182 -29 -62 -368 64 -39 -105 227 -37 -69 131 -15 -58 215 64 -57 -53 -75 -39 -141
6528a41K12n1j71K05N9m4o6k31K66J17j82J76o0L8p0j85J27k8L0K11k48J83j85
$$ -141 71 20 -151 54 113 69 3 -228 38 155 -27 149 89 127 57 -128 -1 -29 1 212 -36 147 -38
6551c8ll2K31k64M00m51L37j29J08l60L79j71Q8l44K72J43J0l40K54m7QK0pj52
$$ -38 -41 -73 158 -106 294 -157 180 51 159 -201 178 7 95 -249 23 166 176 -164 90 43 51 71 64 -88
6575h8K6J39m4j28J70N0m56M97K5j15j25m3q1L70l35J51l3j35J85j38k6O4r0K53
$$ -88 -62 77 33 -95 75 125 -331 166 191 76 -49 -92 -173 197 -138 13 -20 -155 30 -108 -134 -70 -160 93
6599I3j46K40j28k4J08j08k31Q3j07n8M45K6q2M8m01L53q4qj51n8M28k38M5j61
$$ 93 -53 187 59 35 143 35 -196 -113 -220 -278 167 193 111 159 -242 111 27 19 -132 -190 238 0 45 -116
6623a16J04p5L0P1j07R7J32j42j9J19M8P3l10k26J24K61M7j48Pl5q9K29m05N03
$$ -116 -12 -87 -57 14 -93 4 136 -6 -25 94 142 215 -95 -321 -197 64 111 -37 -30 -65 -154 75 -330 173
6647A73l56K41K59m62J43J4j24K43j56J19j18L3J3j54M51k44M6j21K60l22L17
$$ 173 -183 58 317 -145 -2 12 -112 131 -25 94 -24 9 22 -132 319 75 121 0 260 -62 255
6668B55k32k0j30J26o3J74k97Q5L26j82J50k74P2p9L36n6j08l33L45r3%JN7k02
$$ 255 23 3 -127 -1 -64 110 -187 -102 224 42 192 -82 -10 -89 247 191 83 -250 95 2 2 3 60 -142
6692a42j4K33j4k8J48N1m65M02n01J51J70N1J1L1K3k24L40j41k04J10R2j12j12
$$ -142 -156 77 63 35 183 234 -231 171 -330 -179 -9 42 53 84 107 -117 223 82 -122 -12 80 -32 -144
6715a44l5K04L2l00o5L60j00Mn1J58m6l30J24j94L32n9J83Nj50J05P4M9m55K14
$$ -144 -179 25 57 -243 -308 52 -48 -44 -95 63 17 -313 -189 -383 -51 -110 73 78 -72 33 107 156 -299 -85
6739h5N1M8j31L19k24j16J21j4n0J23q4N0jm6M8k55L70l17K53j1j35J77j71r8
$$ -85 -34 14 -117 202 -22 -138 -17 -31 -81 42 -42 8 7 -39 9 -246 124 -193 60 49 -86 91 -80 -178
6763a78K04l25O21k65k10j17J70q1J56m2J42mk17J42l43M25k39N2r1J49j81K07
$$ -178 26 -299 322 57 -153 -270 -100 -181 -25 -67 75 71 -146 -4 -347 78 -161 -109 -200 -51 -232 -25
6785b5O2k9K5K34l44j85M15j67l7J47J9k24k5L7K21k98L72m82L40P0k41K18m1
$$ -25 37 8 33 267 -77 -262 153 -14 -51 96 115 -109 -134 -97 124 -174 198 -284 56 126 -115 103 62
6808F2j97J30j1J2P6n8j18J25k23r9M05k12j91J03J14r6K44r0P7j02J49l37K26
$$ 62 -135 -5 -16 -4 72 14 -104 21 -202 -301 104 -108 -299 -196 -82 -178 66 -24 53 -49 100 -237 -11
6831a1j2Ll3j1J19p1J82j70j64J83r9J22j60J62N5K3O1l17J70p8Ll9j12J53J24
$$ -11 -23 -20 -53 -64 55 -16 166 -4 -168 15 -84 38 -122 40 95 118 179 -138 32 -46 -43 -82 -194 -41 83
6856H3k02K8K57j10M9q2m6L0K72R1k56J07l07J89Q1k94K27j11LJ29J26K1j02l23
$$ 83 -119 -91 166 56 105 23 -23 7 279 370 114 221 -86 103 184 -110 117 6 9 138 264 285 183 -140
6880a40K33k37M0M51m50J02J12k86N2R9J53m24J89L37k47k36L23m7oj44L4l6r6
$$ -140 93 -144 -104 347 -103 -1 111 -175 -123 -24 129 -295 -106 231 -16 -252 71 24 18 -126 -92 -128 -224
6903b24K33l43N39k55K74k51K5Q5o9J26j10j34k2J86k21L26j98J78l70K88O6l01
$$ -224 9 -334 205 -50 224 -27 -2 83 14 140 30 -104 -126 60 -161 165 -33 145 -225 63 129 -172
6925a72j02L62l1k00m0J77J95m59M02j20j43K86k26J88Q6k94P1L07l71Jn7K34
$$ -172 -274 88 57 -143 -183 -6 189 -270 132 12 -131 155 -71 117 203 -91 -20 287 -84 -83 -140 94
6947I4k51k9M06q2m43J37K35J06j99Q4j58QK25j71J38k01M1p9J58L8k04k9J95
$$ 94 -157 -186 220 138 -305 -168 67 173 -26 58 -100 -92 133 -38 100 -101 -60 -139 19 57 -147 -176 19
6970A9j13m9j8J06o6J91k14J90J89l87J88J14m2k13J85k49L7K96l61J19J38j08
$$ 19 -94 -143 -161 -55 -121 70 -144 46 235 -152 36 150 108 -105 80 -169 -132 164 -197 -78 60 -48
6992d8K8K28j95q1J6L61l78l3J84j85j33M81p2k32K12k61J82P1m72K77O5l3r2
$$ -48 -20 208 13 -68 -52 309 -69 -102 82 -103 -236 245 173 -59 153 -108 74 145 -327 -50 15 -18 -110
7015a10J91r1p1L50j78j96L39k56N1l7J26j68p4L23l47K92n2J85q38M95L8R6j18
$$ -110 81 -10 -81 269 91 -105 234 -22 29 -8 118 -50 -124 199 -148 144 92 277 -561 -66 -28 68 -50
7038e0J28j13K49m00L27m92M91k9l68K21O0J55l4l7l7oj47J02L03k39Lk27J77
$$ -50 78 -35 214 -186 141 -351 140 111 -257 -36 24 179 145 108 71 65 -82 20 323 84 87 -140 37
7061C7M9k78K71k71M85k70K99m37K06o6M6r0k24L14m77L49K39m08J3L02q4l01
$$ 37 86 -192 79 -192 293 23 322 -115 91 25 71 -19 -243 71 -406 -57 182 -226 -213 89 5 -296
7083b96K78k20J82K07k23%J33M2j49J58j25q3J89J2p6K13k47j96L49j04J9J14
$$ -296 -18 -238 -56 151 -72 -72 61 103 -46 112 -13 -96 93 105 29 242 -5 -201 148 44 63 177
7105A77k67K50r0p2j37J31k67L50j21J19J44m13J67n4K10k39O2M2J12j38L1j43
$$ 177 -90 160 70 -2 -139 -8 -275 75 -46 73 217 -196 -29 -83 127 -112 -50 -8 104 -34 -3 -146
7127a46K45j56J63lr6j1Q9l29L39n1P1M2L2k10j50M04k67J11j44p1J30j84J25
$$ -146 99 -57 106 103 7 -4 85 -244 95 44 115 157 189 -21 -171 233 -34 77 -67 -138 -8 -192 -67
7150f7o2j1J1J32L25l58n0j29K03k37J80q7K58k47K45j71q9NN6J27q4K72j39P
$$ -67 -129 -140 -129 3 328 -30 -80 -209 -6 -243 -63 -150 108 -139 106 -65 -154 -149 -93 34 -50 222 83 90
7174I0j46P4J91r3l19J62M1j26L21o3l2q7k09L08Q7k31J56J17k68j23P2J95k71
$$ 90 -56 18 209 116 -203 -41 0 -126 195 132 100 13 -196 112 199 -32 124 241 -27 -150 -78 117 -154
7197a54L28k59K08J03k49j4J65j88J79l36n3K75j28J97K8k77K22J11K8j62j45
$$ -154 174 -85 123 226 -23 -37 128 -60 119 -217 -270 5 -123 74 102 -175 47 158 186 24 -121
7218a21rp2L67Q1k35j06K9J64k28J20L7k40K8kNK53J98k97l9O1J7k6N4o3M3N8
$$ -121 -130 -202 165 246 11 -95 -66 98 -130 -10 27 -213 -185 -187 -182 71 269 -28 -67 -6 11 -15 39 -24 19 77
7244G7O1l31J16m5R9J07j34j8L9J40m4O3j74J3J03pj66J74o1j32J84n0M6J95j40
$$ 77 138 -193 -77 -122 -23 84 -50 -68 -29 111 67 130 -44 -31 72 65 -101 73 12 -120 64 14 60 255 115
7269A15K39j35m9l2n7l13L01QK05l61J67j39J4p2L12j82k60K44Q3J14k26K8qj85
$$ 115 354 219 170 138 81 -232 69 77 282 -79 88 -51 -37 -109 203 21 -239 5 88 202 -24 4 -4 -189
7293a89J95r9K26j03n4k3k06K48j45J76J55j55j66K42j41n7K03O1j50J7j05K33
$$ -189 6 -93 133 30 -24 -47 -253 -5 -150 26 181 26 -140 102 -39 -96 107 168 18 35 -70 163
7315A63l33J44j46L71L3k03J42k67j55L18q2K27p0n3J5L6k11k64N4J23L17k99
$$ 163 -170 -26 -172 199 232 29 171 -96 -251 67 -15 212 142 89 104 140 -71 -335 -281 -158 159 -140
7337a40J38J22j89J30J8q5J4J32k27R4J8N2K7j46K16k9o9q8l5K99k41m9K00k23
$$ -140 -2 120 -69 61 79 -6 8 140 -87 7 25 77 104 -42 174 145 76 -12 -47 252 11 -38 162 -61
7361f1Jj60K74n6m4R8L4j94L73k05j57J40J81k73J58O4p5j62P2r7P4K98l37N4
$$ -61 -60 -220 54 -2 -46 52 86 -108 265 60 -97 43 224 -49 109 173 98 -64 8 -89 -15 283 -54 0
7385@M8k88K77k32K02R6R9k85K01k69Q4J64l03P0K06J75j14j77LP2j61J53J57
$$ 0 48 -240 37 -195 7 103 202 -83 118 -151 -67 97 -206 -136 70 245 131 -46 -43 29 -132 21 178
7408A78R7m93L34j13o2K62l50r5J56R2L0J88m01K20J2o6j17L3J73k00Qnk36O18
$$ 178 275 -218 116 3 -59 203 -147 -242 -86 6 36 224 -177 43 55 -11 -128 -95 78 -122 -114 -119 -355 263
7432B63l01J30j89L5o3j61M69j42k25K96q6pJ45R7k24q6J77j9O9j61Kn0J22p0
$$ 263 -38 92 -97 -62 -125 -286 183 41 -184 112 26 19 164 261 37 -49 128 109 178 17 19 -31 91 21
7456B1J1l0j49L08k69R5l05L96j80L27l00m5j08L45k8k43J58Q2j06J97k46L15
$$ 21 32 2 -147 161 -108 -13 -318 78 -102 225 -75 -120 -228 117 89 -154 4 86 -20 177 -69 246
7478B46j82j1rj14O6P9k4q8J59J47k22N5m60L04m0L56j98m5o1l8N9p8M2kQ2J32
$$ 246 64 53 44 -70 -4 75 51 -37 122 269 47 102 -358 -54 -94 262 64 19 -42 -80 -21 -99 -57 -59 23 155
7504A55r5j54r8K56p2K33k86J36l2k94J97K25kj53o3K25r8j89j03K8L86j43j67
$$ 155 60 -94 -192 64 -8 225 -61 75 43 -251 -54 171 169 16 -47 178 80 -109 -212 -184 202 59 -108
7527a08l3R9j80K50m8j43K37k58N1Q4J2M0j74L8K05nj24M05j75q2o7r3R5k53K23
$$ -108 -141 -42 -222 28 -20 -163 74 -184 -133 -49 -37 3 -171 -133 72 67 -57 348 173 91 24 -69 26 -227 -4
7552doo7J86J59j76o9K18o9q6q2k8j00L55j15k61K05J4P4j09j36k8J39k03p4J12
$$ -4 -10 -77 109 268 92 23 241 172 86 4 -24 -124 231 116 -145 60 74 148 39 -97 -125 14 -189 -263 -151
7577a51K12k53J22N2o1j88L27j90J86j07L04m84L73p7j65M19l65k33L26L7m5j07
$$ -151 61 -192 -70 -18 -79 -267 60 -130 56 -51 253 -231 142 65 -100 319 -46 -279 47 84 39 -68
7599f8M5J5K28m93J0MJ28J55j75L12m57J52K17m2n0n1p4J77m6M8P0j81J66j26
$$ -68 -23 -8 220 -273 -263 -259 -131 24 -151 161 -296 -144 73 31 -19 -70 -144 33 -13 35 105 -76 90 -36
7623c6K1K25q0l2k58J31RPk76L13j13O8J94j85K96k33j65L32o2l69K36J18l03
$$ -36 -15 210 130 98 -160 -29 -20 -13 -289 24 -89 -21 173 -12 284 51 -114 218 156 -213 23 141 -162
7646a62K21lk83M18k24J94n1j32l57O42n08K66j07O7k4k31R6K5N2J04J61qj61
$$ -162 59 56 -227 191 -33 161 110 -22 -379 263 -245 21 -86 -19 -43 -274 -178 -153 -101 3 164 156 -5
7669eN8j92M29l48j86M80k77O0j00J59k6j81qK16p6j08J08j40K16j34L1K47l30
$$ -5 53 -139 290 -58 -244 236 -41 19 -81 78 52 -129 -137 79 3 -105 3 -137 79 -55 -24 223 -107
7692a07p2J93m4J46j35j60K87p2j49n5L77p6j78J36J6k35J95J53l49J30N2o0k80
$$ -107 -179 14 -30 116 -19 -179 108 36 -113 -168 209 133 -45 91 107 -128 67 220 -129 1 53 -7 -287
7715b87K35J0m1n1L17j86M3l6K3Q6J18j61j04J3J24j61K41k91K9o7J00j06k09
$$ -287 -52 -42 -83 -134 183 -3 40 4 27 113 231 70 -34 -21 103 -58 183 -108 -79 -146 -46 -152 -361
7738c61M75k72K42J73k08j81N6R8O2j04j45J62j35K57j22K1j39j1J90l3K27n00
$$ -361 114 -158 84 257 49 -132 -76 22 84 -20 -165 -3 -138 119 -3 18 -121 -132 58 25 252 -248
7760b48K12QP6J07l03Q9N2p5K84j81oM3rj52K92l25J90J54l83L65k00j49K02j31
$$ -248 -36 -28 48 155 -148 -59 -7 -82 202 21 15 58 49 -103 189 -136 54 208 -175 190 -10 -159 43 -88
7784h8J16P4J90m60m5J06O3K8Pj55K73j22K5o0P1J83l23K45k4j58j72J69M6K63
$$ -88 28 102 292 -168 -213 -107 -44 -16 -9 -164 109 -13 12 -48 23 206 -117 128 104 -54 -226 -57 -11 252
7808B52k55r1J23Q2j00K82j53Mr1p5j46K25p8j86M62l28N3R1l79L52j2j5j61N9
$$ 252 -3 -94 29 111 11 293 140 144 53 -22 -168 57 -21 -207 255 -73 -20 71 -308 44 32 17 -144 -85
7832h5J21Q7k00K41j42pj23J85J32j26k03J16J37l51L13j01k4M7j39J07k16J73
$$ -85 36 123 -77 164 22 15 -108 77 209 83 -120 -4 133 -218 95 -6 -30 17 -122 -15 -231 -58
7854e8M3M2j87M21p7k8j11j41j30K74J10N7j2k27J05j95k6Q7r4J51J64j59j78
$$ -58 -15 27 -160 261 184 156 45 -96 -226 48 158 215 203 -24 81 -114 -140 -53 -147 4 168 9 -169
7877a69K49m2j69J10j8JL48k97J72j21P6j80J84J89l95q9J75k24K60K65j89m1
$$ -169 80 38 -131 -21 -39 -38 310 13 185 64 140 -40 144 333 -62 -151 24 -200 60 325 136 95
7899I5l06M6Q9K12k96J28J2N5j52Q8j45J0J58j2Q1j8L4k1n7k81L44j19j58L9K52
$$ 95 -211 -165 -76 136 -160 -32 -20 35 -117 -29 -174 -164 -6 -18 63 45 79 58 1 -280 64 -55 -213 -174 78
7924G8k14K03J00k93J55k59L00l40K93R7J07k99K31j14J11mj26J9p8j01K03j50
$$ 78 -136 67 167 -126 29 -230 70 -270 23 120 227 -72 159 45 156 152 26 45 -33 -134 69 -81
7946h1R0j26J72Q5k05O6M32k09k60J57j71K84j52J33m25J36O3j05k9N0q4K25M6
$$ -81 9 -117 55 140 -65 1 433 224 -36 121 -50 234 82 215 -210 -74 -11 -116 -145 -95 -179 46 92
7969I2J3m7j90K04k32K62j82OL49l05L5J60j16o3Q1K5j25J57j78O7J17l63L44
$$ 92 105 58 -132 72 -160 102 -80 -74 275 -30 5 165 49 -14 67 92 -33 124 -54 13 130 -233 111
7992A11j34J99l62J27K06k50K61k29N7j14J91J10k64J66j80oK34j12kk24k4J01
$$ 111 -23 176 -186 -59 147 -103 158 -71 -14 -128 63 173 -91 75 -105 -111 123 11 9 -215 -239 -138
8014a38L61l39Q6J70j65j87K53L9j19N2r1K29O8k33P5j7r2O1J29k67k21M45k78
$$ -138 223 -116 -30 140 -25 -212 41 80 -39 13 -78 151 219 -14 61 44 -48 13 142 -125 -346 99 -179
8037a79M2K58k63r4M06k4j74o4J76j14NL8J79k21j88R7K4J00M0J0l06K85q9N9
$$ -179 -137 121 -142 -236 170 146 -28 -92 84 -30 -25 13 192 -29 -217 -120 -96 4 44 54 -252 33 -56 3
8061CjJ19oN3j49k7J00k22J19J50N6k75L5P0j74R1m8P4J00r5l3J62j1Kj98K97
$$ 3 2 121 115 168 19 -8 92 -130 -11 139 195 -80 -45 25 -149 -58 -106 -32 68 -27 -60 102 91 93 -105 192
8087A92k50J69k8oj69k02j1K73Q2l18L94l01K85K9k8Q0k69O8J53j77l2p1J09J50
$$ 192 -58 111 83 77 -92 -294 -305 -32 50 -268 126 -175 110 139 111 191 -78 -10 143 -34 -66 -137 -28 122
8111A22k90j5K55l8J59l24L69j67j45j22K60r4j65L92k47J43R5k54J2J40K4k42
$$ 122 -168 -183 72 34 193 -131 238 71 -74 -196 64 -30 -195 197 -50 93 188 -66 -54 86 110 -132
8133a32J10J52j84K22m79M03J35l38N0J05J73m18K22j04K03p7k1l9J5j64J01J18
$$ -132 -22 130 -54 168 -311 92 227 -111 -61 44 217 -201 21 -83 120 43 22 -17 -2 -166 -65 53
8155E3j32R8j34J3K21J4j52l12K24J37j4o5K11o5j39K71l52K06l3l00R9o9M7J09
$$ 53 -79 19 -115 -102 119 133 -19 -331 -107 30 16 -49 162 97 -42 229 -123 83 50 -250 -151 -220 -173 -64
8179f4L56l5p5k91R9R5J38J6m35J98L6k24
$$ -64 292 257 182 -109 -10 85 223 239 -196 2 38 -186
8191a86
$$ Imaginary data points
##PAGE= N=2
##DATA TABLE= (X++(I..I)), XYDATA
0@%%%%%%%%%%%%Qj6J6j6J6k4L2l4M2n6O4p2Q8j04J20j36J56j80K08k39K71l06
$$ 0 0 0 0 0 0 0 0 0 0 0 0 0 8 -8 8 -8 8 -16 16 -18 24 -32 32 -40 48 -56 64 -72 84 -96 112 -127 144 -162
34a62L46l92M40m92N50o15O86p63Q47r37J038j149J267j398J542j698J871k062
$$ -162 184 -208 232 -260 290 -325 361 -402 445 -492 546 -603 664 -734 808 -890 981 -1081
52a081K272k506K769l062L393l772M210m724N334o075O999q185R769j2010J5450
$$ -1081 1191 -1315 1454 -1608 1785 -1987 2223 -2501 2833 -3242 3757 -4428 5341 -6669 8781
67H781k1471L5092j26382l926J13761j07267K4108O8497j726k1362P1835J5230
$$ 8781 -12690 22402 -103980 -107906 5855 -101412 -77304 -8807 -10533 -31895 39940 55170
79E5170k8184J5410K8734m2515l69M2000j3267m3949J3009p640m8232j6727K2592
$$ 55170 26986 42396 71130 28615 28246 70246 56979 13030 26039 18399 -29833 -46560 -23968
92b3968j5798l1473J7452L3241k0184k44O2450K5177m0753P46M4306O731k5314
$$ -23968 -39766 -71239 -53787 -20546 -40730 -40974 21476 46653 5900 6646 50952 57683 32369
105C2369m844j0612k5965N258J2731k8689r989K5974j5528k6823L0515K4373k2155
$$ 32369 27525 16913 -9052 -3794 8937 -19752 -29741 -3767 -19295 -46118 -15603 8770 -13385
118a3385j372K3566p714j4745K6224K5203j4764o639J0815j2508j5689O599nj6544
$$ -13385 -14757 8809 1095 -13650 12574 37777 23013 16374 27189 14681 -1008 5591 5586 -10958
132a0958j4433p232J37P785J3634P572m148N536J7754K554o254R135M902j4068
$$ -10958 -25391 -32623 -32486 -24701 -11067 -3495 -7643 -2107 15647 18201 11947 21082 25984 11916
146A1916q922Q046O16j2875p3M832j5917q092J1582k375p538O077j132o264J1534
$$ 11916 2994 11040 11656 -1219 -1292 3540 -12377 -20469 -8887 -11262 -18800 -12723 -13855 -20119 -8585
161h585J4684O23J614Q355m25o385Q367O951j3023r058l40r008n397M131r20m071
$$ -8585 6099 6722 8336 16691 16266 9881 18248 25199 12176 3118 2778 -6230 -11627 -7496 -8416 -12487
177a2487j766K122L587K711N418M569l195o54L361L60K600N236j820o900j968
$$ -12487 -14253 -12131 -8544 -5833 -415 4154 959 305 3666 4026 6626 11862 10042 3142 1174
192A174M475m64p186r03M62r915n68R017L6j056N856P6j411N864N744k981l982
$$ 1174 5649 5185 -2001 -2904 -2442 -12357 -12925 -3908 -3872 -4928 928 1004 -407 5457 11201 8220 4238
209D238J308l779o535N263L822q188j903K613m490L18O936J704m539k349L177
$$ 4238 5546 1767 -4768 495 4317 -3871 -5774 -3161 -7651 -7333 -397 1307 -3232 -5581 -2404
224b404K882O98M388K497l872j78K136j151J231Q63m817o804k383K149j12l906
$$ -2404 478 1176 5564 8061 4189 4011 6147 4996 6227 7090 2273 -4531 -6914 -4765 -4877 -8783
240h783L163J932o139K084R475K491o32J636m76k841J500N117j008n549N41j871
$$ -8783 -5620 -3688 -9827 -7743 1732 4223 3591 5227 4751 1910 3410 8527 7519 1970 2511 640
256F40n132M059L520n968k699J297k711j017M670M777k558k402M464K636j346
$$ 640 -4492 -433 3087 -2881 -5580 -4283 -6994 -8011 -3341 1436 -1122 -3524 940 3576 2230
271B230L987L427m595l486m99l34M52P84k346m986k510L753J365j272L411J410
$$ 2230 6217 9644 5049 1563 1064 730 1182 1966 -380 -5366 -7876 -4123 -2758 -4030 -619 791
287G91n013P04O321J940o81M08L8k645j544M016M14m491l99j935m393J075K952
$$ 791 -4222 -3518 2803 4743 4062 4470 4508 1863 319 4335 4749 258 -141 -2076 -6469 -5394 -2442
304b442p44p71J32j38N86M000N138n57k930K144L06k640K035J983m122l957j253
$$ -2442 -3186 -3957 -3825 -3963 -3377 623 5761 5204 2274 4418 4724 2084 4119 6102 1980 -1977 -3230
321c230J9R6J85J073k107j984K841J461p5M033J289k756R1K640Q81O0L24j024
$$ -3230 -3211 -3115 -2930 -1857 -3964 -5948 -3107 -1646 -1721 2312 3601 845 936 3576 4457 4517 4841 3817
339C817l705k321K370p4l188L54l49l065P30L368J698K39K7P35L42J322L248p66
$$ 3817 112 -2209 161 87 -3101 -2747 -3096 -6161 -5431 -2063 -365 -126 -99 636 978 2300 5548 4782
357D782k415J354j103l442J093J746k827k753m52L79n85O78K846j53j556K732
$$ 4782 2367 3721 2618 -824 269 2015 -812 -3565 -4017 -3638 -4223 -3545 -699 -852 -2408 324
373C24J638l21K403R29j913j241Q6J06j235p74K66k848j774K606k97j509J999
$$ 324 1962 1641 4044 4973 3060 1819 1905 2011 776 2 268 -2580 -4354 -1748 -2045 -3554 -1555
390a555J158j483j17K460K298r23o76J795n01n95J559r57k108M50j715k142M86
$$ -1555 -397 -1880 -1997 463 2761 1838 1162 2957 2456 1861 3420 2463 355 805 -910 -3052 -2566
407b566J044r52j527J042K197p04N84L137k41j141J740J67k50K37l61p20j682
$$ -2566 -1522 -2474 -4001 -2959 -762 -1466 -882 2255 2014 873 2613 2780 2530 2767 2406 1686 4
424Dj060P95p85j058l1j112m94K451J22l93J707R15k75L7J991J499j767j608J206
$$ 4 -1056 -261 -1046 -2104 -2135 -3247 -3741 -1290 -1168 -1561 146 1061 786 823 2814 4313 2546 938 2144
443B144p95j101K38r06j336j96r11k65R36J137r3q01N27K282n01N10K562r92j804
$$ 2144 1349 248 486 -420 -1756 -1952 -2863 -3128 -2192 -1055 -1148 -1949 -1422 860 359 869 3431 2439 635
462F35J238M42p44m21j52j359j762NJ129m14p99L57o77M76J574O09k9R58O67l99
$$ 635 1873 2315 1571 1150 998 -361 -2123 -2118 -989 -1403 -2202 -1845 -2522 -2046 -472 137 108 1066 1733 1334
482A334q82J865J511k174j281P77j652o54J016l24j742n64R3O15M84J916N05j545
$$ 1334 452 2317 3828 1654 373 1150 -502 -1156 -140 -464 -2206 -2770 -2677 -2062 -1578 338 843 -702
500g02Q77J605m94M53J195r25j475j36Q6k90n33O15p04k226K75J690m37J10P54
$$ -702 175 1780 1286 1739 2934 2009 534 398 484 194 -339 276 -428 -2654 -2379 -689 -1126 -1016 -262
519b62r08j54P70J181J076p4N2o5j143J107J194j821q74j97r30j105O22O03j80
$$ -262 -1170 -1324 -554 627 1703 1629 1681 1616 473 1580 2774 953 79 -118 -1048 -2153 -1531 -928 -1108
538a108p16K10L12L66J616J411j107l38P30q03O02Q30o29j346j35j94k91k19J363
$$ -1108 -1824 -1614 -1302 -936 680 2091 984 646 1376 573 1175 2005 1376 30 -105 -299 -590 -809 554
557E54n90k354L92J132j88Q6Q75m2J01J95Q53O04r5L59r83j132N16N15r12j33
$$ 554 -36 -2390 -1998 -866 -1054 -968 -93 -135 -34 161 1014 1618 1523 1882 899 -233 283 798 -114 -247
577b47L43j454p3M46Q12m65n14O51L06q45J301J127q48o8J017o07m27M75Jm26
$$ -247 96 -1358 -1431 -985 -173 -638 -1152 -501 -195 -1040 261 1388 540 472 1489 882 455 930 931 505
597E05q16k22k08n72J357n04j069M38J074p62O38P92N01p31o43J026K45l76j65
$$ 505 -311 -533 -741 -1313 44 -460 -1529 -1091 -17 -779 -141 651 1152 421 -222 804 1049 673 508
616E08q7r03N93R5p50L95L19p77j09K27L30q7k19P90k73n95R45M81o47Q8J90j2
$$ 508 421 -482 111 206 -544 -149 170 -607 -716 -489 -159 -246 -465 325 52 -543 402 883 236 324 514 502
638E02k70p2P5P3o51Q7j47J4M03j09o37M93O82m46l18P17N2m93j12P11n3n27M51
$$ 502 232 160 235 308 -343 -256 -403 -389 14 -95 -732 -239 443 -3 -321 396 448 -45 -157 554 501 -26 425
661D25k34n19K48L58o18K09K14l11K5J71K79k80j95O96m31k08O62k51m57o6M27
$$ 425 191 -328 -80 278 -340 -131 83 -228 -203 -32 247 -33 -228 468 37 -171 491 240 -217 -283 144
682A44K27k54j8j16K77o91M03J4J32K79n18m24N69N8L26m68K21L59p79j44Q43
$$ 144 371 117 99 -17 260 -431 -28 -14 118 397 -121 -545 24 82 408 -60 161 520 -259 -403 440
703D40n2n83L79j6o19J1M73Q0q3l48M01L4r6P91m88l32L02n44k20N67J48o80p
$$ 440 388 -195 184 168 -451 -440 33 113 30 -318 83 117 21 812 324 -8 294 -250 -470 97 245 -435 -442
726d42K15J90j30J32O64l61p73N92K04K23Q6m48J22m45J6M55k05Q8Q9p97k11Q20
$$ -442 -227 -37 -167 -35 629 268 -505 87 291 514 600 152 274 -171 -155 300 95 183 272 -525 -736 84
748H4p7r5M00m75n41M55N56J43l79J28M4n74l4Q45j94l11q0n51J61M00mnj13K38
$$ 84 7 -88 312 -163 -704 -249 307 450 71 199 243 -331 -365 480 286 -25 -105 -656 -495 -95 -99 -104 -217 21
772B1l0p16O51Q67o43k83M26n1M58l22J6k33m12j70M60m80O0O8l4m08O82K69j38
$$ 21 -9 -725 -74 793 150 -133 293 242 700 378 394 161 -251 -421 39 -441 -381 -313 -347 -755 -73 196 58
795E8M87q3l94Q8O02l75k38K62j75p72j91P27K1j30k20q5Q9J39j50J25K51q1n
$$ 58 545 462 68 156 758 383 145 407 232 -540 -731 -4 17 -113 -333 -418 -329 -190 -340 -215 36 -45 -50
818e0k79M69N98j50l02k9k40J83l82K27Lo61J78k9J27Q2L01J06k9j35K62k3J60
$$ -50 -329 140 738 588 286 257 17 200 -182 45 48 -613 -435 -464 -337 -255 46 152 123 -12 250 227 387
841C87j34L31l39j07p2j51L10k1p67k05O82j55J6n2n9J10M3L35J08J50j78K62
$$ 387 253 584 245 138 66 -85 225 204 -563 -768 -86 -241 -225 -277 -336 -226 -183 152 260 410 232 494
863D94o04N37J95m95k07J56n89J24K31k37Q8k02L19Q5l1M1L68j83n4q7L94k3j43
$$ 494 -110 427 622 127 -80 76 -513 -389 -158 -395 -307 -509 -190 -105 -136 -95 273 90 36 -51 343 320 177
886A77J7j16p1K64j56n28K16J1N8l98L54n2l47N12K23k37o9K64L8r2K02j23N5
$$ 177 194 78 7 271 115 -413 -197 -186 -128 -526 -172 -224 -571 -59 164 -73 -142 122 160 68 270 147 202
909B02J13j32m54n0P7J07K8k15J06%j72L94Q2k46K38J54l45J37k10Q71m97l38
$$ 202 315 183 -271 -321 -244 -137 -109 -324 -218 -218 -390 4 86 -160 78 232 -113 24 -186 685 188 -150
931a50K86m9k14L7R3RjM9k26K29m02J55N1l2O56l48l93N09P9k35j56K46j11K39
$$ -150 136 87 -127 -90 3 12 11 60 -166 63 -339 -184 -133 -165 491 143 -250 259 338 103 -53 193 82 321
955C21k7k37l48K67K4j46J44Ol98L37N8J17m24N38J64m46p1J9L46R0j97j03J13
$$ 321 294 57 -291 -24 0 -146 -2 4 -394 -57 1 118 -306 232 396 -50 -121 -102 244 334 137 34 147
978A47k42NK5J71n6k45r7K99k23K71l04P5M43l90K38N8l9Oj2p6P1mm7r8l50J46
$$ 147 -95 -90 -65 106 50 -195 -292 7 -216 55 -249 -174 269 -121 117 175 136 142 130 54 125 121 74 -24 -374 -228
1004b28J41o7j34K71j73J21k8O5j50L51J46l76j2J72K23n1j10K6p1j56n6K15m00
$$ -228 -87 -154 -288 -17 -190 -69 -97 -32 -182 169 315 -61 -73 99 322 271 161 187 116 -40 -96 119 -281
1027b81K14j75K49p1O8j23L36l39M35l74J71K13J21l94j93L78l96J11j72K82m80
$$ -281 -67 -242 7 -64 4 -119 217 -122 313 -61 110 323 444 50 -143 235 -161 -50 -222 60 -420
1048d20M36P6k15o7K26j77%J41Jk2K03r9j2j63J23J48l60l0J72j59oj71K91K27
$$ -420 16 92 -123 -190 36 -141 -141 0 1 -21 182 83 71 -92 31 179 -181 -211 -39 -198 -204 -375 -84 143
1072A43l91K71J76l35M7K61j93l6%J28l0j57R2j60K05J12k8j54R7n6j04N2L15
$$ 143 -248 23 199 -136 -89 172 -21 -57 -57 71 41 -116 -24 -184 21 133 105 -49 48 -8 -112 -60 255
1095B55l28k47J96K8J95l75L16p3q3pK05k4j60Q3Q9Kk47L0j60K91j19J08q3L5
$$ 255 -73 -320 -124 -96 99 -276 40 -33 -116 -123 82 58 -102 -19 70 72 -175 -145 -305 -14 -133 -25 -108 -73
1119g3p0J29PN4j89J38r6j8PJ38k69P3K51j71Q2l24L99L43k90r1p6p6J20N8q3
$$ -73 -143 -14 -7 47 -142 -4 -100 -118 -111 27 -242 -169 82 -89 -7 -331 68 411 121 30 -46 -122 -2 56 -27
1144b7j67J3K36N8m83K32J99j82Q1Q0l0O8O5L7q6R2j09Pj99K36j63q9mJ13j07
$$ -27 -194 -181 55 113 -370 -138 61 -121 -40 40 10 78 143 180 94 186 77 84 -115 121 -42 -131 -135 -22 -129
1169a29J00q7j89M21j39J71m4R2j11Pj09J3J62l73K90J01j24l29L75m1j57j83
$$ -129 -29 -116 -305 116 -23 148 104 196 85 92 -17 -4 158 -215 75 176 52 -277 98 57 -100 -283
1191b83K43J99k09K15j58J34k65K18n2N4o1j04m6J8O9M25k50l00K5l6J07J45k26
$$ -283 -40 159 -50 165 7 141 -124 94 42 96 35 -69 -115 -97 -28 397 147 -153 -128 -164 -57 88 -138
1214a38J5o4K62j19n2J3K73j13n1j07J14J93l85J57j14j1L6k3J55J32p3Q6j72
$$ -138 -123 -187 75 -44 -96 -83 190 77 26 -81 33 226 -159 -2 -116 -127 -91 -114 41 173 100 186 14
1237A4j07n8L10j67J1Q1k14J47J20j28L2o3j33n0J33K73k17j11q8LK05K8j32M24
$$ 14 -93 -151 159 -8 3 84 -130 17 137 9 41 -22 -155 -205 -72 201 -16 -127 -215 -212 -7 21 -111 313
1261C13q3j88K50m1l36L5j1Q3j87J78k25K55N2n8J10k80q0J96K51j24j37j52J4
$$ 313 230 42 292 251 -85 -50 -61 22 -165 13 -212 43 95 37 147 -133 -213 -17 234 110 -27 -179 -165
1284a65K32L9j81J99m2J80l42K17j70J64j38j45R3l8J79o51R00n77l5J09LK52
$$ -165 67 106 -75 124 82 262 -80 137 -33 131 -7 -152 -59 -97 82 -569 331 -246 -281 -172 -169 83
1306H3J57k29J2j40Q9k1K24K9l64K59j61Kk63L94m5J20m28M47l11J00J45k15J1
$$ 83 240 11 23 -117 -28 -49 175 204 -160 99 -62 -60 -323 71 26 146 -282 165 -146 -46 99 -116 -105
1329a05K53j24m8J04J25l14K72l09K04Q0m70L22K21o7p7k17m9K97j40r0J78K1
$$ -105 148 24 -24 80 205 -109 163 -146 58 138 -332 -10 211 144 67 -150 -199 98 -42 -132 46 67
1351F7p5k03L10k82K19K84m97L21j33L9k31K60j79n5L80j83M8j61K7j73J50K23
$$ 67 -8 -211 99 -183 36 320 -177 144 11 50 -181 79 -100 -155 225 42 90 -71 -44 -217 -67 156
1373A56k9j96Q3K40j25j64M2O9l33O5l1L49q8J48l68J93J40l04J59j11J71j11
$$ 156 127 -69 14 254 129 -35 7 76 -257 -192 -223 126 38 186 -182 11 151 -153 6 -105 66 -45
1395d5J28L2j3j3jk26K06p7k8N2k55K03P3k0Nj04q4n3K98l47K09J97j49M5P4l25
$$ -45 83 115 102 89 88 -138 68 -9 -37 15 -240 -37 36 16 21 -83 -167 -220 78 -269 -60 137 -12 33 107 -218
1421b18K09R1P8m05J20J02J34j20mJ73l21J25o1L47k18R8j36K42j76k42J44l4
$$ -218 -9 82 160 -245 -125 -23 111 -9 -13 160 -161 -36 -97 250 32 130 -6 236 60 -182 -38 -72
1443g2R3J70k32L6J30m90L92k34L23k53Q6L0K3J15k20J23l6LR3J54k41O1m3l2
$$ -72 21 191 -41 -5 125 -365 27 -207 116 -137 -51 -21 2 117 -103 20 -16 -13 80 234 -7 54 11 -21
1467b1J25rQ6k86K91rM3Q3o04J03K85k76Q3J10n0O6m6J89k89J5J42P4k0J51k19
$$ -21 104 95 181 -105 186 177 220 303 -301 -198 87 -189 -106 4 -46 20 -26 163 -126 -111 31 105 85 236 17
1492A7j24QJ99n2Q2K41l08j29p8J06j14k7J3J24Q9jnL8l8j65K86n5k4j8r8K68
$$ 17 -107 -99 100 48 130 371 63 -66 -144 -38 -152 -179 -166 -42 47 46 41 79 41 -124 162 107 83 65 -33 235
1518B35k42J10p9k13J58Q4J70l05Q1j25K85j71K40m68m6J30K90J9k39K49k54M2
$$ 235 -7 103 24 -189 -31 53 223 -82 -1 -126 159 -12 228 -240 -286 -156 134 153 -86 163 -91 -49
1540d9M8K87l90J72K30m67L19l89%K62j13J27J30k86p6R0O1J36J53k41l11J72
$$ -49 -1 286 -104 68 298 -169 150 -239 -239 23 -90 37 167 -119 -195 -105 -44 92 245 4 -307 -135
1562a35J04N6nj5J70l30K58k58J87k31J70l25M02j02K36J23k24J17j80P1j90N3
$$ -135 -31 25 20 5 175 -155 103 -155 32 -199 -29 -354 48 -54 182 305 81 198 18 89 -101 -48
1584d8J38j33oj10rL43j18J4J68l66J26p3j64K02J6m2l4j03P5J97l56L87j37J44
$$ -48 90 -43 -49 -159 -168 175 57 71 239 -127 -1 -74 -238 -36 -20 -62 -96 -199 -124 73 -283 104 -33 111
1608A11l50K27k41K06r1J95r6J25j09K7J16m0o3K1ok68N99n26L38k10K51k45j49
$$ 111 -239 -12 -253 -47 -138 57 -39 86 -23 4 120 80 17 38 32 -236 363 -163 175 -35 216 -29 -178
1631a78L01j06j77j11J87J25j00Q8k49J63J01j79K59l8j26R7Mj60m7L54j58k9
$$ -178 123 17 -160 -271 -84 41 -59 29 -220 -57 44 -135 124 86 -40 57 61 -99 -146 208 50 21
1653B1K5k10K12O0Q6m51K49j5p9l2k56N64k74L92j31J18j19k25K84n3j34k91L12
$$ 21 46 -164 48 108 194 -257 -8 -23 -102 -134 -390 174 -100 292 161 279 160 -65 219 166 32 -259 53
1676E3J61N8M3j45l59m6K92J78Q1j91m7r3Q1J16k72L3K9L00j68J8n18K01L1J02
$$ 53 214 272 315 170 -189 -235 57 235 316 125 78 -15 66 182 -90 -57 -28 272 104 122 -396 -195 -164 -62
1700f2J84J84j72q9Nq0l55K52J96m2k76O84m17j79K35k92L92O8l51Q1O4p5k18
$$ -62 122 306 134 45 50 -30 -385 -133 63 21 -255 429 12 -167 68 -224 168 236 -115 -34 30 -45 -263
1723b63J54K59J4k80J18j97K86n6n1j74M0l3QJ86p1J35q3O1J44l25l8K95j72J51
$$ -263 -109 150 164 -116 2 -195 91 35 -16 -190 -150 -183 -175 11 -60 75 -8 53 197 -128 -166 129 -43 108
1747A08k13P9l6lJ86j52P4p6P4k34L11j04l24K40J28j27lO1j34L23m06K1K3L52
$$ 108 -105 -26 -62 -65 121 -31 43 -33 41 -193 118 14 -310 -70 58 -69 -72 -11 -145 178 -228 -207 -184 168
1771A68m41L11q2j8R4K5J60j68J90j14k46O4M6j04J51j81m5K14k26J88L1j32J83
$$ 168 -273 38 -44 -62 32 57 217 49 239 125 -121 -57 -11 -115 36 -145 -190 24 -202 -14 17 -115 68
1794F8o3J78m64J59K16m7l02M2K95L4Mr6j08Q9J86l20j1K04k11J83k65L08K1r4
$$ 68 5 183 -281 -122 94 47 -255 -213 82 116 120 24 -84 5 191 -129 -140 64 -147 36 -229 79 100 6
1818FK42k54M0k4J52j70n7j4J11l47M11k32o6j06J42L2O3J88j10P2k54J99J47
$$ 6 248 -6 34 10 162 -8 -65 -79 32 -315 96 -136 -202 -308 -166 -134 -71 117 7 79 -175 24 171
1841A71k91J06LJ20P7m14L54m7k52L15q5J15n5k83K07N7q3L14m22%J09q0J49k5
$$ 171 -120 -14 -11 109 186 -228 126 79 -173 142 57 172 117 -166 41 98 15 329 -93 -93 16 -64 85 60
1865F0rJ25k92K44o6l7J11K62l36j23J02j19n3K31L4jL9l29J53l2n0J15J1n3l03
$$ 60 51 176 -116 128 62 25 136 398 62 -61 41 -78 -131 100 134 133 172 -157 -4 -36 -86 29 40 -13 -316
1890c16L35J36j81k48L02l2N4r8Q1J7J13k33J75j99P6N9j64J77j20J98l70J46
$$ -316 19 155 -26 -274 28 -4 50 -48 33 50 163 -70 105 -94 -18 41 -123 54 -66 132 -238 -92
1912i2J49m8l6J19K1j71j1qL40j39j21j74K71j18k29K73N1o1k0k48K89j95L39
$$ -92 57 9 -27 92 113 -58 -69 -77 263 124 3 -171 100 -18 -247 26 77 16 -4 -252 37 -158 181
1935A81k25J25l30L96j17J84p8j01k09p7J47n4K37q1j48K19O1m85M64l61J87R
$$ 181 -44 81 -249 147 30 214 136 35 -174 -251 -104 -158 79 -2 -150 69 130 -355 109 -252 -65 -56
1957e6j03J35j33J49Q1q7P5M2Q4K6l98J47j80K98k18J17j98J11J0J18J52l38N1
$$ -56 -159 -24 -157 -8 73 -14 61 103 187 213 -185 -38 -218 80 -138 -21 -219 -108 -98 20 172 -166 -115
1980a15L24k94N2N6R6j75J1k67M53q3Q4k40J52n2n4m8L25l10L04k91M3K13l99
$$ -115 209 -85 -33 23 119 -56 -45 -312 141 58 142 -98 54 2 -52 -100 225 -85 219 -72 -29 184 -215
2003b15L71k53K16m0j94L00j28j23J74k68r6K2Q8J64j28K83k26op6J92j68K22
$$ -215 156 -97 119 79 -115 185 57 -66 108 -160 -256 -234 -146 18 -110 173 -53 -59 -135 57 -111 111
2025A11k03o1K2j38M43L7j88j13Q3km4J2J0N9m2kj13J81K1k27J28M2j05J70j39
$$ 111 -92 -153 -131 -269 174 211 23 -90 -7 -9 -53 -41 -31 28 -14 -16 -129 52 73 -154 -26 16 -89 81 -58
2050e8p8K14j58K81j68j26J47m5j4p3K89k15j9m8J33j39L73l38M6M8q9K02j07
$$ -58 -136 78 -80 201 33 -93 54 9 -5 -78 211 -4 -23 -71 62 -77 296 -42 4 52 -37 165 58
2073E8m3j66J30K14k51pK3l4K50k42k14M38Q4k88J70j3J2k46Q4j2N0K33j48L7
$$ 58 15 -151 -21 193 -58 -65 -42 -76 174 -68 -282 156 240 -48 122 109 121 -125 -41 -53 -3 230 82 119
2097A19j52R9l45M99j7k6Q8k15K2j12k07M78j05k23J47J52k99J88Nj46L2K64k92
$$ 119 -33 66 -279 220 203 177 265 50 72 -40 -247 231 126 -97 50 202 -97 91 96 -50 -18 246 -46
2120d6j49Q9K17j74p3R6o4J5J21p3q5lK81J14k26K5q2rk4k19K74o4k7k82J88J00
$$ -46 -195 -106 111 -63 -136 -40 -104 -89 32 -41 -126 -129 152 266 40 65 -17 -26 -50 -269 5 -59 -86 -368 -180 -80
2146h0O8m2N7K02j64o6j52O1M19m98P1QQ1J11K4j03k58L61m04O47n37J46J67k46
$$ -80 -12 -54 3 205 41 -25 -177 -116 303 -195 -124 -116 -35 76 100 -3 -261 100 -304 343 -194 -48 119 -127
2170a27L68j96m0j8m6J70j50N2n1r4j24K25K13l8R6l33l9J35K4q6j41J66k6K2
$$ -127 241 45 5 -13 -59 111 -39 13 -38 -132 -256 -31 182 144 240 -93 -132 3 27 -59 -200 -34 -60 -38
2194c8q9k3K4K17j02mJ17Q7j19l21J61m3k0J41p6L9j33J77KN5J89n01l0K58k59
$$ -38 -127 -150 -126 91 -11 -15 102 189 70 -251 -90 -133 -153 -12 -88 -49 -182 -5 -3 52 241 -260 -290 -32 -291
2219b91N80m18j5J82Q7J25m23r1QL99j24J02k52m9K43J51l58J5k08M25k53K10
$$ -291 289 -129 -144 38 125 250 -173 -264 -256 143 19 121 -131 -180 63 214 -144 -129 -337 88 -165 45
2241D5p0J55R1q0k41o0J25K49k73K89l87L02l28J36J63l28J77j0J92j18n1J97
$$ 45 -25 130 221 141 -100 -160 -35 214 -59 230 -157 145 -183 -47 116 -212 -35 -45 147 29 -22 175
2263A75l9k35j47M01j50NJ58%k0j75J30J02j23J24k50N3Q3K9J66k68o0J90M6k04
$$ 175 136 -99 -246 155 5 10 168 168 148 -27 103 205 82 206 -44 9 92 121 287 19 -41 149 195 -9
2287iO7J61m82N16j78l82K60Q1K16l49Q2J18K9j50j40j3M5o4L6R4J31o7l0R8O8
$$ -9 58 219 -263 253 75 -307 -47 34 250 -99 -17 101 130 -20 -160 -173 -128 -192 -156 -62 69 2 -28 70 138
2312A38l2m5k0r9K24R1l36J89Q7l00J05m9J74j47n6J85k05Q7j33L7K87j39k16
$$ 138 106 61 41 -58 166 257 -79 110 197 -103 2 -47 127 -20 -76 109 -96 -9 -142 -105 182 43 -173
2335a73J63N3J45k62J96j96L50m14J12o5J3M3j55K61p0j73L82J78n62J48oK34
$$ -173 -10 43 188 -74 122 -74 276 -138 -26 -91 -78 -35 -190 71 1 -172 210 388 -174 -26 -32 202
2357B02j46LQ6j50k16K23j04K46l69K48j89L35o6k27J57l7j35k6J61j86r8K36
$$ 202 56 59 145 -5 -221 2 -102 144 -225 23 -166 169 103 -124 33 -4 -139 -165 -4 -190 -288 -52
2379e2P6j6j15N1J05J26Q5r1M4j99O1n8K07L6m07LO5M8J32J77n04M27l03n0L28
$$ -52 24 8 -107 -56 49 175 260 169 213 14 75 17 224 260 -147 -144 -79 -31 101 278 -226 201 -102 -152 176
2404A76k5l03K02r1J07k16J49J51l02K13j34q2K78J40m27K0N8M4J11j34j60K97
$$ 176 151 -152 50 -41 66 -150 -1 150 -152 61 -73 -155 123 263 -164 -144 -86 -42 69 -65 -225 72
2426G2m11L42j54m1L93r6p5P7k51j3J65p4q2J05J15p8J40p1j65L23m49K70m3j06
$$ 72 -339 3 -151 -192 201 105 30 107 -144 -157 8 -66 -148 -43 72 -6 134 63 -102 221 -228 42 -1 -107
2450a07J56k8K94m30O5R7k43L34k04m0J24k22K27J61k9j13l98M12j32K08k02o4
$$ -107 49 21 315 -115 -50 47 -196 138 -66 -106 18 -204 23 184 155 42 -356 56 -76 132 -70 -134
2472a34L11k26k19N51j41l81J31j17J56K3J5L3J67k88J90j04J23l43L85J0k92
$$ -134 177 -49 -268 283 142 -239 -108 -225 -69 -46 -31 2 169 -119 71 -33 90 -253 132 142 -150
2493a50J35K1M0k0J50j61J31k77R0K8K39m27J00l9J95j10r6J44j04J8k9J17O7
$$ -150 -15 6 46 26 176 15 146 -131 -41 -13 226 -201 -101 -140 55 -55 -151 -7 -111 -93 -122 -5 62
2516F2l16K26J68k48J16K18k35K2J46J09l94j35KL30L9m4m9L9k20J10J99l7r9
$$ 62 -254 -28 140 -108 8 226 -9 13 159 268 -126 -261 -259 71 110 66 17 56 -164 -54 145 108 9
2539Il7J05j24R2l51L31PR6l48K15J1k57L88m8j24Pk7J89r0j78k0J8M5PQ7j00
$$ 9 -28 77 -47 45 -306 25 32 128 -220 -5 6 -251 137 89 -35 -28 -55 134 44 -134 -154 -136 -91 -84 3 -97
2565i7Q5q0l2K28J95j37j89P3P2o8l79N04k73j61M12k94P9j01K06O1k09R2J25
$$ -97 -12 -92 -124 104 299 162 -27 46 118 50 -329 175 -98 -259 153 -141 -62 -163 43 104 -105 -13 112
2588A12j24j29ql4J09JJ74j73J12m5j49j87K4L43o7L85k85r7j67K85l81L62l76
$$ 112 -12 -141 -149 -183 -74 -73 101 -72 40 -5 -154 -341 -317 26 -41 344 59 -38 -205 80 -301 61 -315
2611c15K30N5Q6j79N41m63K5L3l17L09j37K46L4j12j7R0k58J90j24K44l04J08
$$ -315 -85 -30 56 -123 418 -45 -20 13 -304 5 -132 114 148 36 19 109 -149 41 -83 161 -143 -35
2633c5N5J5O5l2k01L40m4k74J59j18J22j55K33K9k64M7J23j30N8k0Q4N5j32Q0
$$ -35 20 35 100 68 -133 207 163 -111 48 -70 52 -103 130 159 -105 -58 65 -65 -7 -27 57 112 -20 60
2657F0o8j99J69M7p4j04J95q7p0J92j3j19K15j93J08l08M07q7j16j39L37k94n0
$$ 60 -8 -207 -38 9 -65 -169 26 -61 -131 61 48 -71 144 -49 59 -249 158 71 -45 -184 153 -141 -191
2680a91K15l8R4n9j94K29n1J14j07l0n9L46l08L1j33M7M9j71M03J29l24m1j69
$$ -191 24 -14 80 21 -173 56 5 119 12 -18 -77 269 -39 -8 -141 -94 -45 -216 187 316 -8 -49 -218
2703b18k7J91L5j29J67r6K5M3l67K63L8pK35j11L3k22L33l42J59j8P0m8J05j0
$$ -218 -245 -54 -19 -148 19 -77 -52 -9 -376 -113 -75 -82 153 42 75 -147 186 -156 3 -15 55 7 112 102
2727A02oj85K20j37J49k71R8j35O9J39jK88k07O6j31J7j89J68pj65K4J66l79L60
$$ 102 96 -89 131 -6 143 -128 -30 -165 -96 43 42 330 123 189 58 75 -114 54 47 -118 -94 72 -307 53
2751E3k61N22l30j32K06k55N7JJ91P8J42Rj34k23K32j27j0J81k9l07L14lm20K35
$$ 53 -208 314 -16 -148 58 -197 -140 -139 52 130 272 281 147 -76 156 29 19 200 171 -136 178 175 -245 -10
2775a0K02o62L54M3J8j5r3O3J26P0M6J89k72J47j41o9n0K52k17j34L64J86m64
$$ -10 192 -470 -116 -73 -55 -70 -163 -100 26 96 142 331 59 206 65 -4 -54 198 -19 -153 211 397 -67
2798f7j8k6J74l9J14K11m51J84j95K85j95J36m11M19j50m1K47J68l41R7k01j77
$$ -67 -85 -111 63 24 138 349 -102 82 -113 172 -23 113 -298 121 -29 -70 177 345 4 101 -100 -277
2820b77K8J44q1j18L43K1m97L61L74l26J57j64K30P5j5k05j30P1pJ46L1Rk3r8
$$ -277 -249 -105 -186 -304 39 60 -437 -76 298 -28 129 -35 195 270 255 50 -80 -9 -16 130 161 170 147 49
2844D9j50N39m29M4n5MJ59j30o1j43K90j46k5L17l20J63l27L11k82J35K55j2q9
$$ 49 -101 438 9 53 -2 2 161 31 -30 -173 117 -29 -54 263 -57 106 -221 90 -192 -57 198 186 97
2867I7l14K27R6l8N4j86K29k36O3J05p4K5K4k10J20k89J34N2j5q5O2l0K74j89
$$ 97 -217 10 106 68 122 -64 165 -71 -8 97 23 48 72 -138 -18 -307 -173 -121 -136 -221 -159 -189 85 -104
2891a04J38o5j04K21k18J90p6J5pk7J85p5K24k19l5l28M61k4k63P4k13J61P0K08
$$ -104 34 -31 -135 86 -132 58 -18 -3 -10 -37 148 73 297 78 43 -285 176 152 -111 -37 -250 -89 -19 189
2915A89k61L2J03K5j66J68j21J2m2J62Q3k77M1q3M13j76p9j81L68P2j52j03p6
$$ 189 -72 -40 63 88 -78 90 -31 -19 -61 101 184 -93 -52 -135 278 102 23 -158 210 282 130 27 -49
2938d9k2J63j70k33N27k74R8k16l6K16M5j91n9K13n9L6j20K90R9p7k81p4L09J59
$$ -49 -71 92 -78 -311 216 -58 40 -176 -212 4 49 -142 -201 12 -47 -11 -131 159 258 181 -100 -174 135 294
2962B94j31k42J4O1j36K11m0j33r5P0k8K65K1n22L85j5k3J13J18l13rK75L19k91
$$ 294 163 -79 -65 -4 -140 71 31 -102 -197 -127 -155 110 131 -391 -6 -21 -44 69 187 -126 -135 140 459 168
2986A68j51k13J47J21%j00o0J58o8k4j15O3l6J66j68K76k12k20L93k56J49J39
$$ 168 17 -196 -49 72 72 -28 -88 70 2 -22 -137 -74 -110 56 -112 164 -48 -268 125 -131 18 157
3008A57n1p6k47L6K97m80L89Q5k36K93l10K62l49J58K06J02k75Q5j02j5J88R0
$$ 157 106 30 -217 -181 116 -364 25 110 -126 167 -143 119 -230 -72 134 236 -39 46 -56 -71 117 207
3030B07j23j0Q8k06j6j19J30K29O8q5m56L96k29J46k06J23j52J70L2q7K68k89
$$ 207 84 74 162 -44 -60 -179 -49 180 248 163 -293 103 -126 20 -186 -63 -215 -45 -13 -100 168 -121
3052a21J91k84K54J04l76n2K13J95k68p6R5L26m61K17J51j53n3J07J79j14j39
$$ -121 70 -214 40 144 -232 -284 -71 124 -144 -220 -125 201 -260 -43 108 -45 -98 9 188 74 -65
3073f5M03k82j50MK67l14J5Q9N0Q5k45K15L07k17k05o3J16J53n23M60j15m4J08
$$ -65 338 56 -94 -90 177 -137 -122 -33 17 102 -143 72 379 162 -43 -106 10 163 -360 100 -15 -59 49
3096D9L5j61J19J13n78M96k73K12r6K88k17R2l5k41K86k75K89L5n8Q9k95K02m5
$$ 49 84 -77 42 155 -423 73 -200 12 -84 204 -13 79 44 -197 89 -186 103 138 80 169 -126 76 31
3119C1j41P5k14J45Q2J57o7J35p2m9j31J99k09J88R6k38R9ol7R7j68J98l06P4
$$ 31 -110 -35 -249 -104 -22 135 68 203 131 82 -49 150 -59 129 225 -13 86 80 43 140 -28 170 -136 -62
3143f2j27K92L1l43J40m6j61N96m05J06l1j34J15J61j95J30k02Q7L22m81L83j81
$$ -62 -189 103 134 -209 -69 -115 -276 320 -85 21 -10 -144 -29 132 -63 67 -135 -48 274 -207 176 -5
3165ej21k3J24LK19n7JOj13l3J6Jp9P7j32K6K56O9j7j83o2k6j20J4L74k58m5K77
$$ -5 -126 -149 -25 -22 197 140 141 147 34 1 17 18 -61 16 -116 -90 166 235 218 35 -27 -53 -173 -159 215 -43 -88 189
3193A89j77L0j7J8n7MJ33j48p0k6J6NJ08K14k13J68M0M4k40J13q7N8J18l33L48
$$ 189 12 42 25 43 -14 -10 123 -25 -95 -121 -105 -100 8 222 9 177 217 261 21 134 47 105 223 -110 238
3218B38j25j38K3k34K95j65j02r9L55on7k4k21L06J22l63L85m99L39J26j62J20
$$ 238 113 -25 -2 -236 59 -106 -208 -307 48 42 -15 -39 -260 46 168 -195 190 -309 30 156 -6 114
3240A14o8q9rJ36k13J40L10k20q9m19K00n2K09pK37k33K71j56j28L15j50k15J17
$$ 114 46 -43 -52 84 -129 11 321 101 12 -407 -207 -259 -50 -57 180 -53 218 62 -66 249 99 -116 1
3263ArJ02j79J57n4n1K62k59j42K92j59j4K8QK87l94M4M2K72l22l7J0m5J07J67
$$ 1 -8 94 -85 72 18 -33 229 -30 -172 120 -39 -53 -25 -17 270 -124 -80 -38 234 -88 -125 -115 -160 -53 114
3288A14k90Q3Q3P4r8J32o5m9J9Q9j79J35J3ll8K35j76k19L03k79j1J0K48O5m03
$$ 114 -176 -93 -10 64 -34 98 33 -16 3 92 -87 48 61 58 20 255 79 -140 163 -116 -127 -117 131 196 -207
3313b07R3J08j26J53o2l5J74K7r4j76M5J36j92J72R8l50M17k83j3K21k54L07P3
$$ -207 -114 -6 -132 21 -41 -76 98 125 31 -145 -100 36 -156 16 114 -236 181 -102 -115 106 -148 159 232
3336B32j76O2J0m3q6q5M6J57j98L5J64j78k20K71K21q1j98K2j04L04l52n6N34
$$ 232 56 118 128 85 -1 -86 -40 117 -81 -46 118 -60 -280 -9 212 131 -67 -45 -149 155 -197 -253 281
3359B81l95L7j02L48j86J27r9j0oj5L0k95M42k36J25J10l79M09j01j42K89p2j43
$$ 281 -114 -77 -179 169 -17 110 11 1 -5 -20 10 -285 157 -79 46 156 -223 186 85 -57 232 160 17
3382A7J48l41p6K51J98k8Q9m60M90r4j54K41l25m24J52J23K51n2O1Q2j94NjJ50
$$ 17 165 -176 -252 -1 197 169 258 -202 288 194 40 281 -44 -468 -316 -193 58 6 67 149 -45 -40 -41 109
3406A09L3j60J0J6o1J40r8kR2l42M01J12l74J32O6k07L30j68k75K90O7l3pp5L55
$$ 109 142 -18 -8 8 -53 87 -11 -13 79 -263 138 250 -124 8 74 -133 197 29 -246 44 111 78 71 -4 351
3431C51m45R5k00J61j65L50k64M6L89k57j55P7O5j77P5k09M18j4j27n9N7j49m
$$ 351 -94 1 -199 -38 -203 147 -117 -71 318 61 -94 -17 48 -129 -54 -263 155 141 14 -45 12 -137 -141
3454a41M9K04r5L4k19J42O1K0j94N4L00O2q07L37L22k98M81j38p3l30Q2L13J4
$$ -141 -92 112 17 51 -168 -26 35 55 -139 -85 215 277 -530 -193 129 -169 312 174 101 -229 -147 166 180
3477A80J3j34j17r6J17k1j07K28o4L7J61j76K2J72j48j00O6m8J0Q7J3j06J69j73
$$ 180 193 59 -58 -154 -37 -58 -165 63 -1 36 197 21 43 215 67 -33 33 -15 -5 82 95 -11 158 -15
3501a5Q1j23M1k67K94m7J47j78J6J82j41rj89o4J58K41j4J46p13M56o6j04J98
$$ -15 66 -57 -16 -283 11 -36 111 -67 -51 131 -10 -19 -208 -272 -114 127 113 259 -454 2 -64 -168 30
3524C0M0j53j76J62K18j24k9j46M5J63j08J89Q2k70P3K32k88j88N24k40J49N2
$$ 30 70 -83 -259 -97 121 -3 -32 -178 -133 30 -78 111 193 -77 -4 228 -60 -248 276 36 185 237
3546B37j34j36j2O0M8MO6k28J61o4l6j41J89M9j06J06Mj21O6J95r2K41l66R8j8
$$ 237 103 -33 -45 15 63 67 133 -95 66 2 -34 -175 14 63 -43 63 67 -54 12 207 115 356 -10 88 70
3571G0j11K61j03j4k20K53nk56L54k57M6K61l27n4K21k39J67k50j47N34k25J98
$$ 70 -41 220 117 103 -117 136 131 -125 229 -28 18 279 -48 -102 119 -120 47 -203 -350 184 -41 157
3593A57k52k04J47K24j38n3K03l87M11j33J52j66P1J9J7O2k06k23L37K5k15j10
$$ 157 -95 -299 -152 72 -66 -119 84 -303 108 -25 127 -39 32 51 68 130 -76 -299 38 63 -152 -262
3615b62N9j8M08r0l7j2k04o1L26j56Kj66K76J12k16N4LJ67r5J81k55J38l56K73
$$ -262 -203 -221 187 97 60 48 -156 -217 109 -47 -45 -211 65 177 -39 15 18 185 90 271 16 154 -202 71
3639G1k54K68k87P1k2NK7M7q2K17J09l00m1O7L32j32j55J06p2l3q1L08j35J5P1
$$ 71 -183 85 -202 -131 -153 -148 -121 -74 -156 61 170 -130 -171 -104 228 96 -59 47 -25 -58 -139 169 34 49 120
3664A20K8l37J27j49K38j79K71k92K28j42M9K21j35j33N6jj35K07k32J02j2K28
$$ 120 148 -189 -62 -211 27 -152 119 -173 55 -87 -38 183 48 -85 -29 -30 -165 42 -190 -88 -100 128
3686A28k55J17K42r2j75k02L41j48l2J87l85J85K39k99R8N2j9o0L19l81Kr7L37
$$ 128 -127 -10 232 140 -35 -237 104 -44 -76 111 -274 -89 150 -149 -51 1 -18 -78 241 -140 -138 -235 102
3709A02j24Q5j80j7K65l30K38p8Q7j53J62k31K91j25l9J81j93J30J7m6K2j11n6
$$ 102 -22 63 -117 -134 131 -199 39 -39 48 -105 57 -174 117 -8 -47 134 -59 71 88 42 64 -47 -103
3732a03J10p2j5J32P2l73K25M3k25M92n06J34P8r1N5l2M0L8J07M9l02J12j79M65
$$ -103 7 -65 -80 52 124 -249 -24 19 -206 286 -220 -86 -8 -99 -44 -76 -36 2 109 158 -144 -32 -211 254
3756B54j08K5j16K19k18k06R8%j0j62K18O8J1J69n17K16P4j00J59r7K2j80R5J9
$$ 254 146 171 55 274 56 -150 -52 -52 -62 -224 -6 62 73 242 -275 -59 15 -85 74 -23 -1 -181 -86 -67
3780f7j9Q3K66l14K00k28j12L02L0j81n1mj4r8Q1L23k18J25k32J60P2l12K52p5
$$ -67 -86 -3 263 -51 149 -79 -191 111 141 -40 -91 -95 -109 -207 -126 197 -21 104 -128 32 104 -208 44 -31
3804c1J84j68j35j31K52Q2qJ95k26k00J99J81k4j1k90J96j75J30j43j29M30j62
$$ -31 153 -15 -150 -281 -29 53 45 240 14 -186 13 194 170 159 -131 65 -110 20 -123 -252 178 16
3826A6N6K7l3o8kj7J89l3j22L11j90j90j94J71k44L15J81k53Q8J5l43L12J38m95
$$ 16 72 99 66 -2 -4 -21 168 135 13 324 134 -56 -250 -79 -323 -8 173 -80 8 23 -320 -8 130 -365
3850c65L01nO7k03J23o4J20j53O9K80j11m3k52M67J2k89r2J31p4J77k6k06L85
$$ -365 -64 -69 -2 -205 -82 -146 -26 -179 -110 170 59 16 -236 231 243 -46 -138 -7 -81 96 70 -136 249
3873B49l01K58l85L78l54N5L82l45J54K74l39J66j65O4k9j72Q5Q9J45n61N00p7
$$ 249 -52 206 -179 199 -155 -100 282 -63 91 365 26 192 27 91 62 -110 -25 64 209 -352 148 71
3895G1J56j55o4K45m97k5M60k35Q6k39L54m05J31J89k85J10N6R4P4k17J98j95
$$ 71 227 72 8 253 -244 -269 191 -44 42 -197 157 -248 -117 72 -213 -103 -47 47 121 -96 102 -93
3917i3j76L96k66M41l79R7K41k12R6k04L3o7J33m0k84K31M4j39N1K2n9M85k89
$$ -93 -269 127 -139 302 -77 20 261 49 145 -59 -26 -93 40 0 -284 -53 -9 -148 -97 -75 -134 351 62
3940F2k42O19n43J22O7L1j84P1j66L21O4n4j25M1j77J16k12M8k17L66JJ38k91
$$ 62 -180 439 -104 18 85 116 -68 3 -163 158 222 168 43 84 -93 23 -189 -141 -358 8 9 147 -144
3963a44J41o7J76j65r3J69j94K03j12K12pr1j22l1J2J28j02J52j80PP0k03L32
$$ -144 -3 -70 106 -59 -152 17 -177 26 -86 126 119 28 -94 -125 -113 15 -87 65 -115 -108 -38 -241 91
3986I1j43j76J84k97M10J81k11o9R3L9l28J11P9J24j82J77P9j96M0q8l2L17l13
$$ 91 -52 -228 -44 -341 69 250 39 -30 63 102 -226 -115 -36 88 -94 83 162 -34 6 -82 -114 203 -110
4009a10OK82l9J97k54J34l79J20k65M12J33k29K05l42L15j26j46J26k3P4l5l25
$$ -110 -104 178 139 336 82 216 -163 -43 -308 104 237 8 213 -129 186 60 -86 40 17 91 56 -269
4031b69K92n4k00K37m5k32K01p4N15l52j38R0k38K80J3O7r3o6K65j76j43j3J09
$$ -269 23 -31 -231 6 -39 -271 -70 -144 371 19 -119 -29 -267 13 26 93 0 -66 199 23 -120 -133 -24
4054b4j1o6P2j91J47k05K34K5p0K59l34K9m9L74k31q2K73m0N7p9j2q5j30J5j06
$$ -24 -35 -101 -29 -220 -73 -278 -44 -19 -89 170 -164 -135 -184 190 -41 -123 150 110 167 88 76 -9 -139 -124 -230
4079b30J87J85j75n9r1K43J10k15j87M45l4j24o1O2j09m0K10m2j7J53m15K87q7
$$ -230 -43 142 -33 -92 -183 60 170 -45 -232 213 179 55 -6 56 -53 -93 117 75 58 211 -204 83 -4
4102dr2k5J7N4M2J01k56K60j03j96J84k79N7J38j04M13o3P6k95L3Q8j21P2J44
$$ -4 -96 -121 -104 -50 -8 93 -163 97 -6 -202 -18 -297 -240 -102 -206 207 144 220 -75 -42 46 -75 -3 141
4126A41j27N1J20k26R1J56J14n77k4M31Q3k8l37k7J44J74k46j5K04j51p7L18j39
$$ 141 14 65 185 -41 50 206 320 -257 -281 150 233 205 -132 -159 -15 159 -87 -102 102 -49 -126 192 53
4149E3l06J97P6j73J34J64l56K6K62M8r3R3k6Q8q4l19K14k32o2L17O6Q0k37P4
$$ 53 -253 -56 20 -153 -19 145 -211 -185 77 125 32 125 99 187 103 -216 -2 -234 -296 21 87 167 -70 4
4173DK96n14J90o3o5J28J75j01J73j25j24n8N7j25J62n6J51m3k3J1n0M3j12M16
$$ 4 300 -214 -24 -87 -152 -24 151 50 223 98 -26 -84 -27 -152 10 -46 105 62 39 50 0 43 -69 347
4197C47k91j4k04mJ90J18J61j58l92J04R3J24m6J33m5k10K55j93m5J06P4N5j20
$$ 347 56 42 -162 -166 24 142 303 145 -247 -143 -50 74 28 161 116 -94 161 -32 -77 29 103 158 38
4220C8J8J4m16M70p2J72k42J08ll74L29q1o9m3J28O0j6J25k3k24J62R3j7k77O0
$$ 38 56 70 -346 124 52 224 -18 90 87 -287 42 -39 -108 -151 -23 37 21 146 123 -101 61 154 137 -140 -80
4245h0R9p9J67q8J30k27Kk31M9K29q2L27l27K99j76Q9J31mk43k6J6j34K19P3M3
$$ -80 19 -60 107 19 149 -78 -76 -307 -258 -29 -111 216 -111 188 12 101 232 228 -15 -41 -25 -159 60 133 176
4270A76n75L67J16k76K95k0j73KQ7n7L9j42R3M3K29k14J77k34j19L12j76J21k35
$$ 176 -399 -32 84 -192 103 83 -90 -88 -1 -58 -19 -161 -68 -25 204 -10 167 -67 -186 126 -50 71 -164
4293a64N3K65k83q8K67J35l32O5Pr1J85n9J14j32J3J64l45J74Q5N8j80qJ74N3
$$ -164 -111 154 -129 -217 50 185 -147 -82 -75 -166 19 -40 74 -58 -45 119 -226 -52 33 91 -89 -97 77 130
$$ [...]
8191b5
##END NTUPLES=NMR FID
##END=
