##TITLE=1H_DE-88m_TFA
 200.13MHz, CDCl3,
 8 sc
 
 15.8.2025
##JCAMPDX= 6.0         $$ Bruker NMR JCAMP-DX V2.0
##DATA TYPE= NMR FID
##DATA CLASS= NTUPLES
##ORIGIN= UXNMR, Bruker Analytische Messtechnik GmbH
##OWNER= pz
$$ XWIN-NMR		Version 3.5
$$ Fri Aug 15 14:19:55 2025 Russian Standard Time (UT+4h)  she@DPX200
##.OBSERVE FREQUENCY= 200.1313
##.OBSERVE NUCLEUS= ^1H
##.DELAY= (6, 6)
##.ACQUISITION MODE= SIMULTANEOUS
##.ACQUISITION SCHEME= undefined
##.AVERAGES= 8
##.DIGITISER RES= 18
##SPECTROMETER/DATA SYSTEM= spect
##.PULSE SEQUENCE= zg30
##.SOLVENT NAME= CDCl3
##.SHIFT REFERENCE= (INTERNAL, CDCl3, 0, 14.3821)
##AUDIT TRAIL= $$ (NUMBER, WHEN, WHO, WHERE, WHAT)
$$ ##TITLE= Audit trail, XWIN-NMR		Version 3.5
$$ ##JCAMPDX= 5.01
$$ ##ORIGIN= Bruker BioSpin GmbH
$$ ##OWNER= she
$$ F:/spectra/data/she/nmr/H-C/1/audita.txt
$$ ##AUDIT TRAIL=  $$ (NUMBER, WHEN, WHO, WHERE, WHAT)
(   1,<2025-08-15 14:18:47.76 +0400>,<she>,<DPX200>,
      <created by zg, POWCHK disabled, PULCHK disabled
       configuration hash MD5:
       00 E9 B6 7A A2 85 ED C7 34 08 36 98 17 FE 4E 26
       data hash MD5: 16K
       4E 62 AD FD DC 8C 4F 1D 59 90 2B F8 B7 4E 40 AE>)
$$ ##END=
$$ 
$$ hash MD5
$$ 75 BF 89 C8 72 41 81 96 F5 C1 4F 72 73 3B 93 DE
##$RELAX= 
##$RELAX= 
##$RELAX= 
##$RELAX= 
##$RELAX= 
##$RELAX= 
$$ Bruker specific parameters
$$ --------------------------
##$DU= <F:/spectra>
##$EXPNO= 1
##$NAME= <H-C>
##$PROCNO= 1
##$TYPE= <nmr>
##$USER= <she>
##$AMP= (0..31)
100 100 100 100 100 100 100 100 100 100 100 100 100 100 100 100 100 100 
100 100 100 100 100 100 100 100 100 100 100 100 100 100 
##$AQSEQ= 0
##$AQ_mod= 1
##$AUNM= <au_zg>
##$AUTOPOS= <>
##$BF1= 200.13
##$BF2= 200.13
##$BF3= 200.13
##$BF4= 200.13
##$BF5= 200.13
##$BF6= 200.13
##$BF7= 200.13
##$BF8= 200.13
##$BYTORDA= 1
##$CFDGTYP= 0
##$CFRGTYP= 5
##$CHEMSTR= <none>
##$CNST= (0..31)
1 1 145 1 1 1 1 1 1 1 1 1 1 1 1 1 1 1 1 1 1 1 1 1 1 1 1 1 1 1 1 1 
##$CPDPRG= <>
##$CPDPRG1= <>
##$CPDPRG2= <>
##$CPDPRG3= <>
##$CPDPRG4= <mlev>
##$CPDPRG5= <mlev>
##$CPDPRG6= <mlev>
##$CPDPRG7= <mlev>
##$CPDPRG8= <mlev>
##$CPDPRGB= <>
##$CPDPRGT= <>
##$D= (0..31)
0 0.7 0 0 0 0 0 0 0 0 0 0.03 0 0 0 0 0 0 0 0 0 0 0 0 0 0 0 0 0 0 0 0 
##$DATE= 1755253127
##$DBL= (0..7)
120 120 120 120 120 120 120 120 
##$DBP= (0..7)
150 150 150 150 150 150 150 150 
##$DBP07= 0
##$DBPNAM0= <>
##$DBPNAM1= <>
##$DBPNAM2= <>
##$DBPNAM3= <>
##$DBPNAM4= <>
##$DBPNAM5= <>
##$DBPNAM6= <>
##$DBPNAM7= <>
##$DBPOAL= (0..7)
0.5 0.5 0.5 0.5 0.5 0.5 0.5 0.5 
##$DBPOFFS= (0..7)
0 0 0 0 0 0 0 0 
##$DE= 6
##$DECBNUC= <off>
##$DECIM= 32
##$DECNUC= <off>
##$DECSTAT= 4
##$DIGMOD= 1
##$DIGTYP= 9
##$DL= (0..7)
0 120 120 120 120 120 120 120 
##$DP= (0..7)
150 150 150 150 150 150 150 150 
##$DP07= 0
##$DPNAME0= <>
##$DPNAME1= <>
##$DPNAME2= <>
##$DPNAME3= <>
##$DPNAME4= <>
##$DPNAME5= <>
##$DPNAME6= <>
##$DPNAME7= <>
##$DPOAL= (0..7)
0.5 0.5 0.5 0.5 0.5 0.5 0.5 0.5 
##$DPOFFS= (0..7)
0 0 0 0 0 0 0 0 
##$DQDMODE= 0
##$DR= 18
##$DS= 0
##$DSLIST= <SSSSSSSSSSSSSSS>
$$ [...]
##$SUBNAM0= <"">
##$SUBNAM1= <"">
##$SUBNAM2= <"">
##$SUBNAM3= <"">
##$SUBNAM4= <"">
##$SUBNAM5= <"">
##$SUBNAM6= <"">
##$SUBNAM7= <"">
##$SUBNAM8= <"">
##$SUBNAM9= <"">
##$SW= 18.0517328524113
##$SWIBOX= (0..15)
0 0 2 0 0 0 0 0 0 0 0 0 0 0 0 0 
##$SW_h= 3612.71676300578
##$TD= 16384
##$TD0= 1
##$TE= 0
##$TE2= 300
##$TE3= 300
##$TEG= 300
##$TL= (0..7)
0 120 120 120 120 120 120 120 
##$TP= (0..7)
150 150 150 150 150 150 150 150 
##$TP07= 0
##$TPNAME0= <>
##$TPNAME1= <>
##$TPNAME2= <>
##$TPNAME3= <>
##$TPNAME4= <>
##$TPNAME5= <>
##$TPNAME6= <>
##$TPNAME7= <>
##$TPOAL= (0..7)
0.5 0.5 0.5 0.5 0.5 0.5 0.5 0.5 
##$TPOFFS= (0..7)
0 0 0 0 0 0 0 0 
##$TUNHIN= 0
##$TUNHOUT= 0
##$TUNXOUT= 0
##$USERA1= <user>
##$USERA2= <user>
##$USERA3= <user>
##$USERA4= <user>
##$USERA5= <user>
##$V9= 5
##$VALIST= <valist>
##$VCLIST= <CCCCCCCCCCCCCCC>
##$VD= 0
##$VDLIST= <DDDDDDDDDDDDDDD>
##$VPLIST= <PPPPPPPPPPPPPPP>
##$VTLIST= <TTTTTTTTTTTTTTT>
##$WBST= 1024
##$WBSW= 4
##$XGAIN= (0..3)
0 0 0 0 
##$XL= 0
##$YL= 0
##$YMAX_a= 159908
##$YMIN_a= -155777
##$ZGOPTNS= <>
##$ZL1= 120
##$ZL2= 120
##$ZL3= 120
##$ZL4= 120
##$ABSF1= 10
##$ABSF2= 0
##$ABSG= 5
##$ABSL= 3
##$ALPHA= 0
##$AQORDER= 0
##$ASSFAC= 0
##$ASSFACI= 0
##$ASSFACX= 0
##$ASSWID= 0
##$AUNMP= <proc_1d>
##$AZFE= 0.1
##$AZFW= 0.1
##$BCFW= 1
##$BC_mod= 2
##$BYTORDP= 1
##$COROFFS= 0
##$CY= -3
##$DATMOD= 1
##$DC= 2
##$DFILT= <>
##$DTYPP= 0
##$F1P= 0
##$F2P= 0
##$FCOR= 0.5
##$FTSIZE= 0
##$FT_mod= 4
##$GAMMA= 1
##$GB= 0.15
##$INTBC= 1
##$INTSCL= 1
##$ISEN= 128
##$LB= 0.25
##$LEV0= 0
##$LPBIN= 0
##$MAXI= 10000
##$MC2= 0
##$MEAN= 0
##$ME_mod= 0
##$MI= 1.114404
##$NCOEF= 0
##$NC_proc= 0
##$NLEV= 6
##$NOISF1= 3.799351
##$NOISF2= 2.8
##$NSP= 1
##$NTH_PI= 0
##$NZP= 0
##$OFFSET= 14.38212
##$PC= 1
##$PHC0= -1562.455
##$PHC1= 13.59228
##$PH_mod= 1
##$PKNL= yes
##$PPARMOD= 0
##$PSCAL= 0
##$PSIGN= 0
##$REVERSE= no
##$SF= 200.129724274929
##$SI= 16384
##$SIGF1= 3
##$SIGF2= 2
##$SINO= 400
##$SIOLD= 16384
##$SREGLST= <1H.CDCl3>
##$SSB= 0
##$STSI= 0
##$STSR= 0
##$SW_p= 3205.1282051282
##$SYMM= 0
##$S_DEV= 0
##$TDeff= 0
##$TDoff= 0
##$TI= <>
##$TILT= no
##$TM1= 0
##$TM2= 0
##$TOPLEV= 0
##$USERP1= <user>
##$USERP2= <user>
##$USERP3= <user>
##$USERP4= <user>
##$USERP5= <user>
##$WDW= 1
##$XDIM= 8192
##$YMAX_p= 0
##$YMIN_p= 0
$$ End of Bruker specific parameters
$$ ---------------------------------
##NTUPLES= NMR FID
##VAR_NAME=  TIME,          FID/REAL,        FID/IMAG
##SYMBOL=    X,             R,               I
##VAR_TYPE=  INDEPENDENT,   DEPENDENT,       DEPENDENT
##VAR_FORM=  AFFN,          ASDF,            ASDF
##VAR_DIM=   8192,          8192,            8192
##UNITS=     SECONDS,       ARBITRARY UNITS, ARBITRARY UNITS
##FACTOR=    0.0002768,     1,               1
##FIRST=     0,             0,               0
##LAST=      2.2672688,     0,               0
##MIN=       0,             -155777,         0
##MAX=       2.2672688,     159908,          0
$$ Real data points
##PAGE= N=1
##DATA TABLE= (X++(R..R)), XYDATA
$$ [...]
1880A66J82m4j58O4j09k51P7J85j30K60j60j41J43j58J35k37J61K0j21Q7p2J60
1902E9O2m14M58k77L38q3l1k53N9L44j15j72K55m81L70k48K50k01J32J16j90J12
1924I0o0r9P5n1j44P5j58J76J37R4j27O2O7j62J96p6J00N6k47k16J78J55k17j67
1948b63L35n1J80j80k61M10j53P9n0n7k6P8o3P0m9L7R3P2m50K41q4M3oj44J77
1973b2K2j5l07N50j09J5l27J60k58J60K49K5Q8k52L0pL5K8n2LJ01k76q5K29J11
1998I6j14l01J74J84n7Rn1O8j44R3L17k16Lk8l3Q3J72m89N8O1R4k26N45l27r6
2023a25Q6p1p3K24K5nl31L64r4j70r1J27L43k58k83L82r7k0J41m8kk02K06J44
2047A72j06o7j30N5J86l15R0K10j61M0J9K2j88K43n1j06M2J72l76J66L28l12q
$$ plain form
1880 166 348 304 146 210 101 -150 -73 112 -18 242 82 -59 84 -74 61 -176 -15 5 -116 -29 -101 59
1902 59 121 -293 165 -112 226 143 112 -141 -82 262 147 -25 230 -251 119 -129 121 -80 52 168 -22 90
1924 90 30 -69 6 -45 -189 -114 -272 -96 41 135 8 70 137 -25 171 95 195 251 4 -212 -34 121 -96 -263
1948 -263 72 21 201 21 -240 170 17 96 46 -11 -37 41 -22 48 -1 36 129 201 -249 -8 -92 -49 -55 -199 -22
1973 -22 0 -15 -322 228 119 134 -193 -33 -291 -131 118 143 231 -21 9 2 37 65 13 16 117 -159 -244 -15 96
1998 96 -18 -319 -145 39 -18 -9 -60 8 -136 -43 274 58 61 33 0 83 255 -234 -176 -115 -21 -247 298 -29 -125
2023 -125 -39 -110 -183 41 66 61 -270 94 0 -170 -261 -134 209 -49 -332 50 -47 -67 74 26 24 -178 28 172
2047 172 66 -1 -131 -76 110 -205 -115 95 -66 -26 -7 15 -173 70 19 -87 -45 127 -249 -83 245 -67 -75
2070g5O8j82L66o1J7J45n13M15l33J42J27j30L4L03j67j14J01j77J67j53j02R2
2092c0K15j23k17R7k71L12K78q3p1j13K05k23n0J41L4K0k48J95r8k12M45j9k15
2115c1J32k35j09L58k04j0J95P1o3j33J05k46R7L54j57J8j7l47K41j14L35p3k99
2138a32R6l77N90l19k03M88m68L10L27l06j82J58o4n3l8P2P2n3K0J39j08J78l26
2161a79N4K98j44j20j15J04J91J06j42j81r7J62j11L47n0k52L26l0O5j19j78N4
2183a1R7l5j14J57j78L4k11J87J66j30j24p2L86q9j33J48o5J19l78N8J03L82m74
2206a77K89J53l58J56j66J51J10k66j17L30r9K44o1k53R4p9k5L09j71R2k17R9
2228C8n1J07J54n81K79Q4j72NJ81j1J45m75K87l0K20l11k4J48K05j62M1P0j79
$$ plain form
2070 -75 -7 -189 177 116 133 278 -235 180 -153 -11 116 -14 20 323 156 42 143 -34 133 -20 -122 -30
2092 -30 185 62 -155 -58 -329 -17 261 178 107 -6 199 -24 -74 67 101 121 -127 68 -30 -242 203 184 -31
2115 -31 101 -134 -243 115 -89 -99 96 167 104 -29 76 -170 -73 281 124 142 125 -222 19 -95 240 167 -132
2138 -132 -36 -413 177 -142 -345 143 -325 -15 312 6 -176 -18 -82 -135 -173 -101 -29 -82 -62 77 -31 147 -179
2161 -179 -125 173 29 -91 -206 -102 89 195 53 -128 -225 -63 -174 173 123 -129 197 167 232 113 -65 -11
2183 -11 86 51 -63 94 -84 -50 -261 -74 92 -38 -162 -234 152 63 -70 78 13 132 -246 -188 -85 297 -177
2206 -177 112 265 -93 63 -103 48 158 -108 -225 105 6 250 189 -64 30 -49 -74 235 64 156 -61 38
2228 38 -13 94 248 -333 -54 30 -142 -137 44 33 178 -297 -10 -40 180 -131 -155 -7 198 36 77 147 -32
2251c2J29p8J3qk89P4J51R6r6Q7j52L51j69l5m28N93k89K57k04P3J48o00O61L2
2275B85k04J03k45J91p5k08l3K81k83K40j7K52k33o9j03O1J36j29K80k83P9J8
2297D4j66J72p9n6j98M5K23J18k01l3L1pJ26J3k5k75J76J67j2l2J11k1l73J63
2321h9J56J7j37J32q2j59Q3K69j11k73J30j9O5K25j25j63r2J44m3K80j98N8L3
2344A01q7k27M37l06K4R4j22j5K40k24j16K17o9r1L30j17k48J70N4q5J59J01O9
2367B89k29j93K07n9nl9j55J2l6M92j25j09K78m48QJ11k1m7L48m03K22k69P2J54
2391E5J85K9k25k19p1K68R9J3j79J70l29M4J37m2J95n9j46j45J97q7J17M3p3M
2415a9Kj79M35N6j55l70R0L19j90j3J23K74m9k47J06j40l7J08k51j01M30l56K47
$$ plain form
2251 -32 97 19 32 24 -265 -191 -40 56 -40 47 -105 246 77 42 -386 207 -82 175 -29 44 192 -408 253 285
2275 285 81 184 -61 130 55 -153 -186 95 -188 52 35 287 54 -15 -118 -57 79 -50 230 -53 26 44
2297 44 -122 50 -29 -85 -283 -238 -15 103 -98 -131 -100 -107 19 32 7 -268 -92 75 63 31 142 121 -252 -89
2321 -89 67 84 -53 79 -3 -162 -79 190 79 -194 -64 -83 -18 207 82 -81 -173 -29 -72 208 10 68 101
2344 101 14 -213 224 -82 -58 36 -86 -101 139 -85 -201 16 -53 -144 186 69 -179 -9 45 -40 119 220 289
2367 289 60 -133 74 15 10 -29 -184 -172 -208 284 159 50 328 -120 -112 -1 -22 -69 279 -124 98 -171 -99 55
2391 55 240 269 44 -175 -246 22 121 134 -45 125 -204 -160 -23 -65 130 71 -75 -220 -23 -110 7 50 -23 -19
2415 -19 -17 -196 239 295 140 -230 -140 179 -11 -24 99 373 324 77 183 43 6 114 -137 -238 192 -164 83
2438H3J26m62k2J95O8K06k37J41K5j05l4j97L56l46J13p0K10j76K6L27M0k68j48
2461a49J44j00Q1K19k19L0j1j31K2Ok6K22M4k45Q5j11q7O1N18n02K43l32L76k46
2485a08J5K6Q9J5K48m28J03Q5M5j17P2J09o4O5k14L33l48Q2O8Q6l9Q2j09j97o7
2510a68J50m2J63n7M2l32J56K46k04J30J7j08KR3j18j66K76l4J14j73R2l4j06
2533f1Nj8J23j43J55j82p8R9p2K40J80m33J51j59J82J03L3L4j42j23K87l56K08
2556C3K8j66K07mj18j26P1J17k4q9J27m69N37K0k09o1r3K89J5p8j24J67r1J3j41
2581a69J72k6K33k23q9k4L06k5l35K17NQ0j23j5J7K1l26L39M6j71Q9J09Jk05l7
2606a33L1K1K7L6j24J40J44j15j88J09k18L93j66J26L4j6q3J8J09q2L7l46K37
$$ plain form
2438 83 209 -253 -275 -80 -12 194 -43 98 123 18 -16 -213 143 -203 -90 -160 50 -126 -100 227 267 -1 -149
2461 -149 -5 -105 -24 195 -24 6 -5 -136 -114 -108 -134 88 132 -113 -28 -139 -226 -165 353 -149 94 -238 138 -108
2485 -108 -93 -67 22 37 285 -143 -40 45 90 -27 45 154 90 155 -59 274 -74 8 76 162 123 205 96 -101 -168
2510 -168 -18 -60 103 46 88 -244 -88 158 -46 84 101 -7 -5 88 -30 -196 80 46 160 -13 79 45 -61
2533 -61 -56 -74 49 -94 61 -121 -199 -100 -172 68 248 -185 -34 -193 -11 92 125 159 17 -106 181 -175 33
2556 33 61 -105 102 98 -20 -146 -75 42 18 -71 56 -413 124 144 -65 -126 -219 70 85 7 -117 50 -41 -28 -169
2581 -169 3 -23 210 -13 -102 -126 180 155 -180 37 42 122 -1 -16 1 22 -304 35 81 -90 -1 108 109 -96 -133
2606 -133 -102 -81 -54 -18 -142 -2 142 27 -161 -52 -270 123 -43 83 117 101 18 36 145 63 100 -246 -9
2629im2L17l69j07j6J62q3J71j0Nj25P8K66k62j85L30J19l02k1o2j33M35r5j08
2653d6J91k83l2o0K94N2k17Nk22M16J86k53K8M1J3l08J43L14k74J14k17Om6L19
2677A64k55o0j5kL23j19J77j78p0K45k32N8k32L18K1j12J22l4k71J90J18j66j43
2700a53J93j23j52L26q7L5j3p7Q2K60k48lj59J32J63k01J07k43J78N1P4j29N6
2723F9j12O7M1j12j44K08N3j88L2Q5K35jk06N0j18j01K39N3q6l03L44J9k30r3
2747a99J61R7K2o4L3L7m7j06K08k40J89Q7k45K89j23Rj02J52l02J98O1j00k03
2770a88J8L55j50pk32K69K57m10K22r2k82J07L32k76J59j32RM6J49l10J36K32
2792B12m85M85l30J8N6Q4n6L74j56k11r5K88j59j94K37j00o4K33l25J00K35m2
$$ plain form
2629 -9 -51 266 -103 -210 -226 -64 -147 24 14 19 -106 -28 238 -24 -209 121 240 -62 -83 -145 -278 157 62 -46
2653 -46 145 -138 -170 -230 64 116 -101 -96 -318 98 284 31 59 100 113 -195 -52 262 -12 102 -115 -109 -155 164
2677 164 -91 -151 -166 -168 155 36 213 35 -35 210 -22 36 -196 122 143 31 153 119 -152 38 156 -10 -153
2700 -153 40 -83 -235 91 4 39 26 -51 31 291 43 40 -119 13 176 -25 82 -161 17 68 142 13 69
2723 69 -43 24 65 -47 -191 17 70 -118 -86 -1 234 233 27 77 -41 -142 97 150 64 -239 105 124 -106 -199
2747 -199 -38 59 81 17 50 87 40 -66 142 -98 91 178 -67 222 99 108 6 158 -144 54 115 15 -188
2770 -188 -170 185 35 28 -204 65 322 -88 134 42 -240 -133 199 -77 82 -50 -41 5 154 -156 -20 212
2792 212 -273 212 -118 -100 -44 40 -16 358 202 -9 -104 184 25 -169 68 -32 -96 137 -188 -88 147 105
2814A05K7k73K70P1l38r4J22l9K88j6l43K56n8j49j50K84K4R9K36m14L75j83l5
2837F5q3n0J79l9j17k86L45j56J31o9K4Q9K20l12k4K38j61k48k8M9M02j86K20
2860B03k67L09j15N1q9j22j0R7k19L85m42K64k13K02j97J30l03M67k40L04L1m86
2882b60R2K41p7L1j3N4r8M0M05n91L98m22L76l31K42K45m41N7N3K64n90M12j24
2905c7j86nJ17qJ67r6KJ02L21m46q2K60q1r1J49j20J44P7l64J25n1J53J4j0j52
2930i8O6J35p8ml4q8P0J40q4j01J89r2P6k87P9J39j01L13l37m0K87r1m5M3l9Q9
2956A07Om48L60j09L02l83J38J48k08J19m3r8J75j77J62j11N3J02lm8J91m76o
2979b47Q2K38l6J13n4r3j33j64K76J03r6J62J85l19K17m04K37j1oj41N6p7J47
$$ plain form
2814 105 132 -141 129 200 -138 -232 -110 -149 139 123 -220 36 -22 -171 -321 -37 -13 86 322 -92 283 100 65
2837 65 -18 -68 111 72 -45 -331 14 -142 -11 -80 -56 33 253 -59 -83 155 -6 -254 -282 -233 169 -17 203
2860 203 -64 245 130 181 92 -30 -40 57 -162 223 -219 45 -168 34 -163 -33 -336 131 -109 195 226 -260
2882 -260 -168 73 -4 27 14 68 -30 10 415 -176 222 -200 176 -155 87 332 -109 -52 1 265 -325 87 -37
2905 -37 -223 -228 -111 -119 48 -48 -46 56 377 -69 -151 109 28 -63 86 -34 110 187 -177 -52 -103 50 64 54 -98
2930 -98 -32 103 25 21 -13 -101 -31 109 25 -76 113 21 97 -190 -111 28 -73 240 -97 -137 150 59 14 57 18 107
2956 107 113 -335 25 -84 218 -165 -27 121 -87 32 -11 -109 66 -111 51 -60 -7 95 92 44 235 -241 -247
2979 -247 -165 73 37 150 96 3 -130 -294 -18 85 -11 151 336 17 234 -170 67 56 50 -91 -35 -112 35
3002C5k74k3M20j61j50pP1R5J45l03j1J05J11p3J19K1j59MM1J13j49o3L9k40J20
3027a74K27j44J05r7L58k42l25K55J01P7j98O6q7J15k6N1J9j53J20j3j89L2J93
3050G1p2k41K06J08K8q6K2J74l28M7K77k45N6j13K96k59q6j00R6K72j94J1j2J29
3074E7M0j18j06L84k20j72O6K86O9k53K43j78Ol03K61l19P6L02j66J1r7K8l5j32
3098b70K79o1L55k35j3jr2n3J25j41K66j29P0Mk31K7k9J27N0l2O2k10J80j78J57
3123B7Q3J8j49K29j29p4j26J27j17J38p2K53j78p8O5J33k50P2K11j97j00J89P1
3146A46k57J15j32J78J52l73M09k12j64l3K6K97n3M9l1j74j85J6J70Q2j51K51
3168A26k85K74r9k34L10j52l0j41K08R5J82m64m5j8M78j29J31n38K80O7j62Q2
$$ plain form
3002 35 -239 -262 158 -3 -153 -160 -89 6 151 -152 -163 -58 53 -20 99 120 -39 -35 6 119 -30 -93 -54 -294 -174
3027 -174 53 -91 14 -83 275 33 -292 -37 64 141 -57 9 -78 37 11 62 81 -72 48 35 -154 -122 71
3050 71 -1 -242 -36 72 100 14 36 210 -118 -71 206 -39 17 -96 200 -59 -145 -245 -149 123 -71 -60 -72 57
3074 57 97 -21 -127 257 37 -135 -69 217 286 33 276 98 104 -199 62 -257 -181 121 -45 -34 -131 -103 -138 -270
3098 -270 9 -52 303 68 55 54 -38 -91 34 -107 159 30 100 104 -127 -100 -129 -2 48 16 78 -132 48 -130 27
3123 27 110 128 -21 208 79 5 -121 6 -111 27 -45 208 30 -48 17 150 -100 -28 183 -14 -114 75 146
3146 146 -111 4 -128 50 202 -171 238 26 -138 -171 -145 152 99 148 117 -57 -242 -226 -56 26 -125 126
3168 126 -159 115 16 -218 92 -60 -90 -231 -23 72 254 -210 -255 -273 205 76 207 -331 -51 16 -146 -64
3190f4j61M5J94L1m8r8K04q6j27J15j91L80k67L74p3l97K37q2K20l13P8n1JQ9
3214A0j38K36P4m7P5j35K27l46Q6P1Oj53J32j20N8j85K41O1l15J67J96m8j49K25
3238B29k47L5L8j38L9r1j65L23p7J24n4j20J03J42k23J40J9J28m2K2o9q1L4j23
3262e4k9J5J40r5Q0O3j04k60M25j10j05J40j08k29J73P1j32Q4j9m88N66Q3k13
3285a06n8J07P8p7K09j57J13k48KL63l19K2L63j26k53L8j06J48l35L95j69j9o8
3308b03m6K02J16Qj73Q7QR7k8K2j01k5J16K11k88k6K35l03L23k77j25J90N0k28
3332a58K23k60L18k32K33m06RJ51J19J91l30RK20k44J61N2j77Q1K11P1j01j63
3354b2j61M35k45M9k23o2K76k62K16q8J88j14QL4j35R0j13N3J58j57L61n5j15
$$ plain form
3190 -64 -225 -180 14 45 -3 -101 103 17 -110 5 -186 194 -73 301 228 -169 68 -14 206 -107 -29 -80 -79 10
3214 10 -128 108 182 135 210 75 302 -44 42 113 119 -34 98 -22 36 -149 92 153 -162 5 201 153 4 229
3238 229 -18 17 55 -83 -44 -135 -300 23 -54 70 16 -104 -1 141 -82 58 77 205 163 185 116 35 69 -54
3262 -54 -83 -68 72 -23 57 120 16 -244 181 71 -34 106 -2 -231 -58 13 -119 -35 -54 -542 24 107 -106
3285 -106 -164 -57 21 -56 153 -4 109 -139 -137 226 -93 -71 292 166 -87 -49 -155 -7 -342 53 -116 -135 -203
3308 -203 -249 -47 69 77 -96 -9 -1 96 68 90 -11 -36 80 291 3 -23 212 -91 232 -45 -170 20 70 -158
3332 -158 65 -195 123 -109 124 -282 -273 -122 -3 188 -142 -133 87 -157 4 56 -121 -40 171 242 141 -22
3354 -22 -183 252 7 56 -167 -229 47 -215 1 -87 101 -13 -5 29 -106 -16 -129 -76 82 -75 286 231 116
3377A16K31p6j86j11r6J68k03K80k14m2O06k83j26j80J39j72R8j51L27n2j32K72
3399B13q5j16n0P4j62j70J22L55k21J72j06K29l40M0j64K60P9k82J82J15j18J25
3421A52P1R7k21k13j06K19o1K12k89Q2J16N0l15K31j00P1j38P9K8j30K71L7k83
3444a40q3o5L84k62J16l8M5K61j27jk57j2L20jk33J24k3N2k8Jo7j36O7J72n9K2
3470C2K66n6k38O6r0L1K13l58j25L88m0K5n4K70m07J43J11l96K05m0N7j41J53
3493A5j29L36k42J3l3r9PL94j91o4j43J7P1L8k35L41k39L61j61k67N2K74J7j56
3517b3j48q1J87l5J92q5k0j07K79l85J00P4j36j49L32Q0l12R4J36J1J01j04j21
3540a20R5m9K24l05J44J10k68K22L2l55O8J20Q7J02j03j1rk8L0J22J53m08J7K45
$$ plain form
3377 116 347 271 85 -26 -122 46 -157 123 -91 -133 473 190 64 -116 23 -149 -51 -202 125 73 -59 213
3399 213 128 12 -38 36 -126 -296 -174 181 -40 132 26 255 -85 -45 -209 51 130 -152 30 145 27 152
3421 152 223 320 99 -114 -220 -1 -62 150 -139 -57 59 109 -206 25 -75 -4 -142 -63 -35 -165 106 143 -140
3444 -140 -223 -288 96 -166 -50 -88 -43 218 91 90 -167 -179 141 140 -93 31 8 60 32 33 -34 -170 -103 69 10 32
3470 32 298 242 4 70 -20 11 224 -134 -259 129 89 114 60 330 -77 66 177 -219 -14 -54 3 -138 15
3493 15 -114 222 -20 -7 -40 -139 -132 262 71 7 -136 -119 -48 -10 -245 96 -143 218 57 -210 -158 116 133 -23
3517 -23 -171 -252 -65 -100 92 7 -13 -120 159 -226 -126 -52 -188 -337 -5 75 -237 -143 -7 4 105 1 -120
3540 -120 -25 -74 150 -155 -11 99 -169 53 85 -270 -202 -82 5 107 4 -7 -16 -44 -14 108 261 -147 -130 115
3564A15l11K68O4L0k17m6k37M63k55L4j81K14m4L74k98J28k68K85Q6j49m5k2r7
3587a09J95j2r5P8o5J39j91N26m93J46k02L2J5j88L11J04k84l6L15l23J76m38
3609c99K61M9J52k39K14kl46N05k40O7J10j52L1J00k98J19L9K82m33K17n2j14
3631a29M50l85MJ85J44k88J16m31M55J02l37J14N%RL0q7J03K9j23N2J06k1K76
3655C79l70N2j91J94j45J43K96n18J11J12lq9O8L45m60K53j0k03J41k12M1J19
3677E3k1q9J25l30L60j79J44j10O3k42K90N2p2k2k94M31j97J47m0P4K13m89R7
3700c6R4pk93K88k12o0L0J43J57k10j0J27J60l92L13n9o1J7J82j47m2k31k0K04
3724f5k1K1M3J3j93j8K03j12K87j77r4J70n8r6j0q0R3J01j50L31j02L5m8L7m63
$$ plain form
3564 115 -196 72 136 166 -51 -97 -334 129 -126 -92 -273 -59 -103 271 -27 101 -167 118 204 55 10 -12 -109
3587 -109 86 74 -21 57 -8 131 -60 466 -27 119 -83 -51 -36 -224 87 191 -93 -129 186 -137 39 -399
3609 -399 -138 -89 63 -176 38 36 -310 195 -45 22 132 -20 11 111 -187 -68 -29 253 -180 37 -15 -129
3631 -129 321 -64 -60 125 269 -19 97 -334 121 223 -114 0 5 5 14 44 -43 60 89 -34 18 124 103 379
3655 379 9 61 -130 64 -81 62 358 -160 -49 63 60 -29 39 384 -76 177 167 -36 105 -107 -66 53
3677 53 32 -57 68 -262 98 -81 63 -47 16 -226 64 116 44 22 -272 159 -38 109 69 143 356 -133 -36
3700 -36 58 51 -242 46 -166 -226 -196 -53 104 -106 -116 11 171 -221 92 33 -28 -11 171 24 -18 -249 -269 -65
3724 -65 -86 -65 -22 -9 -202 -220 -17 -129 158 -19 -113 57 -1 -97 -107 -187 -94 7 -143 188 86 121 73 110 -353
3749c53K06J71m8J22j07K5n9O1Rj22R0L84l34q7j10K27k32O0K58l01K46j31k17
3772b42K86j08J74j93k2n4M11j03j49K0n2J56l35J66Q3N6K30k11k47J61O5j54
3794f2L46k38m15O14j98j38J81l47N1L47K2J2j59Q5j55l8K64l23K63Lq0J0O8k56
3818a43K68j62q6j4K31j86q7K43k5J32j14j60J16Q2j00jnj98J79O8j05K67m95
3841b95J45J2K79n1l8l8P4k64K57n7q0j93J21Q6Nl9m9R4mj0j30j32N2K66l3j04
3867a26K15n5P4j88L85l01K98k80j03J04r4k1J84Jl9j75J19j60J09J07j17P4P2
3890H3K4l1k09Q7O4J22k7j3K40q1k12J12l19p5L25l09k4K83J5l82K78R1j00J2
3914d6J86k28r3L04j12j5k45r4L87j38Q8j16J28j12j2J64K1J89j07p5o2k1n9K13
$$ plain form
3749 -353 -147 24 -24 98 -9 16 -43 18 27 -95 -5 379 45 -42 -152 75 -157 -97 161 -140 106 -25 -242
3772 -242 44 -64 110 -83 -105 -159 252 149 0 20 -32 124 -211 -45 38 94 324 113 -134 27 92 -62
3794 -62 284 46 -369 245 47 -91 90 -257 -206 141 163 175 16 101 -54 -92 172 -151 112 115 35 45 113 -143
3818 -143 125 -37 -123 -137 94 -92 -179 64 39 171 57 -103 13 95 -5 -6 -11 -209 -30 38 -67 200 -295
3841 -295 -150 -138 141 90 52 14 88 -176 81 24 -56 -249 -128 -42 -37 -76 -125 -31 -35 -45 -175 -307 -255 11 -22 -126
3867 -126 89 34 108 -80 305 4 302 22 -81 23 -71 -92 92 93 54 -121 -2 -162 -53 54 -63 11 83
3890 83 107 76 -133 -46 18 140 113 100 340 259 47 159 -160 -235 90 -219 -243 40 55 -327 -49 42 -58 -46
3914 -46 140 -88 -181 123 11 -4 -249 -343 44 -94 -6 -122 6 -106 -118 46 67 256 149 74 12 -9 -68 145
3938A45j07k03J68J08j81J90j19K5k3j35L94m50K07K58k94J38j24o0j60K75r6
3959d4K3k04j7M9K21M1O4o5k7N0ol7L0j09j6j39J01p4J3J72k5k24J9j23K43j02
3985a86K52j78j54K17j36O7K71l29R3j3K09j11N5K3P1q4j38J08j00R5M4l1l33
4008b88J06J93J46J40k35nJ84l92K30j68J46J56m7q3K73l30n7Q7j20O9k3j62M4
4031a36M0M9Q9r6L67l24O0j91J05J09l47J78J0J21K28j65j40j45K75O1k4q6J27
4054A65k20l2p7J88j52P1k90M56m2P7k50K75j42r5J52q1J19j13R2j36J60m10L70
4077H5K53l58qJ71q6j80o1M2l0P3l5K34O7n4J0k9J23k37r8K08k27J92K8j22o4
4102a03K68k61J07J84m1k03Jo4J46o2nj5j53M68o5j13m0k61K88k24K67j29q9K65
$$ plain form
3938 145 38 -165 3 111 -70 120 1 26 3 -132 262 -188 19 277 -17 121 -3 -63 -223 52 -44
3959 -44 -21 -225 -242 -193 28 69 133 68 41 91 85 48 78 -31 -47 -186 -85 -159 -146 26 1 -223 -204 -327 -84 -186
3985 -186 66 -112 -266 -49 -185 -118 153 -176 -83 -96 113 2 57 80 151 67 -71 37 -63 32 76 45 -288
4008 -288 -182 11 157 297 62 57 241 -151 79 -89 57 213 166 83 356 26 -31 56 -64 5 -18 -180 -136
4031 -136 -96 -47 42 -54 313 -11 49 -142 -37 72 -275 -97 -87 34 262 97 -43 -188 87 148 124 38 165
4054 165 -55 -87 -164 24 -128 -57 -347 109 67 144 -106 169 27 -68 84 3 122 9 101 -35 125 -285 85
4077 85 338 -20 -28 143 57 -123 -184 -142 -172 -99 -134 100 167 113 123 94 217 -20 -118 90 -137 55 83 -39 -103
4102 -103 165 -96 11 195 154 -49 -48 -112 34 -28 -33 -48 -201 267 202 89 49 -212 76 -148 119 -10 -99 166
4126A66j82N8J00j95R7j79J38R9L3r6R2k0Oj78j34J22P9m4K20j17k10K67q4j20
4150h2J75l4o0J67m48P3J69j1KO8j30J32j15K5J47p3n7K31K5j70JR7NK60l48J31
4176A80l1P4m09K45P4q8q4J52j3j70j36K59l8M7R3l56L65j70p0m5J40l1Q1j75
4200a06K07j83j14K89j19J07q8R5j37O3k6j16q4J17J84j63L65m17J98k85J23J03
4222A3oK84n33M79j6j50l96M39j46J50j68j48J30k73L34O5j48J28Q1p3l05O8O7
4245a24K15j98Q7J49k76j06Q1Q8j06K12L8J8K9j58K9lM01n08J94k31K23q3r8L38
4269B11n5k20m8M7K33l39L8L87l01j46L19l56K19J99k07j9Pk32J42K34n1l6p9
4292e3k11L87j01q8R9qq%J28M1k13M03k83j09J65j58o1M2R6j75l0j87J89P8K21
$$ plain form
4126 166 -16 42 142 -53 44 -135 3 102 135 39 131 111 117 -61 -195 -73 6 -38 182 65 -145 122 38 -82
4150 -82 93 59 -1 166 -282 -209 -40 -51 -49 19 -111 21 -94 -69 78 5 -52 179 204 34 35 132 137 397 49 180
4176 180 149 223 -186 59 133 45 -39 113 100 -70 -206 53 15 62 155 -201 164 -6 -76 -121 19 -12 69 -106
4200 -106 101 -82 -196 93 -26 81 -7 88 -49 14 -12 -128 -212 -95 89 -74 291 -126 72 -213 -90 13
4222 13 7 291 -242 237 221 71 -325 114 -32 118 -50 -198 -68 -341 -7 58 -90 38 119 46 -259 -191 -124
4245 -124 91 -107 -20 129 -147 -253 -172 -84 -190 22 60 78 107 -51 -22 -25 376 -132 62 -169 54 -29 -127 211
4269 211 156 -64 -112 -65 168 -171 -133 254 -47 -193 126 -230 -11 188 -19 -38 -31 -263 -121 113 62 26 -53
4292 -53 -264 123 22 -66 33 25 17 17 145 186 -27 376 93 -16 149 -9 -70 -28 68 -107 -137 -324 -135 -57 164
4317A64j90M50m85m5j20K76j15N5M2j12L6J84j56Q8K0j66RL09l57J67O2l74L05
4340D7kj32K73l00J18J19j41n0%M3j02K80j69RM6j01QL5K8L25k36n8L13l61k1
4365b9Q7M1j40K6M3J00k2N6q8l45L10N2p0P5k18J81k01o5K21j67L53k68J57j12
4389b3o0J8J03l1lL28l99j40J09J78p1LPnl6N7J65j8k25o1L15m4l95K18J26q6
4415C0J49l20K34J46j85Q4j15j17P3O0j15j16L05j98M65k80k27Q9J11j5k12L54
4437B00J03k29Ql1p5Q8k11R0L6j45J18r1J20n9l7J58j35K07j94K58l58L06o7j59
4461i9qK12J18k54J21l33K48m7j61K63P9q7J41k99J86k39K62l09J97K9k02K45
4483F3l3Lj84k7N09m62J99O7K5l56K78k01J5L2k65M16j1p5K0j5J03l22J56o4Q
$$ plain form
4317 164 -26 424 -61 -106 -226 50 -65 -10 32 -80 -44 140 -16 72 92 -74 -65 244 -113 54 116 -258 47
4340 47 45 -87 186 -114 4 123 -18 -68 -68 -25 -127 153 -16 -7 39 -62 -54 -19 9 334 98 40 353 -8 -29
4365 -29 58 99 -41 -15 28 128 106 162 74 -271 39 91 21 96 -122 59 -142 -207 14 -153 200 -68 89 -23
4389 -23 -83 -65 38 7 4 332 -67 -207 -98 80 9 12 19 14 -22 35 200 182 -43 -104 211 167 -228 -10 116 30
4415 30 179 -141 93 239 54 138 23 -94 -21 39 -76 -192 113 -85 380 100 -127 -38 73 58 -154 200
4437 200 303 74 82 51 -24 64 -147 -57 -21 -166 -48 -139 -19 -78 -115 43 -92 115 -79 179 -179 127 60 -99
4461 -99 -107 105 223 -31 90 -243 5 -42 -203 60 139 52 193 -106 80 -159 103 -206 -9 20 -182 63
4483 63 30 33 -151 -178 331 -131 68 135 160 -196 82 -119 -104 -72 -337 79 68 -7 13 -2 101 -221 -65 -129 -121
4508a21N5k36R8K55J41o1P6j95q9j37K62p6K01l19L72j83J07J3l80J60N6q4l9
4531a24J51q9m9j5J24Po9k5K15o8qj37K27j26j56k07K53j8n7K76j62J79k61J35
4555do8j55M0K89J28j60m0j12K35k8p2j97M96j53j69k49K31r1r7k9J42K62l34
4578a35K8j37M21j15p8kl9N2j92j9K74L44k79k00J62j84r5L97j45J32l55R7K39
4601A71P9j58k24k3J2J71%K15m71L68l54O8K56k11l3Q4J18p9J2Q1r2J38j64J64
4625A28M8j40j99J91K67jl02j84K85l0o8J76k39K20k83r0L52j15r0K04j2o8k57
4648b07L11J10k07Pl7j25J17J88k05J01J0MK95l17j04qJ68j71J91j06j93J73j35
4671a40j1L5N2K24j98Q6j21n5K90q3N1k76J37l0J22j17o3m4L8P6J24q7j56R5L47
$$ plain form
4508 -121 -66 -302 -204 51 192 131 207 12 -77 -214 48 -28 173 -146 226 43 150 163 -217 -57 -1 -85 -124
4531 -124 27 -62 -111 -126 -2 5 -64 -89 126 58 50 -87 140 14 -142 -349 -96 -114 -171 105 -57 122 -139 -4
4555 -4 -72 -227 -187 102 230 70 30 -82 153 125 53 -144 352 199 30 -219 12 -79 -176 -205 -63 199 -135
4578 -135 -107 -244 177 62 -16 -18 -57 -5 -197 -216 58 402 123 -77 85 -99 -194 203 58 190 -165 -68 171
4601 171 250 92 -132 -155 -143 28 28 243 -228 140 -214 -146 110 -101 -134 -50 68 -11 1 82 -10 128 -36 128
4625 128 176 36 -163 28 295 294 -8 -192 93 63 -5 171 -68 152 -131 -221 131 16 -74 130 118 50 -207
4648 -207 104 214 7 14 -23 -148 -31 157 -48 53 63 67 362 45 -59 -67 101 -70 121 15 -178 -5 -140
4671 -140 -151 -116 -64 160 -38 48 -73 -128 162 79 130 -146 -9 -39 83 -34 -97 -141 -103 -27 97 10 -146 -51 296
4696B96n94K39pk23L6K86j55m7J60N2j35m15N32J3K9M2j17n6L73k26r2j1oJ46
4720A20j56m9L04j94J00j15J22k05K45k54%j91L73m29M18q9j77J93J10q3l5j92
4742a84J29L50l57N4P9J64k33k6K61k02j36M2O9l04L33K32l91J52JJ1j56K73p9
4765H2l89O13l15M3j5j85L61k66j62J7j44N83l28K46j33q0L2Q7k4j15N3Rp4K13
4789A09m1j11J56m6R6k21J02j17o6K33r6K1l0k01J78K74j27N6l56J55J1j87M79
4812B71k34q7l26M68j9p1Jq0K29k50J13j17J11j73J7l41N94P9k86J44nN8j57K3
4836c8K73m46J43J20j95K24m2Lj46J15O0K18m17J9j04L23o6j35J13RpJ4Q8l16
4860a90J58j26K04j5k72K17j6Q2L1Km88M71K23m86K88m4P2l36K80j18M3K6nJ30
$$ plain form
4696 296 -298 -59 -66 -289 -253 33 -122 -169 -9 43 -92 -507 25 38 67 109 -8 -64 309 83 -9 -20 -26 120
4720 120 -36 -85 219 25 125 10 132 -73 172 -82 -82 -273 100 -329 89 0 -177 16 126 43 8 -184
4742 -184 -55 295 -62 -8 71 235 2 -24 237 35 -101 -59 10 -294 39 271 -120 32 33 44 -112 161 82
4765 82 -307 306 -9 34 19 -166 195 -71 -233 -216 -360 223 -105 141 8 -72 -40 47 23 -92 -39 -30 -104 109
4789 109 68 -43 113 67 163 -58 44 -73 -139 94 -2 19 -11 -212 -34 240 113 169 -187 -32 -21 -208 271
4812 271 37 -50 -376 92 73 2 3 -77 152 -98 15 -102 9 -164 -147 -488 106 185 -101 43 38 96 -61 -38
4836 -38 235 -211 -68 52 -143 81 39 42 -104 11 71 289 -128 -109 -213 110 44 -91 22 31 24 38 126 -190
4860 -190 -32 -158 46 31 -241 -24 -40 42 73 75 -413 58 281 -205 83 39 111 -225 55 -63 -20 6 1 131
4884A31j09J54j94r1pJ56j22RJ09l37J0L99k92J63L7J17qk90M8J08J18k49O7J54
4908H1j16m9J41J18l3r1k07J06K38l62K21j9j58J99J51k33k58K50J18k75K42o2
4930BQ0J94l89K69o7O6n36M17K85l24k0q1L25k72J87K8j66nk34J48O7J28J44m6
4954B00q4n6j7n7j8J41j46pK29L6j70j68L55r3l78M15r2n5j07J15O4r1jj91J09
4979f7J76o8l37L05J8M8r2M9l0J01J48m52L01k40k18K34L03k07K12n6n5j78K69
5002A64l54J24K07j53K52l01l3J1J31j29Q6J42k0j86K41k77J98k52j85L63Kq5
5024e4J58j32J68j75k06L80j15Q5j92K04j73L72k05j30J15J29j44M7l56J69k54
5045c09J84K70k87J74J28j69j64L45k00m3J98l11J08m7J14K08j24q5k6J34j6j13
$$ plain form
4884 131 22 176 -18 -109 -116 40 -82 -73 36 -301 -291 108 -184 -21 16 133 125 -165 -117 -9 109 -140 -73 81
4908 81 -35 -84 57 175 142 51 -156 -50 188 -174 47 28 -130 69 220 -13 -271 -21 97 -178 64 2
4930 2 82 276 -113 156 89 155 -381 36 321 -3 -23 -104 221 -51 136 164 -2 -7 -241 -93 -26 102 246 200
4954 200 116 60 43 -14 -32 109 -37 -44 185 221 51 -117 238 145 -233 182 90 35 -72 43 107 16 15 -176 -67
4979 -67 109 41 -296 9 27 75 -17 32 2 103 251 -201 100 -140 -358 -124 179 -28 184 128 73 -105 164
5002 164 -190 -66 141 -12 240 -61 -94 -83 48 -81 5 147 127 -59 182 -95 103 -149 -334 29 31 -54
5024 -54 104 -28 140 -35 -241 139 24 109 -83 121 -52 320 115 -15 100 229 85 132 -224 -55 -309
5045 -309 -125 145 -142 32 160 -9 -173 172 -28 -71 127 -184 -76 -123 -9 199 75 -10 -36 98 82 -31
5067c1J59j80r2J37J29j80j3Q3m2J91j92j5jr4J0J41n5R0j6j98M33l33R4j58J7
5092a16l1O2j13K23j42j84K08R0j5n6J45j65J33J20k11j9N6J0Q2K2m20L18L5j34
5116a02J96J01m01J53J77l41J17J47j05m5N2J21j5M1o1J5j65MJ5p9K01N6m3k6
5140A3R6r4N8l5R8k99N3K98l15J31J17J74o47J81J92o0r9K05j80J01j21j5K60
5163A12j10K04j17K03l27l11M38K71j89r3k48J23j61L78j88L45m54l0K67p6J33
5184A70j81J8K43j06r7J14l96K13J28jq8Q8j99p5L8NK07J58n70L33j61J13J54
5207A08j59K28q3K2k44J24p8J22K20n82M21J07l16L43k63K6M0k52M70o40M20k28
5229a94K82l4j81L67K3k34K1L0k96R7q5K42k01J9M6L14k9k49J56j50kJ21k36M51
$$ plain form
5067 -31 128 -52 -144 -7 122 -58 -71 12 -30 161 -31 -46 -47 -141 -131 10 -45 45 29 -169 264 -69 25 -133 -116
5092 -116 -147 -85 -198 25 -117 -301 -93 -3 -18 -74 71 -94 39 159 -52 -71 -15 -5 77 99 -321 -3 32 -102
5116 -102 94 195 -206 -53 124 -217 -100 47 -58 -103 -51 70 55 96 35 50 -115 -111 -96 -175 26 82 39 13
5140 13 109 15 73 38 136 -163 -110 188 -127 4 121 295 -352 -171 21 -39 -138 67 -113 -12 -133 -148 112
5163 112 2 206 89 292 -35 -346 92 363 174 81 -167 -44 -205 173 -15 330 -124 -154 113 37 170
5184 170 -11 7 250 144 47 161 -235 -22 106 105 17 105 -94 -169 -131 -126 81 239 -331 2 -159 -46 108
5207 108 -51 177 94 116 -128 -4 -82 40 260 -322 99 206 -110 233 -30 -4 36 -216 254 -386 34 -194
5229 -194 88 54 -127 240 263 29 50 80 -216 -119 -204 38 -163 -144 -98 216 187 -62 94 -56 -58 63 -173 278
5253B78l12k13J99K35k26m4r5J10Q2J09l01R4k60K23K68j81qJ19j42J56QO1k77
5276a17j27M64j73k03qJ55j01k33L07K45l13R6q8K91R8k68J00P8k31P1L3M0k13
5299i7K79l49K52m2m8J21l03K07L7k30K63k38N9OR1K6J07j56M7n3K5q1K02k29
5323a04Nk7L4J87n5r8n0K80q2k21l36N69k7k01j75N24j05l06L12k07J69j71P7
5346hJ19j74J94K1L7k21l15K70n6J72R7j09j25J58J64l20K76l65L94m28M31l51
5368a39J05j5j33J82J76r8k86J55J57P3j63q7QK10m75M78j19j64K90k64L28k63
5390d4J24j66m6K52j97K26k21M7o8J46J2k53O4K91J57j43k11o6J35k97l7M09k51
5413a37L9J02K38m39K62l77NL43j01R6k6k68J80K63k25R6q9J04N7Q1l79N7K49
$$ plain form
5253 278 -34 -247 -48 187 -39 -83 -178 -68 14 123 -178 -84 -344 -121 147 -34 -42 77 -65 91 99 160 -117
5276 -117 -244 220 47 -156 -164 -9 -110 -343 -36 209 -104 -8 -96 195 293 25 125 203 -28 43 76 116 -97
5299 -97 182 -167 85 43 -5 116 -187 20 57 -173 90 -148 -89 -83 8 34 141 -15 32 -21 4 -77 125 -104
5323 -104 -99 -126 -92 95 40 -58 -108 172 90 -131 -467 102 75 -126 -301 223 118 -188 124 -83 86 -85 -8
5346 -8 111 -63 131 152 189 -32 -347 -77 -133 39 136 27 -98 60 224 -96 180 -185 209 -219 212 -139
5368 -139 -34 -49 -182 0 176 78 -208 -53 104 177 14 -73 -65 145 -330 148 29 -135 155 -109 219 -44
5390 -44 80 -86 -132 120 -77 149 -72 -25 -93 53 65 -188 -124 167 324 181 -30 -96 39 -258 -295 114 -137
5413 -137 -98 4 242 -197 65 -312 -307 36 -65 31 5 -263 -83 180 -45 51 -38 66 123 204 -175 -118 131
5436A31K0j21J96k81O3J57l99L01k07J95j06k9j45J66N2L5K7oJ9k96M30k67Q4
5459A9J20P0l25j58K65J30k10Q8J70k71j99L93j02J14R2j6j06J35l72k7J13p6
5481a53R1K0K39k60J0R5j58P3q5j32L22m1m5J49p7Q1j98J72j25O7j81J00j80L91
5505A75l44K17j5R3j94K43j62k6N5m6Q7l05J24j62J48J09k02J35P3J48l36J70
5527a5j29J92j11K9QJ62M9%p4N2k42k8K85j62O7k31L96k02J14J39n06J80k73j29
5551d29K83o3J96k1p0O0J48P8l37L63j50j23J4j00M1J82N2k62o2L91j49k0j55
5574a33M9L2j38K33p3J82k9j08j2Q2r0j51K03J18j69J88k43J40j87J37l1Q6j53
5597f7J46p3j76L37k27J19k4P6j56k23N5K29j50J91o1j07K04q4J23j22m7j07J71
$$ plain form
5436 131 151 30 226 -55 8 165 -234 67 -140 55 -51 -80 -225 -59 -7 28 55 49 68 -228 202 -65 19
5459 19 139 209 -116 -274 -9 121 -89 -1 169 -102 -301 92 -10 104 196 180 74 209 -163 -190 -77 -153
5481 -153 -62 -42 197 -63 -53 42 -116 -43 -128 -260 62 21 -24 125 48 129 -69 103 -22 45 -136 -36 -216 175
5505 175 -169 48 33 126 -68 175 13 -13 42 -4 83 -222 -98 -260 -112 -3 -205 -70 3 151 -185 -15
5527 -15 -144 48 -63 -34 -26 136 185 185 111 163 -79 -107 178 16 83 -148 248 46 160 299 -207 -27 -300 -429
5551 -429 -146 -209 -13 -34 -104 -44 104 182 -155 208 58 -65 -51 -151 -110 72 124 -138 -200 191 42 22 -133
5574 -133 -84 -52 -190 43 -30 152 123 15 3 85 -5 -156 47 165 -4 184 -59 81 -106 31 0 86 -67
5597 -67 79 6 -170 167 -60 59 35 111 -45 -268 -213 16 -134 57 -4 -111 93 9 132 10 -37 -144 27
5620B7o0j45K7j47L50j78K39rk50O1J07o1J42l64J68O2J52k97K06j7l19K43J4
5643d9K4K23j18j68J77JR7m51L3K53N8m7k65K73pK4j67m6O4L7J80j19q1K4P1l9
5669a8o9L1J72k53R8O6r6J46LOP3pm05k9J69J20j50j06K08LK1k66O2Q5N68l74
5695E8j51P9Q8L1%j92o4k0J34K38l3k64K10j36L85n86R2p4L42M1o3K71l83j05
5719a02n1k25M81j2J35k19j72Q4k8K04n4K18k62rJ74j68N3j33%J53N0k5P1k83
5743a20Q1L4J45j28J48J02K4m11OL78k22j68K35j10q3J23J27o3kP9k58L05k60
5766c8r9Q5J98j00k1J24L8n21L96j3k04J46L68l95J13r7pK0j6K40j88j14L22j46
5790I1J85m80mJ31K9n0j78K40k17K15J71Rk56L9K13J27l21q2M52l75L25m30J49
$$ plain form
5620 27 -33 -178 -151 -298 52 -126 113 104 -146 -85 22 -39 103 -261 -93 -31 121 -176 30 13 -306 -63 -49
5643 -49 -25 198 80 -88 89 90 187 -264 -231 22 80 33 -232 41 34 58 -109 -155 -91 -54 126 7 -74 -50 21 -18
5669 -18 -87 -56 116 -137 -39 27 -69 77 80 86 159 152 -253 -282 -113 7 -143 -249 -41 -38 -17 -283 -221 -136 432 58
5695 58 -93 -14 74 105 105 -87 -151 -171 -37 201 168 -96 114 -22 363 -223 -131 -205 137 178 115 386 3 -102
5719 -102 -153 -378 103 91 226 7 -165 -81 -109 95 41 259 -3 -12 162 -6 47 -86 -86 67 117 92 163 -120
5743 -120 -39 -5 140 12 160 262 286 -125 -119 259 37 -131 104 -6 -89 34 161 98 96 175 -83 222 -38
5766 -38 -137 -52 146 46 25 149 187 -334 62 49 -155 -9 359 -36 77 -20 -27 -7 -23 217 29 -85 237 91
5790 91 276 -204 -208 -77 -48 -98 -276 -36 -253 -38 133 142 -114 -75 138 265 -56 -138 314 -61 264 -166 -17
5813a7Qj07K94j16J9j22r7J42L1P7j73k22K56Q6kq3J00k95K55k96L65j36j3N7
5837A1J8J60k06k2l4K7j3k0K81k03k29N77n23O3K59j75J2K3L4K15l06Q9l5J84
5861A87j6j75j55J41j31L43j22n0j99J48jk36J23K1K11k57M9K07J20j50j4R0k0
5884A14l6l12L61l65QJ92J26j38j56K00K64j48m8k90K64m76N84J23n02K89l11
5905b57J04J00o6J3j56L26l6j29J77q8J22LN4k27O7r5P3J00J85l80j55J92j02
5928a75JK15l43J84L74k91K05j06l01L35j29J67j49L6K84k09l88M00n1L5r4j13
5950a13j06L37k44J28j76%O4j5j88M12Pk24J20j12j01L90m29J29Q8J50k06l9L00
5973A72k1j20m0O9n9r2J27J1J26l76K68l77L91j72J53n2l25M62k91KJ55J70o5
$$ plain form
5813 -17 -9 -116 178 62 81 -41 -138 4 35 112 -61 -283 -27 59 57 -26 74 -221 34 -262 103 -33 -46 11
5837 11 29 189 -17 -39 -73 -46 -59 -79 202 -1 -230 347 -176 -113 146 -29 -17 6 40 255 -51 38 3 187
5861 187 171 -4 -159 -18 -149 194 72 22 -177 -29 -30 -266 -143 -122 89 -168 -119 88 208 58 44 134 114
5884 114 78 -234 127 -238 -230 -38 88 -50 -206 -6 258 110 62 -228 36 -440 144 267 -235 54 -257
5905 -257 -153 -53 -119 -106 -262 64 28 -101 76 -12 110 113 167 -60 7 -88 -15 85 270 -110 -265 -73 -175
5928 -175 -174 41 -302 -118 256 -35 170 64 -237 98 -31 136 -13 23 307 98 -290 110 59 94 0 -113
5950 -113 -219 118 -126 2 -174 -174 -110 -125 -313 99 106 -118 2 -110 -211 179 -250 -121 -33 117 -89 -128 172
5973 172 151 31 -9 60 1 -91 36 47 173 -203 65 -312 79 -93 60 8 -317 145 -146 -144 11 181 116
5996A16p9J73k02J3j29M2K86l27K73k78P5J89nRr8j1k44K59r8oR4m4M9j60M1J83
6022A21k39J75n9j99K91j62l1K78J42m74K16Pk9K12j48P5R4j66l73P6j6K02J77
6045A70k55M7k15N55k89j1j84l32M17l9J13L9r4L39j75J8p1K16l40K09j32N5K78
6068C19n85K75Qn8j03J64N1j31M4J6j86J99m0O0j90M07K3l15J24k73J74j6k73
6091c06J88J15Q8j27J39K22p8k93k0J23J90l57K54k14k9J10J19j94R0p8K41r6
6113H7l65M6L78k35K9n1K71k06o5J21k8K28j51o3K3l16M34j58j38K13k1m5l7K11
6137A62K2o0j84j9NL47j27r2J08j25p3j4j15K20J92j58k72M74j51J35m04o3L69
6160A77L3k61n6P9m3o3R9J48k03J72k41K36J0K8k13j8J59j2k71J80J09j48K44
$$ plain form
5996 116 37 210 8 21 -108 -66 220 -107 166 -112 -37 152 147 156 58 47 -197 62 -36 -42 52 8 57 -103 -62 121
6022 121 -118 57 -2 -201 90 -72 -103 175 317 -157 59 66 37 249 101 176 270 104 -269 -193 -209 -7 170
6045 170 -85 -38 -253 302 13 2 -182 -514 -97 -136 -23 16 -78 261 86 104 33 249 -91 118 -14 41 319
6068 319 -266 9 17 -41 -144 20 71 -60 -16 0 -186 13 -27 33 -157 250 273 -42 82 -191 -17 -33 -306
6091 -306 -118 -3 85 -42 97 319 241 -52 -72 51 241 -116 138 -76 -105 5 124 -70 20 -58 183 87
6113 87 -278 -232 146 -89 -60 -111 160 -46 -111 10 -18 210 59 -4 19 -297 137 -21 -159 54 33 -12 -49 162
6137 162 184 124 -60 -79 -74 273 146 54 162 37 -36 -50 -165 55 247 89 -183 291 140 275 -129 -192 177
6160 177 210 -51 -107 -28 -71 -134 -35 113 -90 82 -159 77 87 115 -98 -116 43 31 -240 -60 49 -99 145
6183A45o9j83K67m07M8J24r4K08L6k65o3K86L7k13l4K5J86j65p0M1K52j07j32
6206a47J86O6k99K37p3jk1O0RK19j33p7j62K13l6Q8o6J73j34j03j89L55M4n34
6230c25L99J32l23P5j37R0L43m31M16j90r5Q4j43P9l7O9R4q2J74n13K11Q5o7J93
6254A01j64j0J86q7l3p5J29p9K08j69p2K29j32j1j16J95j02j90J76j84R4J14J20
6277A28l73j5L02J11r0n7J30k40L81m46J43Q3L46n21J89Mo1l7l1Q1r2J52k00J97
6301H4L5j48P1P7q1m2J05k07k2K0J59l52J43K9n2J40N7L3j88R5K1K14o5k24k1
6326a19Q7k5K35k78q6L02k7j67k5J18j01l4L1n2K01j67L38k77J40k46K84j37o1
6349f6r3L95k66%J93J3j85l6j34K54j45J52k01J16nj45P3q0M42k26j20K6K0k1
$$ plain form
6183 145 76 -107 160 -247 -199 -75 -169 39 75 -190 -253 33 70 -143 -177 -152 34 -131 -201 -160 92 -15 -147
6206 -147 39 105 -194 43 -30 -31 -52 8 17 236 103 26 -136 77 41 129 63 236 102 -1 -190 165 209 -325
6230 -325 74 206 -117 -42 -179 -89 254 -177 239 49 -46 38 -105 -26 -63 6 100 18 192 -321 -110 -25 -92 101
6254 101 -63 -73 113 26 -7 -82 47 -32 176 7 -65 164 32 21 -95 100 -2 -192 -16 -200 -106 8 128
6277 128 -245 -260 42 153 63 6 136 -104 277 -169 -26 57 403 -118 71 75 14 -23 -54 27 -65 87 -113 84
6301 84 119 -29 42 119 38 -4 101 -106 -128 -108 51 -301 -158 -129 -181 -41 16 49 -139 -44 -23 191 126 -98 -119
6326 -119 -32 -57 178 -100 -186 116 89 -78 -103 15 -86 -120 -89 -141 60 -107 231 -46 94 -152 132 -5 -66
6349 -66 -159 236 -30 -30 163 176 -9 -45 -179 75 -70 82 -119 -3 -8 -153 -80 -160 282 56 -64 -38 -18 -39
6373c9r2j07J29K52m7j96L72n04L81j97j04Q6j41K37J12p8kk56L20j76J80j43
6395a3P2j03L37l81m0K83k49M9R4p4l1k0Q8K80l28J52k11q2J03M1j06P7L28P7
6419C43l05K5k92L02J43j53m4J33j51j01O5J46N1m20K88j7O8O0R4l72R8Qq5o0
6443a76M89k81J2k08O0K93m26M06j00j06O2Q0k04j27K27j68K22K43k70J55k73
6464i0k77J97K01p7j13M17k84J91j99Q6j33J42K6L8Q0l03K57k64j5p1K12Pn8j26
6488a56N23k41j45P2l6j0J56j92j54L36On00L91k1j53J9K01k54R3J64j06Q2m29
6511c54L37Q7r0K2j78K9Q0K6J23l07Q7J46J28k6j59K37j77q4P8L1L5M4j69k15
6535b69J11R7m9K4J20J21k56L49k34O5j70J32n7k10J47J85l28L27J8l2n2l66J82
$$ plain form
6373 -39 -131 -238 -109 143 96 -100 272 -232 149 -48 -152 -66 -207 30 142 64 62 -194 126 -50 130 -13
6395 -13 59 -44 293 -88 -128 155 -94 -45 49 -25 -56 -76 12 292 -36 116 -95 -177 -74 -33 -139 -62 266 343
6419 343 38 63 -229 73 216 63 19 152 1 -100 -35 111 162 -258 30 13 81 141 235 -137 -39 -31 -116 -176
6443 -176 313 32 44 -164 -104 189 -237 169 69 -37 25 105 -99 -226 1 -167 55 298 28 183 -90
6464 -90 -367 -170 31 -46 -159 258 -26 165 -34 52 -81 61 87 125 205 -98 159 -105 -120 -191 21 28 -30 -156
6488 -156 367 126 -19 53 17 7 163 -29 -183 153 159 -341 50 29 -124 -105 96 -158 -65 99 -7 75 -354
6511 -354 -17 70 -20 2 -176 -147 -67 -41 82 -225 -138 8 136 110 -49 188 11 -73 5 36 71 115 -54 -269
6535 -269 -158 -61 -110 -86 34 155 -101 248 14 79 -91 41 -16 -226 -79 106 -222 105 123 91 39 -327 -145
6558a45L27j93m0l25P27n46L44J58l12J82j83O6p8q9l8j2J16K60l32j41J25J16
6580a3M4o0jl53M02M0j11rj66O9P5L60k38J5J31l7k32K27j78L58l23q1J75k40
6604a46J44J14J69l65L0N3Q8K8k35m0K97n0l37K98N5o8j36K0K47k88j33K96n4
6627a3j5K6J29l67J71j5J49j35k78K39K80k09P4k46j2P0j8K66j32J17l22M66k18
6650GJ88l75L27J61p2k39n5pQ3j14lJ51j21R1K1L57n22j36L51p9o6j7P7m6j09
6675a47J37N8k2J08J97l04mK75l90R5j2N4K9l25M41l94K2L82l72J90M0k38kK46
6699F4j71j69L05j16L8rN1n0K51l75L02L6k33p2O6oN7n4K10j8p2L5l1r1o6L58
6725B40j14p0j53K74j96L3L2k0l21K93j31J40j18J30j97p8L85l75L52n6k42J99
$$ plain form
6558 -145 182 -11 -51 -376 351 -195 149 307 -5 177 -6 60 -18 -107 -145 -157 -41 219 -113 -254 -129 -13
6580 -13 31 -29 -30 -383 19 59 -52 -61 -227 -158 -83 277 39 54 185 148 -84 143 -35 323 0 -81 94 -146
6604 -146 -2 112 281 -84 -54 -1 87 115 -120 -160 137 87 -250 48 103 35 -101 -81 166 -122 -255 41 -13
6627 -13 -28 -2 127 -240 -69 -84 65 -70 -348 -109 171 -38 36 -210 -222 -152 -170 96 -36 81 -241 225 7
6650 7 195 -180 147 308 236 -3 -58 -65 18 -96 -99 52 -69 22 43 400 -122 -258 93 14 -52 -69 8 -38 -147
6675 -147 -10 48 26 134 331 27 23 298 -92 3 -9 45 74 -251 190 -204 -182 200 -172 18 58 -180 -182 64
6699 64 -107 -276 29 -87 -49 -58 -7 -57 194 -181 121 157 -76 -148 -82 -88 -31 -85 125 107 35 70 39 -52 -118 240
6725 240 126 56 -97 177 -19 14 46 26 -295 -2 -133 7 -111 19 -178 -256 129 -246 106 50 -192 7
6747Gj29m7J8l5M58l19k6K88p8j56j04J74j2k94J32K63j63j10j80J38QK04R3O3
6771A93j89N7k09J45K4K68k13O3n7l04j73M63j49K0j33Q6k6K73J3j66N7j60K76
6794A59J73n15J08J57pJ68j89J28j46k16P8N1Q9N3K2l89M00o2K41l49k8J69j85
6817i0K4j85L26j24K5q6K21j98j79L32K52l36m4Q8m51M33Q2l16N9J72L60l68j56
6840a59KK9o0K42m1j50M31n57K44J92m10L44k66K21l8M0n47K37K10K1J17K27k88
6863D1l6l1L20l82J69K22m30J24L05m04n7J7J60n1j72J84Q7q5O9J71j74j12K05
6886A40rK5o2ll5o3k55L69l11L39K3k92J19J19k13j87K96m5N8j5K27j41j06J67
6910A45m2k08k03K2J85L2J29j37J40K1j35J12j12N3J18O4k99j41R2K60m1j73L60
$$ plain form
6747 7 -122 -169 -151 -186 272 -47 -73 215 137 -19 -123 51 39 -255 -123 140 -23 -133 -313 -175 -167 37 130 193
6771 193 4 61 -148 -3 21 289 76 139 82 -222 -395 68 -81 -61 -194 -108 -134 139 152 -14 43 -117 159
6794 159 332 -183 -75 82 75 243 54 182 36 -180 -102 -51 38 91 113 -276 124 62 303 -46 -74 95 -90
6817 -90 -66 -251 75 -49 -24 -110 111 -87 -266 66 318 -18 -62 26 -425 8 90 -226 -167 5 365 -3 -159
6840 -159 -157 -128 -188 54 13 -137 294 -263 -19 173 -237 107 -159 62 24 64 -483 -246 -36 -15 102 329 41
6863 41 5 -26 294 -88 81 303 -127 -3 302 -102 -159 -142 18 -33 -205 -21 66 -19 50 221 47 -65 140
6886 140 131 156 94 91 56 -7 -262 107 -204 135 158 -134 -15 104 -109 -296 0 -45 13 -2 225 84 -22 145
6910 145 103 -105 -308 -286 -101 -69 60 -77 63 84 -51 61 -51 2 120 184 -115 -256 -164 96 55 -118 242
6933B42k98J03p5P8j00J05j20k78K78j84K88j58J31J14j94K8O2k70K31o5R0K90
6955B98k55k0J66k16r0N9J74j89P9J21nj05j08m7L8J82k7j02L27j70J45k61l6
6978d2J23j8l1O9k19M98m02o6J98l5J30r2K46l08k19J97p4R7J54j76k05P1K38
7001A34m35K08J18Q5l8Q2l49K26k0o1K08k71P8r0K20j75J80k58N2R5J05j53K3
7024c6L72k32j08m7j41nO7M17k83J62j65j90K5Q9K72Rl61K70j48J85j21p6Qn3
7048i0l6J38J37j90M5Q1N5k13L64k54j86J91l1k1O7j74j72M15k42J47N6P8R6l04
7072d3j41M0L46m52J03J85J19o1m3R1j21J42j27J70n4m65M13k02j06L56k47R4
7094cj49K21l44L92J28k24L8J53j21J7J0j82K62l70M9j8jL3J1K92l06J66r8k57
$$ plain form
6933 242 -56 47 -28 50 -50 55 -65 -343 -65 -249 39 -119 12 126 -68 -40 22 -248 -17 -82 8 298
6955 298 43 23 189 -27 -117 -58 116 -73 6 127 122 17 -91 -138 -100 82 55 -47 280 110 255 -6 -42
6978 -42 81 63 32 101 -118 380 -22 -88 110 75 205 113 359 51 -168 29 -45 52 206 30 -175 -104 134
7001 134 -301 -93 25 110 72 154 -195 31 11 -50 158 -113 -35 -125 95 -80 100 -158 -106 -11 94 -59 -36
7024 -36 336 104 -4 -51 -192 -197 -130 287 4 166 1 -189 -164 -75 197 206 -155 115 -33 152 31 -45 -37 -90
7048 -90 -126 12 149 -41 4 85 140 -73 291 37 -149 42 11 -10 57 -117 -289 126 -116 31 87 165 261 -43
7072 -43 -184 -144 202 -250 -147 38 157 96 53 144 23 165 38 208 154 -311 102 -100 -206 150 -97 -3
7094 -3 -152 69 -275 117 245 21 59 212 91 108 118 -64 198 -172 -123 -141 -142 -109 -98 194 -112 54 -44 -301
7118c01L41p9P4k67L04Q1L4k45m4p6K0J65r1J04l30L88q5J05k60L57l97j1R2L81
7142B60m99L30l27J32J7J90j24J27p1j4J32j96p6q8L16j19o3N7k45L99j0m23L70
7165G5l01O15n14K33k30J63r9K25k23P8j30L95l83K47J8J18k53m15N05j66J51
7186A09j62J88k98K44m5l4n4J75Lk19M01n06L36k36o0L93k64K1o9l9K32k19R2
7209a1l0J09r4m7K59j28j52LJ87r5J93o7j20m8n3j96K50J23l6j80m8J93j82j33
7233c03K48pJ0O4r0N5J08j6J00k1l03J90j9j70K29OJ21k14Q7l18L55O5k11j39
7257a73J20j8L3P9J6Q0k57L4J29K49n70J97o7JL22k97Q7k70K34k6L5J56k19j53
7281b78J80l1M6J6J64N0k50J72j82J13j90j40J11K43n7L6K09n7p8M5M8l72J9K96
$$ plain form
7118 -301 40 -39 35 -232 72 153 187 -58 -102 -178 -158 7 -84 20 -310 78 -7 98 -162 195 -202 -213 -121 260
7142 260 -239 91 -236 -104 -87 103 -21 106 35 21 153 -43 -119 -207 109 -10 -73 -16 -261 138 128 -295 75
7165 75 -226 389 -125 108 -122 41 -58 167 -56 22 -108 287 -96 151 169 287 34 -381 124 -42 109
7186 109 -53 135 -163 81 36 2 -52 123 126 -93 308 -198 138 -98 -158 235 -29 -8 -77 -116 116 -103 -11
7209 -11 -41 68 -26 -73 186 58 -94 -91 96 1 194 127 7 -41 -94 -290 -40 83 47 -133 -181 12 -170 -303
7233 -303 -55 -62 -52 12 -78 -23 85 69 169 148 -155 35 16 -154 75 81 202 -12 75 -243 112 177 -34 -173
7257 -173 -53 -71 -38 41 57 137 -120 -86 43 292 -278 -81 -148 -147 175 -122 -35 -305 -71 -97 -62 94 -125 -278
7281 -278 -98 -129 -83 -67 97 147 -103 69 -113 0 -190 -330 -219 24 -33 3 212 155 77 122 170 -202 -183 113
7305A13j12k26J86kq1N8J11M6K05q2k07K17k60J64J65k00j86K36l47L7K99K7p4
7328H7M1J64l60J68q%J42k68j63M6J27j64J65J15M3k13J27n9k24j9L14L63m45
7351b1J18k41R7J12N0j16M0l42q3O44k55J4O3j53K86o8j99k0j07N9L97l9l03R7
7375C0J16p5M3j1j05K08k30Qk01j32J99K17J49j35k54M11n54L69j91L37m26K93
7397F6K79k92o2j51m1L31k89P3J89j3J05k2J95k95j35K69k20J86k76J46p2k54
7419b83M06m13R4J71nJ30K34n30L5M57l31j12P3R3l2Q7l07K32J92j97p7K30j45
7442BJ41j09l84K75L7N7J34j46K59m39K31N8n09M63q6m9k3j64J24L5R9R8j97Q9
7466dj90K87j05j13K03o7J51k04J34k66j03K63J0l07N69L7n13J58j75O3j6M9Q4
$$ plain form
7305 113 1 -225 -39 -41 -122 -64 47 93 298 216 9 226 -34 130 295 95 -91 145 -202 -165 134 161 87
7328 87 128 292 -68 100 92 92 234 -34 -197 -151 -24 -188 -23 92 135 -78 49 -10 -234 -253 61 424 -21
7351 -21 97 -144 -47 65 115 -1 39 -303 -386 258 3 17 80 -73 213 145 -54 -74 -181 -122 275 236 -67 30
7375 30 146 71 114 103 -2 206 -24 -16 -217 -349 -150 67 216 81 -173 238 -316 53 -138 199 -227 66
7397 66 345 53 -9 -160 -201 130 -159 -86 103 90 195 173 368 73 -62 207 -13 173 -103 43 -29 -283
7419 -283 123 -290 -196 -25 -30 100 334 -196 -161 296 -35 -147 -74 19 -13 74 -233 -1 191 -6 -83 147 2
7442 2 143 34 -350 -75 -38 19 153 7 266 -173 58 116 -393 70 -16 -65 -88 -252 -128 -93 6 104 -93 -4
7466 -4 -194 93 -12 -125 78 11 162 -42 92 -174 -277 -14 -4 -311 258 295 -218 -60 -235 -172 -188 -139 -55
7489e5K64k26L4p7J48j72j6K55k71N8k06K36K2K8k03M23l03K28J36j97k00l6J56
7512B6k13K40k53M40l07l1L5k24J43Q7M6J46l89M32J9k51p8n3NJ76J66k81J04
7535a5l09M45r4k10j68R2L56j70j36M81m07Q1k46J13L96k50K30k67m9J00l1N4
7557dr0K61j74O9J56j66k44K52l2j38K98k81j30L2K89j95J36l47K21K86j99J56
7579A56k66J71j19o7P4P4MJ3Q6l23J92l1lK08k07j32L20p7j16J43j14k3K41j93
7603A1j52J73n42N11l0R1J08k48K10pm48M85k83J5J38k67O12l72j04K42J04l58
7625a11R2J34m3o5o5J03k4j92M3K32k12j53J29m3K88k99K67k42K72J26j96Rk18
7648a68K98j81J37k21K66o7J37k56K5K3K08k61Q0J10l07p1L86j50r6J21J63j57
$$ plain form
7489 -55 209 -17 17 -60 88 -84 -100 155 -116 -58 -264 -28 -6 22 -181 242 -61 167 303 106 -94 -130 26
7512 26 -187 53 -200 240 -67 -98 -63 -287 -144 -57 -11 135 -254 178 197 -54 -132 -185 -180 -4 162 -119 -15
7535 -15 -324 121 27 -183 -351 -259 97 -73 -209 272 -135 -54 -300 -187 209 -41 189 -78 -127 -27 -58 -4
7557 -4 -94 167 -7 62 218 52 -192 60 28 -110 188 -93 -223 -191 98 -97 39 -308 -87 199 0 156
7579 156 -110 61 -58 -125 -51 23 27 40 126 -197 -5 -36 -39 169 -38 -170 150 73 -43 100 -14 -37 204 11
7603 11 -141 32 -510 1 -29 62 170 -78 132 125 -323 162 -121 -106 32 -235 377 5 -99 143 247 -111
7625 -111 -19 115 72 7 -58 45 21 -171 -128 104 -108 -261 -132 -175 113 -186 81 -161 111 237 41 50 -168
7648 -168 130 -51 86 -135 131 64 201 -55 -30 -7 201 -60 20 130 -177 -248 138 -12 -108 13 176 19
7670A9R0j52n8J05r7J82r3j17m4L63K3l81P0K9k52M90j10r3lJ83j36N9j83J40
7694C4j63K23O5j50j18L03j98LK37j80PJ47k27j6J42K7k45q0K97J5J14k60l1J62
7718A08k40p1L37k28K6M6q4R6N9J94m29O1K2k5J01j0j66J94K78m78K85j14J77
7741A39m74K20L72k00p6k40J50J59J39k59R6r%k72J29j00K06Q7j00q4J54O2l5
7764F4R7j70j8J56l73J62j34J39j34K3L38N1O3l34K53k51p5J75j20r6K96k53J05
7787c6k05j11K20K70l65J19k75M64j7k60L24r6K6J10l08K45n5J40r1q8J58l22
7809a53L43j06J64l94l2K00K73l21Q6k68N1L6K56L3k46J13J69n00N22o8j2j16
7831C0L8j79M01j96j61J43p3K8j09J46r6J38k35M9K28j98J05j06k08M18j90N2
$$ plain form
7670 19 109 -43 -101 4 -93 89 -4 -121 -165 198 221 -160 -90 -61 -313 177 67 -26 -29 154 18 77 -106 34
7694 34 -129 94 159 9 -109 194 -4 -1 236 56 63 210 -17 -33 109 136 -109 -189 108 123 237 -23 -54 108
7718 108 -132 -203 134 -94 -68 -22 -106 -10 49 243 -186 -125 -103 -128 -27 -37 -203 -9 269 -209 76 -38 139
7741 139 -335 -115 257 57 -19 -259 -109 50 189 -70 26 17 17 -255 -126 -226 -20 67 -33 -117 37 99 64
7764 64 161 -9 -27 129 -244 -82 -216 -77 -211 -188 150 201 264 -70 183 -68 -143 32 -88 -184 112 -141 -36
7787 -36 -241 -352 -132 138 -227 -108 -383 81 64 -196 128 32 58 168 -140 105 50 190 99 11 169 -153
7809 -153 190 84 248 -146 -178 22 295 -26 60 -208 -157 -121 135 168 -78 35 204 -296 226 158 146 30
7831 30 68 -111 290 94 -67 76 3 31 -78 68 -28 110 -125 -76 152 -46 59 -47 -255 163 -27 25
7853B5j45J87m6o2O9p0J36j49J40j40J10k82K76J07k20L36m50J11L68l66J14j48
7875i9K46k66J84j25P6J13j13L6r5J21n8K10k69p1K59n0j35M6O8j66O2J4mkN8
7900D0l4k00J73Q9j16K04j07P7J81l08j41J25j93K97k81J36K11q6K41l42J5m0
7922e9q3O1j9o7Q6q9R8K32l47L36k8p3k43J89q1N0j35J72m08J69L20R2R5l66K1
7947g7L72l46Pl6J76m5j30J14j11J02k23K2L12lm23L80n8j12J48J67m27J70j64
7970a85R0Q9N9J40K44m62j65L36k71J30j61M05m52L45j92j45K98k68K43J5l31
7991b38L36j00L50k11Lqk53K00O2k40j3K93l70N1K23k10N4J10J65k56R6o2j26
8014a44K19%l2l1j3k2J33j69M2j21J87J0l6p7j03K21j82J32J10k83O1J52j14M8
$$ plain form
7853 25 -120 67 21 -41 28 -42 94 -55 85 -55 55 -227 49 156 -64 272 -178 -67 301 -65 49 -99
7875 -99 147 -119 65 -60 16 129 16 52 -43 78 20 230 -39 -110 149 99 -36 10 78 -88 -26 -12 -16 -18 40
7900 40 6 -194 -21 68 -48 156 49 126 307 -1 -142 -17 -210 87 -194 -58 153 67 308 -34 -19 -59
7922 -59 -142 -81 -100 -167 -81 -170 -72 160 -187 149 121 48 -195 -6 -87 -37 -172 0 -408 -239 81 173 268 -98 -77
7947 -77 295 -51 -44 -80 96 51 -79 35 -76 26 -197 -175 137 134 -289 91 33 -79 69 236 -191 -21 -185
7970 -185 -95 -6 53 193 437 -25 -190 146 -125 5 -156 249 -203 142 -50 -195 103 -165 78 93 -238
7991 -238 98 -2 348 137 140 132 -121 79 141 -99 -112 181 -189 -138 85 -125 -71 39 204 -52 44 -18 -144
8014 -144 75 75 43 12 -1 -23 110 -59 -17 -138 49 59 23 -54 -157 64 -118 14 124 -159 -98 54 -60 -12
8038a2K00k51j03K95j26j51K07j71K17k90RK45j53J92j27k0lJ62k34K40l04L53
8060A75l06K75j07M1kJ38j33M3j43J36l3r2k5%j4K65N1P3o30M17o8J96m71L41
8084A27l54K9K03q7J1K53k16P5j32J47k75J78J58p1J80k20J44j66J49l33M25r0
8106A35o0Q6m63M37J33m93L12J28k39k69J50L16j04j7j1Q9J49m81J43M55j68L3
8128B61l54J42J67l43Q3rN1j7j6J42K29k73o9L04k48k38L48m65J95J10L9l11J63
8151a09P7K25j89K7l85N75j98K5L8J38k34J28k13j2L2N8j84J49j38K50k14K35
8173H1K09j02j86j48N30j11j42q1J5j7r1J46k45M0J28O6k40N1
$$ plain form
8038 -12 188 -63 -166 129 3 -148 59 -112 105 -185 -176 69 -84 108 -19 -39 -42 120 -114 126 -178 175
8060 175 -131 144 37 78 76 214 81 124 -19 117 84 -8 -33 -33 -47 218 269 342 -288 129 61 257 -214 127
8084 127 -227 -198 5 -82 -71 182 -34 41 -91 56 -219 -41 117 46 226 6 150 -16 133 -200 225 135
8106 135 75 161 -302 135 268 -225 87 215 -24 -293 -143 173 69 52 41 130 279 -202 -59 396 228 261
8128 261 -93 49 216 -127 -44 -53 -2 -19 -35 107 336 63 -6 298 50 -188 160 -305 -110 0 39 -272 -109
8151 -109 -32 193 4 31 -354 221 23 48 86 224 -10 118 -95 -107 -75 -17 -201 -52 -190 60 -154 81
8173 81 290 188 2 -146 384 273 131 50 65 48 -43 103 -142 -102 26 92 -148 -97
8191i7
$$ Imaginary data points
##PAGE= N=2
##DATA TABLE= (X++(I..I)), XYDATA
0@%%%%%%%%%%%qJ6j6J6k4L2l2M0n4O2p2Q8j04J20j44J68j92K24k57K96l41L88
33B06m37M93n56O26p05P87q77R78j088J208j337J480j638J808j992K196k421K668
51A399k941L240l571L942m361M837n378O007o746P621q684J0010j1717J4006j7257
66i593K2272l1087N1123j82444o048K66992j46052j05992P8085J36619k5990n1437
78c552o50P7744L2586n3319p7685N4840O4062p5026q8568P1854N7822q5942q6305
91a12139O4745O9918o2334o5720P5102O8028l8361k9689N5427M8835j9966m4660
103I186K844L4824M527m6276m1018J5012J9866m0845k7949M3041K8688k2398m486
116b4984K9010J9480q068l939K2364J5633k2829l2806O31K3785o053l3928L97
$$ plain form
0 0 0 0 0 0 0 0 0 0 0 0 0 -8 8 -8 8 -16 16 -16 24 -30 32 -40 48 -56 64 -80 88 -104 120 -137 159 -182 206
33 206 -231 262 -294 332 -373 414 -463 515 -573 635 -702 778 -860 948 -1044 1152 -1269 1399
51 1399 -1542 1698 -1873 2069 -2292 2545 -2833 3174 -3572 4049 -4635 5375 -6342 7664 -9593
66 -9593 12679 -18408 32715 -149729 -155777 111215 -34837 -140829 -62744 73875 47885 -3552
78 -3552 -4202 73542 106128 52809 -24876 29964 94026 19000 -69568 2286 60108 -25834 -112139
91 -112139 -47394 22524 -39810 -105530 -30428 37600 -761 -30450 24977 73812 53846 9186
103 9186 12030 46854 51381 5105 -35913 -20901 -1035 -41880 -69829 -26788 1900 -20498 -24984
116 -24984 4026 23506 15438 11499 33863 49496 26667 -6139 -5508 18277 12224 -21704 -21307
129b1307K2818j2312k0751Q599J6268J356p184J068J2117O984L125M241L125O998
143B5145p44j4822l655R042q262k0298n095P837n415j4256J2778K0212p915n363
157a0811J6000N596m437O024N092m820m874j067o269n776N826J210j2856K52R128
172a782o633l521J1488N442n268k460N918M449l731J620L596m615k426Q9m795
187b629j130K799l666m703K18L841L34j063Q091O160o077J55P168j765k288K058
203G503l280n788j630o79j726r61L609o39n043M714O231m404J715O979j158l727
219A716R09K576q23j840J570j401o175J53J354l749R30L243l648k157L925M246
235H29P03J74M387J191m330J444K777l816j621J04l725l624K95M85n51N10K691
$$ plain form
129 -21307 1511 -10801 -31552 -22953 -6685 -5329 -12513 -11445 672 7656 10781 15022 18147 25145
143 25145 24401 9579 5924 14966 6704 -13594 -18689 -10852 -16267 -30523 -17745 2467 -5448 -10811
157 -10811 5189 10785 6348 12372 17464 12644 7770 6703 434 -5342 484 1694 -11162 -10910 -1782
172 -1782 -8415 -11936 -448 4994 -274 -2734 3184 7633 3902 5522 9118 4503 2077 2166 -2629
187 -2629 -3759 -960 -4626 -9329 -9111 -5270 -4936 -5999 2092 8252 2175 2330 9498 7733 5445 7503
203 7503 4223 -1565 -3195 -3874 -5600 -6561 -2952 -3591 -8634 -3920 2311 -2093 -378 6601 5443 1716
219 1716 2625 5201 4378 2538 4108 2707 -3468 -3315 -1961 -5710 -4780 -1537 -5185 -7342 -3417 829
235 829 1532 1706 6093 7284 2954 4398 7175 3359 1738 1842 -1883 -5507 -5212 -4727 -5278 -4768 -2077
252b077m00k052M192L594j470K072K158l241j376J519O86r94j537n91j808k027
268c352J111n8j503J934O32l122P18L705R30L29J272J653j391j781K008Q55k676
285A264p1j141l625K9J960r36R8J169Q49j068r5L774L16j604J343K56l005L7J698
304A248q10o93L11m41j386l28K420J70j613J548l91k538J753K049l87q50R01J68
322A131j521j7J975l25j894Q53l32k028J223Q93q24M22Q50j53j026M73K762p93
340A669j826Q89m60j655O24R91q09K79l20o2k32J182J181o19o33J350j131j391
358i73J461P63j317j39l8r9o28L02J122m70n03N15l31p74J694J95p88L43L16l85
378B66n71J116O41j228r47R56l66j441J237n0o45N23r5J14M18O93N51n27m74J095
$$ plain form
252 -2077 -2477 -4529 -337 3257 1787 3859 6017 2776 1400 2919 3605 2611 1074 483 -1325 -3352
268 -3352 -2241 -2299 -3802 -1868 -1236 -4358 -3640 65 995 1324 2596 4249 2858 1077 3085 3940 1264
285 1264 1193 52 -3573 -3544 -1584 -2520 -2422 -1253 -404 -1472 -1567 2207 2523 919 2262 2518 -487 -450 1248
304 1248 438 -255 56 -385 -1771 -2099 321 491 -1122 426 35 -2503 -750 1299 912 62 963 1131
322 1131 -390 -407 1568 1243 -651 202 -130 -2158 -935 -42 -866 -444 406 253 -773 -300 2462 1669
340 1669 -157 732 272 -1383 -759 232 -577 -298 -618 -680 -912 270 1451 832 199 1549 418 -973
358 -973 488 1251 -66 -205 -243 -342 -970 -668 454 -16 -519 -4 -335 -1109 585 780 -8 335 651 266
378 266 -305 811 1452 224 -723 233 -133 -1574 -337 -387 -1032 -509 -604 -490 -72 621 1172 645 171 1266
398A266j074o86J341m51j011K20K58l72k86P66K33m87l14O54l21j46J249n46n32
417b39O41M2k07JM90j12p60j68M47o09J08K73k33l17M78k29J5Q98K39l74l79M65
439D70K41p28l82J250n75p27N35l12j37L65o9J11m97P8M51k95R6M49p42k43N35
460a26L89l98N43J94j95k32p7N05m49N2L23r07O5L84l73J86K99k31k74q5N90n2
482A31j46L00K32n56J67K31Nj40K55P6m60J5j53j02j9J00N0o44O3O93o04K67N80
505C41J52m80j73M18M06k86l53K91m13k26O08p06N9K54k28L6j64N81Q5m50N58
526C10J57p00J59L15J04j41j53J30k82J36r4K61k64j62m4k83J54N20j58k55J77
547a13K93p3ML08P7k03j24j22k36M02l12j28K41p2j35J1M5K48j03j93L49j64j20
$$ plain form
398 1266 192 -494 847 396 -615 -395 -137 -509 -795 -29 204 -283 -597 57 -264 -410 839 293 -239
417 -239 402 444 237 238 728 616 -144 -312 135 -474 -366 -93 -326 -643 -165 -394 -379 519 758 384 5 470
439 470 711 -17 -399 851 276 -451 84 -228 -365 0 -69 42 -455 -377 74 -221 -125 324 -418 -661 -126
460 -126 263 -135 408 602 407 175 98 603 154 206 529 -378 -313 71 -302 -116 183 -48 -322 -407 183 131
482 131 -15 285 517 -39 128 359 364 224 479 555 95 110 -43 -145 -164 -64 -14 -658 -595 98 -506 -239 341
505 341 493 13 -160 258 664 378 25 316 -97 -323 285 -421 -362 -108 -336 -300 -464 117 202 -248 310
526 310 467 -233 -74 241 345 204 51 181 -101 35 -59 202 -62 -224 -268 -551 -397 123 -35 -290 -113
547 -113 180 107 111 419 496 293 169 47 -189 213 -99 -227 14 -58 -193 -182 -137 111 8 -185 164 0 -120
570a20K90m6l15K90M8m5m11K23L74n7k95J39n7l18j6K24kN0K4j30L3K36j81L18
594B56j85J73o7m07Q7O24l06k39K25l08pN64l30j91Q7O9j27j10J58j31J24K03
616A62p0k40J90q0K07m83N39m31K44J11M4n0n05l2R8J90n0J18q2n0J81k26r2N69
640B62J5k04l62L76K42l50JQ0j57j11J68J48j80p1L74j71m60K44j46J38L82l2
662A86k26M4R7K82n76K41N9J52k95m9J19J0j11j00qR5P6k18K91q2pK0P5R8j54
687A9L5j20L10j59r6j77J70j44kk1o1K10j89J50j97L60P7j03J69k66J02j0jO8
711A24l63K25j53Q7J29l0j33j80m5L07j17k9M04l19J02k27L22k79J19Q7L99n42
733a12L7J61j43K29k97Q4J98k57k4J8P2J96P8R9j22k38K5K9j59J79l77K67k1L80
$$ plain form
570 -120 170 124 -191 99 147 102 -309 -86 288 231 -64 75 18 -300 -316 -92 -94 -44 -20 -150 -117 119 -62 256
594 256 71 244 177 -230 -143 481 175 -64 161 -147 -154 410 80 -111 -24 45 -82 -192 -34 -165 -41 162
616 162 92 -148 42 -38 169 -314 225 -206 38 149 193 143 -362 -394 -296 -106 -156 -38 -120 -170 11 -215 -307 262
640 262 277 73 -289 87 329 -21 -20 60 -97 -208 -40 108 -72 -143 231 60 -400 -156 -302 -164 218 186
662 186 -40 4 101 383 -193 48 107 259 -36 -85 34 44 -67 -167 -175 -80 -4 -222 69 -13 -20 0 75 173 19
687 19 54 -66 244 85 -11 -188 -18 -162 -164 -185 -246 -36 -225 -75 -272 88 165 62 231 -35 67 57 56 124
711 124 -239 -14 -167 -80 49 19 -114 -294 -339 -32 -149 -178 226 -93 9 -218 104 -175 -56 31 430 -112
733 -112 -75 86 -57 172 -125 -41 157 -100 -124 -106 -34 162 240 339 217 -21 4 33 -126 53 -324 -57 -78 302
757C02l08J7P9q3j49OJ50p2J12M1j31p9K92j53l8K59r9k93J55j7j11M49k09k86
781a66J63J3k3J45l38J72k94L71P5j55Q5L5j15o4K06k4rR6M6k18j66K02J27r6
805F8l94L38k94P9l5J58o7Lq2K55j27N9q4P0K35j12j58j34Q1J97k38R9R7j79l2
830a97QL15k32K16l46O0J01J16p5J68p3k54J40J22R1j15j14J44j12j83J54k3l3
853a22J86j27q9J08j92L50k27K3k11L46l7k8L7n4o6J20K00j66k75L0L25k90J59
876@j07k45K97q9K94J7k95M2K27K8j26J50J07n31M47j84J07j49K57j52lk91L86
899A87m95M52j50j21K60k09j15K35qn1J21Q7r5LK05l46J6K35l30L67n05L17Q2
922A42j16R5n2J74m51L39j16J47k32J13j27J1K0J63j10l38J61R1J32k97J37o9
$$ plain form
757 302 -6 11 90 7 -142 -136 14 -58 54 95 -36 -115 177 24 -14 245 146 -147 8 -9 -120 329 120 -166
781 -166 -3 10 -13 132 -206 -34 -328 43 118 -37 48 83 -32 -96 110 86 77 173 219 1 -165 37 164 68
805 68 -326 12 -282 -203 -238 -80 -147 -144 -226 29 -98 -39 -123 -53 182 70 -88 -222 -141 56 -182 -83 14 -165 -197
830 -197 -189 126 -106 110 -236 -176 -75 41 -34 134 61 -193 -53 69 160 45 -69 75 -37 -220 -66 -89 -122
853 -122 64 -63 -152 -44 -236 114 -113 -90 -301 45 8 -20 17 -37 -103 17 217 51 -224 -194 131 -159 0
876 0 -107 -352 -55 -144 150 167 -128 -86 141 169 43 193 300 -231 216 32 139 -10 247 95 92 -199 187
899 187 -308 144 -6 -127 133 -76 -191 44 36 -15 106 193 98 101 306 -40 -24 211 -119 248 -257 60 142
922 142 26 121 69 243 -208 131 15 162 -70 43 -84 -73 -53 110 0 -338 -177 -86 46 -251 -114 -183
944a83J40j58K08K72l57N2j38L93po83M94j15P9q0O0j23L86l19O0N2o3J93p8k34
968a49K51l2j09k39L18J62l25j00J40j35N45l65JP7j95L42k5j49k3j06k05J38
990a83roO0J29p0l04M92k48K80j13p0Q4n1J6o1k16N22j81k44K31p8j10K80k57
1014a07p1J59q5J12K45n30N53j65o6p0k27K72J73J5j46l3K6Nk16M77k57J74o93
1037d55M65q0K67k01J17l91O1J17J69Q3j88K89j50l2j60J34j72J04j4K27j98k12
1059b20K70n2j07J12K7K21r7j94J92l2j8m4M7j45J0j39J28L4l6j14M29l06j32
1082a66j39J01k1J07q6J04Q5m5P9j01K11n9k15m8J97J28p0j55J76o0n0K7J36j98
1106f2L81o23J61J27p5p1J80r6L95l61L5R4qj7j21K16j50K8J70M9m21J70p9O8
$$ plain form
944 -183 -43 -201 7 279 -78 -26 -164 229 222 -461 33 -82 -3 -83 -23 -146 240 -79 -19 33 -30 163 85 -149
968 -149 102 70 -39 -278 40 202 -123 -223 -83 -218 327 -38 -37 40 -155 187 162 13 -10 -116 -321 -183
990 -183 -192 -198 -138 -9 -79 -383 109 -139 141 28 -42 42 -9 7 -54 -270 252 71 -173 58 -20 -130 150 -107
1014 -107 -178 -19 -104 8 253 -277 276 111 45 -25 -252 20 193 208 62 29 55 60 -156 321 64 238 -455
1037 -455 10 -70 197 -4 113 -278 -217 -100 69 152 -36 253 103 71 -89 45 -127 -23 -37 190 -8 -220
1059 -220 50 -2 -109 3 30 251 154 -40 152 120 102 58 105 -40 -30 -169 -41 -7 -43 -157 272 -34 -166
1082 -166 -305 -204 -225 -118 -204 -100 -15 -60 19 -82 129 70 -145 -193 4 132 62 -93 83 23 -27 0 136 -62
1106 -62 319 -304 -143 -16 -91 -162 18 -78 317 -44 -9 85 77 60 -61 155 5 33 203 252 -169 1 -78 -10
1130a0M4J73p5J59m06P1j2n1P0K6J11l17k42K11L21J48p2l19J04k87J50J47k38
1153b94M75k4n6j69K37j83k16J82J54k57M0L3J53J3n5P9l31L44o9l2j93L9J87
1176E7j44J91k95J03L54n49M43k21Q3J7nM5j48J00m7m2J03K27j50m1J11l46K74
1199A20j85O9o3J10J3j13J31l12K65k1n7J44J02m72J19m6L54k38j18L93j99P6
1221G2j85K70j48j05J71J31j5k08j26r8J39m9R8K05J21j74Q8j69l9Q3r0r8L17
1244A91j0k91K31j73m2N34m67j36O7R8p8J86k84Q7L82l19p3J78l63K44J4n3R3
1267A6o8K94k38q5p5N4J76k7o1P8j92M1K38O2l58O5j28L93J8q8k75K97j46R4K00
1292B85m28J21j39J01j0J71j94m5K4MK96n0k22n3J81M2M6j64j98K95P7n1k44J35
$$ plain form
1130 -10 34 207 132 291 -115 -44 -56 -107 -37 -11 100 -217 -459 -248 73 221 149 -170 -66 -353 -203 -56 -294
1153 -294 181 157 101 -68 169 -14 -230 -48 106 -151 -111 -78 75 88 33 112 -219 125 56 24 -169 -130 57
1176 57 -87 104 -191 -88 266 -283 160 -61 22 39 34 79 -69 31 -16 -58 45 272 122 81 192 -154 120
1199 120 -65 4 -59 51 64 -49 82 -230 35 14 -43 101 203 -269 -150 -196 158 -80 -198 195 -4 72
1221 72 -113 157 9 -96 75 206 191 -17 -143 -241 -102 -151 -53 152 273 99 187 18 -21 62 -28 -126 191
1244 191 181 -110 121 -52 -94 440 -27 -163 -96 2 -76 110 -174 -87 295 -24 -97 81 -282 -38 -24 -77 16
1267 16 -52 242 4 -81 -156 -102 74 47 -14 64 -128 -87 151 213 -145 -80 -208 185 203 115 -160 137 -9 85 285
1292 285 -143 -22 -161 -60 -70 101 -93 -138 -114 -110 186 136 -86 -139 42 84 130 -34 -232 63 140 89 -155 -20
1316b0Jj28M68m41K89k56J83J7N5j43J01l16J55P2l0p2J82J37l24P9j21o6M17
1339B39l57J01J92l09R0R1L8j00J87J21m23o2L37J00o6j35j13J50J39k11j38M5
1361h4K58o5p0K06l49O1j0N7K22j31M9l07K09J46j25j51J80J44j79j28k41k8K71
1384f5M8N3lk90M26j50o2j06K37j23J34j70M1j38J21J36K0k51rL02l31L71kj68
1408B1J26L7k91j5m0K26k81K14r9N62n44m3K09m8j6J24j15p8J79p9l28K29J93
1431A43k36K5l89L64J27J01j03R0r7PN6p8O9r1L7J4j44pL44k37k1K62l11P1j13
1456a17J40J33K3j20j96K83r5l25K00J77j2j4o9J09N6o8l11j60M4m8L66M0J62
1479A98j26j13j88J78J4q3L25l94M05l17K89l38K4R8N7Rk47N9K73O5k99R3j44
$$ plain form
1316 -20 -19 -147 321 -120 169 -87 96 113 168 25 126 -190 -35 37 7 -65 117 254 -70 9 -112 -178 239
1339 239 -118 -17 175 -134 -44 47 85 -15 172 293 -130 -192 145 245 179 44 -69 81 220 9 -129 -84
1361 -84 174 109 39 245 -104 -43 -53 4 226 95 144 -163 46 192 67 -84 96 240 61 -67 -308 -336 -65
1384 -65 -17 36 33 -257 169 19 -43 -149 88 -35 99 -71 -30 -168 -47 89 109 -142 -151 151 -180 191 189 21
1408 21 147 184 -107 -122 -162 64 -217 -3 -102 460 -84 -127 82 34 18 142 27 -51 128 49 -279 -50 143
1431 143 -93 -68 -457 -93 34 135 32 122 25 32 88 10 79 -12 25 39 -105 -112 232 -5 -26 236 -75 -4 -117
1456 -117 23 156 179 59 -137 146 51 -274 -74 103 91 77 8 117 173 105 -206 -366 -322 -370 -4 36 198
1479 198 72 -41 -229 -51 -37 -120 205 -189 216 -101 188 -150 -126 -28 29 38 -209 -150 123 188 -111 -18 -162
1502a62K44J77pm21J17J18l9q2O2M4m20K58K76l86M9J22j75R8J62j32K7k7K93
1525A96l68N29m23J18K0J57Q8l30J64l6k46L52k31j9k79K41K9M6K76k63Nl1lJ12
1549A04k30j5M5N1J98k97P9p4J54m7o8l5P9R6L8r7J41j70L54m73J60L0k8k88K33
1574f0r3L57o2j96J73l01n7L40Qj41N8Qq7K88l73P6J90k26K98l17R2J40j82j88
1598b55J68J93j49j9K33j37O6P5k11J87j74O1k61K04M1K58j73O1k57J0K04N3k28
1621e0O0K92l43J10Q0j2m5j70J86q6P2k57n4L99O2m57J63l4J78J08j6J01l10J92
1645A69j54P9J25l04K94k99K52m78L55MK32m39J50M5j98K0L02Q1m61j13N01m3
1667A20k39J37jq1K71j98K1r7L10n06L32k28K85l53L41r0r4M5J68p5l38K77j28
$$ plain form
1502 -162 82 259 252 -169 -52 66 27 -55 7 51 -369 -111 165 -221 -172 -50 -225 -127 35 -97 -70 -97 196
1525 196 -172 357 -66 52 72 229 317 -13 151 115 -131 221 -10 -29 -308 -67 -38 8 284 21 26 -5 -8 104
1549 104 -126 -141 -96 -45 153 -144 -65 -139 15 -32 -100 -135 -56 40 78 -19 122 -48 306 -167 -7 23 -5 -293 -60
1574 -60 -153 204 142 -54 119 -182 -239 101 109 -32 26 34 -53 235 -138 -62 128 -98 200 -117 -25 115 -67 -255
1598 -255 -87 106 -43 -62 171 34 100 175 -36 151 -23 38 -223 -19 22 280 107 168 -89 -79 125 178 -50
1621 -50 10 302 -41 69 149 137 92 -78 108 22 94 -163 -217 182 244 -213 -50 -84 94 202 186 287 -23 169
1645 169 15 94 219 -85 209 -90 162 -316 39 43 275 -164 -14 31 -167 -147 155 236 -225 -338 163 120
1667 120 -119 18 17 -64 207 9 30 -67 243 -263 69 -159 126 -227 114 24 -70 -25 143 68 -270 7 -121
1690a21J69j71M4K60k77J95P3k38j65K34J3L9j71J9J15j51J60l47K15l9J98m6
1712Hk37J94J52j2q7q8Q5L1r6K26m24L72l77J33q5K8J85Nj83L25j69llO7k26J10
1738f9L05n53J10L7N09l01J28j23k40M27r6k5k07k8j58M48l48L82k2m52J08J42
1760b6J56r6n09N76m7Lk14L05O0l06J26k84P9J88L7k13lL73k20L98o03J95l2J16
1784E9j9j07K49j83l1m5j31J01K00r9P1k99jL68j29p4L1L7j9j19j0K20j86J79
1808F3n9j4qN3q1j71K50o1k35N26q1O2J9l50K68n06L79j04L4k3J93j46Mo7Q5q7
1834e7j21J36p5L27k89j97K64K02m7k07J4N4m03L10J10p7j72J26j45J74k23K18
1856g8o7K3K54n8K8j1l45K88L2l52K48j04J99Lk9q5L97r0k07j14K44N7j19l48
$$ plain form
1690 -121 48 -123 -79 181 -96 99 172 -66 -231 3 16 55 -116 -97 18 -133 27 -320 -105 -144 54 8
1712 8 -229 -35 117 105 18 -70 15 46 -50 176 -248 124 -253 -120 -205 -177 8 13 -170 155 -14 -17 -20 47 -179 -69
1738 -69 236 -317 -207 -170 339 38 166 43 -197 230 134 109 -98 -126 -284 164 -184 198 176 -276 -168 -26
1760 -26 130 34 -475 101 54 57 -157 148 208 -98 28 -256 -177 11 48 -165 -168 205 -15 383 -220 -25 -57 59
1784 59 40 -67 182 -1 -32 -77 -208 -107 93 -6 65 -234 -235 133 4 -70 -39 -2 -21 -140 -150 70 -116 63
1808 63 4 -10 -18 35 -46 -217 33 -28 -263 263 182 244 263 -87 181 -325 54 -50 -16 -39 154 8 12 -55 30 -57
1834 -57 -178 -42 -117 210 -79 -276 -12 190 143 -64 -50 4 -399 -89 21 -56 -228 -102 -247 -73 -296 -78
1856 -78 -145 -122 132 74 102 91 -254 34 66 -286 -38 -142 57 60 31 -54 343 253 46 -68 176 233 114 -234
1880b34P7Q4m1K03k09L13j83J2K80m39n7K99n0j06M9L42k10N6k72r5K09R7j50
1903b5M3m1M1K10l97lJ87l06K57R6k0k07L16j28j09o6J60K95j69O5j00o7j94L09
1927A47j95J48k01j42K28J73q0j9k27J35J05pl9j84Q1P3o1j42K32J24k38j66P6
1950a79K1J73p2J67k38J23j82K45k03O8pm9K94J82l50R3Q4l00J24J5k9r7R6R3
1974G2j11j52j11J54J27j19Q5q6R7j39L62k43J09kJ66m78K62J69l12J02n2K6K22
1997A48Ok60Q4j75M33l59k38K53J72M5l33J25J78j8j02R5l0J06Ok56J04q3K1j02
2021a80k2K61p0j50L29k05J1J73p5j88J95j90p7J68J6K83k10J2Nr1K83k97J44
2044A25l9j29l3K80l25K42l09J24M4j09j9K63l30J01L07l03l9J24l8P6K72l72
$$ plain form
1880 -234 -157 -73 -114 89 -120 193 10 22 302 -137 -194 105 55 -51 -2 340 130 186 -86 -181 28 125 -25
1903 -25 18 -23 18 228 -169 -172 15 -291 -34 62 42 -165 151 23 -86 -152 8 303 134 199 99 32 -162 147
1927 147 -48 100 -101 -243 -15 158 78 59 -168 -33 72 65 26 -158 -77 -4 -65 -207 25 149 -89 -255 -179
1950 -179 -158 15 -57 110 -128 -5 -187 58 -145 -77 -84 -133 161 343 -7 86 170 -130 -6 9 -20 -117 -21 72
1974 72 -39 -191 -302 -148 -21 -140 -55 -141 -44 -183 179 -64 45 43 209 -269 -7 162 -150 -48 -100 -74 148
1997 148 154 -106 -22 -197 236 -123 -361 -108 64 109 -224 -99 79 61 -41 54 24 130 136 -120 -16 -99 -78 -180
2021 -180 -202 59 -11 -161 168 -37 -26 147 72 -116 79 -111 -188 -20 -4 279 69 81 86 -5 278 -19 125
2044 125 86 -43 -76 204 -121 121 -188 -64 -20 -129 -148 115 -215 -114 193 -110 -149 -25 -63 13 285 -87
2066h7J63k58J9j40lK13Q4L26l10q7r6L00j77k80L19J08j97K60j63j6J77k86K49
2089A18j80K14jn23M04N2k61J05J5L11k91L14m04O5L82l94Q5K6j1j32Q9R9l4l11
2113b63J86Q3K80j45Lm19J20K93k75R1J81j89m3k8P1R8q6l1n0M5J3N5k41K09p1
2138a13l77O41j56k2j73K30j79L5K55j88j81K54J4M2j68M43k72o7j68K34n1l9
2160fP4n5j5J44R7j71r3j2L01l50K85k2j32j42J11J15O9j58k53J26J01k45M01
2183A70l25mJ10O9Q4j47q2J89j00m36L03M0J01J51j67l03K21Q9N9j15o3J15pJ13
2207F5k55K61K30k44N9j88pK33j29j83J09K76j57jO2k23p8J34J53n77M80Po2l8
2231g3L14p25N67J46k74J56j87J11J81k37M4r2J99l58L7J20k22M54j45K32m04
$$ plain form
2066 -87 76 -182 -163 -303 -306 -93 -9 317 7 -80 -176 124 -53 -333 -14 94 -103 157 -6 -22 155 -131 118
2089 118 -62 152 151 -372 32 84 -177 -72 -57 254 -37 277 -127 -62 320 -74 11 37 26 -106 -17 82 48 -263
2113 -263 -77 6 286 141 144 -275 -155 138 -137 -46 135 -54 -97 -125 -54 44 -42 -73 -123 -78 -65 -10 -251 -42 -113
2138 -113 -490 151 -5 -27 -200 30 -149 -114 141 -47 -228 26 40 82 -86 357 85 18 -150 84 33 -6
2160 -6 68 13 -2 142 239 68 -25 -37 264 -86 199 177 45 -97 14 129 198 40 -213 -87 14 -231 170
2183 170 -155 -159 -49 20 104 -43 -125 64 -36 -472 -169 -129 -28 123 -44 -347 -126 -37 22 -93 -156 -41 -48 65
2207 65 -190 71 301 57 116 -72 -79 154 25 -158 -49 227 70 69 131 -92 -170 -36 117 -460 20 27 -35 -73
2231 -73 241 -484 83 229 -45 111 -76 35 216 -21 23 -69 130 -228 -191 -71 -293 161 16 248 -156
2252a56K5J66j85K5J69k68K71j2k79M11k01L9N1j94J41J28k64K52j21l8lnK7N9
2276C8J50k78J4l6J21n2j8J81j42R9j18Q7%p2M4J2p0M8K60k94J28j84O4K7K83
2301B92k14j22K26l03L61p1l39J53j89R2RK12J25m57K50j45K60j83Pj27L58k00
2323ej25Q7k31K19j20K29K25k98J52k75j5J96J4q0J39l55M29J55l42Kk01k6P2
2346a54K74l0k86r5L93j98j23L32M9K3k26K77l81J53J10k86K00j42kM83j91l1
2368A49k93R0K88k11R2l9k01K25M3j75K97k84k05K52q5K81k31j05J36k04K81k35
2390a34j4J9J29P0j14J60j60K35m37K41jM7l8j96o1J31K32p8j55qL7J77j51K96
2414B27l83O7R7J78rl50J74k3K03m62J03J40K0J86k4Q6k27qk9K7k5j63Q9J37K60
$$ plain form
2252 -156 -131 35 -150 -125 44 -224 47 35 -244 167 -34 5 56 -138 3 131 -133 119 -2 -40 -43 -48 -21 38
2276 38 188 -90 -76 -112 9 -43 -61 120 -22 77 -41 46 46 -26 18 30 -40 8 268 -26 102 -82 -18 9 292
2301 292 78 -44 182 -121 240 169 -170 -17 -206 -114 -105 107 232 -225 25 -120 140 -43 -36 -163 195 -5
2323 -5 -130 -43 -274 -55 -175 54 279 -19 133 -142 -157 39 53 -27 112 -243 186 341 -1 1 -200 -226 -154
2346 -154 120 90 -196 -291 102 -96 -219 113 162 185 -41 236 -145 8 118 -168 32 -110 -112 371 180 149
2368 149 -144 -54 234 23 115 76 -125 100 143 -32 265 -19 -224 28 -57 224 -7 -112 24 -180 101 -134
2390 -134 -148 -129 0 70 -44 116 -44 191 -246 -5 -6 41 3 -193 -254 -123 109 31 -124 -132 -95 82 -69 227
2414 227 -156 -89 8 186 177 -173 1 -22 181 -281 -178 -38 -18 168 144 230 3 -5 -34 -7 -32 -195 -106 31 291
2439B91l86Q9j25L02m15L39O3j57J33j66jr4J16J54n9q1pQ9j81P1j11J40q9P9
2463fj2j94P8K42k10K47m23J42L43l40K43L4j18Mq3q9J33k19J29J34j31J67k34
2486a63L85j23q6R3M5j68J93k53K4J84o4j31J23k90L87K6j1l91J37M01k95j54
2508a31K49m51L17l1L00k12J75Pk82K26j65O1j91N6L14j98L1l2j17O6J76l06J80
2531D2j36J42K5m3l4K0K34r8J9j88K55j76k89L91J4k54J12K66m43p4J75j28K85
2554A17o9nk38L2N50j89n5k03Q7k19L32j1k00oj09K05j79j5N57k40j56J43j27
2577Bn4n4j34L84n0l06K13LM0J59j03J21m14M8N53l62O7J07m26L64k15J17k41
2600a81L07k55L17k31J42j23o9K32j37R1l5k55P3Q9M1J10J86l29j09O2L44o6n28
$$ plain form
2439 291 -95 -6 -131 171 -244 95 158 1 134 -32 -33 -127 -11 143 84 3 -4 85 -96 -25 -136 4 -85 -6
2463 -6 -18 -212 -134 108 -102 145 -278 -136 207 -133 110 144 26 30 -53 -142 -9 -228 -99 35 -96 71 -163
2486 -163 222 99 13 106 151 -17 176 -77 -53 131 67 -64 59 -231 156 182 171 -220 -83 318 23 -131
2508 -131 118 -333 -16 -47 253 41 216 223 -59 167 2 63 -128 -72 242 44 75 43 -74 -8 168 -138 42
2531 42 -94 48 73 30 -4 16 250 152 171 -17 238 62 -227 164 178 -76 36 302 -141 -215 -40 -168 117
2554 117 48 43 -195 -163 387 198 143 -60 27 -192 140 129 -71 -77 -186 19 -160 -175 382 142 -14 129 2
2577 2 -52 -106 -240 144 94 -212 1 4 44 203 100 221 -193 -145 408 46 113 220 -206 158 -57 60 -181
2600 -181 126 -129 188 -43 99 -24 -93 139 2 93 58 -197 -124 -35 6 116 302 -27 -136 -74 270 204 -324
2623c24M53k63K63k85J45J85k40J28J2j82j24K65k07j90K71K20l25M31k14J09
2643A28k93l4K59%j18K27j64P3k65J07l1J82O6k49PN2J62J28k71r9nJ10kO8j20
2668h2J49N4j38P2pK40k05k24M1K23R1k39Q0J3n1J9J39m11L76p0p3k8R5k54K24
2693C4l0J34j9m7K00j93j97j49J61K77k58k02L03j90M19m7k31j5J24O9Nr7j90
2716a39l6K32k02J44o1Q1J00J07q7k29L61j14K2j35k72N88k76N3m32L13q7N9j61
2739a71K04m7k0j7j2j43L45k11q1K73j05R5k36K29k86J25J37qK7J07k09J06l05
2762b03J33j47J02J71j90n4O5o9Q0R2R3k63l2K92o7J80j18J5l31J79r7L22p7l44
2786b68K71oL17j50k05l4K27j86l51L87N1j92J89k6K5O6j68r6J43j19J44J89N0
$$ plain form
2623 -324 129 -134 129 -156 -11 174 -66 62 74 -108 -232 33 -174 -364 -93 127 -198 233 19 128
2643 128 -165 -199 60 60 -58 169 5 78 -187 -80 -111 71 137 -112 -105 -53 109 237 -34 -133 -138 -28 -30 38 -82
2668 -82 67 121 -17 55 48 288 83 -141 -100 123 214 -25 55 68 17 36 175 -236 140 70 -3 -31 64 -190 34
2693 34 4 138 119 72 272 79 -118 -267 -106 171 -87 -289 14 -176 243 196 -35 -50 74 143 148 51 -139
2716 -139 -175 57 -145 -1 -62 19 119 226 139 -90 271 157 179 44 -228 360 84 137 -295 18 -69 -10 -171
2739 -171 33 -14 -34 -51 -63 -206 139 -72 -153 120 15 110 -126 103 -183 -58 79 71 98 205 -4 102 -203
2762 -203 -70 -217 -115 56 -134 -188 -123 -192 -112 -20 73 -190 -222 70 3 183 65 80 -251 -72 -169 153 76 -268
2786 -268 3 -3 314 164 -41 -75 152 -34 -385 2 53 -139 50 24 49 115 -53 -149 -6 -125 19 208 258
2809B58j41j56r4J4L77j29j62j08K42M2L4k41Q9l2J1j90Q3K77k80J73k50R3K3
2832f7m0l9R9M6m8j39k4L1K61j46J27l59L66N3j58J91l68L66j99J04j1OJ60j76
2856C6J03P1k47o9K61j05O4m5j24Pj11K74j61K88j05j74j56J80O5j4n8L5K04k94
2880g5L53l99K75m34L13K55k02l32N1P8M16l79J87j46j75J14K13k58K37o7K10
2901B35J00l13J25j20Q4n5j95R6O6J54l08J33l6o0J85j51K92k93R7pk88L12J27
2924A80k95m4J08m6j23L02k12J39l2J2k12J04M9J3J35o9r2n0l3K36J33j78J77
2947B02l15J49J3ok8j00K07j76Q1J52k66o2J56J6J27k27M5o7K84l08J7K13k94
2970a87Q9J96k30j48L58J16j32j2j55J31k24P3K04j44K11j39J07n6O5j04j62J53
$$ plain form
2809 258 117 -39 -133 -119 258 129 -33 -141 101 143 177 -64 25 -7 4 -186 -103 174 -106 67 -183 -90 -67
2832 -67 -107 -146 -47 -1 -49 -188 -212 -181 80 -66 61 -298 68 121 -37 154 -214 152 -47 57 46 52 212 36
2856 36 139 210 -37 -106 155 50 114 69 -55 -48 -159 115 -46 242 137 -37 -193 -13 52 38 -20 15 219 -75
2880 -75 278 -121 154 -280 33 288 86 -246 -195 -117 299 -80 107 -39 -214 -100 113 -145 92 25 235
2901 235 335 22 147 27 111 56 -139 -43 23 177 -131 2 -34 -94 91 -60 232 -61 36 29 -259 53 180
2924 180 -115 -159 -51 -97 -220 82 -130 9 -23 -11 -223 -119 -70 -57 78 9 -83 -133 -166 70 203 25 202
2947 202 -113 36 49 43 15 -85 122 -54 27 179 -87 -149 7 23 150 -77 -32 -99 185 -123 -106 107 -187
2970 -187 -98 98 -132 -280 78 194 62 50 -105 26 -198 -125 79 -65 146 7 114 58 123 19 -143 10
2992A0P7p5j87J44K42j96J22k03Q9J29k8k98L06k77K27j02l3J42oJ81r1p1j75
3015g3j49K34J76j74j62K80j61j55O1P8K2J47k3r5O1J61l96M03j37k97K13rj72
3038a67L44K8m05j8L67o6m3q7K09K8k40J3j11K97M0k51j92J50l4j5L93j48k30
3061a38P5mJ09om0r3J37n7J54rj36N9m5j49J68J40j23L30m37k11K71K4K7K56k92
3086A0Q3K57l86l3K89q6k3M2o9O8l27r0M57k19n9j98K84j50J81j81K88j83K41
3109A96n5k13r2K24M5R2j02l07L08n26N13j07l0K6J66m8j51P9R3j1j53k06K14
3132d5J56N2l19J39J08J93k17r8J07k6j13m2K04j33M1K31k05L47J47m53j64j78
3154b68J21J30M41m25j14N5K16j95J04n4j55K44Q4j80K24k35N4n8O8n6J02k5k31
$$ plain form
2992 10 87 12 -175 -31 211 15 137 -66 23 152 124 -174 132 -145 82 -20 -53 89 83 264 173 102 -73
3015 -73 -222 12 188 14 -148 132 -29 -184 -123 -45 -23 124 101 6 67 228 -168 235 98 -199 14 5 -167
3038 -167 177 205 -200 -218 149 83 40 -47 162 190 -50 -37 -148 149 189 -62 -254 -104 -138 -153 240 92 -138
3061 -138 -63 -67 42 36 -4 -97 40 -17 137 128 -8 51 6 -143 25 165 42 372 -65 -276 -5 19 46 302 10
3086 10 93 350 -36 -69 220 134 111 153 84 152 -175 -265 192 -27 -86 -284 0 -150 31 -150 138 -45 196
3109 196 141 -72 -164 60 105 197 95 -212 96 -430 83 -24 -54 -28 138 90 -61 18 111 100 -53 -259 -45
3132 -45 111 163 -156 -17 91 284 67 -31 76 50 -63 -105 99 -34 7 238 33 380 527 74 -90 -268
3154 -268 -147 -17 424 -1 -115 -60 156 -39 65 11 -144 100 184 4 228 -7 47 -11 57 1 103 78 -153
3177a53n5K87J52l1j95J35j27k94J16O3K17j11K4q5J83k74K78k33J25k0j7j82
3199a97K24r7RK2Q1Q1j02n6L71l11l4J93M2o1j60j49J96j16j71M39l65L1J59L87
3223D16l28m4j02p5J41J6q9J96K30m63k90N72q8k24M8L4LJ97k35j36M2J44j54
3246a89K13p8O7J69j59OJ29l35J8J6J81Q2Rm70L96N0j94K47j44P2J7K27l55L1
3270Fnj11P4mo4J08L65m17K60l24J00K2q4J65j96K44l28J95j47K26K6m00K35K6
3294b8R0j44q8J79J0K81m80K11J17k28j32J17K25k68k1KQ2L1m7M4m7M7J23Q8m38
3319b74N25j99l00K39P2j79K63k88L83m33L24k52L2O6J69r1n4K38k22J7j76J6
3341a24j86K95K51o31K0N1M04k5OK4j56K43k65k05L18r7K36l81J51q6N84o58J47
$$ plain form
3177 -153 -208 79 231 200 5 140 13 -281 -165 -102 115 4 28 -57 126 -148 130 -103 22 2 -15 -197
3199 -197 27 -70 -61 -39 42 123 21 -35 336 25 -9 184 226 165 5 -144 52 -64 -235 204 -161 -130 29 416
3223 416 88 44 -58 -133 8 24 -65 131 361 -102 -392 180 92 -132 -84 -50 -47 150 -85 -221 -179 -35 -189
3246 -189 24 -54 13 182 23 29 158 -177 -159 -143 38 120 129 -341 55 105 -89 158 14 86 103 330 -25 6
3270 6 1 -110 -36 -40 -104 4 369 -48 212 -112 -12 10 -74 91 -105 139 -189 6 -141 85 111 -289 -54 -28
3294 -28 62 -82 -170 9 19 300 -180 31 148 -80 -212 -95 130 -138 -159 -157 -75 -44 -91 -47 -94 -47 76 164 -274
3319 -274 251 52 -248 -9 63 -116 147 -141 242 -191 133 -119 -87 -21 148 57 3 241 19 36 -140 -124
3341 -124 -310 -15 236 -395 -375 -324 80 55 61 85 -71 172 -93 -298 20 -77 159 -222 -71 -157 427 -231 -84
3364h4K74q5o2k04L53k86K13k11M31n40L64q5r1J33m0P2k95J77j4K45j88r0j71
3387a84K90q6L5j18Q8J10L0K6k29Qn1K18q9N7J36k27K9k8j19K08KK62m47J65j71
3412h5Q0K86k04J31k39KqM29k05j42j40K3J46J39n03J94l59M01O6k04L22k33R8
3435ej34J76j48J86j5o2j45J68J39L0j97M0p5K26qk38R7J19l60K0OL12j47nl0
3460e0QM03k73K7k47R7l1r7K75l41M07m5j59O4j00J58k80Q7K19j88k93L77k1j27
3484a30N8J28O2k36K41O0kl02K27k7j04K6j3n4P4P0p5J62Q4j26kJ90k49J9j09
3509b8p3J86p6J52k05n01M59K34j98M8j88J53J9J05k46J37l5J63j6j90J49j78
3531a29m0K04J20l06j57M68oj23N1j43K16Qj65O2j11Q3LP8k54qM6J74J48J8m73
$$ plain form
3364 -84 190 105 43 -161 192 -94 119 -92 339 -201 163 78 -13 120 80 152 -143 34 20 265 77 -13 -184
3387 -184 106 20 55 -63 25 135 165 191 -38 -30 -81 137 48 105 241 14 43 15 -104 104 106 368 -79 86 -85
3412 -85 -5 281 77 208 -31 -29 -37 392 187 45 -95 -72 74 213 -290 -96 -455 -54 12 -192 130 -103 -5
3435 -5 -139 37 -111 75 60 -2 -147 21 160 190 -7 33 -42 184 176 -62 35 154 -206 -186 -180 132 -15 -20 -50
3460 -50 -42 361 88 115 -132 -35 -66 -163 112 -229 178 133 -26 38 -62 96 -184 -97 122 -66 -359 18 -3 -130
3484 -130 -72 56 118 -118 123 183 181 -121 106 79 -25 1 -12 -66 8 78 3 165 249 123 121 311 62 81 -28
3509 -28 -101 85 9 161 -44 -545 -86 148 -50 -2 -190 -37 -18 87 -159 -22 -57 106 90 -100 49 -129
3531 -129 -169 35 155 -151 -308 160 154 31 82 -61 155 163 -2 60 -51 32 35 113 -141 -149 -103 71 219 237 -236
3556b36L50J04l92L20j84j98K98K46m25Q2RL1Q3jN4l32M12j96j98J32QL9k23K9
3580a88J24M2j32K32r1K2q0M5K03k75J07L1J76k18J04p4P3m0j98J36M00m14O7
3603E2Nr5j73K79K88n31J56o1J7oM1L9M5K9r0J0l3j03K24l0j40J14k52M4K20n2
3629cJ95k30K32j10j18j66K38J76n59L39J50K8mj85j97K85n7qN5k90J45J85k31
3652a30K5K20P1l11J28Pj90N8K95Lj52O7j19r8K07l1l7j5q1K31j20l7K26J91n93
3677a85M3P0J96k81J22m9J56K29J00m74k44M00Rj03J9J12p3k38j06L69Onk97K05
3701a9M3K78k08rK1O0j75lk05L33j08K40n32K94J37k9l91N17j24p6p7m9K08j17
3725IK3q5k87N26k74RK7N0k2k7K53l92K72M0j38O6q6J46m6r0M6l3q8M7Q3J70Q1
$$ plain form
3556 -236 114 218 -174 146 -38 -236 62 308 -117 -35 -26 5 88 87 141 -191 221 25 -173 -41 -33 6 -217 -188
3580 -188 -64 -22 -154 78 -13 9 -71 -26 177 -98 9 40 216 -2 102 28 101 61 -137 -1 399 -15 52
3603 52 57 -38 -211 68 356 -175 -19 -80 -63 -69 -28 11 56 85 -5 5 -28 -131 93 63 -77 37 -215 -171 49 -3
3629 -3 192 -38 194 84 -34 -200 38 214 -345 -6 144 172 168 -17 -214 71 14 6 61 -229 -84 101 -130
3652 -130 -105 115 186 -125 3 10 -180 -122 173 176 24 91 -28 -126 81 50 13 -2 -83 148 28 -9 217 408 -185
3677 -185 -142 -72 124 -157 -35 -84 72 301 401 -73 -317 83 92 -11 8 120 47 -191 -297 72 78 73 -224 -19
3701 -19 24 302 94 85 106 166 -9 -12 -217 116 8 248 -284 10 147 118 -273 244 120 44 -33 -82 126 9
3725 9 32 -53 -340 186 -88 -79 -52 -2 -24 -51 202 -190 82 122 -16 50 -36 110 64 -26 20 -13 -101 -54 29 199 280
3752B80m02K46J18l66O3O8M1j24n0q3K14l0K96n50K89l19K66j97K70M9j93J97
3774H3l03J60rJ25m4R8j49J72p2k4j69M60k26rj91J26M4k38J16N6K5P9J89j67
3798A32l2l5k50M39j35j85J45k51K87j73r3K81k2r9j13j4P7J74l9j62K18k45J54
3821E9J86j70k4j55J67K6k0k67L87o8k32K31j43J00l5l70J11J92N2K74o2j30m10
3844c01K57o5K29k13j83N81m21N7L7J82k89k0J81J01p0k3L4J49k36MnJ30l49N3
3868a80K77k8r9M4n9m0K15j5k06L25o0q6J91o5l32J08l34K86J19l49J1M47k10
3891d0K48m21L77k17m2K41k90Q0J48j28m8J95K77k85l20J52j69K9L28J56k00j40
3913f9J73j67p0K08o6r8K16J92j79j29l5rO3q3o1j3L29k84K9Q1l69O92m02pL80
$$ plain form
3752 280 -122 124 242 -124 -61 7 48 -76 -126 -209 5 -25 271 -279 10 -309 -43 -240 30 79 -114 83
3774 83 -220 -60 -69 56 12 110 -39 133 61 37 -132 328 102 93 -98 28 72 -166 -50 6 31 110 299 132
3798 132 100 65 -185 254 119 -66 79 -172 115 -58 -151 130 108 9 -104 -118 -41 133 94 -68 150 -95 59
3821 59 245 75 51 -104 63 89 69 -198 189 121 -111 120 -23 77 42 -328 -217 -25 27 301 239 109 -301
3844 -301 -44 -109 120 -93 -276 305 -116 -59 -22 160 -129 -149 32 133 63 40 74 223 -13 -9 -14 116 -233 -180
3868 -180 97 69 -30 14 -45 -85 130 115 -91 234 174 88 279 214 -118 -10 -344 -58 61 -288 -277 170 -40
3891 -40 208 -213 164 -53 -95 146 -144 -64 84 -44 -92 103 380 95 -225 -73 -242 -213 115 271 71 -69
3913 -69 104 -63 -133 75 9 -89 127 319 140 11 -24 -33 30 -53 -114 -127 202 -82 -53 28 -341 351 -51 -58 322
3938C22k94j21J30m9R9pj79j31l2M10n8k62L09k16J58J24j00M4Lk41L48j19p8
3961F0J34k40J08l2j09J23J90k47J17j48K25j95Ml2J66j19j99J55P8j14J17P8
3983A20J23j26m29L48k13K32P2k62J49J9n0L7j6P7K03j1k07k21Q8LJ99M0j59l0
4007a4J77j03M8j93k33M92m9J91j40J30j29J6j56k86J90J3k22K47K1Q0r9o0j55
4030b34K52q9N3J19k26L03j24j07k20K25K2l0J54j71J53m15L30J4l7p5J57O4j13
4053Ek3j64R2r3L73j49k99N46k15j33j07j50L13j84K50o4J51k21M05l33K0j69
4075a49M93n39j98L44J42k75K01O3j35K56k46L06l70pJ93J21j46p3l1J24j94N3
4097f7L9J11O5J24l85M5O9K20j14j86l56N44o2l9j02p1n3J90J36r4R9j35p2j85
$$ plain form
3938 322 28 -93 37 -12 87 80 -99 -230 -262 148 90 -172 137 -79 79 203 103 147 150 -91 257 138 60
3961 60 194 -46 62 30 -79 44 234 -13 104 -44 181 -14 -10 -42 124 5 -194 -39 39 -75 42 120
3983 120 243 117 -312 36 -177 55 127 -135 14 33 -17 20 4 81 284 273 66 -155 -67 -64 135 175 16 -14
4007 -14 163 60 108 -85 -318 174 125 316 176 306 177 193 37 -249 -59 -46 -268 -21 0 80 -19 -79 -234
4030 -234 18 -71 -18 101 -125 178 54 -53 -273 -48 -26 -56 98 -73 80 -335 -5 9 -28 -103 54 118 5
4053 5 -18 -182 -90 -183 190 41 -258 288 73 -60 -167 -317 -4 -188 62 -2 149 -72 333 0 20 -149
4075 -149 344 -195 -393 -49 93 -182 19 82 -53 203 -43 263 -107 -114 79 200 54 -19 -50 74 -120 -67
4097 -67 -28 83 148 272 -113 -68 1 221 107 -79 -435 109 47 8 -94 -165 -218 -28 108 14 113 -22 -94 -279
4121b79L31PO2k65J01k29J43oL96k07O9J4n2J98k31J42k90j58J22L28q4r4J69
4144A87j38M4p2m4J8l3n6M2nj72J25J32j84J20L85m54K11q3k13K52j2j72K57j89
4168e4k4oj09P6K10j95K68j68M2J19j58l4J42Pj40K3N9q4j50K38l3k09L80k34
4192c4j48K67k96J91k67K37J10n7j39J90j5o7R9K4l25L79k64R2K46o9QN9m73J67
4216h5J50k05J82k96M97l57j20J25K08r3N7Lr2M0R2m6j03k1J87Qn0j6j22K47j50
4241D0k51J37L67j64p7J5j21K09j19k60J69j0K34n4o1j0j64M3n7j61L96j36j35
4264a70M28k47l0O5J25l03K8R4J02j26k7K56j28Nm7j53P1M9P4l87K36j03q8L09
4288C3J31j73pO9K14j99o4r7M5J92l87J63J01o3K05k74J78K05l27K51J3n76N58
$$ plain form
4121 -279 52 59 121 -144 -43 -272 -129 -135 261 54 123 137 85 283 52 194 -96 -254 -132 196 112 18 187
4144 187 49 93 21 -23 -5 -38 -94 -52 -57 -229 -104 28 -156 -36 349 -105 106 23 -190 62 50 -122 135 -54
4168 -54 -78 -84 -193 -117 93 -102 166 -2 40 159 1 -33 109 116 -24 -1 58 -26 -176 62 29 -180 200 -34
4192 -34 -182 85 -211 -20 -287 -50 60 3 -136 54 39 -28 71 95 -230 149 -115 -23 223 154 162 221 -252 -85
4216 -85 65 -140 42 -254 243 -114 -234 -109 99 6 63 66 -26 14 106 60 -43 -64 123 131 81 65 -57 190 40
4241 40 -211 -74 293 129 52 67 -54 155 36 -224 -55 -65 169 115 54 44 -120 -77 -134 -295 101 -35 -170
4264 -170 258 11 -19 46 171 -132 -104 -10 92 -34 -61 195 67 72 25 -128 -57 -8 66 -321 -85 -188 -276 33
4288 33 164 -9 -16 53 267 68 4 -93 -48 144 -243 -80 21 -42 163 -111 67 272 -55 196 209 -367 191
4311A91l21K47R0k66j40J99q5j20K5L91m05J77J6N3r5pM3j08J26o9MR7J1K0j34
4336f0j59L81k42O7r0q0K4R8P0j32j9J82Q3j32j11K64k6j74P0K29j83k01J64K60
4360B83k52k18Q3K46oj50K19l88oK67k95j60O32k38j31K77k34J08qJ6k63QK80
4383G0j38J76Rrm7j00J4j36K07l6P6j40L17k12k79L44N0j51j76K70j86l12L82
4406gO4m3l3Q6N5k79K74N9k34k1rJ35LJ50k71K70j63l3MO4jO4o3k39Q2j46K88
4433E6k10J00L2J55j04R1l11K3J17J74k70J22L34m34P6m8J71k22k8J47J95k25
4455e9m8J22j8k8K98k16n6m7Q4K7m6L8k18J29J24k21K12j93K04O3m40J60j11K23
4479a7J21o1n23N08j8J14j05n3J4j48K17j32j03l0J20k4O7K41k84J91q1l9L25
$$ plain form
4311 191 -130 117 207 -59 -199 0 -85 -205 -180 211 -194 -17 -1 52 -43 -50 -7 -115 11 -58 -54 43 54 74 -60
4336 -60 -219 162 -80 -13 -103 -183 -159 -61 9 -123 -142 40 123 -9 -120 144 118 -56 14 243 60 -141 23 283
4360 283 31 -187 -104 142 136 -14 205 -183 -189 78 -217 -377 255 17 -114 163 -71 37 29 45 -218 -210 70
4383 70 -68 108 117 108 61 -39 -25 -161 46 10 86 -54 263 51 -228 116 166 15 -161 109 -77 -389 -7
4406 -7 57 14 -19 67 122 -157 117 176 -58 -79 -88 47 50 200 -71 199 36 3 7 71 70 134 71 -168 -86 -232 56
4433 56 -154 -54 -22 133 29 120 -191 -168 -51 123 -147 -25 309 -125 -49 -97 74 -148 -176 -29 166 -59
4455 -59 -107 15 -3 -31 267 51 -5 -52 32 59 13 51 -167 -38 86 -135 77 -116 88 151 -289 -129 -240 -17
4479 -17 104 43 -480 28 10 124 19 -34 -20 -168 49 -83 -186 -216 -96 -120 -53 188 -96 95 14 -25 300
4502C00m33O0P2j71J54Q9M0j64J44q8J65q3k05j19L97l44K95j37J29o7k48J82
4524c2j06lK98l9j18n9j1J00J18j24K04l40J44oj65k2L02k54J5J46Pr2J50j98
4548h5K87m10L73j66q6J71J48l63J70l45K51L5j46M7K33l15O3R2m32N57j33L27
4570B73j72l98L63j30L4k09J61K78R9l43N7K18k93K85n8k7k22K21j49l31M75j76
4592d4J8L84k39j43K60K2m20L88k84Q0P1k13n9J57rM5j31J94k09O5L6J11j3l40
4616b73K54K47j91l5M0j89L35l78J55R1O9l35M00k28K53j01j0k40J04J44k58J60
4638A4j20l8kJ72R5j83j7R2l98M34j45Q1J4k9j63rL6J78K9J94k20J13k36J61k12
4663a59M4P9mJ62j17j29OJ36J17j97m6J04L4J6k9k23K57J31j28N1j64j4L43l78
$$ plain form
4502 300 -133 -73 -1 -172 -18 71 111 -53 91 3 168 85 -120 -239 158 -186 109 -28 101 34 -214 -32
4524 -32 -138 -141 157 118 0 -59 -70 30 148 24 228 -112 32 26 -139 -161 141 -113 -98 48 55 -37 113 -85
4548 -85 202 -208 165 -1 -87 84 232 -131 39 -306 -55 -20 -166 -119 114 -201 -138 -46 -478 79 -54 273
4570 273 101 -297 66 -64 -30 -239 -78 200 299 -44 13 231 -62 223 165 138 -84 137 -12 -343 132 -44
4592 -44 -26 358 119 -24 236 258 -162 226 -58 22 93 -120 -179 -22 -31 14 -117 77 -132 -67 -31 80 67 -273
4616 -273 -19 228 37 2 42 -147 188 -190 -35 56 125 -210 190 -38 215 114 104 -136 -32 112 -146 14
4638 14 -106 -144 -146 26 121 -62 -79 13 -385 49 -96 -15 -1 -30 -193 -202 -166 12 41 235 15 128 -108 53 -159
4663 -159 -115 -36 -40 122 5 -124 -118 18 135 -62 -108 -4 30 46 17 -206 51 182 54 105 -59 -73 270 -108
4687a08R1Q5Lk98J84j81M43j84r7J73j04J06j01j0KL06m53m2l1L30L0j85j49K39
4711D9l1r5Q8q5R4j85L12j7p1M3r0L08j12n5k23L20k32j94L0J9L62j98M4j18O9
4736C2R0j25J05J04N1j95j11Q6j19K44k13J85n6j94J91k07K22k22L0K73k59j55
4758b43K80k1k84L39n3j41J70j85Q0n9K33j61P2m2J17l75L80k40J62J5K09k1j23
4781A09j19p6j5M1J72k4j34n0N4k0J45j36k2m9n7k73M20J97o1K3l29P2K48j30
4805a4OJ41j34J46k76P4J0k04J8L3J97m8RK9q3J83nl19L79K00j05L1n13L73p3
4830E5J56k89mK44p5r2L7k2R2k22K50m46N04l4j15L49k97P8k96K54q2k30L18j06
4854B7k33J97j57L89k69r2K44Qk45l4K91l79K49N6r3K67j25J4j56n7j16L17P3
$$ plain form
4687 -108 -17 68 71 -227 -43 -224 219 35 -62 111 7 113 12 2 4 310 -143 -185 -216 114 144 -41 -190 49
4711 49 18 -77 11 -74 20 -165 147 130 59 102 12 320 208 153 -70 250 18 -176 -146 -127 235 37 81 -37 32
4736 32 122 -3 102 206 257 62 -49 37 -82 162 -51 134 78 -116 75 -132 90 -132 -102 171 -88 -243
4758 -243 37 16 -268 71 18 -123 47 -138 -58 -117 116 -45 27 -15 102 -273 107 -133 29 44 253 232 109
4781 109 -10 -86 -101 -60 112 88 -46 -96 -42 -62 83 -53 -75 -124 -181 -454 -34 163 102 125 -204 -132 116 -14
4805 -14 -8 133 -1 145 -131 -57 -47 -251 -233 -200 -3 -51 -42 -13 -96 87 82 -237 142 342 237 268 -245 128 55
4830 55 211 -78 -82 162 87 -5 32 10 102 -120 130 -316 188 154 39 388 91 169 -127 127 45 -185 133 27
4854 27 -206 -9 -166 223 -46 -138 106 114 -131 -165 126 -253 -4 52 -41 226 101 115 -41 -98 -214 103 176
4877A76Ll31L14k49K24j8j31J28k10J07k04L8J10o6K89j90J20l4r6Kr1M9J99k87
4901a48J98pL41l02j75J55k3j42J55J04j73j63J58J70k24L64l93J47j75L49k42
4922b6j6R2j52J58r9k0o5N7L6J54jk5r9qQ5K03m26J44J18j14K20k47j1k7L56j31
4948A56j93j35J40K44m53L49j16j69K12k64J36Pm9J90N2k81M00o38L34j37M25
4969B10k96K33N7k97J28n3j57l8Q2Q7O7l7N2j16P1L23j24l81K26n0J37m64J16
4992b24J23K13j5l41L82j29m2L0N2k91K18j45n3K59j94L23k42J5J13P9Rl31K45
5015E4q1Q5l17O1P8L31k26oj8j40J89k26K58l93R4KM22k10m8K58J35m48M26q9
5039A91l50j9r6M58k65J54q5J88J05l20j60M20K66m64m0m4N4k8L1K19l29m5K40
$$ plain form
4877 176 179 -152 162 -87 137 119 -12 116 -94 13 -191 -153 -43 -109 180 -10 110 76 -20 -18 -109 -60 139 -148
4901 -148 50 43 384 82 -93 62 39 -103 52 156 -17 -180 -22 148 -76 288 -105 42 -133 216 -26
4922 -26 -42 50 -102 56 -43 -63 -128 -71 -35 119 118 93 -6 -14 71 274 -152 -8 110 -4 216 -31 -42 -69 287 156
4948 156 -37 -172 -32 212 -241 108 -8 -177 35 -229 -93 -86 -135 55 107 -174 226 -412 -78 -215 210
4969 210 -86 147 204 -93 35 -18 -175 -213 -131 -44 23 -14 38 -78 -7 316 192 -189 37 -13 124 -340 -224
4992 -224 -101 112 97 -244 138 9 -33 -3 49 -242 -24 -169 -222 37 -157 166 -76 -61 52 131 140 -191 54
5015 54 -27 58 -259 -198 -120 211 -15 -21 -39 -179 10 -216 42 -351 -257 -255 167 -43 -91 167 302 -146 280 191
5039 191 -159 -178 -274 184 -81 73 -12 176 281 -39 -199 221 487 23 -17 -61 -7 -35 -4 215 -114 -159 81
5062H1n5L1l4J30m08L77j13j7j32K82Ll5j61k3K8j52K83k51J71JK8L2l34J19L06
5087A57j29Oj3P3Po8o4J02j12j5M3K24o6J5k02j7j26LL28l69K08K37m6k13j11
5112a48RK41j22j05J39o7R4O2j40J53J15j67m8k18M31j94R9l04j25K41Q5j33J4
5135h8P7J84j24n3J43j55J81r5J11r7K3r5j29J80nj11p8K72k26K63k14R3J3k51
5159a81L70k85J02k07O0k0Q7L8L8k5P9J87K2l73J89k01L78k09k91K10j32L36l68
5182a96J39Q6P8j80P4N1k7J29m40M62l12jL24k02J35L4j29j38J05m03K02L10m5
5205E6j26N4j01o9K42k9Q3p8J70o5J2J75l28J02J44l68K06j50J6J10k10K53L6
5228A35K9k81K68J8J9m43K46j89J54p6K38j41j24J80N4k31K7J78K3j61n5L02l10
$$ plain form
5062 81 26 57 23 153 -255 122 9 -8 -140 142 145 110 -51 -74 -46 -198 85 -166 5 6 34 66 -268 -149 157
5087 157 28 34 21 94 101 33 -31 71 -41 -56 -13 211 145 160 -42 -59 -185 -182 146 -223 -15 222 176 -37 -148
5112 -148 -139 102 -20 -125 14 -53 41 103 -37 116 231 64 16 -202 229 35 134 -170 -295 -54 31 -102 -88
5135 -88 -11 173 49 -4 139 -16 165 70 181 84 107 12 -117 63 58 -53 -131 141 -85 178 -36 57 70 -181
5159 -181 189 -96 6 -201 -141 -161 -74 -36 2 -23 56 243 265 -108 81 -120 258 49 -242 -32 -164 172 -196
5182 -196 -57 29 107 -73 1 52 25 154 -286 176 -136 -137 187 -15 120 154 25 -113 -8 -411 -209 101 56
5205 56 -70 -16 -117 -186 56 27 110 32 202 137 149 324 -4 98 242 -126 80 -70 -54 56 -154 99 135
5228 135 164 -117 151 169 188 -255 -9 -198 -44 -120 118 -23 -147 33 87 -144 -117 61 84 -77 -132 170 -140
5251a40J84J83n04K81M6jJ1J93j39J4m9j6j98J42J01k67J70m15L95l9J3k27L52
5274I0M3Pl52L4O4K04J51m17Q8K3K07j25P6k02J76J41l05J15K6J71k46N1rk72
5298b61K48K06j37J8J2L3j88PJ47j93J57k71J81J68p5k8P8O3l60j26N1L14j70
5321a26K30m6J20k23k25K52KJ73%k00j32J58j98N9J67j45J34n3J98l1j48K2j01
5344a13K81j82o8O8J26R9k50J49n4j16K01m57J63K99p7n5J34j01J36k23k05K87
5366D2K09j01l5O7j31j98K06K7k03nJ38M5j89K00j9q8m1L5J74J08j97qk38K66
5390F4p6J77k33J60j8j27n8RJ0p9N5OJ43P5j81J46l28L35r5Q7N2k45K64j68j58
5415a83l8K6J14j2p7p7K21J7Q5k53J83j8p8K90k06n0J6L5J5J16k40K36l53Q3J77
$$ plain form
5251 -140 44 227 -277 4 50 49 60 253 114 128 79 63 -135 7 108 -159 11 -404 -9 -48 -35 -262 90
5274 90 133 140 -212 -178 -114 90 241 -176 -88 -65 142 17 93 -109 67 208 -97 18 44 215 -31 20 11 -261
5298 -261 -13 193 56 74 86 119 -69 -62 85 -108 49 -222 -41 127 52 24 102 165 -195 -321 -270 44 -126
5321 -126 104 58 178 -45 -270 -18 -16 157 157 -43 -175 -17 -215 -156 11 -134 0 -53 145 114 -34 -12 -113
5344 -113 168 -14 -82 -14 112 211 -39 110 56 -60 141 -316 -153 146 69 14 148 47 183 -40 -245 42
5366 42 251 150 115 182 51 -147 59 86 -117 -122 16 61 -128 72 53 -35 -76 -41 133 241 44 36 -202 64
5390 64 -12 165 -68 92 74 -53 -111 -102 -92 -171 -116 -110 33 108 -73 73 -255 80 -15 72 124 -121 143 -25 -183
5415 -183 -221 -195 -81 -93 -170 -247 -26 -9 76 -177 6 -12 -90 200 -6 -56 -40 -5 10 126 -114 122 -231 -148 29
5440B9k24J98L2J12j90J04m49K25K67k79M28m05J69J4J4K15l08J69l5k24K49j43
5462c2p0Q4M7N9k51J15L7r9o5K45r3k2k37M66j0j26k18P0K82j12o9k07J52k4J99
5487A21k21k1k3N2K8j40J05J25j09K6Q1j92K90k78K20k23o6M13l10J66k1N0j65
5510i2L17K7j78j6J87j64j59K63J8r2m1K0l56L93q6R1j09n0J9k18K59k06K01K39
5534B67l08N9j16m3J29N2l3k48K77N2p4o1j3O4k21K26jK28k79j32L47n3K7l03
5558a57M3M0O3q4O6L2Q1R1j75l8J55Lj30J08j11J92p2j96J96j43J32O8n09K29
5582a16m6M83l02j80J03j12n9J70K01p1j24j4J2j49J74J42oR3l52%K91l42K84
5605H0L6j56l38K35j87L87k4j83L21j97K35l48J94n9j4K55j26K8m33N43j20p6
$$ plain form
5440 29 -195 3 35 147 -43 61 -388 -163 104 -175 253 -152 17 31 45 260 -48 121 86 -138 111 -32
5462 -32 -102 -18 29 88 -163 -48 -11 -110 -175 70 -23 -45 -282 184 174 48 -170 -100 182 70 1 -206 -54 -78 121
5487 121 -100 -121 -144 -92 -64 -204 -99 26 -83 -57 24 -168 122 -156 64 -159 -225 188 -122 44 23 73 -92
5510 -92 225 252 74 58 245 81 -78 185 203 111 70 90 -266 127 41 132 23 -27 -8 -226 33 -173 28 267
5534 267 -41 18 -98 -141 -12 40 7 -241 36 88 14 -47 -60 4 -217 9 8 236 -43 -175 172 119 146 -157
5558 -157 -114 -74 -11 -95 -29 3 84 175 0 -38 117 120 -10 98 -13 179 107 -89 107 -36 96 164 -345 -116
5582 -116 -162 321 19 -161 -58 -170 -229 -59 142 71 -53 -67 -55 -204 -30 112 106 199 -153 -153 138 -204 80
5605 80 116 -40 -378 -143 -330 57 33 -150 171 -26 209 -139 55 -4 -18 237 111 139 -294 249 129 53
5627E3N0j79J04j27J24p3L9q8j7l0J0J67K7o2p7m8L90k25j48L74J13m54M4j26
5651a59L43k30L2Q7J58l20K49m9k22jLJ76j22L4L0q7J9J71L3j29j21K92l34R2
5675e5K42l37J91J90j16j02l1j5K19k32L36j84k07K51l87K64j13J44K32l04J42
5696A28l0q6J76K4k7l90P9K69J16l17o0J11j79J69k74P12k73j38j34p6O8J26m9
5719e5L9l77L58M8J41m05K68j30K17j36J13k6M8k72J58L45l47j45r0K26r3J41
5741B6j60J30q7J33l20Q1J20K55%j19j15L40j17J9k56K7K4J4M9j1j07l8K00j88
5765a00L27k23R5J06k67J9Qk0j4J00j37j87K85j9J26k6K03l01j44K14k00o7m8
5788b70J33J75k46L6J69P5j3j5Mj27L58o58L31P2L2J15p3k01J10j90M5M04j95
$$ plain form
5627 53 103 -76 28 -99 25 -48 -9 -97 -114 -144 -134 33 60 -2 -79 -127 263 38 -110 264 377 -77 -33 -159
5651 -159 184 -46 -14 73 231 -89 160 111 -111 -112 -109 67 -55 -21 9 -78 -59 112 145 16 -105 187 -147 -55
5675 -55 187 -150 41 231 115 13 -18 -33 186 -46 290 106 -101 150 -237 27 -86 58 290 -14 128
5696 128 98 12 188 212 185 -205 -126 143 259 -58 -118 -7 -186 -17 -291 421 148 10 -124 -200 -132 -6 -55
5719 -55 -16 -393 -35 13 154 -251 17 -113 104 -32 81 55 103 -169 -11 334 -13 -158 -248 -22 -115 26
5741 26 -134 -4 -91 42 -278 -197 -77 178 178 59 -56 284 167 186 -70 -43 -19 -5 44 33 -74 -112 88 -100
5765 -100 227 4 99 205 -62 -43 -35 -55 -69 31 -106 -293 -8 -27 99 73 276 -25 -169 45 -155 -222 -270
5788 -270 -137 38 -208 -172 -3 72 59 44 48 -79 279 -379 -48 24 56 171 98 -103 7 -183 -138 266 71
5811G1o9L6J36j40K8l31J17o1K43O1M4K1k8o6M2k79N5K44k92K10j51K24j21k13
5835b19J33P4J61O1l42N2K06k15J53L2Q9j50P7M9k48n1J55l38O1P06n01ml7K54
5859A58n4j55L2M2j43Q0P0l2n3j60K41k29J90k72L65r1J77m41L46q7K4l06K13
5882h5%L07l85J28N8j65L23k64K51k36j42J08K87l37M0M8Q1j69J23K80m15J74
5904A0n7n4j07J08K64k30J11n6p3n0J03J70j49P0p1q0K20l25K45j02M0j01L26
5927B12j82M2l4J09l6j57M5j07m1K65p4N5m6j13K1p9N7P7j33J77j10k7J08K13
5951B42k91J76N8q4J2l32K26K07k91m4J78k96J41j99K40Q4l0n6M3J6J01l7j87
5974a23k1L05l17K48j4n3O6j5l52K46P0j06j51K41O1j78nj03N1K80j48k84L47
$$ plain form
5811 71 2 38 174 34 62 -269 -152 -213 30 91 135 156 128 62 104 -175 -120 124 -168 42 -109 115 -6 -219
5835 -219 -86 -12 149 210 -132 -80 126 -89 64 96 185 35 112 161 -87 -138 17 -321 -260 446 -55 -59 -96 158
5859 158 104 -51 -19 23 -120 -40 30 -2 -55 -215 26 -203 -13 -285 80 -11 166 -275 71 -16 8 -298 -85
5882 -85 -85 222 -163 -35 23 -142 181 -83 168 -68 -210 -102 185 -152 -112 -64 17 -152 -29 251 -164 10
5904 10 -47 -101 -208 -100 164 -66 45 -11 -84 -134 -31 139 -10 60 -11 -91 129 -196 49 -53 -13 -114 212
5927 212 30 72 38 147 111 -46 -1 -108 -149 116 42 97 51 -62 -41 -120 -63 14 -119 58 -52 -79 29 242
5951 242 -49 127 185 101 113 -219 7 214 -77 -121 57 -239 -98 -297 -57 27 -3 -59 -16 0 101 64 -123
5974 -123 -144 161 -156 92 78 25 91 76 -276 -30 40 -66 -217 24 85 -93 -98 -201 -150 130 -18 -302 45
5997D5j60l8K99n4k27P4K19l45J10L33k02k51K04J95k33L20l98K86J16k41J63
6018B15n7k57K68j54j52J09k32J06j31L82k05K85k74J55J29k08L87k87j67J74
6038H6l5L8J03n57N32j72o2n2j2K90l06L27k28kJ47q0K4l1RN1j56j36N5K25j67
6063a09J47r8k36K94k81J25N4R4p2Q0j66J74L9r2k65M04k31J36O1q8J45j95M6
6086c4n1J45O1k01L5J09q5P3J26k23J06j1j64J16j06M0L20J0l50k23M04k46J48
6109aj30j01K87m7L0P4O3o6j80j26K61Oj06J73P1j73J40L6j61O2l03L24j34o1
6133f2M2L13o6k02ok65M75l92K26J62j31L3j69k4J41j28J27k62k12J69J27NL9
6156f0J56j34J3K52l83K85l75J06K80L9l81LQ2Q3l2jk1Q9NR9j3n18N07r5J25j12
$$ plain form
5997 45 -115 -153 146 92 -135 -61 158 -187 -77 256 54 -197 7 202 -31 289 -109 177 293 52 215
6018 215 158 -99 169 15 -137 -28 -260 -154 -285 97 -108 177 -97 58 187 -21 366 79 -88 86
6038 86 51 89 192 -365 167 -5 -67 -119 -131 159 -147 180 -48 -50 97 17 41 10 19 70 -86 -222 -167 58 -109
6063 -109 38 -60 -296 -2 -283 -158 -104 -10 -82 -2 -168 6 45 -47 -312 92 -139 -3 58 -30 115 -80 -34
6086 -34 -85 60 121 -80 -45 64 -21 52 178 -45 61 50 -114 2 -104 -64 256 266 -84 -307 97 -149 -1
6109 -1 -131 -232 55 8 38 112 175 109 -71 -197 64 70 -36 137 208 35 175 211 50 112 -191 133 -1 -62
6133 -62 -20 293 227 25 19 -246 229 -163 63 225 94 127 -42 -66 75 -53 74 -188 -400 -231 -104 -99 -60
6156 -60 96 -38 -25 227 -156 129 -246 -140 140 179 -202 -199 -117 -34 -66 -67 -88 1 6 105 92 -426 81 -14 111 -1
6182aJ41k53JJ49l2j65J75m59K37L74j08l41K42q6K16j88P9J33j57q3M3Q8M6k2
6206B9j58L1p1j41M49j15j15J05nJ44k77K4J17o0K6j89M08j69L0j65Q2J0J18j79
6230g1K1q5q9K74k13J21J66k41N9j03K87k4j92K04k07M0j8Q1k20L34p8j46m2J71
6254B9K7q9k6J95l38M25l24k01J55J66r7R5K04j82k20J24J13k4j76J37K18m68
6276b57K32j00P5J32j17o8K27j7n0K3m9K15j78j23M5r1J74k42l5L38k11J23j74
6299a28J75J05j79q9J14J20j35m8J01R1l24K82J05l55J84K08j19j18j21R5J24
6320H8ml29K84k9PK18l71j1J6J20K20l98J4J14k1L11J3j37j3l79O05l71K69n53
6344c37M06K32j00Ok13k58L33KJ44J6l7j71j47J1J49O5l5Mj64%J57j10J92o2j12
$$ plain form
6182 -1 140 -113 -112 37 5 -160 15 -444 -207 167 59 -282 -40 -126 90 -98 -19 114 -43 -126 -83 5 51 29
6206 29 -129 -98 -169 -310 139 24 -91 14 9 153 -124 -100 17 -43 -17 -206 202 33 63 -102 -20 -10 108 -71
6230 -71 -50 -135 -224 50 -163 -42 124 -117 -58 -161 126 102 -90 114 -93 -53 -71 10 -210 124 46 -100 -142 29
6254 29 56 -33 -59 136 -202 223 -101 -302 -147 19 -78 17 221 39 -181 -57 56 32 -144 -7 211 -257
6276 -257 -25 -125 -50 82 -35 -103 124 107 57 80 31 246 68 -55 -10 -101 73 -169 -204 134 -77 46 -128
6299 -128 47 152 -27 -116 -2 118 -17 -65 36 127 -197 85 190 -165 19 227 108 -10 -131 -36 88
6320 88 84 -245 39 10 17 235 -136 -147 -131 -11 209 -189 -175 -61 -82 229 242 105 92 -287 318 -53 216 -337
6344 -337 69 301 201 207 -6 -264 69 71 215 231 194 23 -124 -113 36 101 66 70 -94 -94 63 -47 145 83 -29
6369b9j26K1K3q3J55N9K67k78J72j49O5N4m6J74j69l85K59o6L5k0K30n5r8m53
6393d43N03J9k34K24L7j35n3M23k26K54j51l76L3p0K33M6j59Nl45L75J29M6j29
6416Fp2l3j26J22L7%l1J75j01K4M7j30K5J93j20N9J00pk15j12J28J00Ql9L3j6
6442E5J9k9l0K47m01L63l6j22k04J41M9O4j36P5p2j10J01J25m3j11q5J74m2J14
6466A06j25J30Q8q0j08%m3RJ34j31M0J66k70P2j1m8q2J02L9Q7R6r1o0q8L6q7Q2
6493c7K34k95J4K39j60o0m4J77r7n3R1L6k39M29m9m41N19j71l00J24K05k36L42
$$ plain form
6369 -29 -155 -134 -111 -194 -39 20 287 9 181 32 97 151 105 279 110 -275 -16 -82 -47 -67 163 108 10 -443
6393 -443 60 79 -155 69 106 -29 -82 341 115 369 218 -158 -125 -195 38 84 -75 -70 -415 -40 89 135 6
6416 6 -66 -99 -225 -103 -66 -66 -97 78 -23 1 48 -82 -57 136 16 75 175 168 -47 -159 -31 69 77 38 71 55
6442 55 74 45 15 262 -139 224 188 66 -138 3 52 116 -20 55 -17 -127 -26 99 56 -55 -140 34 -8 106
6466 106 -19 111 199 119 11 11 -32 -23 111 -20 20 186 -84 -12 -23 -71 -153 -51 -12 75 171 80 20 -68 -32 -119 -37
6493 -37 197 -98 -84 155 -5 -65 -109 68 -29 -82 9 45 -194 235 186 -255 264 93 -207 -83 122 -114 228
$$ [...]
8191c85
##END NTUPLES=NMR FID
##END=
