##TITLE=1H_DE-88_oil_TFA
 200.13MHz, CDCl3,
 8 sc
 
 4.4.2025
##JCAMPDX= 6.0         $$ Bruker NMR JCAMP-DX V2.0
##DATA TYPE= NMR FID
##DATA CLASS= NTUPLES
##ORIGIN= UXNMR, Bruker Analytische Messtechnik GmbH
##OWNER= pz
$$ XWIN-NMR		Version 3.5
$$ Fri Apr  4 16:20:30 2025 Russian Standard Time (UT+4h)  she@DPX200
##.OBSERVE FREQUENCY= 200.1313
##.OBSERVE NUCLEUS= ^1H
##.DELAY= (6, 6)
##.ACQUISITION MODE= SIMULTANEOUS
##.ACQUISITION SCHEME= undefined
##.AVERAGES= 8
##.DIGITISER RES= 18
##SPECTROMETER/DATA SYSTEM= spect
##.PULSE SEQUENCE= zg30
##.SOLVENT NAME= CDCl3
##.SHIFT REFERENCE= (INTERNAL, CDCl3, 0, 14.3821)
##AUDIT TRAIL= $$ (NUMBER, WHEN, WHO, WHERE, WHAT)
$$ ##TITLE= Audit trail, XWIN-NMR		Version 3.5
$$ ##JCAMPDX= 5.01
$$ ##ORIGIN= Bruker BioSpin GmbH
$$ ##OWNER= she
$$ F:/spectra/data/she/nmr/H-C/1/audita.txt
$$ ##AUDIT TRAIL=  $$ (NUMBER, WHEN, WHO, WHERE, WHAT)
(   1,<2025-04-04 16:18:52.65 +0400>,<she>,<DPX200>,
      <created by zg, POWCHK disabled, PULCHK disabled
       configuration hash MD5:
       00 E9 B6 7A A2 85 ED C7 34 08 36 98 17 FE 4E 26
       data hash MD5: 16K
       35 F6 09 2E F2 63 DC 77 15 51 6C 97 6F CE 6F 0E>)
$$ ##END=
$$ 
$$ hash MD5
$$ BF 0D 56 CA C1 7C 2C 41 75 3A 99 3C 37 FE 59 11
##$RELAX= 
##$RELAX= 
##$RELAX= 
##$RELAX= 
##$RELAX= 
##$RELAX= 
$$ Bruker specific parameters
$$ --------------------------
##$DU= <F:/spectra>
##$EXPNO= 1
##$NAME= <H-C>
##$PROCNO= 1
##$TYPE= <nmr>
##$USER= <she>
##$AMP= (0..31)
100 100 100 100 100 100 100 100 100 100 100 100 100 100 100 100 100 100 
100 100 100 100 100 100 100 100 100 100 100 100 100 100 
##$AQSEQ= 0
##$AQ_mod= 1
##$AUNM= <au_zg>
##$AUTOPOS= <>
##$BF1= 200.13
##$BF2= 200.13
##$BF3= 200.13
##$BF4= 200.13
##$BF5= 200.13
##$BF6= 200.13
##$BF7= 200.13
##$BF8= 200.13
##$BYTORDA= 1
##$CFDGTYP= 0
##$CFRGTYP= 5
##$CHEMSTR= <none>
##$CNST= (0..31)
1 1 145 1 1 1 1 1 1 1 1 1 1 1 1 1 1 1 1 1 1 1 1 1 1 1 1 1 1 1 1 1 
##$CPDPRG= <>
##$CPDPRG1= <>
##$CPDPRG2= <>
##$CPDPRG3= <>
##$CPDPRG4= <mlev>
##$CPDPRG5= <mlev>
##$CPDPRG6= <mlev>
##$CPDPRG7= <mlev>
##$CPDPRG8= <mlev>
##$CPDPRGB= <>
##$CPDPRGT= <>
##$D= (0..31)
0 0.7 0 0 0 0 0 0 0 0 0 0.03 0 0 0 0 0 0 0 0 0 0 0 0 0 0 0 0 0 0 0 0 
##$DATE= 1743769131
##$DBL= (0..7)
120 120 120 120 120 120 120 120 
##$DBP= (0..7)
150 150 150 150 150 150 150 150 
##$DBP07= 0
##$DBPNAM0= <>
##$DBPNAM1= <>
##$DBPNAM2= <>
##$DBPNAM3= <>
##$DBPNAM4= <>
##$DBPNAM5= <>
##$DBPNAM6= <>
##$DBPNAM7= <>
##$DBPOAL= (0..7)
0.5 0.5 0.5 0.5 0.5 0.5 0.5 0.5 
##$DBPOFFS= (0..7)
0 0 0 0 0 0 0 0 
##$DE= 6
##$DECBNUC= <off>
##$DECIM= 32
##$DECNUC= <off>
##$DECSTAT= 4
##$DIGMOD= 1
##$DIGTYP= 9
##$DL= (0..7)
0 120 120 120 120 120 120 120 
##$DP= (0..7)
150 150 150 150 150 150 150 150 
##$DP07= 0
##$DPNAME0= <>
##$DPNAME1= <>
##$DPNAME2= <>
##$DPNAME3= <>
##$DPNAME4= <>
##$DPNAME5= <>
##$DPNAME6= <>
##$DPNAME7= <>
##$DPOAL= (0..7)
0.5 0.5 0.5 0.5 0.5 0.5 0.5 0.5 
##$DPOFFS= (0..7)
0 0 0 0 0 0 0 0 
##$DQDMODE= 0
##$DR= 18
##$DS= 0
##$DSLIST= <SSSSSSSSSSSSSSS>
$$ [...]
##$SUBNAM0= <"">
##$SUBNAM1= <"">
##$SUBNAM2= <"">
##$SUBNAM3= <"">
##$SUBNAM4= <"">
##$SUBNAM5= <"">
##$SUBNAM6= <"">
##$SUBNAM7= <"">
##$SUBNAM8= <"">
##$SUBNAM9= <"">
##$SW= 18.0517328524113
##$SWIBOX= (0..15)
0 0 2 0 0 0 0 0 0 0 0 0 0 0 0 0 
##$SW_h= 3612.71676300578
##$TD= 16384
##$TD0= 1
##$TE= 0
##$TE2= 300
##$TE3= 300
##$TEG= 300
##$TL= (0..7)
0 120 120 120 120 120 120 120 
##$TP= (0..7)
150 150 150 150 150 150 150 150 
##$TP07= 0
##$TPNAME0= <>
##$TPNAME1= <>
##$TPNAME2= <>
##$TPNAME3= <>
##$TPNAME4= <>
##$TPNAME5= <>
##$TPNAME6= <>
##$TPNAME7= <>
##$TPOAL= (0..7)
0.5 0.5 0.5 0.5 0.5 0.5 0.5 0.5 
##$TPOFFS= (0..7)
0 0 0 0 0 0 0 0 
##$TUNHIN= 0
##$TUNHOUT= 0
##$TUNXOUT= 0
##$USERA1= <user>
##$USERA2= <user>
##$USERA3= <user>
##$USERA4= <user>
##$USERA5= <user>
##$V9= 5
##$VALIST= <valist>
##$VCLIST= <CCCCCCCCCCCCCCC>
##$VD= 0
##$VDLIST= <DDDDDDDDDDDDDDD>
##$VPLIST= <PPPPPPPPPPPPPPP>
##$VTLIST= <TTTTTTTTTTTTTTT>
##$WBST= 1024
##$WBSW= 4
##$XGAIN= (0..3)
0 0 0 0 
##$XL= 0
##$YL= 0
##$YMAX_a= 135170
##$YMIN_a= -145955
##$ZGOPTNS= <>
##$ZL1= 120
##$ZL2= 120
##$ZL3= 120
##$ZL4= 120
##$ABSF1= 10
##$ABSF2= 0
##$ABSG= 5
##$ABSL= 3
##$ALPHA= 0
##$AQORDER= 0
##$ASSFAC= 0
##$ASSFACI= 0
##$ASSFACX= 0
##$ASSWID= 0
##$AUNMP= <proc_1d>
##$AZFE= 0.1
##$AZFW= 0.1
##$BCFW= 1
##$BC_mod= 2
##$BYTORDP= 1
##$COROFFS= 0
##$CY= -3
##$DATMOD= 1
##$DC= 2
##$DFILT= <>
##$DTYPP= 0
##$F1P= 0
##$F2P= 0
##$FCOR= 0.5
##$FTSIZE= 0
##$FT_mod= 4
##$GAMMA= 1
##$GB= 0.15
##$INTBC= 1
##$INTSCL= 1
##$ISEN= 128
##$LB= 0.25
##$LEV0= 0
##$LPBIN= 0
##$MAXI= 10000
##$MC2= 0
##$MEAN= 0
##$ME_mod= 0
##$MI= 1.114404
##$NCOEF= 0
##$NC_proc= 0
##$NLEV= 6
##$NOISF1= 3.799351
##$NOISF2= 2.8
##$NSP= 1
##$NTH_PI= 0
##$NZP= 0
##$OFFSET= 14.38212
##$PC= 1
##$PHC0= -831.9023
##$PHC1= 15.39221
##$PH_mod= 1
##$PKNL= yes
##$PPARMOD= 0
##$PSCAL= 0
##$PSIGN= 0
##$REVERSE= no
##$SF= 200.129724274929
##$SI= 16384
##$SIGF1= 3
##$SIGF2= 2
##$SINO= 400
##$SIOLD= 16384
##$SREGLST= <1H.CDCl3>
##$SSB= 0
##$STSI= 0
##$STSR= 0
##$SW_p= 3205.1282051282
##$SYMM= 0
##$S_DEV= 0
##$TDeff= 0
##$TDoff= 0
##$TI= <>
##$TILT= no
##$TM1= 0
##$TM2= 0
##$TOPLEV= 0
##$USERP1= <user>
##$USERP2= <user>
##$USERP3= <user>
##$USERP4= <user>
##$USERP5= <user>
##$WDW= 1
##$XDIM= 8192
##$YMAX_p= 0
##$YMIN_p= 0
$$ End of Bruker specific parameters
$$ ---------------------------------
##NTUPLES= NMR FID
##VAR_NAME=  TIME,          FID/REAL,        FID/IMAG
##SYMBOL=    X,             R,               I
##VAR_TYPE=  INDEPENDENT,   DEPENDENT,       DEPENDENT
##VAR_FORM=  AFFN,          ASDF,            ASDF
##VAR_DIM=   8192,          8192,            8192
##UNITS=     SECONDS,       ARBITRARY UNITS, ARBITRARY UNITS
##FACTOR=    0.0002768,     1,               1
##FIRST=     0,             0,               0
##LAST=      2.2672688,     0,               0
##MIN=       0,             -145955,         0
##MAX=       2.2672688,     135170,          0
$$ Real data points
##PAGE= N=1
##DATA TABLE= (X++(R..R)), XYDATA
$$ plain form
0 0 0 0 0 0 0 0 0 0 0 0 0 0 0 0 0 0 0 0 2 -8 8 -8 8 -8 13 -16 16 -16 22 -24 29 -32 37 -41 46 -53 60 -68 75 -83
40 -83 93 -102 114 -126 139 -155 170 -188 206 -227 251 -277 304 -336 372 -411 456 -508 567 -636
60 -636 719 -818 946 -1108 1325 -1633 2105 -2930 4783 -18786 22627 15702 -60009 34065 133870
75 133870 35231 -51115 70170 124949 -19514 -78575 57835 65764 -105457 -109431 35326
86 35326 -11555 -134273 -45288 83287 5211 -83559 29059 127943 20381 -43116 73235
97 73235 94389 -38782 -52675 51876 36680 -66452 -50033 24817 -22249 -81728 -6091 50165
109 50165 -14921 -42276 28171 52309 -12455 -24448 54934 66420 -14236 -19835 38543 13602
121 13602 -44274 -12391 36583 -15440 -76483 -25228 23370 -29331 -48789 18062 37204 -8404
$$ packed form
0@%%%%%%%%%%%%%%%%%%Kj0J6j6J6j6K1k9L2l2L8m6N3o1O9p8Q7r9J13j28J43j58
40h3J76j95K16k40K65k94L25l58L94m33M78n28N81o40P08p83Q67r64J075j203
60f36J355j537J764k054K433k958L738n035P713k3569M1413o925p5711R4074R9805
75A33870r8639q6346J21285N4779j44463n9061J36410P929j71221l974J44757
86C5326m6881j22718Q8985J28575p8076q8770J12618R8884j07562o3497J16351
97G3235K1154j33171j3893J04551j5196j03132J6419P4850m7066n9479P5637N6256
109E0165o5086k7355P0447K4138o4764j1993P9382J1486q0656n599N8378k4941
121A3602n7876L1883M8974n2023o1043N1255M8598n2701j9458O6851J9142m5608
$$ plain form
133 -8404 -6451 45573 47888 3790 11789 43963 9369 -32817 -9631 10093 -19830 -40401 -16574
146 -16574 -1253 -26951 -28536 13529 21195 -5914 -3818 18385 18481 249 2979 28306 18864 -15870
160 -15870 -7700 15075 -3709 -23273 -4638 11326 -13863 -32058 393 15989 -13143 -7904
172 -7904 24676 13161 -11227 3028 25910 12974 -11529 -1215 10346 -14266 -22472 -94
184 -94 251 -15529 -12713 719 2610 -5715 3570 22510 13374 81 8325 11124 3029 -1043 1502
199 1502 5520 -7081 -20451 -6937 2849 -9009 -10406 860 1677 -9090 -7763 11740 13233 -3314
213 -3314 5127 16916 1657 -4983 7963 10868 -1387 -9844 -3783 -4637 -16895 -9355 5221 -1758
227 -1758 -7026 622 3665 4137 7142 12870 13414 1598 -2521 3217 -1081 -5089 -2816 -3790 -5847 -10656
$$ packed form
133h404J953N2024K315m4098P999L2174l4594m2186K3186J9724k9923k0571K3827
146a6574J5321k5698j585M2065P666k7109K096K2203R6j8232K730K5327r442l4734
160a5870Q170K2775j8784j9564J8635J5964k5189j8195L2451J5596k9132N239
172g904L2580j1515k4388J4255K2882j2936k4503J0314J1561k4612q206K2378
184i4L45j5780K816J3432J891q325R285J8940r136j3293Q244K799q095m072K545
199A502M018j2601j3370J3514R786j1858j397J1266Q17j0767J327J9503J493j6547
213c314Q441J1789j5259o640J2946K905j2255q457O061q54j2258P540J4576o979
227a758n268P648L043M72L005N728N44j1816m119N738m298m008K273r74k057m809
$$ plain form
243 -10656 -12582 -1734 2674 -1864 1640 5462 2317 -817 2977 12399 10608 672 3969 4085 -5442
258 -5442 -2383 4315 -163 -6444 -8706 -7109 -7926 -9363 -686 4168 -2234 -252 4207 2839 6122
273 6122 10195 10141 7300 454 -2622 -1585 -3841 -2731 -1793 -5814 -6336 -7723 -6955 2285 5068 935
289 935 3229 4178 1235 46 2737 7492 3745 -3155 -32 -618 -6407 -1332 3026 -1000 -2791 -2961
305 -2961 -3256 -3572 -1705 5004 4105 -2221 923 2963 -187 3597 6268 3029 417 -2948 -3397 -2411
321 -2411 -3448 -1250 -1084 -4395 -2441 -2541 -2281 4656 5279 1868 3620 2607 58 117 1657 3160 -741
338 -741 -4899 -1707 -2647 -4880 730 1644 -1633 -96 295 -708 266 2045 4428 1126 -2226 1630
354 1630 927 -2354 1836 2423 -1017 -1423 -2778 -2288 -514 -825 372 -684 -2163 754 395 -208 4681
$$ packed form
243a0656j926J0848M408m538L504L822l145l134L794R422j791r936L297J16r527
258e442L059O698m478o281k262J597q17j437Q677M854o402J982M459j368L283
273F122M073n4k841o846l076J037k256J110R38m021n22j387P68R240K783m133
289I35K294R49k943j189K691M755l747o900L123n86n789N075M358m026j791j70
305b961k95l16J867O709q99o326L144K040l150L784K671l239k612l365m49R86
321b411j037K198J66l311J954j00K60O937O23l411J752j013k549N9J540J503l901
338g41m158L192r40k233N610R14l277J537L91j003R74J779K383l302l352L856
354A630p03l281M190N87l440m06j355M90J774l11J197j056j479K917l59o03M889
$$ plain form
371 4681 3249 -108 1461 849 -651 -85 -221 -218 -2598 -4213 -568 -1448 -2270 2379 1321 -1125 1753
388 1753 1614 650 1910 1930 1680 -1111 -2324 1371 -234 -2032 1619 361 -2518 -898 -640 -248 1083
405 1083 -246 -475 -1129 -626 2145 527 393 3819 972 -1610 1091 714 -110 215 -739 -1501 -2759
422 -2759 -2662 312 -362 -112 2582 -318 -1679 2323 1700 680 1564 318 -471 -2005 -1412 1711 -142
439 -142 -837 2005 -462 -1886 1126 687 807 1299 -697 -1807 -2403 -1206 641 -466 -2 2255 -1441
456 -1441 -2023 2438 2122 1106 1448 -159 -582 -1179 -818 973 -193 199 1384 -2153 -2163 1437 262
473 262 -511 808 -517 -1792 -2246 -775 2145 1017 417 1944 -463 -379 2600 1134 648 1108 -1092
490 -1092 -2171 -2397 -1218 125 -1326 -603 1140 -1989 -1194 2467 1735 1648 2132 78 -307 -373 10 1053
$$ packed form
371D681j432l357J569o12j500N66j36Lk380j615L645q80q22M649j058k446K878
388A753j39r64J260K0k50k791j213L695j605j798L651j258k879J620K58L92J331
405A083j329k29o54N03K771j618j34L426k847k582K701l77q24L25r54p62j258
422b759R7K974o74K50K694k900j361M002o23j020Q84j246p89j534N93L123j853
439a42o95K842k467j424L012m39J20M92j996j110n96J197J847j107M64K257l696
456a441n82M461l16j016L42j607m23n97L61J791j166L92J185l537j0L600j175
473B62p73J319j325j275m54J471K920j128o00J527k407Q4K979j466m86M60k200
490a092j079k26J179J343j451P23J743l129P95L661p32q7M84k054l85o6L83J043
$$ plain form
508 1053 -94 -450 -212 -2780 -1500 1406 -805 -814 816 -630 -1060 -1026 189 2121 1061 1131 1690 -410
526 -410 332 2237 207 620 682 -1922 -2370 -1735 -1090 -439 -1868 -709 561 -1568 -63 2330 598
543 598 1400 2294 181 237 458 247 937 -257 -44 -97 -2379 -330 1161 -1313 -775 738 -790 -578
561 -578 -279 -40 804 -441 236 1138 -524 688 1195 -597 791 1278 -1089 -750 -233 162 286 -1054
579 -1054 -68 811 -867 282 1027 -711 146 336 -1268 -48 329 -518 -388 -342 742 972 -655 1123
597 1123 1389 -1136 260 907 -922 92 135 -669 -212 -956 -265 107 -543 642 377 -1543 478 835
615 835 -482 708 1193 371 79 -247 745 1008 -805 213 34 -1839 -738 -599 -1569 130 250 -854
633 -854 -446 98 1212 1291 430 2117 1589 -802 702 753 -654 419 -483 -1921 -1336 -1421 -743 -461 -522
$$ packed form
508A053j147l56K38k568J280K906k211rJ630j446m30L4J215J932j060P0N59k100
526d10P42J905k030M13O2k604m48O35O45O51j429J159J270k129J505K393j732
543E98Q02Q94k113N6K21k11O90j194K13n3k282K049J491k474N38J513j528K12
561e78K99K39Q44j245O77R02j662J212N07j792J388M87k367L39N17L95J24j340
579a054R86Q79j678J149P45j738Q57J90j604J220L77q47J30M6J084K30j627J778
597A123K66k525J396O47j829J014M3q04M57p44O91L72o50J185k65j920K021L57
615H35j317J190M85q22k92l26R92K63j813J018j79j873J101J39r70J699J20j104
633h54M08N44J114P9q61J687n28k391J504N1j407J073r02j438N85q5O78K82o1
$$ plain form
652 -522 848 -220 -1114 987 1153 -37 1647 1533 171 420 174 691 679 -104 285 -519 -2071 -924
670 -924 -1018 -1572 159 -418 -1401 -209 233 1002 1273 862 2367 1465 -586 879 793 -575 389 -569 -1910
689 -1910 -1000 -1370 -1072 -612 -392 775 -356 -1113 1260 1049 73 1441 1002 -19 530 101 221 597
707 597 -15 495 -521 -1437 -37 -636 -1142 283 -359 -1150 -289 -107 460 677 286 1549 707 -351 1454
726 1454 458 -599 624 -272 -1119 -271 -731 -876 -336 -190 369 -462 -451 1233 237 -569 890 11 -695
745 -695 209 -218 53 418 -150 387 -5 99 968 -275 -759 766 -439 -759 133 -507 -360 -168 -412
764 -412 428 -29 -256 1072 -22 -387 689 -271 -313 792 -1 -88 32 -152 110 -325 -259 824 -807
783 -807 -1132 269 -577 -592 580 -364 -124 262 -180 639 552 825 1270 -176 -248 861 -451 -690 405
$$ packed form
652e22J370j068q94K101J66j190J684j14j362K49k46N17j2p83L89q04j552J147
670i24r4n54J731n77r83J192M42P69K71m11J505r02k051J465q6j368R64r58j341
689a910R10l70K98M60K20J167j131p57K373k11r76J368m39j021N49m29J20L76
707E97o12N10j016r16J400n99n06J425o42p91Q61J82N67K17l91J263q42j058J805
726A454r96j057J223q96q47Q48m60j45N40J46N59q31J1J684r96q06J459q79p06
745f95R04m27K71L65n68N37l92J04Q69j243m84J525j205l20Q92o40J47J92k44
764d12Q40m57k27J328j094l65J076r60m2J105p93q7J20j84K62m35O6J083j631
783h07l25J401q46j5J172r44K40L86m42Q19q7K73M45j446p2J109j312k39J095
$$ plain form
802 405 -421 -892 -982 -1141 -139 -124 -169 614 -437 -283 729 -99 435 1549 479 160 187 -21 456 43
822 43 362 341 -1089 -1305 -333 -1144 -533 537 -727 -381 -4 -192 507 859 1094 1356 -315 -3 825 -444
842 -444 -132 644 -413 -591 -761 -1027 -3 -94 -50 345 -630 -335 372 -302 618 1463 -42 -248 260 42
862 42 736 107 113 265 -902 -878 -79 -918 -352 501 -912 -464 233 -300 455 729 679 799 -496 -145 476
883 476 -618 163 490 -661 -298 -224 -488 254 222 76 120 -637 -409 171 -705 412 785 -593 -277 116
903 116 -98 640 458 430 534 -387 -232 344 -513 278 414 -972 -143 132 -420 224 218 65 150 -711 -88
924 -88 397 -458 307 457 -584 236 207 4 846 377 187 -51 -595 25 -282 -795 15 -257 -1035 -213 98
945 98 -288 552 262 197 365 119 528 793 -51 205 41 -793 273 236 -516 162 -110 -292 -354 -735 59
$$ packed form
802D05q26m71r0j59J002J5m5P83j051J54J012q28N34J114j070l19K7k08M77m13
822D3L19k1j430k16R72q11O11J070j264L46L77j88O99L52K35K62j671L12Q28j269
842d44L12P76j057j78j70k66J024r1M4L95r75K95P07o74R20Q45j505k06N08k18
862D2O94o29OJ52j167K4P99q39N66Q53j413M48O97n33P55K74n0J20j295L51O21
883D76j094P81L27j151L63P4k64P42l2j46M4p57K28N80q76J117L73j378L16L93
903A16k14P38j82k8J04r21J55N76q57P91J36j386Q29K75n52O44oj53Q5q61O23
924h8M85q55P65J50j041Q20k9k03Q42m69j90k38n44O20l07n13Q10k72p78Q22L11
945I8l86Q40k90o5J68k46M09K65q44K56j64q34J066l7p52O78k72j82o2l81P94
$$ plain form
966 59 314 -433 -3 88 -319 622 740 69 838 322 -147 207 -256 196 45 -921 -285 -438 -1341 44 74
987 74 -185 192 -127 -197 379 297 629 849 -78 384 -71 -646 491 185 -352 -128 -354 -766 -383 -427 307
1008 307 289 -503 78 -217 -291 752 713 274 889 141 -402 348 275 437 -18 -704 -183 -554 -1045 118 279
1029 279 -75 81 -223 -508 365 367 448 466 -14 173 -341 -228 867 522 -138 401 -382 -570 -52 -129 256
1050 256 57 -547 -237 -401 -535 726 380 -62 555 -307 -357 264 230 599 267 -412 19 -333 -503 782
1070 782 133 -62 171 -581 -562 306 -16 148 -140 -410 30 -265 -318 919 412 171 513 -177 4 364
1090 364 152 434 -54 -719 -238 -673 -423 355 -35 -533 116 -663 -263 368 249 680 125 -416 222 -50
1110 -50 -48 608 15 -223 114 -708 -379 294 -147 -281 -303 -456 -163 -391 -208 838 111 141 617 69 144 828
$$ packed form
966E9K55p47M30R1m07R41J18o71P69n16m69L54m63M52j51r66O36j53r03J385L0
987G4k59L77l19p0N76q2L32K20r27M62m55n75J137l06n37K24k26m12L83m4P34
1008C07j8p92N81k95p4J043l9m39O15p48n43P50p3J62m55o86N21l71m91J163J61
1029B79l54J56l04k85Q73KQ1J8m80J87n14J13J095l45o60N39p83j88N18p7L85
1050B56j99o04L10j64j34J261l46m42O17q62n0O21l4L69l32o79M31l52j70J285
1070G82o49j95K33p52J9Q68l22J64k88k70M40k95n3J237n07k41L42o90J81L60
1090C64k12K82m88o65M81m35K50P78l90m98O49p79M00O31j19M31n55n41O38k72
1110e0KO56n93k38L37q22L29O73m41j34k2j53K93k28J83J046p27L0M76n48P5O84
$$ plain form
1132 828 38 180 -59 -482 -331 -560 -3 169 -683 -679 101 -616 -87 478 290 300 64 -227 254 206 290 665
1154 665 -106 -133 226 -229 -155 231 -368 -192 -406 -481 -89 -275 -144 492 -105 -66 698 76 528 697 225
1175 225 205 -24 -209 43 6 -40 43 -695 -259 62 -259 -22 375 -74 95 -39 -183 351 191 98 361 -356
1197 -356 0 289 -178 231 422 -149 -266 -325 -318 134 -120 -50 211 -528 -175 328 -3 333 472 -248 52
1218 52 -7 -98 252 90 68 87 -620 -106 61 -284 241 176 -372 -143 -353 -204 357 39 -103 180 -421 15
1240 15 415 76 503 408 -253 -213 -131 29 468 -44 -86 -81 -578 -329 15 -107 291 72 -774 -251 -82 23
1262 23 504 192 307 219 -270 249 348 86 439 99 -443 -419 -308 -317 81 -239 -203 -170 -576 115 365 217 659
1285 659 429 -206 185 20 95 493 -14 -164 -262 -618 -166 -118 -288 194 -28 -520 -64 160 -84 359 186
$$ packed form
1132H28p90J42k39m23J51k29N57J72q52MP80p17N29N65j88J0k36k91M81m8Q4L75
1154F65p71k7L59m55P4L86n99J76k14p5L92j86J31O36n97L9P64o22M52J69m72
1175B25k0k29j85K52l7m6Q3p38M36L21l21K37L97m49J69j34j44N34j60r3K63p17
1197c56L56K89m67M09J91n71j17n9PM52k54P0K61p39L53N03l31L36J39p20L00
1218E2n9r1L50j62k2J9p07N14J67l45N25o5n48K29k10J49N61l18j42K83o01M36
1240A5M00l39M27r5o61M0Q2J60M39n12m2Nm97K49L44j22L98k19q46N23J69J05
1262B3M81l12J15q8m89N19R9k62L53l40n42K4J11rL98l20L6L3m06O91K50j48M42
1285F59k30o35L91j65P5L98n07j50r8l56M52M8j70M82k22m92M56K24k44M43j73
$$ plain form
1306 186 125 306 -274 391 597 256 360 103 -499 -110 3 -292 27 -471 -252 -382 -204 25 394 126
1326 126 623 168 -231 345 103 66 251 -52 -192 -127 -480 -103 -34 -156 122 -71 -418 40 -50 -262 161
1347 161 58 5 -131 -196 330 305 35 408 -25 -252 232 -159 -235 26 -363 -436 -144 -297 121 127 -143 366
1369 366 14 -87 249 -2 16 449 -126 -233 218 -97 5 95 -85 226 -101 -319 96 -56 -221 6 -182
1390 -182 -347 56 -6 277 234 -79 276 32 -122 423 100 19 223 -188 -203 -19 -44 95 -47 -374 -25 -164
1412 -164 -302 107 -161 -93 -87 -253 3 200 162 268 175 31 174 -131 -17 293 -38 -289 -74 -394 -190 -46
1434 -46 -44 182 -24 -139 139 -154 -41 506 -57 -24 102 -134 -14 108 48 191 -47 -295 118 -249 -202 221
1456 221 -267 -177 -142 -486 -130 132 227 382 63 104 150 -156 134 509 -172 -245 112 -405 -131 97 9 -157
$$ packed form
1306A86o1J81n80O65K06l41J04k57o02L89J13k95L19m98K19j30J78K29L69k68
1326A26M97m55l99N76k42l7J85l03j40O5l53L77O9j22K78j93l47M58r0k12M23
1347A61j03n3j36o5N26k5k70L73m33k27M84l91p6K61l89p3K92j53M18Ok70N09
1369C66l52j01L36k51J8M33n75j07M51l15J02R0j80L11l27k18M15j52j65K27j88
1390a82j65M03o2K83m3l13L55k44j54N45l23q1K04m11j5J84k5J39j42l27L49j39
1412a64j38M09k68O8Oj66K56J97l8J06r3j44J43l05J14L10l31k51K15l20K04J44
1434d6KK26k06j15K78k93J13N47n63L3J26k36J20J22o0J43k38k48M13l67M7M23
1456B21m88R0L5l44L56K62R5J55l19M1M6l06K90L75o81p3L57n17K74K28q8j66
$$ plain form
1478 -157 -161 18 84 -32 46 467 -11 -218 171 -63 183 186 97 162 -76 -79 -59 -227 -181 95 -200 -241 -22 -303
1502 -303 -82 372 116 241 169 -16 237 -8 291 399 -72 -124 246 -306 32 74 -245 177 -45 -79 -46 -126
1524 -126 111 203 -369 102 123 -198 46 346 -4 213 37 -273 151 -77 60 193 -30 -131 108 -311 -142
1545 -142 143 -207 2 -120 -66 6 -28 132 239 -187 76 51 -105 41 276 -80 175 -17 -76 -5 -33 -80 104
1568 104 -257 -92 -110 -284 -91 39 -32 109 92 49 318 172 248 140 -124 200 122 -166 32 -52 -287 -140
1590 -140 -186 -188 114 -3 106 124 -129 57 30 62 393 248 66 86 26 -70 148 -20 -218 -116 -523 -195 -18
1613 -18 -460 -48 -70 -391 47 -143 12 262 112 228 49 -83 202 14 -135 113 26 -241 -159 -357 -263 -104
1635 -104 -6 -231 87 -250 -22 88 -12 342 58 112 126 141 25 -26 -17 103 110 -232 -90 -49 -190 -85 127
$$ packed form
1478a57mJ79O6j16P8M21m78k07L89k34K46Lq9O5k38lK0j68M6K76k95m1K19k81
1502c03K21M54k56J25p2j85K53k45K99J08m71n2L70n52L38M2l19M22k22l4L3q0
1524a26K37R2n72M71K1l21K44L00l50K17j76l10M24k28J37J33k23j01K39m19J69
1545a42K85l50K09j22N4P2l4J60J07m26K63k5j56J46K35l56K55j92n9P1k8m7J84
1568A04l61J65j8j74J93J30p1J41j7m3K69j46P6j08k64L24p8k88J98q4k35J47
1590a40m6kL02j17J09J8k53J86k7L2L31j45j82K0o0r6K18j68j98J02m07L28J77
1613a8m42M12k2l21M38j90J55K50j50J16j79j32K85j88j49K48q7k67Q2j98R4J59
1635a04R8k25L18l37K28J10j00L54k84N4J4J5j16n1RJ20Pl42J42M1j41J05K12
$$ plain form
1658 127 -214 145 23 -49 190 55 82 -78 -2 254 217 70 234 -25 -240 -63 -24 -76 179 -237 -132 -143
1680 -143 -101 88 88 -6 189 -103 -145 424 267 -91 175 5 77 54 -170 -4 61 -128 -41 -124 -397 109 -17
1703 -17 -62 80 46 199 127 -72 109 53 -26 231 -14 -105 169 -139 101 142 -90 96 -242 -365 185 14 -247
1726 -247 174 26 -24 109 -2 110 190 0 115 36 12 191 107 -105 -26 -230 -189 10 -197 146 -44 -245
1748 -245 -88 -123 -59 91 21 55 274 52 -49 294 21 86 253 -127 62 178 -112 -88 -186 -158 -14 -289 -191
1771 -191 140 23 14 16 -58 99 142 -33 51 -17 -23 118 -117 5 172 -351 -157 170 -127 -108 -71 -146 137 39 -248
1796 -248 238 -48 29 313 -6 85 151 -163 -75 73 33 -148 -247 181 -106 -288 -112 15 -1 -90 -2 -24 56 104
1820 104 -122 201 -37 156 -3 -87 87 64 -142 167 -64 -280 186 -44 -23 -114 -212 -236 93 -120 -102 155
$$ packed form
1658A27l41L59j22p2K39j35K7j60P6K56l7j47J64k59k15J77L9n2K55m16J05j1
1680a43M2J89%r4J95k92m2N69j57l58K66j70P2k3k24J66O5j89Q7q3k73N06j26
1703a7m5J42l4J53p2j99J81n6p9K57k45r1K74l08K40M1k32J86l38j23N50j71k61
1726b47M21j48n0J33j11J12Q0j90J15p9k4J79q4k12P9k04M1J99k07L43j90k01
1748b45J57l5O4J50p0L4K19k22j01L43k73O5J67l80J89J16k90K4r8K8J44k75R8
1771a91L31j17rKp4J57M3j75Q4o8oJ41k35J22J67n23J94L27k97J9L7p5K83r8k87
1796b48M86k86P7K84l19R1O6l14Q8J48m0j81r9M28k87j82J76J27j6q9Q8k2Q0M8
1820A04k26L23k38J93j59q4J74k3k06L09k31k16M66k30K1r1r8k4L29k13J8K57
$$ plain form
1842 155 -74 -10 271 -23 105 -102 0 25 91 -106 93 -130 -80 84 -214 -114 -164 -59 59 -175 -163 65
1864 65 -202 -19 148 -38 88 232 -42 142 196 -65 6 67 -161 -85 -223 -41 64 -41 -49 -119 -230 -59 56
1887 56 -22 35 63 178 197 168 100 216 -163 -73 -120 -350 10 103 -128 73 -56 -186 -25 -36 120 151 3 141
1911 141 337 44 53 96 -55 101 148 -29 112 -107 -182 -103 -248 -120 125 -255 -57 52 -14 170 22 41 140
1934 140 -45 114 50 -172 -53 38 -137 90 -142 -65 0 -142 -128 -120 -153 -83 -161 11 167 187 -57 379 189 -87
1958 -87 -91 -127 28 -62 -95 16 -14 -176 51 162 -68 -51 57 -5 11 -97 -140 140 83 14 230 -147 49 -31 -114
1983 -114 52 121 -183 9 -79 -93 -128 -50 -39 34 -272 -157 -27 -8 208 96 -126 36 -19 -119 327 96 -28
2006 -28 33 24 85 64 116 94 216 26 -60 125 -173 5 81 -3 154 -36 70 168 -35 26 -40 -63 141 -52 106
$$ packed form
1842A55k29O4K81k94J28k07J02K5O6j97J99k23N0J64k98J00n0J05J18k34J2K28
1864F5k67J83J67j86J26J44k74J84N4k61P1O1k28P6j38J82J05j05qp0j11J71J15
1887E6p8N7K8J15J9k9o8J16l79R0m7k30L60R3k31K01j29j30J61j1J56L1j48J38
1911A41J96k93RM3j51J56M7j77J41k19p5P9j45J28K45l80J98J09o6J84j48J9R9
1934A40j85J59o4k22J19R1j75K27k32P7O5j42J4Ql3P0p8J72J56K0k44M36j90k76
1958h7ml6J55r0l3J11l0j62K27J11k30J7J08o2J6j08m3K80n7o9K16l77J96q0q3
1983a14J66O9l04J92q8j4l5P8J1P3l06J15J30J9K16j12k22J62n5j00M46k31j24
2006b8O1rO1k1N2k2J22j90q6J85k98J78P6q4J57j90J06R8k03O1o6k3K04j93J58
$$ plain form
2031 106 17 -58 -62 -78 -204 -68 -47 -150 72 21 -12 182 -46 -9 23 132 -65 194 -156 88 111 14 110 -134
2055 -134 -33 150 -111 -80 34 -150 -66 -7 -199 43 133 -72 112 -2 -70 134 28 108 102 -3 -75 -156 -191 -166
2079 -166 -52 -113 163 -247 -94 100 -87 -93 82 159 -51 134 81 -33 161 -157 116 -9 3 130 113 86 81
2102 81 -283 -121 3 -67 -78 33 -30 102 20 -10 -122 93 -18 312 120 85 -158 10 31 -37 -61 153 71 -80
2126 -80 -17 -54 32 235 -119 -31 71 -114 -18 -100 57 170 -4 -89 -26 -16 1 20 -102 -17 -110 53 -66 -86 -110
2151 -110 -34 -156 -8 60 -159 10 61 -92 61 63 -105 -38 5 41 -22 148 199 30 -53 -19 -20 -291 -233 154 -57
2176 -57 200 61 -167 164 127 76 310 17 -19 1 -124 93 -40 -160 -21 -36 -196 -71 -207 46 98 -62
2198 -62 -145 86 -35 39 -149 -206 181 183 -212 -21 -198 -139 -9 -5 38 110 -132 -88 80 -131 76 -79 -142 38
$$ packed form
2031A06q9p5mj6j26J36K1j03K22n1l3J94k28L7L2J09j97K59l50K44K3r7R6k44
2055a34J01J83k61L1J14j84Q4N9j92K42R0k05J84j14o8K04j06Q0oj05p2q1l5K5
2079a66J14o1K76m10J53J94j87oJ75P7k10J85n3j14J94l18K73j25J2J27j7k7n
2102H1l64J62J24p0j1J11o3J32q2l0j12K15j11L30j92l5k43J68K1o8k4K14q2j51
2126h0O3l7Q6K03l54Q8J02j85R6q2J57J13j74q5O3J0J7J9j22Q5r3J63j19k0k4
2151a10P6j22J48O8k19J69N1j53J53Kj68O7M3L6o3J70N1j69q3L4jk71N8L87k11
2176e7K57j39k28L31l7n1K34k93l6K0j25K17j33j20J39j5j60J25j36K53N2j60
2198f2q3K31j21P4j88n7L87Kl95J91j77N9J30MM3P2k42M4J68k11K07j55o3J80
$$ plain form
2222 38 73 13 109 -91 179 223 66 36 -93 25 152 -234 -124 -44 -188 -104 -31 -70 68 -59 -82 40 84 37
2246 37 149 68 1 160 -47 -70 58 -152 -163 -197 -209 111 -42 -243 -24 -68 -104 23 -141 -140 -92 -132 44 -44 -43
2271 -43 115 75 -28 42 -38 -232 14 -44 -48 -139 -218 -10 -141 -65 9 39 16 29 -48 -107 121 112 96 30 110 10 30
2298 30 36 102 152 -31 -16 78 -123 -49 -75 29 -107 -94 69 165 -60 25 -9 28 -37 -39 -111 273 52 -58 143 -184
2324 -184 -20 -164 -172 -68 -155 -184 -63 -67 24 74 -4 90 101 64 160 31 85 235 17 -123 52 116 96 177 -85 39
2350 39 -128 -173 -195 79 107 159 66 -73 171 114 -1 -50 31 47 -94 -28 -123 -70 -87 -46 -46 -143 -20 -33 -134 -22
2376 -22 -6 71 -16 -15 54 -80 -100 -7 -129 -106 40 -144 -9 -157 -146 -73 11 -201 25 21 -96 -113 -151 -195 -32 -59
2402 -59 -58 130 -60 128 168 90 119 -36 -86 58 -179 -88 94 -174 -126 -133 -26 -55 100 -82 -78 120 145 125 -6
$$ packed form
2222C8L5o0R6k00K70M4j57l0j29J18J27l86J10Q0j44Q4P3l9J38j27k3J22M4m7
2246C7J12q1o7J59k07k3J28k10j1l4j2L20j53k01K19m4l6J27j64JM8m0J76q8J
2271d3J58m0j03P0q0j94K46n8mr1p9K08j31P6P4L0k3J3p7n9K28rj6o6Q0j00K0
2298C0OO6N0j83J5R4k01P4k6J04j36J3J63R6k25Q5l4L7o5kp2L84k21j10K01l27
2324a84J64j44qJ04q7k9J21mR1N0p8R4J1l7R6j29N4J50k18j40J75O4k0Q1k62J24
2350C9j67m5k2K74K8N2r3j39K44n7j15m9Q1J6j41O6r5N3j7M1%r7J23j3j01J12
2376b2J6P7q7JO9j34k0R3j22K3J46j84J35j48J1P3Q4k12K26mj17j7l8m4J63k7
2402e9JJ88j90J88M0p8K9j55n0J44k37R1J82k68M8pJ07k9J55j82MJ98K5k0j31
$$ plain form
2427 -6 -129 -48 64 117 -4 -125 -89 -40 17 100 -121 -157 -2 -99 -130 -13 -95 -119 172 -75 5 149 -25 102 48
2452 48 151 -89 14 -110 146 -93 -56 141 -111 -183 29 -83 21 -179 -18 10 -15 1 64 131 88 75 106 71
2476 71 -135 -29 108 -93 -64 -96 84 -153 98 -168 7 -17 -144 76 58 19 54 66 49 122 82 1 -101 61
2500 61 -7 21 -74 -25 -55 -280 107 28 -82 33 -129 213 167 13 25 14 -73 -90 30 -7 -8 97 78 77 -30 -48
2526 -48 43 -130 -19 157 96 50 -22 18 -84 -9 -14 43 -201 -51 191 45 118 -43 -3 40 115 -122 20 -53 110
2551 110 96 -186 -16 -90 42 -10 29 81 208 33 23 96 -51 34 -38 -89 -113 130 -35 -15 51 -155 18 26 -159
2576 -159 -65 44 -21 -87 -52 116 65 -59 -5 57 -255 101 214 -2 144 42 22 -53 71 -106 -58 -66 18 113 -176
2601 -176 9 -137 -54 208 -17 -92 -15 15 -49 61 -50 36 -3 53 176 24 69 -31 8 -147 -65 -64 61 -24 57
$$ packed form
2427fj23Q1J12N3j21j21L6M9N7Q3k21l6J55r7l1J17q2k4K91k47Q0J44j74J27n4
2452D8J03k40J03j24K56k39L7J97k52p2K12j12J04k00J61K8k5J6O3O7m3j3L1l5
2476G1k06J06J37k01K9l2J80k37K51k66J75k4j27K20j8l9L5J2j7P3m0q1j02J62
2500F1o8K8r5M9l0k25L87p9j10J15j62L42m6j54J2j1q7j7J20l7jJ05j9jj07j8
2526d8R1j73J11J76o1m6p2M0j02P5nN7k44J50K42j46P3j61M0M3P5k37J42p3J63
2551A10j4k82J70p4J32n2L9N2J27j75j0P3j47Q5p2n1k4K43j65K0O6k06J73Qj85
2576a59R4J09o5o6L5J68n1j24N4O2l12L56J13k16J46j02k0p5J24j77M8qQ4R5k89
2601a76J85j46Q3K62k25p5P7L0o4J10j11Q6l9N6J23j52M5j00L9j55Q2JJ25q5Q1
$$ plain form
2626 57 31 230 141 178 0 -12 2 102 25 34 78 25 47 -222 -80 -2 -196 -116 -78 55 73 -157 -44 57 -20 140
2652 140 1 34 48 156 6 -3 78 -235 53 -164 -117 60 -155 -147 -33 -129 65 -86 13 128 -16 176 45
2675 45 -22 33 57 -1 188 12 -147 -127 -28 -30 88 -79 -7 -22 -108 -54 10 -59 112 21 -78 90 1 -108 88 62
2701 62 -18 -144 -53 -91 20 -128 59 65 -199 -4 60 -126 263 2 -188 127 -75 152 17 -31 -21 45 27 -33
2725 -33 -18 -53 -61 -20 -56 38 -200 50 7 1 8 17 -190 44 178 -64 210 -41 86 199 -131 -69 -216 143 -45
2750 -45 -16 -137 -107 -193 -17 25 -69 61 -38 -38 -169 -150 81 243 6 -101 -72 120 -63 198 -62 -62 47 -79
2774 -79 -66 -40 -156 -16 -80 -104 9 98 71 90 103 -29 76 -17 -85 146 -105 -232 -89 33 -66 -102 -5 163 -212
2799 -212 33 -70 -191 21 21 -170 -36 12 59 47 0 -123 216 -69 -20 96 -84 93 -83 -101 -148 225 -61
$$ packed form
2626E7k6J99q9L7j78j2J4J00p7RM4n3K2k69J42P8j94Q0L8J33J8k30J13J01p7J60
2652A40j39L3J4J08j50rQ1l13K88k17M7J77k15QJ14r6J94j51R9J15j44J92j31
2675D5o7N5K4n8J89j76j59K0R9kJ18j67P2j5q6N4O4o9J71r1r9J68q9j09J96k6
2701F2q0j26R1l8J11j48J87Ok64J95O4j86L89k61j90L15k02K27j35m8J0O6j8o0
2725c3J5l5qM1l6R4k38K50m3oPRk07K34J34k42K74k51J27J13l30O2j47L59j88
2750d5K9j21L0q6J76M2r4J30r9%j31J9K31J62k37j07K9J92j83K61k60%J09j26
2774g9J3K6j16J40o4k4J13Q9k7J9J3j32J05r3o8K31k51j27J43J22r9l6R7J68l75
2799b12K45j03j21K12%j91J34M8M7j2m7j23L39k85M9J16j80J77j76j8m7L73k86
$$ plain form
2822 -61 -54 128 -25 -51 -91 -20 61 -89 107 59 152 52 74 -198 4 156 -12 38 -318 9 -72 -212 -27 13
2846 13 -107 -61 11 -64 149 -52 -70 90 16 192 87 -145 -44 -71 45 -21 -92 -70 -46 -73 -91 93 -214 90
2870 90 23 -28 45 115 55 244 30 -77 258 -28 47 42 -283 -46 -106 -73 -159 110 140 -66 -7 -76 54 -66 85
2895 85 -97 81 24 -33 31 179 57 -16 162 -51 -128 66 -124 -83 -86 -162 -20 159 -75 -54 -114 -93 -28 87 14
2920 14 101 -83 11 80 -169 -11 -11 125 192 33 -43 16 -117 -184 -10 78 104 -107 -168 15 71 76 -49 31 92 -41
2946 -41 -41 202 82 -34 -81 -35 -12 -43 -103 -106 -146 15 -219 -9 96 -39 146 -25 52 -2 128 70 49 -145 212
2971 212 22 -115 66 -111 -72 -110 -82 -34 31 -234 22 117 -66 75 -10 1 -14 -55 16 86 -85 -77 11 -94 7
2996 7 94 -136 -77 -59 -73 8 73 11 -26 59 -66 152 69 79 256 -14 88 55 55 -46 -26 -203 122 110 20 -24 -33
$$ packed form
2822f1PJ82j53k6m0P1Q1j50J96m8R3j00K2k72K02J52j68N0l56L27q1j40J85M0
2846A3j20M6P2p5K13k01j8J60p4J76j05k32J01k7J16o6p1K2K4k7j8J84l07L04
2870I0o7n1P3P0o0J89k14j07L35k86P5nl25K37o0L3q6K69L0k06N9o9J30j20J51
2895H5j82J78n7n7O4J48j22p3J78k13p7J94j90M1lp6J42J79k34K1o0K1O5J15p3
2920A4Q7j84R4O9k49J58%J36O7j59p6N9j33o7J74Q8K6k11o1J83N6Nj25Q0O1j33
2946d1%K43j20j16m7M6K3l1o0lm0J61k34K10J05j35J85j71P7n4J30n8k1j94L57
2971B12j90j37J81j77L9l8K8M8O5k65K56R5j83J41q5J1j5m1P1P0j71QQ8j05J01
2996GQ7k30N9J8j4Q1O5o2l7Q5j25K18q3J0J77k70J02l3%j01K0j77L25j2r0m4r
$$ plain form
3023 -33 -14 -12 -76 82 54 -65 8 -70 -33 1 -166 7 -101 76 -10 140 49 -184 -12 57 -91 -333 -87 65
3047 65 30 -29 -19 39 84 -51 152 91 30 86 178 -137 -38 5 -31 41 -224 -107 57 -138 55 39 71 -13 100 -52
3073 -52 -80 90 -120 88 135 -257 147 -59 106 169 -39 25 31 -22 -98 -25 -162 -20 -23 14 -111 -246 28 71 101
3098 101 219 71 -48 230 198 -5 -46 38 -73 66 -160 -38 -23 -65 109 95 -95 -34 9 -39 -73 141 -72
3121 -72 -90 -88 -124 -120 -41 -26 0 95 -5 29 -33 37 64 -82 91 -23 37 -23 -49 48 126 -80 34 3 98 41 88 -100
3149 -100 158 -76 76 112 37 -241 -91 -61 100 -129 -116 -92 129 144 -65 -18 46 119 -210 28 112 -43 -38 -8
3173 -8 -60 34 73 -107 2 45 -20 -54 -125 -113 88 43 90 -1 -148 80 -90 73 -30 -4 -83 63 143 -190 -10
3198 -10 19 -145 -205 -19 43 212 -10 74 -27 -47 23 56 100 -2 -32 -95 73 -27 -73 -55 10 -5 -46 -19 201 -20
$$ packed form
3023c3J9Ko4J58k8j19P3p8L7L4j67J73j08J77q6J50r1k33J72O9j48k42K46J52
3047F5l5n9J0N8M5j35K03o1o1N6R2l15R9M3l6P2k65J17J64j95J93j6L2q4J13j52
3073e2k8J70k10K08M7l92M04k06J65O3k08O4On3p6P3j37J42lL7j25j35K74M3L0
3098A01J18j48j19K78l2k03m1Q4j11J39k26J22J5m2J74j4j90O1M3m8l4K14k13
3121g2j8Kl6MP9J5K6R5j00L4o2P0K7j46J73j14O0o0k6R7P8k06J14l1R5n7M7j88
3149a00K58k34J52L6p5k78J50L0J61k29J3K4K21J5k09M7O4P3l29K38Q4j55NL0
3173hn2R4L9j80J09M3o5l4p1J2K01m5M7r1j47K28j70J63j03K6p9J46Q0l33J80
3198a0K9j64o0J86O2J69k22Q4j01k0P0L3M4j02l0o3J68j00m6J8O5j5m1K7K20k21
$$ plain form
3224 -20 -121 -31 -90 -55 77 5 12 67 33 92 -5 56 73 -83 94 86 81 19 -116 92 -166 -138 -121 39 63 -24 21 -17
3252 -17 -44 114 -103 -85 16 -35 37 -71 17 -89 38 -51 -30 -11 -38 85 -21 -108 -20 -98 -11 -148 -144 -34 -147
3277 -147 21 149 3 148 -35 -141 -3 55 169 -125 -261 16 -26 -85 -25 33 21 -27 105 -96 53 38 101
3300 101 44 75 80 117 83 20 -11 -71 -61 -17 -51 -234 -72 -100 79 137 35 221 28 79 116 -118 -116 51 30 86 37
3327 37 159 14 -34 -161 -153 -148 -48 14 -347 -188 5 -80 19 -33 -38 265 -61 97 143 -150 46 61 -153 0 15
3352 15 -10 -72 -137 -161 -61 38 -126 37 -44 -41 114 176 3 -253 59 15 27 93 30 45 60 -66 -35 -68 -12 34 -60
3379 -60 -90 46 72 92 -95 -2 -85 223 -15 87 229 63 -85 -115 250 -95 20 -244 -43 -7 207 17 68
3402 68 10 37 -66 74 65 170 33 -183 12 131 61 32 35 177 -86 54 -33 -56 -30 -10 -81 -49 -104 -65 108 -58
$$ packed form
3224b0j01R0n9L5J32p2PN5l4N9r7O1J7j56J77qno2j35K08k58K8J7J60K4q7M5l8
3252a7k7J58k17J8J01n1P2j08Q8j06J27q9K1J9k7J23j06q7Q8p8Q7j37MJ10j13
3277a47J68J28j46J45j83j06J38N8J14k94j36K77m2n9O0N8j2m8J32k01J49j5O3
3300A01n7L1NL7l4o3l1o0J0M4l4j83J62k8J79N8j02J86j93N1L7k34KJ67k1N6m9
3327C7J22j45m8j27QNJ00O2l61J59J93q5R9n2nL03l26J58M6k93J96J5k14J53J5
3352A5k5o2o5k4J00R9j64J63q1LJ55O2j73k56L12m4J2O6o3J5J5j26L1l3N6M6r4
3379f0l0J36K6K0j87R3q3L08k38J02J42j66j48l0L65l45J15k64K01L6K14j90N1
3402F8n8K7j03J40rJ05j37k16J95J19p0k9LJ42k63J40q7k3K6K0p1L2n5L9J73j66
$$ plain form
3428 -58 129 200 36 18 -78 -55 39 -72 146 6 21 25 28 130 77 -24 -40 46 7 47 58 -51 -7 5 17 -69 89
3455 89 59 -49 143 -27 -77 -7 28 49 -21 0 75 108 -160 14 -13 92 100 -5 -74 39 5 60 93 -113 -78 41
3481 41 111 115 -167 -69 -34 -39 150 50 -182 -2 -78 -156 -71 149 -9 178 -112 -67 53 37 -21 75 82 243 181 -205
3507 -205 49 85 136 -56 -28 -47 43 29 -10 -143 -24 140 -67 -24 -11 106 53 -6 23 -149 171 -170 -28 -48
3531 -48 -210 84 -90 -178 -110 -2 -140 80 -125 -91 11 4 -2 37 6 127 79 -65 73 72 68 -156 3 -44 128
3556 128 65 14 21 65 -24 -38 -20 -61 168 -38 -57 -96 105 41 -73 -29 -103 -14 2 36 93 112 62 58 83 -90 -83 -36 -33
3585 -33 -40 50 93 141 -29 -120 147 -201 -133 131 59 37 238 -54 183 8 -259 7 -72 -1 -131 -149 -18 28 -5
3610 -5 145 -143 -77 14 -53 -191 41 97 29 102 -30 -45 -87 89 -117 64 -22 137 -14 97 38 -182 37 80
$$ packed form
3428e8J87P1j64j8r6K3R4j11K18j40J5MLJ02n3j01j6Q6l9M0J1j09M4J2J2q6J58
3455H9l0j08J92j70n0P0L5K1p0K1P5L3k68J74k7J05Qj05o9J13l4N5L3k06L5J19
3481D1P0Mk82R8L5nJ89j00k32J80p6p8Q5K20j58J87k90M5J20j6n8R6PJ61o2l86
3507b05K54L6N1j92K8j9R0j4l9j33J19J64k07M3J3J17n3n9K9j72L20l41J42k0
3531d8j62K94j74q8O8J08j38K20k05L4J02poL9l1J21m8j44J38jmk24J59m7J72
3556A28o3n1PM4q9j4J8m1K29k06j9l9K01o4j14M4p4Q9J6L4N7J9n0mK5j73PM7L
3585c3pR0M3M8j70r1K67l48O8K64p2k2K01k92K37j75k67K66p9P1j30j8J31M6l3
3610eJ50k88O6R1o7j38K32N6o8P3j32j5m2J76k06J81q6J59j51J11n9k20K19M3
$$ plain form
3634 80 -102 -6 88 -49 -55 20 32 38 -91 -63 1 -23 -138 94 -196 -82 -89 31 -177 46 -49 -10 -111 -121 -87 9
3660 9 173 -40 103 77 25 169 -11 -118 -39 -5 67 -262 68 -8 -55 117 -133 10 5 100 143 -118 74 -56
3684 -56 -181 87 45 59 -35 29 -34 -135 33 -79 17 77 -147 41 -194 -59 65 32 -122 -14 -38 107 141 35
3708 35 -32 69 58 -54 107 -73 95 29 -43 88 131 -57 44 -104 -44 -33 6 193 -17 57 105 16 31 111 -17
3733 -17 65 -96 -79 61 117 -6 53 57 -11 -69 149 -31 -11 -140 -201 22 105 -125 38 -22 -23 -67 62 12 -95 -160
3759 -160 42 -52 199 48 -172 22 32 -6 -70 104 11 124 59 -77 -11 -70 3 67 -82 99 -120 -83 -41 -77
3783 -77 46 -195 -85 -89 -115 11 -73 -111 15 79 -24 103 35 -94 57 -43 44 -174 -87 72 44 67 -100 -77
3807 -77 5 0 -22 -127 -7 60 -81 -135 -19 42 -8 77 -97 146 -97 62 -75 114 -86 14 -32 10 75 11 -59
$$ packed form
3634H0j82R6R4j37oP5J2Oj29K8O4k4j15K32k90J14pJ20k08K23r5L9j01j0L4R6
3660IJ64k13J43k6n2J44j80j07P9L4P2l29L30p6m7J72k50J43nR5M3k61J92j30
3684e6j25K68m2J4r4O4o3j01J68j12R6O0k24J88k35J35J24l3j54J08k4J45L4j06
3708C5o7J01j1j12J61j80J68o6p2J31M3j88J01j48O0J1L9J87k10P4M8q9J5Q0j28
3733a7Q2j61J7J40N6j23N9Mo8n8K18j80K0j29o1K23Q3k30J63o0jm4J29n0j07o5
3759a60K02r4K51j51k20J94J0l8o4J74r3J13o5j36O6n9P3O4j49J81k19L7M2l6
3783g7J23k41J10mk6J26q4l8J26O4j03J27o8j29J51j00Q7k18Q7J59k8K3j67K3
3807g7Q2nk2j05J20O7j41n4J16O1n0Q5j74K43k43J59j37J89k00J00m6M2O5o4p0
$$ plain form
3832 -59 -133 15 -100 -86 49 95 111 151 -19 -224 -165 -84 -26 3 -78 -3 -9 -40 -92 -11 16 2 69 142 67 368 19
3859 19 -4 17 60 -8 -7 18 15 -38 50 -32 -33 85 38 -150 85 122 167 77 32 17 14 -54 82 -65 116 4 -5 65 -114
3888 -114 132 -60 -78 151 65 -115 -81 71 -103 -44 -48 -38 113 151 61 -19 10 -12 -82 46 81 -170 -51 -13 -85
3913 -85 114 -40 -109 -60 -22 -79 -84 57 88 70 -21 86 25 61 -104 -24 -131 5 -7 24 -53 -21 38 -51 39 -68 -91
3940 -91 -154 -120 -53 -44 74 -105 -83 63 44 107 -72 39 -49 -58 176 -90 134 226 48 35 -34 89 -72 143 120
3965 120 70 -113 37 6 34 -77 5 -59 93 73 -57 27 -4 101 -1 155 -45 -59 22 -53 31 -25 -119 110 18
3990 18 -212 -28 -131 -12 -213 -124 -25 126 -126 130 23 -161 -67 -104 -123 135 56 -70 -53 -109 12 -53 24 11
4014 11 69 -137 16 81 22 71 45 -40 123 80 -154 -129 -187 81 16 47 82 44 -152 58 27 146 16 -158 16
$$ packed form
3832e9p4J48j15J4J35M6J6M0j70k05N9Q1N8K9q1P5ol1n2Q1K7j4O7P3p5L01l49
3859A9k3K1M3o8JK5ln3Q8q2jJ18m7j88K35L7M5r0m5j5lo8J36j47J81j12rP0j79
3888a14K46j92j8K29q6j80L4J52j74N9mJ0J51L8r0q0K9k2p0J28L5k51J19L8p2
3913h5J99j54o9M9L8n7nJ41L1j8r1J07o1L6j65Q0j07J36j2L1p7L2N9q9R0j07k3
3940i1o3L4O7RJ18j79K2J46j9O3j79J11q8rK34k66K24R2j78j3o9J23j61K15k3
3965A20n0j83J50l1K8j11Q2o4J52k0j30Q4l1J05j02J56k00j4Q1p5Q4n6r4K29r2
3990A8k30J84j03J19k01Q9R9J51k52K56j07j84R4l7j9K58p9j26J7n6J21o5P7j3
4014A1N8k06J53O5n9M9k6q5J63m3k34K5n8K68o5L1L5l8j96K10l1J19j30j74J74
$$ plain form
4039 16 186 193 -60 72 -57 -18 43 87 135 -54 28 23 77 -15 190 -86 -59 -58 -39 -19 23 38 28 -17 -68 -206 -153 -102
4067 -102 -124 36 -179 74 96 112 -161 5 68 95 243 53 52 -61 105 120 78 -45 196 83 19 25 -14 64 7
4092 7 64 -29 177 68 -54 -25 19 39 61 -155 -119 -22 95 -58 29 -137 115 25 -149 27 -41 -125 283 -53 17
4117 17 13 -6 -36 54 88 97 70 -39 -174 58 36 -132 89 93 68 8 38 88 -112 -34 -119 -11 51 8 2 -177 -96 -47
4145 -47 -124 42 11 -77 -129 -3 -67 69 123 -73 29 214 -87 -51 60 -35 -90 49 -85 19 -33 1 94 28 -132
4170 -132 43 -28 -72 80 -120 -7 125 -29 52 -131 -27 25 182 4 110 -41 -31 -47 -40 -36 -56 54 16 -17
4194 -17 -21 -30 -76 82 119 69 197 220 52 165 13 64 74 17 -27 6 -57 12 -91 -92 -16 -48 -26 -10 -29 -67 96 -58
4222 -58 72 -95 7 55 57 72 23 -75 -101 156 -92 -22 -77 -135 -50 -48 40 -89 -64 -4 -25 64 -87 47 -9 -44 -7
$$ packed form
4039A6J70Pk53J32j29L9O1M4M8j89Q2nN4r2K05k76K7JJ9K0M2J5j0m5n1j38N3N1
4067a02k2J60k15K53K2J6k73J66O3K7J48j90jj13J66J5m2j23K41j13o4Ol9P8n7
4092GN7r3K06j09j22K9M4K0K2k16L6R7J17j53Q7j66K52r0j74J76o8q4M08l36P0
4117A7mj9l0R0L4Rk7j09j35K32k2j68K21Mk5o0L0N0k00P8q5J08O2m3oj79Q1M9
4145d7p7J66l1q8n2J26o4J36N4j96J02J85l01L6J11r5n5J39j34J04n2L4R3o6j60
4170a32J75p1m4J52k00J13J32j54Q1j83J04N2J57j78J06j51J0j6PMk0J10l8l3
4194a7mrm6J58L7n0J28K3j68J13j52N1J0n7m4L3o3O9j03jP6l2K2J6j9l8J63j54
4222e8J30j67J02M8KJ5m9r8k6K57k48P0n5n8Q5KQ8j29K5O0k1Q9j51J34n6l5L7
$$ plain form
4249 -7 2 -27 -103 -212 -106 -225 19 53 -122 -208 -19 -76 -20 -25 -96 -82 -62 61 -12 19 2 160 37 -4 -221 -19
4275 -19 -61 -14 66 29 -116 30 22 -148 8 -81 -154 -33 -132 96 -104 -1 252 -35 -30 -63 -2 26 68 48 -141 42
4301 42 -4 -57 83 -64 -54 109 82 19 115 -122 -222 -124 92 179 80 -57 154 103 -108 -94 -107 -132 84 51 -78
4326 -78 92 -39 -69 -62 -82 106 13 -62 -75 -8 -58 51 62 -40 -80 -69 -83 -86 56 -156 42 -7 -60 -85 -158 -62 132
4353 132 25 -63 25 -26 -73 -5 -49 11 19 -41 -99 -210 12 3 -91 12 -156 33 122 -74 -33 47 29 -42 3 -79 144
4380 144 13 95 -22 53 29 143 -68 -185 -140 61 -111 114 -16 25 -180 60 237 71 99 -55 80 63
4402 63 -104 5 13 -26 47 -43 -44 -1 -47 0 63 -81 13 -80 34 40 66 -153 91 -15 131 -199 25 48 47 49 -90
4429 -90 28 -127 21 103 -118 -111 136 -27 -14 -14 -18 -26 -14 66 86 -58 129 21 -64 82 -28 -55 120 -58 -40 0
$$ packed form
4249gRk9p6j09J06j19K44L4j75q6J89n7N6np1J4K0J23p3L1j7J58j23m1k17K02
4275a9m2M7Q0l7j45J46qj70J56q9p3J21r9K28k00J03K53k87Nl3O1K8M2k0j89J83
4301D2m6n3J40j47J0J63k7o3R6k37j00R8K16Q7r9j37K11n1k11J4j3k5K16l3j29
4326g8J70j31l0Pk0J88r3p5j3O7n0J09J1j02m0J1j4lJ42k12J98m9n3k5p3R6J94
4353A32j07q8Q8n1m7O8m4O0Qo0n8j11K22rr4J03j68J89Q9j96M1Q0j8p1M5q2K23
4380A44j31Q2j17P5k4J14k11j17M5K01j72K25j30M1k05K40J77j66K8j54J35j7
4402F3j67J09Ql9P3r0jM3m6M7O3j44R4r3J14OK6k19K44j06J46l30K24K3jKj39
4429i0J18j55J48Q2k21PK47j63J3%mqJ2Q0K0j44J87j08q5J46j10k7J75j78J8M0
$$ plain form
4455 0 64 -102 -114 1 154 -75 -28 207 6 74 -93 166 9 -42 -14 85 -170 -20 58 125 52 30 70 -61 -143
4480 -143 96 137 180 -15 145 -75 -121 -61 115 -43 112 -25 54 68 -2 66 -53 16 -9 8 19 79 -201 70
4504 70 -27 205 41 170 -139 -49 -55 -7 -121 -139 -36 18 58 101 64 22 130 -66 76 -119 -62 -89 -5 59 -55
4529 -55 45 15 26 -35 62 -99 -40 46 57 89 26 119 15 94 -86 44 83 52 201 -6 -150 40 -136 -34 35
4554 35 -169 104 148 -89 -93 79 -28 -13 7 -119 -104 72 -122 -14 -47 -138 -80 -65 52 72 13 7 -36 -55 67 82
4580 82 11 29 -110 -46 0 14 6 -65 -153 104 -74 19 32 117 105 214 -35 -171 -14 -80 -72 75 62 6 40 -74 140
4607 140 -10 -60 -264 4 82 156 -32 188 73 65 46 11 0 28 -32 -126 -32 -142 67 5 115 -41 46 -73 86
4632 86 -11 -67 49 -17 -2 -60 -20 86 -65 -111 39 65 -89 55 -95 71 -91 78 -45 76 -42 -67 -164 -162
$$ packed form
4455@O4j66j2J15J53k29M7K35k01O8j67K59j57n1K8R9k55J50P8O7p3k2M0j31q2
4480a43K39M1M3j95J60k20m6O0J76j58J55j37P9J4p0O8j19O9k5J7J1O0k80K71
4504G0r7K32j64J29l09R0oM8j14j8J03N4M0M3l7m2J08j96J42j95N7k7Q4O4j14
4529e5J00l0J1o1R7j61N9Q6J1L2o3R3j04P9j80J30L9l1J49k07j44J90j76J02O9
4554C5k04K73M4k37mJ72j07J5K0j26J5J76j94J08l3r1N8J5J17K0n9om3j9J22J5
4580H2p1J8j39O4M6J4qp1q8K57j78R3J3Q5j2J09k49j36J57o6QJ47j3n6L4j14K14
4607A40j50n0k04K68P8P4j88K20j15qj9l5j1K8o0r4R4j10K09o2J10j56Q7j19J59
4632H6r7n6J16o6J5n8M0J06j51m6J50K6j54J44j50J66j62J69j23J21j18k5r7K
$$ plain form
4656 -162 -65 28 -120 -7 -76 -84 20 -13 104 62 0 3 123 -131 133 -106 -28 -34 -29 -62 -167 6 63 -103 -126 -1
4682 -1 106 12 -84 -192 -43 199 -120 52 -155 -89 -42 -70 -42 122 65 -67 -29 22 10 102 74 102 151 -152 -144 -106
4708 -106 -26 8 -6 -66 -127 76 65 25 -25 -12 199 30 75 87 -14 -45 -142 46 -116 -81 4 -34 25 -12 -109 53
4734 53 -26 -48 49 -82 -21 155 -10 -138 31 95 -257 66 -112 -36 8 184 -51 70 -74 192 -53 -110 -66
4757 -66 99 9 144 -53 -192 -3 130 85 -18 -116 -82 -167 -25 248 124 149 -46 -44 60 -25 -55 -78 -104 30
4781 30 134 18 -124 -108 77 -29 182 -1 -3 -85 -95 56 35 -80 109 -76 -179 78 183 -38 -60 93 31
4804 31 79 73 -21 2 64 9 22 -152 -151 100 -63 129 35 59 98 -119 43 -8 -125 193 123 -65 -28 129 -75 56
4830 56 -184 -79 -47 45 -114 50 -112 -49 25 43 171 50 -24 18 133 79 58 15 15 28 -63 -45 73 -37 31 -55
$$ packed form
4656a62R7R3j48J13o9qJ04l3J17m2o2LJ20k54K64k39P8oNl3j05J73N7j66k3J25
4682aJ07r4r6j08J49K42l19J72k07O6M7k8K8J64n7j32L8N1j2R2k8K8M9l03QL8
4708a06Q0L4j4o0o1K03j1m0n0J3K11j69M5J2j01l1r7J88j62L5Q5l8N9l7r7J62
4734E3p9k2R7j31O1J76j65j28J69O4l52L23j78P6M4J76k35J21j44K66k45n7M4
4757f6J65r0J35j97j39J89J33m5j03r8L4q5J42K73j24K5j95KJ04q5l0k3k6J34
4781C0J04j16j42J6J85j06K11j83kq2j0J51k1j15J89j85j03K57J05k21k2J53o2
4804C1M8or4K3O2n5J3j74JK51j63J92r4K4L9k17J62n1j17L18p0j88L7J57k04J31
4830E6k40J05L2R2j59J64j62O3P4J8J28j21p4M2J15n4k1m3%J3r1J8J18j10O8q6
$$ plain form
4856 -55 56 203 74 147 -27 -25 -90 41 -65 -52 -98 -110 10 71 -32 138 -73 79 -20 49 -6 -215 43 -76
4880 -76 -11 16 0 96 -3 29 18 -62 22 85 129 1 -196 -3 -151 150 -7 15 59 52 -193 49 -33 -92 -83 147 191
4907 191 -54 59 55 -86 -47 1 -43 90 -53 -1 155 142 114 -48 -92 23 -145 178 -2 -166 -28 -24 109 -82
4931 -82 73 -72 -5 -47 93 5 54 -86 -91 137 -80 69 -41 142 24 27 2 87 22 -80 -93 8 178 174 -21
4956 -21 64 -32 -45 58 -15 -31 29 179 -25 174 106 -38 -33 17 115 -105 85 -101 -65 114 -30 -31 72 14 -45 -32
4982 -32 -102 -24 -73 126 120 61 -117 25 -80 -40 -112 86 62 20 -218 -33 -1 -4 113 32 55 103 -74 -32 -10 90
5008 90 64 65 87 -151 69 -56 -237 -20 60 57 24 79 -65 -162 -29 97 -56 -59 52 -76 -71 23 49 -39 23 -208
5034 -208 52 -50 -177 3 -97 86 -57 -48 19 -116 -47 -121 19 -29 84 168 -46 -186 -24 118 38 -76 40
$$ packed form
4856e5J11J47j29P3j74Ko5J31j06J3m6j2J20O1j03J70k11J52r9O9n5k09K58j19
4880g6O5K7j6R6r9L2j1q0Q4O3M4j28j97J93j48L01j57K2M4pk45K42q2n9RK30M4
4907A91k45J13mj41L9M8m4J33j43N2J56j3k8j62m4J15j68L23j80j64J38MJ33j91
4931h2J55j45O7m2J40q8M9j40nK28k17J49j10J83j18Lk5Q5o5j02j3J01J70mj95
4956b1Q5r6j3J03p3j6O0J50k04J99o8j44NN0R8k20J90j86L6J79j44jJ03n8n9J3
4982c2p0P8m9J99on9j78J42j05M0p2J98k4m2k38J85L2lJ17q1K3M8j77M2K2J00
5008I0k6JK2k38K20j25j81K17Q0ll3N5j44r7J33J26j53lJ11j28NR4K6q8O2k31
5034b08K60j02j27J80j00J83j43RO7j35O9p4J40m8J13Q4k14j40J62J42q0j14J16
$$ plain form
5057 40 -195 104 50 -72 -44 77 -100 67 43 -56 -79 -25 -25 27 130 55 285 -163 128 -67 -115 82 -70 -1
5081 -1 -88 148 -68 -36 -4 2 0 145 38 21 -146 83 -21 -109 -61 -69 60 -53 -45 4 -40 13 -144 0 -163 -25
5107 -25 -83 60 -100 36 88 152 -104 33 -102 52 69 4 51 -59 104 59 106 158 58 -94 39 83 -62 -41
5131 -41 -85 -91 14 32 -106 9 16 40 67 -87 92 17 149 -79 -122 142 160 -27 -188 -183 105 96 -7 102 -30
5156 -30 85 118 -85 92 -66 20 40 -83 -17 -6 116 289 113 31 -3 192 69 -14 127 -147 -86 25 37 44
5180 44 -7 1 177 2 -148 6 54 0 -18 -6 15 -10 5 -121 -155 -124 -9 37 -71 -22 22 63 -14 -37 -87 96 15
5207 15 -189 -40 -102 250 -114 128 35 -85 73 79 -82 95 114 35 -103 14 -126 58 -52 -170 27 -18 -78
5230 -78 28 69 -74 13 -53 95 26 -5 -48 -110 85 111 -20 16 -167 18 -220 -36 -116 -82 62 -158 55 -5
$$ packed form
5057D0k35K99n4j22K8J21j77J67k4r9k3N4%N2J03p5K30m48K91j95m8J97j52O9
5081aq7K36k16L2L2OkJ45j07j7j67K29j04q8M8qJ29j13QM9m4N3j57J44j63J38
5107b5n8J43j60J36N2O4k56J37j35J54J7o5M7j10J63m5M7N2j00j52J33M4j45K1
5131d1m4oJ05J8j38J15PK4K7j54J79p5J32k28m3K64J8j87j61NK88rj03J09j32
5156c0J15L3k03J77j58Q6K0j23O6J1J22J73j76q2l4J95j23q3J41k74O1J11J2P
5180D4n1QJ76j75j50J54M8n4j8J2K1k5J5j26l4L1J15M6j08M9M4M1p7k3n0J83q1
5207A5k04J49o2L52l64K42r3j20J58Oj61J77J9p9j38J17j40J84j10j18J97m5o0
5230g8J06M1j43Q7o6J48o9l1m3o2J95K6j31L6j83J85k38J84q0L4J44k20K13o0
$$ plain form
5254 -5 55 10 -85 101 23 -212 -123 -177 18 -16 -34 13 105 -79 -111 -55 -26 62 76 25 139 -25 24 57 43 52 95 63
5282 63 -128 -139 56 23 -157 106 70 -163 -78 27 75 -16 -102 13 79 33 43 162 -63 -37 -55 20 -57 -51 103 87
5308 87 -105 -95 -171 18 -115 -61 167 55 23 -112 -86 -2 -54 -60 -143 -115 -8 -32 -20 31 41 1 91 -118 68 -82
5334 -82 -42 70 27 -8 6 21 -119 135 -42 97 39 43 -16 -181 11 68 67 -32 37 -42 -113 105 -156 -2 -57 55
5360 55 93 1 -26 -85 77 -12 171 -126 86 -181 100 -13 -15 -211 -27 192 -17 -183 -171 -109 22 18 -8 64 15
5385 15 63 37 136 -11 -109 -3 143 -88 -120 20 57 -111 -129 -88 250 -65 35 42 -36 43 2 93 -163 -157 120 -34
5411 -34 -36 -66 80 -5 -14 40 -59 94 40 -90 25 156 -32 23 31 20 -12 26 -28 161 -104 34 164 77 165 -4
5437 -4 -79 -173 -61 -17 3 166 41 -114 -17 54 -59 34 -103 -6 -116 82 22 35 -140 7 19 46 121 80 -140
$$ packed form
5254eO0m5r5J86p8k35Q9n4J95l4j8M7R2j84l2N6K9Q8J4n1J14j64M9L3j4RM3l2
5282F3j91j1J95l3j80K63l6k33Q5J05M8r1q6J15O6m6J0J19k25K6j8P5p7OJ54j6
5308H7j92J0p6J89j33N4K28j12l2j35K6Q4n2oq3K8J07k4J2N1J0m0R0k09J86j50
5334h2M0J12m3l5J4J5j40K54j77J39n8Mn9j65J92N7jr9O9p9p1K18k61J54n5J12
5360E5L8r2k7n9J62q9J83k97K12k67K81j13kj96J84K19k09j66J2O2J31mk6P2m9
5385A5M8k6R9j47r8J06J46k31l2J40L7j68j8M1L38l15J00Pp8P9m1R1k56OK77j54
5411c4kl0J46q5rN4r9J53n4j30J15J31j88N5Qj1l2L8n4J89k65J38J30q7Q8j69
5437dp5r4J12M4K0J63j25j55R7P1j13R3j37R7j10J98o0J3j75J47J2K7P5m1k20
$$ plain form
5462 -140 -163 45 -21 -21 -12 -314 73 -192 -226 -69 24 6 106 104 84 28 5 -90 44 75 -157 14 -180 -8 -26 115
5488 115 27 -13 109 -43 0 -121 19 -77 -55 104 40 6 76 -150 41 -57 -92 57 -71 10 52 263 -164 -24
5512 -24 75 57 -100 73 172 50 64 -84 65 -54 124 70 -15 -21 8 19 -29 -47 85 48 -197 71 -223 16 75
5537 75 0 69 12 -67 7 119 160 40 55 -62 78 38 -203 -97 36 -157 -85 46 -10 96 -1 3 156 98 -65
5562 -65 -180 -147 -53 -198 -126 -107 6 -35 55 63 98 58 -63 -14 -18 -102 -8 90 131 -53 36 -21 43 -53 57 100 24 -48
5590 -48 120 188 57 50 -13 201 119 -139 98 -143 -24 19 15 4 -21 -36 5 -8 -13 -17 -95 199 -66 -40 39 85 23 -30
5618 -30 174 -76 -80 -29 -19 -54 -51 -28 -1 -111 -5 -35 1 176 58 36 -16 -49 -59 -161 -94 52 -113 42 44 74 103
5645 103 -1 -207 -108 57 -175 -158 -92 68 -77 70 171 -103 -44 42 -70 -79 26 49 28 7 -27 47 56 -46 -73
$$ packed form
5462a40k3K08o6%Rl02L87k65l4J57R3j8J00kk0n6k3r5J34L1k32J71j94J72j8J41
5488A15q8m0J22j52M3j21J40r6K2J59o4l4P0k26J91r8l5J49j28Q1M2K11m27J40
5512b4R9j8j57J73R9j22J4j48J49j19J78n4q5oK9J1m8j8J32l7k45K68k94K39N9
5537G5p5O9n7p9P4J12M1j20J5j17J40m0k41J06J33j93P2J31n6J06r7MJ53n8j63
5562f5j15L3R4j45P2J9J13m1R0QL5m0j21M9mq4R4R8M1j84Q9n7O4r6J10M3p6p2
5590d8J68O8j31po3K14q2k58K37k41J19M3mj1k5j5M1j3nmp8K94k65K6P9M6o2n3
5618c0K04k50mN1J0l5LK3K7j10J06l0L6J75j18k2n2l3j0j02O7J46j65J55KL0K9
5645A03j04k06R9J65k32J7O6J60j45J47J01k74N9Q6j12rJ05K3k1k1l4P4Rj02k7
$$ plain form
5670 -73 -61 55 -38 92 161 -135 -57 -206 -171 43 40 -33 50 22 11 147 91 163 170 -42 -35 1 -70 42 45 -4 -44 2
5698 2 -28 76 -5 -173 -49 8 102 -15 -93 282 -67 21 -111 10 68 27 62 -13 21 51 -43 70 -12 162 86 -83
5724 -83 82 -68 109 -42 -28 92 -18 -58 -12 148 1 -41 58 -144 -19 116 196 51 -64 -39 -91 -61 -7 -198
5748 -198 -158 -130 -61 16 70 -28 82 181 6 -55 -113 -206 -71 -124 -120 12 -2 41 192 90 -79 4 -144 59 91 -24
5774 -24 52 20 -24 106 -100 -74 -60 9 -7 0 66 -43 -137 -108 18 -12 -24 -111 101 -125 -58 190 67 -49 50 42 105
5801 105 -13 116 -218 -154 121 82 -134 77 -100 -55 40 -85 30 65 -8 92 104 -219 -22 189 11 -32 -118
5824 -118 46 -141 31 -26 -19 -1 71 -10 -35 108 75 48 -59 -36 5 81 -97 -18 -50 -92 -26 -176 -30 68 -135 -127
5850 -127 -2 69 -14 -44 30 89 56 -111 101 39 178 -37 -88 -187 -164 111 86 82 14 270 135 108 -55 -170 98
$$ packed form
5670g3J2J16r3J30O9k96P8j49L5K14lp3Q3k8j1J36n6P2Pk12PL6p1J12Lm9m0M6
5698Bl0J04q1j68J24N7R4j17p8L75l49Q8j32J21N8m1L5p5L4L0r4J13q2J74p6j69
5724h3J65j50J77j51J4J20j10m0M6J60j47m2R9k02J25J35Q0j45j15K5n2L0N4j91
5748a98M0K8O9P7N4r8J10R9j75o1n8r3J35n3MJ32j4M3J51j02j69Q3j48K03L2j15
5774b4P6l2m4J30k06K6J4O9j6PO6j09r4K9J26l0j2q7K12k26O7K48j23j16R9qO3
5801A05j18J29l34O4K75l9k16K11j77M5R5j25J15L5p3J00J2l23J97K11j78m3q6
5824a18J64j87J72n7PJ8P2q1k5J43l3k7j07K3M1P6j78P9l2m2O6j50J46R8k03Q
5850a27J25P1q3l0P4N9l3j67K12o2J39k15n1r9K3K75k5mo8K56j35k7j63j15K68
$$ plain form
5875 98 163 51 183 -9 -91 -55 13 -46 -61 163 -37 54 96 65 -83 -102 -152 -77 -15 48 76 -32 99 33 76 -38
5901 -38 -128 -20 141 -64 -95 67 57 -74 -18 193 151 -75 -2 21 -5 42 -72 27 -112 -130 114 -24 -23 14 130
5926 130 82 125 19 63 -263 -117 -2 -15 117 -200 -137 -69 -53 165 44 20 -58 89 137 8 23 -4 -222 -7
5950 -7 -216 3 -195 180 3 -76 -79 -33 73 0 -134 33 129 117 -115 9 -75 51 -91 79 -51 -91 -11 -7 48
5975 48 175 89 -193 51 62 113 -27 136 -29 -37 60 117 24 -47 -133 87 120 15 -208 -124 -172 -47 -8 -90 -193
6000 -193 -1 -96 -88 -101 -183 1 -249 77 -138 10 -64 208 33 0 110 25 59 72 9 79 -51 20 5 -84 39
6025 39 27 44 -7 -18 -131 -112 -60 -120 -22 54 -14 -33 207 10 176 58 -27 69 337 -77 24 -20 -49 53 -20 -84
6051 -84 -118 -156 92 -38 -176 -24 47 -63 5 -146 1 -62 108 97 -28 -129 69 -30 -60 68 -10 8 71 -9
$$ packed form
5875I8O5j12J32j92q2L6O8n9j5K24k00R1M2l1j48j9n0P5O2O3K8j08J31o6M3j14
5901c8r0J08J61k05l1J62j0j31N6K11m2k26P3K3k6M7j14R9j39j8K44j38JL7J16
5926A30m8M3j06M4l26J46J15j3J32l17O3O8J6K18j21k4p8J47M8j29J5k7k18K15
5950gk09K19j98L75j77p9lM6J06p3j34J67R6j2k32J24q4J26j42J70j30m0Q0MN5
5975D8J27q6k82K44J1N1j40J63j65qR7N7r3p1q6K20L3j05k23Q4m8J25L9q2j03
6000a93J92r5Qj3q2J84k50L26k15J48p4K72j75l3J10q5L4J3o3P0j30P1j5q9J23
6025C9j2J7n1j1j13J9N2o0R8P6o8j9K40j97J66j18q5R6K68m14J01m4k9J02p3o4
6051h4l4l8K48j30j38J52P1j10O8j51J47o3J70j1j25j01J98r9l0J28p8J8O3q0
$$ plain form
6075 -9 -7 192 88 -96 -174 35 -20 0 119 88 14 -94 -71 11 -61 112 -45 -9 -56 -3 131 -128 -165 -45 -6 -136
6101 -136 60 -3 67 -14 -51 -35 97 -142 64 117 44 6 -110 -167 83 -9 -237 144 -89 69 50 187 8 -43
6125 -43 17 146 67 -81 -64 -36 9 35 -4 -59 -170 -15 60 -52 49 -87 86 45 -19 -183 8 83 5 -17 13
6150 13 -238 -74 -115 107 149 -9 -84 -39 -72 -149 -161 -43 33 21 49 -55 -8 100 146 72 127 7 288 -48 108
6175 108 99 91 23 -50 72 -18 71 163 46 34 62 -78 -69 -49 -153 95 -123 -82 48 8 -46 184 81 40 41 -13 52
6202 52 149 -52 -43 128 82 -65 -39 165 23 83 -139 116 160 97 -72 120 -77 13 65 23 24 6 156 -90 -55
6227 -55 7 -66 27 66 53 -208 0 -17 -145 -95 112 -32 8 47 -33 -26 94 -3 6 95 161 -52 -61 -106 40 157 -90
6254 -90 -18 -28 -27 -76 76 -132 94 -18 -46 57 39 -109 45 -67 -59 -39 169 -135 -12 -212 97 -162 54 93
$$ packed form
6075iKJ99j04j84p8K09n5K0J19l1p4j08K3Q2p2J73j57L6m7N3J34k59l7J20L9j30
6101a36J96o3P0q1l7J6J32k39K06N3p3l8j16n7K50r2k28L81k33J58j9J37j79n1
6125d3O0J29p9j48J7K8M5K6l9n5j11J55P5j12J01j36J73m1o4j64J91P5p8k2L0
6150A3k51J64m1K22M2j58p5M5l3p7j2J18P6j2K8j04M7J08M6p4N5j20K81l36J56
6175A08rqo8p3J22r0Q9R2j17j2K8j40RK0j04K48k18M1J30m0n4K30j03m1Jn4O5
6202E2R7k01RJ71m6j47K6K04j42O0k22K55M4o3j69J92j97R0N2m2Jj8J50k46L5
6227e5O2p3R3L9j3k61K08j7j28N0K07j44M0L9q0PJ20r7RQ9O6k13rm5J46J17k47
6254i0P2j0Jm9J52k08K26j12k8J03j8j48J54j12QK0K08l04J23k00L09k59K16L9
$$ plain form
6278 93 -88 24 55 36 86 -19 73 -16 -16 -92 48 -36 -28 46 28 -18 -68 -3 68 102 -189 -32 89 -25 -96 -127 -21
6305 -21 133 -2 50 48 -21 63 2 -15 -9 -75 -5 20 109 -87 19 118 -20 105 -6 -146 -87 17 13 -110 -42 -5 97
6332 97 -25 -28 -36 -101 207 -78 40 128 -179 -16 -102 36 -133 -5 21 -39 -25 -15 87 -38 -172 -44 -64 -109 23
6357 23 33 -98 31 122 -27 73 -86 -63 133 -127 -22 -13 1 -128 -8 57 -95 -228 -8 5 -78 48 -21 -130
6381 -130 31 30 106 62 70 53 -196 -158 -70 19 79 115 69 -9 80 47 144 43 -117 188 7 -83 -87 -74 89 78 -116
6408 -116 95 -60 -243 4 -82 128 -29 -100 -19 41 -146 62 -7 104 177 204 79 62 95 -34 -37 -35 116 -53
6432 -53 -27 144 -290 69 132 -34 -11 -100 31 -11 78 16 67 -59 8 -44 -113 -128 10 -27 26 123 -40 64 131 205
6458 205 11 70 42 56 64 146 125 30 213 51 -41 -55 161 54 18 75 -194 103 -125 17 -182 -36 -145 -17
$$ packed form
6278I3j81J12L1j9N0j05R2q9%p6J40q4QP4j8m6n0O5P1L4k91J57J21j14p1l1J06
6305b1J54j35N2ko9Q4o1j7Oo6P0K5Q9j96J06R9j38J25j11j40N9J04mj23O8L7J02
6332I7j22lqo5L08k85J18Q8l07J63q6J38j69J28K6o0J4J0J02j25j34J28k0m5J32
6357B3J0j31J29R1j49J00j59K3J96k60J05RJ4j29J20O5j52j33K20J3q3J26o9j09
6381a30J61jP6m4Qj7k49L8Q8Q9O0L6m6p8Q9l3R7j01j60L05j81r0mJ3J63j1j94
6408a16K11j55j83K47q6K10j57p1Q1O0j87K08o9J11P3K7j25j7L3j29lKJ51j69
6432e3K6J71m34L59O3j66K3q9J31m2Q9o2N1j26O7n2o9j5J38l7N3R7j63J04O7P4
6458B05j94N9k8J4QQ2k1r5J83j62r2j4K16j07l6N7k69K97k28J42j99J46j09J28
$$ plain form
6482 -17 129 6 -89 -36 33 120 30 -23 55 -120 104 7 66 -41 -64 104 -106 -24 35 -22 74 -96 2 20 108 -59
6508 -59 38 13 -47 -12 116 17 70 -157 -131 136 40 -99 53 -137 -129 86 -5 -62 -60 111 -44 -50 -86 15 152 143 -84
6535 -84 41 148 100 64 -20 283 163 49 -15 -131 -93 30 110 -66 5 -123 6 78 -59 99 -37 9 -16 -9
6559 -9 -21 169 14 -197 67 -129 23 -71 12 23 -65 -12 -35 -107 -43 -59 20 9 -61 116 146 185 47 -97 -17 43
6585 43 176 55 145 -89 -170 130 -70 -127 135 -7 -87 181 119 62 -16 -68 46 -40 133 19 105 -310 -50 -14
6609 -14 -296 117 -83 91 -37 -21 -64 -11 -37 10 77 -36 -63 134 -94 -37 -13 113 -62 -1 -7 -21 2 30 152
6634 152 52 106 123 168 -1 80 6 -112 90 -100 -24 -120 159 -80 106 0 -163 -61 -51 -62 106 -81 -166
6657 -166 -63 87 28 -55 -41 153 63 83 76 103 -64 79 -45 45 -12 37 -135 -121 -13 2 -167 115 -61 37 105
$$ packed form
6482a7J46j23r5N3O9Q7r0n3P8j75K24r7N9j07k3J68k10Q2N9n7R6j70R8J8Q8j67
6508e9R7k5o0L5J28r9N3k27K6K67r6j39J52j90QK15r1n7KJ71j55ol6J01J37rk27
6535h4J25J07m8l6q4L03j20j14o4j16L8J23Q0j76P1j28J29P2j37J58j36M6k5P
6559ij2J90j55k11K64j96J52r4Q3J1q8N3k3p2O4j6P9j1p0J77L0L9j38j44Q0O0
6585D3J33j21R0k34q1L00k00n7K62j42q0K68o2n7p8n2J14q6J73j14Q6m15K60L6
6609a4k82M13k00J74j28J6m3N3k6M7O7j13k7J97k28N7K4J26j75O1oj4K3K8J22
6634A52j00N4J7M5j69Q1p4j18K02j90P6r6K79k39J86j06j63J02J0j1J68j87q5
6657a66J03J50n9q3J4J94r0K0pK7j67J43j24R0n7M9j72J4J08J5j69K82j76R8O8
$$ plain form
6682 105 100 -44 -192 21 -139 -147 60 131 7 74 -75 41 3 21 -36 6 -158 14 46 -84 -45 37 99 65 127
6707 127 89 53 55 124 -126 123 82 -35 -135 216 49 -41 -26 -39 8 -61 87 -78 244 -84 -7 53 -115 -49 -81
6732 -81 31 69 46 90 -42 51 -107 -68 -126 6 -207 1 12 -107 -10 14 -30 5 53 -88 -198 -64 98 14 -97
6757 -97 53 61 143 -119 70 83 -113 9 -11 -29 -90 15 53 -66 -46 230 -128 98 -3 -113 8 -3 -4 47 -27
6782 -27 -64 12 8 -6 -57 -54 77 -14 -1 63 104 8 120 73 2 -74 -51 18 122 -34 119 130 112 162 -55 0 126 -93
6810 -93 21 -36 11 -116 21 108 15 -96 -62 39 84 -111 -8 14 -58 14 -99 20 -45 92 -6 32 -17 17 62
6835 62 74 -99 103 -47 -69 45 -21 194 -48 69 95 104 106 18 -29 55 156 -95 19 60 76 -16 119 68 86 68
6861 68 -28 152 115 19 -118 -38 -77 -66 -109 78 28 10 37 135 -59 -169 -45 -1 72 145 64 -3 -53 44 -57 -64 13
$$ packed form
6682A05nj44j48K13j60qK07P1j24O7j49J16l8J8n7M2j64J72L2j30L9Q2O2l4O2
6707A27l8l6KO9k50K49m1j17j00L51j67r0J5j3M7o9J48j65L22l28P7O0j68O6l2
6732h1J12L8k3M4j32R3j58L9n8J32k13K08J1j19R7K4m4L5M8j41j10J34J62q4j11
6757i7J50QQ2k62J89J3j96J22k0j8o1J05L8j19K0K76l58K26j01j10J21j1jN1p4
6782b7l7P6mj4n1LJ31r1J3O4M1r6J12m7p1p6K3O9J04j56J53J1j8N0k17N5J26k19
6810i3J14n7M7j27J37Q7r3j11L4J01M5j95J03K2p2P2j13J19o5J37r8L8m9L4M5
6835F2J2j73K02j50k2J14o6K15k42J17K6RKq8m7Q4J01k51J14M1J6r2J35n1J8j8
6861F8r6J80l7r6j37Q0l9J1m3J87n0j8K7R8j94j10J24M4P3P3q1o7n0R7j01pP7
$$ plain form
6888 13 -108 30 169 92 68 39 -76 -50 -121 74 79 50 -79 -45 -136 -36 19 33 -44 -106 169 -74 11 56 58 149 -64
6915 -64 44 33 -48 -26 -63 77 -3 -152 78 -78 -48 117 121 -124 -145 19 6 77 -77 171 71 -59 -38 104
6939 104 -68 -155 -119 -43 118 -114 41 28 -56 202 1 -42 -98 -10 135 13 22 172 33 -3 59 -112 -35 9 38
6964 38 36 -87 -91 110 7 -142 41 110 35 97 -88 -7 93 27 -22 22 54 121 -82 -206 99 7 113 123 40 -49
6990 -49 -10 -84 -67 -19 -40 71 -129 -48 52 -69 43 149 49 -98 -42 -13 -134 -91 -114 -61 -12 -20 -235 -56 -55 5
7016 5 -62 65 -43 -51 -23 72 100 5 4 -23 -70 -47 26 -62 -29 -23 87 -133 -19 6 -87 -65 -77 81 12 136 -60 -152
7044 -152 58 -146 0 -217 -64 154 -76 116 107 45 -84 13 123 105 101 -237 -26 -5 -149 93 103 -192 -19
7067 -19 -22 55 78 59 185 -70 46 33 -71 5 -69 -37 -93 46 101 -74 -58 -18 233 -146 -60 36 39 -140 -172 54
$$ packed form
6888A3j21J38J39p7k4k9j15K6p1J95Nk9j29L4r1J00N5J4p7o2K75k43Q5M5KR1k13
6915f4J08j1q1K2l7J40q0j49K30j56L0J65Mk45k1J64j3P1j54K48j00j30K1J42
6939A04j72q7L6P6J61k32J55j3q4K58k01m3n6Q8J45j22RJ50j39l6O2j71P7M4K9
6964C8kj23mK01j03j49J83O9p5O2j85Q1J00o6m9M4L2O7k03j24L05r2J06J0q3q9
6990d9L9p4J7M8k1J11k00Q1J00j21J12J06j00j47N6K9j21M3k3N3M9qk15J79JO0
7016Eo7J27j08qK8R5K8r5jk7m7K3P3q8L3OJ10k20J14K5r3K2j2J58o9J24j96r2
7044a52K10k04J46k17J53K18k30J92ro2j29R7J10j8ml38K11K1j44K42J0k95J73
7067a9lP7K3j9J26k55J16j3j04P6p4L2n6J39N5j75J6M0K51l79Q6R6Lj79l2K26
$$ plain form
7093 54 -9 -34 -71 38 -17 164 -6 -165 -41 -84 -21 -109 -6 38 218 108 69 16 29 -22 -39 -25 -25 -30 -86 70 9
7120 9 107 -119 -12 -52 218 16 -136 48 79 -109 -22 -4 166 -161 40 93 -57 46 -78 130 51 81 -69
7143 -69 -88 39 -93 27 18 22 -44 81 5 39 43 -3 -22 54 8 -41 -110 -19 48 44 75 -158 26 -51 181 -77 -39 -33 48
7172 48 -92 -55 -6 30 -15 43 122 -95 -52 -47 -32 171 17 106 -7 9 10 84 -43 40 -43 -34 85 -186 -36 9 -15
7199 -15 152 134 -65 84 78 50 28 19 -178 78 -131 -106 49 -87 110 116 -12 -6 -88 69 129 -24 8 -26 39 40 149
7226 149 -47 -39 128 113 -1 -107 -104 -113 -15 -61 -98 1 50 -101 71 -105 -135 -67 189 108 82 -36 127 100 22 6
7252 6 -36 31 -25 -63 -1 -155 3 91 -142 -142 -153 -49 49 103 -125 -139 -47 -25 -18 -30 150 -98 34 112 26 13 -39 41
7280 41 77 58 -31 11 13 140 -118 -160 196 -2 50 13 59 123 66 -15 128 64 -12 20 222 3 -80 -119 -186 -84 23
$$ packed form
7093E4o3k5l7J09n5J81j70j59J24m3O3q8J03M4J80j10l9n3J3n1j7J4%nn6J56o1
7120IR8k26J07m0K70k02j52J84L1j88Q7J8J70l27K01N3j50J03j24K08p9L0j50
7143f9j9J27j32J20rMo6J25p6L4Mm6j9P6m6m9o9R1O7mL1k33J84p7K32k58L8OQ1
7172D8j40L7M9L6m5N8P9k17M3NJ5K03j54Q9j13J6JP4j27Q3q3RJ19k71J50M5k4
7199a5J67j8j99J49ok8k2rj97K56k09K5J55j36J97Oj28Oq2J57O0j53L2l4O5JJ09
7226A49j96QJ67j5j14j06LrR8m6l7R9M9j51J72j76l0O8K56q1k6j18J63k7p8j6
7252Fm2O7n6l8O2j54J58Q8k33%j1J04R8N4k28j4R2K2Pj2J80k48J32P8q6j3n2Q0
7280D1L6j9q9M2KJ27k58m2L56j98N2l7M6O4n7q1J43o4p6L2K02k19q3l9o7J02J07
$$ plain form
7307 23 1 -150 25 108 -97 156 11 108 -145 23 25 61 -64 97 -33 71 1 -12 -204 -39 -108 -24 182 -43
7331 -43 13 -251 80 -138 242 -24 90 59 18 -43 102 -135 -37 -17 -123 96 37 227 145 29 31 138 18 -30
7355 -30 -61 -35 169 -134 57 34 -61 -10 4 -25 49 -59 -125 -77 -124 -67 -198 -156 20 -58 -119 45 -32 159 64 87
7381 87 -106 110 -76 18 123 -12 -17 73 7 0 102 29 -95 -127 -23 -15 24 -151 80 -97 65 88 18 -96 -43
7406 -43 78 -52 -29 20 -28 70 12 0 128 59 -13 102 -54 57 107 -37 -68 75 131 107 62 16 -79 -4 -9 -168
7432 -168 -2 25 -119 83 -35 -198 83 -4 -50 23 -9 6 92 -50 -82 6 -92 77 43 22 -34 -100 -78 -2 -107
7457 -107 -92 16 12 103 -13 20 -68 -98 -16 -90 -114 -3 8 114 69 30 115 141 -46 94 -69 23 100 23 51 -36 -39
7484 -39 -193 -36 -44 -30 90 1 -30 -5 95 -39 -245 21 10 132 -254 -12 83 -84 73 2 94 -105 -89 92
$$ packed form
7307B3k2j51J75Q3k05K53j45R7k53J68KL6j25J61j30J04p0j3j92J65o9Q4K06k25
7331d3N6k64L31k18L80k66J14l1m1o1J45k37R8K0j06K19n9J90q2j16KJ07j20m8
7355c0l1K6K04l03J91k3r5N1J4k9P4j08o6M8m7N7j31M2J76p8o1J64p7J91r5K3
7381H7j93K16j86R4J05j35nR0o6pJ02p3j24l2J04QL9j75K31j77J62K3p0j14N3
7406d3J21j30K3M9m8R8n8j2J28o9p2J15j56J11N0j44l1J43N6k4m5m6r5P5nj59
7432a68J66K7j44K02j18j63K81q7m6P3l2J5Q6j42l2Q8r8J69l4k1n6o6K2P6j05
7457a07J5J08mR1j16L3q8l0Q2p4k4J11J1J06m5l9Q5K6j87J40j63R2P7p7K8q7l
7484c9j54J57qJ4J20q9l1K5J00j34k06K66j1J22l86K42R5j67J57p1R2j99J6J81
$$ plain form
7508 92 -20 107 -59 42 107 -28 -15 91 69 -173 -22 -101 -57 93 -64 -187 -167 -21 34 -116 44 -97 -61
7531 -61 104 43 125 -8 52 -54 52 -21 153 95 52 -22 -127 -40 117 199 53 -73 28 -18 20 225 10 94
7555 94 -41 144 8 -111 0 -25 -23 -226 -77 -116 43 -88 -8 -61 -103 41 100 -120 -50 97 -80 64 -108
7578 -108 5 117 -66 -92 -57 -24 7 121 -28 40 136 -22 -34 -178 -126 7 -35 -18 -252 85 72 -37 -56 76
7602 76 147 -24 0 28 -23 -86 42 -129 69 -142 50 -22 -27 -16 -12 -128 -37 -31 49 -37 -113 56 -79 171 90 19 -89
7629 -89 -62 135 18 142 -17 138 29 -26 161 84 -2 -28 -53 94 -75 -70 165 -26 16 -93 -16 -47 -135 37
7653 37 29 -1 -38 36 63 -23 30 -39 -80 76 -40 -112 -13 -50 77 -3 36 -46 72 19 -54 10 -67 17 39 73 -26 70 -120
7682 -120 -110 95 10 31 -63 15 162 43 68 -149 70 -37 -26 -60 179 -55 177 -12 -2 49 7 20 51 19 50
$$ packed form
7508I2j12J27j66J01O5j35J3J06k2k42J51p9M4J50j57j23K0J46N5j50J60j41L6
7531f1J65o1Q2j33O0j06J06p3J74n8m3p4j05Q7J57Q2j46j26J01m6L8K05k15Q4
7555I4j35J85j36j19J11k5Kk03J49l9J59j31Q0n3m2J44N9k20P0J47j77J44j72
7578a08J13J12j83k6L5L3L1J14j49O8R6j58j2j44N2J33m2J7k34L37j3j09j9J32
7602G6P1j71K4K8n1o3J28j71J98k11J92p2nJ1Mj16R1OQ0q6p6J69j35K50q1p1j08
7629h9K7J97j17J24j59J55j09n5J87p7q6k6k5J47j69NK35j91M2j09P7l1q8J72
7653C7ql0l7P4K7q6N3o9m1J56j16p2R9l7J27q0L9q2J18n3p3O4p7Q4K2L4r9R6j90
7682a20J0K05q5K1r4P8J47j19K5k17K19j07J1l4K39k34K32j89J0N1m2J3L1l2L1
$$ plain form
7707 50 5 -86 131 93 92 3 164 124 -101 -38 101 -27 -9 78 -148 74 5 -70 -25 41 -109 -21 -48 -127 131 -74
7733 -74 -92 -189 120 -67 -69 -47 50 -50 -24 -90 133 -40 -19 158 19 72 85 71 87 -100 -15 -116 -145 16 -90
7758 -90 -34 -89 91 32 -72 -33 43 -10 -95 -67 31 -56 37 -96 17 26 28 110 -180 -158 113 64 -12 74 3 77 89 117
7786 117 -26 91 46 -95 34 -105 100 -63 56 -88 -29 -163 21 -97 -31 -125 -102 16 -22 -63 -42 168 51
7809 51 29 149 44 -25 15 -169 -43 -98 -64 15 27 22 82 -11 49 -25 -37 6 -97 -61 238 -128 10 -201 11 115
7835 115 159 68 -136 -52 -131 63 9 23 41 -130 51 -13 -39 -178 -202 -124 110 68 -36 -69 6 -102 -122 66 24
7860 24 -5 68 -74 72 87 54 -51 -35 99 138 101 92 76 -193 205 -35 73 -68 -39 -125 -137 -170 1 -40 19 -22
7886 -22 105 1 62 -12 -32 49 90 71 132 87 -33 1 -3 -38 -121 -20 -72 27 -196 -104 2 -51 16 5 -159 39 -42
$$ packed form
7707E0m5r1K17l8jq9J61m0k25O3J39j28J8Q7k26K22o9p5M5O6j50Q8k7p9K58k05
7733g4j8r7L09j87kK2R7j00K6o6K23j73K1J77j39N3J3j4J6j87Q5j01k9J61j06
7758i0N6n5J80n9j04L9P6n3q5K8R8q7R3j33J13RKQ2k90K2K71m9p6Q6p1P4J2K8
7786A17j43J17m5j41J29j39K05j63J19j44N9j34J84j18O6r4K3J18l8m1K1K10j17
7809E1k2J20j05o9M0j84J26n5L4P9J2nO0r3O0p4j2M3j03L6K99l66J38k11K12J04
7835A15M4r1k04Q4p9J94n4J4J8j71J81o4k6j39k4P8K34m2j04l3P5j08k0J88m2
7860B4k9P3j42J46J5l3j05J6J34L9l7rj6k69L98k40J08j41K9q6j2l3J71m1N9m1
7886b2J27j04O1p4k0Q1M1j9O1m5j20L4ml5q3J01n2R9k23R2J06n3O7j1j64J98q1
$$ plain form
7913 -42 59 -39 124 50 102 57 121 15 69 -81 27 83 -4 -141 -21 113 -74 -62 27 43 -96 39 19 -168
7937 -168 0 -85 5 66 -2 77 77 -196 -90 16 33 -127 -120 -65 -18 -251 27 16 118 71 -29 -139 -41 -83 -51 125
7963 125 171 -31 -72 -108 -62 90 -26 -4 -27 -2 -44 -203 94 -64 17 74 -3 69 -43 23 -128 -68 -100 80 8
7988 8 -44 43 -126 14 -16 -130 -21 154 -57 57 92 39 -74 -235 -80 -87 -50 8 -60 -137 -139 119 65 110 -10 47
8014 47 -25 -72 -95 -13 -38 -75 27 -24 -27 -106 -56 -29 -55 -140 158 69 -83 150 -41 49 6 59 6 -32 37 9 -74 34
8042 34 -44 -19 44 -13 26 -25 111 43 -20 101 -57 56 -142 106 85 61 -39 -192 133 71 -63 -57 7 75 80 100
8068 100 60 -27 11 -227 -46 88 19 -42 22 -8 111 77 7 141 -115 91 71 -50 32 -34 -17 91 127 42 15
8093 15 115 -61 61 -5 -8 -108 -53 -86 -61 92 26 63 -114 46 -83 -24 -75 161 -128 -135 102 -50 -63 -117 -45
$$ packed form
7913d2J01r8J63p4N2m5O4j06N4j50J08N6q7j37J20J34j87J2Q9J6j39J35k0j87
7937a68J68q5R0O1o8P9%k73J06J06J7j60PN5M7k33K78j1J02m7j00j10R8m2L2J76
7963A25M6k02m1l6M6J52j16K2k3K5m2j59K97j58Q1N7p7P2j12O6j51O0l2J80p2
7988Hn2Q7j69J40l0j14J09J75k11J14L5n3j13j61J55pL7N8o8p7kK58n4M5j20N7
8014D7p2m7k3Q2k5l7J02n1lp9N0K7k6q5K98q9j52K33j91R0m3N3n3l8O9k8q3J08
8042C4p8K5O3n7L9n1J36o8o3J21j58J13j98K48k1k4j00j53L25o2j34OO4O8NK0
8068A00m0q7L8k38J81J34o9o1O4l0J19l4p0J34k56K06k0j21Q2o6J7J08L6q5k7
8093A5J00j76J22o6lj00N5l3K5J53o6L7j77J60j29N9n1K36k89pK37j52j3n4P2
$$ plain form
8118 -45 165 -74 26 101 77 -37 -93 3 61 -68 95 -52 -31 40 0 7 88 30 -176 106 -56 -87 -5 66 48 22
8144 22 19 -42 -99 -52 -42 -107 44 -119 -119 191 -46 -76 36 212 108 -4 -7 149 103 0 -86 -49 -184 -188 118 -50
8170 -50 -64 -78 -4 -126 55 19 66 -53 81 -83 -63 -45 -173 -73 -174 138 18 38 124 -200 -133
$$ packed form
8118d5K10k39J00P5k4j14n6R6N8j29J63j47K1P1m0PQ1n8k06K82j62l1Q2P1j8k6
8144B2lo1n7M7J0o5J51j63%L10k37l0J12J76j04j12lJ56m6j03q6L7j35mL06j68
8170e0j4j4P4j22J81l6M7j19J34j64K0J8j28J00j01L12j20K0Q6l24O7
8191a33
$$ Imaginary data points
##PAGE= N=2
##DATA TABLE= (X++(I..I)), XYDATA
$$ plain form
0 0 0 0 0 0 0 0 0 0 0 0 0 -8 8 -8 8 -8 16 -16 24 -24 32 -37 40 -48 60 -72 80 -96 109 -124 142 -160 184 -208
34 -208 233 -263 295 -332 372 -413 461 -511 566 -626 694 -766 845 -932 1028 -1133 1248 -1375
52 -1375 1515 -1671 1847 -2045 2271 -2531 2832 -3187 3612 -4136 4800 -5663 6844 -8565 11316
67 11316 -16414 29054 -130285 -115662 135170 -50115 -145955 18397 123303 -34604 -55955
78 -55955 102287 120970 -31912 -8787 100589 48097 -71266 -22372 64966 7603 -88073
89 -88073 -27678 32673 -45131 -85564 5824 30729 -45480 -52557 38516 55278 -15506 -391
101 -391 86324 50772 -42266 -9588 67844 20615 -65016 -30184 29006 -36901 -90972 -11822
113 -11822 32749 -27300 -28506 43470 43570 -16315 1833 73040 54245 -15227 -4615 28352 -8113
$$ packed form
0@%%%%%%%%%%%qJ6j6J6j6K4l2M0m8N6o9P7q8J08j32J52j76K05k33K66l02L44l92
34b08M41m96N58o27P04p85Q74r72J077j192J320j460J611j777J960k161K381k623
52a375K890l186L518l892M316m802N363o019O799p748Q936j0463J2507j5409J9881
67A1316k7730M5468j59339J4623K50832j85285r5840J64352J04906j57907k1351
78e5955J58242J8683j52882K3125J09376n2492j19363M8894Q7338n7363r5676
89h8073O0395O0351p7804m0433R1388K4905p6209p077R1073J6762p0784J5115
101c91Q6715l5552r3038L2678P7432m7229q5631L4832N9190o5907n4071P9150
113a1822M4571o0049j206P1976J00n9885J8148P1207j8795o9472J0612L2967l6465
$$ plain form
126 -8113 -43268 -13627 10701 -27543 -53433 -6166 16635 -28973 -27314 31074 29270 -18510 -8317
139 -8317 41801 33261 -11034 10613 48314 7502 -31007 4329 25396 -16672 -38588 -5059
151 -5059 1497 -41914 -33980 20918 13351 -20919 4400 32831 10074 -6627 19351 33617 1105
164 1105 -15795 6496 3205 -22519 -15660 2930 -1557 -17118 -15148 6050 8096 -5281 7259
177 7259 20841 4529 -5915 7020 17466 4739 -10498 1721 8583 -16606 -20591 3539 2900
190 2900 -15016 -12816 3158 1234 -13289 1068 23912 9040 -3810 12830 14521 320 2433
203 2433 10646 4159 -13703 -14729 -2868 -8427 -14286 -2107 915 -5329 -3540 2136 9277 9719 4957
218 4957 9606 8972 -2949 -3495 3014 4315 -1217 -8040 -3744 -2893 -13242 -6682 7931 1792 -7273
$$ packed form
126h113l5155K9641K4328l8244k5890M7267K2801m5608J659N8388j804m7780J0193
139h317N0118q540m4295K1647L7701m0812l8509L5336K1067m2068k1916L3529
151e059O556m3411P934N4898p567l4270K5319K8431k2757j6701K5978J4266l2512
164A105j6900K2291l291k5724O859J8590m487j5561J970K1198K046j3377J2540
177G259J3582j6312j0444J2935J0446j2727j5237J2219O862k5189l985K4130o39
190B900j7916K200J5974j924j4523J4357K2844j4872j2850J6640J691j4201K113
203B433Q213o487j7862j026J1861n559n859J2179L022o244J789N676P141M42m762
218D957M649o34j1921n46O509J301n532o823M296Q51j0349O560J4613o139r065
$$ plain form
233 -7273 -2614 4611 3982 417 9135 15980 2535 -2618 6279 1494 -4550 88 -86 -7629 -14247
248 -14247 -10850 -4429 -6281 -3295 6486 3371 -1188 3927 8090 11627 11019 5481 4938 803 -6422
263 -6422 -3950 -450 -2027 -5660 -8849 -5623 -4781 -8275 190 8141 974 -1957 2295 2723 1969 3989
279 3989 9392 7773 -2537 -2031 2596 -2447 -1397 2760 -2945 -7853 -7298 -4534 -2433 -2296 2467 5641
295 5641 -453 -25 5403 4382 5391 6310 1792 -332 -3337 -6630 -3569 -1158 -1091 -2956 -5928 -2564
311 -2564 408 -1212 4540 7738 1175 11 1927 680 938 1585 2711 495 -5278 -2552 -235 -3711
327 -3711 -114 3094 -2518 -3808 -1378 -612 944 1639 3688 3069 -1834 313 3823 1133 2103 2042 -2197
344 -2197 -1969 -2552 -4328 -1481 -207 -604 -1666 -2758 1144 2540 257 4428 5219 -425 -93 934
$$ packed form
233g273M659P225o29l565Q718O845j3445n153Q897m785o044M638j74p543o618
248a4247L397O421j852K986R781l115m559N115M163L537o08n538n43m135p225
263f422K472L500j577l633l189L226Q42l494Q465P951p167k931M252M28p54K020
279C989N403j619j0310N06M627n043J050M157n705m908N55K764K101J37M763L174
295E641o094M28N428j021J009R19m518k124l005l293L061K411O7j865k972L364
311b564K972j620N752L198o563j164J916j247K58O47J126k216n773K726K317l476
327c711L597L208n612j290K430P66J556O95K049o19m903K147L510k690R70o1m239
344b197K28n83j776K847J274l97j062j092L902J396k283M171P91n644L32J027
$$ plain form
360 934 -886 -290 -250 -960 -2621 -4211 -527 275 -2450 1837 2649 -2072 -398 2012 1042 1587 1232 1545
378 1545 430 -2227 564 1838 -911 395 -112 -3158 -1180 -727 -2083 167 407 -707 -734 -466 3043
395 3043 2958 340 3139 2192 -2247 -49 638 -1309 -453 -1518 -2586 -2298 -1619 1238 615 -928 2573
412 2573 1555 -2136 1279 2571 417 450 -211 -700 -1041 -1383 1421 1260 -712 619 -869 -2703 812
429 812 1265 -1181 -62 -736 -1506 -1048 59 2545 1481 -482 1859 352 -1785 1330 1645 -427 174
446 174 -1175 -2177 -1086 -62 1958 662 -613 1593 -851 -2719 1619 1762 -1176 -886 -1451 -1488 -563
463 -563 136 2085 1747 572 1790 -211 -1107 2674 1361 -1239 -312 -1449 -2780 -2073 -813 1496 336
480 336 -1548 225 -559 -892 2796 1655 -143 1258 -195 -1265 82 795 1653 156 -1112 921
$$ packed form
360I34j820N96M0p10j661j590L684Q02k725M287Q12m721J674K410r70N45l55L13
378A545j115k657K791J274k749J306n07l046J978M53j356K250K40j114k7K68L509
395C043q5k618K799r47m439K198O87j947Q56j065j068K88O79K857o23j543L501
412B573j018l691L415J292k154L3o61m89l41l42K804j61j972J331j488j834L515
429H12M53k446J119o74p70M58J107K486j064j963K341j507k137L115L15k072O01
446A74j349j002J091J024K020j296j275K206k444j868M338J43k938K90n65l7R25
463e63O99J949l38j175J218k001q96L781j313k600R27j137j331P07J260K309j160
480C36j884J773p84l33L688j141j798J401j453j070J347P13Q58j497j268K033
$$ plain form
496 921 -1706 -2469 1510 728 -1542 -701 -1711 -1633 -78 797 2166 1497 512 1523 -80 179 2902 293
514 293 -1642 -197 -1881 -2653 -2034 -1154 753 -129 -907 588 -432 291 3032 1601 649 1857 -103
531 -103 -735 632 866 730 -937 -1124 52 -1933 -1758 844 -879 -1355 351 -1208 -1084 551 728
548 728 1475 986 449 1372 -234 623 2528 -353 -1132 657 -1194 -1490 -547 -674 -48 -706 -822 714
566 714 -387 -127 1261 -352 117 1215 -908 -982 803 312 215 -579 39 1074 -332 -229 1278 -591
584 -591 -700 781 -882 -224 587 -631 -240 -210 275 532 -723 8 1121 -1247 -603 1301 -661 173
602 173 1243 63 410 453 294 582 -479 -204 91 -2153 -728 788 -1236 -221 760 -368 -59 181
620 181 1052 1726 272 687 1233 -711 -57 588 -639 -195 228 -1834 -1403 -691 -223 -129 -724 123 973
$$ packed form
496I21k627p63L979p82k270Q41j010P8J555Q75J369o69r85J011j603K59K723k609
514B93j935J445j684p72O19Q80J907q82p78J495j020P23K741j431r52J208j960
531a03o32J367K34j36j667j87J176j985J75K602j723m76J706j559J24J635J77
548G28P47m89n37R23j606Q57J905k881p79J789j851k96R43j27O26o58j16J536
566G14j101K60J388j613M69J098k123p4J785m91r7p94O18J035j406J03J507j869
584e91j09J481j663O58Q11j218L91L0M85K57j255P31J113k368O44J904j962Q34
602A73J070j180L47M3j59K88j061K75K95k244J425J516k024J015R81j128L09K40
620A81Q71O74j454M15N46j944O54O45j227M44M23k062M31P12M68R4n95Q47Q50
$$ plain form
639 973 -1298 199 1953 411 1207 1628 -161 551 824 460 527 -549 -411 -1059 -2768 -1202 -71 -1734
657 -1734 -629 295 -826 51 1019 1362 2160 1099 1433 1128 -448 394 941 -823 -255 -542 -2262 -1299
675 -1299 -560 -278 -175 -624 346 317 -1123 594 1624 358 1241 1073 -469 632 772 421 529 -103
693 -103 -376 -1092 -2463 -447 19 -1747 -333 69 -991 82 796 824 1663 986 1251 819 -305 711
711 711 589 -799 -38 -380 -1843 -730 -306 -428 -11 -410 141 137 -832 647 1039 -566 646 368 -504
730 -504 672 523 -185 456 137 338 -301 -906 485 204 -1418 12 -38 -1096 49 153 162 843 133
749 133 196 446 114 707 -135 -992 517 108 -838 305 337 -52 197 -96 231 175 -665 346 -191 -1158
769 -1158 255 -65 -811 644 236 -331 407 257 559 570 43 858 -15 -1100 415 163 -869 18 -516
$$ packed form
639I73k271J497J754j542P96M21j789P12K73l64O7j076J38o48j709J566J131j663
657a734J105R24j121Q77R68L43P98j061L34l05j576Q42N47j764N68k87j720R63
675a299P39K82J03m49R70k9j440J717J030j266Q83j68j542J101J40l51J08o32
693a03k73p16j371K016M66j766J414M02j060J073P14K8Q39o77K65m32j124J016
711G11j22j388P61l42j463J113M24j22M17l99N51mr69J479L92j605J212k78q72
730e04J176j49p08O41l19K01o39o05J391k81j622J430n0j058J145J04RO81p10
749A33O3K50l32N93q42q57J509m09r46J143L2l89K49k93L27n6q40J011n37r67
769a158J413l20p46J455m08n67P38j50L02J1n27Q15q73j085J515k52j032Q87n34
$$ plain form
788 -516 -818 -99 -594 -340 420 34 583 -239 -377 1093 484 38 1175 595 -38 273 -114 495 371 -687
808 -687 -270 -882 -1501 23 -617 -803 770 -126 -487 345 278 994 1138 666 963 39 -714 781 31 -304
828 -304 517 -612 -1310 -431 -548 -261 34 -206 -3 -636 -572 986 498 276 1408 236 -243 313 84
847 84 493 618 -581 -540 -993 -1153 -206 -622 -359 821 -519 -747 392 397 830 715 402 569 -354 -541
867 -541 632 -86 -17 665 -895 -863 123 -345 -97 226 -97 -209 -907 -603 1002 -37 140 981 -53
886 -53 -216 574 207 596 696 -86 -289 -942 -738 54 -521 -7 517 -760 -778 433 81 288 332 -37 76
907 76 -466 -368 648 -25 125 586 -547 -100 941 104 189 308 -302 -253 -630 -482 182 -401 -316 358 -862
928 -862 -346 616 -226 534 570 7 67 -12 180 686 -158 83 557 -528 -165 687 -146 -19 -211 -571 -183
$$ packed form
788e16l02P19m95K54P60l86N49q22j38J470o09m46J137n80o33L11l87O09j24j058
808f87M17o12o19J524o40j86J573q96l61Q32o7P16J44m72K97r24p53J495p50l35
828c04Q21j129o98Q79j17K87K95k40K03o33O4J558m88k22J132j172m79N56k29
847H4M09J25j199M1m53j60R47m16K63J180j340k28J139NM33j15l13J67r23j87
867e41J173p18O9O82j560L2R86m68K48L23l23j12o98L04J605j039J77Q41j034
886e3j63P90l67L89J00p82k03o53K04P92n75N14N24j277j8J211l52K07M4l69J13
907G6n42R8J016o73J50M61j133M47J041q37Q5J19o10M9l77J48O64n83Q5O74j220
928h62N16R62q42P60L6n63O0p9J92N06q44K41M74j085L63Q52q33J27j92l60L88
$$ plain form
949 -183 -458 -349 200 -288 142 492 -231 452 1143 81 353 477 -149 48 -489 -128 86 -890 -680 -20
969 -20 -685 -86 481 -285 348 436 -266 555 388 596 612 -347 -257 326 -640 247 402 -533 -47 -389 -903 -291
991 -291 -276 -201 314 -505 -36 337 38 842 1116 111 389 137 -236 198 99 7 -90 -999 -638 -283 -639 143
1013 143 422 -330 148 23 -395 380 492 514 303 -613 179 407 -290 543 622 -677 -187 -638 -692 180 97
1034 97 -180 -188 -610 -118 133 -201 855 729 -302 203 -33 -397 795 271 168 135 -607 -275 -110 -291
1054 -291 526 447 -605 -106 -293 -661 194 468 90 -12 -545 101 122 -63 914 585 -203 250 -82 -284
1074 -284 399 228 -19 -227 -508 -330 -380 -237 671 210 -590 65 -262 -126 597 383 183 218 -393 0 345
1095 345 60 719 342 -595 -58 -272 -674 59 -192 -239 -458 -648 -206 106 -23 705 572 -246 404 -10
$$ packed form
949a83k75J09N49m88M30L50p23O83O91j062K72J24o26J97n37L61K14r76K10O60
969b0o65N99N67p66O33Q8p02Q21j67K08J6r59R0N83r66Q87J55r35M86l42n14O12
991b91J5P5N15q19M69L73k99Q04K74j005K78k52l73M34r9r2r7r09L61L55l56P82
1013A43K79p52M78j25m18P75J12K2k11r16P92K28o97Q33P9j299M90m51n4Q72q3
1034I7k77qm22M92K51l34J056j26j031N05k36l64J192n24j03l3p42L32J65j81
1054b91Q17p9j052M99j87l68Q55K74l78j02n33O46K1j85R77l29p88M53l32k02
1074b84O83j71k47k08k81J78n0J43R08m61q00O55l27J36P23k14k00L5o11L93L45
1095C45k85O59l77r37N37k14m02P33k51m7k19j90M42L12j29P28j33q18O50m14
$$ plain form
1115 -10 -141 835 144 -77 -94 -481 -429 -398 -471 336 -319 -847 -134 -246 -56 716 112 64 227 -189 291 438
1137 438 284 629 26 -519 152 -227 -701 69 -455 -441 -478 -816 -71 150 -110 613 173 -8 696 275 233
1158 233 700 123 -105 -162 -396 112 -46 -229 86 -404 -664 163 -175 -88 302 -67 -238 256 -241 196 270
1179 270 146 422 -127 -176 662 -38 3 269 -449 -547 -289 -285 -22 143 -383 202 -244 27 614 102 120 712
1201 712 -206 -291 122 -25 236 101 -57 63 -398 -395 309 -41 45 386 -499 -378 236 -175 312 193 147 73
1223 73 -320 -70 606 -43 352 318 -324 -363 -43 -225 269 -134 -374 -13 -495 -216 220 -190 129 390 -565
1244 -565 -105 400 138 316 286 -17 317 -253 135 524 -19 -76 -102 -869 -268 106 -64 48 -23 -254 43
1265 43 -291 155 730 252 188 285 -354 -50 259 19 318 97 -344 -393 -438 -7 214 -250 -159 -100 -618 -211
$$ packed form
1115a0j31R76o91k21j7l87N2L1p3Q07o55n28P13j12J90P72o04m8J63m16M80J47
1137D38j54L45o03n45O71l79m74P70n24J4l7l38P45K21k60P23m40j81P04m21m2
1158B33M67n77k28n7k34N08j58j83L15m90k60Q27l38Q7L90l69j71M94m97M37P4
1179B70j24K76n49m9Q38p00M1K66p18r8K58MK63J65n26N85m46K71N87n12J8N92
1201G12r18q5M13j47K61j35j58J20m61LP04l50Q6L41q85J21O14m11M87j19m6p4
1223G3l93K50O76o49L95l4o42l9L20j82M94m03k40L61m82K79M36m10L19K61r55
1244e65M60N05k62J78l0l03L34n70L88L89n43n7k6p67O01L74j70J12p1k31K97
1265D3l34M46N75m78o4R7o39L04L09k40K99k21m41m9m5M31K21m64R1N9n18M07
$$ plain form
1287 -211 413 109 545 262 112 324 4 264 563 -4 104 45 -537 -381 -44 -431 -54 30 -494 -92 -93
1308 -93 85 800 149 289 221 -165 202 447 -36 214 -20 -309 -279 -361 -36 173 -339 -118 -187 -800 -80 286
1330 286 17 336 -55 -37 210 -15 356 808 23 42 -72 -565 -10 116 -389 -46 -141 -343 -64 -160 200
1351 200 545 -54 135 304 -108 102 230 -234 294 4 -277 132 -14 -40 208 -316 18 -53 -253 52 93
1372 93 -321 196 -32 -170 252 56 229 292 66 -4 -97 -323 334 181 -181 83 -280 -149 159 -40 180
1393 180 49 -280 -1 -134 -255 234 105 -95 83 -145 -320 214 130 137 10 -244 -148 -140 -94 63 85 -363 19
1416 19 -225 -250 35 12 -2 7 -136 29 92 -29 429 344 -216 278 155 85 322 -13 66 49 -233 -113 -205 -110
1440 -110 128 -234 -442 112 -202 17 309 168 76 228 19 219 190 28 165 -108 -385 -45 -442 -114 289
$$ packed form
1287b11O24l04M36k83j50K12l20K60K99n67J08n9n82J56L37l87L77Q4n24M02j
1308i3J78P15o51J40o8l86L67K45m83K50k34k89L0q2L25K09n12K21o9o13P20L66
1330B86k69L19l91J8K47k25L71M52p85J9j14m93N55J26n05L43r5k02K79r6L60
1351B00L45n99J89J69m12K10J28m64N28k90k81M09j46k6K48n24L34p1k00L05M1
1372I3m14N17k28j38M22j96J73O3k26p0r3k26O57j53l62K64l63J31L08j99K20
1393A80j31l29K79j33j21M89j29k00J78k28j75N34q4Pj27k54R6QM6J57K2m48L82
1416A9k44k5K85k3j4Rj43J65O3j21M58q5n60M94j23p0K37l35P9j7k82J20r2R5
1440a10K38l62k08N54l14K19K92j41r2J52k09K00k9j62J37k73k77L40l97L28M03
$$ plain form
1461 289 -88 -98 -156 -216 139 6 65 477 10 -158 195 171 109 479 20 -63 130 -149 -152 68 -191 6 -282
1484 -282 -336 -61 -197 -63 212 166 45 -51 -90 169 36 87 265 -92 -270 -98 -267 -149 179 -223 -21 -59
1506 -59 -89 76 -19 -95 197 -168 -111 150 11 127 330 13 63 -44 -164 124 -89 -32 10 -216 -376 -22 -153
1529 -153 -43 230 48 16 -69 -209 103 128 145 231 92 -90 97 12 202 283 -23 109 17 -210 -59 -108 -35
1552 -35 25 -306 -121 101 -110 72 275 -48 68 119 18 305 195 -82 43 -172 -27 142 -207 -210 -35 -237
1574 -237 1 -127 -300 116 23 12 121 -137 121 253 -40 212 210 -121 25 260 37 -24 -72 -174 103 -255
1596 -255 -332 -36 -322 43 127 -216 -52 277 94 118 99 92 224 -186 75 199 -89 -176 79 -356 -98 -159 -148
1619 -148 19 -100 -275 117 -23 90 203 -105 61 143 8 58 210 -2 59 10 -105 -82 -250 -72 -85 -150
$$ packed form
1461B89l77j0n8o0L55j33N9M12m67j68L53k4o2L70m59q3J93k79lK20k59J97k88
1484b82n4K75j36J34K75m6j21r6l9K59j33N1J78l57j78J72j69J18L28m02K02l8
1506e9l0J65r5p6K92l65N7K61j39J16K03l17N0j07j20K88k13N7M2k26j60L54j31
1529a53J10K73j82l2q5j40L12K5J7Q6j39j82J87q5J90Q1l06J32r2k27J51m9P3
1552c5O0l31J85K22k11J82K03l23J16N1j01K87j10k77J25k15J45J69l49lJ75k02
1574b37K38j28j73M16r3j1J09k58K58J32k93K52kl31J46K35k23o1m8j02K77l58
1596b55p7K96k86L65Q4l43J64L29j83K4j9pJ32m10K61J24k88q7K55m35K58o1J1
1619a48J67j19j75L92j40J13J13l08J66Q2j35N0J52k12O1m9j15K3j68J78j3o5
$$ plain form
1641 -150 -71 -9 -84 209 162 30 288 109 -105 155 -128 -31 232 -143 -140 25 -365 -10 -130 -202 -17 -212 -196
1664 -196 -119 -122 218 117 -274 -27 288 -108 189 145 -71 109 -2 -62 122 -152 9 81 -82 -124 -39 -63 131
1687 131 161 -280 -38 -13 -95 189 -63 135 224 87 1 174 -5 141 127 -13 -41 -195 -207 -26 -84 -135 2
1710 2 -229 88 -26 -21 49 259 126 335 -33 -148 -76 6 31 17 -266 32 -158 -232 -30 75 -3 18 -222 -59
1734 -59 57 -90 88 133 245 230 176 -132 338 74 -88 70 -301 -244 -167 -245 -73 -105 -193 19 -47 -219 191
1757 191 94 105 106 49 113 276 -29 138 77 -139 65 -51 -208 -4 43 -142 -32 -41 -202 7 -124 -97 8 -26
1781 -26 8 92 41 203 5 -73 96 60 -83 41 -66 -86 59 -153 -106 -162 -51 73 107 98 282 52 52 282 -73
1806 -73 271 111 138 82 -38 8 -48 -128 -59 -58 -260 -27 60 -128 99 99 -12 -22 -21 -114 220 -151 40 277 -12
$$ packed form
1641a50P9O2p5K93m7j32K58j79k14K60k83R7K63l75LJ65l90L55j20p2J85j95J6
1664a96P7lL40j01l91K47L15l96K97m4k16J80j11o0J84k74J61P2j63m2Q5k4J94
1687A31L0m41K42K5q2K84k52J98Q9j37q6J73j79J46j4j40k8j54j2J81n8n1J37
1710Bk31L17j14NP0K10j33K09l68j15P2Q2K5j4k83K98j90p4K02J05p8K1k40J63
1734e9J16j47J78M5J12j5n4l08M70k64j62J58l71N7P7p8J72l2q8K12o6j72M10
1757A91r7J1Jn7O4J63l05J67o1k16K04j16j57K04M7j85J10rj61K09j31K7J05l4
1781b6L4Q4n1J62j98p8J69l6j43J24j07k0J45k12M7n6J11J24L4rJ84k30%K30l55
1806g3L44j60K7n6j20M6n6q0O9Jk02K33Q7j88K27%j11j0Jr3L34l71J91K37k89
$$ plain form
1831 -12 -3 189 -7 52 -94 -197 51 -130 -110 27 -107 182 0 -269 -80 4 -94 -14 -29 22 166 -57 41 11
1855 11 35 20 227 -57 -151 -181 -42 -94 -110 -89 -25 -118 -192 48 -87 -77 271 29 133 166 11 113 11 -65 175
1880 175 30 -102 49 -142 86 102 -213 61 -175 -164 85 61 -88 173 2 -19 151 40 -42 109 53 -74
1902 -74 9 -71 96 18 -136 2 44 31 -9 -112 -67 240 4 -61 155 48 38 -14 207 183 46 -128 22 29 -94
1927 -94 -72 -188 28 192 -64 -44 156 49 -1 22 -21 115 97 82 33 -26 123 71 -52 23 -59 -61 -26 78 -17 -22
1953 -22 -43 -57 40 35 60 127 -105 118 -97 -111 146 178 113 -72 -100 132 -8 -67 166 93 -106 40 -74 -31 -102
1978 -102 -112 -18 57 59 19 7 -39 -34 96 -35 -69 49 -89 26 83 267 5 -2 124 49 -56 52 -61 -3 -17 72
2004 72 -205 174 210 215 -51 59 -47 131 -124 -21 115 -82 -131 -183 -84 -44 -122 -47 241 -121 19 71 -150 96
$$ packed form
1831a2RJ92j96N9j46j03K48j81K0J37j34K89j82k69J89Q4r8Q0j5N1J44k23R8l0
1855A1K4j5K07k84r4l0J39n2j6K1O4r3p4K40j35J0L48k42J04L3j55J02j02p6K40
1880A75j45j32J51j91K28J6l15K74k36J1K49k4j49K61j71k1J70j11q2J51n6j27
1902g4Q3q0J67p8j54J38M2j3m0j03M5L07k36o5K16j07j0n2K21k4j37j74J50Pj23
1927i4K2j16K16J64k56K0K00j07n0K3m3J36j8j5m9n9J49n2j23P5q2kL5J04r5n
1953b2k1j4R7nK5O7k32K23k15j4K57L2o5j85k8K32j40n9K33p3j99J46j14M3p1
1978a02j0R4P5Km0j2m6NJ30j31l4J18j38J15N7J84k62pJ26p5j05J08j13N8j4Q9
2004G2k77L79L6Nk66J10j06J78k55J03J36j97m9n2R9M0p8P5K88l62J40N2k21K46
$$ plain form
2028 96 12 35 111 45 -42 -80 0 73 195 119 29 26 -138 -93 112 -233 144 -116 -96 107 86 129 127 8 199 52
2054 52 -66 114 46 -28 158 -106 -58 42 -75 -156 18 -109 -35 -64 -106 -66 -87 -111 232 118 -51 3 179 28
2078 28 135 -59 7 -8 -347 -88 2 -283 201 -48 -236 -71 31 43 78 -77 124 -107 -172 179 99 -17 168
2101 168 -47 -34 185 18 -3 -9 -163 -75 -121 -169 96 -1 -210 24 -255 -86 41 18 83 -21 20 155 102 -40
2125 -40 150 -116 -31 -115 -174 -50 74 -144 101 -113 -102 66 47 -115 93 -11 29 176 -101 31 185 85
2147 85 46 172 -112 -9 -57 -42 41 -76 -165 15 -76 -87 46 -27 85 51 -5 131 0 -80 116 39 17 67 -46
2172 -46 -2 67 -107 21 34 -286 177 -137 -88 222 2 122 21 -66 129 148 -44 184 106 126 -11 26 -168
2195 -168 -30 -106 -5 8 -245 -91 47 -51 -117 -45 35 155 201 -36 181 -52 -102 97 -163 14 147 43 -36
$$ packed form
2028I6q4K3P6o6q7l8Q0P3J22p6r0lj64M5K05l45L77k60K0K03k1M3kj19J91j47
2054E2j18J80o8p4J86k64M8J00j17q1J74j27P4k9m2M0k1k4L43j14j69N4J76j51
2078B8J07j94O6j5l39K59R0k85M84k49j88J65J02J2L5j55K01k31o5L51q0j16J85
2101A68k15J3K19j67k1oj54Q8m6m8K65r7k09K34k79J69J27k3O5j04M1J35n3j42
2125d0J90k66Q5q4n9J24J24k18K45k14J1J68j9j62K08j04M0J47k77J32J54j00
2147H5l9J26k84J03m8J5Q3j17q9J80r1j1J33p3J12l4n6J36j31q0J96p7k2N0j13
2172d6M4O9j74J28J3l20M63l14M9L10k20J20j01q7J95J9j92K28p8K0j37L7j94
2195a68J38p6J01J3k53J54J38r8o6P2Q0J20M6k37K17k33n0J99k60J77J33j04p9
$$ plain form
2218 -36 117 37 67 87 -54 -37 -148 -127 56 3 98 105 -54 16 132 -122 115 174 123 98 30 -130 18 -235 -62
2243 -62 30 -37 -17 -90 -40 -56 25 33 97 -1 117 258 210 -43 145 -9 -130 47 -35 145 27 31 74 -62 152 -48
2269 -48 -90 -70 103 -55 68 146 -96 60 45 103 162 -195 41 -142 1 10 5 -109 -149 69 -24 43 -7 -208 87
2294 87 -169 -198 49 113 214 4 44 119 -89 -26 159 107 -8 -12 -52 -156 -159 -91 -153 -25 -146 39 91 -140 65
2319 65 -123 -17 116 -35 28 82 43 82 -106 -51 195 -79 -245 87 52 22 137 3 -77 48 -106 46 -97
2342 -97 -156 42 134 28 191 159 -40 129 303 -98 -64 -262 132 7 -311 55 -190 -85 -13 32 19 -24 -94
2365 -94 -40 101 -71 -211 6 -15 266 -138 1 154 -1 34 -32 -204 -115 74 44 3 -17 -84 21 112 -158 -11
2389 -11 52 150 68 -29 14 78 -143 22 -159 -178 -120 -65 -80 6 -65 -218 -84 44 -80 119 15 58 24 -86 126
$$ packed form
2218c6J53q0L0K0j41J7j11K1J83n3R5Pj59P0J16k54K37N9n1k5o8j60J48k53J73
2243f2R2o7K0p3N0j6Q1QO4r8J18J41m8k53J88j54j21J77q2J80j18MM3j36K14k00
2269d8m2K0J73j58J23P8k42J56j5N8N9l57K36j83J43Rnj14m0K18r3O7n0k01K95
2294H7k56k9K47O4J01k10M0P5k08O3J85n2j15mm0j04lO8o2J28j21J85N2k31K05
2319F5j88J06J33j51O3N4l9L9j88N5K46k74j66L32l5l0J15j34q0J25j54J52j43
2342i7n9J98R2j06J63l2j99J69J74m01L4j98L94j25l18L66k45J05P2M5j3m3p0
2365i4N4J41j72j40K17k1K81m04J39J53j55L5o6j72Q9J89l0m1k0o7J05R1k70J47
2389a1O3R8q2r7M3O4k21J65j81j9N8N5j5Q6p1j53J34J28j24J99j04M3l4j10K12
$$ plain form
2414 126 -120 81 -45 -5 -231 65 -104 137 -137 -83 88 15 7 -40 -40 -14 197 8 42 73 60 -18 6 -105 -13
2439 -13 -215 2 59 75 14 14 -134 -139 -75 -148 45 204 102 -48 -69 79 135 71 82 32 -33 -100 139 -64 -16 4
2465 4 -155 -10 -78 -33 23 92 100 45 -88 -114 134 -128 1 43 21 49 -34 61 145 -130 -38 25 -128 -116 -41 43 20
2492 20 -160 -257 150 -111 -18 58 65 -35 84 58 100 -22 -115 160 -90 -135 20 -75 -79 131 -34 117 33 -97 43
2517 43 7 30 -72 -87 -30 22 -166 45 -3 69 174 11 133 129 85 -128 -37 54 -86 -130 -31 -43 128 -97 13
2542 13 195 -71 123 -197 -58 141 6 41 -6 22 -36 -45 -45 -43 -28 -18 -89 45 -113 -7 -50 -143 124 -114 -82 2
2568 2 -11 -167 -96 -14 -14 67 -115 183 14 -112 89 -139 128 -47 33 -72 90 -26 -12 78 -79 115 56 -130
2592 -130 97 93 33 14 -66 -19 -41 -201 -33 -33 -118 -1 -71 52 -54 -129 1 -49 -76 156 159 3 49 191 18 149
$$ packed form
2414A26k46K01j26M0k26K96j69K41k74N4J71p3qm7%K6K11j89L4L1j3p8K4j11R2
2439a3k02K17N7J6o1%j48nO4p3J93J59j02j50k1J48N6o4J1n0o5o7K39k03M8K0
2465Dj59J45o8M5N6O9Qn5j33k6K48k62J29M2k2K8q3R5Q4k75R2O3j53J2P5Q4k3
2492B0j80r7M07k61R3P6Pj00J19k6M2j22r3K75k50m5J55r5mK10j65J51q4j30J40
2517D3l6K3j02j5N7N2j88K11m8P2J05j63J22mm4k13R1R1j40m4R9j2J71k25J10
2542A3J82k66J94l20J39J99j35L5m7K8n8r%KJ5J0p1J34j58J06m3r3K67k38L2Q4
2568Bj3j56P1Q2%Q1j82K98j69j26K01k28K67j75Q0j05J62j16J4R0j57J94n9j86
2592a30K27mo0j9q0M7k2j60J68%q5J17p0J23j06p5J30n0k7K32Lj56M6J42j73J31
$$ plain form
2618 149 -180 -29 44 -200 -69 89 -55 -74 110 -63 142 -10 -78 107 119 136 -204 -75 -195 64 -256 79
2640 79 136 58 8 7 47 -127 -130 -53 -57 -57 18 66 -150 -89 7 -122 84 235 24 23 -125 85 -9 31 127 75 204 -201
2668 -201 -18 -105 76 -114 -175 72 -127 12 97 17 125 105 -163 -21 96 73 141 91 -60 -50 -124 -29 10 -139
2692 -139 53 15 -37 -10 114 81 -2 45 -48 19 -113 55 199 16 -11 58 166 41 -13 43 -47 48 -93 -58 122
2717 122 -142 76 85 -44 101 -90 63 108 42 -22 107 -49 157 -213 -9 -160 -190 66 51 111 -5 -50 -145
2740 -145 197 2 45 -38 1 75 24 -100 54 244 95 206 -94 -39 7 -6 -82 -42 -248 -79 5 -12 89 -28
2764 -28 -28 -54 102 -119 37 81 82 26 -119 -150 25 95 43 -130 -181 -165 -30 -14 136 -22 -128 62 11 35 52 55
2790 55 73 173 -49 -7 174 95 72 156 11 -74 81 -14 102 -72 -6 -148 49 316 115 -148 -52 -124 11 132
$$ packed form
2618A49l29J51P3k44J31J58j44j9J84j73K05j52o8J85J2J7l40J29j20K59l20L35
2640G9N7p8n0jM0j74lP7m%P5M8k16O1R6j29K06J51k11jj48K10r4M0R6n2J29m05
2668b01J83q7J81j90o1K47j99J39Q5q0J08k0k68J42J17k3O8n0j51J0p4R5L9j49
2692a39J92l8n2K7J24l3q3M7r3O7j32J68J44j83k7O9J08j25n4N6r0R5j41L5J80
2717A22k64K18Rj29J45j91J53M5o6o4J29j56K06l70K04j51l0K56j5O0j16m5r5
2740a45L42j95M3q3L9P4n1j24J54J90j49J11l00N5M6j3p6M0k06J69Q4j7J01j17
2764b8%k6J56k21J56M4Jn6j45l1J75P0n2j73n1J6J35J6J50j58j06J90n1K4J7L
2790E5J8J00k22M2J81p9k3Q4j45q5J55r5J16j74O6j42J97K67k01k63R6p2J35J21
$$ plain form
2814 132 58 -17 30 30 -9 -8 -148 66 -140 -36 -160 -122 -94 -10 10 -58 12 27 -60 58 -108 70 -8 49 78 -23
2840 -23 95 111 17 -66 173 34 47 38 -63 -182 -32 -56 15 -161 -7 77 -119 14 41 -147 2 57 55 -104 97
2865 97 37 -105 -48 -50 66 -32 107 11 -122 -22 103 -1 2 -166 -46 124 -21 -75 63 98 -68 34 -96 -123
2889 -123 55 -32 -113 -114 -178 -93 7 -142 -14 162 -120 204 57 35 113 105 -27 -117 -66 33 57 23 -69 -253 -208 -138
2915 -138 13 -1 59 -117 9 -40 -105 69 -77 82 204 -45 84 -44 -107 156 -63 -265 98 87 -78 -23
2937 -23 -44 -73 -99 11 4 -14 -304 -33 -25 42 29 -9 184 -51 60 113 15 -192 148 22 -51 -20 64 80 -89 97
2963 97 -60 141 29 130 90 101 78 236 13 -85 -70 3 43 -19 123 89 93 -149 -14 -45 53 -73 85 -80 -81
2988 -81 -20 -59 112 2 21 -158 13 44 -130 145 -4 -83 -1 31 33 155 9 -68 -104 43 -91 120 -176 91
$$ packed form
2814A32p4p5M7%l9Jj40K14k06J04j24L8K8Q4K0o8P0J5q7J18j66J78p8N7K9j01
2840b3J18J6r4q3K39j39J3rj01j19J50k4P1j76J54Q4j96J33K7j88J49N5kj59K01
2865I7o0j42N7kJ16r8J39r6j33J00J25j04Lj68J20J70j45n4J38L5j66J02j30k7
2889a23J78q7q1jo4Q5J00j49J28J76k82L24j47k2P8qj32r0N1R9K4l4r2j84M5P0
2915a38J51j4O0j76J26m9o5J74j46J59J22k49J29j28o3K63k19k02L63j1j65N5
2937b3k1k9k6J10pj8k90K71QO7j3l8J93k35J11N3r8k07L40j26p3L1Q4J6j69J86
2963I7j57K01j12J01m0J1k3J58k23r8J5P3M0o2J42l4Mk42J35l1R8j26J58j65j
2988h1O1l9J71j10J9j79J71L1j74K75j49p9Q2L2KJ22j46p7l6J47j34K11k96K67
$$ plain form
3012 91 -127 -133 81 69 17 -37 -97 31 71 -78 -35 -187 25 -91 -77 -103 -23 -174 -125 68 9 -295 77 -93 -182
3037 -182 -99 81 202 -53 -77 43 10 -28 -10 -230 -131 5 -24 -166 18 -224 32 -9 -153 -62 84 -228 -18
3060 -18 -97 -85 64 55 22 -4 -238 5 30 23 124 -213 -25 -35 -128 -146 -25 39 19 118 17 88 34 -74 117 -116
3086 -116 45 121 124 -123 47 164 -96 -36 4 -63 53 133 -62 161 9 32 26 -41 139 -147 73 114 70 103 -46
3111 -46 -95 -81 142 271 61 164 67 249 -75 54 41 -179 123 -54 52 -107 21 -18 72 29 57 240 -68
3134 -68 -153 -28 -55 -13 -59 -77 -31 -206 39 105 -13 -19 9 111 -80 -110 88 59 201 -20 83 83 76 -30 54 12
3160 12 -1 -88 -6 -161 -15 113 -18 -49 -52 60 -57 48 89 126 32 -23 -29 -2 81 103 46 13 5 -88 -54 123 -96
3187 -96 -10 105 -85 4 -15 -63 111 -41 167 111 -37 -43 13 -67 51 112 53 37 -149 -28 -48 57 -99 -15 27
$$ packed form
3012I1k18oK14j2n2n4o0J28M0j49M3j52K12j16J4k6Q0j51M9J93n9l04L72j70q9
3037a82Q3J80J21k55k4J20l3l8J8k20R9J36k9j42J84k42K56m1j44R1J46l12K10
3060a8p9J2J49rl3k6k34K43K5pJ01l37J88j0r3j8J21O4k0R9j01P1n4j08J91k33
3086a16J61P6Lk47J70J17k60O0M0o7J16Q0j95K23j52K3oo7J80k86K20M1m4L3j49
3111d6m9J4K23J29k10J03r7J82l24J29j3k20L02j77J06j59J28l9R0m3K8J83l08
3134f8q5J25k7M2m6j8M6j75K45O6j18oK8J02j91l0J98k9J42k21J03%pj06Q4m2
3160A2j3q7Q2j55J46J28j31l1lJ12j17J05M1L7r4n5oK7Q3K2n7l3qr3L4J77k19
3187i6Q6J15j90Q9j9m8J74j52K08n6j48oN6q0J18O1n9j6j86J21k0J05j56Q4M2
$$ plain form
3212 27 119 94 140 19 89 39 104 -73 -39 32 -72 -92 11 53 5 27 -144 4 136 -95 74 68 -135 33 -21
3237 -21 -25 179 -28 -23 222 -89 142 13 -37 177 0 78 30 -194 2 140 -159 76 -44 -34 103 -136 57
3260 57 62 -65 -43 -91 31 -54 -80 -77 -100 122 72 50 10 -71 31 -191 -49 -41 -42 -93 134 -125 -47 -92 54 128 167 56
3288 56 119 -14 38 -154 -47 -54 -81 26 -18 5 43 79 7 -105 -54 -85 106 153 16 -16 -55 45 -118 -7 147
3313 147 -55 -110 -83 -14 -77 -133 140 20 86 -37 -18 -8 84 66 89 -30 -51 157 156 -152 135 -105 -2 -47 -117
3338 -117 61 -15 72 -158 -39 161 207 -18 -62 148 -45 37 -36 36 32 24 -109 -19 31 -52 78 126 -135 -12 36
3363 36 -133 -134 69 71 68 -20 -70 -5 18 139 4 35 185 171 -66 100 17 86 -129 12 35 6 138 44 9 14 71
3390 71 -93 16 -19 27 -53 -7 167 75 16 82 32 -18 80 -130 73 9 62 -54 69 -25 -69 -82 -109 -250 -98 -25
$$ packed form
3212B7R2k5M6j21P0n0O5j77L4P1j04k0J03M2m8K2j71J48J32k31J69ok03J68n4
3237b1mK04k07NK45l11K31j29n0K14j77P8m8k24J96J38k99K35j20J0J37k39J93
3260E7Nj27K2m8J22q5k6Lk3K22n0k2m0q1J02k22J42Qjn1K27k59P8m5J46P4L9j11
3288E6O3j33N2j92J07pk7J07m4K3L8L6p2j12N1l1J91M7j37l2l9J00j63J11J54
3313A47k02n5K7O9o3n6K73j20O6j23J9J0R2j8K3j19k1K08jl08K87k40J03m5p0
3338a17J78p6Q7k30J19K00M6k25m4K10j93Q2p3P2mqj33R0N0q3J30M8k61J23M8
3363C6j69jK03Klq8n0O5K3J21j35L1J50j4k37J66q3O9k15J41K3k9J32r4l5NN7
3390G1j64J09l5M6q0M6J74r2n9O6n0n0R8k10K03o4N3j16J23r4m4j3k7j41J52P3
$$ plain form
3416 -25 -65 53 68 -28 64 -16 119 52 -47 -165 -69 -4 27 171 82 -21 -86 45 50 -212 -105 59 -144 35 99
3441 99 110 2 34 -13 22 108 114 32 30 -63 28 -26 -81 59 -212 220 149 94 101 -50 89 -19 93 6 93 110 184 -27
3469 -27 79 -18 -87 -85 142 66 -22 -23 15 9 44 -120 57 -42 -48 -37 7 -91 -33 156 -115 109 115 75 -54 41 -62 -190
3497 -190 -74 90 60 222 -35 -93 -195 190 -16 -76 147 -106 229 -81 -104 310 26 187 163 58 91 -131
3519 -131 -239 -162 3 -163 -154 -133 -133 85 -109 156 42 158 72 34 101 70 -50 47 95 68 6 103 -71 -46 -96 82
3545 82 -10 -97 54 -126 144 29 40 49 131 71 -41 111 194 207 90 -133 80 -44 -103 -84 -41 -195 40 -2 -1
3570 -1 -129 -62 -3 -37 92 -99 -49 18 -28 150 -18 55 182 152 51 -19 -5 -26 102 -77 75 134 -3 -174 -228
3595 -228 67 7 -7 68 56 -58 -16 20 79 193 -113 -15 -63 -56 -47 -73 26 -66 -28 31 -11 152 -125 73 -58 -77 45
$$ packed form
3416b5m0J18J5r6R2q0J35o7r9j18R6O5L1J44q9j03o5J31Nk62J07J64k03J79O4
3441I9J1j08L2m7L5Q6Oq2kr3R1n4n5J40k71M32p1n5Pj51J39j08J12q7Q7J7P4k11
3469b7J06r7o9KK27p6q8jL8oL5j64J77r9oJ1M4r8N8J89k71K24Om0j29R5j03j28
3497a90J16J64l0J62k57n8j02L85k06o0K23k53L35l10k3M14k84J61k4j05L3k22
3519a31j08P7J65j66RK1%K18j94K65j14J16q6l8O7l1j20R7M8k7o2R7j74K5n0J78
3545H2r2q7J51j80K70j15J1RQ2o0j12J52Q3J3j17k23K13j24n9J9M3j54K35m2J
3570aj28O7N9l4J29j91N0O7m6J78j68P3J27l0j01p0J4k1J28j79J52N9j37j71n4
3595b28K95o0j4P5j2j14M2L6N9J14l06R8m8PRk6R9r2L8N9m2J63k77J98j31j9J22
$$ plain form
3622 45 -83 78 -103 -16 20 42 -2 -38 -67 -113 -112 -93 -44 -8 -159 -87 3 -88 20 66 -117 -75 77 -99 38 75
3648 75 94 186 -27 -50 155 -60 63 -96 27 -8 -35 -118 59 2 85 -79 -156 180 187 -103 -15 87 44 63 -64
3673 -64 -88 -174 -197 -41 149 58 11 -107 -106 -39 131 -194 -88 -58 -98 -29 -32 93 75 9 -17 -50 -213 -103 -121 -158 28
3700 28 4 -210 33 112 -35 24 49 27 167 -29 49 135 23 0 59 0 -32 -129 144 -54 92 32 -1 27 100 7
3726 7 -30 8 -116 -167 -51 -13 -2 -139 -91 -134 166 9 29 5 108 -6 -34 56 51 -58 -194 -33 -11 -118 27
3751 27 -56 37 3 -84 -124 -38 0 170 -66 -23 82 -67 -67 13 50 -147 -17 75 81 -102 -161 164 -6 -142 69 -124
3777 -124 57 112 14 14 -169 -104 56 67 14 83 -4 -128 -139 -98 -159 -99 -127 -177 -81 130 52 110 145 77 -157 66 94
3804 94 -161 52 76 -59 8 24 -1 6 58 -56 -67 104 -46 11 -32 18 23 -80 -28 34 -187 -3 119 70 208 -39
$$ packed form
3622D5j28J61j81Q7L6K2m4l6k9m6JJ9M9L6j51P2R0r1J08M6j83M2J52j76J37L7
3648G5J9R2k13k3K05k15J23j59J23l5k7q3J77n7Q3j64p7L36Pk90Q8J02m3J9j27
3673f4k4q6k3J56J90r1m7j18JO7J70l25J06L0m0O9lJ25j8o6k6l3j63J10j8l7J86
3700B8k4k14K43P9j47N9K5k2J40j96P8Q6j12k3N9n9l2r7K73j98J46o0l3K8P3r3
3726Gl7L8j24n1J16L8J1j37M8m3L00j57K0k4J03j14k8R0nj09j36J61K2j07J45
3751B7q3R3l4q7m0Q6L8J70k36M3J05j49%Q0L7j97J30R2Oj83n9L25j70j36K11j93
3777a24J81N5r8%j83O5J60J1n3O9q7j24j1M1o1O0k8n0R6K11p8N8L5o8k34K23K8
3804I4k55K13K4j35O7J6k5PN2j14j1J71j50N7m3N0Nj03N2O2k21J84J22m9J38k47
$$ plain form
3830 -39 92 -77 18 189 -137 -82 -11 -68 -87 21 -3 -165 -76 74 10 119 62 40 117 -45 67 9 155 56 -72
3855 -72 33 -160 -29 -95 38 53 -9 -169 -151 114 -121 -129 -85 42 106 -51 0 -84 -67 -143 217 2 170 -63
3879 -63 -202 -69 -102 -49 118 -5 -28 -69 99 20 -6 90 72 -50 60 18 -27 20 81 15 56 -61 -56 -109 50 -120
3905 -120 26 102 -101 -53 0 86 133 -135 -42 16 1 41 154 71 3 3 44 140 5 106 26 33 -73 32 67 -9 -62
3932 -62 114 -38 -36 -53 37 -47 5 31 76 -104 -46 -65 -207 -20 -177 -70 -347 -46 -43 87 -191 -92 129 -21 -149
3957 -149 -52 -105 71 11 -96 94 103 -24 121 130 -151 48 1 9 49 109 40 20 54 -57 -106 -20 91 -110 -136 125
3983 125 158 -55 -106 38 -39 130 -101 175 112 -92 -19 -21 56 -80 60 -98 101 -221 38 79 -88 -25 -168
4006 -168 -40 -41 -36 144 86 0 -87 40 -42 31 -41 -88 -56 -63 101 -27 22 -54 -57 -69 -72 -14 4 139 -108 63 -73 -117
$$ packed form
3830c9J31j69R5J71l26N5P1n7j9J08k4j62Q9J50o4J09n7k2P7j62J12n8J46r9j28
3855g2J05j93J31o6J33J5o2j60J8K65k35qM4J27O4j57N1q4J7p6L60k15J68k33
3879f3j39J33l3N3J67j23k3m1J68p9k6R6j8j22J10m2m5M7O1o6M1j17Nn3J59j70
3905a20J46P6k03M8N3Q6M7k68R3N8j5M0J13q3o8%M1R6j35J01q0Pj06J05L5p6n3
3932f2J76j52Kj7R0q4N2K6M5j80N8j9j42J87j57J07k77L01LJ30k78R9K21j50j28
3957a49R7n3J76o0j07J90Rj27J45Rk81J99m7QM0O0o9k0L4j11m9Q6J11k01k6K61
3983A25L3k13n1J44p7J69k31K76o3k04P3kP7j36J40j58J99l22K59M1j67O3j43
4006a68J28jNJ80n8q6q7J27q2P3p2m7L2pJ64j28M9p6lj2lN8J8J35k47J71j36m4
$$ plain form
4034 -117 170 -18 -90 -96 -6 93 -78 -136 -97 -68 -14 -48 78 86 -7 69 65 7 39 -86 -4 -169 -27 -3 121 62 -113
4061 -113 -16 0 73 -45 14 -8 -22 -48 59 189 2 70 -119 14 -181 73 124 -265 75 -117 43 -32 -84 -24
4085 -24 -24 19 6 133 61 -23 20 27 30 89 41 13 74 -143 10 -43 6 -4 -14 14 -128 -105 34 26 100 57 19 -94 42
4114 42 109 -100 73 -212 -49 41 36 132 9 9 -24 67 93 47 46 -88 -12 -8 -20 43 -29 112 -81 49 115 40 -6 126
4142 126 153 -3 -128 40 -52 108 164 -139 -23 -10 5 -138 -29 -26 -129 127 -120 36 132 -53 -300 25 55
4165 55 122 20 -77 -40 -12 37 -84 -72 -229 -122 210 77 16 194 -52 6 50 206 6 49 122 87 -5 31 168
4190 168 -101 -169 -50 -187 99 -3 -66 11 -33 -18 78 -231 10 -25 -47 12 66 -41 106 -88 -5 -26 -12 17 -22
4215 -22 91 48 -104 75 -55 -1 78 38 -20 -119 35 -136 -94 68 -99 275 59 131 188 89 87 -40 -57 -78 75
$$ packed form
4034a17K87j88p2oR0R9j71n8L9K9N4l4J26Qr3P6mn8L2j25Q2j65J42K4J24n9j75
4061a13R7J6P3j18N9k2j4k6J07J30j87O8j89J33j95K54N1l89L40j92J60p5n2O0
4085b4%M3j3J27p2q4M3PLN9m8k8O1k17J53n3M9j0j0K8j42K3J39qP4m3l8j13J36
4114D2O7k09J73k85J63R0nR6j23%l3R1K6m6jj34P6Mj2O3p2J41j93J30O6p5m6J32
4142A26K7j56j25J68r2J60N6l03J16J3J5j43J09Lj03K56k47J56R6j85k47L25L0
4165E5O7j02r7L7K8M9j21J2j57J07L32j33o1J78k46N8M4J56k00M3P3l5r2L6J37
4190A68k69o8J19j37K86j02o3P7m4J5R6l09K41l5k2N9N4j07J47j94Q3k1J4K9l9
4215b2J13m3j52J79j30N4P9m0n8r9J54j71M2J62j67L74k16P2N7r9kj27j7k1J53
$$ plain form
4240 75 4 128 105 -136 -11 98 -69 -36 115 -43 170 -51 20 25 -23 46 -11 68 -173 11 105 121 44 -9 172
4265 172 161 96 11 21 35 92 -35 -102 55 -91 -166 -259 -112 -38 -122 19 -32 9 16 8 -6 86 73 74 -25 -16 59 10 -91
4294 -91 -118 -81 107 -71 -14 -16 116 -62 41 72 -111 -50 -150 -172 54 -60 -105 101 -30 -33 125 60 -29 35 19
4319 19 -61 177 11 30 82 46 -2 79 -50 168 -94 -84 17 -170 11 -17 -76 44 34 -186 -41 90 -115 3
4343 3 113 83 -61 -92 -140 172 -12 -119 14 -14 -16 -43 37 52 53 36 71 -76 -70 149 -13 -5 -63 1 71 -122 47
4370 47 -56 39 -76 16 -11 14 175 -151 104 91 124 -79 133 -52 -47 166 -36 102 29 -12 -66 -99 77 -33
4394 -33 25 39 -40 -74 -15 45 -124 168 -25 78 -87 -46 -4 -71 -13 -48 -85 -28 14 -200 102 80 -165 94 235
4419 235 173 -3 125 -215 24 35 -64 24 -32 0 -40 -1 45 65 -42 -15 -45 17 106 281 -43 -75 14 106 4 46
$$ packed form
4240G5p1J24k3k41J25J09j67L3J51j58K13k21P1Nm8O9n7P9k41J84R4J6p7n3J81
4265A72j1o5q5J0J4N7j27o7J57j46p5r3J47P4q4J41n1M1Pqj4R2j3Jr9RP5m9j01
4294i1k7L7J88j78N7kJ32j78J03L1j83O1j00k2K26j14m5K06j31lJ58o5q9O4j6
4319A9q0K38j66J9N2l6m8Q1j29K18k62J0J01j87J81k8n9J20j0k20J45J31k05J18
4343CJ10l0j44l1m8L12j84j07J33k8kk7Q0J5Jj7L5j47OK19j62Qn8O4P0j93J69
4370D7j03R5j15R2k7K5J61l26K55j3L3k03K12j85NK13k02J38p3m1n4l3J76j10
4394c3N8J4p9l4N9O0j69K92j93J03j65M1M2o7N8l5l7N7M2k14L02k2k45K59J41
4419B35o2j76J28l40K39J1r9Q8n6L2m0L9M6K0j07K7l0O2Q9J75l24l2Q9R2j02M2
$$ plain form
4445 46 -11 -48 -29 -57 144 -30 -10 -14 72 17 23 -25 -41 62 -30 -94 45 -58 55 71 28 81 -78 134 5 57 145
4472 145 41 -71 180 35 2 -37 -62 -32 49 -15 -22 -7 -3 -135 -186 58 44 -144 68 -90 64 -121 18 144
4496 144 129 -3 -63 -19 103 -27 59 70 66 -7 -5 171 26 -40 42 11 -58 27 73 -64 2 59 -40 134 -35 82
4522 82 44 -155 61 29 -152 -125 13 -144 -75 -41 -228 8 -105 5 -137 152 63 -2 142 -5 25 76 45 -4
4546 -4 68 -69 -31 18 4 219 52 -39 87 130 12 -16 53 53 -22 -125 172 179 81 -146 62 -133 17 -129 -192 -108
4572 -108 -2 -19 8 -69 -25 -178 -25 -29 53 276 -4 -15 -66 19 3 29 39 -58 23 76 -54 88 92 -168 -40 105
4598 105 116 -91 57 -107 -5 -31 -60 62 147 -32 -190 84 167 118 -6 193 -31 40 -74 -26 107 124 -105
4621 -105 -56 -52 -1 30 -19 10 -68 150 -26 -57 -15 -4 -81 42 -55 88 64 112 -101 -56 72 9 98 -69 -5 -47 58
$$ packed form
4445D6n7l7J9k8K01j74K0mQ6n5Om8j6J03r2o4J39j03J13J6m3N3j59K12j29N2Q8
4472A45j04j12K51j45l3l9k5L0Q1o4pJ5Mj32n1K44j4j88K12j58J54j85J39J26
4496A44j5j32o0M4J22j30Q6J1mp3KJ76j45o6Q2l1o9Q5M6j37O6N7r9J74j69J17
4522H2l8j99K16l2j81K7J38j57O9L4j87K36j13J10j42K89q9o5J44j47L0N1l1m9
4546dP2j37L8M9j4K15j67r1J26M3j18k8O9%p5j03K97Pr8k27K08j95J50j46o3Q4
4572a08J06j7K7p7M4j53J53mQ2K23k80j1n1Q5j6K6J0r7Q1N3j30J42Mk60J28J45
4598A05J1k07J48j64J02k6k9J22Q5j79j58K74Q3m9j24J99k24P1j14M8J33J7k29
4621a05M9MN1L1m9K9p8K18j76l1M2J1p7J23r7J43k4M8k13M5J28o3Q9j67O4m2J05
$$ plain form
4648 58 -138 -12 -93 0 4 -20 -190 -35 -24 -32 91 -219 -26 172 152 144 -157 90 -25 -151 107 102 96 -106 -59 57
4674 57 -153 167 -76 17 -43 105 101 153 -54 -71 30 -142 -31 186 -183 102 15 31 -1 46 -9 52 48 -70 103
4699 103 -181 97 -20 -236 69 225 77 -8 -23 -40 45 94 42 -24 195 -102 -81 -35 103 -47 72 149 3
$$ packed form
4648E8j96J26q1R3Mk4j70J55J1qJ23l10J93J98k0ql01K47j15j26K58nok02M7J16
4674E7k10L20k43R3o0J48mN2k07j7J01j72J11K17l69K85q7J6l2M7n5O1mj18J73
4699A03k84K78j17k16L05J56j48q5j5j7Q5M9n2o6K19k97K1M6J38j50J19P7j46
$$ [...]
8191a05
##END NTUPLES=NMR FID
##END=
