##TITLE=1H_DE-87_oil_TFA
 200.13MHz,CDCl3,
 8 sc
 
 31.3.2025
##JCAMPDX= 6.0         $$ Bruker NMR JCAMP-DX V2.0
##DATA TYPE= NMR FID
##DATA CLASS= NTUPLES
##ORIGIN= UXNMR, Bruker Analytische Messtechnik GmbH
##OWNER= pz
$$ XWIN-NMR		Version 3.5
$$ Mon Mar 31 15:42:40 2025 Russian Standard Time (UT+4h)  she@DPX200
##.OBSERVE FREQUENCY= 200.1313
##.OBSERVE NUCLEUS= ^1H
##.DELAY= (6, 6)
##.ACQUISITION MODE= SIMULTANEOUS
##.ACQUISITION SCHEME= undefined
##.AVERAGES= 8
##.DIGITISER RES= 18
##SPECTROMETER/DATA SYSTEM= spect
##.PULSE SEQUENCE= zg30
##.SOLVENT NAME= CDCl3
##.SHIFT REFERENCE= (INTERNAL, CDCl3, 0, 14.3821)
##AUDIT TRAIL= $$ (NUMBER, WHEN, WHO, WHERE, WHAT)
$$ ##TITLE= Audit trail, XWIN-NMR		Version 3.5
$$ ##JCAMPDX= 5.01
$$ ##ORIGIN= Bruker BioSpin GmbH
$$ ##OWNER= she
$$ F:/spectra/data/she/nmr/H-C/1/audita.txt
$$ ##AUDIT TRAIL=  $$ (NUMBER, WHEN, WHO, WHERE, WHAT)
(   1,<2025-03-31 15:41:15.82 +0400>,<she>,<DPX200>,
      <created by zg, POWCHK disabled, PULCHK disabled
       configuration hash MD5:
       00 E9 B6 7A A2 85 ED C7 34 08 36 98 17 FE 4E 26
       data hash MD5: 16K
       D3 94 E1 38 1B 94 83 8F 4C ED D0 CD 2C BE CB 13>)
$$ ##END=
$$ 
$$ hash MD5
$$ 87 08 1D 87 0E 3C 54 7F 9A 2D EE 32 5C C1 4B B4
##$RELAX= 
##$RELAX= 
##$RELAX= 
##$RELAX= 
##$RELAX= 
##$RELAX= 
$$ Bruker specific parameters
$$ --------------------------
##$DU= <F:/spectra>
##$EXPNO= 1
##$NAME= <H-C>
##$PROCNO= 1
##$TYPE= <nmr>
##$USER= <she>
##$AMP= (0..31)
100 100 100 100 100 100 100 100 100 100 100 100 100 100 100 100 100 100 
100 100 100 100 100 100 100 100 100 100 100 100 100 100 
##$AQSEQ= 0
##$AQ_mod= 1
##$AUNM= <au_zg>
##$AUTOPOS= <>
##$BF1= 200.13
##$BF2= 200.13
##$BF3= 200.13
##$BF4= 200.13
##$BF5= 200.13
##$BF6= 200.13
##$BF7= 200.13
##$BF8= 200.13
##$BYTORDA= 1
##$CFDGTYP= 0
##$CFRGTYP= 5
##$CHEMSTR= <none>
##$CNST= (0..31)
1 1 145 1 1 1 1 1 1 1 1 1 1 1 1 1 1 1 1 1 1 1 1 1 1 1 1 1 1 1 1 1 
##$CPDPRG= <>
##$CPDPRG1= <>
##$CPDPRG2= <>
##$CPDPRG3= <>
##$CPDPRG4= <mlev>
##$CPDPRG5= <mlev>
##$CPDPRG6= <mlev>
##$CPDPRG7= <mlev>
##$CPDPRG8= <mlev>
##$CPDPRGB= <>
##$CPDPRGT= <>
##$D= (0..31)
0 0.7 0 0 0 0 0 0 0 0 0 0.03 0 0 0 0 0 0 0 0 0 0 0 0 0 0 0 0 0 0 0 0 
##$DATE= 1743421275
##$DBL= (0..7)
120 120 120 120 120 120 120 120 
##$DBP= (0..7)
150 150 150 150 150 150 150 150 
##$DBP07= 0
##$DBPNAM0= <>
##$DBPNAM1= <>
##$DBPNAM2= <>
##$DBPNAM3= <>
##$DBPNAM4= <>
##$DBPNAM5= <>
##$DBPNAM6= <>
##$DBPNAM7= <>
##$DBPOAL= (0..7)
0.5 0.5 0.5 0.5 0.5 0.5 0.5 0.5 
##$DBPOFFS= (0..7)
0 0 0 0 0 0 0 0 
##$DE= 6
##$DECBNUC= <off>
##$DECIM= 32
##$DECNUC= <off>
##$DECSTAT= 4
##$DIGMOD= 1
##$DIGTYP= 9
##$DL= (0..7)
0 120 120 120 120 120 120 120 
##$DP= (0..7)
150 150 150 150 150 150 150 150 
##$DP07= 0
##$DPNAME0= <>
##$DPNAME1= <>
##$DPNAME2= <>
##$DPNAME3= <>
##$DPNAME4= <>
##$DPNAME5= <>
##$DPNAME6= <>
##$DPNAME7= <>
##$DPOAL= (0..7)
0.5 0.5 0.5 0.5 0.5 0.5 0.5 0.5 
##$DPOFFS= (0..7)
0 0 0 0 0 0 0 0 
##$DQDMODE= 0
##$DR= 18
##$DS= 0
##$DSLIST= <SSSSSSSSSSSSSSS>
$$ [...]
##$SUBNAM0= <"">
##$SUBNAM1= <"">
##$SUBNAM2= <"">
##$SUBNAM3= <"">
##$SUBNAM4= <"">
##$SUBNAM5= <"">
##$SUBNAM6= <"">
##$SUBNAM7= <"">
##$SUBNAM8= <"">
##$SUBNAM9= <"">
##$SW= 18.0517328524113
##$SWIBOX= (0..15)
0 0 2 0 0 0 0 0 0 0 0 0 0 0 0 0 
##$SW_h= 3612.71676300578
##$TD= 16384
##$TD0= 1
##$TE= 0
##$TE2= 300
##$TE3= 300
##$TEG= 300
##$TL= (0..7)
0 120 120 120 120 120 120 120 
##$TP= (0..7)
150 150 150 150 150 150 150 150 
##$TP07= 0
##$TPNAME0= <>
##$TPNAME1= <>
##$TPNAME2= <>
##$TPNAME3= <>
##$TPNAME4= <>
##$TPNAME5= <>
##$TPNAME6= <>
##$TPNAME7= <>
##$TPOAL= (0..7)
0.5 0.5 0.5 0.5 0.5 0.5 0.5 0.5 
##$TPOFFS= (0..7)
0 0 0 0 0 0 0 0 
##$TUNHIN= 0
##$TUNHOUT= 0
##$TUNXOUT= 0
##$USERA1= <user>
##$USERA2= <user>
##$USERA3= <user>
##$USERA4= <user>
##$USERA5= <user>
##$V9= 5
##$VALIST= <valist>
##$VCLIST= <CCCCCCCCCCCCCCC>
##$VD= 0
##$VDLIST= <DDDDDDDDDDDDDDD>
##$VPLIST= <PPPPPPPPPPPPPPP>
##$VTLIST= <TTTTTTTTTTTTTTT>
##$WBST= 1024
##$WBSW= 4
##$XGAIN= (0..3)
0 0 0 0 
##$XL= 0
##$YL= 0
##$YMAX_a= 191070
##$YMIN_a= -193508
##$ZGOPTNS= <>
##$ZL1= 120
##$ZL2= 120
##$ZL3= 120
##$ZL4= 120
##$ABSF1= 10
##$ABSF2= 0
##$ABSG= 5
##$ABSL= 3
##$ALPHA= 0
##$AQORDER= 0
##$ASSFAC= 0
##$ASSFACI= 0
##$ASSFACX= 0
##$ASSWID= 0
##$AUNMP= <proc_1d>
##$AZFE= 0.1
##$AZFW= 0.1
##$BCFW= 1
##$BC_mod= 2
##$BYTORDP= 1
##$COROFFS= 0
##$CY= -3
##$DATMOD= 1
##$DC= 2
##$DFILT= <>
##$DTYPP= 0
##$F1P= 0
##$F2P= 0
##$FCOR= 0.5
##$FTSIZE= 0
##$FT_mod= 4
##$GAMMA= 1
##$GB= 0.15
##$INTBC= 1
##$INTSCL= 1
##$ISEN= 128
##$LB= 0.25
##$LEV0= 0
##$LPBIN= 0
##$MAXI= 10000
##$MC2= 0
##$MEAN= 0
##$ME_mod= 0
##$MI= 1.114404
##$NCOEF= 0
##$NC_proc= 0
##$NLEV= 6
##$NOISF1= 3.799351
##$NOISF2= 2.8
##$NSP= 1
##$NTH_PI= 0
##$NZP= 0
##$OFFSET= 14.38212
##$PC= 1
##$PHC0= -467.8875
##$PHC1= 8.392209
##$PH_mod= 1
##$PKNL= yes
##$PPARMOD= 0
##$PSCAL= 0
##$PSIGN= 0
##$REVERSE= no
##$SF= 200.129724274929
##$SI= 16384
##$SIGF1= 3
##$SIGF2= 2
##$SINO= 400
##$SIOLD= 16384
##$SREGLST= <1H.CDCl3>
##$SSB= 0
##$STSI= 0
##$STSR= 0
##$SW_p= 3205.1282051282
##$SYMM= 0
##$S_DEV= 0
##$TDeff= 0
##$TDoff= 0
##$TI= <>
##$TILT= no
##$TM1= 0
##$TM2= 0
##$TOPLEV= 0
##$USERP1= <user>
##$USERP2= <user>
##$USERP3= <user>
##$USERP4= <user>
##$USERP5= <user>
##$WDW= 1
##$XDIM= 8192
##$YMAX_p= 0
##$YMIN_p= 0
$$ End of Bruker specific parameters
$$ ---------------------------------
##NTUPLES= NMR FID
##VAR_NAME=  TIME,          FID/REAL,        FID/IMAG
##SYMBOL=    X,             R,               I
##VAR_TYPE=  INDEPENDENT,   DEPENDENT,       DEPENDENT
##VAR_FORM=  AFFN,          ASDF,            ASDF
##VAR_DIM=   8192,          8192,            8192
##UNITS=     SECONDS,       ARBITRARY UNITS, ARBITRARY UNITS
##FACTOR=    0.0002768,     1,               1
##FIRST=     0,             0,               0
##LAST=      2.2672688,     0,               0
##MIN=       0,             -193508,         0
##MAX=       2.2672688,     191070,          0
$$ Real data points
##PAGE= N=1
##DATA TABLE= (X++(R..R)), XYDATA
0 0 0 0 0 0 0 0 0 0 0 0 0 0 0 0 0 0 4 -8 8 -8 8 -8 10 -13 16 -16 21 -24 28 -32 36 -42 45 -52 60 -68 76 -85 95
39 95 -105 117 -130 146 -160 177 -195 216 -239 261 -288 318 -349 386 -426 471 -521 579 -645 722
59 722 -815 926 -1060 1234 -1461 1772 -2229 2968 -4353 7836 -36839 -35481 34746 -26030 26954
74 26954 164374 67462 -64935 98867 172345 -50792 -88765 125973 49810 -193508 -91680
85 -91680 65954 -104472 -178238 27991 77378 -68180 -62141 76706 102573 10286 10690 108933
97 108933 81943 -49054 -33432 74678 26899 -92220 -41911 35084 -64714 -107836 31520
108 31520 47120 -67338 -22933 77200 20171 -42495 26676 84809 28799 -18706 20984 31978
120 31978 -27316 -32704 29480 29098 -59374 -86982 -6231 8333 -67844 -37941 48268 9692 -41131
133 -41131 26046 79237 31319 7959 63928 61424 -25595 -32660 27796 978 -57809 -31146
145 -31146 5543 -37015 -72724 -10791 40839 -10152 -30896 27178 25161 -20000 4850 48630
157 48630 28826 -11423 -1264 25377 -105 -25430 7441 23520 -13676 -35452 -9927 9455
169 9455 -14867 -20472 26281 23525 -28467 -10325 33677 11812 -9082 15063 19046 -19878 -32023
182 -32023 4494 8550 -26406 -16913 10439 -5758 -21193 728 28700 24344 -4 9459 26621
195 26621 -3068 -15120 17828 17200 -17546 -22052 -3265 -7204 -22916 -3677 18392 -7763 -23042
208 -23042 1790 6906 -2715 5290 14552 14616 3451 -5178 8700 14396 1709 1295 4950 -8434
222 -8434 -24395 -17854 4309 -1414 -16403 3599 10623 -14419 -2516 29785 22010 886 3444
235 3444 11406 -2195 -15120 145 6830 -13982 -16443 -6714 -10676 -9850 28 9338 10287 -1153
249 -1153 -1675 9346 5880 5244 13857 10968 -361 -6756 -2812 5896 203 -4007 947 -9004 -19661
264 -19661 -10656 -2497 -3186 -4835 -2292 5677 822 -3424 14734 23188 9977 5044 6721 2191 -6699
279 -6699 -8063 1769 -1430 -15976 -11809 -6543 -9816 -282 9551 6031 1084 474 4314 4165 317
294 317 6851 7920 -4797 -6801 -1666 -379 2117 1647 1468 2000 -6310 -8314 -89 1157 -375 -1160
310 -1160 -2140 -1218 -3490 45 11954 9736 306 2236 1545 -3672 -2792 -538 881 -4436 -9387 -3863
326 -3863 -3666 -3095 7561 8411 542 1504 2934 1958 685 988 4515 -1091 -10456 -5702 166 -483 1984
343 1984 2035 775 1589 -1801 -81 4629 2559 1369 -1043 -4826 -2998 -1199 -43 5032 1772 -2154
359 -2154 379 -2055 -2048 2857 2185 -519 -3420 -4387 -35 15 931 6644 2662 -2812 1043 1460 -373
376 -373 824 1024 734 -4470 -7360 -547 1695 -638 2700 1593 -738 889 99 1456 4455 1590
392 1590 -613 -2961 -4395 177 1114 -226 2429 -295 -2513 -329 -1039 1474 3771 107 -2222 -2307
408 -2307 -1877 1514 428 1005 3625 -767 -2917 1418 728 451 1985 394 -1512 -3858 -3226 1983
424 1983 1422 -357 2441 -1118 -2965 762 767 1087 2261 -726 -2574 -2985 -1114 3348 1362 324 2983
441 2983 359 -1221 1158 995 1988 1840 -3230 -4245 -3240 -2637 -563 -727 542 1637 -2176 -1553 3818
458 3818 3291 2738 3344 339 -729 -774 182 2132 -516 -556 357 -3836 -3653 530 -902 -749 435 -2424
476 -2424 -3132 -1346 1616 3386 1885 2260 3189 65 937 3795 1645 1155 81 -4382 -4070 -1930 -2914
493 -2914 -2057 -1551 32 -563 -2804 781 4665 2726 3424 3229 -787 155 1229 417 1022 -176 -1925
510 -1925 -2591 -3861 -700 933 -2123 -969 196 -2265 -838 949 1562 2937 2334 1566 1404 74
526 74 1356 2782 561 294 -2195 -4850 -2251 -1377 -2445 -691 -1391 -2055 -650 -214 1901 4097 2129
543 2129 1592 1360 615 1812 214 33 1531 -842 -2332 -1479 -2672 -190 1589 -1495 -1426 -260 -1489
560 -1489 -259 1191 1541 1443 -687 -551 951 -294 1623 1946 -1337 205 3 -2781 -295 1100 -126
577 -126 -189 -884 -332 -22 -206 1744 1896 -1188 -706 -591 -1568 156 -195 -856 199 -711 -733 448 577
596 577 2208 1836 -560 455 1042 -378 791 710 364 -282 -2298 -1377 -309 -1123 354 -62 -2116 324
614 324 629 -408 1730 2373 1319 366 246 1357 907 -574 1145 -425 -3110 -1592 -1448 -2953 -204
631 -204 25 -1741 -457 288 537 1510 2605 3595 1282 -130 2536 686 -1250 1393 -258 -2586 -1897
648 -1897 -2353 -2382 -1120 -688 -437 -1544 -318 921 434 880 3595 1983 632 1821 794 990 1871
665 1871 -100 -324 -1012 -2875 -2153 -2304 -2145 -910 -1682 -1773 -76 -104 1572 2362 2026 2674 1900 731 2192
684 2192 1081 -581 817 -1074 -2829 -2108 -2018 -1617 -468 -1084 -827 -759 -434 1297 732 611 2802 1092
702 1092 -33 1520 1201 814 1340 -260 -393 -380 -1814 -1198 -1335 -1228 -661 -2254 -1849 -87 -29 658 1725
721 1725 960 1793 1356 456 2006 861 -209 112 -1249 -1715 -1085 -1087 -714 -213 -1311 -89 88 -109 1093
740 1093 245 -138 1048 -507 -768 757 373 702 208 -467 569 118 -592 404 -86 -442 -8 -950 -1218
759 -1218 599 -160 -341 173 295 676 -378 -17 1607 530 -128 236 -645 -460 601 -656 -338 482
777 482 -455 -226 -383 340 669 -723 -633 337 -1031 -684 483 -675 -422 344 -287 222 882 580 1166
796 1166 432 415 648 -742 -181 693 -977 -1118 -268 -996 -389 -566 -362 562 -181 -622 621 113 713
815 713 1225 -29 516 1188 77 246 386 157 482 -971 -870 -389 -1300 -783 -225 -1199 -307 49 -542
834 -542 331 1086 712 972 95 434 978 -103 677 700 -478 -525 -339 -1178 -283 -494 -632 -396 -797 -447
854 -447 -6 49 384 865 71 635 868 260 565 279 87 41 -760 -659 -194 -1106 -324 -444 -1025 -170 152
875 152 -429 626 1055 443 393 -2 479 537 54 418 442 -443 252 7 -359 134 -146 -644 -488 -606 -481
896 -481 -132 -169 282 18 -437 527 207 32 956 518 -265 19 -383 -206 -12 -472 -341 -312 -501 -26 -226
917 -226 -427 752 37 -186 2 -214 320 384 -245 282 709 -304 552 388 115 419 178 -146 223 -422
937 -422 -357 -186 -603 -238 -185 -656 181 84 -202 696 236 -163 311 -6 202 376 -482 149 -90 -196 500
958 500 36 -207 320 -225 -628 52 -58 -237 -73 -812 381 211 -342 551 809 631 306 260 130 558
978 558 -161 69 -121 -616 -220 -696 -864 79 8 -504 -138 -144 114 140 39 733 682 -272 488 28 -21 496
1000 496 274 -89 158 -462 -579 -80 -426 -362 -491 -1022 -209 -154 -334 837 553 210 756 408 204 905
1020 905 455 -316 -140 -328 -309 -642 -207 226 -513 -800 108 -406 -80 464 -218 129 424 -70 231 15
1040 15 424 645 -63 -111 371 -260 -292 417 -103 -372 -223 -859 135 -17 102 284 124 -21 303 360 352 718
1062 718 -98 332 -103 -34 17 60 -304 181 -298 -553 -70 -2 -16 199 -470 -167 -169 -446 4 159 260 298 -265
1085 -265 207 320 -137 530 494 -54 12 384 -377 242 -41 -61 32 83 -207 27 -104 284 421 -582 39
1106 39 80 -240 274 235 162 337 26 83 266 47 -7 -70 -567 -170 -278 -480 31 -516 -204 280 -466 167
1128 167 858 387 428 376 106 -251 -42 -129 84 -302 -296 -43 -351 -71 175 -326 -31 307 -102 -284 145 -3
1150 -3 429 376 52 419 78 595 388 75 526 112 -572 -469 -453 -596 -379 -99 -491 -126 -228 406 601
1171 601 195 483 630 234 -36 256 186 427 -214 -146 -89 -554 82 112 -466 189 -236 -487 -197 -62 -10 139
1193 139 120 -245 160 -14 581 394 68 153 -120 -271 -151 295 -390 202 -173 -404 138 -255 342 162 107
1214 107 197 168 -275 215 96 -113 247 -136 -372 -143 -235 149 -101 -24 127 -135 -459 -2 94 -20 182 -392
1236 -392 24 298 -6 5 482 76 -31 -92 -268 195 107 -149 105 -392 -7 88 -151 115 16 -83 -217 -385
1258 -385 -78 306 -13 173 207 12 405 340 264 78 246 23 50 -80 13 -76 -208 -161 -149 -195 -285 -81 -89 -8
1282 -8 71 -74 250 193 156 432 172 -183 145 3 -130 56 -83 240 2 -541 -232 -317 -358 -53 -246 -80
1304 -80 113 -87 176 309 378 489 176 359 484 82 -134 28 -95 -329 134 -512 -384 3 -190 -40 -143
1325 -143 -91 268 49 -40 392 -29 148 154 122 388 289 -78 232 -239 -124 91 -161 -385 -34 -1 -28 -31 -170
1348 -170 -59 213 557 216 -22 -205 139 -23 -165 95 -286 -463 -237 -413 -155 169 129 -134 163 -123
1368 -123 137 49 131 287 -2 -257 208 60 126 276 -105 123 -283 -202 100 -350 -240 -6 -330 -168 -44
1389 -44 -226 131 226 529 -14 126 -159 183 143 201 250 83 137 -174 -341 137 252 -9 -28 -10 -186 -146 134
1412 134 59 -156 -160 -369 -8 -179 -90 154 126 150 27 123 45 2 49 -25 -127 -150 84 -144 14 -202 -226 -158 -343
1437 -343 -84 -94 57 35 272 39 119 325 167 73 297 -252 248 -63 14 -200 -274 -36 -77 -293 -270 -20 -353
1460 -353 -6 340 17 207 150 -34 292 -233 254 -111 162 6 22 -163 -49 -64 -367 -202 -194 -74 12 -114
1482 -114 64 281 6 150 83 133 133 71 -148 166 131 84 26 -139 111 -346 -268 -179 343 -132 72 -248 -18
1505 -18 68 215 95 -23 177 89 -47 -54 46 39 -111 -101 178 -63 -143 -219 -71 -30 -126 -222 -225 62 125 46 -69 268
1531 268 -162 -164 191 -122 133 124 45 -155 -239 -375 121 114 88 -50 325 100 113 -125 86 244 76 -62 19 194
1555 194 -25 230 83 175 50 -127 329 369 34 -30 30 -143 -49 -322 -110 -85 -177 4 117 -122 148 54 46
1578 46 177 -49 -68 -150 194 49 241 88 250 -224 -129 84 -304 -169 150 -87 -161 115 -200 149 179 -54
1600 -54 314 147 -9 384 156 257 23 -32 -96 126 -336 -3 -99 81 -92 -330 -239 139 -223 89 -59 -197
1622 -197 37 101 -292 -8 -145 89 36 -84 71 8 -313 -340 -46 -189 81 278 -110 276 -228 -152 -179 81
1644 81 159 287 61 30 84 95 82 104 -55 -94 88 -347 59 -100 130 -24 -120 3 168 -49 -75 147 -154
1667 -154 66 12 33 -245 18 158 -188 -170 -256 12 -208 1 47 -46 39 41 34 76 48 -87 -75 21 70 227 -387
1692 -387 0 218 192 -31 -278 109 151 89 -222 200 19 158 74 -111 -73 -207 -69 -251 13 -164 82 -16
1714 -16 231 108 -179 -101 -143 -3 -106 -235 -299 52 -51 -326 31 32 -212 -296 -106 368 200 -70 77 -19 461
1737 461 -83 58 79 -138 126 61 13 -104 -28 180 -165 -250 -160 -515 -256 -206 -15 -159 28 81 95 -61 -99
1760 -99 31 142 -168 -221 234 -100 -49 -100 -225 -98 244 107 -3 -168 158 -109 27 -259 237 205 214 228 84
1783 84 79 19 201 -132 54 -216 -167 -90 -253 -238 -52 -156 -39 123 123 38 -46 -130 206 -241 146 32 246 77
1807 77 265 266 -66 -21 -23 -173 -102 -79 -134 -83 -37 182 25 48 108 60 -196 17 88 -14 106 96 -59 97 -118
1832 -118 219 -8 4 262 129 129 -455 111 -106 152 -160 87 218 -22 -69 -55 47 -54 96 12 -92 -223
1854 -223 78 -91 245 -41 43 57 97 -180 -130 -3 139 174 64 -83 -26 -52 -297 177 212 -144 -75 123 -95
1877 -95 76 133 36 -153 1 -349 104 -193 -169 -94 -89 149 115 123 -33 55 127 177 -77 189 -269 260 49 139 -216
1902 -216 21 -191 36 136 -102 47 -201 -37 54 98 -215 128 225 224 -199 -60 186 121 146 113 -86 -234 177
1925 177 45 -185 -191 91 -22 -14 33 164 -102 -45 -205 292 30 -147 -102 -75 -98 112 72 -79 7 142 191 151
1949 151 -119 -176 -56 -40 -66 -5 -77 -304 -106 150 -153 63 199 70 -45 205 270 -29 138 76 57 -271 -241
1972 -241 -84 -140 45 -63 338 124 -187 49 -57 -55 -13 146 140 18 241 345 -7 117 26 -53 -157 15 53
1995 53 46 -156 276 16 -47 -84 1 -106 120 1 -165 79 52 -76 25 -57 237 0 10 -67 -151 412 -73 14
2019 14 -90 11 -15 -135 145 -19 46 -60 257 0 -238 -72 8 -4 -82 -222 182 356 87 264 133 -34
2041 -34 -180 -198 127 -71 -52 -389 8 -30 259 56 -167 -14 -36 -241 -2 380 412 -303 -4 85 210 290 -43
2064 -43 -7 -22 -24 91 209 -87 -49 -138 152 121 -23 -22 168 -198 -145 -153 33 64 -215 -177 -4 47 -145 148 122 -142
2090 -142 0 29 -147 -170 -352 162 -378 225 234 186 196 -78 -59 -148 -152 -457 -181 -29 -48 85 -50 -118 2 164
2114 164 121 88 87 166 52 -150 -80 128 57 41 -59 113 -157 -152 -114 69 -170 188 -115 -151 137 70 162 -90 -235
2139 -235 -243 199 -24 18 -21 -177 -98 358 75 -20 -79 -102 152 -397 -119 -91 -126 23 108 -226 88 139 -169 143
2163 143 -309 -176 162 -92 -226 123 -127 170 199 -143 184 71 -80 -112 -1 40 204 -274 12 -21 5 87
2185 87 205 191 -108 54 -43 74 280 73 -1 -201 -28 79 -87 101 -41 46 -46 145 -150 8 -13 37 -192
2208 -192 -259 83 280 112 62 -6 119 -177 249 111 113 -69 5 -7 -45 84 137 -23 -95 -236 146 -47 92
2231 92 137 98 90 79 346 27 -76 140 42 120 -91 125 83 -95 57 244 53 -12 53 47 -274 200 -31 -353
2255 -353 96 -205 -94 -185 -69 73 128 95 -47 199 86 45 28 1 79 -176 32 -127 -38 -130 -72 153 136 -105
2279 -105 418 38 205 145 -65 304 -116 -193 -168 212 123 30 246 -91 106 -302 -110 74 -190 -193 30 86 -142
2302 -142 241 55 1 110 -53 53 112 -40 33 1 269 -103 240 187 -102 -268 -92 39 115 -46 201 223
2324 223 31 270 -323 -48 46 74 -34 62 -76 31 250 54 3 -202 515 90 -125 -12 -79 -72 -164 -108 -263
2347 -263 -54 61 98 -171 -31 -57 138 -28 1 -48 -30 18 -135 146 -227 18 138 -110 44 69 -12 -76 -73 -351
2371 -351 99 61 92 342 -156 -70 -149 -352 53 106 58 -24 172 2 199 20 5 181 -127 -18 193 35 -105
2394 -105 -73 -40 -48 -143 134 91 -35 31 121 16 -54 -244 96 132 277 -24 -46 150 -235 27 121 315 -167 -258
2418 -258 -273 -112 -42 -419 89 -7 161 -48 -179 -28 -21 -87 -173 -164 195 -106 -46 169 -208 -61 10 112 91 37
2442 37 -247 -32 -188 -183 -88 13 -167 168 -163 6 269 -121 -10 66 67 -246 25 56 -81 -144 99 46 232
2465 232 36 179 -168 -196 101 -38 -74 -168 -71 -77 -116 -248 -56 -170 86 -16 -3 87 78 -305 -92 -271 84 -262
2489 -262 2 -373 -20 -91 -141 22 115 45 300 187 -1 149 -269 233 -45 81 48 -60 -159 87 -82 -182
2511 -182 -175 83 -251 141 -288 -70 -242 15 11 -75 282 89 -67 -73 -5 -131 5 185 -11 -174 111 58 -201
2534 -201 -31 158 18 30 -50 135 141 13 38 -180 32 145 53 -9 8 -8 65 16 98 -8 -67 34 59 63 81 -226
2560 -226 -239 273 254 -163 -61 -35 131 113 67 250 -150 94 28 -307 -184 -237 88 -59 -87 -144 52 251 -73
2583 -73 -53 86 74 59 -353 16 -22 58 -139 198 -21 -117 164 -31 -61 -45 -119 84 -76 -179 53 358 83
2606 83 80 215 228 -151 65 87 178 -258 63 252 -166 120 -69 -178 236 -222 180 239 142 156 -124 70 -71
2629 -71 101 180 16 0 -140 -48 133 -10 30 -50 -57 -123 -47 -138 -139 76 35 -229 -4 -49 34 -19 211 -133 -80 77
2655 77 48 213 74 -67 44 -231 -222 47 184 56 31 7 -5 -15 202 68 123 -168 72 -133 -57 82 161 -134
2679 -134 -119 -84 38 -99 -189 5 84 -83 -66 -26 61 229 -10 -112 268 67 -39 -15 87 -70 -47 -204 7
2702 7 23 409 86 55 -53 24 -168 266 191 20 -36 80 -65 -216 199 -202 87 187 96 -64 24 -180 -10
2725 -10 -53 25 -447 -16 -305 53 -108 109 264 330 46 137 30 -170 -214 -115 -46 21 -97 82 -256 24 -33
2748 -33 -175 118 262 53 -149 -60 353 52 -53 -98 110 -2 151 -120 -91 -86 122 37 -68 75 -247 -116
2770 -116 -23 -58 -195 5 -138 70 -3 88 2 155 -182 -17 -36 118 -4 26 69 -293 -84 14 -188 24 260
2793 260 -242 -22 -228 -3 175 -130 -24 179 12 -126 -389 216 -129 -197 -79 40 -95 13 -170 110
2813 110 273 105 274 84 169 199 -79 -44 62 4 81 -40 46 269 -143 -249 51 -112 264 348 0 29 -114
2836 -114 88 -22 57 142 -125 3 -137 -183 -225 -88 269 -80 -10 -53 3 -14 43 -326 -69 23 110 317 13 46
2860 46 209 -107 -272 -174 -102 -242 -107 -17 -20 54 287 -174 -16 -66 -104 -101 34 54 95 92 -134 37 -47 100 6 43
2886 43 -221 113 -72 210 98 186 -32 17 -79 -96 17 76 188 136 18 66 36 10 -132 -72 214 102 116 55
2910 55 -261 224 -104 -33 -96 -26 -92 121 161 -249 -194 113 -80 -28 283 177 -82 -88 19 101 140 -55 1 -318
2934 -318 -88 25 75 -217 124 125 0 73 -127 -5 -205 -322 53 -49 90 121 27 -73 129 52 -55 127
2956 127 56 -33 -4 -228 133 -4 270 173 -10 31 -203 268 -159 -176 -195 65 77 -136 -89 -304 -16 -261 30
2979 30 247 -128 -21 -60 74 124 141 254 0 -56 -28 -89 58 -66 -42 -37 384 160 -74 133 265 -19 -23 133
3003 133 184 20 -190 -108 13 146 34 74 -52 -180 -19 52 32 65 -10 175 67 -47 -109 204 64 -50 -166
3026 -166 59 -166 -82 157 100 -210 -92 21 -14 -99 106 -64 -164 -113 46 -235 -14 -145 -265 -210 -125 87
3048 87 180 -46 21 -91 4 206 118 292 39 171 -41 -273 82 237 -211 -107 -245 5 -49 76 183 -217
3070 -217 -106 143 -28 29 -197 -16 210 -70 -61 328 54 69 125 106 53 104 11 108 97 -72 -51 208 -179 -298
3094 -298 -94 158 -95 352 45 -79 25 123 35 1 25 -213 -119 -4 61 139 -20 -244 37 -176 -139 125 112
3117 112 -48 -81 -72 -188 71 -42 85 -37 -75 -9 -54 -16 -147 33 -15 -114 83 29 49 -102 -89 -42 -16 -30 161
3142 161 180 -144 -183 34 32 -278 -73 -94 -160 88 66 -41 -103 75 187 69 115 268 1 101 -66 -14 -28 34
3166 34 34 48 -34 134 130 11 -193 57 -65 -107 146 -190 -79 -3 -36 -181 252 219 -27 -19 56 -150 210 149 -16
3191 -16 -44 -84 -113 -429 5 -19 185 101 -140 -241 10 -106 102 -57 -86 -107 -118 76 173 231 3 -147 75 72
3215 72 101 95 -262 203 -91 -266 -104 86 -124 111 -142 -97 11 7 75 42 247 113 -117 -13 60 11 -15 -79
3239 -79 44 227 -149 45 58 -64 -153 263 -62 188 79 230 156 -177 -135 -94 -166 -167 39 -72 237 -11 10
3262 10 -109 -231 -69 -119 -11 -18 -110 -90 -89 23 -189 -107 -15 -31 80 236 -114 39 143 -142 45 -200 0 -57
3286 -57 296 175 51 -31 27 -130 -168 -158 103 42 202 -38 35 108 118 320 -50 32 -158 24 -392 -173 -371
3309 -371 -78 -17 144 14 240 -41 152 114 -132 -11 142 1 -201 295 62 -188 -141 117 140 -13 250
3330 250 96 33 50 -129 167 311 -30 -195 75 -50 192 -36 45 61 -280 -50 187 100 -165 25 -164 -221
3352 -221 -216 -121 83 1 -14 212 43 -135 100 -55 80 -98 281 298 -138 89 226 184 38 142 -127 32
3374 32 67 211 -173 -66 -90 -81 -202 74 106 -292 -104 190 -135 -209 -215 106 191 198 174 -33 -184 -173 61 -218 -187
3399 -187 34 22 232 -17 38 34 -4 40 -73 -175 2 -21 30 35 137 141 208 68 138 8 -28 316 -66 -85 18
3424 18 155 -4 -230 -298 -8 -21 -99 -128 186 47 23 -34 -202 -16 -100 41 -172 44 184 -40 -157 -62 79
3447 79 34 -8 149 57 -7 268 31 88 -5 41 100 -125 142 355 82 -16 23 -207 -110 124 -66 41 155 -99
3471 -99 -176 -56 1 -8 87 22 32 100 -200 134 -53 -221 -24 -76 94 -233 14 -81 -61 -31 124 -43 -214 141
3495 141 14 -52 105 68 -90 272 184 -65 69 -330 41 287 -378 72 -112 -99 14 -186 -49 -245 -275 185
3517 185 130 -57 78 -79 116 416 -224 -92 109 -123 131 35 -74 91 -61 -48 -109 109 135 -189 263 -233
3539 -233 0 -92 9 -340 -58 -41 -14 27 0 41 -58 205 -217 -38 71 23 141 114 -23 -84 -183 33 -228 174
3563 174 5 64 -15 -99 136 49 125 -271 -1 122 -212 -61 -251 -136 -73 -145 215 -3 175 9 134 233 172
3586 172 -156 -68 -109 20 6 251 -5 -85 181 125 -34 -22 77 79 -5 -130 -1 -313 142 -91 68 -28 71 -71
3610 -71 37 22 39 -47 -85 89 57 109 -10 -82 96 163 -170 -61 136 -221 -27 52 -170 -33 224 156 61 -146
3634 -146 49 194 -8 127 150 165 115 139 -319 -115 -48 -34 140 26 -246 151 50 -7 44 29 -221 -56 44
3657 44 -158 44 124 143 -178 262 69 -89 -2 -1 70 118 -399 -3 0 -112 -172 116 209 -76 170 -23 316 85
3681 85 -3 -6 -150 118 -84 100 31 -32 31 -114 -240 -35 82 -39 -8 100 -104 -92 114 200 192 114 -72 112
3705 112 223 5 124 -208 -44 -28 -78 -165 -175 -6 -83 -285 102 -1 0 -108 -40 -1 -292 25 81 -19 34 165
3729 165 -121 -69 6 -156 -29 62 -74 136 180 -403 -29 -83 74 81 46 30 21 76 -16 -29 96 144 109 -24 -342
3754 -342 80 -213 -2 -27 -36 -19 -133 -110 43 -182 -11 -115 -40 -161 -145 4 208 -149 -122 -90 -107 -64 42 0
3778 0 -16 47 66 74 -108 18 52 -84 86 -113 -78 203 -31 -48 -30 302 -137 -103 299 -96 -39 -22 -4 -117 -236
3803 -236 313 247 -359 141 -376 14 224 -190 -30 -198 71 -60 64 -287 -108 17 -73 -287 181 -211 71
3824 71 54 165 35 -83 99 -29 -222 -100 247 72 -57 29 -118 -328 389 138 -232 65 -116 -111 305 166
3846 166 -318 61 -58 -183 -127 -40 -95 -70 164 -68 25 -81 -56 105 149 -7 78 -34 -264 -191 -42 265 131
3869 131 -243 199 -25 136 208 109 -19 -316 282 53 -71 -3 -333 -10 59 -220 77 -37 68 318 -219
3890 -219 18 39 150 -99 -36 261 -354 210 -181 -185 -263 353 -350 -288 10 167 191 102 164 42 87 -4 9 -126
3914 -126 43 407 7 67 -35 181 -153 -231 -275 -119 -112 212 9 180 147 130 151 -157 74 -202 -358 -164 -2
3937 -2 -87 -95 160 -47 -52 -181 245 -85 58 46 -354 184 59 171 341 128 -101 62 -83 -13 29 -210 -194 -256
3961 -256 -56 -125 -75 120 219 -90 -153 188 113 -57 -167 -66 289 22 45 -55 -22 39 63 -98 44 63 226
3984 226 -55 105 76 173 -109 -37 216 225 -38 154 223 -161 -47 193 5 -101 -153 63 -185 -129 173 162 18
4007 18 -123 58 146 100 -103 52 126 115 -100 -291 5 -151 -133 -202 164 -141 -159 -77 114 -127 55 122 146 50
4031 50 -22 -37 55 14 -51 132 207 -115 -146 -89 -111 -162 91 -103 -111 121 180 57 174 261 26 149 -99 -179 -66
4056 -66 36 -38 -5 -21 68 65 -14 45 237 2 -104 -230 172 101 -50 -6 -191 -39 -92 34 36 -28 -39 271 133
4081 133 -49 -121 255 52 60 99 -37 204 10 -93 -291 96 137 35 -204 -56 81 105 105 33 -96 -6 -197
4104 -197 140 128 21 -35 35 15 169 40 206 -167 39 -183 104 129 -472 -145 78 323 -194 -167 355 -244
4126 -244 72 226 160 88 113 -56 -99 1 -113 -34 -97 -164 20 141 -30 287 135 -263 -180 154 -35 8 -105
4149 -105 -70 208 114 -42 216 -89 -75 -134 -214 10 38 -247 357 -83 -124 -198 -67 -175 174 -43 31 85 36 -237
4173 -237 -106 140 -6 -27 -65 310 94 74 -115 -146 -80 -72 48 91 139 -82 -1 173 -168 128 -220 77 -152
4196 -152 -232 130 46 169 288 -96 136 -7 47 -83 101 312 -185 38 286 36 62 275 -140 175 -131
4217 -131 82 -31 -134 63 -125 48 -88 -4 -10 -321 -277 -236 158 -124 -187 -3 84 -265 -94 56 7 -3 -119
4240 -119 49 95 -103 -114 57 37 120 73 -9 -51 -38 -46 143 -42 -31 -130 -163 8 -202 -31 122 -24 -22 -45 -72 -26
4266 -26 -178 -197 8 -135 52 150 124 -165 41 178 42 -141 -162 32 -125 -120 -44 252 144 -183 -5 202 21
4289 21 177 -86 -245 -86 -26 -10 130 -35 110 -175 88 45 15 158 -179 256 293 57 97 -271 15 129
4311 129 -52 49 -155 -312 102 -167 63 275 207 147 17 70 26 102 86 -387 -22 -198 -75 6 -367 -125
4333 -125 14 69 -228 96 -318 30 -50 46 -127 -56 -301 225 -139 -90 68 163 70 -32 -2 -49 -81 -240 230
4356 230 34 -57 -92 3 -37 -191 -90 -219 148 -41 -91 -15 233 179 170 258 -263 82 20 -23 172 67 -3 23 -57
4381 -57 -53 -240 13 45 129 267 73 162 -76 -128 -219 -23 20 -122 -63 -102 -62 250 -124 -230 170 -36 -63 -2 57
4406 57 -181 -98 -4 -109 79 -233 54 141 330 77 192 -9 4 -62 41 151 289 314 -132 -47 140 -209 23
4429 23 -60 179 -12 300 16 12 -125 166 -37 -8 58 8 -377 198 -61 -244 -101 532 192 5 65 -100 -110
4452 -110 31 68 -328 -223 -229 -13 -203 63 -214 195 108 -4 -19 -232 -15 -18 132 373 244 146 87 -121 77
4475 77 -245 24 95 15 -7 153 127 104 303 -210 -179 -82 -179 30 -149 92 166 36 -18 1 -151 -128 6 305
4499 305 165 284 -52 -87 106 -187 -98 113 -98 13 52 -174 164 -130 179 -91 231 64 118 -73 -350
4520 -350 57 -232 -15 -208 57 229 175 -72 -64 36 -148 -86 -146 -135 13 -150 6 207 -313 98 168 -71
4542 -71 135 -162 -93 264 -177 -373 -100 -125 66 212 -115 154 26 -63 -76 -248 -178 275 -80 48 -66 76
4564 76 -213 26 281 -25 -83 155 53 40 97 231 -82 22 201 10 -196 65 -5 -53 177 -174 6 241
4586 241 -36 -420 179 138 122 -4 -147 254 169 28 -152 -213 -107 -129 -75 -220 77 -139 -5 203 -142 -43
4608 -43 117 2 8 26 168 69 34 -86 -389 232 -247 59 187 268 176 276 -145 -124 -231 -56 2 -66 63 -149
4632 -149 13 49 96 0 -30 -135 219 53 -318 44 17 108 70 142 33 -199 -27 29 -148 76 -145 -199 136
4655 136 -115 -104 157 74 9 -78 -127 37 -110 -94 -6 269 150 -191 130 -21 -28 -138 -103 -95 -284 21 -473 -110
4679 -110 -14 -4 -164 167 103 -55 208 261 273 -291 59 -11 248 -69 11 -26 84 -155 -101 -48 -137 -166 -73 2 -21
4704 -21 -32 57 -313 62 -209 129 199 -434 -2 28 -102 155 -181 150 17 167 267 32 164 0 -144 128
4726 128 -20 207 -140 -204 22 35 -79 247 230 -124 57 -71 -146 -190 130 44 -209 -121 52 148 135 11 -19
4749 -19 -53 175 111 -226 -54 213 -52 -6 23 -67 42 197 191 147 128 46 229 64 -40 137 -121 -172 -159 255
4773 255 -242 -132 -56 -92 -80 167 154 28 66 -193 50 -295 90 -241 133 -14 -47 64 -4 119 -227 17
4795 17 17 -231 -180 168 130 27 -91 -100 41 -228 -85 287 -283 192 -101 -157 -79 44 167 24 40 -51 -254 -58
4819 -58 139 79 -64 -60 165 42 31 -94 -113 -1 206 132 -26 -120 82 -286 59 -38 47 117 184 119 -41 56 -16
4844 -16 79 176 8 216 107 139 -13 -127 -223 19 227 -214 24 325 145 214 54 -21 53 37 124 -30 234
4867 234 -25 201 214 118 -117 -252 -216 -244 -70 -225 -23 83 44 220 -82 -67 -113 8 137 -190 6 -109
4889 -109 -308 106 122 -294 -201 136 98 144 -31 71 -18 -36 311 -63 -240 -3 -156 -194 -60 100 66 -94 159
4912 159 -82 -92 168 -177 163 -208 193 -112 182 -117 138 -266 209 -9 292 218 279 115 74 -20 57 95
4934 95 -66 76 53 31 191 218 -155 13 -53 15 170 -53 43 -60 30 -142 -101 -207 -287 60 -95 112 204 20
4958 20 135 110 -176 -315 30 194 25 -15 87 -98 1 388 -274 58 -108 49 -8 246 -110 33 -284 6
4980 6 44 103 63 -71 78 -112 -52 -196 299 34 -13 127 -127 117 -88 -27 97 -180 19 -124 -233 161 53
5003 53 43 -248 7 187 5 -59 -71 242 -37 -84 -121 -23 -173 -47 -131 -405 110 71 305 -115 223 173 -175
5026 -175 -5 -171 -134 -24 -35 84 -245 43 -27 -35 -113 173 -69 -139 182 88 195 -87 63 81 -81 -208 204
5049 204 -94 115 -202 -98 -58 -49 -93 -37 -52 74 276 -114 -56 35 11 173 -48 147 24 -78 -25 44 128 64
5073 64 401 -372 -36 224 72 -166 -354 -216 -241 29 109 83 -11 -114 -19 37 -144 28 -40 43 201 65 -6
5096 -6 48 -145 77 -4 -355 9 -53 -102 52 219 170 -152 154 15 -99 -100 -133 -19 -30 131 -24 -86 17 -123
5120 -123 -178 44 232 -134 -188 -150 -24 6 -56 -180 135 156 -73 216 -7 -71 -252 0 269 -122 -147 459 -145
5143 -145 13 -273 -247 -183 463 -81 -64 188 32 23 -84 -57 43 -40 -65 70 -327 171 -202 -166 -7 -36 -2 -307
5167 -307 -130 49 93 -116 157 -75 -139 -34 33 152 174 -93 -11 96 -13 -284 13 222 -56 12 -109 -100 77
5190 77 90 124 55 84 -55 213 92 -95 -182 153 153 -159 -133 -124 -248 107 2 141 163 216 24 63 -41 160 -76
5215 -76 -59 54 63 -71 24 41 -30 69 92 -94 110 -6 42 -43 -49 -207 -94 122 270 125 -5 76 34 181 0
5240 0 -58 64 239 -231 -34 207 -200 -89 162 37 211 -257 -26 -174 32 220 148 52 256 164 -7 -211
5262 -211 27 132 -221 -91 -9 -5 -72 12 45 -232 95 326 18 14 198 -49 -226 62 52 124 -148 -135 -267 -35
5286 -35 258 -37 -112 2 194 -262 -134 -52 26 -174 -48 -210 144 -42 -61 -139 -144 166 140 132 -58 -63 0 80 50
5311 50 -108 -52 9 40 164 105 116 -69 4 92 -318 -87 -33 167 -56 -32 208 124 -229 213 283 188 71 40 -43
5336 -43 125 -138 198 -90 -154 -56 4 225 -287 128 -79 41 -44 163 -88 -137 148 -111 166 199 -98 59
5358 59 204 -26 168 -85 51 -140 38 -195 6 -54 -172 83 -146 31 221 -1 -69 -54 -222 -14 -33 -75
5380 -75 -76 -108 -155 22 107 -175 129 176 106 -166 110 131 -209 106 0 188 -76 3 195 113 191 212 17 36 80
5405 80 1 176 203 26 114 349 -293 31 95 45 -120 -1 -1 -58 78 79 -22 215 -195 -20 64 43 20 -58 75
5430 75 -147 158 -113 -4 55 76 -302 -34 -146 6 252 53 157 72 -26 -36 221 -37 -147 108 196 31
5452 31 50 -90 -239 -95 -62 60 -171 28 -115 195 -8 75 69 -141 -149 164 -88 293 33 -178 -44 -4 30
5475 30 -3 113 -106 -111 -202 -76 -21 277 150 -44 5 76 82 294 262 -115 -157 -62 -195 -72 -131 36 -119 -75 15
5500 15 -59 -209 29 335 -81 181 395 120 -119 -193 76 -44 2 -162 -48 65 -178 22 47 -31 -100 119
5522 119 -273 47 187 365 96 104 217 -153 -121 -178 53 -4 -91 -528 97 -51 -87 -10 48 33 105 359 -11 9
5546 9 -101 34 97 46 -18 54 220 -273 -11 -97 -65 -60 83 -3 -46 -174 -20 61 180 38 34 -22 -162 -198 -51 57
5572 57 -51 18 66 -88 -61 -99 -54 -119 219 112 66 20 266 23 -98 73 -7 -189 -87 -37 -164 -59 79 -126
5596 -126 -112 -144 224 258 -57 147 -114 -6 81 247 -169 64 -5 -66 1 198 -251 -3 -239 100 112 65 -17
5619 -17 -4 208 -56 -246 -158 -94 52 106 -50 126 -15 -39 -224 222 198 -80 24 -127 285 149 -216 87
5641 87 249 -87 130 -69 39 -43 48 -18 -8 114 -285 127 184 -394 45 -96 25 242 -193 -74 12 168
5663 168 59 -153 -306 -161 -82 278 -398 -213 -13 -106 -61 -123 -74 186 54 268 -128 94 -125 85 -268 29
5685 29 -31 -24 -8 -40 231 -20 -215 -72 79 -66 98 -77 242 277 83 -81 14 106 -148 -289 -7 71 192
5708 192 74 103 -240 -149 10 -166 -109 98 43 78 -102 21 64 -50 16 59 -66 -129 -185 -194 -58 70 -78 138
5732 138 -2 160 -41 316 -132 -7 -224 -52 101 9 -322 -31 261 -77 -165 -66 -107 100 50 50 116 26 -19
5755 -19 -12 -162 60 92 165 -95 -48 64 -29 -360 -46 4 -25 -103 -95 98 -45 -6 -36 48 -260 94 -300 35 73
5780 73 249 116 16 -253 -17 -101 41 -132 -70 331 -246 162 109 -310 198 234 -104 77 -150 -50 138 -339
5802 -339 226 -169 -138 -146 7 10 -236 -25 -185 145 253 -176 -122 -119 -137 -47 -32 237 -135 19 104 251 95 -73
5826 -73 -106 -134 -105 -185 8 -24 -206 -24 13 13 15 41 54 -28 169 -96 149 -21 16 -122 363 -125 -326 17 -39
5851 -39 -54 56 -169 -185 -195 -158 -8 293 195 -168 -76 -35 -134 -32 93 -197 35 -214 -112 -82 92 169 -71 20
5875 20 52 -213 -56 -140 -26 75 187 -291 -59 358 -101 35 -291 -301 -230 42 -110 237 -41 232 144 -185
5897 -185 161 -169 125 -223 -235 86 19 131 78 -129 -245 -102 -107 -128 -371 -96 -53 -118 -92 96 216 -6 87
5920 87 180 -145 -96 -145 -78 -86 16 -100 -182 85 -30 -173 -90 67 125 -166 62 -158 63 -152 -243 257 -324 -20
5944 -20 32 -185 -178 -34 -171 -41 3 -50 83 -296 -10 75 153 207 86 -95 -74 171 -12 19 20 -9 138 -219 -16
5969 -16 86 95 -167 -37 133 212 -171 -95 105 -29 277 2 -6 21 -18 -92 93 100 -67 -5 144 -74 -223 -42
5993 -42 22 -79 27 -73 92 -36 -150 -22 -70 -463 -243 -47 67 89 -66 -16 -12 -81 147 -67 -180 193 -173
6016 -173 119 128 104 8 193 -143 -25 -1 -52 -24 43 -5 4 164 14 60 48 -150 109 -230 -233 47 -84 -131 -329
6041 -329 117 -23 -173 70 -224 294 -176 -310 -14 204 -172 -119 243 30 -302 -40 158 64 -224 -132 83
6062 83 -147 -127 179 255 -169 -21 -69 143 -174 154 -107 12 -99 70 10 269 105 137 238 -53 133 -235
6084 -235 20 -25 -47 57 2 -29 213 188 -60 220 173 -222 -71 276 -77 -146 -37 -21 -157 76 -65 -82 -186
6107 -186 -7 -71 -85 -195 73 -104 -206 -191 193 90 -13 -15 -20 229 -30 -115 163 -103 184 -35 -204 -102 -143
6130 -143 -18 97 -370 -164 202 -129 -50 38 -19 -50 110 -115 147 35 233 143 -2 347 75 -72 27 -131
6152 -131 -59 -281 11 309 119 200 -231 96 -84 -35 33 264 4 -358 -36 136 -163 -67 117 -87 -22 92
6174 92 -99 37 -147 67 73 -145 -2 -111 -109 -302 66 -65 1 93 -5 170 -168 79 -209 -121 61 -1 94 113
6198 113 129 -56 179 99 29 2 -503 213 118 115 144 -179 -134 73 6 -209 -73 344 30 -82 -144 24 11 8 229
6223 229 -8 128 -32 -185 -145 133 195 88 98 -160 -62 37 -23 181 188 15 -58 103 19 40 -95 -114 -57 -92 -120
6248 -120 180 126 82 -338 73 28 157 -109 -130 -78 104 -4 194 -143 124 -122 -77 285 41 127 -46 -136 -252
6271 -252 -114 -315 211 -2 -136 189 67 -152 -142 206 114 25 6 -160 -131 -73 74 -248 280 -86 206 141
6293 141 -70 1 -90 -186 -68 -41 -274 -94 103 24 -255 -41 -330 125 9 -41 248 157 -108 -122 -64 -145 7
6316 7 117 -125 -239 35 -24 -98 -88 -24 -100 -107 -114 156 46 33 192 -16 256 116 -104 48 -331 99 -210 151
6340 151 42 -78 80 89 49 -220 63 -27 10 -64 170 137 120 -227 -18 -216 -46 26 -31 188 -74 -67 -15 173
6364 173 -281 139 -48 -110 -167 -162 -49 121 197 102 -11 370 40 -100 36 -24 -74 63 17 139 -55 232 -2
6387 -2 -50 -178 165 -87 107 60 12 -37 61 58 -157 -70 -169 -73 56 -117 -30 49 -47 224 107 -208 -4 -80 -167 -140
6413 -140 -1 269 -76 66 206 297 33 173 -70 -124 218 -106 94 100 -48 147 31 138 -40 -26 60 -81
6435 -81 56 -118 84 -56 0 216 1 -112 -75 -96 -257 54 -216 155 -130 -41 135 -173 82 -13 -244 -78
6457 -78 0 50 -156 -36 60 -197 -117 -173 -35 -49 -42 122 47 158 -238 147 70 59 -41 113 -59 -62 -50 94 98 -70
6483 -70 -221 159 259 228 26 95 173 -140 28 68 165 128 -178 59 52 -91 -135 120 243 -180 -13 -112 2 62
6507 62 -12 -130 -334 -91 -57 33 66 -12 60 -18 93 8 34 65 -9 -6 186 4 60 32 -33 -44 -51 0 111 9 40
6534 40 216 -38 -95 -296 20 -99 -187 131 128 -54 -178 -146 -261 -64 112 -116 31 -123 114 -109 -8 -178
6556 -178 -334 32 74 92 120 106 -81 -58 -17 299 -107 -73 112 -111 6 -88 13 33 -64 35 -170 -91 -41 86
6580 86 37 -73 -234 -149 -109 -45 -88 -72 -114 174 53 -156 -93 151 48 17 216 -118 51 97 -30 70 40 24
6604 24 -112 -62 42 92 -21 232 167 -16 120 -112 188 51 -151 40 -131 101 136 -17 187 -218 79 60
6626 60 87 110 -51 -45 9 82 4 0 346 99 169 249 119 153 -7 -225 -191 -244 -46 83 2 -63 81 274 -84 -147
6652 -147 -24 178 200 112 165 179 265 91 12 38 207 -251 224 217 -80 -200 121 -189 60 99 -46 61 -325
6675 -325 -250 -346 -293 -19 18 163 189 -4 75 -54 -56 -145 133 258 296 -39 67 161 -27 -6 -177 -192 -109 226 -89
6700 -89 -172 144 -235 -209 -41 -21 8 -75 127 239 35 110 57 -96 -2 -30 60 60 -102 -109 151 -70 -22 -396 -62
6725 -62 -76 -42 -118 -66 -68 56 -130 170 -107 -188 -211 207 -150 207 -125 -53 50 224 -28 8 4 87 -215 65 140
6750 140 -186 233 15 131 5 -48 -240 246 220 144 -14 269 -117 -227 63 -103 234 -74 31 68 27 -305
6772 -305 184 -92 -213 -133 110 -158 -46 22 39 -46 26 208 -195 -66 -23 66 -143 115 -101 -173 162 -55 -21
6795 -21 186 -64 -159 47 58 -7 109 157 133 45 279 45 -299 8 -75 26 -25 320 51 -160 -142 -149 270 73
6819 73 122 87 92 124 109 23 -45 202 70 -64 -171 150 95 64 -4 243 -20 -38 -270 -71 -3 -154 -238 -129 -17
6844 -17 109 -111 -121 -78 -203 -112 44 110 -160 -100 -278 -4 68 100 -36 176 -70 64 233 208 235 178 -179 -40
6868 -40 31 -59 39 129 210 -142 -25 -3 14 -138 14 86 -17 -108 158 -125 134 133 -8 88 140 -237 25 303 -48
6893 -48 -116 168 2 192 145 -43 45 -57 22 -136 276 242 -138 15 -153 13 -221 -58 -45 -169 -128 -37 -138
6916 -138 -41 -89 143 205 -107 78 70 -121 -37 92 26 165 -77 -2 -14 12 -114 202 -41 78 -526 -139 -49 -16
6940 -16 256 23 119 220 -305 36 -105 -27 -60 -96 -69 -23 179 372 152 -95 187 -24 -57 -59 211 -154 -120 84
6964 84 -71 -236 -47 112 -117 172 159 -180 -119 -160 53 -148 -44 258 -40 100 -84 -71 -27 53 -37 -55 104
6987 104 -101 52 -56 221 -51 -17 243 13 94 32 -18 6 14 70 -50 273 41 87 33 -155 -230 231 2 -209
7011 -209 157 53 84 -78 83 -12 -22 -89 -175 -63 -38 -158 138 222 79 -111 76 -152 -1 73 -138 104 103
7034 103 -125 127 -246 -146 -125 165 212 -267 -117 118 -9 -29 -184 166 87 222 111 209 -116 13 -158 -125
7056 -125 217 114 -53 91 85 -38 150 115 -84 -94 -93 191 5 123 -35 -91 -185 127 -122 12 224 55 59
7079 59 -251 44 89 -132 -150 -16 -203 36 59 -18 1 -58 158 71 97 -2 -165 -226 381 -152 309 -11 -181 -48
7103 -48 -52 69 178 178 175 12 -47 -121 137 -1 -2 58 63 70 -173 103 50 219 -326 -50 -249 -109 104 39 -269 29
7129 29 124 -173 -11 -186 -27 -135 -59 219 -107 -270 -76 29 69 167 98 3 -16 -177 -83 -132 -183 136 -143 46
7153 46 111 54 97 -140 -75 183 -7 126 66 -206 -169 -22 -92 57 104 -140 121 -49 -11 81 17 24 -4 -108 -185
7178 -185 42 15 6 361 145 -41 110 -315 65 253 -33 -59 -345 50 27 -30 168 -46 -35 -246 31 -226
7200 -226 -17 -18 -234 88 24 143 120 -83 105 -74 -17 -66 16 156 24 -40 114 59 -5 185 227 -71 -61 -17
7224 -17 26 17 -35 13 -76 -192 -66 33 1 -71 -25 -120 -68 -39 58 131 -81 70 -310 -60 182 -8 80 -52 48 -2
7250 -2 47 -72 42 -210 -24 58 -137 129 174 -66 -196 95 -135 -115 86 -70 -56 -237 9 153 -183 -144 216
7273 216 159 -70 -250 -63 136 -7 9 311 -54 -228 -110 -19 245 122 -140 202 -192 9 65 -72 111
7294 111 21 23 -152 1 -218 -33 -45 -84 151 117 75 162 -68 -123 174 -21 149 0 -199 49 82 91 236 112
7318 112 95 337 -140 198 142 64 100 -275 181 268 157 84 1 43 -93 138 -96 -162 -238 -55 -298 63 109 -188
7342 -188 179 9 -336 16 -152 15 148 -100 -6 186 -45 -164 163 0 -135 24 -91 -53 -120 -48 100
7363 100 16 -93 209 13 351 468 -175 -172 -75 -133 -57 62 -120 202 53 190 -183 -19 -55 -205 -111 101 -118
7386 -118 97 189 130 -67 -96 127 88 -128 -14 23 14 184 49 161 -206 -151 -177 279 84 6 3 112 -235 -193
7410 -193 219 -116 393 82 -84 -210 54 193 -81 228 12 116 105 -149 103 -155 122 47 179 -95 -17
7431 -17 292 164 -98 24 -50 151 145 129 -137 -70 -53 66 133 -67 33 -39 -9 -189 50 37 -6 -40 108 -174
7455 -174 146 -91 -21 80 29 -40 -78 56 199 113 38 -52 -74 13 100 -225 -136 -186 -37 67 237 -40 40 48 -93
7480 -93 -92 -174 -39 -131 -44 -225 273 28 -148 -128 -2 165 219 -112 220 -187 76 41 -56 -51 10 -72 148 -20 -92
7505 -92 -156 -64 72 157 177 -159 113 58 85 -48 -27 133 59 -15 43 338 198 118 -59 63 -228 43 -55 193
7529 193 41 318 -50 80 144 217 131 -271 -58 -21 -188 188 -58 155 120 -41 126 15 279 17 -62 2
7551 2 121 -30 -10 -12 47 -47 152 -103 -50 40 -72 -113 40 11 -6 124 208 97 170 32 270 128 -77 148 -194
7576 -194 326 -37 122 106 -88 85 122 223 168 155 -30 219 10 9 279 -150 65 -79 -34 -209 218 -54
7598 -54 -9 -107 -265 -251 -134 226 165 29 -52 -99 -161 22 239 -141 -159 -22 -322 106 -238 59 178 30 -267
7621 -267 -34 -87 171 102 115 201 -75 -139 -115 3 -39 105 179 -69 -40 -123 -69 4 51 -20 -378 187 105 -20 -134
7646 -134 11 158 20 13 75 5 17 287 91 170 52 -229 -133 100 -65 -107 -143 17 32 105 -25 62 306 -65
7670 -65 114 -151 171 -21 154 35 -215 -29 -246 -168 -227 180 -73 -66 -105 326 312 124 -19 -102 13 29 -408
7693 -408 172 -39 -51 164 12 91 -177 -192 -157 33 -198 102 133 11 158 -136 -248 129 1 111 -221 69
7715 69 242 -6 -73 -6 -242 30 97 125 -247 -260 -274 -47 55 197 -98 50 -189 -264 304 199 7 -2 55 161
7739 161 -116 -19 182 192 -23 -118 -20 -7 36 116 -83 -62 -339 -24 -142 12 240 -21 -206 16 -105 58 100
7762 100 -29 40 -47 -53 242 -265 -148 -87 -11 13 -116 153 81 -47 53 -192 129 287 -296 37 -131 82 -9
7785 -9 -221 -102 -248 -21 -250 -75 21 72 120 -63 156 254 43 -81 -179 66 258 -23 124 -305 248 88
7807 88 -18 -17 151 -208 -198 8 43 -316 -113 71 115 202 -161 12 86 51 0 137 234 -285 267 120 -355 -130
7831 -130 -386 184 -165 -91 31 -217 131 -80 64 172 236 214 57 186 -63 -67 -144 -34 -11 63 226 -89 238
7854 238 -54 24 -430 -157 31 -123 41 -70 5 69 199 229 -74 113 -311 -275 113 -103 -226 -183 180 -27
7876 -27 297 -109 100 184 -34 144 39 20 72 -59 66 18 11 -101 -19 -121 46 -99 -98 159 76 -91 -121 17
7900 17 -137 -94 -131 -185 -79 -137 -206 -113 194 0 -85 -110 127 115 114 -111 69 -148 67 -120 149 468 -136 -280
7924 -280 18 -318 46 -53 -70 -34 -86 154 -123 28 -350 -28 -7 -95 -12 283 171 222 -129 200 10 -163 -174
7947 -174 -103 -45 4 46 -12 57 -74 148 49 -127 -247 192 123 65 -38 -201 -258 3 277 -23 19 84 -43 -91
7971 -91 -134 124 235 89 -115 -95 203 -222 -88 65 44 100 -191 38 86 17 -9 140 -313 50 180 257 -173
7994 -173 -170 10 10 -18 -118 91 -299 275 -7 194 87 95 26 -171 -9 85 -124 22 293 12 97 -115 -1
8017 -1 27 -239 -213 225 -37 -68 -279 -48 -17 -271 -15 138 140 -12 23 218 77 -85 -115 -25 -22 274 3 67 123
8042 123 33 127 81 -108 43 -20 32 357 -28 -98 -72 -3 -231 71 -49 -64 152 178 72 60 5 32 -95 204
8066 204 -120 32 173 -173 -165 91 66 65 77 -162 -96 291 -50 74 27 -120 -80 275 44 205 -2 -247 163
8089 163 -40 19 159 -97 214 82 -58 -221 216 56 29 79 86 -53 -81 -170 39 -55 -102 66 136 25 170
8112 170 -193 -1 -16 -187 -66 -314 150 -149 74 226 -76 -4 -29 6 -39 -11 324 10 -106 -29 -127 97 -100
8135 -100 -284 -120 -69 -173 -101 -110 134 -143 -202 -130 29 -110 -50 91 -35 -28 189 -144 -53 -128 -51 135 -77 21
8159 21 36 -70 128 -106 235 -170 -191 255 208 4 33 34 -167 -124 -112 -35 15 15 235 85 -233 -168 -207 171 -57
8184 -57 199 -116 -9 3 15 22 -217
8191b17
$$ Imaginary data points
##PAGE= N=2
##DATA TABLE= (X++(I..I)), XYDATA
0 0 0 0 0 0 0 0 0 0 0 0 8 -8 8 -8 16 -16 24 -24 32 -40 48 -56 64 -76 88 -104 120 -138 160 -184 209 -240
32 -240 273 -310 350 -391 439 -495 552 -616 686 -763 845 -936 1034 -1144 1263 -1392 1533
49 1533 -1690 1860 -2050 2260 -2495 2756 -3051 3388 -3774 4224 -4752 5387 -6165 7150 -8430
64 -8430 10181 -12724 16775 -24249 42649 -189874 -143245 191070 -111150 -178178 64513 120377
76 120377 -72241 -8957 142512 109551 -10897 31983 86624 43391 -49507 -27950 63550
87 63550 29723 -108521 -49188 45007 -74961 -127257 42273 48411 -101490 -54475 89797
98 89797 30297 -51152 60658 128774 -130 -51155 52829 74683 -24739 -60938 3229 16191
110 16191 -85272 -100810 18041 20967 -75801 -15959 89379 19699 -49789 58457 129105
121 129105 23296 -25858 51269 26587 -65264 -27288 32520 -26262 -81111 -34536 11612 -29854
133 -29854 -55302 16955 50300 -16516 -30429 34773 44451 -1602 10522 64337 39829 -27085
145 -27085 -4672 39919 1094 -33026 -6068 -1980 -47463 -61567 -6338 20915 -26170 -24782
157 -24782 34968 20904 -23712 13967 57927 22038 -16471 13053 25196 -28024 -31636 23387
169 23387 11727 -32636 -18000 5931 -5778 -14647 9286 34840 8738 -23544 2191 24202
181 24202 -396 -10992 10642 12019 -20999 -28065 7773 6520 -23941 -3511 16105 -14978 -23850
194 -23850 6185 19015 8188 3200 18274 18001 -6325 -617 25309 15125 -11512 -16822 -7512
207 -7512 -12753 -29384 -9772 14443 -11538 -22745 11108 13190 -7197 8897 31081 14090 -11991
220 -11991 -2583 12621 -4534 -9890 9688 2537 -16188 -13153 -6671 331 2617 -1340 2333 97
234 97 -9061 79 14063 11812 5182 5725 10146 -155 -11190 6266 12338 -11379 -16190 -6194 -14503
249 -14503 -19632 -6006 8068 4246 -7165 3072 15569 6959 10289 23523 15260 -857 -6489
262 -6489 -2216 -718 -9754 -7756 -439 -11507 -17187 -5524 -1347 175 5584 5578 1438 -4660 -1522
277 -1522 9154 7576 3506 8454 4041 -2771 -2157 2397 9140 2934 -10788 -7807 -5028 -11483 -8244
292 -8244 320 3082 -1414 -4471 3989 8277 3273 10843 14666 1000 -4444 -2235 -4422 -4894 -3197
307 -3197 -193 -3485 -11278 -5067 4581 2237 5671 9085 1512 -2750 -1432 1506 4133 -1144 -1877
322 -1877 918 -4616 -5637 942 3489 5267 1196 -4525 -850 -1579 -4835 1027 3479 257 -2336
337 -2336 -3891 359 4369 4014 6661 2808 -4671 -1613 -285 -3748 -1065 983 -1550 -4883 -5734 2137
353 2137 5478 1344 4977 5529 -2124 -2449 704 625 582 -2138 -2655 -2562 -6017 -697 3880 1983 2733 1565
371 1565 -2057 598 1212 510 3263 543 -2642 -2230 -3597 791 3398 980 1022 -1272 -3817 886
387 886 383 -1713 2590 1325 -2878 -3224 -860 3955 3501 -38 3069 1176 -3946 -767 1333 62
403 62 600 -1872 -3638 -2800 -1677 2975 3708 127 1397 -37 -2751 631 2105 687 971 -1409 -2480
420 -2480 -1249 -616 2802 3573 270 344 -778 -2109 1351 902 -836 761 -2518 -4712 -1721 386
436 386 3139 894 -961 2130 -47 -2206 2734 2992 916 1380 -1543 -2696 -11 1446 2349 600
452 600 -1657 -249 -2815 -4373 998 970 -2274 -2072 -2786 -1478 804 1703 4266 3725 1543 2816 1072
469 1072 -118 2842 1127 -1516 -1082 -4328 -5707 -2073 -439 111 -1286 -1566 834 -871 459 5235
485 5235 3139 555 2250 -517 -679 2856 1670 393 -371 -903 -1434 -4091 -2143 1734 -1169 -2580
501 -2580 -1059 -2690 -1183 2483 2454 3325 2928 1090 1510 1095 2201 2961 -1185 -2858 -1656 -4043 -3627
518 -3627 -871 -1704 -870 -474 -1380 -60 893 2422 4739 2100 1549 1229 -999 1328 2678 -454 -791
535 -791 -1176 -2952 -1877 -1989 -1371 790 -1519 -2332 -851 -576 1261 1444 1014 3218 1453 -354 1599
552 1599 1293 1160 2675 -1010 -2711 -642 -1892 -1436 -277 -447 -576 -1565 -1192 1188 760 1128 1874 -603
570 -603 -233 1008 -1829 -323 2451 -146 -986 -529 -564 431 90 1493 1693 -1678 -933 996 76 807
588 807 1151 -911 -185 -912 -1575 20 -180 -29 301 -2056 -1159 1348 -65 708 1679 1181 704 -505
606 -505 -26 1775 346 20 -106 -2794 -1557 -25 -1760 -559 1019 -1184 -1278 411 1285 2002 1031
623 1031 2338 2191 -874 553 1603 -692 366 465 -2709 -2193 -1294 -1914 -951 -427 10 -980 -1747 1862
641 1862 1953 329 2778 3250 89 1242 1664 317 888 362 -1505 -2800 -2669 -1611 -2305 -2472 -146
658 -146 -508 -1755 671 1472 1871 3619 2265 1584 1974 524 665 717 -376 -253 -1472 -2464 -1526 -1483 -1635
677 -1635 -587 -1400 -810 -442 -966 1056 2175 708 2177 2113 427 1325 1858 1167 1021 -570 -1493 -1879
695 -1879 -1936 -1480 -1586 -2520 -572 -893 -1818 913 1646 1588 2340 1497 1553 1676 481 409 564 -408 -435 -1602
715 -1602 -2035 -479 -535 -927 -185 -873 -454 -204 -418 568 941 -9 494 737 488 1275 976 634 992 -113
735 -113 -452 -191 -1083 -177 -662 -1737 -301 -1212 -1589 610 814 477 765 524 920 857 -125 620 418 -687
755 -687 -25 -770 -987 647 230 -587 -33 63 152 -43 -397 1048 69 -1345 -100 -407 -875 760 -134
774 -134 -359 699 390 151 738 728 762 -164 -898 433 -478 -1023 678 -516 -954 225 -215 -428 516
793 516 191 281 3 -333 260 -227 319 1727 -86 -257 729 237 491 198 -532 168 -857 -1442 -607 -699
813 -699 -613 66 -852 -368 991 -65 319 1176 1177 1205 354 49 900 417 -137 387 -950 -411 -234 -1222 -740
834 -740 5 -587 -690 -495 -415 780 108 696 1083 169 520 787 289 321 626 -662 -138 -1028 -951 42 -659
855 -659 -805 -183 -814 -388 572 -95 429 793 639 552 156 502 867 203 3 363 -757 -429 90 -921
875 -921 -230 -99 -1107 -575 -797 -147 507 -105 93 1103 11 326 1128 -90 495 401 -379 -149 -222 -551
895 -551 -299 -781 -290 -178 -599 -416 553 -324 272 355 -156 217 137 -13 379 256 73 378 -133 64 578
916 578 -276 151 -233 -673 -287 -347 -506 -86 -529 -457 252 -34 57 786 252 378 348 -360 671 171 -118
937 -118 522 -288 37 347 -146 113 370 -470 -121 -231 -840 -152 -28 -148 94 -467 162 469 320 769
957 769 753 204 570 124 -545 411 -65 -564 -229 -810 -299 2 -590 75 453 -65 40 20 -158 662 333
978 333 85 469 235 110 627 -169 618 382 -830 -469 -207 -536 -414 -484 -178 -410 -536 8 432 92
998 92 700 709 54 584 521 -39 333 33 -524 -567 -603 -289 -236 -645 155 41 -688 260 105 -168 454 418 -198
1021 -198 418 -78 435 152 97 608 87 -866 -22 52 -680 15 -229 -820 -167 -660 -327 202 254 600 -18
1042 -18 -23 735 355 124 716 141 -276 146 -353 -1 -98 -280 94 -251 -569 -152 -160 -39 255 8 63 100 116
1065 116 265 658 179 441 177 -338 163 -9 -172 33 -100 -263 72 -524 -285 114 207 459 -167 8
1085 8 211 -63 -403 306 -67 -68 40 -251 378 905 361 73 -87 102 -117 54 -4 -8 -489 -412 -105 -578 331
1108 331 183 -200 441 405 -137 476 141 -126 209 98 -300 100 -133 260 65 -352 2 -269 -165 346
1128 346 -73 -343 -105 237 -296 -88 146 776 266 26 670 166 -49 454 -300 -493 65 -849 -540 -404
1148 -404 -287 -71 88 -95 397 -26 117 800 233 -67 192 -82 161 185 162 55 108 -200 -285 -282 -189 290
1170 290 -265 -481 40 -373 -269 260 206 506 368 282 280 174 107 79 -68 -188 65 -396 -179 30 -401 -278
1192 -278 -198 -315 -163 161 53 211 106 171 122 -453 160 539 277 -171 211 -214 -193 293 -102 67 -277
1213 -277 -251 -208 -394 -28 174 -206 -26 83 -244 126 213 205 202 20 -409 -72 13 -278 29 -201 -133 -231 -351
1236 -351 67 294 -75 186 -29 17 54 -125 135 132 -160 97 -85 -139 207 49 183 483 -121 -192 -165 -113 331
1259 331 -87 -180 4 -282 -274 185 -198 303 348 -357 25 -43 -337 232 575 138 186 -151 -131 61 29 -269 -296
1282 -296 -427 -413 -358 -182 3 62 -294 125 81 361 277 231 490 554 -138 4 -221 -227 75 -107 -440 154 -455
1305 -455 -268 153 39 -301 -110 -151 -70 135 90 460 345 278 130 149 -159 462 72 -248 -65 -497 -265 -218
1327 -218 -409 170 121 -191 -50 128 299 433 269 412 263 -126 146 19 -21 -63 -335 -161 -183 -365 -196
1348 -196 234 -131 199 -284 -167 10 36 -190 214 222 255 270 111 234 182 47 -71 -234 -89 -52 -169 46
1370 46 130 101 -286 308 -25 270 210 170 141 378 -114 -94 146 -117 116 71 -150 -173 -7 391 238 27 -90
1393 -90 -78 -170 7 38 199 61 -207 -269 392 214 72 131 -146 262 40 162 60 123 -195 -97 -78 -68 60
1416 60 -130 106 -71 -157 64 36 58 154 72 -66 -105 -197 351 319 300 -80 245 -19 77 -45 -359 -71 -516 -389
1440 -389 -172 -111 -261 200 -138 -80 262 -39 231 308 -117 -52 242 -32 -258 -142 -141 196 -15 118 -219 -205
1462 -205 -135 25 82 22 -25 128 217 236 27 335 70 225 -3 -32 76 -67 -149 -339 -121 -386 -203 -74 -23
1485 -23 -204 68 -138 90 -60 188 74 211 141 295 58 375 -81 -75 423 35 104 -72 -300 176 29 3
1507 3 66 83 -225 62 -38 -166 176 227 78 -26 -31 235 200 10 -104 -123 5 14 117 -224 93 69 196 146
1531 146 -204 -181 -273 -48 57 51 -74 -41 144 47 332 169 155 264 111 17 26 38 -164 159 -119 -67 -275 -248
1555 -248 239 60 -34 87 83 12 236 -94 139 -143 -61 247 -3 274 66 -109 260 310 -100 -222 -26 -225
1577 -225 34 -190 29 -59 30 382 7 -75 -123 245 107 217 214 129 166 -18 -408 112 -6 -180 2 -252 7
1600 7 77 86 390 108 -62 -37 -563 73 322 41 -19 -132 -22 250 60 -292 -31 -111 -148 6 101 -72 339
1623 339 108 -17 -63 106 141 136 296 206 291 206 195 -214 -47 268 124 -126 52 51 15 -297 -233 134 135 236 1
1648 1 -65 338 279 172 20 -25 148 245 60 -89 3 -236 -33 -253 24 16 -22 -98 -54 67 38 -91 42 -224
1672 -224 -107 -74 -12 -80 -112 -141 143 -10 -48 -138 36 5 37 -255 76 -293 -201 -31 -382 1 81 129 -202 -100
1696 -100 121 -107 -89 11 190 15 -254 82 -114 -130 -92 -29 -109 -185 -45 246 0 98 111 -154 168 116 -89
1719 -89 104 221 -70 152 141 -137 -85 101 -344 -211 -8 -58 -47 -266 -60 101 131 -110 215 -45 475 92
1741 92 -230 155 143 8 44 147 167 -46 -90 -90 72 183 -2 -84 47 -279 -137 -75 -5 130 -46 -36 166 -27
1765 -27 -23 253 207 216 61 -54 -113 149 107 199 195 23 -144 151 116 -36 73 91 30 -27 -57 257 6 -31 259 98
1791 98 42 -13 -208 145 -6 -58 110 -134 123 -41 20 -260 -2 189 301 377 70 195 83 12 -28 -52 149
1814 149 165 -43 73 -153 109 -171 -8 -91 87 -7 16 -148 178 -9 56 337 20 -19 101 -119 -149 258
1836 258 164 114 126 132 -72 228 119 11 -203 107 9 1 -60 20 -20 213 27 -6 -67 115 -28 65 -119 -46 -78
1861 -78 -42 45 -9 19 24 -5 -65 0 -380 -107 -235 -101 -73 38 90 -45 104 94 -102 -58 -73 -106 42 135 110 -179
1887 -179 -284 54 -185 -151 29 50 -236 8 129 50 0 269 -108 205 151 -2 47 171 -82 13 -79 -76 -103 -413
1911 -413 -66 1 -90 -198 -42 -109 193 86 134 138 271 -297 343 17 -126 -27 307 -106 -86 280 380 37 122
1934 122 83 6 -24 -41 -11 131 -94 -101 67 -85 27 39 -20 -40 242 -82 219 237 -35 -326 101 -90 -182 -194
1958 -194 1 168 378 241 93 -181 1 -35 -36 -138 325 246 11 5 3 83 -169 -259 -53 -331 -56 116 -154
1981 -154 -224 30 -221 -3 6 76 161 4 8 -210 96 115 -156 261 -165 -97 252 14 210 -20 108 -92 390
2004 390 -426 46 -136 -69 149 89 -25 136 -92 117 -3 -117 160 -121 -61 -109 68 -170 117 -310 -51
2025 -51 -192 -78 69 98 79 -133 76 140 -7 -278 86 111 209 17 67 21 153 -125 -146 -20 -115 -25 2 -47
2049 -47 -39 -279 21 26 -169 178 237 -19 37 26 414 127 7 34 318 -238 -70 -64 -12 -34 -32 -80 -82 206 -65 65
2075 65 21 123 -5 151 309 22 32 -136 55 -101 6 156 59 -48 -250 -335 -214 -98 -25 7 16 -38 9 -82
2099 -82 -117 -107 10 59 69 113 174 179 -54 76 -202 26 -4 -108 129 -160 6 -8 -264 55 184 -110 27 -25
2123 -25 -181 -11 23 38 114 139 50 2 15 111 -178 233 -200 -57 66 -138 28 186 223 -10 -95 23 -11 237
2147 237 73 79 106 -130 126 -69 -43 -23 50 -13 -250 -43 -87 100 63 -215 -134 96 -53 -67 102 -208 -105 -66
2171 -66 133 -16 -86 -43 -55 11 -295 193 -65 41 -211 56 -154 -60 189 -347 40 -11 -7 64 174 -61 -227
2194 -227 73 123 -45 -33 69 20 3 138 -78 -42 57 -40 -376 -154 -155 -25 -153 0 132 174 288 -93 40
2217 40 9 217 -17 -162 60 3 -108 185 -37 -256 -178 37 -1 -182 85 107 63 -65 171 101 -214 19 189
2240 189 -127 -4 -131 -63 -31 -6 211 -101 68 -92 199 -113 -198 -66 -46 -432 -43 -54 -106 -105 -38 44 382 312
2264 312 -15 -208 -186 -95 1 -48 2 79 58 -130 -102 -38 66 82 28 -55 155 9 232 69 -44 83 83 -4 -124
2289 -124 -243 189 -12 123 144 -116 236 44 -143 -248 60 -45 22 -179 -358 -16 -180 -47 19 150 258
2310 258 32 -9 39 275 138 -276 49 -99 -126 -114 423 -122 -108 345 -174 63 31 -97 173 374 -154 -43
2332 -43 -98 -216 96 -52 63 -200 101 -52 132 76 200 -93 -274 92 -244 -82 256 40 -108 -134 143
2353 143 210 -73 -115 38 44 159 155 -202 268 -51 -101 155 17 -10 3 209 107 -111 236 54 -136 237 -42
2376 -42 -143 -48 -207 -71 -126 176 -3 -94 52 -212 117 -9 211 -24 322 100 -16 81 -274 31 45 -11
2398 -11 -41 75 -44 109 -320 -46 34 -55 -118 55 88 17 338 -20 20 155 -95 164 -143 -122 -284 -56 -77
2421 -77 -128 -125 6 185 -45 125 -4 118 -33 -15 169 -192 -132 -179 136 -1 -102 67 -137 -61 26 -106 -137
2444 -137 -81 17 111 183 -69 231 -244 -301 -24 -205 -110 -163 -222 40 85 -141 289 -190 14 47 348 70 -82
2467 -82 -39 111 138 -86 -84 -22 55 -228 -169 -94 34 -182 -287 6 19 334 -8 -109 -36 22 63 139 65 238 188
2492 188 -228 -173 -138 2 -14 66 -130 10 -148 77 -145 -213 -475 228 -74 291 225 -27 35 242 231 -31 -265
2515 -265 -247 32 161 134 -70 -122 -104 73 -116 -42 47 120 -170 168 62 -209 372 46 -12 -55 -177 -263 -233 2
2539 2 -208 -230 97 -142 119 95 17 131 8 -42 -104 154 -222 -15 -43 12 -110 -195 -104 -146 -62 -284 -242 86 -84
2564 -84 121 104 -106 145 94 13 -207 -33 145 -176 -217 -228 -60 -69 -70 -13 -106 -17 -131 -40 69 -146 -57 78 -12
2589 -12 -6 166 3 -3 -74 144 -113 -27 -281 -233 -299 39 -3 149 84 -94 -83 177 10 -25 -121 116 120 -393 -271
2614 -271 -213 14 116 211 51 93 188 69 13 8 265 57 6 10 -320 -12 80 -154 37 -112 -145 238 -188 56
2638 56 -89 221 124 80 -8 -141 -68 163 44 -41 285 289 -200 -126 -10 -94 -62 -91 151 -29 111 -139 232 228 29
2663 29 11 18 -3 -87 26 425 -146 -48 65 -40 -37 -188 -60 72 70 -99 165 -9 -120 -144 -26 32 52 -271 145
2688 145 -21 19 214 -45 -89 45 -128 -199 -55 183 -151 -29 173 208 252 -19 -143 -212 -38 85 276 39
2710 39 -84 57 4 -16 -153 -181 -141 122 264 231 -36 -8 -94 55 -10 72 -253 -98 4 59 -48 139 96 -47
2734 -47 239 99 60 97 92 -117 -48 143 114 -227 294 -332 87 345 -148 52 -1 52 7 -134 34 -22 -62 142
2758 142 8 161 -236 91 -29 -64 -256 16 -48 -172 172 -47 -259 -308 -196 -199 -199 -83 -254 -137 78 136 -146
2781 -146 64 4 113 -78 23 98 5 -95 107 203 -30 122 83 -98 106 9 5 116 -141 -312 222 -97 -191
2804 -191 122 124 -152 -14 386 -111 73 -215 -227 -203 -13 43 88 145 98 56 0 129 371 -12 -4 186 161 -323
2828 -323 -140 -115 60 9 -154 -238 -51 145 -204 95 199 -298 1 -62 79 139 222 -118 -292 -132 -178 29
2850 29 -93 -43 89 109 231 -57 248 17 -53 92 72 -93 33 -131 -173 175 96 150 367 -146 -247 -59 41
2873 41 -47 77 156 -203 -50 -76 -230 42 65 -97 55 164 241 -11 -242 -5 -20 -128 101 -7 13 109 -34
2896 -34 -312 114 -211 -19 74 135 -107 16 -63 134 205 250 -78 28 -123 -130 63 -219 -154 5 -100 159 48
2919 48 -67 -100 123 -21 -8 215 136 237 11 122 13 19 -349 79 -105 64 -20 56 97 -125 101 48 -97
2942 -97 -99 -276 180 20 -46 86 165 74 -47 -94 -58 181 277 66 56 26 -178 199 -24 -79 -62 -113 250 -26 130
2967 130 -109 -113 -31 -135 41 70 186 125 -140 -23 425 265 -20 195 164 -81 53 -152 86 -63 146 266
2989 266 -86 -90 187 -208 -94 -75 128 -42 -64 -105 -196 46 280 45 -318 12 -48 -25 -168 225 330 -62 15
3012 15 63 169 -10 -42 -332 -49 -131 -49 -16 95 49 -246 137 70 7 -191 146 56 162 30 -98 57 -51
3035 -51 -19 35 12 -234 -267 -72 35 9 44 -295 -54 -71 -32 155 -59 -289 106 2 -260 -72 91 72 -7 -41
3059 -41 45 -5 -274 124 49 -124 38 -74 78 -52 -92 117 207 -105 221 -265 -361 -71 282 -117 69 28 182
3082 182 -2 -150 210 -135 -39 -236 176 38 -110 156 -116 59 -81 -68 260 -113 216 -238 68 -31 -40 182
3104 182 94 -22 -17 98 -171 -52 23 -240 -347 -16 -122 65 150 101 -4 -74 -40 -74 28 -192 78 -220 2
3127 2 167 -92 -26 -35 1 67 -55 9 68 -78 -19 -145 74 -137 -34 12 78 -216 177 -158 41 32 -210 67 35
3152 35 -66 -112 110 -8 156 -242 176 100 -112 -106 -76 60 -120 94 15 -15 127 119 -8 148 117 70 457 -4
3176 -4 -226 -177 105 -20 -222 -167 -129 -160 -113 -50 256 50 21 81 -3 -79 -35 142 12 257 -43 -117 -276 239 99
3201 99 58 -142 -92 -93 -57 37 -185 -192 307 -91 -80 -29 157 -107 -182 100 37 -69 -68 -64 -104 -100 200 127 121 219 -4 200
3229 200 -68 -41 109 129 98 -346 -135 185 -136 -11 45 -155 142 -10 -111 11 -70 17 -123 -163 -141 171 -132
3252 -132 88 153 70 192 148 157 -122 13 137 -96 -175 -59 -173 70 -172 16 -134 -191 -1 -74 -101 136 -132
3275 -132 -40 16 -72 32 106 166 -91 19 208 -187 190 70 -85 -153 -86 -92 -111 -237 93 341 25 40 -154 -65
3299 -65 95 -128 -43 182 -41 187 93 396 -111 275 165 -114 152 77 93 116 -160 0 147 205 36 -55 -137
3322 -137 -148 142 227 -257 -158 -12 55 127 -159 34 27 18 193 90 -212 -133 -249 183 -90 108 -86 -223 196
3345 196 -2 -4 -130 10 29 -195 -91 15 -98 289 -170 19 -11 24 225 36 106 164 90 51 77 -215 -346
3368 -346 -15 55 134 41 -34 94 -127 -103 -38 243 -206 -279 -174 -13 46 46 32 66 -70 -210 224 180 -55 6 184
3393 184 -147 243 231 -15 88 -90 258 47 -33 -170 -90 146 -81 103 68 -337 -18 -124 -52 173 -187 -132
3415 -132 149 22 51 -31 -24 48 -174 -146 -35 -24 -111 270 -127 19 -187 -154 68 76 39 -145 260 324 18 44 185
3440 185 152 -17 58 -11 25 3 -126 -4 -158 10 27 -293 194 278 39 -163 -6 -23 76 -445 3 -90 131
3463 131 40 -52 -200 223 -128 -71 121 52 -218 -66 -17 55 -150 -227 230 34 6 46 187 51 92 -149 -162 17
3487 17 57 338 -207 86 125 -209 79 -220 -225 159 -328 -62 -86 14 -213 -196 155 381 305 -19 246 92 103
3510 103 79 90 -44 5 -96 -62 283 37 118 211 65 219 -54 -347 -286 -109 78 280 18 -55 11 -93 47
3533 47 90 120 52 -193 92 142 -141 -100 91 -245 -62 -160 13 -173 161 -141 98 207 126 83 -218 -16 -181
3556 -181 -119 -197 63 123 147 -8 245 20 -81 29 -43 58 -89 -339 -231 -125 67 -63 82 -38 199 171
3578 171 49 -247 53 0 20 -41 14 116 164 -380 68 13 122 -503 141 111 -128 49 -101 86 47 -123 -132
3601 -132 -148 224 142 -64 72 79 216 58 -150 164 116 -82 -207 110 -186 -192 -81 36 -52 -130 -119 -35 -66 -147
3625 -147 125 116 11 -23 446 -290 37 100 99 -257 24 108 -46 230 355 -113 -8 -123 -18 127 -75 35
3647 35 98 99 -257 33 -254 -406 -118 27 -143 -118 86 1 -294 -51 80 -258 -25 -139 -73 -8 -215 -320 -21
3670 -21 63 -71 218 225 -41 -122 44 202 -87 -51 124 -26 -78 -263 137 -340 -55 -14 71 -42 -12 -93 -241 -81
3694 -81 0 -60 -121 43 201 -83 96 -175 -31 64 -187 -142 -278 -198 60 228 -140 237 316 -224 69 234 128
3717 128 19 81 244 66 70 107 138 201 -147 266 51 -86 20 337 -91 -52 53 177 -76 -67 -122 261 -44
3740 -44 -89 -99 229 -5 161 136 -73 -3 247 3 250 51 -275 -324 -114 41 35 -6 75 -85 -36 215 69 276
3764 276 -44 41 42 -20 17 -1 -73 -68 164 -240 -184 -10 -225 -39 184 -109 -77 42 66 8 -56 -10 -128 -33 146
3789 146 -55 119 -124 -42 -15 -11 55 30 77 -13 59 381 165 11 -59 -184 -85 -12 94 76 -156 -119 172 -342 -9
3814 -9 -117 100 150 4 171 101 187 18 -1 278 26 15 92 -92 108 -15 113 -228 126 60 -163 116 -92
3837 -92 70 -80 3 9 74 26 74 -62 207 46 55 -85 24 286 26 250 6 125 52 -28 -7 -53 303 349 253
3862 253 -106 52 42 45 44 -94 58 220 107 131 -178 166 -178 -253 63 -297 185 -201 246 127 178 -165 -178
3885 -178 43 -43 3 -118 -409 66 391 113 -45 -183 95 -39 38 273 -111 -1 37 181 103 -137 -182 155
3907 155 -54 103 26 -146 -49 -41 9 72 164 11 -148 -4 -40 62 -33 24 -76 -415 59 139 130 134 -271 78 -84
3932 -84 226 -15 -56 35 23 84 -42 135 141 58 19 -30 -179 -164 3 -205 14 105 109 -47 -241 173 -175 28 -11
3957 -11 102 -75 -36 -10 77 18 28 227 108 18 -59 -118 77 -81 83 82 45 11 -29 153 -179 247 202 124 -65
3982 -65 -142 -29 6 -76 -1 41 -201 -3 -104 -7 89 41 40 -93 102 -147 -188 193 69 176 -122 -2 -60 86
4006 86 -17 -331 203 26 6 276 35 -199 12 2 -15 -100 178 158 -72 115 -167 75 121 -72 87 -138
4028 -138 -150 185 10 124 -64 87 258 -159 -88 85 66 79 88 -62 -217 -74 -132 -17 90 -89 346 54
4050 54 -86 -229 81 -180 -10 -29 32 10 -45 -77 197 89 -118 129 -84 -112 -68 175 7 -31 18 -136 -276
4073 -276 67 241 99 -5 -109 -89 -29 92 125 -11 227 114 -83 108 183 -150 5 -29 170 146 -190 49
4095 49 -63 70 -46 -260 57 273 -25 58 10 17 278 77 149 80 -125 -181 -172 -38 -51 101 34 -179 -28 -40
4119 -40 111 225 -86 16 -68 26 -19 18 14 52 105 118 -82 -33 -10 202 -187 244 1 -198 96 -33 63 236
4143 236 -50 143 4 17 116 137 -23 -107 136 56 93 219 44 -282 -79 148 55 84 -246 205 -167 238 134
4166 134 127 69 -6 -116 -310 196 163 -18 -115 -103 219 151 -66 -3 -227 -293 -31 167 160 -178 -193 -13 51 96 -15
4191 -15 -117 -53 31 -6 -198 112 58 -94 101 31 -38 -77 85 -103 -220 75 150 -22 -32 162 296 223 -293 7
4215 7 -95 -102 -21 -236 -202 -107 -287 119 70 280 -191 -45 -85 -95 15 265 -87 -276 -43 -31 164 -449 -408 195
4239 195 -88 0 -15 136 261 -149 -119 -150 164 115 203 111 107 42 -84 -142 -118 -109 -40 17 166 -110 -1 103 -216
4264 -216 297 -171 83 110 -115 144 -112 150 122 -79 47 157 -155 21 -16 100 65 -99 80 72 177 24
4286 24 -39 -159 109 88 -130 -123 70 -119 -194 97 40 -23 -56 -10 -232 -3 15 -7 41 136 -203 53 -117 -127 -237
4311 -237 65 87 5 -13 -37 186 145 -65 -229 -123 131 -149 -106 131 19 210 358 9 -291 -182 60 -83
4333 -83 -49 60 13 174 -130 127 175 137 -122 -189 77 33 -198 290 331 41 -82 84 8 148 -184 3 48
4356 48 -5 -80 258 231 -129 -11 -113 48 64 -46 32 -182 73 -243 -151 -71 162 31 -99 -164 -182 299 39
4379 39 172 18 251 -20 -116 -287 -33 154 148 -127 100 -289 -313 -46 34 -204 87 -133 224 -39 -111 -57 -180
4402 -180 146 155 21 -9 265 -198 -9 331 -239 118 183 90 199 -69 -131 -21 -83 -298 -339 -18 -58 -68 65
4425 65 93 73 47 246 344 -14 -125 -46 -174 -175 4 -63 -272 -88 75 -7 191 -62 -98 84 -111 -20 -47 -217
4449 -217 -13 -53 100 204 127 243 -55 19 -99 307 -127 -63 126 61 62 237 -121 41 254 39 -159 -61 8
4472 8 235 287 -48 -225 -282 -79 -159 -281 188 40 -234 100 -77 -139 -198 -134 36 -96 -218 11 77 -27 239
4495 239 81 253 -16 -219 74 -238 -72 17 162 153 -133 -41 -140 107 -337 95 -68 -103 33 269 -76 -113
4517 -113 -126 119 -137 189 1 -323 135 201 196 18 -39 -30 8 -90 133 52 123 47 -158 -257 113 -153 401 -54
4541 -54 265 30 432 -36 100 59 9 13 -222 -116 -199 50 10 -95 139 -45 -227 -45 -65 -144 -509 -100 153
4564 153 -46 -187 -110 93 50 34 16 311 332 -89 -173 -95 -4 -81 -63 -111 115 46 -187 353 -106 39 26 -62 189
4589 189 95 -150 28 -103 -112 89 -114 -69 252 189 267 200 -86 -153 17 24 89 60 209 -154 111 -378 -224 174
4613 174 -161 171 -255 -69 257 4 -87 4 137 57 -177 -108 104 -60 -65 -30 -59 -129 110 53 -158 35 -132
4636 -132 -128 113 -63 35 -214 116 68 -24 -190 -276 -149 -221 79 99 -4 18 99 7 -153 -59 -181 -227 -229 53 189
4661 189 -142 39 -11 -53 -23 -212 -53 248 -201 220 19 129 36 -149 77 100 103 -85 -154 6 150 -21 -27
4684 -27 121 -16 173 -155 -82 28 185 -54 76 260 8 -75 -36 80 106 237 90 56 210 -111 286 25
4706 25 -107 161 -105 -120 -39 -19 102 -96 -188 -2 -186 -51 -142 -30 -202 -164 41 56 -92 -104 -44 176 144 -84
4730 -84 266 122 -77 -37 -55 53 -8 227 -107 -60 24 -16 39 -96 -23 -54 -80 -199 -58 61 36 105 -36 51 347
4755 347 -272 -81 150 231 -101 -122 25 81 99 -88 72 9 -420 136 -131 -33 -430 -329 13 83 5 50 -3
4778 -3 98 278 98 13 73 115 -101 143 206 -93 215 5 -98 96 80 -112 60 21 -118 -136 -78 -42 -198 -15
4802 -15 -158 -10 -14 -160 112 -58 41 -159 41 -113 -106 211 420 67 -68 -221 163 73 -337 150 26 -203
4824 -203 -57 163 3 95 6 -304 217 -3 244 79 -9 87 124 -4 -169 -178 -26 31 -41 -125 -22 -200 55
4847 55 56 168 62 -22 47 35 27 -88 138 46 -134 -41 -66 115 -4 110 -87 -56 132 150 208 -4 -239 35 -25
4872 -25 64 21 -102 -152 -43 32 -170 -29 21 97 73 106 208 -27 119 118 -65 161 -137 -192 -98 20 -78 208 -100
4897 -100 -104 26 14 135 -42 -41 37 -35 119 20 -55 -62 56 -69 8 151 72 -33 -290 101 -224 -2 69 -235 178
4922 178 139 -217 -63 17 -236 72 -49 -143 -31 3 59 116 -284 -3 -3 172 -222 97 291 12 221 -15 173
4945 173 -140 -70 173 -44 -141 -58 105 143 208 1 -39 144 -198 186 -137 -174 246 129 -30 152 -266 14
4967 14 -121 -30 -142 -34 1 -100 143 -40 103 -275 138 73 -127 -38 100 132 -80 24 106 -290 -83 -36 134
4990 134 45 24 27 -154 214 -86 21 96 -39 21 66 -220 -226 65 127 57 146 -21 -199 -86 13 75 37 123 -92
5015 -92 55 347 -35 -66 24 -115 16 44 60 127 -45 -283 -145 -96 -113 -37 126 62 -1 257 0 -19 -111 139
5039 139 147 234 174 137 -92 -100 20 94 -111 -69 286 -237 164 62 67 -8 76 -18 -162 -315 48 -3 -287 98 -29
5064 -29 -38 -184 19 123 -357 191 162 210 -300 3 -8 -27 -113 -240 53 -26 -52 -219 226 5 -137 101 -8
5087 -8 -68 83 -195 -111 120 -11 -159 9 -36 -132 -81 -35 -48 138 -4 152 109 -158 -46 344 58 137 47 -177
5111 -177 36 -175 -112 66 21 -52 70 -98 194 261 28 91 44 38 -102 84 28 8 103 -255 -116 -241 -92 10
5135 10 53 91 -74 46 -206 -46 138 103 -114 -9 -135 -234 82 2 121 -180 85 -67 -290 -155 119 37
5157 37 215 39 15 170 37 176 100 216 193 -431 -24 -201 -168 63 180 -122 -130 182 76 35 -80 150 130
5180 130 138 520 -65 -99 -143 -46 67 79 -128 8 -197 153 33 127 -86 -25 321 -99 -66 -109 -325 243 125
5203 125 157 -300 -147 -36 18 -55 16 -62 -27 39 -59 -48 -176 -118 25 112 -170 -37 20 -185 -181 25 59 56 212 -23
5229 -23 4 -34 321 -98 -143 -25 -176 316 140 84 3 128 12 114 259 -236 -101 -107 4 19 -97 7 -61
5252 -61 -115 -108 -89 29 -62 -65 -54 -109 -3 -10 -164 328 -310 -300 -543 -188 -16 146 -30 -240 -4 76 114 -173 38
5277 38 -15 26 -34 225 0 179 -61 154 87 -267 -177 -97 17 -132 -3 -142 -100 3 94 76 15 -221 3 138
5301 138 114 138 -142 -367 105 267 13 -67 25 -101 -125 66 55 14 -20 107 -119 257 82 222 107 88 111
5324 111 8 -357 96 -52 -43 -77 -130 378 165 15 -33 -76 -190 -33 156 -244 -106 -5 30 133 34 -37 1
5347 1 74 73 -10 -198 -242 -278 -46 -205 89 -312 107 16 189 -9 90 -91 -233 -52 157 117 107 -84 -15 -185
5371 -185 82 -42 -405 67 -191 -179 30 -5 -82 115 103 2 113 47 -51 -41 -175 243 -102 74 513 -24
5393 -24 -200 209 205 89 -300 248 235 -202 -2 221 -323 68 -50 81 -89 210 -174 106 31 201 -72 -333
5415 -333 148 -275 -417 101 -312 -304 203 238 -179 -54 -129 64 -204 262 7 -209 104 -96 13 -134 -118 220
5437 220 -7 -316 -29 -72 127 -123 97 -27 -44 -211 227 -156 260 101 -347 -29 102 56 -108 -129 -83 167
5459 167 -9 9 0 -324 -150 -126 109 88 -36 59 66 22 -70 22 -47 -229 137 -300 23 -179 -70 -111 -43 99 23
5484 23 -96 18 -22 47 -65 77 -110 -21 -5 -193 -188 51 11 -172 162 -95 -263 15 197 -130 11 138 -80
5507 -80 -39 122 84 -150 40 -86 -135 72 87 210 70 158 -120 192 74 -114 -307 36 -136 -194 21 131
5529 131 -134 -94 -45 14 46 361 120 77 -13 144 19 -59 -154 178 80 166 87 -52 -167 33 180 138 -101 218
5553 218 -45 -94 130 -106 -140 357 -307 87 49 -11 -76 21 37 -130 -62 -95 200 -145 204 223 -71 -4 -41 5
5577 5 68 42 207 130 111 26 -128 9 3 -165 -3 77 287 -86 -71 -135 159 77 -75 256 216 -93 -326 23 -4
5602 -4 318 168 55 253 -5 -127 6 105 -5 -38 56 160 -145 65 -80 -147 -5 114 18 197 -150 -87 111
5625 111 -116 -127 78 137 -70 -47 -138 -6 245 -83 -123 -59 -103 266 18 151 49 -154 67 190 -164 -3
5647 -3 201 141 198 -4 47 10 189 172 -259 4 -12 76 -177 -9 -56 219 134 11 -25 17 83 114 41 -164 127
5672 127 -27 223 117 -257 -282 80 -18 48 -231 20 -231 -61 104 -20 -5 164 145 -149 26 -202 -109 110
5694 110 -33 -54 -222 -165 86 177 -52 -156 59 -242 43 107 -39 -2 -138 93 -160 88 -247 112 -3 -539
5716 -539 79 -84 -256 -18 -13 -100 -159 111 78 -127 -210 -142 -100 -219 -13 -89 12 165 25 140 -83 88 -4
5739 -4 -224 11 78 285 -325 151 143 106 190 50 -214 -1 171 -385 102 217 -17 -180 22 159 57 -77
5761 -77 -316 100 -11 59 14 -164 26 -191 104 34 -116 168 -31 459 175 -325 53 -112 194 -183 78
5782 78 177 -46 43 -23 -245 -34 7 112 157 213 131 -109 214 -125 -42 294 243 72 -89 172 -65 138 52 -10
5806 -10 -116 18 85 171 -189 -90 49 38 25 119 53 158 -116 -34 -120 -156 93 28 -134 -30 43 -131 -58 -73 54
5831 54 -187 -123 21 15 -186 -91 -170 -337 -34 162 90 -92 -37 -61 -216 -49 107 -73 -58 -142 -81 -53 -191 194
5855 194 -14 247 329 38 132 6 234 -2 281 -128 221 -140 52 74 86 59 -137 -82 -59 1 -18 126 41
5878 41 178 -224 155 53 93 135 10 107 114 -126 41 23 -92 -98 86 -111 60 -89 56 -267 88 98 -109
5901 -109 -92 151 -79 41 -4 48 -90 210 154 53 -227 71 261 64 -37 45 -143 44 239 -141 -178 -93
5923 -93 -37 98 13 110 312 199 -29 -50 189 -67 -112 -109 71 135 -163 -75 1 6 -138 -118 61 -8 -53 -198 24
5948 24 66 -65 92 11 155 -16 -47 -134 123 272 45 80 190 5 33 -142 123 90 153 58 -82 129 267
5971 267 54 -30 -169 67 -86 -20 -60 -337 52 87 93 -133 32 -36 -98 56 -52 186 -242 85 196 98 -254
5994 -254 -306 71 -93 -28 -144 -253 -177 -76 12 -67 -69 -59 129 -81 -43 4 45 -177 22 -122 -275 -97 -239 21
6018 21 -151 -96 0 -257 -213 -278 -112 8 -59 27 -11 -18 178 163 167 -115 -49 95 72 105 -34 -212 -129 -2 -41 21
6044 21 -150 -19 118 -12 260 -94 115 -178 126 -64 -323 34 131 0 175 -243 8 12 -35 169 -147 -124
6066 -124 -146 54 138 49 93 -14 105 30 -13 93 -51 -138 93 -144 219 43 160 11 145 326 -105 -323
6088 -323 17 -33 -19 -33 160 227 43 50 -69 -236 -43 157 44 -117 -23 -3 -14 -149 128 -143 117 -83 -33
6111 -33 4 -3 -291 78 -174 -12 169 -47 -86 97 175 -214 135 103 -278 -22 -133 277 -4 -44 62 118 161
6134 161 -37 -121 107 47 -391 23 2 135 -99 -49 -121 -129 -164 41 98 -190 79 108 17 83 -14 -53 32 36 -168 -79
6160 -79 32 -55 -10 185 158 -123 124 -87 98 -113 57 -123 -168 -326 -47 -208 -12 -86 -153 -50 -250 -20
6182 -20 -156 -81 150 89 -240 35 40 118 -38 418 208 306 -230 -38 5 56 302 -143 31 -254 -184 177 -177
6205 -177 -136 8 -8 86 -104 37 67 -69 -25 195 -289 -223 14 199 269 -8 16 -94 -44 -266 24 118 -129
6228 -129 43 -90 -205 -255 277 -174 68 115 23 -31 -17 37 -147 1 -48 -263 -226 16 94 51 76 97 63 -94
6252 -94 355 136 160 -58 163 -232 12 121 -1 284 5 -135 -24 136 -62 -378 33 -136 172 159 231
6273 231 -51 -100 215 -97 -248 73 118 -84 2 -97 18 61 -93 -41 46 150 52 -64 125 11 270 -5 -172
6296 -172 -244 -82 243 232 3 -186 36 138 -9 37 -146 35 -81 -177 -255 -13 -243 86 88 6 -165 -52 -92
6319 -92 -84 58 346 27 21 -116 -377 -168 -155 -27 41 -57 93 146 99 151 -200 30 -211 -177 234 38 33 -289 -157
6344 -157 180 93 124 126 292 297 -136 24 -31 -156 226 -205 -20 12 200 -297 -75 -101 72 -69 282 127 -23
6367 -23 165 -88 -22 30 335 -114 -171 -258 -63 -119 101 135 -277 94 -44 92 -50 -197 130 5 0 -171 -242
6390 -242 -330 43 356 -25 53 74 86 -179 -242 20 109 -85 -95 -53 -191 295 123 87 -149 -45 233 -90 -43
6413 -43 -4 -61 -286 -179 234 88 102 154 17 51 84 109 -134 -35 100 -3 204 -102 189 -20 -34 -65 198 56
6437 56 53 -23 -27 60 -91 48 -243 52 74 -147 -34 -277 77 -175 115 74 62 17 -162 -33 347 124 -42 14
6461 14 -56 143 -4 417 -64 159 -115 -120 87 -111 -1 -71 -162 -152 254 -132 125 -115 -98 -138 47 -86 -12
6484 -12 43 -262 240 -192 81 -179 -60 82 18 -420 203 152 35 81 264 -65 -164 0 -4 -43 -1 30 181 82
6508 82 -285 -160 -31 -54 137 -124 128 -155 259 -179 37 -88 82 86 -39 -101 29 13 -118 175 89 -82
6530 -82 27 -55 -32 144 356 100 79 -255 49 -78 -177 -136 28 -65 131 -102 -42 -121 -65 10 4 -202 -295 171 161
6555 161 135 140 -325 -111 -336 -184 -73 -180 -367 -53 -121 -292 -131 50 138 225 6 139 253 -71 247 -112
6577 -112 72 -48 199 120 90 -209 221 282 -89 46 5 -165 -168 273 -63 150 88 -48 -58 -276 214 20 -230
6600 -230 114 27 -165 -352 -96 -78 75 18 -156 -170 -11 97 68 107 58 -78 163 52 21 -12 235 -48 148
6623 148 205 -233 -12 -21 -103 -199 -83 -10 11 -77 365 -16 -168 59 73 3 26 189 -258 -78 314 70 34 238
6647 238 -75 -220 -4 325 -211 62 52 -284 -195 209 35 106 210 115 59 34 -126 -86 169 -54 -9 -43 -97
6670 -97 198 -185 -137 -31 -212 45 111 256 258 249 117 215 -46 -33 -184 326 34 141 126 57 56 -257 -134 287
6694 287 -74 -151 92 71 -75 -115 64 112 -187 125 276 -19 -219 -59 -100 167 -157 9 183 -141 -86 -312
6716 -312 -17 -78 -9 -53 -9 117 69 -80 -87 -128 118 -120 89 3 -141 -103 -169 -217 -269 -25 7 -87 249 -29 82
6741 82 67 -138 134 -12 181 9 68 -10 -22 -163 419 -202 49 -2 89 -284 63 -105 209 -64 -36 29 -47
6764 -47 85 -232 98 102 90 -169 102 -31 -90 -7 -225 125 -98 -25 214 44 27 63 18 -106 52 -156 -140 79
6788 79 21 -27 13 -89 -69 150 100 -184 20 -70 -18 -149 133 -33 30 -139 19 -41 0 -2 -173 266 288 -136 56
6813 56 246 -89 -97 120 -197 25 -53 77 -50 -177 42 -153 67 78 53 -99 123 -177 -72 25 -21 -204 -90
6836 -90 46 115 34 58 17 79 172 -10 -41 69 61 -108 174 86 -67 -114 38 -204 389 -184 -72 -61 -117 19 145
6861 145 -161 -136 -201 -3 -9 57 178 -135 152 37 143 -17 -59 128 -114 267 13 118 -121 -29 101 107 -36
6884 -36 -31 112 -117 107 -37 107 33 16 412 91 -29 -153 7 -145 -94 -180 -29 147 152 25 -216 336 157
6907 157 -169 179 -76 164 -40 6 -47 24 92 31 -121 -162 58 -106 414 33 45 26 14 -42 -5 -58 37 -77
6931 -77 -80 341 70 -162 191 -169 -54 114 57 128 33 -275 -25 -130 -146 -156 -218 120 86 -57 48 -111 -74 77
6955 77 151 1 -94 -376 -206 -154 -48 136 -16 196 -38 68 174 228 99 107 -30 11 100 -77 21 186 -59
6978 -59 -67 129 3 -351 -143 -156 -97 -142 266 -33 -60 -259 134 -184 188 -271 73 -164 49 209 -57 -212
7000 -212 -31 -49 -256 176 110 68 -59 -11 -60 -107 151 131 48 93 17 33 -286 35 -140 188 140 -92 178 -39
7024 -39 -179 157 -116 -218 9 62 -79 -376 -25 202 261 113 20 120 -38 -196 -112 380 51 -45 -45 -70 -200
7047 -200 -119 -243 313 -153 326 382 -156 110 284 -105 -131 -26 -3 286 -4 164 81 -127 -133 -82 -149 69 142
7070 142 183 -93 -276 -279 -262 -40 -256 180 89 -32 -8 -139 -37 -77 299 193 -243 32 205 -154 -286 44
7092 44 28 127 38 288 94 -66 20 -8 -23 -12 72 -87 -97 -96 165 175 -28 -75 42 -34 -67 -121 -121 -1 246 33
7118 33 265 -152 -102 -110 -4 193 39 259 -29 -189 -65 -61 -12 241 -97 257 -77 -104 -201 -187 -155 128 117 130
7142 130 -188 10 -10 -59 -97 56 -1 -33 184 -161 51 115 -34 19 333 -5 -83 20 -134 -18 209 346 -73
7165 -73 181 -18 95 -38 -67 -134 52 -70 -189 132 0 59 -11 -59 374 -99 -189 -110 227 286 259 58 131 -57
7189 -57 -112 172 -93 -7 -132 -252 -15 -26 29 40 169 41 7 32 -69 -145 -69 166 -77 105 76 -89 -119 24
7213 24 -96 -10 -12 82 -31 0 150 -57 -73 -116 -147 36 -64 -80 116 -178 7 71 -109 18 74 228 -237 70
7237 70 -21 -266 -15 96 -139 -93 65 -61 -81 84 -119 -129 59 100 -225 -29 141 116 -27 -197 -7 -3 -66
7260 -66 228 -13 -88 -16 13 -13 81 -335 -219 -52 90 172 190 -146 43 -242 -114 -77 -55 -91 181 199 18 35
7284 35 91 31 -80 -4 163 18 34 72 -57 193 -132 51 -64 23 72 141 -203 80 -314 101 -122 -114 -32 35
7308 35 -31 -54 -126 274 173 -46 29 -17 39 -108 18 55 171 12 225 346 287 59 166 141 6 159 -25
7331 -25 299 158 154 84 20 110 286 -74 365 56 -55 -24 -551 -98 5 -199 49 37 336 228 217 14 13 -97
7355 -97 -180 -15 -43 309 -74 -320 -182 -103 -119 -224 -12 -25 37 61 -166 -95 -176 -83 -198 77 1 -123 -219 -50
7379 -50 25 267 -99 -56 -195 -83 2 30 196 163 48 -63 44 9 -67 54 48 -70 -25 -159 140 -97 -122 -104
7403 -104 61 -31 20 -145 -126 -94 60 -54 -129 -282 133 11 71 203 44 -199 242 332 -62 -39 -41 138 27
7426 27 -277 -55 104 41 324 -20 187 -190 -125 167 -67 -50 22 15 -202 -153 -40 223 93 -86 -154 -14 341
7449 341 125 -196 -152 -189 -165 -50 165 -50 -132 -225 163 123 -82 -185 13 -199 65 -49 -261 -141 -27 -252
7471 -252 122 153 7 -196 -100 291 -74 -113 -69 -96 -77 -98 -79 -182 -90 20 -27 -30 -227 176 164 -124 -2 -298
7495 -298 -79 13 -139 47 237 45 -76 100 307 40 118 -315 -132 -98 403 25 101 259 -82 194 147 70
7517 70 -350 -139 -2 61 85 25 -31 94 -99 -125 88 -139 17 -335 -93 97 -126 21 -179 16 -169 -43
7539 -43 -33 112 49 161 -6 -40 -203 -130 54 94 -10 92 130 -107 52 -201 17 56 -163 59 50 -219 203
7562 203 -36 15 4 -45 -4 94 157 32 -34 -184 44 45 135 10 15 81 112 196 -106 -72 25 82 5 -16 -236 74 86
7589 86 -48 78 -119 -48 -15 31 -89 426 25 32 90 -234 -94 -29 -106 -11 -282 3 -79 82 146 -12 34 58 51
7614 51 -99 -137 -47 11 44 135 -370 -82 -58 52 106 28 82 -32 36 -22 -125 50 -275 -213 -315 242 -160 56
7638 56 -40 139 -116 26 -110 -129 -7 1 -38 163 181 155 -113 -124 164 373 29 -87 -280 -219 -98 36 -79
7661 -79 78 141 -20 -161 -119 -20 174 28 -32 -65 64 -102 221 84 7 112 -125 76 -237 68 -7 231 103
7684 103 -11 218 140 -120 184 25 -190 -38 6 -2 -53 106 -24 -197 -139 0 74 -178 13 171 296 204 83
7707 83 152 -85 -232 -33 129 -49 169 151 -12 94 -25 -77 19 111 39 65 -262 42 45 98 -39 -69 -84 -7 67
7732 67 -178 46 139 49 -172 116 57 64 -164 8 46 14 -51 136 -135 -107 -211 -156 42 157 30 -107 108 -40
7756 -40 -183 -25 -251 98 -42 -158 24 24 171 273 -63 -183 -102 49 118 -157 64 150 79 -26 -101 -100 -125 86
7780 86 59 -96 90 -198 -1 -37 -92 -205 388 -110 -260 228 57 144 156 217 -164 360 13 25 -21 24 152
7803 152 225 -22 166 -162 -126 19 -60 -21 -291 28 85 -148 -89 -253 105 239 -208 133 -83 -60 107 40 -294
7826 -294 -190 130 -170 -76 -53 77 254 278 -60 297 -28 -197 283 5 147 -267 -315 306 33 310 -158
7847 -158 248 53 31 40 -132 132 -320 285 -328 -21 191 8 141 157 20 -102 -258 63 52 12 192 27
7869 27 79 -100 -32 28 -59 23 -130 33 133 -18 -39 85 -236 -272 -9 -269 126 -461 -43 60 134 79 -121
7892 -121 -150 -389 59 148 70 130 62 -77 218 12 -277 -79 -101 -176 79 116 -37 24 204 299 -32 317 -105
7915 -105 -73 -14 150 -216 87 38 -86 275 56 31 -60 -205 -78 85 -1 -13 -142 -99 -165 61 -138 -169 -86 118
7939 118 -71 40 283 -7 72 90 151 -159 -77 91 -94 194 -216 -91 98 -10 -304 206 101 138 -139 -244
7961 -244 -18 120 -105 -199 -113 -25 -105 0 58 -166 158 172 -132 0 -92 -11 -79 155 60 -150 -238 -221 -38 2
7985 2 -29 19 -70 147 43 121 -58 205 -19 -51 231 66 -105 24 112 131 -215 52 -85 -66 -34 180 -48 -87
8009 -87 -191 -213 93 7 -41 -136 135 31 -46 193 79 -54 120 -52 -124 -97 29 48 -177 -16 117 -66 -240
8032 -240 -65 247 -84 13 -55 76 30 -315 12 -105 105 146 -333 131 113 -69 -200 55 1 -81 -60 -115 74
8055 74 -273 -263 76 35 -63 37 -41 -184 80 152 26 226 -20 -112 -136 133 -153 183 114 69 -200 -66 -138 -261
8079 -261 -74 96 -29 165 313 29 192 18 238 -121 -42 -163 -89 17 -8 -322 -105 -103 368 -23 -72 -193
8101 -193 -143 65 173 -12 -193 -89 -89 46 -179 -80 22 -112 -206 287 -47 -100 -79 32 -10 -156 109 -100 79
8124 79 189 189 -75 -485 -88 -107 -6 -109 33 -35 126 91 219 56 -150 -27 129 134 -244 -30 235 4 -127
8147 -127 25 191 -354 -16 -156 -83 -193 -15 33 98 -38 -396 266 -107 48 246 233 -97 277 -23 -43 44
8169 44 -87 233 64 109 -34 -27 -74 206 20 -37 97 40 171 54 157 61 34 164 -125 -72 28 -164
8191a64
##END NTUPLES=NMR FID
##END=
