##TITLE=1H_DE-87_oil
 200.13MHz, ,
 8 sc
 
 31.3.2025
##JCAMPDX= 6.0         $$ Bruker NMR JCAMP-DX V2.0
##DATA TYPE= NMR FID
##DATA CLASS= NTUPLES
##ORIGIN= UXNMR, Bruker Analytische Messtechnik GmbH
##OWNER= pz
$$ XWIN-NMR		Version 3.5
$$ Mon Mar 31 14:09:42 2025 Russian Standard Time (UT+4h)  she@DPX200
##.OBSERVE FREQUENCY= 200.1313
##.OBSERVE NUCLEUS= ^1H
##.DELAY= (6, 6)
##.ACQUISITION MODE= SIMULTANEOUS
##.ACQUISITION SCHEME= undefined
##.AVERAGES= 8
##.DIGITISER RES= 18
##SPECTROMETER/DATA SYSTEM= spect
##.PULSE SEQUENCE= zg30
##.SOLVENT NAME= CDCl3
##.SHIFT REFERENCE= (INTERNAL, CDCl3, 0, 14.3821)
##AUDIT TRAIL= $$ (NUMBER, WHEN, WHO, WHERE, WHAT)
$$ ##TITLE= Audit trail, XWIN-NMR		Version 3.5
$$ ##JCAMPDX= 5.01
$$ ##ORIGIN= Bruker BioSpin GmbH
$$ ##OWNER= she
$$ F:/spectra/data/she/nmr/H-C/1/audita.txt
$$ ##AUDIT TRAIL=  $$ (NUMBER, WHEN, WHO, WHERE, WHAT)
(   1,<2025-03-31 14:08:18.87 +0400>,<she>,<DPX200>,
      <created by zg, POWCHK disabled, PULCHK disabled
       configuration hash MD5:
       00 E9 B6 7A A2 85 ED C7 34 08 36 98 17 FE 4E 26
       data hash MD5: 16K
       85 82 76 0E 04 A5 97 09 94 59 E1 36 3C C4 C5 C3>)
$$ ##END=
$$ 
$$ hash MD5
$$ 70 0C BD D5 E7 90 48 2A 81 FF E8 69 58 BE 11 7E
##$RELAX= 
##$RELAX= 
##$RELAX= 
##$RELAX= 
##$RELAX= 
##$RELAX= 
$$ Bruker specific parameters
$$ --------------------------
##$DU= <F:/spectra>
##$EXPNO= 1
##$NAME= <H-C>
##$PROCNO= 1
##$TYPE= <nmr>
##$USER= <she>
##$AMP= (0..31)
100 100 100 100 100 100 100 100 100 100 100 100 100 100 100 100 100 100 
100 100 100 100 100 100 100 100 100 100 100 100 100 100 
##$AQSEQ= 0
##$AQ_mod= 1
##$AUNM= <au_zg>
##$AUTOPOS= <>
##$BF1= 200.13
##$BF2= 200.13
##$BF3= 200.13
##$BF4= 200.13
##$BF5= 200.13
##$BF6= 200.13
##$BF7= 200.13
##$BF8= 200.13
##$BYTORDA= 1
##$CFDGTYP= 0
##$CFRGTYP= 5
##$CHEMSTR= <none>
##$CNST= (0..31)
1 1 145 1 1 1 1 1 1 1 1 1 1 1 1 1 1 1 1 1 1 1 1 1 1 1 1 1 1 1 1 1 
##$CPDPRG= <>
##$CPDPRG1= <>
##$CPDPRG2= <>
##$CPDPRG3= <>
##$CPDPRG4= <mlev>
##$CPDPRG5= <mlev>
##$CPDPRG6= <mlev>
##$CPDPRG7= <mlev>
##$CPDPRG8= <mlev>
##$CPDPRGB= <>
##$CPDPRGT= <>
##$D= (0..31)
0 0.7 0 0 0 0 0 0 0 0 0 0.03 0 0 0 0 0 0 0 0 0 0 0 0 0 0 0 0 0 0 0 0 
##$DATE= 1743415698
##$DBL= (0..7)
120 120 120 120 120 120 120 120 
##$DBP= (0..7)
150 150 150 150 150 150 150 150 
##$DBP07= 0
##$DBPNAM0= <>
##$DBPNAM1= <>
##$DBPNAM2= <>
##$DBPNAM3= <>
##$DBPNAM4= <>
##$DBPNAM5= <>
##$DBPNAM6= <>
##$DBPNAM7= <>
##$DBPOAL= (0..7)
0.5 0.5 0.5 0.5 0.5 0.5 0.5 0.5 
##$DBPOFFS= (0..7)
0 0 0 0 0 0 0 0 
##$DE= 6
##$DECBNUC= <off>
##$DECIM= 32
##$DECNUC= <off>
##$DECSTAT= 4
##$DIGMOD= 1
##$DIGTYP= 9
##$DL= (0..7)
0 120 120 120 120 120 120 120 
##$DP= (0..7)
150 150 150 150 150 150 150 150 
##$DP07= 0
##$DPNAME0= <>
##$DPNAME1= <>
##$DPNAME2= <>
##$DPNAME3= <>
##$DPNAME4= <>
##$DPNAME5= <>
##$DPNAME6= <>
##$DPNAME7= <>
##$DPOAL= (0..7)
0.5 0.5 0.5 0.5 0.5 0.5 0.5 0.5 
##$DPOFFS= (0..7)
0 0 0 0 0 0 0 0 
##$DQDMODE= 0
##$DR= 18
##$DS= 0
##$DSLIST= <SSSSSSSSSSSSSSS>
$$ [...]
##$SUBNAM0= <"">
##$SUBNAM1= <"">
##$SUBNAM2= <"">
##$SUBNAM3= <"">
##$SUBNAM4= <"">
##$SUBNAM5= <"">
##$SUBNAM6= <"">
##$SUBNAM7= <"">
##$SUBNAM8= <"">
##$SUBNAM9= <"">
##$SW= 18.0517328524113
##$SWIBOX= (0..15)
0 0 2 0 0 0 0 0 0 0 0 0 0 0 0 0 
##$SW_h= 3612.71676300578
##$TD= 16384
##$TD0= 1
##$TE= 0
##$TE2= 300
##$TE3= 300
##$TEG= 300
##$TL= (0..7)
0 120 120 120 120 120 120 120 
##$TP= (0..7)
150 150 150 150 150 150 150 150 
##$TP07= 0
##$TPNAME0= <>
##$TPNAME1= <>
##$TPNAME2= <>
##$TPNAME3= <>
##$TPNAME4= <>
##$TPNAME5= <>
##$TPNAME6= <>
##$TPNAME7= <>
##$TPOAL= (0..7)
0.5 0.5 0.5 0.5 0.5 0.5 0.5 0.5 
##$TPOFFS= (0..7)
0 0 0 0 0 0 0 0 
##$TUNHIN= 0
##$TUNHOUT= 0
##$TUNXOUT= 0
##$USERA1= <user>
##$USERA2= <user>
##$USERA3= <user>
##$USERA4= <user>
##$USERA5= <user>
##$V9= 5
##$VALIST= <valist>
##$VCLIST= <CCCCCCCCCCCCCCC>
##$VD= 0
##$VDLIST= <DDDDDDDDDDDDDDD>
##$VPLIST= <PPPPPPPPPPPPPPP>
##$VTLIST= <TTTTTTTTTTTTTTT>
##$WBST= 1024
##$WBSW= 4
##$XGAIN= (0..3)
0 0 0 0 
##$XL= 0
##$YL= 0
##$YMAX_a= 118797
##$YMIN_a= -159094
##$ZGOPTNS= <>
##$ZL1= 120
##$ZL2= 120
##$ZL3= 120
##$ZL4= 120
##$ABSF1= 10
##$ABSF2= 0
##$ABSG= 5
##$ABSL= 3
##$ALPHA= 0
##$AQORDER= 0
##$ASSFAC= 0
##$ASSFACI= 0
##$ASSFACX= 0
##$ASSWID= 0
##$AUNMP= <proc_1d>
##$AZFE= 0.1
##$AZFW= 0.1
##$BCFW= 1
##$BC_mod= 2
##$BYTORDP= 1
##$COROFFS= 0
##$CY= -3
##$DATMOD= 1
##$DC= 2
##$DFILT= <>
##$DTYPP= 0
##$F1P= 0
##$F2P= 0
##$FCOR= 0.5
##$FTSIZE= 0
##$FT_mod= 4
##$GAMMA= 1
##$GB= 0.15
##$INTBC= 1
##$INTSCL= 1
##$ISEN= 128
##$LB= 0.25
##$LEV0= 0
##$LPBIN= 0
##$MAXI= 10000
##$MC2= 0
##$MEAN= 0
##$ME_mod= 0
##$MI= 1.114404
##$NCOEF= 0
##$NC_proc= 0
##$NLEV= 6
##$NOISF1= 3.799351
##$NOISF2= 2.8
##$NSP= 1
##$NTH_PI= 0
##$NZP= 0
##$OFFSET= 14.38212
##$PC= 1
##$PHC0= -466.8987
##$PHC1= 9.992209
##$PH_mod= 1
##$PKNL= yes
##$PPARMOD= 0
##$PSCAL= 0
##$PSIGN= 0
##$REVERSE= no
##$SF= 200.129724274929
##$SI= 16384
##$SIGF1= 3
##$SIGF2= 2
##$SINO= 400
##$SIOLD= 16384
##$SREGLST= <1H.CDCl3>
##$SSB= 0
##$STSI= 0
##$STSR= 0
##$SW_p= 3205.1282051282
##$SYMM= 0
##$S_DEV= 0
##$TDeff= 0
##$TDoff= 0
##$TI= <>
##$TILT= no
##$TM1= 0
##$TM2= 0
##$TOPLEV= 0
##$USERP1= <user>
##$USERP2= <user>
##$USERP3= <user>
##$USERP4= <user>
##$USERP5= <user>
##$WDW= 1
##$XDIM= 8192
##$YMAX_p= 0
##$YMIN_p= 0
$$ End of Bruker specific parameters
$$ ---------------------------------
##NTUPLES= NMR FID
##VAR_NAME=  TIME,          FID/REAL,        FID/IMAG
##SYMBOL=    X,             R,               I
##VAR_TYPE=  INDEPENDENT,   DEPENDENT,       DEPENDENT
##VAR_FORM=  AFFN,          ASDF,            ASDF
##VAR_DIM=   8192,          8192,            8192
##UNITS=     SECONDS,       ARBITRARY UNITS, ARBITRARY UNITS
##FACTOR=    0.0002768,     1,               1
##FIRST=     0,             0,               0
##LAST=      2.2672688,     0,               0
##MIN=       0,             -159094,         0
##MAX=       2.2672688,     118797,          0
$$ Real data points
##PAGE= N=1
##DATA TABLE= (X++(R..R)), XYDATA
0@%%%%%%%%%%%%%%%%%%%nJ3j6J6j6J6j7K3l0L2l3L9m6N1n8O5p4Q3r1J02j12J24
41F6j39J54j70J87k06K26k48K74l04L35l67M05m49M96n50O13o87P75q81J011j175
62f34J391j682K096k734L816n962J1646n2763j14268J96695P0305j22786M8186
75C3306Q5491o6059j3523M8161n2157m1764M9941m5150r9556L9171K5413p3964
87a10690M8683Q4550o1986j5927P8926k14q768M4761o444l1550M958j0204j2441
100C654L6066K172q2999k2347O7361j187m0322K2372l458k2526L2339L165j7216
113b2926M4287J6934l7571J3470L5351j9672j4268L3886q691o5152j2232J9451
125a7133k2965N71K4778k1371o765L0056J0655J7846K9685j0710k6019K117J5762
$$ y = [0, 0, 0, 0, 0, 0, 0, 0, 0, 0, 0, 0, 0, 0, 0, 0, 0, 0, 0, 0, -5, 8, -8, 8, -8, 8, -9, 14, -16, 16, -17, 22, -24, 27, -31, 34, -40, 43, -48, 54, -58, 66, -73, 81, -89, 98, -108, 118, -130, 144, -160, 175, -192, 213, -236, 260, -290, 323, -364, 411, -470, 541, -634, 757, -925, 1171, -1563, 2253, -3709, 7937, -44826, -159094, 37601, 107906, -14880, 33306, 118797, 52738, 39215, 87376, 35219, -6545, 43396, -1754, -101310, -62139, -36726, -110690, -62007, 22543, -39443, -55370, 23556, 23342, 14574, 59335, 52891, 21341, 26299, 16095, 3654, 39720, 41892, -41107, -63454, 3907, 2720, -37602, -15230, -18688, -41214, -8875, -5710, -22926, 21361, 38295, 724, 14194, 49545, 29873, 15605, 49491, 40800, -24352, -36584, -17133, -40098, -39527, -14749, -36120, -42885, -12829, -2174, 15672, 45357, 34647, 8628, 10745, 26507]
138B6507k215j4329J870k181j9576j262O154n436J963l416j0427k286o875Q710
152b2799K5569K451k196M882n636J2772K2968m192j1937o596j1458j0952k301
165i425J0782l424k1400J852O644n866J9709J4935j3618L906N145j4380K689J0288
179G837k613m780m826l296j961N313J8248l221j7544M412j1l046J2008k73k910
194C337N562j0916J029J9015k252j0640k813p498o951k721L245K494o016L286
208a1839K632q213J7669J9630j1690J49Q495j2505n18J2287k362q718o426k200
222c609l753j755J0029Pj2853L311m63p654J5129O700j1541O081P516l503J908
237E550P526Q307o094j5374L77m6o771L123m388q245L999n11K277J1578M132J982
$$ y = [26507, 24292, 9963, 11833, 9652, -9924, -11186, -5032, -10468, -8505, -11921, -22348, -24634, -31509, -22799, 2770, 5221, 3025, 7907, 2271, 15043, 38011, 33819, 21882, 15286, 3828, -7124, -9425, 1357, -2067, -23467, -21615, -14971, -20837, -1128, 13807, 189, 4095, 9240, -5140, -2451, 7837, 5224, 444, -4382, -7678, -9639, -4326, 13922, 10701, -6843, -2431, -2442, -5488, 6520, 6247, 3337, 8899, -2017, -988, 18027, 15775, 5135, 2322, -5176, -12127, -14848, -11603, -9109, -15125, -11839, -9207, -17420, 249, 19879, 8189, 8338, 16833, 4328, 3810, 16097, 13735, 5017, -1409, -3609, -7362, -9117, 912, 919, -11934, -8623, -9086, -16740, -1611, 5089, -6452, -371, 7145, 3642, 5550, 13076, 21383, 15289, -85, 292, 246, -6525, -3402, -7790, -16035, -12036, -12547, -10270, 1308, 5440, 7422]
253G422j658o415O921N583n981J055k449o742O28M63K657J976o808r13k226p783
269a4270P146N155m612K064N57K29R892M577R38L096l154k691m560m022N808m555
285A598j3309J437k67k843O943K545M04J980k581L135L327R41N520l836o128O086
301D952J646j482M740k348n465j822l820O1m89l435J788n424n000J0740N400o45
317f03O003N62j237J883k45K520m8n946j349n161k045P690j981n055L366j761
333c407l386K765J126K369j331l546L925M66J587Q080j288l372K483k105l69J616
349E613m605k701k379m409J560M8K683N502n817j800R046Q24j394L299q73j599
365B998l207j012N314J79k185P49n890j185O388l552k442K791l420k087P44L557
$$ y = [7422, 5764, -651, 6270, 11853, 5872, 6927, 4478, -2264, -1636, -1173, 1484, 3460, -3348, -4261, -6487, -14270, -7124, -1969, -6581, -4517, -3960, -3731, 6161, 10738, 11676, 14772, 11618, 8927, 4367, 345, 6153, 1598, -11711, -10274, -10541, -13384, -6441, -3896, -3492, -1512, -4093, -958, 2369, 3310, 8830, 4994, -1134, 4952, 6598, 5116, 9856, 7508, 2043, 221, -3599, -3538, -4027, -7462, -5674, -11098, -16098, -5358, 42, -603, 5400, 5962, 4725, 6608, 6363, 8883, 8835, 2889, 1540, -3621, -5666, 2024, 43, -5012, -1646, -3407, -6793, -4028, -2902, -533, -1864, -5410, -1485, -1019, 568, 8648, 7360, 3988, 6471, 4366, 3997, 5613, 1008, -1693, -4072, -8481, -6921, -6873, -4190, 1312, -4505, -6305, 2741, 3565, 2171, 5470, 4597, 2998, -209, -1221, 4093, 4272, 2087, 2836, -3054, -4239, 2149, -1403, -3845, -1054, -4474, -6561, -5817, -2260]
381b260N592j774j055L835l166R67O023k996k712j522m368N03J196j528K398j394
397b261k934J702N95M600L154n613n19L082j462J455K186O4Q10m782l244N111
413A944j46j054j27n264j454J782n31L542K301p34k76k594L439O126l206q03J801
430D746o484j004M553j402p18P4j704j21j589L149M127k820q99q29l243M575M503
447D914m672N06J148l307m54K414K650k55o510j033K260j154L599J910k810J540
463G46k34j117M073J266n12j453m855m47J862j576K851K96n631N61J813Q18L207
480A668P6m40j157l715L757N024k301j7j40l714J532J329j439O77j248l204k328
497e640q62N447K334m140J979J426k918M118L841L2q49l987j371J014p31J721
$$ y = [-2260, 3332, 1558, 503, 4338, 1172, 2139, 8162, 5166, 2454, 932, -3436, -2933, -1737, -3265, -867, -2261, -5195, -3493, -2898, 1702, 4856, -757, -1276, 1806, 344, 1799, 3985, 4049, 4859, 77, -3167, 1944, 1798, 744, 617, -4647, -6101, -4319, -4850, -1308, 993, 259, -17, -2611, 828, 6954, 3748, 2945, 4746, -1738, -2742, 1811, 409, -309, -235, -1939, -2060, -3649, -500, 3627, 807, -92, -921, -4164, 411, 4914, 242, 748, 1896, -1411, -1865, 549, 3199, 2944, -3566, -4599, -2339, -3493, 106, 2016, -794, 746, 512, -605, 3468, 4734, 4222, 2769, -2086, -2533, -671, -2247, 604, 900, -4731, -4170, -2357, -1539, 1668, 1744, 1304, 147, -3568, 189, 5213, 2912, 2895, 2755, -959, 573, 1902, 463, 1140, -108, -3312, -5640, -6502, -1055, 1279, -2861, -882, 544, -2374, 1744, 5585, 5617, 4768, 781, -590, 424, -307, 1414]
513A414m41n437K44Q51K63L544M85j283P35k007n5K750R90K628j244m820K162
530G79K727j456J174l89m424k343j566J516K546l81p09j918J84O630J381j916
546A835M091j263m029J250R49r18P47k481j802k394o04L644Q5j16J55l584K27
563d208M495j86J443K442m201j677L979J612J808j679l628k73n90m19j51j055
579b288Q80j098m567L486K924k6L461k03l142K066K08m93L244q93l915j938O37
596a657K486l83l60R34m312j588N610q45j297K790j912j376J982K67J060K170
612C569k91j720k805J210K625k717o8J048m367j144K143J297K830p59l317J735
628g31J899K47J933j394j390n35j697J196J679l93O69j781k037K271l76k71K247
$$ y = [1414, 973, -4464, -4220, -3369, -3106, 438, 923, -360, 375, -1632, -1687, 1063, 2053, 4681, 3437, -1383, 779, 3506, 2050, 3224, 2835, -1589, -3932, -5498, -3982, -1436, -1817, -2526, -4444, -4260, 2370, 3751, 1835, 5926, 4663, 634, 1884, 2833, 1915, 2662, 181, -1621, -4015, -4619, -975, -890, -1006, -851, -4435, -4208, 287, 101, 1544, 3986, -215, -1892, 2087, 3699, 5507, 3828, 200, -73, -663, -1082, -1233, -2288, -1408, -2506, -7073, -3587, -663, -689, 2772, 2569, -573, 1493, 1701, 1208, 4452, 3559, -356, -2294, -1657, 829, 446, 86, 1020, -3292, -4880, 730, -115, -1412, 1378, -534, -1910, 72, 339, 1399, 3569, 3278, 1558, -1247, -37, 2588, -129, -197, 851, -3516, -4660, -2517, -1220, 1610, 851, -2466, -731, 1168, 1415, 3348, 1954, 564, 29, -1668, -472, 1207, 814, 1483, -298, -2335, -64, -440, -711, 1536]
645A536j952k363J546q6J024K165j13q01k029m2K950j25n57J67k984j08K179j435
663a028O34K033k345o92l4J481K192j291p51R60k086j93K294j081O26J6k312K06
681a371J020J083J375j736j361Q07j315J418J834j924j14J073k278N93J816P49
697A669o89k398j92J346l97N89J202j652J031n48j472K636Q63j769j83o52M51
714a65O62p20J036k2k198N22O58o46J493j18j091M76j108Q04K261q66o55N45j337
733d69P10P07q26Q10n38j634k99K58K029P1k698J185J776k588J422J428o36K58
751I66j145p27J837J32l44k18j212Q31k56j251J782J75k440J038j40l20J505P
769B20N03J7j223Q13J289q29M12k59j518R79r08o86J656o83r03J19l52J899m64
$$ y = [1536, -416, -2779, -1233, -1319, -295, 1870, 1757, 956, -1073, -1115, 1835, 1710, 1153, 1320, -1664, -1772, 407, -1028, -394, 1639, -706, -1398, -1432, 49, 2241, 950, 199, 1159, -927, -1120, 1174, 93, 719, 735, -1577, -1371, -351, 732, 2107, 371, -990, -183, -1498, -80, 1754, -170, -284, 789, -1489, -896, 920, 1669, 980, -1418, -1610, -264, -661, -72, 1130, -522, 509, -39, -1511, 1125, 1988, 219, 36, -616, -165, 497, -223, 813, 791, -1407, -885, -227, -873, 620, 502, -589, -113, -1221, -417, 1844, 978, 323, 868, -469, 241, 948, 122, 932, 394, -1240, -1539, -1281, 748, 819, -1879, -694, 1082, -1506, -84, 1344, 708, 966, -179, -906, 931, 1063, 719, 501, -711, 120, -136, -1387, 395, 570, -1870, -832, -972, -1292, 213, 220, 723, 740, -483, 330, 1619, 790, 1202, 943, -575, 404, -504, -1190, 466, -217, -1120, -1001, -1353, 546, 82]
788H2j566J954K65j677P89Q73J21P33j349J12Q15j081J135p02j395P37j099q98
806b151J659k99m57L85j13O29J236k32J145p82j241J366j11j140O77o29q90N38
824d10j439Q60J202p15k05m48J44J464q55k20J960m87r17Q32J09O95K89j906M12
843C65n38p32R92o16r67J033r62J5J615l75O27J97o01O44K30k73J335j569j078
862f58J861j324q02J335n30m05o39p04J283O86o09O95o56q1J180p46N71J814j420
881H51n18J16l33P67n50p55O68r52r19J074R8K07P14j046K69N49j57J087n00q41
901a71M23o63L12J251j194m79J263j460j77O57N69N41j464p68J397m26J55J115
919H81q49Q5K32r74P83Q19o60m32q13M84Q20m98J25J063j641N0O61k50N83N65
$$ y = [82, -1484, 470, 735, -942, -153, 720, 841, 1574, 225, 337, 1152, 71, 1206, 504, -891, -154, -1253, -2151, -492, -791, -1248, -863, -976, -347, 889, 657, 1802, 1020, -221, 1145, 1034, -106, 571, -58, -948, -410, -1849, -989, 213, -502, -707, -1155, -1011, 453, -402, -622, 1338, 851, -66, 766, 875, 1570, 1859, -47, 365, -173, -905, 87, -529, -1496, -463, -1425, -1410, 205, -170, 457, 654, 53, 697, 927, 654, 1989, 420, -658, 1203, -121, -923, 412, -118, -523, -1162, -1866, -583, 103, -506, 189, -467, -548, 632, -114, 457, 2271, 851, 333, 449, 116, 883, 333, -422, 246, -706, -1625, -551, -453, -246, 468, -578, -309, 240, 83, 1170, 670, -171, 252, -411, -99, 1152, -42, -521, 742, -718, -895, -238, 331, 872, -592, -1360, 37, -389, -234, 881, 32, 117, 349, -625, 158, 977, 317, -115, -928, -444, 376, -122, 3, 1066, -575, -525, 136, -114, 469, 1034]
939A034j224k51j55K0J142l28m36M25j126K89R73q18R53L33j521L58J69N32O35
958A004r21p08R44r04l8R48k70J55n81q37J072N65N7N20r46m81P44p07O81P14
978A011j060l70L83q82M69O81m5k74j007j7J097n56O99N67j054M9M20j61J368
997A318l2r86k90l20N11o9o65P51l50j452P56K88L45R51o42p16Q28L3K9J012n96
1018G04m48k84n55J141l02l62M35m50r36O27n6P70J15j479N73O46r26P53J246
1037A212n70N0q25o1Q65j86l31k56p77N66l04l45J214L77j561N53K48k04R88n20
1057A33Q5j0q41K84N29nP12q01j108R77k23L72P65p71q71K14K33K69j9j6P15o16
1079Gm13P04M11nj07q46l88N58k85P3N99n46j71l07J08J114j59k89J00o95K02
$$ y = [1034, -190, -441, -596, -576, 566, 238, -198, 227, -899, -610, 363, -455, 498, 831, -690, -332, -163, 369, 1004, 83, -625, 319, -585, -623, 325, 55, 210, -371, -1208, -136, 429, 486, 1006, 60, -421, 323, -384, 297, 1011, -49, -419, -36, -918, -449, 232, 187, -87, -1094, -1111, -14, -570, 129, 696, -358, -309, 111, -50, 1318, 1286, 300, 10, -310, 201, 132, -533, 218, -132, -1584, -828, -540, -195, 756, 114, -602, 226, 259, 288, 1300, 704, 256, -28, -583, 558, 256, -106, 329, -121, -1057, -430, -486, 284, 399, -1080, -507, 139, -787, -34, 1212, 642, 692, -133, -194, 671, 485, 154, -102, -879, -313, -617, -962, 252, 629, -932, -379, -131, -335, 653, 133, 218, 208, -633, -349, 180, 175, 887, 86, -1022, -45, -268, 104, 869, 98, -773, -559, -326, -57, -76, -92, 623, 7, -406, 298, 709, 704, 597, -249, -637, -79, -364, -291, 308, -238, -409, -716, -608, 506, 347, 58, 158, -537, -335]
1100c35L45l2K37J18r57O91j71j82J199m47l07j08p96P02P4j41p2J19o50L22M9
1121c42N41L33k85o69K27L82K15Q2o02P38l88j033J427l00r1K77j097n1R82o64
1141c18M10k46k93K97m12J38P60j01p0N92q41R2O39m54K13j12q70N43j29r5J67
1162i0j00J27j25m01K29J054o39j93K23k33P22m81O5P45o56q01O14o1k56L36k88
1183b09K75n47q1O73o5j34M56n94K45M94m33L91J16n45o6K26k68L83n34j22K85
1204e4n21k3L94J84Q3m7m64L23M95k31J83K92p17M37n14j4P18n54r4J66m05L81
1226A8Mp9j11p2q5N35j02NL89m53K67j99m86N96R8n06L36l37k34L48J6m1P78r74
1250b89J59N79j90J27l62j15r4o6k9L24l03k6L20n43Q29M05o47J84k72k01J78
$$ y = [-335, 10, -22, 215, 333, -624, 67, -104, -286, 913, 466, 159, 51, -745, -43, 31, -110, -182, -63, -713, -391, -342, 199, 532, 247, -422, -195, 187, 402, 484, -118, 620, 232, -801, 626, 326, 235, 512, -585, -636, 346, -318, 92, -154, -447, -150, -562, -424, 336, 235, 165, 757, -84, 8, 647, 193, 406, 294, -576, -33, -162, -257, -90, -190, -63, -188, -589, -360, 694, 55, -138, 85, -148, 574, 93, 158, 903, 247, -554, 60, -1, -257, 79, -209, 66, -481, -562, 111, 46, -88, 368, -226, 19, 513, 80, 471, 587, 42, -24, 202, -66, 317, -217, -339, -54, -575, -598, -204, -20, 63, 16, -448, -125, 370, 139, 322, 614, -103, 334, -180, -194, 524, -30, -124, 42, -363, 18, 22, -57, -168, -240, -325, 210, 108, 113, 502, 49, 316, 117, -369, 227, 325, -181, 155, -182, -416, -68, -52, -93, 685, -289, -130, 449, 259, 386, 24, -91, -185, -251, -280, 44, -259, -285, 35, -508, 321, 726, 79, 263, -9, -210, -32]
1271c2L1JL10m78K93Q1m35J15L03m57J11j47J1P78k99k98L15k94J96J36k69L57
1293C29O6n14K13n8p4l4k14k98N37m42m0O04j32L49L53o55M96m8j08J13k64l32
1315a53J59q2m31J71k65L19k71k00O80J34l67L23K15r5K70n6j40J1p2J47o34R6
1337b41M42j23m92o1K18l67K90q5L64L62l24P5N83k61K34k18m41N73o59L85J93
1358D47p27L3K16k30J99k3m66M56j22l69J055j10j14M6k74K80M2p9R6j13Pj21
1380A29o10m6N02ln99K86J04K72K43m54N48R7n26M31j11l26K35p6Q6k84j43N18
1402B73Q7n89oK19j54J57k48k2L87j15j45J41lJ53%n23N19j7m32M92J69m23R5
1425A5m36M2O81k62k94M31m77K04l01L37L84l76q1K85j71k79K36K16J06m4p00
$$ y = [-32, -1, 0, 310, -168, 125, 206, -229, -114, 189, -268, -157, -304, -293, 485, 186, -112, 203, -91, 105, 241, -28, 329, 395, -119, 94, 36, -38, -72, -286, -584, -47, -489, -529, 75, -57, 292, 645, -10, 486, 438, 330, 443, 179, -153, 6, -76, -507, -336, -601, -282, -553, -753, -73, 61, -306, 17, 232, 137, 407, 351, 211, 222, 150, 297, -337, -241, 201, 78, -414, -475, -257, -624, -334, -419, -55, 307, -17, 58, 641, 380, 614, 396, -45, 528, -131, 254, 447, -280, -247, -31, -261, -62, -85, -551, -95, -217, -586, 469, 359, 245, 291, 17, 297, 339, 260, 356, 243, 250, 129, -481, -527, -25, -28, -627, -341, -237, 35, 278, -176, 372, 469, -57, 374, 263, -63, 172, 96, 182, -102, -245, 273, 360, -229, -235, -16, -170, -13, -261, -283, 104, -11, -156, -15, -18, 135, 135, -388, 131, 114, -318, 174, 343, -80, 15, -421, -379, 302, 40, -254, 177, -300, -96, -397, -60, 324, -52, -133, 152, -19, -298, -62, 154, 260, 216, -484]
1446d84M47J66Q0j21j80q7M9p8Q0L16R2m28J96l94K05K41j69L57k37j43L36j93
1468E1J96j32j86K7L0k94l8K66j45L5j57RL90j64J18L14k71j95J81OM26k87q7
1491I3k7R2l79K63J69l19j07n07L58J45J07j46L34j85K39j30K84M04o89J25J26
1512B50m7l09P3nl1o4m98L49K65L21l13l47L87K1k7k5J52n78M35J65n01M94j52
1535A5l02M83l05n42P18J8P5k17j08J6K19M5K33j37k8J7l25J74K98j78l27Q2k22
1558b98J47M7J17j70k4k04J51J48m9K06J89l86k26K25J42n0R3J94k76Q8o8j31
1580a35O17l69l97J58J86m17K50J16j81L95k20q5Q9M6k6p2m02L29M35o47P49k09
1602B10p5oj85k55N11j12m05L47k92K57K45l06R8J6j58K4O4J77k2k47K82j28k44
$$ y = [-484, -37, 129, 209, 88, -92, -179, -130, -208, -128, 188, 280, -148, 48, -346, -141, 100, -69, 288, 51, -92, 244, 51, 247, 115, -71, -44, -14, -308, -346, -80, -225, -190, -347, -338, 52, -112, 6, 320, 49, -146, 35, 41, 467, 180, 93, 66, 158, -221, 42, 211, -108, -215, -722, -364, -219, -112, -258, 76, -109, 130, 0, 284, 688, -1, 124, 250, 203, -106, -33, -38, -69, -133, -631, -282, -17, 304, -9, -356, 31, 52, 25, 0, 152, -426, 9, 174, -327, 167, 15, -287, 196, -109, -651, 67, 85, 160, -57, -165, -149, 70, 115, 348, 211, 183, 200, -125, 49, 347, 169, -158, -76, -298, -151, -104, 13, -157, -181, -385, -234, -86, -135, 71, 260, -126, -352, -127, 15, -35, 58, 252, -24, 64, -4, -135, 482, 113, -284, -126, 60, -357, -107, 9, -172, 223, 3, -82, 7, 53, 27, -45, -447, -118, 317, -330, 419, 210, 135, 129, -56, -311, 200, 88, -317, 30, -262, -5, 240, -66, 32, 48, -110, -86, -22, 155, 133, -114, 168, 40, -204]
1625b04L60J38k64j64J76l42K51L30k21K1m33J76k59K46J23K06j7K25n01j70M35
1646A12j21m8K10l70L22k44L1M4L36p91K50J50QK83j60K22Qj16J38l20j35K90
1668I9J5j06L61m53j92k0K74n1k95q5L01J43m9M5J17l29M15J83m18L31k71j42
1690a27J99l31L72l7O2p6l05k63P46n9l36J64k52K96k29K26K17j03j1k89O44n69
1712f1N5K05l19J6j06O5J58j08J12j10j5J34J63j35Q8m7k78J62J21m8Q3l8j70
1735g3L88l19J78r8o9Nm21J81K21K7j29K44j99o7Q5K27l2J96m30J35o6J22N1j90
1759c3J75q2j82M11Mk08K62n97J29K15J7k47M1K04J5J11j92j34O0J4L03k93L5
1782B8M7l51K91K18n04J36K49m12K62K55m66L56j34j6K93l65K71J40k09K37k60
$$ y = [-204, 156, 294, 30, -134, 42, -300, -49, 281, 60, 81, -352, -176, -435, -189, -66, 140, 123, 348, -153, -323, 112, -9, -57, 153, -217, 105, -139, -108, -64, 272, -519, -269, -119, -111, 172, 12, 234, 242, 126, 264, -56, -191, 99, 114, 8, 369, -84, -276, -296, -22, -73, -368, -453, -152, -9, -58, -13, 104, -225, 190, 373, -45, 286, 15, -127, 72, -259, 113, 76, 138, 62, -243, -506, 240, 181, -155, 9, -243, 53, -176, 50, 267, 164, 153, -136, 508, -61, -6, 199, -120, -104, -210, -145, 13, -95, 17, -93, -108, 26, 189, 54, 142, 95, -183, -21, 100, 52, 135, 97, -73, 315, -4, 174, 76, 7, 12, -409, -228, -7, 20, -109, 135, -64, -131, -46, 181, 149, 345, -85, 50, -16, 106, 157, -33, 142, 60, -122, 289, 293, 85, 347, -250, -121, 94, 111, -136, -95, 109, 124, 235, 43, -91, -31, -17, 286, -7, 28, 75, -276, 15, 233, -271, -135, 114, -298, -36, 219, -247, 109, -25, -41, 252, -113, 158, 298, 89, 326, 66]
1803F6j62J51M3j98oK7P9r8j44L4K61j76K79K7k32k1K72m7K6L38p81L16o9k21
1827b36K48R4j52j91J64J91k97L9K37j01k2J3J05nK38j41K5L18n82J35k58k49
1849d27M11K19k81n2J52l3K62k89K58l98K52m1l5j46K25J56l81L43k38n0J49j88
1871a32o5K00J25k01j78L8M0K10k89M22p5R6q0j90L00Km2j07o4j45J60K36k63
1894bm2kK15n22K41n0M02m06J81K7k68K03J16j36j2J35K9J42k45J9j27M3K00J36
1918B77m52L1l4J3J98j61QL82m35L68k98J2M81j85n02K77L50l73J00lj66K39k49
1941a22J70r7k8J12j23k54M40j70m1p4r7J29M15j36q4j98j02L98k97J96J84m7
1963A74m62J92j12J28m8O7J4J53q0L7l0k0pj62OK05O8J24q0k65l6J99l9J09k4
$$ y = [66, -96, 55, 98, -100, -106, -79, 0, -98, -242, -208, 53, -123, 156, 183, -49, -70, 202, 155, 181, 519, -262, 54, -15, -236, 12, 106, -46, -237, -73, 118, -179, -140, 97, -4, -26, -13, 92, 87, 325, 184, 209, 527, -55, 80, -178, -427, -16, 203, -78, -130, 22, -11, 251, -38, 220, -178, 74, 33, -2, -148, 77, 233, -148, 195, -43, -93, 56, -132, -197, 3, 128, -73, -251, -213, -173, 37, -252, 170, 95, 191, 111, -79, 221, 223, 181, 74, 10, -135, 25, 261, -2, -44, -46, 169, -353, -112, -162, 240, -166, 15, 42, -226, -23, 93, -43, -55, 80, 109, 251, 6, 25, -102, -59, 141, 277, -175, -144, -178, -165, 33, -128, -120, 262, -173, 195, -103, -91, 390, 205, -297, -20, 330, -43, 57, 54, -112, 127, -122, 48, -49, -77, 35, -88, -342, 98, -72, -113, -187, -284, -155, 260, 124, 40, -158, -260, 138, -159, 37, 221, 174, -288, -96, -208, -80, -128, -61, -47, 106, 26, 63, 33, 13, 6, -156, -150, 55, 123, 247, 167, -98, -134, 65, 26, 135, 111]
1988A11l77K76M9k52M27j77l57L02J56k11J52J62k89O2J20j3r0k53N05k03l4j89
2010a23k47L70L4n3N1k60J13l8R1J31k85J85J49k08OR8K27k13o9o2Q3K6k6Nj06
2035a21P6J9P3k08Q6k50J93J35L5nQ1k96o3L48j61k22M27l71K77j14K10m39K46
2058d4J7N4kk94P0j21K90J74j68j21M47n52L21L1m3j71K15L4j99k97L25m7j46
2081b27L2J81P0J93k67K28m36n4N14j22j16K58m08q8N9n5K33J76l15JN65l79k45
2104b02K85j0J6j57L6p4n7p8M53m72J0M27j18j16L90l70j30QJ39p6K1J20K2j85
2128a18P7j44M2J86K39n6q3k18j42M33j25l05J96k27j0L51m50M57N7j67q6J30
2150C7j37K99j89K76r0j48k74K87m14M56j13K14p0j26j49N5P6j32J68j47J19k24
$$ y = [111, -266, 10, 59, -193, 234, 57, -300, 2, 158, -53, 99, 261, -28, 34, 154, 141, 51, -202, 303, 100, 66, -123, -370, 0, 34, -19, 32, -228, -115, -153, -62, 69, -216, -31, 118, -90, -84, 14, 241, 28, -41, -103, -20, 6, -20, -15, -121, -45, -26, 47, -161, -75, -325, -132, 3, 38, 33, 114, -182, -245, 103, -58, -280, 147, -224, 53, -61, 149, -290, -44, -27, 27, 25, -269, -199, -320, -30, 144, -24, -145, 302, -250, 71, 102, 59, -112, 103, 137, -62, -359, -34, -81, -227, -195, -14, 56, 249, -18, 210, -226, -280, 234, 112, -4, 254, -154, -242, -183, -238, -5, 171, -144, -143, 422, 43, -202, 83, 73, 89, -68, -32, -106, -163, -241, 212, -260, -250, 177, 59, -57, 333, -37, -167, -159, -20, -96, -75, 45, 67, -118, -41, -185, -143, 43, 282, 226, 143, -75, -217, 216, 91, -214, -18, -245, -255, 96, -354, 103, 160, -7, -93, 37, -100, 199, 10, 286, 196, 48, -226, 61, -353, 103, -10, 204, 134, 8, -141, -86, -10, -142, 26, -121, -2, -226]
2172b26Q7N5K69j44k46M42o6p9o3j4K37m8l32MM3K99k57l3K31l1k1L7k15K80j91
2197A8J72k4j36j93K50l78N00k32L14k67K09m28r4L01o9J53p5L2k04R5j43L19
2219A20k54J60O2r9J28O7j61j06r4N3L98j45K48m92j2j75J26K42l08J73Q0j81
2241a70K14L4j62K80k99J51k72L65k42Ro0J24j57N7p7K6M46l13L26j28m86K97
2263c7K38r1p0P1j54j29K76j92o2J16M3j48K12k18K66J22o18J76K80P4%J96j40
2286B11J9j12K8j01j29OK69j80M3P4J2k87m2K47k03K07k21J29o7J52m2N4K63j51
2310A79j72N6j10L5K81Lk50k7Kj45M1q9J32M5k46J83J59r5K3o6m6L3O2n0o5K85
2336A58q5J7m87K54L58L2m91L19k45J43p5K51j82OJ52MJ03j30k56J40N8r5k7Q5
$$ y = [-226, -139, -84, 185, 41, -205, 237, 171, 92, 29, 15, 252, 204, -128, -124, -81, 218, -39, -72, 159, 128, 107, 144, -71, 209, 18, 190, 166, 30, -163, 87, -291, 209, -23, 291, 24, 233, -195, -289, 12, -57, 96, 21, 53, -151, -56, -199, 120, -134, 26, 88, -11, 117, 184, 23, -83, -177, -124, 274, 129, 377, -115, -127, -302, -176, 66, -242, -69, 11, -170, 44, 78, -84, 196, -103, 48, -224, 141, -101, -92, -152, -28, -185, -128, -205, -179, 267, -46, 280, 152, -334, -37, 201, 110, 40, 111, -43, -172, 104, -88, -150, -34, 9, -139, 73, -145, 121, 243, -375, -199, 81, 155, 155, 351, 211, 230, 118, 146, 45, -84, -78, 191, 11, 54, 128, 140, -147, -189, 58, -145, 62, -159, -30, -97, 55, 13, 67, 330, 179, 7, 63, -47, -12, 269, 272, 22, -5, -3, -148, -107, -196, -64, -19, -265, -82, 77, -18, 5, -61, -107, -74, -12, -62, -127, 158, 73, 90, -397, -143, 215, 247, -244, 75, -170, -27, -102, 149, -33, -27, 125, 129, 232, 102, -154, -14, 44, -51, -78, 7]
2360GL13n18J93q1K00K63j75l28J66q6R1o0j33K67l66J53N6J09J70k06q3L96k34
2383A14K3r2o7Q8p9k9j2j69L10L9m55M85j90q1K94j1j06j37L10m88O4J09K2r8
2407a56J31j2Q5k62J54k42L61m7J00J46p5j36j67J12n3j32L8n3K2J02k15J58K61
2430A20j10Q9k92K39N9k57K02O2k41J95J8l04O32m94J32j46j3K95j74l64M01n3
2452dJ5O3J13k05j75L19l94J30Q9j35K01J28j11n2J00k13J56K7N5j30j83K02n4
2475e8J98j84l6m8J4O0p9P8K32J81k42k52J36o6K4OJ05K9K5j74j55L30k93P1m5
2500a43nM1r2K63O3r4r9Q4J45j1R0j11l8j21K21l47K21j08q7N06m35R4m0J54l37
2525a86m6L42j51K50m8j6j87L8j33mM89o11M67j39K6P7P9m73L28n6J12J09k92
$$ y = [7, 320, -198, -5, -86, 114, 377, 202, -126, 40, -46, 45, -15, -148, 119, -247, -94, -38, 71, 241, 35, -48, 348, 114, 137, 45, -22, 66, -13, -42, -54, -223, 87, 126, -329, 156, -34, -115, 179, 168, 62, -75, 235, -253, -189, -80, -58, -156, -25, -37, 48, -214, -60, -302, 59, 12, 112, 258, 183, 47, -120, -8, -61, -193, -155, -208, -186, -84, -299, -141, 120, 10, 99, -193, 46, 105, -152, 50, 112, -129, 66, 84, -220, 412, -82, 50, -96, -109, 186, 12, -352, 49, -4, 11, 74, 187, -18, -193, 126, -268, -138, -49, -184, 17, 145, 34, -18, 82, -131, 25, 52, 107, -23, -206, -4, -58, 140, -44, -80, -128, -114, -54, -133, -55, 177, 358, 116, -136, 0, -66, -42, -36, 69, 98, 123, -51, -206, 124, -169, -98, -143, -148, -107, -199, 64, 127, 33, -66, 18, 163, 152, 242, 131, 93, -28, 193, -154, 67, -41, -128, 378, -57, 37, -3, 151, -186, -232, 110, -41, 209, 161, 145, -42, -4, -137, -141, 348, -263, 204, 65, 91, 168, 247, -226, 102, 46, 158, 267, -25]
2548b5j26rM54k09J3m0j25J18J39j81o8o0N3J74j91K79j64J01n2k1O7l24K79K31
2572C13m00K29M2n30N02m36L12k32K17j4o7r9J78J74j61j44Q2J74k27J0J08l1
2594@l9n7L42m19M43l26R3l08O41j88j15m38O23m88L28j24J33q3j46k84L75J5
2616b2M42l69k26K54j70J59oJ74j85K67l89J4K05m0q0j8L39m91P4k8K2M42n73
2639b05Q8L25j95j12J07K3q7j32L21k56K83J01k14p0j0L4n3K84l67L08j62m8J37
2662A00P1l2l38J9L51j85n8J33J04l04L90n45M72l12n6L76n32L78J93k32j56j37
2684c00N45l72O8nJ13J75p0j55j60K37J47k08j23KK44j61n3k24K42J71n3j14k52
2707c06L81N7j79N5mJ58k38M2l47K83P0K78j87p2K29l4j10L9N6j69j0K82p9k38
$$ y = [-25, -151, -160, 294, 85, 98, 58, -67, 51, 190, 9, -59, -119, -66, 108, -83, 196, 32, 133, 81, 60, 127, -197, 82, 313, -87, 142, 184, -346, 156, -280, 32, -200, 17, 3, -64, -163, 15, 189, 28, -116, -34, 140, -87, -77, 31, 0, -39, -96, 246, -173, 270, -56, 37, -271, 370, 182, 67, -371, 252, -236, 92, -32, 101, 18, -128, -412, -37, -22, 420, 51, -175, 79, -91, 68, 62, 236, 51, 318, -71, -57, 148, 108, 28, 10, 349, -142, -68, -96, -74, 368, -205, -117, 208, 13, -99, 8, 31, -56, -188, 133, -123, 160, 261, 47, -23, -33, 1, -52, 232, -135, 173, 11, -37, 100, 171, 139, -199, -180, 171, -14, -72, 61, 165, -139, 251, -294, 178, -134, -190, 186, -346, 32, 225, -7, -163, -300, 245, -127, -59, -64, 49, 224, 154, -1, -161, 76, 223, 15, -108, -106, 138, -23, -76, -300, -58, 113, 60, -54, -306, 75, 132, -47, 8, 4, 162, -76, -34, -381, -98, -28, 250, 63, -9, 220, 186, 76, 115, 171, 2, -8, 274, 195, -43]
2731d3k63L44R6k9o9p8K09J09r5k66J85r0N2m3L2j3Qo7p6P5pm5J42n7M8k13o4
2758b18M3N8P7J24l77M31k6r7q5k32L4M02l07J48K01k47K74j85o7k2l5K94j27
2781F1J22l85R4L03l57K99j31K1P0j19J38l05K07J09k20j6J09J44k55K11j52K5
2803b7M6o6k48L92q4m8O3k51L22J53l48L5j20K58k3k50K07K2R1J12k70K8r6P1
2827c1K0r7M5O5J69j67l0R1j31J48N5n5l25J13L62l99J98J53o3j79K27j63K78
2850B84j44j81k58N09k24P2J8m7Q4l63J05Q2No4L82k64j16J33k0rJ26j09p2J91
2874A20j30k98L43j63K56j50m7K18k24j83K85j14K68l0l00K93j7j46Q2j09K62
2895B16l69J93J62j92k85J36p8L9L15K96m91L27j57o7Nk9nJ6k17K80j48J46J55
$$ y = [-43, -306, 38, 134, 105, 36, -42, 167, 276, 181, -85, 100, 10, 62, 19, 51, 38, 46, -21, -97, -22, -29, -74, 68, 11, 59, -154, -218, -175, -117, -40, 84, -293, 138, 112, 15, -70, -302, -268, 134, -173, -25, 176, -71, 203, 18, -49, -71, -106, 188, 61, 183, -202, -108, 195, -162, 137, 6, 27, 97, -22, 116, -189, 18, 127, -93, -109, 0, 144, -111, 100, -52, -27, 19, -47, -295, 97, 13, -35, 28, -223, 99, 252, -96, -61, -181, 77, 54, -196, 11, 33, 124, 236, -34, -6, -102, -31, -11, -108, -63, 2, 171, 4, -26, 65, -66, 82, 137, 82, -243, -130, 232, -167, 31, 184, 121, -58, 169, 6, 284, 140, -41, -299, 210, -14, 58, 76, 29, 113, -250, -145, -63, -58, -122, 260, -4, -120, 13, -7, -16, 110, 1, -71, 120, -10, -308, 35, -128, 128, -22, -69, 149, -75, -258, 27, -87, 181, 151, -149, 144, 127, -19, 63, -46, 216, -153, 40, 202, 10, -275, -139, -217, -178, 137, 433, -58, 269, 112, 45, 50, 21, 16, 32, -185, 95, -53, 93, 248]
2918B48n77J64K18J3l99M08p8j2J70l12K89m2mk47M25m43K35o4J1J19j11m7r8
2941a34J68R8j96L42j75k28%J84l5j72J44K66j21j76p9L32j10j22j05J01J6K33
2963B31j7k22mk49K27N6J58l7j08j33J39O4j70j47J31r7J38j61R0J55j31K8L01
2986B42p7q8m5j13J56N3J30k73n2M1K34k22k4k31K18M2J8J1m1J12j03l12J80K8
3010a16j14R7L13l2J05j0l0j70k4m9o8l3J50L0j15L60j18k63j0k1L43q6j33J30
3034A36k21J86j94o2P9J20l16K55L40k50k13J12k9j12J32p0P6K0NM3l6m5r0J20
3058a4Qj29K80k72P1J1o0K8O4n1M9j95L20L7n9j37K2J02l6q7q4J63r9J63k32N8
3084g9k0J79K8J05m62K81J82l80mL16k22m9K29l52J11K75j50o6K42j11P3l06J08
$$ y = [248, -329, -165, 53, 66, -333, 75, -3, -15, 155, -157, 132, 90, 86, -161, 264, -179, 56, -8, 3, 122, 11, -36, -134, 34, 132, -64, 278, 103, -125, -125, 59, 24, -148, -4, 262, 141, -35, -114, 218, 108, -14, -119, -18, -2, 231, 214, -8, -12, -261, -34, 22, 180, 143, 35, -98, 41, 105, -65, -212, -81, -178, -40, -201, -111, 44, -87, -59, 242, 165, 77, 32, -81, 75, 128, 258, -15, -67, -26, 208, -14, -38, -269, -51, -9, 9, 20, -21, 91, -12, -324, -144, -116, -230, -133, 180, 148, 253, 243, 213, 43, 19, -30, -98, -131, 19, 49, -66, 294, 176, -87, -97, -118, 225, 139, 6, 136, -85, 101, -93, -155, -76, 44, -272, -17, 323, 73, -140, -28, -57, -169, -37, -107, -31, -11, -6, 37, 1, -44, -134, -14, -6, -135, 145, -127, -56, -45, -105, -77, -13, -64, -15, -210, 110, 147, 88, -49, -27, 75, 39, -48, -132, 31, -68, 95, -137, -79, -99, 80, 108, 213, -249, 32, 214, -166, -170, 146, -76, -125, 104, -248, -137, 138, -12, -78, 164, 53, 126, -180, -72]
3107g2ko8L33k52O1n4J72j22p3K06%k21J02j02J10R8J73l85K35K20k26m9k15J20
3131a1M32o33L56J78k55j44K87m00l6L48p9J06l62L21j46J04J18j63q7K06j86
3152d6k07J13J10P8J06j96J29j4K94n03J37L7k76J14J49J13j09J31j99M2R5j37
3174c9K68l67K13k08K24l37J79M4J03nP3r1j52p1N2K26k47L98n56J38J39K1j98
3197a93L63j61j91J53J31k49J01N3J23m3Q5m4k24K27j24k12J31P2k8M26m30J02
3219F8j08K6K34n7l16K51j77J58p8j27K61l14J47j41L06j58Q4k11Q5K72l36L70
3241B39k94j14J72pK04j13j2k27L02l29L18M1k41J56k24k21M55K69m08J5j32K63
3263A12O1j90L07l59J44k28J74Nj40J13n2Q0k04P8J6j8k9L01k68q0L75l51J83
$$ y = [-72, -74, -142, 191, -61, 0, -54, 118, -4, -77, 129, 129, -92, 10, -92, 18, 116, 289, -96, 139, 359, 133, 84, -131, -11, 421, -212, 144, 322, 67, -77, 210, -190, -226, 122, 43, 149, -213, 108, -38, 66, 184, 21, -66, 140, -46, -253, -140, -30, 48, 154, -42, 87, 73, 367, -136, 1, 38, -238, -124, 25, 138, 29, 160, -39, 3, 98, -39, 229, -138, 75, -133, 91, -246, -67, -23, 80, 75, 148, 57, -95, -166, -114, 112, -135, 263, -293, -155, -16, 5, -193, 170, 9, -182, -29, 102, -147, -46, 7, 130, 87, 172, 128, -96, 131, 7, -205, -74, -2, -30, 396, -34, 68, -40, -14, 220, 163, -153, 98, -79, 79, 1, -126, 135, -179, -32, -173, 133, -25, 59, -152, -67, 205, -131, 239, -55, -169, 3, -4, 200, 87, 75, -152, 150, -179, 139, 180, -61, 95, -129, -350, 105, 374, -34, -19, -151, 112, 173, -17, 290, -69, 75, -153, 21, 26, -114, -1, -53, 27, -177, -99, -83, -101, -130, 171, -97, -177, 198, -153, 30]
3286C0j01K79k30j53J21J09J5k91K67q6p1K4n6K78k05J64J80m06R4N55m56J53
3308B14m2j23j87Q6P1K60j57p8n6J1j80N3J41j31K35k08J57k44J88k4j01L39l09
3331h5KK48j61n5j92K69n8J20j85J41j65J33j52p5L28j89J32N9j03p9L12l28J40
3354E7j58J03N6P0K26k18j9J81j90K0j51K57j71M0P3j88L3J21l2m5P0k52J63j89
3378a43J80K2n2J32j33j16k3M31l58K97l68k79N94j82R6n7K0j08p9J23Q8k40L55
3401B00k88k58M09l35J86L29j24R4m08K55j11k19L73q7l1j83L73j28j30K07k14
3422i0J6j10j7L73k84K27j58L10j63O7j47l1P0k46J85J97l25l0K53j87J07J49
3444A66l04M1J11K9O7j33R7r5L6l7J23m3N3k44L30j17q0j47l1O8L4L8q1L17k10
$$ y = [30, -71, 208, -22, -175, -54, 55, 70, -221, 46, -40, -111, -87, -143, 135, -70, 94, 274, -132, -38, 517, 61, 214, 172, 49, -138, -52, 19, 279, 122, 44, -12, -1, -181, -128, 13, -118, 117, -91, 66, -178, 10, -14, -115, 224, -85, -83, 165, 4, -51, -243, 26, -32, 88, -97, 44, -121, 12, -140, -215, 113, -76, 56, 115, 12, -67, 245, -83, 57, -101, 2, 58, 128, 354, 136, 117, 298, 108, 128, -23, 234, 63, 103, 176, -12, 21, 142, 110, 65, 135, -117, 46, -143, 37, 59, 7, 139, 6, -110, -133, 298, -60, 237, -131, -410, 184, 2, 98, 41, 61, -47, -126, -3, 85, -155, 200, -88, -346, 63, -272, -86, 243, 119, 213, -195, 60, -51, -270, 103, 16, -15, -198, 175, 47, -83, 124, -90, -74, -184, -201, 172, -112, 115, -43, 267, 104, 171, 24, -7, 63, -183, 2, 199, -126, -156, 97, -90, 17, 166, -138, -97, 14, 43, 110, -23, 74, -21, 15, -22, 101, 58, 111, -133, 197, 80, 0, -147, -178, -110, -76, -38, -119, 198, -12]
3469a2j10l0J12J02j04Rn3K13k01N3L8j25j18L59j5L2k26R4K15m95J18J70J43
3492A69l39M2j5K06O6k08J34l6K6l17R6J30K38k33q5N5j7J06j79L13k60p0K90
3515A12qj22L6q8Q2n8J93l13L06j53j28K19P1j65N7j90J18R9j20L32m43J78K43
3538B58l05p9J83NJ58m3m17L65P9j84J59k67J27j98m0L10j23L15j38l62O9m6J44
3561c0j50M88m27K85k36J27j44Q6l9j89N9L53m02K10L4j31J11K40j30k29J51r8
3583f1k33M50j57k10qK60o5R8p1m4Q4j42K26j14N3j14j81L30J0J22j19j17P8k07
3607a32J18J42l6K9R2k25m3p6L39l21J63N7k3j8k6k53K52O5k72J44k73K2L03j3
3631A5R0O4k22j58K81k39L4K27K02j68l09k07L40J90k95l4L73j49K0M9R6j09K11
$$ y = [-12, -122, -152, -40, 62, -42, -33, -86, 127, -74, -21, 17, -108, -226, 133, 118, 150, -76, 18, 233, -262, -144, 26, 169, -170, -128, -143, 63, 129, -79, 55, 19, 45, -272, -176, -46, 192, -41, -126, -71, -88, 18, -161, 152, -108, -178, 112, 104, -18, 18, -70, 12, -46, 147, -166, 140, -13, -141, 78, 149, -16, 41, -149, -31, 68, -52, 280, -163, 15, 258, -47, -126, 57, 62, 220, 177, -240, 125, 204, 20, 179, -88, 39, -159, -199, 111, -12, 303, 165, -197, -128, -174, -30, -180, 308, -119, 166, -70, 57, -87, -1, -40, -229, -170, 183, -219, -9, 25, -106, 5, 245, 115, -114, 37, -61, -294, 156, -1, -211, -219, 41, -24, 74, 3, -41, 43, -99, 127, 13, 66, -48, -229, 101, 111, 233, 114, -3, 75, -132, -14, 128, 92, 121, 213, -12, -55, -131, 208, -113, 50, 107, 84, 66, 40, -213, 39, 104, -168, -24, -297, -275, 28, 15, 105, 169, -53, -211, 70, -169, -135, 92, 294, 126, -183, -390, -50, 140, -155, -189, 184, 35, 55, 104, 200, 91, 302]
3654C02r6l42N09m98K25j63m7j79P04l19o7J26j58l4J47l21L03k74J63K5R4J14
3676B14m8j50Jk21L40k27Q2L95k33k12p3L9M97j17k38Q3n6P0n5m7R7j87Rp0NQ4
3702a8L35k31J63j14nj39J34j89K5J40j26K32l24mk9J34j40J28K53l41K19o6m4
3725gj10j02J42R3K3l06K29j6J16j78J61l3J41m5k83N7K23k76K10j05j27J49l1
3748g5J25O2q5j90J53M7Q7j16j65K15k53J76N1K7j17r4K02j52Q1k52N3K16p4L9
3772c9j35K79N1l58L16R6k70M4l7j3l0K13j10p0K05l92K49j38K55m36K02K58o7
3795G3K40m72K22j03P4j4j26N82o02K19k68L16j72j53j37N89m82J42r8Q7J45J98
3817B60k88K92l55J59M3k13K68k57K48j33l20M61j32j4K06j63J68k71kK42J6k00
$$ y = [302, 206, -136, 373, -125, 100, -63, -110, -289, 415, 96, 29, 155, -3, -37, 110, -211, 92, -182, -19, 6, 100, 214, 166, 16, 17, -204, 136, -91, -9, 386, 153, -59, -132, -93, 404, 287, 49, 132, 76, 146, 91, 44, 141, -46, -37, -107, -102, -18, 317, 86, 249, 135, 130, -9, 125, -64, -39, 101, -25, 207, -117, -121, -150, -16, -156, -28, 225, -116, 103, 37, -7, -117, -219, -77, 16, 39, -267, -38, -54, 62, -116, 45, 12, 153, 108, -175, -118, 105, -171, 39, -66, -193, -44, -75, 50, 112, 27, -163, -10, 37, 124, 8, -157, 58, -195, -19, 32, 59, -58, -152, 50, -102, -21, -273, -220, -4, -78, -39, -174, 105, 156, -202, 114, 210, -60, -16, -53, -66, -96, 117, 7, -63, 142, -250, -1, -139, 116, -320, -118, 140, 73, 313, -159, 63, -40, 34, 20, -106, 476, -126, 93, -175, 141, -31, -184, -321, 268, -214, -72, -170, -83, 62, 260, -28, 264, -91, 68, 111, -102, 166, -91, 157, 24, -296, 165, 33, 19, 225, 62, 230, -41, -43, 199, 215, 15]
3839A5l6J39l18j0J71L39j59j89J26k25L57j63q5K3r2J95j58l5L6j9L09m57L04
3862F8j49o1L02k73K78mm55N0M45j65K64k09Kk57K15o7J46qk31KJ25L8l5K46l71
3887a04J26o9l27L70Jj82K27j0k68L85j69j63L68o22N47j20p8J11L18l05q0K15
3909A71l36L29Q5k01l5k37P5L8m4J37o2J67m25M40k63MJ89j71M14l62nJ04j29
3932a17l6J80kQ9j26M0Nj87Q3L39o5k85J21j9j12k1J40k69kN55k32k46K30j44
3956h1K4k16J60K34o5J18j37L5j20Q7J9L5j4k13q5J41N8n0L7J12j96O0j26L74
3980A91r1k6K1j89J82k3j19M3P0k64K81r3r4j38L86k65j13L37k5J1K37l83J10
4003D6o3k3J01L21l29q9k50M36M3k15l88K19K65m71O19j39j87K24q8M5j40mJ23
$$ y = [15, -21, 118, -200, -210, -39, 300, 141, -48, 78, -147, 210, 47, -38, -15, -107, 88, -70, -105, -69, -88, 221, -236, 68, -81, -142, 160, -113, 165, 161, -294, -244, 201, 36, 300, 91, 93, -164, 51, -16, 130, 122, -109, -107, 18, 56, 21, 267, -104, 22, -47, -374, -4, -3, -185, 42, 32, -236, 149, -20, -183, 185, -437, 110, -10, -88, 23, 341, 36, -44, 171, -165, 164, 249, 48, 13, -224, -149, -111, -155, -18, -80, 87, -338, 102, -161, -157, 32, -139, 275, -87, -92, 12, -117, -153, 27, 25, 114, -12, 28, 33, -154, -71, 268, 203, -82, 39, 20, -92, -113, 27, -242, -244, 311, 79, -167, 63, -81, -57, -273, -113, 121, 56, 174, 37, 72, -48, 39, 58, 93, 79, -134, -219, -78, -20, -70, -33, 79, -117, -57, -183, 191, 100, 74, 95, -94, 88, 65, -54, -11, 59, -205, 76, -17, -111, -249, 137, -128, -241, 96, 71, 82, 319, -64, 46, -17, -40, 61, 382, 53, -36, -286, 150, 193, -22, -410, -191, 74, -397, 222, 83, -104, 120, 32, 77, -63, -67, 56]
4026E6J3j9p6J6k21L06l03j8L64p1j6j14L6k2l6J12J59k36p5K80J66l67l5J05
4050Dk58L71j13j65L6N9N6R0J5k18K34k04K10K32k92j38L8k78K66K40j69K41k92
4073c5k56L16n1J07j75J52R3n53L66L6nj52K91o1m5j4Q7j44M12j59j21j19J35
4096A05M6m3q8j02J13j31K87j83k23M10j44J1j26j12J97k11K88p9j8nM2j12L48
4119B70j90J03l36m2K27m4j03L35l36K94q3q9r2O6J41k32J6J89j00j97O9M26j51
4142A41P2k0m0l5J80m96LK77l9j08j00K07k06J31QO1k95L00k94m8J98J61j75J28
4166A1O3j35R3k19L30j42O9l8J32P1j26L8MJ07l63K8J4K80j05j78J3N3j05j29
4190b34L89m9P2o3m82M30J38J4k36j12M12k42K68l40j81K50%J96j38r7J65n1j17
$$ y = [56, 69, 50, -26, -10, -231, 75, -228, -246, 118, 47, 31, -83, -47, -69, -105, 7, 166, -70, -145, 135, 301, -66, -101, 4, -254, 117, 4, -161, -125, -66, -10, 80, 95, -123, 111, -93, 117, 349, 57, -81, -43, -321, -55, 185, 16, 257, -35, -291, 25, -26, 81, -94, 58, 151, -402, -36, 0, -5, -157, 134, 73, 28, 14, 101, -43, 369, 210, 89, -30, 105, 151, 108, 20, -82, 31, -100, 187, 4, -219, 191, 47, 58, -68, -180, 17, -194, 94, 15, -3, -8, 34, -78, 270, 80, 183, -153, -195, 32, -12, -115, 220, -116, 178, 95, 6, -86, -20, 121, -111, -95, 94, -6, -203, -134, 292, 141, 213, 193, 153, 118, 298, -198, -195, 82, 43, -65, -165, 42, -164, -33, -25, 36, -259, 41, -253, -301, -103, 58, -117, 11, 74, -61, 32, -187, 143, 1, 70, 32, 164, 235, 109, 147, 151, 258, -105, -77, -63, 217, 112, -66, -53, 0, -105, -234, 155, 106, 178, 115, -367, 63, 201, 215, -21, -133, 279, 37, 305, -35, -216, 34, 34, 230, 92, -5, 160, 109, -8]
4213hJ46m7j00k7K8J33J87k32l5pM1l22J41J15J36q2m7K70l03J32O1j96j91J54
4237e3R8l70Q0J30K15J37k34j50J4J32j1J48j50J62k03P5r2j6M6k2N9l4R3k00
4261a46K7J68o7N0J6J43j98R4m11O3L44J08j62j19K04K4j8p7l75J62K87k45L53
4284B25k41J41k4j21P6j14K03l9j31LL25j86k04J93j93L86j40j77r8K95k77O5
4306c3J04j94O9O4J68j17k01M8l5N1j02N17m36j98L91J29k47r8o7P8l5J5K27p6
4330B2J1K10j35k93r9L36J59j99Q5k06L13j80n2Q4j23n9J44j36J41j81J24J59
4352A25j24N4j84P5j49k9N2j18M09k84J32J39j89J53O6k09k3J90k02M2o2R5K05
4375A64j92M4l4q7j61L43q2K1j84M39j59l30J60K11k10L67k64m9j14J24l0k4J52
$$ y = [-8, 138, 91, -9, -36, -8, 125, 312, 80, 45, 38, 79, -243, -102, 13, 149, 67, 20, 290, -13, 119, 180, -16, -207, -53, 45, -325, -245, -115, 100, 237, 3, -147, -133, -1, -12, 136, -14, 148, -55, 20, -72, -88, -42, -64, -5, -39, 54, -146, -119, 49, -18, 32, 48, 191, -7, 87, -324, -261, 83, 191, 29, -90, 114, 138, 120, 43, -332, -170, 117, -128, 225, -16, 125, 101, -20, 56, -58, 145, 106, -25, -22, 303, 117, -87, 106, -87, 299, 159, -18, -116, 179, -98, -33, 71, -123, -54, 10, 178, 61, -140, -92, -127, -76, -178, 339, -97, -295, 96, 225, -22, -120, -187, -109, -144, -129, 98, 22, 33, 243, 108, -185, -284, 52, 211, 12, 97, -109, 204, 24, -28, 56, -67, -126, 18, -118, 23, -158, -34, 125, 1, 55, -129, -54, -203, -232, -180, -298, 111, -173, -41, 98, -91, 62, 128, -81, -104, 86, -116, -74, -136, -41, 164, -28, 16, -18, -105, -266, 77, -5, 16, -168, 271, 112, -218, -58, 153, -57, 310, 46, -3, -117, 7, -23, -47, 105]
4398A05o5J0K43l51k7J84J16j85J44j71r1J30Q7l48K03Pj4QP1J8J59j39k46J91
4422C9k23J69R6P8k35Q8J3O5j54p4Q0K0q7M7k38L73%Q1l05K78j19l3J29o8K3l1
4448A2j97n5L80j42R1l66L32k7L04l33q4K49l06K98j40K2N4j48K05M02k79j94
4470G8l1j80L5K42n50L62Q1J55r5qJ25k88J98m23L9K63O3l2P1j72n6L82l03J01
4494E7J33M0k55j07K28k4n4P2l88L64j1o3k76jO7L00l7k65N8J03O8K80q4j45q4
4519b4m2M0j30k0LK22P0j85N7l41M12M1j35J83j27j47J08N9P0l56L16j97J63R6
4543A36k24J35j35N7j47K60l00P09o55O4J26J08l5k2j11O6J8m64M49k33J94K5
4565B1j97K78j07K4M8p2J75j08k80P0J28m6o1L3q6L29k83Q3J73J79J9m42J05K7
$$ y = [105, 40, 50, 293, -58, -85, 99, 215, 30, 174, 3, -88, 42, 129, -219, -16, -9, -23, -15, 56, 74, 233, 94, -152, 39, -184, -15, 81, 159, -76, 12, 25, 90, -64, -138, -58, -38, -125, -78, -316, 57, 57, 138, -167, 111, -8, -41, 88, 20, 43, 12, -185, -240, 140, -2, 89, -277, 55, 28, 332, -1, -85, 164, -142, 156, 16, 38, 92, -56, 149, 551, 272, 78, 47, -133, -98, 144, -406, -44, 37, 192, 97, 89, 214, -74, 124, -299, -260, 3, 66, 34, 105, -67, -123, 259, -44, 57, 190, 230, -25, -132, 96, 72, 18, 90, -298, 66, 55, -8, -284, -285, -218, 82, 45, -220, -162, -59, 9, 289, 205, 60, -24, -66, -26, -156, -176, -173, 49, 119, -66, -9, -350, 62, 103, -32, 151, 24, -123, -15, 44, 114, -242, 74, -123, 40, 136, -88, 47, -88, -31, -178, 82, -218, 491, -164, -100, 26, 134, 99, 77, -34, 32, 50, -414, 35, -198, -4, 21, -176, 102, -5, 19, 67, -5, 170, 62, -218, -148, -20, -66, -127, -94, -180, 149, -134, -51, 122, 301, 320, -122, -17, 10]
4589A0K6J27k34J2M06k89j25j8K68l81M66j23j35k13M43l18j45L92k11J92k50
4610a00P3Oj55K28mQ8R8j23m8K9k89K67j32O1J5Mj47K51K60n6l88q3K64n8J53
4635B14qJ78l10J12k3k27o8J01J41j99o7L13p7J3o3rQ7k10L94l22J80m2n8l3M8
4660F5n3L1l20L48Jj84J82l41M49j74j89M48j87K1J41p1q8l1r8oJ43J51J7m90
4684b35K58o7J60K6k6k59K9J11j15P0J16Q1n0l65M70n9l74J75j1J58j06J32k22
4707a03n1K31J89j46kj78j22L01k74%P7J82K29n26J73j05K37k07N7L13j55l52
4729b32J35J97l74j29L81K8J06K24j07k0j98k56J50J55j47j15J91K57k72k10J52
4750h4J24j64om0K86n2N7p5P4k21J43j74L18k48j14L62l15K11j02O7n0K20j64
$$ y = [10, 36, 163, -71, -59, 347, 58, -67, -85, 183, -198, 268, 145, 10, -203, 240, -78, -223, 169, -42, 150, -100, -27, -21, -176, 52, 48, 136, 234, 111, 63, 92, -197, 70, -62, -1, 14, 18, -129, 122, 382, 326, -62, -145, 119, 61, 214, 206, 384, 74, 186, 163, -64, -132, -31, 110, -89, -156, 157, 80, 93, 30, 21, 108, -102, 292, -30, 150, 108, 50, 17, 65, 12, 43, -277, 71, 72, -112, 70, -271, 178, 4, -185, 263, 76, 97, 238, 167, 79, 48, -50, -56, 87, 238, 255, -235, 23, -44, 116, 142, 116, -143, -114, -3, -118, -48, 68, 149, 99, -266, 204, 145, -229, -54, -65, 93, -13, 119, -103, -154, 77, 266, 120, 118, -60, -182, 119, -155, -155, -78, 104, 333, -193, -20, -125, 112, -95, -38, 275, 120, -232, -97, 100, -274, -403, -22, 6, 112, 336, 229, 209, 11, -245, -95, 60, -87, -202, -11, 246, -26, -236, -84, 40, -124, -130, -170, 116, 64, 121, 46, 120, -101, 42, -132, 186, -62, -176, 186, -129, 82, -20, 47, -3, 217, 53]
4773E3k04n0O6J30j78K36J21j04o8O7j60N9j26J11J8J23k5J86j40R5j61M1j27
4796c7Q0j62LK18K81m2l45N8j86K52l62K57p1j50J15j1L25l07J99k43J35M6l20
4819b67L42k70K17J72q9j49j2K34q4k80O5j6J03j17K17L0n9R5j50Q1L5k6p1l88
4843c87L42K09k29J6j83L44J6k8K6m3j35n5k7j9J97j49L1R3R0j34p8J9Q6J51k43
4868i0Q4rQ5l0J23k02RJ64o6j84J62j69J92L0k47Q3K56N4l77J02R1j5k8l5q4J14
4894A3K05l65R9R3k43J94j1k05J41K23p3m4J72j12k06L6O3r9K15k96J20n1K58
4917A27o5N0m4k14p9L95k00J00l27L09j25k33K71K4O5p1k21K30K15l73P8j32J78
4940d2k36J89o4L2L42o3j53J61l15L62k45J14j13K3j16J31O2j70j35J44L45l09
$$ y = [53, -151, -201, -135, -5, -183, 53, 174, 70, 2, 69, -91, -32, -158, -47, -29, 94, 69, 255, 115, 210, 49, 90, -37, 43, -119, -116, 102, 383, 341, -4, 54, -132, 120, -242, 15, -56, -206, -91, -102, 223, -84, 115, -128, 7, 53, -267, 75, -195, 22, 194, 105, -44, -56, 178, 94, -186, -121, -137, -34, -151, 66, 96, 37, 132, -18, 63, 98, 72, 1, -387, -45, 164, -65, -49, -232, 112, 128, 100, 126, 83, -52, -107, -134, -153, 44, -105, -74, 19, 109, -25, -103, -84, 2, 153, -90, -6, -15, 70, 40, 163, -39, -30, 134, 68, -116, 46, -123, 69, 99, -148, -65, 191, 245, -132, -30, 61, 46, 18, -17, -101, 13, 218, -147, -48, 45, -198, -4, -15, -220, -79, 144, 71, 27, 199, 87, -119, -83, -20, -119, 96, -200, -80, -131, 127, 62, 112, 68, -146, -225, 170, -30, 70, -257, 52, -73, -306, -35, -11, 54, -17, -238, -8, 207, -166, -88, -220, -42, -278, -89, -153, -121, 221, 158, 5, 166, -149, 213, -32, 82, -31, -8, -124, 7, 69, -101, -236, -92, 253, -56]
4962e6R6O0k70j76q4L08J52j03n3L8J21J8j84J59%k31r7K66N7R4j28R0j0j08K5
4987a6k71K00p7k7j24K60q4L02j0j49j59J87j38l61K28K94k90K73l30L47J0L5
5009A00m14K56l4N8P6j41K60m07J19p0K43n4L2L7l04L06j04k74L36j00k8N0J59
5032A02k52K37Ml26J39K24l30J25R2R9j09J00j93ML72l2j50q4k08P8J62j19J70
5055A05K55j74l33OJ54M8j17J04j10J37j48l4m9J11L54k88o2j34K19L8o0O6k66
5078a78K30J81l94L8r7J94k1N4QR3j2m5j72K75j71k3K24l10J73j2Jj3j47o5J07
5103h2K02k28l5K71M7l14M50m3m29L25l52K9K16J74k54J0J53j94L8j41K88M4r
5126A66k7m15J07Q8l8o9J05J8K16N3j72q8J74j68p8L62l13QJ17K9j83k76N76j89
$$ y = [-56, 40, 100, -170, -346, -430, -122, 30, -73, -126, -88, 33, 51, -133, 26, 26, -205, -302, -36, 21, 115, -13, 77, 67, -41, -16, -287, -87, -164, -191, -315, -55, -139, 163, 153, 4, -155, 32, -106, -467, -239, 55, -235, 38, -292, 55, 65, 100, -314, -58, -92, -34, 42, -99, 161, -246, -127, -197, 46, -8, 24, 61, -243, 63, -41, -315, 21, -79, -107, -57, 102, -150, 87, 91, -235, -96, 128, -202, -77, 15, 114, 5, 105, -88, -84, 288, 256, 106, 22, -186, -108, 54, -65, 105, 360, 186, -147, -141, 13, 61, -56, 48, -62, 75, -73, -107, -156, -45, 309, 21, -41, -175, 44, 82, 22, 88, -178, 52, 233, -161, -123, -220, -26, -47, 7, 15, 108, 96, 51, -121, 154, -17, -40, 184, -126, 47, 35, 36, 23, -124, -189, -82, 120, -108, -143, 128, 175, -139, 311, 268, -161, 164, -188, -159, 57, 231, -23, -13, 140, -54, -16, -157, 131, 175, 166, 139, -276, -169, -81, -119, -188, -83, -65, 151, 204, 32, -56, 118, -50, -128, 234, -79, -71, 46, 75, -108, -384, 192, 3]
5150Cj50J21J4J93L0l09J65K62l16j25O8J44k15J76j51n7K64k56L07k46L64p6
5172B10l70J60j99K12J04J01k58J1KL42m32K7jk54N31l19J63j94O1N2k78K97j09
5195a41M43m23K09j12J04m18L80j40L00o09L97O7J74k13L0j42j39N28l84L1J35
5216G7j72K41j49O5k35j79N43k5j19l85L17m8L30j61j01L18l70oj41K17J53j69
5238AK5n4J74m3j66N5N1j33NR7M8m9k13M03J1j27pl81o0q4M85j17j06L25P2o2
5264A50j68J36K19n17J07L10p7J6P8j95l5n2J92j50j0J45k73K63L5J5n8q8L2l14
5288b39K80j83j23K48j03L0j15m5K21k70M10k6k47J51Qj20L10k01L54m85K61N1
5310A67k72K86j00j47n45N25J1J32o0K40J0m96K17K20r5J77l89K39K7j78q0K01
$$ y = [3, -147, -26, -12, 181, 211, -98, 67, 329, 13, -112, -44, 100, -115, 61, -90, -147, 117, -139, 168, -78, 286, 210, -160, 0, -199, 13, 117, 218, -40, -29, -27, 315, -117, -90, -91, -345, 186, -133, 30, -164, -103, -51, -329, -32, -141, 302, -121, 88, -24, 80, -338, 42, -98, 202, -407, -10, 57, 231, 18, 48, -94, -233, 295, -89, -58, 77, -95, 146, -3, 62, -173, -352, 191, 166, 47, -338, -21, -69, 261, 100, -1, 317, -53, -59, -200, 17, 170, 1, 26, -28, 146, 103, -63, -8, 43, -90, -85, 12, 60, 11, -202, 201, 212, 85, 78, -303, -363, -447, 38, -79, -185, 140, 212, 150, -18, 118, 337, -180, -73, 237, 160, 176, 254, 59, 24, -28, 164, 14, 4, 149, -124, 139, 174, 189, 131, 43, 75, -239, 41, -142, -265, -17, -120, -90, -205, -250, -29, -299, 111, 85, -162, -11, -3, -123, 187, -14, 340, -145, 116, 167, -105, 181, 81, -66, -611, -86, -75, 57, -3, 237, 247, -249, -32, 188, 93, 270, -119, 120, 147, -31, -111, 90]
5332I0R8m43K33K34m22J40K30j27lo1K24l02Q4J08M9q2k9rP8j20k73L41l30J80
5356a12L6P3M9J10m7r7K20j13K10l12j70J25j00J07R8l9l6J1M4j62R4j49L17J0
5380A67k49M18n08J0L45j64k17L39k36L48l23J02J36k13P2j11J63l24R7J87Q9
5401A28j60J60K0j30K0k02L57k73J12N2l52L07K7o1j31K68j03k95L25kj48j34
5423b15L96j99p4J07K24m2k15K2j93J65m1J31j21l9N4J62k82J64q6J73m5p4j86
5446b14L05j95j82N33j19l09J79qL68k25j64J00r6M6K10j20k05L61l35j0K49j30
5468C9j17K03Qm2J50k10J22k45l3J0J80m15L26j9Q2k30K68J10j8k52n8J75k45
5491b11N7R0J33k18K06k64J01L19j41k95K79k7K3r0k18L25Kj59j03P8K1Pj5O1
$$ y = [90, 188, -255, -22, 212, -210, -70, 160, 33, 30, -31, 193, -109, -25, 83, 132, 50, 21, 12, 90, -30, -303, 38, -292, -112, -76, -3, 46, 156, 109, 12, 232, 119, 329, 17, -153, -28, -128, -21, 77, 38, 2, 13, 57, -105, -11, -160, 157, 167, -82, 336, -172, -162, 183, 19, -198, 141, -95, 253, -70, 32, 168, -45, 27, -84, 79, -245, -148, 39, 128, -32, 128, 148, 18, 38, -164, 193, -80, 32, 84, -268, 39, 66, 5, -126, 142, 39, -256, 69, 67, -81, -215, 181, -18, -92, 15, 239, 197, -18, 4, -189, -24, -65, 66, -55, -94, -40, 122, -160, 4, -82, 91, 46, -28, -214, 91, -104, -286, 247, 128, -181, -2, -10, 358, 133, -31, 69, -27, 19, 229, 109, -96, 265, -70, -80, 169, 39, -78, 125, 133, 91, 241, 31, 153, -92, -125, -115, 65, -350, -24, -43, 39, -191, 77, 187, 169, -83, -141, 34, -211, -154, -64, 69, -149, 57, -207, -106, 213, 72, -223, 56, 29, 52, -38, -256, 69, 71, -88, -191, -113, -92, -85, -100, -39]
5515c9J61k14q3M83j19r9j01R4j28L61n52J69J74J8J80l32mj48P2J26J9R5j57
5538b4J3L5j74J97J8K84n11J52K7j58K09j27P8o1p1m21Q41m22K1L54k99j14K59
5561A06j92q4J49%J39J9j08l38j5K46L0L9j09J12L19m41L30k95J36k54R9J99l69
5584b82L93k58j66J01M53J8k03K36j55k40Q0l2L81m46K94k15K14K81k39q3L4k77
5606a11Q9q8J5J88j89J30l34K49j7k00K67m8r6L35j83k12L65j19r2l4q2k2J44
5629d5M9J7o7j27P5J69k8k70M6J29J12J67k60j91K05j2K6Q9k26K44j89j88L46
5652G1K8J02%j44PM3l3j33j17K60k12J36P2k7Q4j49k30K39J1l6j84J48o6R4P5
5677C9o2J95j50J0K36k44Q6k39K44M0K2j57K49j20k96K09j66J06r0j7K9j44K48
$$ y = [-39, 122, -92, -175, 308, 189, 90, -11, 83, -45, 316, -236, -67, 107, 125, 305, -27, -31, -179, -107, 19, 38, 133, -24, -11, 24, -150, 47, 65, 349, -162, -10, 17, -141, 68, -59, 19, -42, -113, -534, 307, -115, -94, 260, -39, -153, 106, -86, -170, -21, -21, 118, 137, 29, -309, -324, -78, -48, -9, -118, -6, 313, -128, 202, -93, 43, -211, -112, 87, -282, 111, -147, -313, -212, 241, 259, 56, 292, 137, -103, -23, -55, 326, -120, 174, -41, 173, 454, 215, 132, 166, -111, -22, -110, -95, 93, -96, 34, -300, -51, -68, -268, -1, -49, -145, 190, 7, -205, 160, 41, -51, -85, -167, -189, -45, 4, 21, -46, -173, -98, 71, 43, -227, -181, -52, 60, 227, -33, -224, -19, -31, -5, 84, -142, 102, -87, -275, 71, 99, 201, 201, 57, 64, 107, 74, -59, -176, 84, -128, 8, 80, 53, 137, -12, -242, -3, 8, -28, -212, -64, -130, -36, 39, -23, 172, 22, 32, 268, 24, 110, -129, 115, 155, 177, 20, 269, 149, -147, 62, -104, 2, -88, -105, -76, -220, 28]
5700B8k14J14K54j15j09j27K80k03N42l48M8p1j01j49L14m9j53L0L14j66N3l09
5722a37J10kK00k22M1j48K48j52n6J02K6N6M9l02N56l61Oj03K84k7l06L37j59
5745D0J1j06R5K35l88l4K35O2L9j72o2J92l3k5j70j28K91m1J39P8k11j85M5j06
5769a99K76n9j64L05j95j29j10P1Q5J76q4J95l06P9K46j40l1j44J7K83j13j04
5791d5Q2k69pM30o05J22N02k12K30k73N96o27p8P6L73q0j73j98K71n42N12P6J3
5814A74M6j02j66j10Q2J13j73J80K16k38l02O48l60QJ57l38n9J32J19j60J65P4
5836A06j07j48K19Q6j83K73R1l52J73m28K11k2m3Q1K28j39kj08r7L16n8r0l09
5859c02K59j82K96J90l94J95J50j78J04j27K01O5j88K2L1k65P3K15j54k75O09
$$ y = [28, -186, -72, 182, 67, -42, -169, 111, -92, 450, 102, 150, 79, -22, -171, 143, 94, -59, -29, 285, 119, 172, -137, -27, -29, 171, -51, -10, -158, 90, -62, -118, -16, 10, 66, 115, -187, 369, 8, 14, -89, 195, 168, -138, 199, 40, 51, -55, 40, 275, -113, -147, 88, 150, 189, 17, -45, 147, 114, 89, -81, -209, 82, 41, 180, 258, 47, -138, -93, -199, 77, 18, -146, 159, -36, -165, -275, -204, -119, 57, -27, 168, -138, -59, 187, 47, 16, -128, -111, 172, 59, -45, 37, -232, -239, 191, -414, -292, 210, -2, 228, -45, 551, -76, -154, -78, 295, 215, 42, -156, 115, -427, 85, 161, 174, 220, 118, -48, -158, -76, 37, -136, 44, 260, 22, -280, 368, 8, 16, 173, -165, -224, -92, 27, -133, 32, 106, -1, -149, 70, 156, -27, 246, 337, -15, 158, -270, -59, -81, -124, -43, 185, 46, 44, -64, -161, 155, 97, 7, -302, -43, -225, 71, 261, -133, 62, 212, 34, 138, 11, 212, 277, 89, 111, 142, -123, -50, 165, 11, -264, 345]
5880C45j98p6K17k11l03L15K58n80L89k48L43l84J38k3k6K17p3n56L56p5L05j07
5902B3M1j91M17k34o6j07q9L35j06J22k9o0J0M4r7m0q6J26J46k35J79l44M67m31
5926b05L97J3j01j02k42K17j65O6J93J41j50k92J53j31j25J54L09N6l33K81m11
5947b77L96k70K90r8r0p6Q5r3K6R3M0l24K61M58l54k0j43P8N9J57k55r7p3J57
5971g0J58q4J21RO9k37J99k6j27J43j17jJ28n58K52L14k30N6Q3j27Q9J72L6n8
5995A94k12lk0j85K79m4L8k0j11o1K2o0K12j76j33K85O6R9j01k45M72l43o4K23
6019A12j88opJ07l0j93Q3l6J84j97L62o3l41o9M09j67o3k01l8K03J02j57J39L95
6043C40k77n9J6q6J78J23l11L42j49j8n2R9l02J01P5j25J5L48j8k59J19j10j42
$$ y = [345, 147, 71, 288, 77, -226, 89, 347, -233, 156, -92, 251, -133, 5, -18, -44, 173, 100, -456, -100, -175, 130, 23, 64, -127, 290, 56, -10, -117, -206, 129, 23, 145, 116, 56, 66, 110, 13, -27, -113, 13, 159, -76, 103, -241, 226, -205, 192, 205, 104, 2, -240, -23, -188, -122, 71, 212, 62, -230, -77, -208, -333, -179, 130, 186, -147, 134, -277, 119, -151, 139, 41, -49, -125, -40, -133, -107, -14, 26, -298, -37, 421, 67, 47, -96, -18, 41, 198, -57, -154, -227, -70, 88, 4, 125, 134, 203, -34, 165, 139, 12, 155, 38, 37, 165, -393, -141, 173, -57, -1, 82, -45, 44, 216, 252, 194, -18, -21, -41, -226, 53, 9, 47, 27, -84, -145, -123, -183, 29, -147, -280, 5, 71, 170, 69, -176, 296, -47, -111, 112, -76, -82, -89, 18, -12, -205, -122, -158, 26, -171, 191, 128, -213, -282, 127, -40, -103, -304, -342, -139, -37, -194, -55, 340, 63, 4, 20, -66, 112, 235, -76, 266, 117, 99, 47, 146, -156, -55, 20, -105, -90, 258, 240, -19, 100, -10, -152]
6066a52P5J7L25o2j53o4k07L66l52L62J81m37K10m6o9j14l71N59M0l6k0r8L04
6089B58j88j18K76j78j13K52j75j40n9J82J12k2n4o3J37p2o8J19j4Q2j72J33j37
6112b2J72j36L4j00j02j29J89N0l9j39L02P1l8j16k79K08o0L83l25j5M7p4K1L62
6136B65k96j08K03j90N2K56l48J41m2O5j55K41q0J3k94J58j04L73j90o3L1R4N9
6159H1j30m2r1o5L52k21J64j08O6J64k88L91m01j7oJ82l80N41k22J23N6J28J00
6182C77n93L97J9k96J07J92r7n8J38l5k28j21R4J54k44K45j56j66L51k71K77k26
6204a40n3J58q9J05N7j44R6j74J76q4J44n5m9k14J60r2K0M59l25j2Q6j63K46m1
6228G2J75k81L6lQ7k65J68m2O2m8J60k65k6J58K48o2l36M41k19L38m70L39J2l70
$$ y = [-152, -77, -60, 265, 203, 50, -14, -221, 145, -207, 155, 336, -101, 109, 63, -6, -120, -491, 68, 108, 72, 52, -46, 258, 70, -48, 228, 50, -63, 189, 14, -126, -185, -3, 109, 87, 33, -30, 107, 35, -33, 86, 72, 154, -18, 115, -22, 150, 14, 48, -52, -154, -283, -94, -44, -83, -222, 80, 151, 113, -3, -282, -74, -134, 249, -76, -91, -44, -118, -97, 265, -31, -139, 64, -126, -74, 182, -166, -25, -67, -2, -157, 84, 4, 17, -277, -119, -223, 150, -40, -103, -72, 22, 81, -49, -91, -182, -247, 105, -116, 48, -60, 6, 170, -118, 273, -128, -145, -151, 31, -349, 192, -30, 93, 149, 277, 377, -216, 181, 200, -96, 11, 203, 106, 48, 186, 151, -77, -198, -104, 50, -194, 51, -105, -271, 80, -191, 86, -140, -193, -35, -124, -19, 38, -106, -10, -184, -8, -92, 52, -3, -52, -266, -106, -198, -178, 281, -44, -56, 30, -133, 113, 72, 247, -34, 2, -1, 86, -179, -11, -53, 9, -39, 121, -144, -170, -12, 236, 174, -162, 279, 60, 398, -72, 267, 279, -91]
6252i1L81k58k53J44j65j31N17k2p7j5l1k15K54q7J8L1pJ24J98l14j95P1L67l94
6276a50K81Qn77P18j03k81K62l26K52J08l85L43l96M74k36J7l91N30m3j68K91
6297B28k07k59K53M6k9K23m14K3J9NJ40k64K06r0J55J00l3J75k45k73R0J37N3
6320C9K7j15J70N9j03k85L35J6k66K23k5J17m6l50L18J86l13k2J44p7R1r4k11
6343a82O0L7J76Pl22J83q8J67q1m3K26n0k30j7L00Nj20J2j70M9K35k10J00r7k01
6368b54L17k3P2j41jL65k06k38J19J30j70jP6j90L33m2k41M8q8J5m9K58r7j75
6392a83M4R0j88K46J82k31j4J04n5r9P4J23j02Q7j6j5K02l01k52M93l91Q9r7K70
6416F0j6J06k24j32K43K59l04j19o5K28j25K35n4j68K2P7J09k43j31K49J04M3
$$ y = [-91, 290, 32, -221, -77, -242, -373, 144, 122, 45, 30, -1, -216, 38, -49, -31, 0, -7, 117, 315, 1, -194, -123, 244, -150, 131, 139, -438, 280, 177, -104, 158, -168, 84, 192, -193, 150, -246, 228, -8, 9, -382, 148, 105, -63, 228, 21, -238, 15, 61, 32, 255, -159, -136, -117, -112, 28, -236, -30, -120, 35, 135, 102, 277, 32, -241, -151, -14, 39, 66, -49, 121, 180, 77, -208, 127, 143, -123, 100, 75, 192, 146, -204, 114, 300, -13, -35, 109, 32, 123, 29, -182, -122, -85, 91, 98, -224, -41, -129, 38, -43, -86, 140, 90, -140, -157, 143, 148, 28, 40, -130, -81, 154, -56, 44, -53, -254, 63, 40, 112, -29, -30, 335, 129, -109, 10, 140, -30, -31, 45, -145, 188, 146, -95, -47, -135, -120, -169, 89, -8, -183, -139, -49, -237, 9, 191, -40, -54, 50, -5, -104, -30, 93, -9, 78, 62, 47, 249, -52, -304, 189, -202, -113, -210, 60, 44, 150, -74, -206, 37, 296, -8, -127, -192, 36, -89, 146, 92, -76, -54, 23, 132, -111, -242, 7, 111, 154]
6438A54j5k46j6J35k39J4j72J88J21K46jm35J81P1L32j37L7k74L9K33k78K58M
6461B00k77QJ80k12N9k27J20J09K82m82L80k60K96l34l34L12L63l97K95l5l11
6482b65L09R7k98K37P7l1l7j77J23j22J32l59L71Q2j96k96Q0J28J29J65N1j38
6504F2p0Q5j02p3R6O2J02j4j89j20J09k13L64K1j29j43R9K65k20p6j01OP7J94
6528I2o9P2l66M03j48j83J85k59L96j81J78k03P6j53L85k60J0P2m6J04%j77r7
6551a69L5O1K82k58j23K24j67JP4j39L86m21M10k56K28k45K35j69j35n0K72p8
6573bj1J46j16r1j72M13k16j09m1qL68k48kQ2j72M01k26O6n3p2R4L25m06K56k7
6598A79l46J49o5R5m6K07j01j3J2J50j45j03m50N72j65J17L75m79K35k33O5J8
$$ y = [154, 139, -107, -123, 12, -227, -213, -385, -197, -76, 170, 169, -266, -85, -14, 318, 181, 218, -56, -17, 216, -62, 196, 200, -77, -69, 111, -101, -42, -269, -149, -40, 242, -240, 140, -120, 176, -158, -492, -180, 183, -214, 81, 46, -265, 44, 141, -157, 80, 157, 126, 89, -88, 35, -87, 45, -314, 57, 139, -57, -353, -273, -145, -16, 149, 200, 62, -8, 77, -25, -98, -2, 60, 162, 148, -41, -161, -52, -265, 99, 120, -9, -152, -53, 212, -8, -84, -185, -179, -102, 92, 23, 95, -271, 132, -16, -199, -14, -273, 123, -58, 120, -83, -7, -160, 225, -35, -25, 47, 1, 105, 105, -72, -169, -134, -73, 209, -49, -172, 52, -115, -114, -40, -179, 207, -214, 196, -60, 168, -77, 158, -11, -146, -196, 76, -2, -13, 133, 17, -74, -246, 167, -49, -158, -199, -207, 161, -87, -89, -7, -179, 222, -4, 62, 9, -63, 31, 356, -50, 206, 179, -167, -18, -83, 12, -34, 173, 72, 59, 71, 221, 76, -27, -477, 95, -70, 47, 422, -57, 178, -55, 10, 28]
6620B8j43N8m3K33k14O0j1j35K30l0NkL09l13P7j12l03K62k62M10m11J59J48L32
6644C32l26j29M31m10J9K82k04Qq4J34L22k55R7k72K14k76j85L85R2j7l35L75
6666A98j81l5L73o00L72j90J16k01k1N96l93Q7J2p5k17M43l52J88l39K01l20M43
6688A05k56n6K4O1L09r0j47O7QR5l41J64K70l73R6K65k14J54n78L15K22J97m17
6711a20L27l38k2J18Q3j77J0K66N3Rm14J43K08j58m41M21j12K29m5k60L51P9j26
6734H4Pk18j14K92k6O6j62K3J42k94k0K29l35M21j91q5J72k24L99j06k85L16L3
6757A24k15p4K9L7K29J21j05j5k41K96j43M4q9p8J87K4k95K37q3N1j69L35l5j20
6781E2K63n6k99m7l3J15k37L18qM3K01k13Rl48L40PK75m06k83M49m3kj11j8O4
$$ y = [28, -115, -57, -100, 133, -81, -21, -32, -167, 63, 33, 38, 36, 345, 32, 109, -3, -306, -44, -306, 104, -307, -148, 0, 332, 6, -123, 308, -102, -83, 199, -5, 3, -81, 53, 375, 120, 217, -55, 159, -117, -302, 83, 175, 158, -177, 198, 17, -18, 355, -245, 127, -63, 53, -148, -169, 427, 34, 121, 133, 58, -159, 284, -68, 120, -219, -18, -338, 105, -151, -207, -183, -122, 187, 97, -50, 17, 25, 120, -221, -57, 213, -160, -64, 201, -13, 141, -437, -122, 100, 297, -120, 207, -131, -153, -35, 48, -129, -119, 147, 200, 209, -205, -62, 146, -12, -453, -32, -144, 85, 40, -220, 131, 210, 84, 91, -127, -241, 51, 25, 91, -71, -48, 94, -200, -220, 9, -326, 95, -96, -181, -9, -233, 166, 60, -225, 91, 124, -91, -165, -136, -99, 130, 251, 146, 131, -110, 186, 43, 87, -2, -80, 107, 131, -164, 73, -10, 41, -128, 207, 172, 52, 315, 259, -40, -87, -120, -5, -242, 76, 68, 111, 312, 99, 108, -240, 100, 107, 382, -24, -307, 142, 99, 97, -14, -32, 32]
6806C2o5p6J58j36P2K6N4j74Q5j61R4N4j90J65J00k09K99K1n9J17k88K51l2l95
6830b57J71J1K55l23J57J89l4j3r2l51M52l26J15J15j83J12R8j95k5K1J47N4J23
6853B21k22l09M47j46J03j91k0l4Q3k2N3l63M64j77k5Q9j31q8R6J25r3q6k6L49
6877I7p3O8j57k88J38J72L9M5j66M20j31r8J45k06L8j6K8j19Q4m4J75q8j83K40
6901A20Rl21K04r2qj19p6K53J60j58j56J88N5RK93m79L36k80p9R3K68j09J25k1
6925B15k13O5M8Ql62Q0P8L10l35j11JJ97j27J47P9j64j03J22j80L17J1k62K04
6948B5m2L10k17r6K51j25q9j53J42n0O9l7k05M22k55J0j60K80j5o9O3j76L07n16
6972c26L45J10q7p1L73m06J11J42j22N5k88K83K4l70K42J56r6K2j73m3K53L20
$$ y = [32, -33, -109, 49, -87, -15, 11, 65, -109, -24, -185, -91, -37, -227, -62, 38, -171, 128, 149, 90, 207, -81, 170, 138, -257, -86, -75, 180, -143, 14, 203, 169, 156, 64, -287, 165, -161, -46, 69, -114, -2, 96, -99, -124, -103, 44, 98, 221, -1, -310, 137, -9, 94, -97, -117, -151, -68, -90, -37, -400, 64, -113, -138, -49, -180, -268, -172, -47, -140, -226, -252, 97, 24, 92, -65, -353, -215, -43, -4, 41, -125, 295, 164, 66, 211, 5, 43, 27, 55, -64, 20, -24, 151, 63, -120, 120, 129, -192, 12, -80, -88, -207, -283, -30, 130, -28, -184, 4, 59, 68, 361, -118, 218, -62, -141, -48, 220, 111, 236, 215, 2, 67, 115, 123, -239, -159, -81, 229, -106, -217, -216, -19, -146, 1, 80, -84, -187, -65, -245, 72, 83, -179, 25, -17, 293, 76, -20, 231, 106, 17, -136, 6, -44, 25, -12, -217, 205, -50, -40, -200, 80, 65, -4, 59, -117, 190, -326, 19, 129, 42, -29, 344, -62, 49, 191, 69, 124, -164, 119, 143, -227, 15, 171, 75, 97, -76, -119, 134, 454]
6994D54l02k54K16k09k54L71k93M27j23j83M5PK55j45k50L23M8k23K75o6j5OJ00
7017B10j45n9k05K89j15J14k64M62q5k46J52l20J90k4K26k71qj6J01j65K41Rr8
7040b7k6r2K40J27k37o4R6j23j0J12J29l68K22J71k84k6J92p8J77j03j16K3m0
7063a05j46N52n28M05j45j78j15L63k23M4KJ62J15j18K02l91j46J3J0M50r0l31
7085a98J07P2P3l74K31j99L84l6J46m96L71N3r2J94n23L2N32k83j34J77j32J02
7107Gq8K82l19P6k32L15j93O7K3l7J75m3j31o7JM94l84j9L71m90K38K18k65M3
7131D2J73J79m08J6j65P9J39M3j91K4k24M14J2j27j2j91J92k7J01Q3j36P9l8l25
7155b68K89n8%k00L30j43K86j15j8m82L37J00J11k80O5J23j15J0l1J81J89n07
$$ y = [454, 152, -102, 114, -95, -349, 22, -271, 156, 33, -150, -105, -98, 157, 12, -238, 85, 133, -90, 185, 119, 104, 110, 210, 65, 6, -199, 90, -25, 89, -175, 287, 202, -44, 108, -212, -22, -46, 180, -91, -99, -115, -14, -179, 62, 71, -27, -53, -145, 95, 222, -15, -79, 17, -106, -116, -4, 125, -243, -21, 150, -134, -160, 32, -46, 131, 28, -88, -65, -105, -251, 301, -227, 178, 33, -145, -260, 103, -120, -76, -74, 88, 203, 85, 287, -104, -250, -237, -227, 223, 133, -198, -91, -19, 54, -320, -89, -288, 96, 60, 206, -290, 81, 134, 42, 236, -287, -255, 277, -6, -140, 37, -95, 7, -81, 201, -118, -42, -274, 41, -152, -85, -62, -99, 76, 33, -98, -165, -164, 330, -54, -73, 298, -192, 46, 264, -1, 42, 215, 394, -14, 2, -163, -84, 55, 98, -93, -69, -293, 121, 133, 6, -6, -197, -5, -32, 69, 152, 16, 95, 57, -268, 21, -37, -37, -237, 93, -50, 236, 121, 103, -379, -42, 58, 169, -111, -46, 77, -38, -28, -59, 122, 311, -196]
7177a96M09m8k23Q7Q5k25J01J46j86J5kj04J05j57R9J82J0l14K50J79k93%j62
7200b42L07j7j61J70j92M5K01R7OK8k6k87L1K1j03J21J51j57KK64Q4l01j12O8
7224bk10J49j10M76m34J44J43j88K6j03K0L9J91r6l81K71M0m8Nj54J46R9J43J5
7248A81k53l6K45k04J99l32J98K38k03N7Jl2l4k5m0j20J79M8j96P6J49Nj63J21
7272E9R4k13j5R0N3l27L52j48K61m38J80n6k9K94k8j78k6N6L68l46m7k9J22qJ65
7297B06p7j55J73j93j97J36K89j27p7N9L6r9M5L8o5J8o1k1Q9n7l9j17J25J48j65
7322h8m0M3M65m52R0K6k02M16l00j42J25k9J00J44r6l7k23M14k17K41k92K21n8
7345A09j64K16l68K97j98J54k0k6P5p6o6Q0j37J88Lo6o3J1J00o6k05N07p6k04
$$ y = [-196, 213, 165, -58, 29, 114, -111, -10, 136, -50, -35, -37, -141, -36, -193, -94, 88, 98, -216, 34, 213, -80, -80, -242, 65, 48, -113, 57, -135, -90, 111, 208, 214, 242, 216, -71, -40, -19, -122, -1, 150, -7, -5, 259, 343, 42, -70, -2, -212, -63, -173, 303, -131, 13, 156, -32, -6, -109, -89, -50, 141, 45, -336, -65, -25, -73, -68, -222, -76, 23, 166, 181, -72, -108, 137, -67, 132, -200, -2, 236, 33, 90, 91, 59, 25, 0, -40, -160, 19, 67, -129, -53, 96, 101, -62, 59, 153, -60, -75, 15, 68, -259, 93, -55, 206, -232, -52, -108, -137, 157, 129, -49, -75, -19, 349, 3, -44, -73, 49, 41, 206, 129, -26, 147, -46, -243, -107, 182, 55, -22, 37, 73, -26, 19, 57, -8, 10, -51, -72, 17, -40, -79, -196, -71, 77, -88, -128, -85, 380, -72, 18, 44, -158, 258, -42, -184, -59, -88, 12, 156, 60, 23, -200, 214, -3, 238, -54, 167, 109, -55, 161, -207, 90, -108, 46, 26, 0, 75, -1, -67, 13, -124, 64, 67, 1, -62, -51, 49, -17, -222, 285, 209, 5]
7369Ej39K2J17j2J46l41j56L34J67k37J74o4jl4L93m28p6j57J73J15R4l43L68
7392A20l47J65K06j63K10k29Q8k00J07J59k11J0J0K09j14J82l65M57k77J5j45
7413a13J14l7k7R4J80l98K05j97J42j58ro9J20K25j7k17M99M3m7m23k7l0J6L85
7437B54j7j44n4J01m22J66j84K42K65j25l78L54j00j30m9K14J62j12o5J2k42J22
7459a30P0M3R9r8r0J89j72J1K60n60K85J8j86K61j02Q7J64l87L67j3j41J47o0
7482F2J99q9p4l29J97J0q7R5J28j99j15K57M3k47jJ16K18m35O6j9K02j96K17L64
7506C83m27L7j11j3K62m11K35k39L2L71j04K41q1k24j27L63J22l40q7P8j24J95
7528C1K25j31k63Q4K02k16L81m21N8Q9j55J27K96l80L7o0M80m24m8K64n74M34
$$ y = [5, -134, -112, 5, -7, 139, -202, -358, -24, 143, -94, 80, 16, 15, -19, 374, -54, -130, -287, -114, 1, 95, -248, 120, -227, -62, 144, -19, 191, -38, 50, -150, -43, 116, -95, -85, -75, 134, 20, 202, -163, 294, 17, 32, -113, 1, -36, -63, 31, 211, -187, 18, -179, -37, -195, -204, -273, -153, 72, 55, -162, 337, 380, 333, -90, -117, -147, -131, 254, 237, 93, 39, 140, -282, -116, -300, -58, 207, 82, -296, 58, -42, -172, -221, -7, 155, 43, -22, -10, -252, -130, -60, -17, 82, -16, -106, 83, -89, -78, 182, -378, -93, -75, -261, 0, -102, -15, 149, -238, 129, 116, -25, 122, 62, 261, 172, 98, -231, -34, -24, -111, -16, 112, -87, -202, 55, 98, -149, -150, -34, 184, -251, -185, -204, -2, -198, 19, 383, -44, -7, -118, -131, 131, -280, -45, -284, -252, 119, 15, 256, 175, -49, -176, 187, 309, -31, -118, -40, -164, 31, 256, 125, -138, -54, 148, -68, 313, -108, -50, 39, -116, 11, 307, -73, -36, -96, 384, -40, -88, 176, -398, 36]
7550C6M9K7J13k90k2L79m28j8J12J72l2j43j37Q9Q0N8k5r5L3K6j27o4J23K73l63
7575a74K29N8L3n9j45N9k41M60j36j33j89j29J15K06J90k28P8R3j34J91l85N3
7597a88N2Q8m8K11k68k8N56k99k65j17O8K46mj14J47m54N47o1k9J14k72j71L23
7620C4N9k4k02K10j16J5M8k4M03l94K4Rk76K59olq7K25j37P1k82L21o5n4P4r4
7646a2l7R8j21OP5j41P7k2L07j62k2J35k87J04j77L07rkj95q2J09q1J22J22j58
7671d6k8K58l20J8K35N5p0J19oo8l1l38K12P1p1j87J15J09J32j41M0J26j70N2
7695F6j09L2J06j45q7J43j9k4r9K18J5m0m1j95J24K10j88K33l32J68j42K25n8
7718F1J8l54K19J77J07k08j45M05j36k17Q7P6l48J38l4J93r6r9M58l19k34j20
$$ y = [36, 85, 112, 225, -65, -87, 292, -136, -154, -42, 130, 98, -45, -182, -93, -13, 45, 20, -75, -42, -16, -143, -207, -84, 189, -174, 55, 113, 146, 87, -58, 1, -240, 220, 84, -49, -238, -367, -252, -46, 144, -84, -6, 87, -47, 144, -241, -188, -136, -48, -96, 115, -153, -181, 375, 76, -189, -306, -238, 8, 4, -110, 37, -417, 130, 69, 40, 154, -118, -289, 34, 93, 69, -133, 77, -39, -24, 24, 0, 403, 9, 33, 42, -234, 25, 19, 16, -71, 154, 17, 88, -194, 127, 62, 8, 82, -12, -49, 49, -72, -66, 9, -132, -55, -77, 230, 68, 46, 181, -106, -2, -179, 128, 119, 117, -78, -160, -51, -132, -10, 112, -46, -74, 184, -136, -118, 117, 172, 102, 221, 215, 147, 116, -222, -10, 61, -10, -197, -82, 27, 159, 18, 58, 184, 14, 66, -43, -11, 95, -50, -137, 6, -13, -37, -136, 82, 97, 57, 16, -179, -55, 155, -33, 200, -132, 36, -106, 119, 61, 79, -275, -56, 121, 228, 20, -125, 280, 144, -73, 14, 90, -258, -120, -154, 39, -57, -156, 302, -17, -251, -371]
7740c71L47k9L09l82J26j90J32J93R7l88ro1K02J69q1k97J06m8J52Q6j46J57J9
7763I3N8k11j65P1R5n9K29j84l7M69k37L5j97K13k53J38j30p3R0m8j8J01J55K
7787A37Mk78j0L06k24L37l38j70K00OO1r9r1L6J91j28j11L33J46j84j07L4k38
7810a87J44j33L59P4k35j49J10K4J42j03K4L2j04J55m73K29m4kM63n82J87J86
7832A17k24J66k57J60p1K55J46k96J17j41j06K43J87k34oJ26o7k96J39J5k1K46
7854A98j46J08l07K12K20l65%k5Q6M5M7r6j0r3J23L21m54J99j50K79k94k4p5L45
7878A44K7N2j67K40j74k91J48K4K93m43J97M7J41j05k57N6J25k43J74K46l44N2
7900e8J43l9j50J49j14j71J23L71l74J00J67K03l32J84Jl44J65p7j66Q5L2J93
$$ y = [-371, -24, -53, 256, -126, 0, -190, -58, 135, 232, -156, -165, -226, -24, 145, 64, -233, -127, -175, -23, 63, -83, 74, 93, 151, -60, -225, -154, -59, -118, 111, -73, -110, 359, 122, 157, -40, 173, -80, 58, -72, -145, -55, -103, -121, -20, 135, 137, 141, -137, -147, 159, -65, 272, -66, -236, -36, -30, 31, -68, -159, -123, 68, -60, -171, 162, 308, 124, 17, 51, -187, -43, -176, 183, 257, 22, -127, -17, 7, 149, 46, 70, 102, -2, 153, -320, -91, -135, -137, 326, -256, -69, 117, -107, 59, -198, -38, -109, 146, 292, -4, 113, -28, -134, 109, 296, 62, 56, 182, 115, -181, -42, -27, -48, 198, 52, 160, -147, 65, 285, -80, -80, -105, -19, 26, 73, -23, -33, -126, -3, 318, -136, 63, -87, 192, -102, -126, -201, 144, 171, 223, 56, 296, 122, -169, -21, 3, 296, -147, 50, 97, 238, 133, -124, -68, 57, -186, -12, 234, -110, -58, 85, 46, -104, 45, -69, -240, -117, 254, -120, -20, 147, 350, 18, 202, 203, -141, 24, -53, -219, -134, -102, 91]
7922I1l2p2J58r9j43K27Q4j69k13L0l3J44j42j36l6K47rK53k45K1L29m2j40l27
7946b54J79J86n9j47L02l29j3K3N4l56M43L6l39K93n8J8j71K62J20k72k8J45J94
7969B29k43N7J68k94K60j57q4K6Q7p1Q3n3J37j97M0R9O8j52P6q6J01k51J01K05
7993A49o7j48J37j06k70J84J5L01m00J74L08q25M96Q2q9L75m07K65O1l02P5K08
8015B16l43J70q9n1j94J72k17L71kr9K54j81J77j98J4m8Ql5p9J61m06L38R0j57
8039a28K10O3l66K40l7J39j78L4J04R4N1k76K10r9j56N19l31k0j09J95k83j34
8061b58K50m9K4j75J20r6J46k82N70k29r4o8L44m49K92p0j28K03K2oj10J74k23
8084i2R1OJ85k00j33J32R2J4j35R9N9l31K32J42j93J55k11P1o2J12l4J23m78M33
$$ y = [91, 59, -13, 145, 46, -97, 130, 214, 45, -168, -138, -171, -27, -169, -305, -341, -94, -103, 150, -95, -74, 255, 213, 73, -254, -75, 111, 52, -95, 207, -122, -135, -112, -58, -414, 29, 65, -274, 19, -39, -21, -192, 70, 190, -82, -110, 35, 229, -14, 43, 211, -83, 177, 20, -64, -38, 49, -22, 61, 8, 145, -52, -12, 87, 155, 3, 79, -7, 94, -157, -56, 149, 82, -66, 71, -35, -305, -121, -106, 195, -205, -31, 277, -548, -52, 30, -59, 316, -91, 174, 235, -67, 8, 216, -127, 43, -46, -97, -291, -119, -336, 35, 33, -66, 188, 7, 184, -14, 0, -48, -40, -75, -154, 7, -399, -61, 29, -128, 82, 145, -221, 19, -18, 121, -57, -23, 81, 175, 226, -50, 160, 61, -95, 424, 93, 73, -36, 159, -124, -258, -8, -57, -33, -208, -88, -184, -38, -320, 250, 21, -73, -141, 203, -246, 46, -24, -152, 51, 73, 67, -43, 131, -92, -1, 5, 190, -10, -143, -11, 81, 95, -40, 59, 118, -213, 19, 161, -32, 123, -88, -17, -79, 33, -1, 122, -356, 77]
8108G7n0l80L03j76L74l59K63k01J90N7q3n6J22j9j21J77k06q8O6j13J69o4J24
8131Fk40O1N69l58k80N90m56k06K37K4J10j91K28j17q4K03k29J98j6J35l76L75
8153A83k21J27j0m3Kj08j31K00l9k8L13n53M42n1n5m3j30MJ13j09K32j03j4J2
8177a0q1L6j00M8K78O7k52k21J62K2J21L4j00k41
$$ y = [77, 27, -353, -50, -226, 148, -211, 52, -149, 41, 98, 15, -41, 81, 62, -59, 118, -88, -176, -110, -223, -54, -118, 6, -234, -173, 396, 38, -242, 348, -108, -314, -77, -53, 57, -134, 94, -23, -107, 96, -133, 65, 49, 184, -192, 183, -38, 89, 79, 36, 38, -70, -201, -1, -40, -68, 245, -308, 134, 83, 28, -15, -145, -141, -28, -137, 95, -8, -22, -10, -91, -55, -155, -107, 171, 238, -14, -235, -73, -51, 70, 104, 4, -237]
8191b37
$$ Imaginary data points
##PAGE= N=2
##DATA TABLE= (X++(I..I)), XYDATA
0@%%%%%%%%%%%qJ6j6J6k4L2l2M0m9N7p2Q8j04J20j39J63j92K24k56K90l31L78
33B01m27M83n46O13o88P69q58R57j064J183j311J449j602J770j953K153k373K613
51A369k879L173l500L864m272M737n267N881o601P456q493R785j1447J3670j6814
66i338K1643l0089M9112j74045J2275K01025j59857K9786R3081l1260k1060J11973
78I3246j0460m5491L1807k319q2588M6627M7499q4201j8914P1125p0525n7175
90h1369O1233m087m9732L9272J5152k2130K0399K6112O378M2955K0273n6537k0045
103b126O9197J801o7978j834o11m5836P342R428k6358K7342K4940l5171J2294
116b7570N4492J19j2761L3002L879n2857m610M1507j2176k0004J4627k3191k6180
$$ y = [0, 0, 0, 0, 0, 0, 0, 0, 0, 0, 0, 0, -8, 8, -8, 8, -16, 16, -16, 24, -25, 32, -40, 48, -56, 64, -75, 88, -104, 120, -136, 154, -177, 201, -226, 257, -289, 324, -364, 405, -453, 504, -560, 623, -688, 761, -841, 929, -1024, 1129, -1244, 1369, -1510, 1663, -1837, 2027, -2245, 2492, -2775, 3106, -3495, 3961, -4532, 5253, -6194, 7476, -9338, 12305, -17784, 31328, -142717, -130442, 70583, -89274, -59488, 33593, 2333, -18727, 93246, 82786, 37295, 69102, 66783, -15805, 30822, 78321, -5880, -24794, 46331, -24194, -81369, -20136, -24223, -73955, -34683, -19531, -41661, -21262, 4850, 11228, 54183, 74456, 17919, -2126, 67071, 68872, 894, -940, -1551, -47387, -40045, -30617, -56975, -29633, -4693, -39864, -27570, 26922, 27041, 14280, 47282, 51161, -1696, -6306, 35201, 23025, 3021, 17648, -5543, -31723]
129c1723K2073K495j1086P913j5903k4349J5575L1026J0934k877J2039J5492o574
142B5035J788J2105q503j0209r751k0223r747o006o10J5848m205j4569N021L932
156b0094J1451K4460k588j3980K920K403J558P188J0844k996k1509j817J2094
169I934p970L119Q343k2372q305R443r270J979J7249m38l594J351K155M516L818
184I958Q331p970k3864m58O361n850P407K756p170P332J52J673K1229N57j3991
199F453K36o24k880J785K570o07q915m518K374q793N564J4065j7051r977J2602
214g716m901M70J8663K955o386J421M648M447L33N042j987j8287l642K529j0403
229a2814N473N715j5767Q25J1934k398K414R677O550l951j1489N019R463m104
$$ y = [-31723, -9650, -7155, -18241, -10328, -26231, -50580, -35005, -3979, 6955, 4078, 16117, 31609, 25035, 26823, 38928, 30425, 20216, 10465, -9758, -19505, -25511, -26121, -10273, -14478, -29047, -24026, -20094, -8643, 15817, 13229, -751, 2169, 4572, 6130, 13318, 24162, 21166, -343, -2160, 9934, 1964, 5083, 13426, -8946, -17251, -7808, -17078, -15099, 2150, 1712, -1882, -531, 1624, 6140, 9958, 18289, 10319, -13545, -14003, -7642, -13492, -6085, -3329, -10499, -3167, -3015, -1342, 19887, 20444, 6453, 6689, 6065, 3185, 4970, 7540, 6933, -1982, -6500, -4126, -12919, -7355, 6710, -10341, -20318, -7716, -12617, -12147, 6516, 9471, 3085, 4506, 9154, 13601, 13934, 18976, 16989, -1298, -4940, -2411, -12814, -7341, -1626, -17393, -16568, -4634, -7032, -4618, 5059, 11609, 7658, -3831, 1188, 10651, 6547]
243F547J575o38r155K493J469l783M970k712q359l346n445N793R401l806J389
258c607N989j268O027O068J320J034p601n282p35q141J790M548r638l189K517
273a0168j113P317N111k730J873n7j052K250J451P388R29j0416K940O160m645
288E238K162m24p835l222m946k042K829j524J908m71m054Q989Q927j158N345J578
304A1300n809J085K38q57N74m866j426k939o108P375M489p548J83n13l732K660
320e894J548K405K595k867J768L132J431Q581M02q325J851j163o429M85j191k752
336d423k489m982L036M296k45O026Q45m855M051K594o75L344k349k647J385j755
352A157J150J684j351Q35o061n778O833M90n935J990M00j423J468J727P323L078
$$ y = [6547, 8122, 7484, -1671, 822, 2291, -1492, 3478, 766, -7593, -10939, -16384, -10591, -1190, -4996, -3607, 2382, 1114, 7141, 13209, 14529, 15563, 7962, 2680, 1945, -6196, -4406, 142, -9496, -12685, -10168, -11281, -3964, 1147, -1583, 290, 233, -819, 1431, 2882, 10270, 11199, 783, 3723, 9883, 5238, 7400, 6976, -859, -4081, -9027, -11069, -8240, -9764, -7856, -8327, -12381, -3392, 5535, 4377, 9722, 11300, 5491, 6576, 6814, 5957, 6531, 1665, 239, -2700, -8808, -1433, 3056, -4492, -4309, -4822, -8554, -5894, -4346, -1941, 654, -2213, -445, 2687, 4118, 12699, 13101, 4776, 6627, 5464, -965, -480, -1671, -4423, -6912, -11894, -8858, -4562, -4807, 1219, 2064, -2791, 1260, 3854, 3179, 6523, 4174, 1527, 2912, 1157, 2307, 3991, 2640, 3475, -2586, -8364, -1531, -1041, -6976, -4986, -4586, -6009, -4541, -2814, 4509, 7587]
368G587l331J606k037j897O413l268o207J508l317l931J834K241K381k078l361
383e857L995m6l73O894q61m334K284r41J913L574k045n75q71m984O20R21R8L95
401a93o221k523N625L06J112M294k02J234j953j583O165J400m130p16l645k500
417c530L152l27l7J013l529j434q3J818N826k497l037L684k738j65P002J27k915
434B330J91j658k14o94M74K311l973m092J988j395L340N223m024j356L955j871
450E35L35L016R82j465o144j421M158n04k18J772m304m31J780q37L294K771k415
467I04j299j728J024N069j27M62K68n319q69L156j227p4j703k781o96j542L136
484c346N952k390j306K353j766K532L418j734R8j093l241r75J6L305J143o435
$$ y = [7587, 4256, 5862, 3825, 1928, 8341, 5073, -1134, 374, -2943, -6874, -5040, -2799, -418, -2496, -5857, -1862, -1908, -2281, 4613, 3752, -582, 1702, 761, 2674, 6248, 4203, 3628, 2757, -2227, -1607, -686, -588, -193, -6414, -8937, -3312, -3006, -1894, 2400, 2198, 3432, 1479, -104, 6061, 7461, 3331, 2615, -1030, -3530, -378, -705, -742, 271, -3258, -4692, -4775, -2957, 2869, 372, -2665, 1019, -1719, -1884, 5118, 5245, 2330, 2521, 863, 649, -45, 429, 2740, -1233, -5325, -3337, -4732, -1392, 3831, -193, -1549, 2406, 535, 870, 3886, 4868, 3403, -2741, -4162, -4, -508, -726, 1046, -3258, -3689, -1909, -2746, 548, 3319, 904, -395, -2123, -1099, 3970, 3843, 4305, 4573, -746, -1615, 1541, 314, 240, -1463, -4244, -4940, -6482, -3346, 2606, 216, -1090, 1263, -503, 2029, 5447, 3713, 3811, 2718, -523, -1498, -1482, 1823, 2966, -3469]
500c469r89K707k903K329M615k226j483j217K66M160J376R45M21m042l58L178
516C310j086N33j280m253j143j292n15L190R97R02M13l151L440N460j224J08M11
533D820m131j407O64J212K005k826l079j156p58M548R84m581J675P52l402K989
549a691L568j81J501j80j410L58J24L295m54m238j328k951j007L634r26j632J793
566a725l169r42N758K973M70o15k609J358J511l29J44j116o26l87m197K065L664
583B228k951j10l05l862J685K124o19L005N32l272L12K837L212l43k200J81l098
600f44j929M306l13m294J501j172k345L206J604q9J558l04j294p01J921K942j951
617B002j924J663k933r78L624L88k18j175l833J035K554q22N72q60j427J031j63
$$ y = [-3469, -4458, -1751, -4654, -2325, 2290, 64, -1419, -2636, -2370, 1790, 3166, 4111, 4532, 490, 132, 3310, 2224, 2757, 1477, -2776, -3919, -5211, -5726, -2536, -1539, -637, -224, -3375, 65, 5525, 4301, 4409, 4820, 689, -718, -54, 1158, 3163, 337, -2742, -3898, -4656, -108, 876, -3705, -2030, -1278, -4680, -1691, 1877, 1696, 3197, 3017, 1607, 1965, 2089, 5384, 4930, 692, -636, -3587, -4594, -960, -1886, -3518, -1725, -4894, -5836, -78, 2895, 3365, 2750, 141, 1499, 3010, 2681, 2825, 1709, 1083, 696, -3501, -1436, 2228, -723, -833, -1138, -5000, -3315, -1191, -1810, 1195, 1727, -1545, -1233, 1604, 4816, 4473, 2273, 2454, -644, -2573, 1733, 1420, -2874, -1373, -2545, -4890, -1684, -80, -169, 1389, 1085, -209, -910, 1011, 3953, 2002, 78, 1741, -1192, -2170, 1454, 1842, 1624, 449, -3384, -2349, 205, -617, -45, -905, -2332, -1301, -1464]
634a464J691K666p82k0j068j990K452L59j988J431j979l055K168J369R9J058p52
651A95j155q54M75L536m1k403N19j268n50L205q55j325J817j839j522J730Q92
668E57J372j325j844J171r74j59K944l81j436Q64j743L21J512L76J53j704j935
685b231J584J07L12K141k033n54J462j742K95K491k56r96j944k2K191n41k88R08
703H84j555j28N60j247J984J275k786n29R45M19J268k12j69L92j703j36J589m95
721C56j56P2j523L33R4m02K682j174j320Q99l71N02J242r64K23K75j500N79Q32
740F79R62k27l090P20K450k655k78J932j068n56Rn53K093Q87j022J82k64N38P51
759A490j529J178O74k861K47O66p16Q98J06r71K59q13L52J827j010Q9Q43j273
$$ y = [-1464, 227, 2893, 2111, 2091, 1023, -967, 1485, 1844, -144, 1287, -692, -3747, -1579, -210, -111, 947, 195, -960, -1814, -1339, 2197, 2156, -247, 272, -996, -1546, 1659, 804, -521, 1296, -543, -2065, -335, 557, 1929, 604, -1240, -69, -1043, -1202, 1742, 1361, -75, 789, -954, -633, 879, 1255, 1408, -296, -2231, -647, -540, -228, 1913, -120, -674, 788, -954, -659, 1832, 1576, 580, -1364, -1386, 805, 264, -24, 884, -671, -799, -239, -1486, 498, 1773, -1013, -1542, -597, -178, 1090, 878, 709, 1101, -602, -738, 851, 356, 200, 272, -1251, -918, -824, -1226, 1456, 282, -1038, -139, -510, -8, 1234, 270, 493, 768, -732, -153, 679, 1641, 1414, -1676, -956, 1494, -1161, -1439, 493, -575, -1131, -1122, -1675, 418, 1305, 283, 465, 201, 739, 1490, -39, 1139, 1813, -1048, -801, -135, -851, 47, 153, -818, -559, -1372, -1020, 807, -203, -114, 729, -544]
777e44J428L77q27J633o75j612N21k57K19K23k052N2J589k437O86J694l43Q09
795D84o88K24J517l48k6K65j174K99Q0j278J195M74k099L50j29m03J047m31J70
814d71j47j105J452J018j225J209N20o04M78k63o0J165j595j264K83p45O35O9
832f50j204J458r3j163J427J016K10L26j291O01N71q91O58j2j369P18m20p83J288
851C97n47q82M91r76J47R98j90R31j11j095J990J53j107J540r8j230r3j045O55
870g2O75j388j49R0o92J393l85m92J831p27o92R96J78M95j63p73L77L11j294J181
890G00J95r75M02j238q4P09l3N8K34j051O73L75L42J134q52p69J329p06j088J034
910C89L25l34r23r85J312N59r87R77o07o59P57n32P91J154n84q40j81L81P02k80
$$ y = [-544, 884, 1261, 434, 2067, 1392, -220, 301, 44, 263, 486, -1566, -1514, 75, -2362, -1676, 18, -325, 484, -204, 20, 1537, 1189, 1163, 1428, 254, 553, 633, -645, 550, 1024, -1075, -725, -854, -1257, -210, -641, -471, -618, -1723, -271, 747, -478, 731, 1251, 647, 1125, 862, 802, 1967, 372, -892, -609, -1354, -719, -650, -1854, -396, -489, -1652, -225, 791, 1001, 1327, 36, 637, 1208, 317, 975, 963, -406, 312, -108, -891, 397, -150, -1032, -541, -1517, -1370, -372, -562, 369, 258, -837, 1153, 1306, 199, 1739, 1641, 411, 318, -727, -72, 603, -785, -934, -844, -1536, -143, -528, -1020, 811, 84, -608, 388, 566, 1061, 898, 125, 502, 813, -481, 700, 895, -80, 322, -916, -1000, -291, -324, -266, -32, -1083, -410, -35, 307, 1441, 589, -180, 1149, 443, -645, 389, 714, 380, -543, -1528, -216, 343, -644, 333, -274, -933, -176, -708, 83, 1237, 653, -187, -368, 13, 715, 435]
930D35m84M69q32n35J040o6J84L24q80O9L04n30J379m40q56M87q00J04J032m61
950e7j13Q76j368n7J089J31Q5m81r70J055j76q9J035n34n92o1p35Q23Q65p18P0
971G8o41k78P21l64N04J180j267q4N75n89Q61M36l44o50q93M1J311q35j68L81
991b5r56j74J320l75O56O39j308k12M80O73K47m52j57K54j357K82J024o78L65
1010B46l14j398R87K70k0O43o91j02L51j82R10L20n62L84k98j275P02N45j40l43
1030C3j573N73R75o03J99J048j040J00j41J19J339k97k99j74n65L52O33p82O61
1049E58J69j562J24K45M02L37n42m31N8l75P72R99l71Q3K51j173L54R28n91M06
1069F41o38r33M19QN25M81q90M76m3p32O15M51l49K68q97j86J025j97J89K82l78
$$ y = [435, -49, 420, -412, -947, 93, 27, 211, 535, -345, -276, 28, -502, 877, 437, -419, 68, -732, -628, 404, -57, -170, 706, -662, -719, 370, 501, 586, 105, -865, 190, 14, -75, 960, 426, -166, -227, -962, -139, 726, 8, 78, -563, -841, -120, -484, 20, 1200, -67, -151, 424, -165, 696, 1132, 788, 138, -755, -714, 597, -238, -406, -25, -981, -1155, 165, -210, 446, 1085, -223, -435, 45, 718, 965, 513, 356, 610, -747, -465, 559, -119, 246, -68, -1466, -479, -209, -229, 414, -277, -379, -28, -210, 700, 1020, 458, 842, 544, -731, -29, 516, 376, 33, -1540, -967, 8, -595, -396, 652, -388, -288, -429, -310, 1029, 732, 433, 259, -306, 46, 679, -103, 558, 727, -835, -711, -466, -64, 273, -269, -700, -642, -1017, -245, 754, 383, 466, 717, -456, -102, 826, 235, 641, 3, -930, -511, -503, 22, 503, -387, 89, 46, -686, -71, 380, 31, 299, -598, -784, 241, 44, 233, 515, 137]
1090A37k84K13l70J137m28p80J86n54K22O79K5l82L28p29L94K45j56O84k19q15
1110d67K97k17N74N78n28j00j49m98M66K89k62L55n73q72P80K74Qj10k31J43k5
1131b68j74R07N09q82L90m83n37J204m49j88J44m98pJ60j51N08l75l29L93k98
1151d24j71J099k71l39K39j07M58L2k40J19k70m56L29l83K04P96j027m19P04j35
1171b62J38Q0k59Q49l07p79R64r0J71O3n14j75K71m24L95q7o53L97k54l98Q44
1192c0j22j55R55p82k63J049j95l0k08k39M84n56k50M92M0m05J48n60K29Q35n24
1213h7k06O6K29l01M47J49O70q72m59O41k63J05O9p10K81R4o00P95j32J07J91
1234B14k97K6K20l23L22L62o61k58N73m23L31lj69N46m01n79R69j06m94K5k69
$$ y = [137, -147, 66, -304, 833, 405, -375, -189, -743, -521, 158, 183, -199, 129, -600, -206, 39, -117, 567, 348, -467, -170, -387, 187, 765, 237, 137, -12, -510, -44, 245, -17, 338, -235, -1107, -327, -53, -45, -155, -386, -243, -268, -442, 465, 974, 92, 482, -1, -538, 666, 217, 29, 173, -325, -332, -172, -323, 185, -190, -519, -126, -424, -595, 504, 233, -106, 133, 26, 484, 516, 276, 395, 125, -331, -2, -385, -181, 615, -412, -831, -127, -262, -124, -44, -303, 546, 239, -540, 424, 334, 505, 568, 54, -121, 150, -274, 121, 34, -619, -222, -476, -874, -30, -152, -307, 648, -134, -397, 652, 457, 427, 219, -20, 464, -92, -342, 150, 190, -215, -67, -627, -398, 437, -87, -293, -227, 2, -299, 148, 297, 967, 95, -364, 277, 14, 119, 188, -522, -241, -147, -747, 48, -84, 23, 214, -83, -57, 163, -160, 162, 524, -137, -395, 178, -245, 86, 83, -86, 460, 59, -520, 449, 343, -151, -126, -395]
1255c95Q36j81p25M39k5l18J33j88J04P96q90MO57l57R8J79k14K81p3m06N45j57
1277A43L5L58k83m36L9k90L09J13o72M99k9J84K56k23N1M85p80l4P23q8k72Pl27
1300b32O7j74j55O85m38M85m48k61K06K19j08J18J34l26M97P9nM7k56k53L84n09
1322b44J29L28p84J74K96o19Q28j05p5K02L34L4k62j00L34K03q66J85K67n49O06
1343C16l35l89L40m95K67L19l79K46J93n09N18K36k14M85l31j49K37l15j4J06
1363A33n02K37O9m58M55j4j35L7l5Q4J83J21K10K1k88Q3Nn32P01p9q41O08%j32
1387f9J59k35JO9l07L27K76m92M84J38m08L70k6j56M42l85m73M55m53L2M42m75
1409b84L66l46k09M03J74kQ0j34rJ89m19J72N18n21o4n25O40K43j08m10L7j91
$$ y = [-395, 441, 260, -465, -26, -51, -369, -236, -424, -320, 476, -414, -410, 247, -110, -12, 167, -47, 234, 161, -245, 300, 143, 178, 536, 253, -183, -144, -434, -125, -12, -684, -185, -214, -30, 226, 3, 54, 539, -241, -275, 448, 360, 88, 95, -232, -165, -339, -494, 191, -247, 238, -210, -471, -265, -46, -154, -36, 98, -228, 269, 348, 343, 390, 134, -119, 265, -244, -115, 213, -571, -397, -101, -720, 108, 3, -72, 130, 464, 498, 236, 136, 470, 673, -193, -8, 259, -290, 316, -19, -408, -68, -563, -296, 23, -356, -110, 83, -426, 92, 328, 114, 599, 268, 119, 356, 41, 27, 133, -369, -132, -63, -521, -66, -80, -215, -178, -213, -129, 54, 175, 385, 406, 118, 201, 206, -326, 375, 296, -545, 63, 63, -69, 90, -145, -144, -75, -382, -55, 221, -271, 213, 351, -57, 313, 287, 131, 573, 188, -285, 170, -283, -251, 191, -284, 82, -264, -473, -70, 104, 102, 182, 48, 39, 228, -191, -19, 499, -22, -86, -611, 29, 272, 164, -246, -209, -400]
1431d00L26m5K3L33k33l28J71J71l08Q66k77n51L25l88L90Nj38M53r4m86L07r7
1453B5o4O24o11o00N79k49M49l74R9J80J4m43L16J21J84Kl01k06N94l82M18j37
1475B38j54K01l90j48K70P8m05L42k61l1M72j82r2kj47J63K32l20N31k92j54J09
1497E8l62K57L04k41l82M58r4j20Q4R8K07m40l09N73J96j32M4j93j11K56l13L33
1519A71Oj93j5l45p5K33K5j39O99o61L13M56k99K19K73m18j29J39o92N15L28k73
1541A38j15o35N45k08J04K05N8m32Q8K00j98N82k80l14M50j9J24J46l48L80m09
1562F2k39K5Lj8J73p0l46N23j68j39M81m53J87K9p7j17l0L64Q3k91j73L70l65
1585a86K42R9m24L77k35j23K97j64j84J66k16J19O12m52M13P9l38j84Q8k58M84
$$ y = [-400, -74, -119, -96, 237, 4, -324, -153, 18, -290, 576, 299, -252, 73, -315, 75, 80, -58, 395, 301, -185, 122, 25, -39, 585, -26, -626, -47, -296, 153, -221, -122, 58, 72, -371, -55, 66, 250, 252, -49, -255, 339, -43, 375, 238, 84, 285, -105, -253, 17, 95, -310, 32, -229, -260, 212, 30, -62, -64, -211, -48, 184, -136, 395, 103, -51, 58, -304, -47, 257, 16, -366, 92, -2, -122, -38, 60, 267, -173, -482, 91, 287, 155, 199, 6, -105, 151, -162, 171, 177, -16, -31, -376, -451, -218, -193, -332, 367, -294, 19, 475, 176, 395, 668, 250, 121, 260, -432, 83, 411, 138, 23, -612, -67, -275, -171, 34, 92, -340, -252, -52, -250, 332, 52, -262, 188, 169, 293, 439, 91, 471, 62, -177, -152, -149, -167, 6, -64, -410, 113, -55, -194, 287, -166, 21, 50, -27, -144, -174, 190, 273, -18, -191, 179, -186, 56, 155, -269, 108, -127, -250, 47, -117, -301, -135, -351, -232, 380, -72, 341, 420, 82, -102, -14, -272, 212]
1606B12O1j46j74j56N1K59p1k95Q1J25j76K14J68J91k18k95K08j36L91J11l00
1627A05l18M27m20N31m8l10J25l17P1K11j19k08K12k05L28k37k52R09j94k82J7
1648B6j30L17K26l68Oj05l76N89k39M4m4M1q7K91m30r5L30K69k90j13l8N24r3
1671B55k34K75j86j58k29J36m3J49m4j32L30l38j25M73k11J14j09K7L74l33J74
1692A65K9k36J94K3j58J76n3k28M2J13J84k65j78K24P8j74J56J16J56j63Q0k39
1714D2K53j39l6R5k92P7J0P2L3M0m78L50k1l77J57K89k83K98J60j69O4L4k00J95
1738A74l86M17k28k62L51j20j62J27K63j44J32k23O0Ql7J5q1%M75l79J5J96k61
1761e0k90M14K94l47j03j43R2j58r4L86n3j14j10J90K24M2l55M79k8m42K09P5
$$ y = [212, 273, 127, -47, -203, -152, 107, 36, -259, -178, -53, -229, -15, 153, 344, 126, -169, 39, -97, 294, 405, 105, -213, 214, -206, 325, 277, -33, 92, -225, -154, 57, -62, -270, -58, -263, 65, -172, -424, 485, 291, 9, 26, -104, 213, 439, 71, 77, -28, -404, 185, -54, -10, -54, -13, -100, 191, -239, -334, -4, 265, -25, -138, -176, 348, 255, 21, 296, 110, -48, -277, -141, -184, -35, -79, -211, 119, -219, -344, 129, -82, 32, -77, -50, 324, -9, 165, 194, -42, 152, 175, 17, 193, 140, -88, -46, 67, 251, -14, -192, 32, 110, -64, 92, 208, 364, 201, 281, 42, 295, 156, 120, 215, -77, 0, 10, 82, 115, 155, -323, 27, 6, -371, -214, 75, -208, 90, 250, 81, 145, 179, -21, 174, -212, 205, -23, -285, 66, -54, -216, -89, 174, 30, 162, -61, -1, 7, -30, -15, -96, -96, 379, 0, 15, 211, -50, -340, 74, 368, 21, -82, -225, -133, -291, -385, 1, -52, -166, -276, -86, 138, 180, -175, 304, 276, -166, 43, 118]
1783A18j35J38o9k55L45k15J07J74l01j51K97j60K8j49p7L82k42m6J75J05J84
1804B53r7j02J78p4k5l18K46j04K36k19j76M51j46k70J45j21j64J01M7N14j61
1825A94j32m7l1K70j14k70K48Lk75R2j7J6K13l03K02J94j98k62M16L3L8k43J31
1848A58j62j4k01J20R2M08j15l35L9Q1l16J26J15l10L36kj18L67j81M5L9l2j44
1871dJ99o9J7k22K57k78K6o4ML3l1K05n57N57l1j79R8R9k92J10L14k85M62j40
1895B29k04K56o33M50K1k69J60j91oL04j65J35J9k21j04K78k19nJ05R5p9J66l42
1918b20K44K84l62L06k66q3j21L02q9l9l51K19n1K11J47q6j24L10j27j36K62m27
1940a97L33j60j53j99L30p3K92j44k20p7k29L39K43j40J22j59L8K43k3j36J70
$$ y = [118, -17, 121, 52, -203, 142, -73, 34, 208, -93, -244, 53, -107, -79, -228, -305, 77, -165, -211, -36, 69, 253, 156, 54, 232, 158, 133, -185, 61, -43, 193, -26, -202, 249, 103, -167, -22, -143, -307, -206, -159, 355, 194, 62, 15, -16, 254, 140, -130, 118, 121, -154, -62, -79, -63, 150, -153, 49, 243, 45, -217, 199, 232, 270, 27, 158, -4, -18, -219, -99, -7, 401, 286, -49, -10, 71, -245, -119, -4, -314, 22, 20, -98, 269, 88, 133, 172, 140, -4, 195, 126, 143, -79, 178, -100, -74, -138, -134, -101, -132, 73, -484, 73, 42, -137, -39, 60, -232, -122, 192, -93, 369, 229, 25, 281, -352, 98, 119, -150, 10, -181, -187, 117, -48, 87, 106, -115, -219, 59, -160, -165, -60, 35, -44, 122, -220, 24, 308, -54, 252, -14, -97, -218, 84, -5, -44, -395, -176, -227, -16, 131, 45, -79, 231, 104, -32, 230, -197, 136, -24, -177, -376, -46, -119, 173, 29, -191, -268, -497, -158, 85, -55, 67, -92, -54, 189, 166, 30, 200]
1961B00j63j44J71J18n8l1k22j39L77j91n3J69k37N47j58k26R7O6R0k01k54K50
1983HK96j63J45m1l36J82k49J73q5j00LJ27J62k35J24LJ1K34m45J42K77j75Q4
2006A42l35K91p5k24l9M92n06J83J02j06L4P1j78%J72l00M18j82J21K15o15M51
2028A32k2k24L02o8N2n6l5j56K06k28L02j28l10R0p3L30j39K56k12M1k7p3L71
2051C31J64l29j85oJ78O6m28K10k80J00K53r4K19J03n64K68K5j15J95J6Jj71J19
2074G6l04M19o9K5j33M5k07K63J5j7lj41M5j35J82j3j44K66L0k27Q0K40q7O8%
2099B74l56R6p7k0K01R0j09l01R3L9M07l46J3Q1j90j21N9K76Q0o0j17o4K1k60
2123b91P6O8J26J5k13K21J16j81J09j57L5K61j47Q5P0O5k16k60l4K73M0l97K90
$$ y = [200, 37, -107, 64, 182, 124, 93, -129, -268, 109, -82, -135, 34, -203, 344, 186, -40, 57, 123, 213, 12, -242, 8, 304, 141, 286, 245, -91, 91, -158, 15, -70, -170, -167, -40, 122, -113, 11, 14, 25, 259, -186, -44, 233, 58, 142, -193, 98, 23, -201, -240, 252, -254, -71, 31, -75, -41, 30, -148, -148, 24, -276, 142, -40, 81, 296, -319, 132, 110, -114, 188, 120, 172, 116, 81, -75, 131, -97, 205, 77, -233, -143, -216, 114, -25, 231, 19, 60, 33, -40, 331, 495, 166, -19, -25, 153, 219, -209, 1, -279, -179, 74, -20, 199, 302, -262, 6, 31, -84, 111, 127, 128, -43, 76, -228, 191, 122, 147, 14, 59, -148, 115, 130, 113, 110, -31, 14, -121, 61, 48, -96, 170, 200, -27, 53, 293, 206, 274, 274, -82, 14, -63, -83, 118, 208, 99, -202, -109, -70, 337, -9, 4, 85, -105, -226, -167, 109, 189, 129, 12, -52, -31, -291, -215, -147, -21, -6, -219, 2, 118, -63, 46, -111, -76, 185, 38, 123, 193, 258, 42, -218, -252, 21, 61, -336, -46]
2146d6Q8k83K76P7k04L3K2r0J57j18K91J6k56J81k17N1J09j42R3Q8n2N6j98J24
2170E6Q6l28K46m8j32M61j90J0j5l27L95j45K9J25k48r8k0J92j78M49j35j29J16
2193A72k58l66J29M41k41K81ml65M95m76J43J5KK29J30k53j09r8K02j10L4K50
2215B43j9m07J18R4O6Rj58p7L63l77K17J12l32N6O5j4q3RJ39Q9j73J54l15q7K15
2240i3P8k5R3R5j11J91J22m25K57k07M9q0K8M8J37k70K53K55n22J97K2k44M26
2263B74l11r6j65J30M31j9m56L75J68k29q2j56K95j99m7j01K89l63M18l75J20
2284i9M4J76q3j58L33j68k09l7O1PK09J24L7k65K9r9J09M5J22n47M36j75J57J36
2308A85l19QJ05K34j65j20J02P4j53N3j02J04K77k56J46j25n9P0n8J24n39J23
$$ y = [-46, 42, -241, 35, 112, -92, -59, -37, -127, 30, -88, 203, 219, -37, 144, -73, -22, 87, -55, 38, 126, 74, 130, -68, 56, 142, -186, 60, 12, -120, 341, 151, 161, 146, -181, 214, 69, 98, 223, -25, -123, -143, 49, -129, 320, 185, 56, 172, -86, -452, -323, 118, -123, 158, 154, -211, 284, -192, -49, -34, -32, 197, 327, 74, -35, -133, 69, -41, -7, 243, 224, -183, -65, 29, 95, 104, -54, -131, 232, -145, 72, 184, -148, -92, -27, -41, -124, -115, 24, 113, -60, 94, -221, -308, -93, -15, -40, 53, 148, 37, 228, 350, -75, 182, -25, 24, -56, -28, 20, 157, -113, 140, 395, -127, 70, 92, -152, 274, -37, -133, -298, -168, 263, 244, -212, 163, 331, 102, 20, -136, 159, -40, -87, -188, 101, -262, 156, -219, -99, -55, 121, 38, -120, 213, 45, -164, -201, -140, -133, 76, 200, 237, -28, 1, -98, 11, 56, 178, -369, 67, -108, 49, 185, -134, -126, -21, 213, 48, -72, 30, 104, -49, 4, -98, 6, 283, 27, 173, 48, -11, 59, 1, 125, -414, -291]
2330b91J37K78j96J73l8J8L5J9k18j04K63j47J00R7k42npL17q2k22j60L00o1p9
2354a15J24j13K11k11L48l97J94P1K15m62J14j9J07j61J09J7k95J61J06j07K44
2375A41m86J94j7Q0M9P2j73O9K31q5j57M92m56J48m63M90N5l97L59j02n5J06J59
2398B54k75n9n6J16Qj70J65k9j4J27j66K2K0J88k27J74K0k13q3L16q9j08J47j74
2422a06L3m2L46m60K62j20o5K5j01K82P1k15j1L3K12k06l8J22k28j88N35k45K49
2445A45l87J70J3J21J07P3k22O3k01N9J72K55k48N7j72J22J11m93K68J11j38k68
2467b82L62JJ52l66K13J94j75Q9k79L76j73k89R4j00O2J50m5j84r2M35j31N6J89
2490B57m77%L01o7l87M96o3j88M2n8K32k41K51r4M6O7J62lr4j88k0lJ54j78P9
$$ y = [-291, -154, 124, -72, 101, 63, 81, 116, 135, -83, -187, 76, -71, 29, 126, -116, -121, -128, 189, 107, -115, -275, 25, -36, -115, 9, -104, 107, -104, 244, -153, 41, 112, 327, -135, -21, -40, 67, -94, 15, 32, -263, -102, 4, -103, 141, -345, -151, -168, -88, -39, 33, -140, -71, 160, 75, -82, 410, -46, 102, -361, 129, 184, -213, 146, 44, -11, 95, 254, -21, -80, -136, -20, -12, -182, -17, -46, -60, 67, -99, -77, -57, 131, -96, 78, 98, -115, -198, 118, 29, -79, 68, -106, -73, -115, 231, -229, 33, -87, -152, -127, -228, 54, 125, -90, -101, -68, 144, -62, -100, 22, -206, -394, 141, -104, 145, -242, -72, -59, 62, 169, 242, 20, 83, -118, -59, 113, 368, 120, 177, 5, 127, 238, -255, 13, 124, -14, -282, 80, 81, 233, -133, 80, 274, 99, 188, -91, 285, 112, -177, -83, -183, -121, 29, -16, -200, -292, 143, 12, 68, 257, -220, -220, 81, 14, -373, 123, 60, -128, -86, -144, 88, -153, 98, 4, 50, 117, 279, 276, 182, -6, -26, -29, 125, -53, 26]
2515B6j29J44J87l35L38M3m50L87o7M1j13K02n81K23k34J83L98r8n4j70M00l45
2537dK39j44k41J73j26K99k63J69m1p3J09P6k07j84L55Q4j99n0oN7k68K84lK19
2561B55k7L8m25j00L07M8ll7R3k64L16l52L08l76j14K89q5N0J62J85k8k09q5R7
2585D3Q3l97N28m77K96k20J25K9J58j78J28j84J61o0J25l4N7j54l43K8O42o99
2607c43K92J34j26Q1k1j44K07qJ05J00j08k38K4o6R4J86k76o0M9Q3J6MK14M5j90
2632E4Rr4K5k62K75K4j1j55M3QP6J7J6j89j16K74k67M58k54Q1j54j52N92k58M7
2657H7q7j82jP1j12Q0J52j06J93k40L28k01k31L01Q1p4j38J27l29K70K55m07J22
2680d1O7R5m9j8N1m13K31O0kK2j22N8J21pj1P8j14J71j61K59l57L25j50l06N20
$$ y = [26, -103, 41, 228, -107, 231, 274, -176, 211, 144, 185, 72, 274, -307, -84, -318, -135, 263, 165, 111, -59, 341, -4, 235, 91, -150, 23, -103, 196, -67, 102, 61, -12, 97, 173, -34, -218, 137, 221, 22, -28, -34, 23, -245, 39, 36, 255, 228, 266, -159, -259, 48, 96, 93, 56, 149, -115, 201, -151, 157, -219, -333, -44, -129, -79, 83, 268, 240, 31, -54, 43, 126, -271, 257, -220, 76, -144, -19, 10, 168, -10, 118, -66, 95, 35, 160, 126, 183, 29, -314, -286, 356, -343, -51, 83, -43, 38, 17, -127, 80, 72, 177, 277, 169, -69, -45, -111, -17, 169, -107, -167, -118, -35, -19, -15, 199, 244, 54, 63, -31, -6, -268, 7, 31, 20, -135, -92, -84, -8, 9, 25, -164, -280, -6, -273, 185, -69, 12, -142, -294, 298, 40, 87, 0, -182, -183, -112, -224, -144, 8, -98, 95, -145, 183, -18, -249, 52, 133, 59, -79, 48, -281, -11, 244, -163, -41, 26, 121, 72, 54, 105, -308, -77, -17, -19, 3, -119, -61, 60, 53, 42, 120, 6, 177, 16, 275, -82, 243, 93, -213, 307]
2705C07m66K66mm1q3j30J44M3N8k14K88j95J17J54k26J23j78k1j10K03J5K9r3
2728a4j85l0J55K30k41J87l02K06j61J03Pj85L67k07kL3K53j33k13P0K01m6j61
2751f8j35J99k95K82j13L93n21K67j63K66P8j76j28p6J09J1K01J11m50L67k33
2772g4j01K3m9L22j14M2j40L17j87r8k70N15k93J82p3O2J57j70J17p9k37J99K55
2795C06l26j93O04m05J32k41j41L55j23K17l78J54Q7L1J01j14J30Rk14L20k51
2816F0J33o6k25J1K0J73k52K43k43M87n02K21m7Q6j95m6P3L37k40j46K59m72O3
2839b68K85J60l9j09Qm1n7j25M09m12J15j1o4J7L98j77j6k73K00k1l1j95J90N4
2863cL3k96M05l12kQ1PK11j17k11J33K1J62L8j86R3j12J84K0l1j83Qj4J92j45
$$ y = [307, -159, 107, 103, 62, -21, -151, -7, 36, 94, -120, 168, -27, 90, 244, 18, 141, -37, -58, -168, 35, 50, 79, -14, -199, -229, -74, 156, -85, 102, -200, 6, -155, -52, -45, -230, 137, -70, -72, -39, 214, 81, -132, -62, 139, 93, -68, -203, -4, -299, -17, -130, 263, -258, 9, -154, 112, 190, 14, -114, -190, -81, -70, 131, 242, -208, 159, -74, -175, -152, -201, 121, 7, 49, -91, 226, 39, -59, -329, 186, -107, 75, 2, 64, 221, 51, 168, 89, -148, 51, 306, -20, -213, 391, -14, 118, -123, -264, 91, -32, 185, -193, -39, 48, 79, 180, 66, 196, 205, -9, 311, 60, 193, 127, -98, -87, -67, 106, -146, 97, -146, 341, -161, 60, 13, 99, -96, -142, -69, 268, 28, -118, 141, -331, -268, 17, 177, 138, 29, 37, -4, -61, -186, 223, -189, -74, -85, -149, -132, 266, 89, 73, -200, 0, -21, -52, -247, -57, -3, 30, -266, 139, -173, -175, -94, -87, 124, 7, -204, -71, -50, 112, 150, -36, 57, -55, 129, 149, 118, -65, -57, -71, 121, -24]
2888b4k9M6K46k31L2j04K3m6M05k38J19l45J92L5k75M96j67m49M61m23M11k15
2910h0J54L9l09J86m4J38j00K52m23J02p7J02J59j56J25k13L66q1j38L5K04k20
2932B1m5P5m7j99JJ71J15l2j54K03M6q9L1k46M80n19J52p9J51n6M4Mn8J64l05
2957a71K89L1L1j33j51l0J13m21M93o1m9L7m2j0J61q2J15q0K2J60k15k31M48k76
2981e2mj1J41j55K7K11Rm9j2mL2j27j13L01l02N4L20k66q7p4M29l71J25N5j92
3006a15J70Q7O6l54L85k18O9J88l56K50k66Lk07J84k6K90m32M85k49j9K1P5P5
3029A06o7l17L68j27k12K17j81MK28J31m21K21K38l49J25J17n2j26K02k81K09
3050C3J33r4j82K32m73L94j75N41k95l02O6L22Kl82K93k52j33L77m6m1J16j67
$$ y = [-24, -53, -7, 239, 8, 40, -64, -41, -87, 318, 80, 199, -146, 46, 81, -194, 302, 135, -314, 147, -276, 135, -80, 74, 113, -196, -10, -54, 84, -16, 236, -187, -85, -162, -60, 99, -57, 68, -145, 221, 140, 2, 37, 241, 21, -24, 51, 4, -195, -194, -23, 92, 60, -94, 109, 155, 66, 97, -149, 331, -188, -36, -115, 36, -20, 24, 28, -30, 134, -171, 118, 149, 180, 47, -104, -134, -21, -442, 51, -10, -59, -22, -64, -74, 87, 5, 120, 40, 62, 222, 7, -224, 224, -52, -56, -67, 74, -81, -54, 157, 166, 117, 105, 101, 133, 6, -107, 194, -108, -54, 266, 0, -87, -161, 268, -103, 22, 77, -115, 55, 142, 208, -146, 239, 21, 90, 278, -78, 172, -94, -91, -298, -114, -140, 150, -282, 203, -46, -65, -44, 31, 106, 39, -278, 90, -37, -249, -32, -213, -209, 19, 150, -271, -50, 188, -161, -36, 81, 29, -97, 105, -176, 33, 166, 72, -110, 122, -351, 43, -132, 409, 114, -188, -122, 200, 202, -180, 113, -139, -272, 105, 59, 18, 134, -33]
3072c3L4j4n7K30k8O1j36n1o5J11J44N2l52m6r7M00l25J24L61l27j72L03m1j08
3096c2j22K68q9j78N76j80j61o3n4l4Q4k71L53K11j24k74K59R4l14L4j45L0L72
3119B40k48Q8L63m07l9N4j90r3J30k50L50J47j10J3Kr7R9j23K46n8n5o9J88k66
3143h5k9J83j30n3J52J1n2j77K70j50J2j98N6J04j66R3M18m25J46J12j41L61o27
3166c15L93j41K02j19M6J2l45L69k44P0po1K8K6J62K0l03Q8J14N5J56l03K98l35
3190a34j27L26P%l94j58L24K10l60M86l43O3K8P7J22n7p8oP2j27Q7K30l33l0K2
3215i3M3J81k02K05j42j34J08L10l93J86j18Qj60K78k50k23M21J3j62J41J7L60
3237C94n06l3L10k9j37K4j70J84j85K03j65%K30R4j43r9J16n6J99m12j26L15m0
$$ y = [-33, 1, -13, -70, 160, 132, 193, 57, 6, -59, 52, 196, 248, -104, -150, -247, 153, -172, -48, 313, -14, -186, 117, 76, -32, -154, 114, 25, -153, 423, 243, 82, 19, -35, -69, 15, -256, 97, 308, 184, -90, 169, 263, -51, -17, -162, -132, 240, -8, 80, 443, 36, -3, 51, -139, -232, -102, -352, -2, 145, 35, 48, 50, -47, 52, -71, 175, 117, 62, -7, 181, -85, -114, 69, -61, -114, 38, 49, -3, -180, 90, -60, -48, -246, -190, -86, -252, -159, 259, -166, -20, 92, -49, 312, -315, 78, -63, 139, 20, 66, 78, -267, 102, -142, -72, -79, -140, -112, -86, 76, 96, -207, -119, -5, 50, 206, -97, 201, -134, -261, 65, 72, 72, -322, -480, -156, 54, -306, 180, -163, -100, -72, 5, 127, 70, -8, -14, 58, -69, 18, 248, -85, -115, -93, -50, 131, -71, 134, -8, -142, -34, 276, -117, 69, -49, -41, -201, 77, -173, -396, 25, 38, -124, 17, 34, 394, -112, -145, 165, 136, -1, 23, -147, 37, -148, 55, -110, -110, 120, 214, 71, -28, 88, 32, 231, -181, -307, 8, -32]
3260c2l25M22l6K38k55j8o5K16j24P4l72K64Q8r3j29Q2R4m6L35k62j34J78J21
3283B21k32k75M30n61L43J99o4j45K59r9k15j6K73k87J38K28o6j54M3M0n56M88
3305hL8R8m4q0pK52j63K6l1L18o64L11L01l50j64J94q7k19K97O1j66J21m1Q2j90
3330a15K71J2k89Q4J37k46O8K04j29L13j64p8k01J1j00M81n14J32m4J99K8k53
3352a93L9O9J12p2K96p5k5L4l79K75J0j2j47P8o5K16k85o4L84k4j16R1m02K90
3376C5J12k37o5J51j16j3r1Q10o94K44P4l21J79J55j60p3Q3Jj7O7q9M0Kj39j75
3401b37N69l45Q8q8ok23M14k33L89n15j85M86l53K92P5j29j5l5o5L64n0l43K32
3424H7j17Q8N9j93J23Q7j51J29R2j02j69J28n3P3j97K92l99L58o6p3m7j08M62
$$ y = [-32, -357, 65, 29, 267, 12, -6, -71, 145, 21, 95, -277, -13, 75, -18, -147, -65, 29, -17, 318, 56, -78, 100, 221, -11, -286, 144, -417, -74, 125, 61, -84, 175, 76, -139, -155, 118, -169, -31, 197, 131, -23, 20, 60, -496, -8, 30, 128, 84, 4, -3, 249, 86, 112, 81, 399, -265, 46, 347, -3, -167, 27, -60, -279, 18, 79, -87, 34, -7, 75, -115, 156, 168, -121, -37, 100, -146, -78, 126, -3, 310, 146, 68, -133, -122, -222, 259, -255, -123, -167, 32, 60, -193, -154, -85, 27, -45, 251, 176, 151, 185, -194, 81, 91, 79, -68, 10, -55, 161, -124, -188, 196, 172, 56, 147, -255, 35, 147, -90, -155, -4, -120, -133, -224, 586, -108, 136, 210, -111, 68, 223, 63, -10, 73, 74, 57, 124, 35, 75, 77, -62, -237, 332, -13, 75, -13, -19, -242, 172, -61, 328, -187, -372, 114, -239, 53, 128, -1, -16, -51, -116, 248, 198, -145, 87, -30, 58, 117, -76, 47, 134, -17, 112, 204, 102, -67, 61, 8, 81, -116, 176, -223, 135, 69, -4, -51, -159, 303]
3447C03n13L16j94J54j24p2P3J87k36J94j19R2j81J90k80K79j85J25K0m22L14
3468g9O7j27L67l02K7j14K90j62p3Q8o9q6Q2k3o0J34N1k7J07r7l1o3J77J44j19
3493A02K23m18L32m74R5j97N66l31L4m2J9P1N4j03k5K36l29L84j02p8P1Lk77Q0
3517a06K43n6q8J05j83J42J0J0l40J02K01J07j57p8j86K35j29J01J81j37J24j13
3539a2M9p7K40m0q1K03l35n9j6j45K43K08j58P1j93J46po3L58k54k49M02k19M5
3563E7l4P1j63P5nL57r3l76J01r0M9K76j80j73K14n08K69QL51n7k75K49J07l46
3587a16K63j77j0K82k10J22k78k26M36M3j78P1J46k22N6m0J23P1j45j0k97L76
3609H0J9o9N7J91o46M79p6p6J31L2k84N9QL1J11l44K18J67q5J52k45j82K74K01
$$ y = [303, -210, 106, -88, 66, -58, -130, -57, 130, -106, 88, -31, 61, -120, 70, -210, 69, -116, 9, 29, -393, -79, -12, -139, 228, -74, -47, -161, 129, -33, -106, -18, -87, -173, -91, -114, -174, -40, 11, -16, 91, -6, -37, -100, 77, 221, 102, 325, -93, 239, -235, -140, -337, 229, -102, -68, -110, -91, -20, 34, -69, -94, 142, -187, 197, 95, 17, 88, 91, -186, -106, 137, 81, -7, 98, -85, 57, 67, 77, -263, -161, 40, 147, -10, -88, -274, -39, -168, -67, 114, -23, 101, -12, 37, -40, 200, 160, 79, 282, -53, -112, -128, -273, -30, 178, 20, 91, -102, 44, 37, -26, 332, 78, -171, 231, 12, 57, 23, 94, -69, 6, 1, 358, 265, -111, -10, -100, -51, 225, 45, -128, 86, -422, -153, -145, 206, 149, -126, 123, 230, -116, 147, -30, -40, 242, 32, 154, -124, -350, 86, 129, -49, 22, 168, -54, 2, -38, 85, 156, 11, 1, -296, 80, 99, 30, 87, 278, -368, 111, 35, -41, 90, 122, -162, -103, -95, -64, 47, -297, -79, 88, 3, 155, -90, -272, 2, 203]
3633B03k99j34K34N1L1j89J74Q6j60L1J53l03L51j66J09m14p9K00L12j28K9j50
3655e8J6J5k21N5L88n85L84J6j25R1J14k10J91k31O5K42l08J21J09NO4k46J70
3678F2k2n33O16k37mJ41k07M2N0Q4k8J31k94J26K18L29m45Pj10J13J24j27J08
3701A44m4r8J47k92J75K20l57k9k1oj2K47m74N67j31J50j74n3O9q6N3n8j01L00
3725A36k3m34K62N3J17Q7j32j76M6O4l18L19q5P1L65m77J12k15M54j43k30J0k27
3748c64K46J43m03O45k71L2K79l95J09M2J03m01L31k35J28K1j92L98k63k49L73
3769G7P4l02K81k04J7L1K43n05J11J65K19k42N4J0L9J28m10P4n4J77O5j97kJ52
3793Ak3P6K22j37m65K67O4k9k4J19J27k98J46J67m90K61J18R9p6J59j69k14J32
$$ y = [203, -96, -230, 4, 55, 86, -103, 71, 157, -3, 28, 181, -122, 229, 63, 172, -242, -321, -121, 191, 63, 92, -58, -42, -27, -248, -193, 195, -390, -6, 10, -115, -24, 90, -120, 71, -160, -95, 147, -161, -40, 69, 74, 138, -108, 62, 40, -493, 123, -114, -118, 23, -184, -142, -92, -8, -36, 95, -199, -73, 145, 474, 29, 36, -74, 39, 163, 36, 144, 100, 2, 149, -143, 32, 252, -105, -134, -155, -161, -173, 74, -400, 167, 36, 186, 12, -41, 28, -58, -5, -63, -164, 136, 113, -321, -59, -6, 111, 198, 66, -110, -64, 0, -318, 1, -84, -13, 352, -125, -13, -228, 226, 83, -147, -137, -364, -118, 25, -378, 267, -4, 28, 307, -88, 21, 63, 166, -235, 96, -139, -11, 10, -182, 216, -47, -296, 77, 151, -151, 130, -74, -57, -26, 217, -288, -177, -12, 207, -35, 19, 29, 68, 196, -214, -140, -194, -17, 48, -149, -151, 1, -22, 54, 276, 139, -326, -59, 5, -24, -48, 71, 198, -100, 46, 213, -277, -16, 102, 201, 125, 284, 115, -99, 33]
3816C3j58R4l43L08L8L11m89K08j54K96p5j84M1R1r8q9K4J80j38L1J13k3K23k38
3840BL3L4k87J48J33%k32J71m6L86k92j94J55R3o1k34K91l96L87j61K08k43j14
3863b19K83r2jj70K91J08L7k43q8o4J43j69J64Jk7M5J93q9k00Q4Q6l20L05k8k3
3888GL07m59J42L25k52j66J88RJm2J67j11j15j20J63M9M4j27K19j79J79j03K94
3911D20m03O2O2J7J88n76J87n4K07k23J09J35j87P6j68J08J50k12N3J0n2j76L92
3934A25k78J18o9J30J68r0j09m4J01j18K93n1k30m8J80j49nK83j56M9l24M07O5
$$ y = [33, -125, -31, -374, -66, -28, 283, -206, 2, -152, 144, 69, -115, -74, 17, -81, -170, -146, 34, -104, -73, 40, 17, 240, 2, 35, 69, -218, -70, 63, 63, -169, 2, -44, 342, 50, -144, 11, 104, 43, -191, 100, -296, 91, -70, 138, -105, -219, 64, -28, -29, -199, 92, 200, 237, -6, -94, -158, -15, -184, -20, -19, -46, -1, 192, 103, -97, -13, 73, -247, 58, 30, 7, 314, -145, -3, 322, 70, -96, 92, 101, 102, 60, 227, 116, 1, -119, 44, 93, 137, 10, 229, 50, 229, 126, 420, 17, 79, 141, 158, 346, -230, -43, -97, 110, -113, -4, 131, -56, 20, -148, -40, 110, -102, -49, -39, -91, -267, 125, -153, -35, -104, 26, 194, 104, -5, -49, 52, -66, 227, 176, -54, -102, 78, -71, -76, 207, 51, 100, -224, 183, 248]
$$ [...]
8191c45
##END NTUPLES=NMR FID
##END=
