##TITLE=1H_DE-87_ch_7
 200.13MHz, CDCl3,
 8 sc
 
 23.4.2025
##JCAMPDX= 6.0         $$ Bruker NMR JCAMP-DX V2.0
##DATA TYPE= NMR FID
##DATA CLASS= NTUPLES
##ORIGIN= UXNMR, Bruker Analytische Messtechnik GmbH
##OWNER= pz
$$ XWIN-NMR		Version 3.5
$$ Wed Apr 23 16:40:53 2025 Russian Standard Time (UT+4h)  she@DPX200
##.OBSERVE FREQUENCY= 200.1313
##.OBSERVE NUCLEUS= ^1H
##.DELAY= (6, 6)
##.ACQUISITION MODE= SIMULTANEOUS
##.ACQUISITION SCHEME= undefined
##.AVERAGES= 8
##.DIGITISER RES= 18
##SPECTROMETER/DATA SYSTEM= spect
##.PULSE SEQUENCE= zg30
##.SOLVENT NAME= CDCl3
##.SHIFT REFERENCE= (INTERNAL, CDCl3, 0, 14.3821)
##AUDIT TRAIL= $$ (NUMBER, WHEN, WHO, WHERE, WHAT)
$$ ##TITLE= Audit trail, XWIN-NMR		Version 3.5
$$ ##JCAMPDX= 5.01
$$ ##ORIGIN= Bruker BioSpin GmbH
$$ ##OWNER= she
$$ F:/spectra/data/she/nmr/H-C/1/audita.txt
$$ ##AUDIT TRAIL=  $$ (NUMBER, WHEN, WHO, WHERE, WHAT)
(   1,<2025-04-23 16:39:54.40 +0400>,<she>,<DPX200>,
      <created by zg, POWCHK disabled, PULCHK disabled
       configuration hash MD5:
       00 E9 B6 7A A2 85 ED C7 34 08 36 98 17 FE 4E 26
       data hash MD5: 16K
       69 C1 33 7F 23 A4 7D 65 B6 4A A5 EC EE E1 5F 87>)
$$ ##END=
$$ 
$$ hash MD5
$$ 31 B4 47 16 7A E3 6F A8 08 52 D9 CB 4E 70 A2 B0
##$RELAX= 
##$RELAX= 
##$RELAX= 
##$RELAX= 
##$RELAX= 
##$RELAX= 
$$ Bruker specific parameters
$$ --------------------------
##$DU= <F:/spectra>
##$EXPNO= 1
##$NAME= <H-C>
##$PROCNO= 1
##$TYPE= <nmr>
##$USER= <she>
##$AMP= (0..31)
100 100 100 100 100 100 100 100 100 100 100 100 100 100 100 100 100 100 
100 100 100 100 100 100 100 100 100 100 100 100 100 100 
##$AQSEQ= 0
##$AQ_mod= 1
##$AUNM= <au_zg>
##$AUTOPOS= <>
##$BF1= 200.13
##$BF2= 200.13
##$BF3= 200.13
##$BF4= 200.13
##$BF5= 200.13
##$BF6= 200.13
##$BF7= 200.13
##$BF8= 200.13
##$BYTORDA= 1
##$CFDGTYP= 0
##$CFRGTYP= 5
##$CHEMSTR= <none>
##$CNST= (0..31)
1 1 145 1 1 1 1 1 1 1 1 1 1 1 1 1 1 1 1 1 1 1 1 1 1 1 1 1 1 1 1 1 
##$CPDPRG= <>
##$CPDPRG1= <>
##$CPDPRG2= <>
##$CPDPRG3= <>
##$CPDPRG4= <mlev>
##$CPDPRG5= <mlev>
##$CPDPRG6= <mlev>
##$CPDPRG7= <mlev>
##$CPDPRG8= <mlev>
##$CPDPRGB= <>
##$CPDPRGT= <>
##$D= (0..31)
0 0.7 0 0 0 0 0 0 0 0 0 0.03 0 0 0 0 0 0 0 0 0 0 0 0 0 0 0 0 0 0 0 0 
##$DATE= 1745411993
##$DBL= (0..7)
120 120 120 120 120 120 120 120 
##$DBP= (0..7)
150 150 150 150 150 150 150 150 
##$DBP07= 0
##$DBPNAM0= <>
##$DBPNAM1= <>
##$DBPNAM2= <>
##$DBPNAM3= <>
##$DBPNAM4= <>
##$DBPNAM5= <>
##$DBPNAM6= <>
##$DBPNAM7= <>
##$DBPOAL= (0..7)
0.5 0.5 0.5 0.5 0.5 0.5 0.5 0.5 
##$DBPOFFS= (0..7)
0 0 0 0 0 0 0 0 
##$DE= 6
##$DECBNUC= <off>
##$DECIM= 32
##$DECNUC= <off>
##$DECSTAT= 4
##$DIGMOD= 1
##$DIGTYP= 9
##$DL= (0..7)
0 120 120 120 120 120 120 120 
##$DP= (0..7)
150 150 150 150 150 150 150 150 
##$DP07= 0
##$DPNAME0= <>
##$DPNAME1= <>
##$DPNAME2= <>
##$DPNAME3= <>
##$DPNAME4= <>
##$DPNAME5= <>
##$DPNAME6= <>
##$DPNAME7= <>
##$DPOAL= (0..7)
0.5 0.5 0.5 0.5 0.5 0.5 0.5 0.5 
##$DPOFFS= (0..7)
0 0 0 0 0 0 0 0 
##$DQDMODE= 0
##$DR= 18
##$DS= 0
##$DSLIST= <SSSSSSSSSSSSSSS>
$$ [...]
##$SUBNAM0= <"">
##$SUBNAM1= <"">
##$SUBNAM2= <"">
##$SUBNAM3= <"">
##$SUBNAM4= <"">
##$SUBNAM5= <"">
##$SUBNAM6= <"">
##$SUBNAM7= <"">
##$SUBNAM8= <"">
##$SUBNAM9= <"">
##$SW= 18.0517328524113
##$SWIBOX= (0..15)
0 0 2 0 0 0 0 0 0 0 0 0 0 0 0 0 
##$SW_h= 3612.71676300578
##$TD= 16384
##$TD0= 1
##$TE= 0
##$TE2= 300
##$TE3= 300
##$TEG= 300
##$TL= (0..7)
0 120 120 120 120 120 120 120 
##$TP= (0..7)
150 150 150 150 150 150 150 150 
##$TP07= 0
##$TPNAME0= <>
##$TPNAME1= <>
##$TPNAME2= <>
##$TPNAME3= <>
##$TPNAME4= <>
##$TPNAME5= <>
##$TPNAME6= <>
##$TPNAME7= <>
##$TPOAL= (0..7)
0.5 0.5 0.5 0.5 0.5 0.5 0.5 0.5 
##$TPOFFS= (0..7)
0 0 0 0 0 0 0 0 
##$TUNHIN= 0
##$TUNHOUT= 0
##$TUNXOUT= 0
##$USERA1= <user>
##$USERA2= <user>
##$USERA3= <user>
##$USERA4= <user>
##$USERA5= <user>
##$V9= 5
##$VALIST= <valist>
##$VCLIST= <CCCCCCCCCCCCCCC>
##$VD= 0
##$VDLIST= <DDDDDDDDDDDDDDD>
##$VPLIST= <PPPPPPPPPPPPPPP>
##$VTLIST= <TTTTTTTTTTTTTTT>
##$WBST= 1024
##$WBSW= 4
##$XGAIN= (0..3)
0 0 0 0 
##$XL= 0
##$YL= 0
##$YMAX_a= 103614
##$YMIN_a= -144108
##$ZGOPTNS= <>
##$ZL1= 120
##$ZL2= 120
##$ZL3= 120
##$ZL4= 120
##$ABSF1= 10
##$ABSF2= 0
##$ABSG= 5
##$ABSL= 3
##$ALPHA= 0
##$AQORDER= 0
##$ASSFAC= 0
##$ASSFACI= 0
##$ASSFACX= 0
##$ASSWID= 0
##$AUNMP= <proc_1d>
##$AZFE= 0.1
##$AZFW= 0.1
##$BCFW= 1
##$BC_mod= 2
##$BYTORDP= 1
##$COROFFS= 0
##$CY= -3
##$DATMOD= 1
##$DC= 2
##$DFILT= <>
##$DTYPP= 0
##$F1P= 0
##$F2P= 0
##$FCOR= 0.5
##$FTSIZE= 0
##$FT_mod= 4
##$GAMMA= 1
##$GB= 0.15
##$INTBC= 1
##$INTSCL= 1
##$ISEN= 128
##$LB= 0.25
##$LEV0= 0
##$LPBIN= 0
##$MAXI= 10000
##$MC2= 0
##$MEAN= 0
##$ME_mod= 0
##$MI= 1.114404
##$NCOEF= 0
##$NC_proc= 0
##$NLEV= 6
##$NOISF1= 3.799351
##$NOISF2= 2.8
##$NSP= 1
##$NTH_PI= 0
##$NZP= 0
##$OFFSET= 14.38212
##$PC= 1
##$PHC0= -829.4692
##$PHC1= 9.992201
##$PH_mod= 1
##$PKNL= yes
##$PPARMOD= 0
##$PSCAL= 0
##$PSIGN= 0
##$REVERSE= no
##$SF= 200.129724274929
##$SI= 16384
##$SIGF1= 3
##$SIGF2= 2
##$SINO= 400
##$SIOLD= 16384
##$SREGLST= <1H.CDCl3>
##$SSB= 0
##$STSI= 0
##$STSR= 0
##$SW_p= 3205.1282051282
##$SYMM= 0
##$S_DEV= 0
##$TDeff= 0
##$TDoff= 0
##$TI= <>
##$TILT= no
##$TM1= 0
##$TM2= 0
##$TOPLEV= 0
##$USERP1= <user>
##$USERP2= <user>
##$USERP3= <user>
##$USERP4= <user>
##$USERP5= <user>
##$WDW= 1
##$XDIM= 8192
##$YMAX_p= 0
##$YMIN_p= 0
$$ End of Bruker specific parameters
$$ ---------------------------------
##NTUPLES= NMR FID
##VAR_NAME=  TIME,          FID/REAL,        FID/IMAG
##SYMBOL=    X,             R,               I
##VAR_TYPE=  INDEPENDENT,   DEPENDENT,       DEPENDENT
##VAR_FORM=  AFFN,          ASDF,            ASDF
##VAR_DIM=   8192,          8192,            8192
##UNITS=     SECONDS,       ARBITRARY UNITS, ARBITRARY UNITS
##FACTOR=    0.0002768,     1,               1
##FIRST=     0,             0,               0
##LAST=      2.2672688,     0,               0
##MIN=       0,             -144108,         0
##MAX=       2.2672688,     103614,          0
$$ Real data points
##PAGE= N=1
##DATA TABLE= (X++(R..R)), XYDATA
0@%%%%%%%%%%%%%%%%%qJ6j6J6j6J6k1K9l2L4m1M7n3O1o9P8q8J00j14J30j45J60
39H4j77J95k18K43k67K94l24L59l97M38m82N30n83O42p10P86q71R68j080J212
59F42j371J563j800K101k503L066l903N277p892J4493o1426r2355J90810N6912
73A03614j02978K1975M6961n9471k545L9661l2701j9841M4088l2368o6279L0838
85b9046J4497n7540L1394N3581m1405k369N7201q874j6289K4769k391j2491R961
98B0998q238j2858K1578O674m3141j2595L6670m416k6535J2364j474j2244K0833
111b384M84j7166K1642J2264j9622N261J9375m504n685J1259m575k3876k061J0625
125A037j1885n587R362o382r81J2863L73J644J0992l844q465L658O600j15n618
$$ plain form
0 0 0 0 0 0 0 0 0 0 0 0 0 0 0 0 0 0 0 -8 8 -8 8 -8 8 -13 16 -16 18 -23 24 -29 32 -37 41 -47 53 -61 69 -76 84
39 84 -93 102 -116 127 -140 154 -170 189 -208 230 -252 278 -305 337 -373 413 -458 510 -570 642
59 642 -729 834 -966 1135 -1368 1698 -2205 3072 -4820 9673 -51753 -144108 46702 103614
73 103614 636 22611 69572 10101 7556 47217 14516 -5325 38763 6395 -59884 -29046
85 -29046 -14549 -72089 -40695 12886 -28519 -30888 26313 17439 1150 25919 23528 11037 20998
98 20998 12760 -98 21480 28154 -14987 -27582 9088 4672 -21863 -9499 -10973 -23217 -2384
111 -2384 -1900 -19066 2576 14840 -4782 479 19854 15350 9665 20924 16349 -7527 -9588 1037
125 1037 -10848 -16435 -7073 -13455 -14436 -1573 -1200 444 11436 7592 -873 2785 9385 9270 3652
140C652j890K275k885j871Q96j472p77j784m493k86J153K608M059j248n96M922
156B263P9K805O525k665m732Q41k025l609M71j78l730l234J298O18M03M505J678
173A313l267K506K326l218K192L129l592j547J443j189j11K482k24l386r64R84
189a123j594M64K388k620n15L012J46P09L613n77k655R93J2k359Q2N31k465k325
207d283J394K44r31L260J478k728J359K005j101J218J568j658j665N72R99r43
223G88JL43k048j132J258q40r65J366r66o31J358Q87N99J319Q66K65n87j8Q94
242B757r11m71q05k054k44O41n46M38J61j024Q70M43j11J637N9p35M61n5M38P45
262A694j41Q5p74j079N94l55n91K29q23j308Q01j23P67Q98n8Q8R14K6J169k60
$$ plain form
140 3652 1762 4037 1152 -719 177 -1295 -2072 -3856 -8349 -8635 -7482 -4874 -815 -2063 -2659 2263
156 2263 2342 5147 11672 9007 4275 5116 3091 -518 -47 -225 -3955 -7189 -5891 -5273 -4870 -365 1313
173 1313 -1954 552 2878 -340 1852 4981 1389 -158 1285 96 -15 2467 2243 -1143 -2107 -1123
189 -1123 -2717 -2253 135 -2485 -3000 12 158 867 4480 3903 1248 2241 2253 -106 -24 507 -1958 -4283
207 -4283 -2889 -2645 -3576 -316 1162 -1566 -207 1798 697 1915 3483 1825 160 732 1731 788
223 788 789 1132 -916 -2048 -790 -1630 -2595 -1229 -2195 -2826 -1468 -581 18 1337 2203 2468 1881 1863 2757
242 2757 1846 1375 570 -1484 -1728 -1087 -1633 -1195 -1034 -2058 -1188 -745 -856 781 840 105 566 511 949 1694
262 1694 1553 1638 864 -215 379 24 -567 -338 -1161 -2469 -1668 -1791 -1024 -126 -184 -96 818 844 2013 1753
282A753p60M72p94j014N42n56j09O0j210P43k96r0Q99o1l50P70q1NJ307k76l9
303I15N47j028N02L60m04k76j071p35L39m33j42R37o88k52Q41K36O65P17l02L15
323A043m0m51M81m29k71R8p74l60N83q42M94J8p73L91j58N9J135j27J2P84m51
344D22N49K11l31O1m02l07k23k82k79K83p01j08L83K18J27M71j1K23qj92J29J78
366D11L73k86k53O7o1O9l01J01m31k15K30l58K81R3j62QJ60L85M91j12J55J94
388H39n87k9p3k14P6J73m88R8j77J6L60j57K6L52l35J96m3K12J5p7m33K30K85
411B65j77N64q70p5J38o0l18N19k39k29K40R9j19M57L7J1l21K57J65n3j86j55
433e0m3j69N12m96K99J44k05k74K49j6K16k70N51n48n3M55j26j57L96p4l45J00
$$ plain form
282 1753 993 1465 671 -343 199 -357 -466 -406 -1616 -873 -1169 -1259 -360 -421 -771 -1 -82 -77 1230 954 915
303 915 1462 434 936 1296 892 616 -455 -1190 -851 -1284 -1426 -489 -1177 -1429 -588 -352 313 1030 728 1043
323 1043 1003 552 1033 604 333 431 -343 -703 -120 -962 -468 -450 -1223 -832 -990 -931 204 77 89 873 422
344 422 971 1182 851 912 510 203 -20 -302 -581 -298 -999 -1107 -724 -506 -379 92 81 304 296 104 233 411
366 411 784 498 245 312 251 320 19 120 -311 -526 -296 -654 -373 -280 -442 -434 -274 111 602 490 645 839
388 839 252 223 150 -64 12 185 -303 -205 -382 -366 -6 -163 -137 215 -120 76 33 245 260 183 -250 -20 265
411 265 88 652 -218 -293 -155 -215 -533 -14 -253 -482 -242 -143 -262 195 232 243 -78 179 344 291 105 -50
433 -50 -93 -262 250 -246 53 197 -8 -282 -33 -49 167 -103 448 -100 -153 302 176 19 415 341 -4 96
455I6O3j35K7m10J76j%P2q1L30j00k11K93j42m3R2k3N5l90L37j59K47k13P6r5
480a39RK23n6n5Km7J11L24m16J07Q0J6j34K8k6O8j30P0J50m27J06K66P0j08K51
505C43l65N9J96j97R2o4P9k80J83j72N4J66k29j91K38j24K14J26k26L6Q8K2lo0
529a5O4k29K26L25l38j48K97k97m7K3km3J63m5n9L14l80L46r4j74J03K72j96k48
553a82J02J2J7o8L22k68kk9J4N1J51k78K21k33L30j44J5o4%j46K51j27L54l02
577cQ6kj14qk90K15J21R8j40j42M96l01m4J39k74L18R0k01j89M51j91j44J57k12
601h4K30k60o5M35l43J18J67Ok12K2J57l9n34P93l35k46M10l40q2J17R4o8r2L92
625B41k95Q3m3N0l6P0r1Mq5p8J19j49L23J03o6R0p4k65L2K36Nm32L80k30J56M6
$$ plain form
455 96 159 24 51 -359 -183 -184 -184 -112 -193 137 37 -174 119 -23 -66 26 3 58 -332 5 -154 93 -120 -44 -139
480 -139 -130 93 37 -18 -16 -63 48 372 -44 63 143 159 25 53 27 95 -35 35 185 -242 -136 130 200 92 343
505 343 -22 37 233 36 128 64 143 -137 46 -126 -72 94 -135 -326 -88 -212 2 128 -98 -62 26 48 45 -15
529 -15 49 -180 46 371 33 -115 182 -115 -162 -139 -141 -184 -21 -66 -125 189 -191 155 61 -113 -10 262 66 -182
553 -182 -80 -68 -51 -119 203 -65 -67 -96 -82 -31 120 -158 63 -170 160 16 31 -33 -33 -179 72 -55 299 -3
577 -3 83 81 -33 -41 -331 -116 5 103 -37 -179 317 16 -28 111 -163 155 245 44 -145 306 115 -29 128 -84
601 -84 146 -114 -179 256 -87 31 198 204 -8 14 171 132 -402 391 56 -190 220 -120 -202 -85 9 -59 -151 241
625 241 -54 29 -14 36 0 70 -21 -17 -102 -180 -61 -210 113 216 150 240 166 -99 -67 169 174 -258 122 -108 48 94
651I4m7K2m14Q3K65j68N9L73l96k8j30KJ46q7N5l7K54q6L9J49j98q3L06k57%O9
677a5J23o0p5m2J9j1K40m46J46OK2k52K75K62l24Q8J58j03qpL0q5l12L51R8o8
703A0J32O5K0j92O0m10M71j91o0P7k95M77k42J91k84J91l37N86q8k97j49K33n
726c7j03J34j9j12J64k47nL45J2j45k7K52j87m23L21J82j0N9k88J86j41J40L1
749H2j3n7L9J42j23JK13m62L67k75K48k39M99n48K29l47L05j78j54J28P0j10K74
772I1k20O2R5o1R1q5J18J58l99NK47l14M55j47j5j42m4J53j60kL3k9K29qJ79n03
798b13K50p3J76k44k4L94j72k7p7q0N5L17m39L58k72J92k19K52j24J77j87Q2l9
821F3o9j07J70K37l61n1P8o1J31J23n2j91K59j88L58q1j48j23j59P9J3L4O3j1
$$ plain form
651 94 47 69 -345 -262 3 -165 -106 267 -129 -157 -287 -285 -139 -226 -171 -208 46 -40 -1 148 -50 -133 173 -84 -84 -15
677 -15 108 48 -27 -69 -50 -61 179 -267 -121 -115 -93 -345 -70 192 -132 -44 114 11 3 -4 26 -59 -371 -20 78 10
703 10 142 207 227 35 95 -315 156 -35 -95 -18 -313 164 -78 113 -171 20 -317 269 181 -116 -265 -32 -37
726 -37 -140 -6 -25 -137 27 -220 -225 120 132 -13 -40 212 25 -398 -77 105 95 154 -134 52 -89 51 82
749 82 69 12 51 193 70 71 284 -178 189 -86 162 -77 422 -126 103 -244 61 -117 -271 -143 -73 -183 91
772 91 -129 -67 28 -33 58 -27 91 249 -150 -145 102 -212 243 96 81 -61 -105 48 -112 -114 -81 -110 119 111 290 -213
798 -213 37 -36 140 -104 -128 266 94 67 -10 -90 -35 282 -157 201 -71 121 -98 154 30 207 20 102 63
821 63 -6 -113 57 294 -67 -118 -40 -101 30 153 101 -90 169 -19 339 258 110 -13 -172 -93 -80 -46 17 6
845Fo0L5O1J09K08k85j1N3l44Q2J55K69m84L9K06N3j66L94n08L85l60J16O1l9
869b5K56m21J89n9j06L69k36%j1pj40O8K42J12k46m5K40j90J12k8q2j47M9J25
893A9K45k21K40m19M8k54K80l6K97m20L07j19m0P6Nj5J56l03J25o4po7oJ50Q9
918F6k84O6Q3n6J16j51J77J80k92N7O2j18O6M7R5l28K98j10m1P1N1m7J10k86J38
943c0R7m48N86j88l27L10K8M2j10l24J97J85k09K58m5P3k95L4QR8K03j75L11m50
967a71L7L29j97J40k24J45L25n32J51O9o3Q1l12J28K54j72k1NJ8n1L9k77L87m3
991D5q3j0j68J40M42k35J2k13K25j8l38K57j05k16K75QR3j85J62mj03J90q2n5
1015C4q1J34l00M10o8k21j28N03l10kk25K58K67m7k28m5jJ30k88L16k54k16L99
$$ plain form
845 6 -54 -19 42 151 359 74 63 116 -228 -146 9 278 -206 -167 39 92 -74 320 -188 197 -163 -47 14 -25
869 -25 231 -190 -1 -60 -166 203 -33 -33 -44 -51 -191 -123 119 231 -15 -60 180 -10 102 74 -8 -155 -106 19
893 19 264 43 283 -136 -88 -342 -62 -98 199 -221 86 -33 -73 3 8 -7 149 -154 -29 -93 -100 -167 -173 -23 66
918 66 -218 -152 -69 -125 -9 -160 17 197 -95 -38 24 -94 -28 19 114 -214 84 -26 -67 4 55 8 118 -168 -30
943 -30 67 -381 205 17 -310 0 28 70 -40 -364 -167 18 -191 67 22 95 -200 -166 -158 -60 143 -32 279 -171
967 -171 -134 195 -2 138 -86 59 384 -148 3 72 9 90 -222 -94 160 -12 -33 -28 -10 -61 -22 -299 88 45
991 45 -38 -48 -216 -76 366 131 143 -70 155 137 -201 56 -49 -265 10 18 111 -74 88 84 -19 171 89 34
1015 34 -47 87 -213 197 129 -92 -220 283 -27 -29 -254 4 271 224 -4 -49 -50 80 -208 108 -146 -362 37
1038C7o4j0K0Q3J15n14K05J44j85K73k58J40P1j12J06M2K7k13J3J37K7J42j27
1061I9n6j20K49K9o2j26j00P9O4L5J65m39J52j47oJ71j40Q0kJ31k11K22l26K94
1085C5K19k74q0R6j55L03j7l22l0K44K8K8j05q6N3O8m6M5J20k89N59l71J1J05
1109A39J17j34l08J43pn8L95m92J33Q3j4P0j17J49l11Q0mK74k7q4k20j7L37l47
1133b20O6Q3J93j92K95j49j06L44m31O4P6o8N7m6m4J66M6p5O1k84J72n9R3n9J12
1158I5j80J80k84L78l25k3P9N0N4on7q2J02o1j40J09O5K03j88K68k49Q3J33j22
1182H2j6j86L20l81L27m70M24QP8k90p9J3L38j83P3j5L7M4L6m22K79Q1j99L9K37
1207A75m13J26K09J13J41k02l77KJ44J2L20l41K34j24M1K32k60l6p4k25J33M79
$$ plain form
1038 37 -27 -37 -17 66 181 -333 -128 16 -169 104 -154 -14 57 -55 51 93 120 -93 -80 57 84 226 99
1061 99 43 -77 172 201 139 13 -87 -8 56 91 256 -183 -31 -178 -184 -13 -153 -73 -75 56 -155 67 -259 35
1085 35 254 -20 -100 -4 -159 144 127 -195 -225 19 47 75 -30 -116 -63 5 -41 4 124 -165 394 23 34 139
1109 139 256 122 -186 -43 -50 -108 287 -205 -72 11 -3 67 -50 99 -212 -132 -136 138 111 27 -193 -210 127 -220
1133 -220 -154 -71 122 -70 225 76 -30 314 -117 -53 23 -45 12 -34 -78 88 134 59 120 -164 8 -51 42 -17 95
1158 95 -85 95 -189 189 -136 -159 -80 -30 24 18 -39 -121 -19 -80 -220 -111 -46 157 -31 237 -12 71 204 82
1182 82 66 -120 200 -181 146 -324 100 108 186 -104 -183 -170 168 -15 58 43 80 124 160 -262 17 98 -101 -62 175
1207 175 -238 -112 97 210 351 149 -228 -226 -82 -70 250 -91 143 19 60 292 32 -4 -78 -303 -170 309
1229C09p09L11J7M4J4n3J14nj29L72k22J9j16P0l0p2K45K4o0j89l8j03L47l11
1253a51M06k52rp9l0J63j27R5j81K87J86l25J22p9j85L0K18p3J94j37j13J83k5
1276A18k61J68J21r2l4N5j66Q8n3L67m42L49j52j60l8M2j24L52l43M70k98j69
1298b02L12l0K63l20m1J31J98j11J2l23J04R1n7p8J0J31o2oJ79k38R0k08K39n7
1322B7R9J68r2m6p1n4k02j9J62k16L34l4k48J60J80l9j68m9K05K53o16M58k96
1345a04P6L0L6K35lr7j50J01j4n36J45J68q5J82K58k49O2K96l15k35N48J2m46
1368h5J71m8p9r0R6K81j49r4l23J12L81j47L8j51Q7K09q7l10L41O7l43K73Ro0
1392I9j49j97K67j71r6J30O4o9L00L8l69k9J30q1j01J76L08k6j68k1R2m45K86
$$ plain form
1229 309 -400 -89 -72 -28 -14 -67 47 42 -87 285 63 82 -34 36 6 -66 179 203 143 -46 -84 -187 160 -151
1253 -151 255 3 -6 -85 -115 48 -79 16 -165 122 308 -17 105 26 -159 -129 89 16 210 73 -40 143 118
1276 118 -143 25 146 54 20 75 -91 -3 -56 311 -131 218 66 -94 -132 -90 -214 138 -205 265 -33 -202
1298 -202 110 80 343 23 -18 113 311 200 212 -111 -7 84 27 -51 -41 90 28 22 201 -37 53 -155 84 27
1322 27 126 294 202 156 85 31 -171 -190 -28 -244 90 56 -192 -32 148 109 -59 -108 97 350 -266 192 -104
1345 -104 -28 2 38 273 270 173 23 124 110 -426 -281 -113 -198 -16 242 -7 55 351 36 -199 349 361 -85
1368 -85 86 38 -41 -131 -35 246 97 3 -320 -208 173 26 64 -87 0 209 122 -188 153 220 -123 150 159 99
1392 99 -50 -247 20 -151 -247 -117 -53 -122 178 216 -153 -182 -52 -133 -234 -58 250 224 56 35 127 -318 -32
1415c2J14j95k5j34J82L12k03M8j83k95N71k92J38Q4r4m6K27P4k33K25k14k3K5
1438C1K5P6n7j22J95j39J2j47O63m83j4j40k2O8k21K66j13L04j47k72L60j91l03
1461c71M41j33K02j12K9m4J18j23j69K81k59L21k22K39p7j90J43j43N7j72J43
1482d1L03j47k07J72Pj81L3L6j93k9J65K9j21K4LK26J89q9L9k6p9l13K48j54M25
1507C19o34J05L35j1j62K36r2k34K88j98k03K60mJ75L5k05q6nJ08J6J73l0o6J71
1531B91l80j80M10j66k54L68j2J1k76J90J29k56K27j76L5j10L20k43N1j6j72M41
1553B32j35J04j61j32J8K32K9k92Q7k2P1N4q2M7N0l56J51J48k11K67k07P8J18
1576H8n5q2k95K48l6J0K29j66J85J87k51Rn3L6k28K38j75R8m14N47l3q3k40M36
$$ plain form
1415 -32 82 -113 -138 -272 -90 222 19 67 -116 -411 160 -132 6 90 -4 -50 177 251 18 243 29 6 31
1438 31 56 132 75 -47 148 9 21 -126 537 54 40 -100 -122 -54 -275 -9 -122 182 35 -237 123 -68 -371
1461 -371 70 -63 139 27 56 12 130 7 -162 119 -140 181 -41 198 121 -69 74 -69 -12 -184 -41
1482 -41 262 115 -92 80 87 -94 -61 -25 -218 -247 -82 -53 -174 -150 -147 79 268 179 218 192 113 -200 48 -106 319
1507 319 -315 -210 125 114 -48 188 96 -138 150 -48 -251 9 5 180 215 10 -76 -81 27 43 216 186 120 291
1531 291 -89 -269 141 -25 -279 89 77 88 -188 2 131 -125 102 -74 -39 -149 171 -72 -21 -37 -209 232
1553 232 97 201 40 -92 -74 158 187 -105 -18 -40 31 85 3 50 100 -256 -105 43 -168 99 -108 -30 88
1576 88 33 -49 -344 -96 -132 -122 107 -59 126 313 62 71 18 54 -174 64 -111 -13 -427 120 87 4 -236 200
1600B00l10L00m6J50l33k5K95j62j58P6K06l46lN8J04K72k62j3M8p5R3j13j26
1623a70K16M8O3m56L79Qk49oK38M8k10j30J67M19n87K94K4J54k20kK45k48j2J17
1647A30k27PL7K12q3l27j68Q05l30%k3j01j14J24J67k82J24k5j22oJ53J76j41
1670a4j73N9J88l17L55J67j28j98J47m1j84J24J85j7O6L4R5j80j96j17K07l9l8
1693a5K18o33M89J43k06Q6l37K30j70L30m2j96J2J22j23MK36n2om07L55J25n0
1716A13J22j18r6l5j43L8K83k38L42k52L3K5J3L4k24N8L8q6J46%rj16k12M14r5
1741C5q7J59L4j98k15K78J01J26k88n9J33l29N5Q7L5J12J37lj85l14L29j88J74
1764g1r0J01o9R0l7L37l51K5R4R1j40k35N32m33K55j38j72K98j44j6r7J74n4j76
$$ plain form
1600 200 -110 190 144 294 -39 -64 231 69 -89 -13 193 -153 -156 -98 6 278 16 3 51 -24 69 -44 -170
1623 -170 46 94 157 -299 80 88 -161 -167 71 119 -91 -221 -54 365 -222 72 96 250 30 28 273 25 13 130
1647 130 -97 -90 -53 159 76 -251 -419 386 56 56 33 -68 -182 -58 109 -173 -49 -74 -196 -202 -49 127 -14
1670 -14 -187 -128 60 -257 98 265 137 -61 86 45 -139 -15 170 153 219 253 348 168 -28 -145 62 23 -15
1693 -15 203 -430 59 202 -4 82 -255 -25 -195 135 93 -103 -91 31 -92 -88 148 96 90 -317 38 163 113
1716 113 235 117 21 -14 -157 -119 164 -74 268 16 49 74 87 121 -103 -45 -7 -93 53 53 44 -72 -284 130 35
1741 35 -52 107 141 -57 -272 6 107 233 -55 -114 19 -310 -255 -168 -133 -21 116 113 -72 -386 -57 -245 -71
1764 -71 -161 -60 -129 -39 -76 261 -90 -65 29 120 -20 -255 277 -156 99 -39 -211 87 -57 -73 -170 4 -50 -226
1788b26K40L53l68k26l0N8M67m30q6l0J07J36p6M07R1m77K38j96J28m6o1J8j11
1811a20J15j7L25m35N38n22J31Mj44j01M62m27P2J39K4Rj54K22q7k33K90j69O2
1834a6K7M7K3j40J95j12k12K99j27J10J38J9j91k21L85n66N24j24k81N20k61q6
1856e0J37O1j86J13L1k05J7L55m56N8K9J81m2j36J04q7J38l92N86l04K82k11k24
1879b01J50k7j46R9J98j29Q9m1N2Nm5J46jk90r5J16K93L2k56p5R6O5J13j65J66
1904A49m34M21j50Q7k44L23J0m1k52o6Q1J42K24j44p9k32M96j50k44N1M7j80K99
1927A14j53Q9lj12l06O15j34r1k34J45oK04j02R8l28M70l77QL24l02j01K70k94
1950b06J70K65k14J81l78pM41j20j09K8j86M45m95K86j09j08J70m5j61P6j60L72
$$ plain form
1788 -226 14 367 -1 -227 -257 -199 268 -162 -248 -278 -171 -35 -111 296 387 -90 148 -48 80 34 -27 -9 -120
1811 -120 -5 -22 303 -132 406 -116 15 19 -125 -226 236 -191 -119 20 44 53 -101 121 34 -199 91 -78 -16
1834 -16 11 58 81 -59 136 24 -188 111 -16 94 232 251 60 -161 224 -342 182 58 -223 297 36 -50
1856 -50 87 148 -38 75 106 -99 -82 273 -183 -125 -96 85 43 -93 11 -76 62 -330 256 -48 234 23 -201
1879 -201 -51 -78 -224 -125 73 -56 33 -8 44 49 4 150 149 -141 -236 -120 173 205 -51 -126 -30 35 148 -17 149
1904 149 -285 136 -14 73 -171 152 162 121 -131 -197 -116 26 250 106 27 -205 291 141 -103 -52 -5 -185 114
1927 114 -39 50 47 -65 -371 244 110 19 -215 -70 -76 128 26 124 -204 266 -111 -103 221 -81 -182 88 -206
1950 -206 -36 229 15 196 -182 -189 252 132 23 51 -135 310 -185 101 -8 -116 54 9 -152 -76 -236 136
1972A36l56J61K9K6k36L18K34j58k76p3K04n8J88p1J22l84N3M4K1L7j04M61l33
1995a5j72P1R2M3j6q7om3L1L19k49K4M4K13k58k95M79m2j44k02J20J53p1J77j9
2020A47Q4q8j98Q4L2j27J05N0k98L4R0J00l1j94J98N8R7m01N59l59L42k41n7L2
2044A8j4n0j41K62n2j07q5K54j44Q9Q0q2J19k77R3J50%l56K32J58l06L60l33R7
2068c5K22q2j8k30K49nr6k59N6J68k42K58j14L12J7Kp3k14k0J54j67L80m9m05
2092a91J57l9J62O4M7r9m6q0p0L60m55J28K38j84R7j62J35P4j05J76j67o7m9L06
2116B30j12k52jL4J54l13J42j46j05K52L44m3j94Oj11P2K61o2k56P9N4j40J42
2139C5O8k41m4J70k00M82k19M1J63j46j27R6j8K22j85j98K98k46rk11J77P6k4
$$ plain form
1972 136 -220 -59 -30 -4 -240 78 312 154 -122 -195 9 -49 139 68 190 -194 -141 -97 -76 -39 -143 318 -15
1995 -15 -187 -116 -24 19 3 -84 -90 -133 -102 217 -32 -8 36 249 -9 -304 175 133 -11 -213 -93 60 -11 166 147
2020 147 231 143 -55 29 61 -66 39 89 -209 -175 -85 15 -16 -210 -12 46 143 -258 301 -58 284 43 -14 18
2044 18 4 -46 -187 75 23 -84 -169 85 -59 30 110 28 147 -130 -37 113 113 -243 -11 147 -159 201 -132 -35
2068 -35 187 105 87 -143 106 101 5 -254 -198 -30 -272 -14 -128 184 201 203 130 -84 -104 50 -117 263 214 -191
2092 -191 -34 -73 89 153 200 101 55 -25 -95 265 -190 -62 176 -8 89 -73 62 136 31 207 40 -27 -76 230
2116 230 118 -134 -135 -101 53 -260 -118 -264 -369 -117 227 184 -10 -4 -115 -43 218 156 -100 -21 33 -107 35
2139 35 103 -138 -182 -12 -212 270 51 92 255 109 -18 78 60 282 97 -101 197 -49 -58 -269 -92 -16 -40
2162d0j00K18l54J49J53j89L42m16L52k40M1j32M35r8k02Pk2K73k87K05k19n1
2184a75N3m7l9L47j48J88j15L0l67J33J54J29J3j52j6J81j40j4n1J38q2k67M05
2207A58l93K61j17L35O5m57J20q7J27q6k7M7J81J2o0j52N2K6K2k07K19N9L0J27
2231B55m96L18j95K62j40nR5k46M87k36j14p3J96N9l29J08LO4L4k19K76J03j12
2254I5l12J42J14j27K16l3l36J93j40K27J9j45K7K30k22J21O0j27J0l9m5mK82
2277B06l45R0j95N7J93o6pK84l37J01M0J05M3k00j71J78J33k13K10k58K20j09
2299d1K77k92J06j74J04j45Q3J14J4O3j58K61k66M2J34j28j03j0J10O9j80Jp6
2322a95J94m0O4Q7l96K90j44K46k75L38l06K12j01p5O1K11k82M79n20J60J03m1
$$ plain form
2162 -40 -140 78 -276 -127 26 -163 179 -237 115 -125 -84 -216 219 121 -81 -74 -96 177 -110 95 -124 -175
2184 -175 -122 -169 -208 139 -9 179 64 94 -273 -140 14 143 156 4 -12 169 29 15 -36 102 20 -247 158
2207 158 -235 26 -91 244 309 -148 -28 -115 12 -74 -101 -54 127 139 79 -73 -21 5 27 -180 39 98 128 255
2231 255 -241 77 -118 144 4 -1 94 -152 335 99 -15 -88 108 167 -162 -54 -51 13 47 -172 104 207 95
2254 95 -217 -75 39 -88 128 95 -241 -48 -188 39 58 -87 -60 170 -52 69 129 2 12 -27 -72 -76 206
2277 206 -139 -49 -244 -187 6 -60 -67 217 -120 -19 21 126 169 -31 -202 -24 109 -104 106 -152 68 -41
2299 -41 236 -56 50 -124 -20 -165 -82 32 46 109 -49 212 -54 -12 122 -6 -109 -119 -9 60 -120 -119 -195
2322 -195 -1 -41 23 110 -286 4 -140 106 -169 169 -137 75 -26 -101 -40 171 -111 368 -152 8 111 70
2344G0j35q0R3K65k76K53l3J69j95J10k44OJ26j21Q1j41P5K3k5k24J57%j66O9
2368a43J84K6j1m0l2m07K08L28J6k8l60K26J50L1o8r0j07Q7P1P0j52k7J7J71k52
2393a32K79k41K09J12l57K87j55m25K67j09N03j12J4N5j17k38l6K59k70K44m6
2414iJ99k31K07j01p9k3j25r3L25k00L35l21l5K90o0J48l38K04l18L07J3j84M1
2437d8J3k70N43k12l32L73j93L84j66k12J49j62K61m2q2j70L43j30k03J28L10
2458B82k63J05j40k66L77N3j98R2j10K74k47J88j39q6Q1j23L19m19M88n12K82
2479C8M2J11k56J25K92n51J98k05J34K62j84p7n8L09O9n49K43J63j65R7k95J42
2501a15N2O8j02N7m9n2R0k45M65l31K47k66r3M31j19q9O4j81k6J76J27j50L91
$$ plain form
2344 70 -65 -145 -52 213 -63 190 157 326 131 241 -3 3 129 8 89 -52 23 46 21 -203 -46 -46 -212 -143
2368 -143 41 67 56 16 -16 -423 -215 113 129 101 -259 -33 117 148 80 -10 -117 -30 41 111 -41 -68 -51 120 -132
2393 -132 147 -94 115 227 -130 157 2 -423 -156 -265 238 126 140 195 78 -160 -196 63 -207 37 -9
2414 -9 190 -41 166 65 -14 -37 -162 -255 70 -130 205 -116 -151 139 79 227 -111 93 -225 82 95 -89 -48
2437 -48 -35 -305 238 26 -306 67 -126 258 92 -120 29 -133 128 86 4 -166 177 47 -156 -28 282
2458 282 19 124 -16 -282 95 148 -50 42 -68 206 -41 147 8 -78 3 -120 199 -220 268 -244 38
2479 38 80 191 -65 60 352 -199 -1 -206 -72 190 6 -71 -129 180 249 -300 -57 106 -59 38 -257 -115
2501 -115 -63 5 -97 -40 -89 -141 -51 -296 169 -162 85 -181 -274 157 38 -51 13 -168 -194 -18 109 -41 350
2524C50k83Mm71L52p6M0K89j10Q0k88K80l26K76j53k2m2J72j29J24j07m9J36l
2547D4j25J74k13L46k43q1l2n3J84M5L2qJ2j56O5o5J88K2J57J4k10j30J31j9k40
2572a61L4o4K00L9l5m73L41J78k4n1J26j89O3L3J1N5l7NOJ09Q7k58m9oN4R3j43
2599e6Q9j19J36L3j07O9rj02N7o5n2O1M13j51m58L49j54L79j99l55N21l34N1J5
2623A2n2K70j71m5J08k46R4j17J74j27n6K49J04j19K9j13Q0M5nJ28j55r4O8K16
2647B77k17Q0q2J03j73K7P6j79Jnoj4K6J29lJ4M0j79r7K48R1n08L11r4O4K61k66
2674g5J80OO8j37k07J64n0J33R3m63N57J8j64l22J62J80k6k06L7J44k41p2K01
2697b0j72Q9P7k1J63m13K60R7k52K72k38N1J37j39J46j07j24K85j48n4k00K79
$$ plain form
2524 350 67 71 -400 -48 -124 -84 205 95 175 -113 167 -159 117 -36 -58 -100 72 -57 67 -40 -89 47 44
2547 44 -81 93 -120 226 -17 -98 -130 -183 1 46 78 70 82 -74 -9 -74 114 136 293 307 97 -33 98 79 -161
2572 -161 -127 -191 9 48 13 -460 -119 59 35 -16 110 -79 -16 17 28 83 46 51 57 166 253 -5 -54 -60 -6 87 -56
2599 -56 33 -86 50 83 -24 45 36 -66 -9 -74 -126 -65 348 197 -261 88 -66 313 114 -241 280 -54 -3 12
2623 12 -40 230 59 14 122 -124 -30 -147 27 -100 -156 93 197 78 107 -6 74 119 114 242 87 -7 61 277
2647 277 60 140 58 161 -12 15 91 -88 -87 -92 -98 -112 -86 43 40 54 94 -85 -182 66 157 -351 -40 -134 -70 191 -75
2674 -75 105 111 179 42 -165 -1 -51 82 175 -288 269 287 123 -199 -37 143 117 -89 -52 92 -149 -221 -20
2697 -20 -192 -103 -26 -47 116 -297 -37 60 -192 80 -158 -107 30 -109 37 -70 -194 91 -57 -111 -311 -32
2719c2M30l42j33J5j52M37j26j43j69L1J7J44n2p8K45O1Pj05K0j40J23k26N8J24
2743A4m1m9J06M8M2j62J15k90l0L95l18J62M3K26k42k%QL5l32J38J76K8k21N5
2768i6M4O5j23l4J77J38o4r8J76j06j72J74j67L3j42J43K79l57l8L86l51PJ01
2791b5J44p6k4k8r5L16m70K84P9p1j09K66o2m6j65J55J11k49K86l14J59M3j90
2814h1LR6k87k6L5L93o2l7j34r7M55l31m3L48m75K81j40J01r7j93J99J57j75K0
2838i0N0L8M4j52M14k98n4J70j39J12P1j34mn0JJ2j44L12j73J35Q3l90K77J89
2862B80l09J16j24mp6R5k18J03k02M06m6o5k7L2J76j37l14m6J50M45l52K39m5
2885G7n5N3p0n3R5l16L86k50J85nk39L47p2k29J49N3j13L87k16r6K70Qj5l73J31
$$ plain form
2719 -32 398 56 -77 -62 -214 223 97 -46 -215 -184 -167 -23 -75 -153 92 153 160 55 75 -65 58 -168 -110 14
2743 14 -27 -76 30 78 120 -42 73 -217 -247 148 -170 -8 35 261 19 17 17 25 60 -272 -134 42 70 -151 -96
2768 -96 -52 13 -110 -144 33 171 107 9 185 79 -93 81 -86 -53 -195 -52 227 -130 -168 218 -133 -126 -25
2791 -25 119 43 19 -9 -104 212 -258 26 105 34 -75 191 129 83 -82 73 184 -65 221 -93 66 109 -81
2814 -81 -78 18 -269 -295 -260 133 71 34 -100 -197 258 -73 -116 232 -243 38 -102 -1 -98 -291 -92 65 -110 -90
2838 -90 -40 -2 42 -110 304 6 -48 122 -17 95 166 32 28 -22 -21 -9 -153 159 -14 121 204 -186 91 280
2862 280 -29 87 -37 -41 -117 -22 -240 -137 -339 67 21 -44 -71 -39 137 0 -314 -360 -210 235 -117 122 77
2885 77 22 75 5 -48 47 -269 117 -133 52 47 -192 155 83 -146 3 56 -57 330 114 18 288 296 281 -92 39
2910C9j80j09N03l48K23l1j82K65j9l33P1J8n1R1m3N3J34k34K07J74m15J97O3
2933I3R1k76k42N80k46J9Rj3j78K83O1l89J04K46k3l02Q0J9j32J86nJ60j36J78
2957A67k48K49j05q0N5J19J2j50m55M77j39J92j71J78k3m1K76n36k8M89l03J01
2979C6O5l08J41k01K21J2k11N84m38J54J00o1K85j72o8m6j11J88j31L9j33Pl4
3002h2O1o2n3mJ99k6k78K44Qm7J73k37L34m54N4n4L55n9j4j78J09J1R7J95m37
3027a45O1R0K0r6L66k57J94k59q1k0l2L23k05j19L35m29N83j44l11Q7k7Q2Ll37
3051c18O0K76J66k48r7J36J9j20L8K19j4n4L9l62K73k16K78K6j79J09p6K07r6
3074F6j38Lk5Q5J35O7r0m0k53k5K15j61K65k6J05j4K3j23Q4k06q1j11O01n62K31
$$ plain form
2910 39 -141 -250 253 -95 128 97 -85 180 161 -172 -101 -83 -134 -43 -86 -33 101 -133 74 248 -167 30 93
2933 93 184 -92 -334 246 0 19 28 15 -163 120 181 -208 -104 142 119 -183 -103 -84 -216 -30 -35 125 -11 167
2957 167 -81 168 63 -17 38 157 169 19 -436 41 -98 94 -77 101 78 37 313 -223 -251 238 -65 36
2979 36 101 -207 -66 -267 -46 -34 -245 339 -99 55 155 94 379 207 139 93 -18 170 39 78 -55 -48 -82
3002 -82 -21 -83 -136 -140 59 33 -245 -1 7 -40 133 -104 230 -224 -170 -224 131 72 58 -120 -11 0 97 292 -145
3027 -145 -84 6 26 -70 296 39 233 -26 -107 -127 -159 164 -41 -160 175 -254 329 185 -126 -39 -66 16 19 -318
3051 -318 -258 18 184 -64 -161 -25 -6 -126 -88 131 117 63 102 -260 13 -203 75 101 -78 31 -45 162 66
3074 66 -72 -69 -94 -9 126 193 103 63 -190 -215 0 -161 104 78 183 169 192 69 153 -53 -134 -245 356 -206 25
3099B5q5m0J31k0O8j4q4K33p5j75L39l41j0K86m98L4r6M72k72j31J4M1J82j8l2
3124f6J15Rj96J09L53m35J28j40K33n5M0j62j0J96j44K3J52r4j21k7jQ6k4P1j64
3149a24k7M96l17q4K31k35L70n17o7J50J21k91N2J37k63N29l15qq3R0L58k70J6
3172e1L3p5j79M31J1l73K99J64j21K25l54J7m9L66k93j05J13j99K1K33m28M24
3194A10m0o0J9J93j93Mk3J54k93J2R1K0K18n8K25n18K59J38l6k47j82K61j5j61
3218a22L49k9l13K68j87r0P2RQ6l1j66R5J53k96J28N2M0K43k36j0MK6J66j41j32
3243f2J82j87o7K24o6n5r9N20k96Q0j37j01lK12j43RQ1J70K4j46mk86J53J38k54
3268a13R2j86K18j60J66p0J12J9l0j22j2M60j78o24M54J38k21J61j21j84K02J40
$$ plain form
3099 25 -60 -100 31 11 79 65 -19 214 139 -36 303 -38 -48 238 -260 -226 -322 150 -122 -253 -239 -198 -16 -34 -66
3124 -66 49 58 -138 -29 324 -111 17 -123 110 55 95 -67 -77 119 -25 -2 150 56 -65 -92 -93 -7 -31 40 -124
3149 -124 -151 345 28 -56 175 -60 310 -207 -274 -124 -3 -294 -242 -105 -368 161 -154 -162 -245 -155 203 -67 -51
3172 -51 -18 -93 -272 159 170 -203 96 260 139 364 10 27 -22 344 51 -54 59 -140 -119 114 -314 110
3194 110 70 10 29 222 29 33 10 164 -129 -117 -26 -6 212 154 379 -139 120 258 222 -25 -207 54 39 -122
3218 -122 227 198 -115 153 -34 -124 -52 -43 43 12 -154 -59 94 -202 -74 -22 18 261 25 15 19 45 211 70 -62
3243 -62 120 -67 -134 90 24 -31 -130 390 94 174 37 -64 -67 145 2 11 92 262 286 140 136 -150 3 141 -113
3268 -113 -21 -207 11 -149 17 -53 59 78 48 -74 -86 374 196 -428 26 164 -57 104 -17 -201 1 141
3290A41l5k7j89R6KJ10K46m47K68N3j34O3lq9O9j95K89m18K04q2J23J15l53J98
3314Ej13K09N2R1j28Kk21Q4j26L95k92J76m4j32P2K24k43K49p3k13j34J33K09
3337A82j3j07k93L65k43j94N00j99k6J54k98J81K73j74j25R2m38L59j16J06j08
3358a22K12K65n41Q8k5K09n8N1%l7k62R4J89J98n28L91l33L4M3J83L2j49L29k1
3382B42j70r7k1o8P7J82l57K92K4m0Q6l33J13K35k22j77N17l15k07K59l1j44j6
3405a71J78J63q7l84K58P8J21k61k2M7K7R9l3Nm9k9P8p3j00P8J70l2o1l1R2k67
3431b06M98m46j6J65o6K52l21R7j0J38j38K47k66Oj75J88O2l44J50K41J55l01
3453i0K62l33J18o3J64J36k28j28J49k7L01l42N2J22M2l13L03m9Mk1o9Q1j12K95
$$ plain form
3290 141 106 79 -110 -14 -12 98 344 -103 165 218 84 147 144 55 124 -71 218 -200 4 -78 45 160 -193 5
3314 5 -108 101 153 244 116 118 -103 -19 -145 250 -42 134 90 -42 30 254 11 260 187 -26 -160 -27 182
3337 182 169 62 -231 134 -109 -303 197 -2 -28 126 -172 9 282 108 -17 75 -363 -4 -120 -14 -122
3358 -122 90 355 -186 -98 -123 86 28 79 79 42 -220 -126 63 261 -267 124 -209 -175 -132 51 83 -66 263 242
3382 242 72 -25 -46 -114 -37 145 -212 80 104 64 150 -183 -70 165 -57 -234 283 -32 -239 20 -11 -155 -171
3405 -171 7 170 83 -301 -43 35 156 -105 -127 -80 -53 46 13 18 -31 -60 18 -55 -155 -77 93 61 0 -31 61 -206
3431 -206 292 -154 -170 -5 -71 181 -140 -43 -53 85 -53 194 -72 -66 -241 -53 9 -335 -185 56 211 -90
3453 -90 172 -161 -43 -106 58 194 -34 -162 -13 -40 261 -81 -29 93 135 -178 125 76 80 59 -10 71 -41 254
3477B54j59n9J30k50L26J36m06M9p8J97j4k08o2j4L44k06J41k27L00p5j08Nq0
3500f4j5j59K10K92j57k79J69m5K40K85m30j13j3k5L42n08K48O5L2K49m97M10
3522B37n59K88J46j33r7l7K96k27M8J24j82Q0j69K73R2j15K9j73l15M19j87R1
3544g1o1J1k79K21L27j41j01m2K67O4J4j24l9m59J78M11m3j15M1j61l8K81l05
3567a64N22o03L35J23k32j28J90o8M0N3r6M21n44R5J49p0K9j46L18k57J45j9j16
3590b3j8j09K38o4j02J63J57j79K9j13P0K53j99j52j41J59J41J09o8m79M03p1
3612DM1j3j15J29j06O9k52K56J04l27K74j25k10L31K82l97J5o5ON4K48k57N26
3635D72l72k37J53jJ22k59Q8R8k12J24o8J95l9m3Q0j90OK89l41o6%J93J27j39
$$ plain form
3477 254 95 36 166 -84 242 378 -28 21 -57 140 126 -82 -144 -158 186 -20 121 -106 194 119 11 16 -64
3500 -64 -79 -238 -28 264 107 -172 -3 -48 192 477 47 -66 -79 -104 238 -270 -22 43 75 324 -173 237
3522 237 -322 -34 112 -21 -118 -155 141 -86 -38 86 -96 -16 -185 88 180 65 94 -79 -394 25 -162 -71
3544 -71 -132 -121 -400 -179 148 7 -94 -136 131 195 209 85 46 -413 -235 176 133 18 59 -102 -140 141 -164
3567 -164 358 -245 90 213 -19 -147 43 -25 15 68 -28 393 -151 -56 93 23 52 -94 224 -33 112 93 -23
3590 -23 -41 -150 88 24 -78 85 242 63 92 -21 49 302 103 -49 -190 -31 110 219 151 -328 75 4
3612 4 45 32 -83 46 -60 9 -243 13 117 -210 64 -61 -271 60 342 -55 -40 -105 -99 -45 203 -54 472
3635 472 100 -137 16 15 137 -122 -34 64 -148 -24 -92 103 64 21 101 -89 -83 206 -135 -201 -201 -8 119 -20
3659b0j67r7r0M32p5J68k34Q6l3J84l52O1L15m0n1j9j10r7K37j64p9J47j3K1J95
3684B05k66R2qK13l46J76l2qP7N0r7p7k95L12Q1n2j89J54J35J43k38J49k10j9
3708e0K41o5K61l44L7J76m11L4K1M5P6l05L83l25R6j7J0J42K20k37p6L07j06l2
3732H1lj73J08k6J42k79k4M54k49J52k45L91n03L0O1J84n5pj06Q2P6k20L9N6L2
3757bJ20J07j61j15L9J78k60Q0rM6J8R9m7o6k94L99j76O2k37j70M66k29N38k41
3781A45j37k6k1P5M3m26N79j42l76N06m62R1K08k7j00K47r5q0P9K3k6j80J8j01
3805a85L57k32m1K4L7J22K4j16K0J78m5j0Q0n1q1p6J19J55o9k12k66K79j38PJ46
3830B6j87J77j58K17j58P1M5l05P9J75J3j19J3J6L67m04R7o2J33J13p9p8K53k42
$$ plain form
3659 -20 -187 -284 -374 58 -17 151 -83 3 -30 154 -198 -137 178 138 87 68 -42 -139 98 -66 -145 2 -11 10 205
3684 205 -61 31 23 236 -110 66 34 26 103 153 56 -21 -316 -4 77 25 -164 -10 125 268 30 179 -31 -50
3708 -50 191 126 387 43 80 256 -155 -121 -100 -55 21 -284 99 -226 -130 -147 -137 5 225 -12 -88 219 113 81
3732 81 78 -95 13 -13 129 -150 -174 280 31 183 -62 329 -174 -144 -83 101 46 39 -67 15 91 -129 -90 -34 -2
3757 -2 118 225 64 -51 -12 166 -94 -14 -23 23 41 140 93 27 -267 132 -44 18 -219 -389 77 -152 386 145
3781 145 8 -18 -39 36 79 -347 232 90 -286 220 -242 -151 57 30 -70 177 82 2 81 104 78 -102 -84 -185
3805 -185 172 -60 -101 -77 -40 82 106 -10 10 188 143 133 213 162 81 5 124 279 210 -2 -268 11 -127 -120 26
3830 26 -161 16 -142 75 -83 -12 33 -272 -193 -18 -5 -124 -111 -95 272 -132 -35 -97 36 149 70 -8 245 3
3854CJ39j57R1k02p1K48o1K14k28j95r4M71O7j55J15n8k96nJ15J33k01M67k40
3877A00j51J74M2k89k6K91j07J9j47J22RnK21m49K46j61J35o4J39K8j08k12J51
3900d2pJ30o4M5k34J03N7J88Q4k18J90n8l79J81L4J08k54K58k53J83M7k56J99
3923D2j94K88k11J43Q7M0k79J33k25K51k2lj44L12q9R2k65Ml8Q2J66k84J28J77
3947A91k50J37Rj21K13l99J87J5Q6J26k77K88j1j18j3j59N42m19K5n6P4M4j4l56
3971b56J99J04O1l57L06j17M8k0O2R8k07J19j01l7j39K63j05LJ29j4j26j04L41
3994A50O0j71J12j10P1k17J41K3l61J94K07k05J13K64k79k9Q4Q9j64j91O8L87
4016B36k01L4J29k96J94j18M1PR9j75K07q8m24j3L01J70K83m16Q0N3j03o1j60
$$ plain form
3854 3 142 -15 76 -126 -197 51 -10 204 -24 -219 -313 158 225 70 185 127 -169 -174 -59 74 -127 340 100
3877 100 -51 123 165 -124 -150 141 34 53 -94 28 37 32 253 -196 50 -111 24 -40 99 127 19 -193 -42
3900 -42 -49 81 17 62 -172 -69 -12 176 260 42 232 174 -205 -24 10 118 -136 122 -131 52 99 -157 42
3923 42 -152 136 -75 68 155 195 -84 49 -176 75 53 50 -94 218 129 221 -44 -40 -78 4 170 -114 14 191
3947 191 -59 78 87 -34 179 -220 -33 -18 68 194 -83 205 194 76 63 -96 446 27 52 -4 70 114 100 -256
3971 -256 -57 47 108 -249 57 -60 -12 -32 30 128 -79 40 -61 -98 -237 26 -79 -76 53 39 -87 -191 150
3994 150 210 39 151 41 112 -105 36 59 -302 -108 99 -106 7 271 -8 -37 47 136 -28 -219 -151 236
4016 236 35 69 198 -98 96 -22 19 26 125 -50 157 69 -355 -368 -67 103 386 -30 50 103 0 -61 -221
4039b21L13o8k2Q7jK9J19l29k14K93j27K87j00K83m56K89p7Q8k31j01j56J89K37
4062A11Jj03j39m3J89L5k09K16j66M11l03J31j44P0j8j00J65k79j5K44J21k63
4084h8J46k6J78l13P9J45k1r8J50k50J20K15j09jj97q0l3L01j29L0j82J53Q5R1
4108A66k41K76k48l8P5K9j36M6J3P7J19l08K32q5J38p0j01N7L6K60l31N9R9k38
4132a14J70k63j02M42r3O8l17K10J70l1j93J96l34J72K26j28r6M9OJ2j74O5R7
4155C8r8R1k27J22j4O8r9L14j25k73p0J90N15o78L74k04J38o4L7K3o0m5j1j02
4179a60M4L6J05Q1j65l1J90j65J15j51l3L0L60k49k72L7K78N2J21k01j76M6L04
4202A96K3j51r1L1J59k35L20j07k88K19l1m4k52J48jJ12o0J53r0j45J62j90J89
$$ plain form
4039 -221 92 24 2 89 88 117 236 -93 -307 -14 -141 146 46 329 -127 162 85 173 -58 -159 -315 -126 111
4062 111 112 9 -130 -173 16 51 -158 58 -108 303 0 131 -13 57 39 -61 104 -175 -190 54 175 -88
4084 -88 58 32 210 -103 -24 121 100 2 152 -98 22 237 128 127 -70 -150 -183 118 -11 19 -163 -10 75 166
4108 166 -75 201 -47 -85 -10 19 -117 -71 -58 19 138 -170 62 -23 115 45 -56 1 37 297 -34 25 124 -114
4132 -114 56 -207 -309 133 40 108 -209 1 171 140 -53 143 -191 -19 207 79 -17 32 38 50 -124 -59 38
4155 38 -60 31 -196 -74 -88 -20 -119 195 70 -203 -273 -83 432 -246 128 -76 62 -2 35 58 -2 -47 -58 -160
4179 -160 -116 -80 25 106 -59 -90 100 -65 50 -101 -134 -104 256 7 -265 -228 50 102 223 22 -154 -108 196
4202 196 219 68 -23 8 167 -68 252 145 -143 76 45 1 -251 -103 -104 8 -52 101 11 -134 28 -162 27
4225B7k0nk0j08N1Q8K53j38oj34M2J34o8k28j78M87k50M5J35p9q5j28J13K4jp2
4251a21P2P7K5N3l0j37L13q5k17J41mk17K25K63l97Q3J62k24P9j20k3R0m9n5q7
4276a83J87j25j86L09j1oj13L4O8n4j21K01J07j82J77P5j26j60K18l62M11j65
4298gK4n7o8J16j5L0j29N4o5N1j29M30l93K14j2N6j34l03L09j4P3l0N74o31j08
4323a64J71P4P1j28mj49J20M9j36n7J75n2j07J71J38j48j27J34l3o8L6j31L33
4346A68j96k8j12M3L56k77R5L75l37k73J51J90J43j82k53K88j25Q1n9k6m9k4O2
4369A1j03J95k85K83o3K8q3n2P0J05k11J64l38L30j04K52k00Q1l5J68k79k54J89
4392a31M0J11p4J19n0m2M8qJ05k23J35j29K01J00m04P9K58j44O5K29k75j7j78
$$ plain form
4225 27 7 2 -18 -126 -75 13 266 128 122 -12 30 164 96 -132 -310 177 -73 -28 107 28 -57 -185 -72 -48 -49 -121
4251 -121 -49 28 53 106 76 -61 252 167 -50 91 87 -130 95 358 -39 44 206 -18 61 -59 -82 8 -41 -96 -183
4276 -183 4 -121 -307 2 -9 -15 -128 -94 -26 -80 -201 0 107 -75 102 177 51 -109 109 -253 158 -7
4298 -7 17 -40 -108 8 -7 23 -106 -52 -117 -66 -195 235 -158 56 44 100 -34 -337 -28 -42 31 1 575 -56 -164
4323 -164 7 81 152 24 20 -129 -9 40 -96 -153 22 -30 -137 34 172 24 -103 31 -2 -70 -34 -165 168
4346 168 -28 -56 -168 -125 231 -46 49 424 87 -186 -35 155 298 116 -137 151 26 107 48 22 -27 -51 11
4369 11 -92 103 -182 101 38 66 -17 -69 1 106 -105 59 -279 51 -53 199 -1 80 45 213 -66 -320 -131
4392 -131 -91 20 -54 65 15 -27 21 13 118 -105 30 -99 102 202 -202 -123 135 -9 56 285 10 -7 -185
4415a85P7J10J37j1n7O7l2l03J93j01K08R8j03o1L06n16K65J41l02j38p7K66m6
4438f4J85k33J70Rl99M62M5j53j39J71l6L5k7l29L82J39l8j71j45K09K39m14J26
4461B4J65j83J42k95J21N8r0j7j04K50j90K37n6N4o8N1r8j34J10l8O1j76K07L5
4485F6j2j97J96j10j77P0n5K01l8j09K47j51j3j11J19J28k34K63Q9m82J67J91
4507D8q9lk20J06J53K47r1k09j63J19o8J5M19n02L18k36K26l72L81J61k17k8q2
4530h7O0k0J09k35L14k85J16J12j65J09J16j38J54l86J48j05MM66n26L05l10K70
4552B6p7O5p6J48r0l22K84q8J8K7qk7m6K2J36K02m09J16L21J2q8k33k58J72p9
4577b52M63l77O67n25LJ89j68l32L80l8j27K22k14j8J05n2j2L01l63K99k56L7
$$ plain form
4415 -185 -108 2 139 128 71 138 106 -197 -4 -105 103 201 98 37 343 -173 92 233 -69 -207 -284 -18 -64
4438 -64 121 -112 58 67 -332 130 175 22 -117 54 18 53 26 -303 79 218 180 9 -136 73 312 -102 24
4461 24 189 6 148 -147 -26 32 -58 -75 -179 71 -119 118 62 116 48 99 1 -133 -23 -61 0 -176 31 66
4485 66 54 -143 53 -57 -234 -164 -219 -18 -56 -165 82 -69 -82 -193 -74 54 -180 83 172 -310 -143 48
4507 48 -41 -44 -264 -158 -5 242 151 -58 -221 -102 -170 -155 264 -238 80 -156 70 -302 79 240 23 -5 -87
4530 -87 -27 -47 62 -173 141 -144 -28 84 -81 28 144 6 160 -226 -78 -183 -179 287 -239 66 -244 26
4552 26 -51 14 -62 86 -4 -326 -42 -130 -112 -85 -93 -120 -166 -144 -8 194 -215 -99 222 234 146 -87 -345 -173 -252
4577 -252 211 -166 501 -24 -21 168 0 -332 48 10 -117 105 -109 -127 -22 -74 -86 215 -148 151 -105 -68
4599f8n8J48K2P2qk58j1K52r1J19k13j26K10J03P3k14j8q1R3Pj02k39L74k20K24
4624a0K08q2l4j74J61m0j5j07K30o3J3j59J90K3k38J38J83m87J91j89Q4L20L8
4647A81k00O6j83L04q8k9Ol66J55N80o40L64j50j97K75l20J78J02k08L14M0k49
4669f5j5J73j41Q2o4K20Q5p7q6j76J71k90L08o4l16j6KL29k62Q9K2Q2Ll8J64l90
4695b70J1K44pK5j29K14l5m87L95j6j07k12N24k48K28k24j84L40k2r8j43L86j91
4718fq0Po1K63k99J88J6j27R2K70l72L9J99j42k41J63O9k22Q8K7O5J11k20R3M5
4743c5K12k42K54j86K35m05J32o4L1JJ08n34M09k7K28l38K26l3L3O5J5l7k42J69
4767b5L3K27l14K79l91L46j94M3L7k34J80J79m1j36j90J38J14r2k01J94K69k60
$$ plain form
4599 -68 -126 22 44 116 108 -150 -161 91 0 119 -94 -220 -10 93 166 -48 -66 -147 -54 -47 -149 -388 -14 -234 -10
4624 -10 198 116 82 -92 69 29 14 -93 137 74 87 -72 118 141 -97 41 224 -263 -72 -261 -177 143 181
4647 181 -19 47 -136 168 80 51 57 -309 -154 426 -214 150 0 -197 78 -242 -64 38 -170 144 184 -65
4669 -65 -80 93 -48 34 -30 190 275 198 112 -64 107 -183 125 61 -255 -271 -269 60 -202 -113 -91 -9 -6 -44 120 -270
4695 -270 -259 -15 -22 3 -126 88 53 -434 -39 -55 -162 -374 150 -98 130 -94 -278 62 40 -58 -201 185 -6
4718 -6 -86 -79 -140 123 -176 12 28 -99 -7 263 -109 -70 129 -13 -254 -91 -22 -244 -156 -129 -64 47 -173 -80 -35
4743 -35 177 -65 189 3 238 -167 -35 -99 -68 -67 41 -493 -84 -111 117 -221 5 -28 5 70 85 48 -194 -25
4767 -25 8 235 -79 200 -191 155 -39 4 41 -193 -13 166 125 -11 -201 -63 51 -41 -242 -48 221 -39
4789c9k97K71k29N05j81k06L23j4l3j84R2J30J60k40l2j72K88k1M2j93R9j60K15
4812A24j09j09K7J41j17O5j43n7R9j57L00n3m0Q8n9l9K0j07mm7L67r8l84K01J16
4837B5P5k35j70M10j58J73k5k37K43p6p5l4k1K31k52l0J29J41j65k1J13j4j72
4860a45PK2o0K14M6j97J96J3K6n4K06k06n4M8o3j98J58J89k06K07j71j67J88J74
4884A73j07L1k71M34j73K4j21K4L0k17K2J77J79q4l91Q4R5J60j08N0k9M8j39J29
4908B0K8J64k80j03P7K2J07j35j06J53K49k58P0n6j2J36j03m17N28P4n4J02j53
4931E3KJ22k7l72M20l66J81N5K71l61Rk06K58jj81j1J10p6P1K81k27J37K3J05
4955B70k58j52j3L02k40J49j7N7l29K85J46l83J92Q6mj43j1j75J45K06mo8l9J88
$$ plain form
4789 -39 -336 -65 -294 211 30 -176 147 133 100 -84 8 138 298 58 26 -146 142 121 163 -30 69 -91 124
4812 124 15 -94 -67 74 -43 22 -121 -178 -79 -236 64 11 -29 59 0 -39 -19 -126 -130 -177 190 92 -292 -91 25
4837 25 100 -135 -305 105 -53 120 95 -142 101 25 -50 -84 -105 126 -126 -156 -27 114 -51 -72 41 27 -145
4860 -145 -138 -116 -176 38 84 -113 83 96 122 68 274 68 14 62 -1 -199 -41 148 -58 149 -22 -189 -1 173
4884 173 66 97 -174 260 87 111 -10 14 44 -173 -151 26 205 121 -270 -186 -91 69 -39 11 -18 30 -109 20
4908 20 48 212 -68 -171 -94 -72 35 -100 -206 -53 196 -62 8 -48 -60 76 -27 -444 84 158 104 206 53
4931 53 55 177 150 -222 198 -168 13 68 339 -22 -13 -219 39 38 -143 -154 -44 -120 -49 232 5 142 165 270
4955 270 12 -140 -153 149 -91 58 41 98 -231 54 200 -183 9 95 91 -52 -63 -238 -93 113 109 41 2 190
4979A90l54mN34m63J84j8Q8l12k4J17r0K49j08l1J36k70LJ28J40j97n0K11k94
5002b35L39QJ67l29K73l5l2r3k53J59M1j45J98O7L7l31J0Q1P9k65K33J71k47L0
5026g2J92L0j87K84k04l1l5o7Q5j59K4Q0K0p5K40R4J09k41j26J64n08L29J07j83
5050a30Q9J10J41k24l3K90l22Q2k60J38J84j7k10p0J48O8j57J55q0K5J3P8L76
5073C94k25k54j93L15j39J88l71J16K8K55j54J80j01K0l29O9L96k20o0J34j53
5094a04J0J0J40m5J77l48J09J85J29l31jN3mK6p3J00j7L12j64j32k12K43M9j51
5118c9Q5k4K49k73j13j35J88jk2K75j18j6j79R0lk99K59j4L51l72j24R6m2J06
5142g5L0O2k33M09j69j56J22K96j22k48K86l0r4k4q3N5K40l70J84K5j26k70J32
$$ plain form
4979 190 -164 -168 366 -97 87 69 157 -155 -179 -62 -152 97 -11 -42 94 -176 -173 -45 95 -102 -152 59 -235
5002 -235 104 112 279 -50 223 188 156 63 -190 -31 10 -135 63 130 167 -164 -154 -73 6 -259 -26 145 -102 -72
5026 -72 120 150 -37 247 43 12 -23 -90 -5 -164 -140 -60 -40 -115 125 219 328 87 -39 125 -383 -54 53 -130
5050 -130 -41 69 210 -14 -47 243 -79 3 -257 -119 65 48 -162 -232 -84 -16 -173 -18 -98 -73 -60 18 394
5073 394 169 -85 -278 37 -102 86 -285 -169 -141 114 -40 140 39 59 -270 -201 195 -25 -85 49 -104
5094 -104 -94 -84 56 11 188 -160 -51 134 263 -68 -69 -16 -20 6 -67 33 16 328 164 32 -180 63 112 -39
5118 -39 46 22 271 -2 -115 -250 -62 -63 -85 190 72 56 -123 -33 -36 -335 -76 -90 261 -111 -235 -139 -181 -75
5142 -75 -45 17 -216 193 24 -132 -10 286 164 -84 202 172 78 54 -29 26 266 -104 80 105 -21 -291 -159
5165a59R5n3l0J68J23J01l44J33pk62J01J66P3k04O6J71ll8n4J3j00L3J2k78M26
5190A49J29l00K98k99J99k38l6n0J09J00m1p7J02q5j92M97j63r7K5m5r0R6j97
5213b06K74j90R2J02P5j49J32j14k30K37J2l14J87j78K00j51j2O95o50L38J30
5234B80j85j0j0J34k31l8J48k07K58o5j63K06kl16k2K63J27K15q4l80K12j00R7
5257A27j88J26k27Q1P4J50J43m00J92k0J6j68n6n8l9K38J4P4N1n7j59J23j18J04
5281B3k48J76j78K36l0J7J6O5k32L67m14M38j92pK48l27j2M24l95j8K42n1k13
5304f5k8O4L2R3l97L69L3j8p6j94L05K86n82P6K6R2m3K8J6J51K1k22O0j98K73
5329A02m90M00R2j01L5N1q0J5J68k91j1M6J39k05J98k08L33j77J89k14o3J73l3
$$ plain form
5165 -159 -64 -117 -147 21 144 245 -99 34 27 -235 -134 32 105 -99 -33 138 135 97 43 56 -44 -11 1 -277 149
5190 149 278 -22 276 -23 176 -62 -98 -148 -39 61 20 -57 45 -40 -232 265 102 5 30 -15 -105 -9 -206
5213 -206 68 -122 -30 72 147 -2 130 16 -214 23 35 -279 -92 -270 -70 -221 -233 462 -188 150 280
5234 280 95 85 75 209 -22 -60 88 -119 139 74 -89 117 115 -201 -223 40 167 382 298 -82 130 30 127
5257 127 -61 65 -162 -81 -7 143 286 -114 78 58 74 -94 -150 -208 -247 -9 5 79 130 73 -86 37 -81 23
5281 23 -225 -49 -227 9 -21 -4 12 77 -155 212 -202 236 44 37 285 -42 -54 370 -25 -43 199 148 -65
5304 -65 -93 -29 3 96 -301 68 101 83 7 -187 118 404 -178 -102 -76 16 -27 1 17 168 189 -33 27 -171 102
5329 102 -388 12 104 3 38 89 9 24 192 -99 -110 -64 75 -130 68 -140 193 16 205 -9 -72 101 68
5352F8J83j59j09Q5J78k22J73l38P5J37j67K66l00K81k83k86M22k43L8L10k08
5373i9K8L52l24K6n3J20J44k24K94k23L15k58q5K55k72J96m9k61Q1M1lkO3L22
5397C84m95J27k34L59o1j81M7k98M69j56j53R3K29k31q1K82k81L20l15J23k4K41
5419A64k64J08k6j5J7J8p5m4q1K5L37k23M1MJ81j33k50L30j50l4p0K21K17n29
5443b31N21l95J40j81%Q5J69k34%K90o5p0J12j52j7j11K76kJ57o18M12l2j63K66
5467A57j35K7L29k83j3J9j95J20l1k3j69J10l16N34r4r4J04p0J43j63J66j52J70
5490A41k14R0j55R8J64m90N06j58J0j29n5R1J96k70K9k1Q6J35k52O6J17J26J13
5513B24n02L48J00j37J35k90J32j73J59J10L1k52K07O4q5J05J6l39K59O5k58J80
$$ plain form
5352 68 251 92 -17 68 246 24 197 -141 -66 71 -96 170 -130 151 -132 -418 4 -239 -201 109 -99
5373 -99 -71 281 -43 -17 -70 50 194 -30 264 41 356 98 13 268 -4 192 143 -118 -37 4 1 -1 62 384
5397 384 -111 16 -218 141 80 -101 -54 -352 117 -39 -192 -99 130 -101 -182 100 -181 139 -176 -53 -77 164
5419 164 -100 8 -18 -33 -16 2 -73 -117 -198 -173 164 -59 -18 -14 167 34 -216 114 -36 -70 -140 81 298 -231
5443 -231 290 -105 35 -146 -146 -61 108 -126 -126 164 99 29 141 -11 -28 -139 137 135 292 -326 86 54 -109 157
5467 157 22 49 378 95 82 101 -94 26 -5 -28 -197 -87 -403 131 37 -57 47 -23 120 -43 123 -29 141
5490 141 -73 17 -138 -40 124 -366 140 -18 -8 -137 -192 -101 95 -175 -146 -167 -81 54 -198 -132 -15 111 224
5513 224 -278 70 170 33 168 -122 10 -163 -4 106 137 -115 92 156 71 176 192 -147 112 177 -81 99
5535I9j44K7q6J69N3N0j04j43K09J92l55j44J69n5J57r3l4J32l44J32O3j1P7O2
5559G8n1J57M6m65L32K4r5L8J3l33n3M1L95j52k50L57J32l33J03j78M6n8K01k26
5583b31L21l16L07r3K10j3l27L58j53K53l52l4j18M09n3J02m08M11m09J83l65
5604c18J83j96K47J49l4n2j03m4J34J06j17K00l25K45j30L48j96j71K34k65j24
5625b29L53j14l47K42p8J90N0m3Pl80J59n9K76Q4j97N7l0Q7J17j08Q2N1l09R1
5649d8P0M5n4J60m98O97m87kL4k83K87j15K37j6k18M23j87J04j63L3J78l2q3j80
5673i8k44M05o8L7r9q0K45k63L81O5l71J20o7o4P2Q9j18J74l77Q3J79J1j09J42
5697D5P7RN3l02j74J86O5K18j49o1n4J63k89L6M17k18P6j07K62n15K58J2j30K0
$$ plain form
5535 99 -45 -18 -104 65 118 168 64 -79 130 322 -33 -177 -8 -63 94 1 -33 99 -245 -113 -50 -61 16 78
5559 78 27 184 230 -235 97 121 26 64 77 -256 -309 -268 127 -25 -275 82 214 -119 -16 -194 -148 -206 -5 -231
5583 -231 90 -226 81 -12 198 185 -142 216 63 316 -36 -70 -188 221 168 270 -138 273 -136 47 -318
5604 -318 -135 -331 -84 65 31 -21 -124 -168 -34 72 -45 155 -170 75 -55 293 97 -74 160 -105 -229
5625 -229 124 10 -337 -95 -173 17 67 24 31 -349 -190 -249 27 111 -86 -29 -59 28 145 37 119 170 -139 -48
5649 -48 22 67 13 173 -325 372 -115 -117 -83 -366 -79 -194 43 27 -191 232 45 149 -14 19 197 165 82 -98
5673 -98 -342 63 -5 32 -67 -147 98 -165 216 281 -90 30 -37 -101 -29 60 -58 116 -261 -178 1 12 -97 45
5697 45 122 131 184 -118 -292 -106 -41 177 28 -33 -87 76 -213 -177 240 22 98 -9 253 -262 -4 8 -122 -102
5721a02N7Qk3K78j32Oj73r7n3QQ9Nj60R4Q2J22M5k06J92J35J23j56r2j41K46k20
5747f5n8J20j1Qp0l4K75Rk13J52p5m1P0j22m2J69K0Q5M2j82Q2r7k25J90j74K93
5773A06K07n74L07qJ45r5j07L37k80lk9k0m4j78M9r2N49l79Q0KJ34j47J98l72
5797b14K30l0j66Q3K04l3K0K53q81N81K65l14J4j42Q1L8M4J49j19O7j5k94K69
5820I0q4j1P5o1k0n8J51j71L75p18L63oq5M27r7j51j7KoL6j65K01k33L00p1J17
5846A83j26j39J89q4P4J07k62j17k6L65k1j37k50J11L90k99K01R1m43K84J13k30
5868b6P4j31J70M6l02J76k7K4K68m46J57r7J53o1j73M39m57L9J77R4Qm20L30n9
5892d4k12L69k16%Q7J70k05J14j46o1Nm7M83l92K47j31m9K9M6r1j29L88k20M1
$$ plain form
5721 -102 -45 -37 -60 218 86 92 -81 -178 -231 -223 -134 -129 -289 -195 -113 9 54 -152 40 175 298 142 50 -91 155 -65
5747 -65 -123 -3 -14 -6 -76 -110 165 174 -39 113 38 -3 67 -55 -97 72 92 177 219 37 119 22 -203 -13 -187 106
5773 106 313 -261 46 38 183 88 -19 318 38 35 6 -14 -58 -236 -187 -279 270 -109 -29 -27 107 -40 158 -214
5797 -214 16 -14 -180 -97 107 74 94 347 -534 47 312 -2 12 -130 -49 -11 33 182 63 130 115 -179 90
5820 90 6 -5 70 9 -11 -69 82 -89 286 -432 -69 -75 -160 267 170 19 2 4 -2 34 -131 70 -163 137 66 183
5846 183 57 -82 107 23 97 204 -58 -175 -201 164 143 6 -244 -133 257 -42 159 250 -193 91 204 -26
5868 -26 48 -83 87 133 -169 7 -20 4 272 -174 -17 -114 39 -22 -195 244 -213 -174 3 97 105 -315 15 -44
5892 -44 -256 113 -103 -103 -16 154 -51 63 -83 -144 -139 -186 297 -95 152 21 -28 1 47 -44 -173 215 -5 36
5916C6J36j72J68k93q1q9L77K3K22l99K51m8J0L1n0N1j1j95J01m4k31L26l7k81
5940a99L15k23J89J96m83J69J95k72j34j6J00j64M66m54N41j03k48K76k55Q3q
5961b9k7M4M1K8l1p8J05p3M8k33K07j30l8J47k75K43m5N2l0k57L38r1j62L60j65
5986e1j45M54l04j36J42M4j77L05q6k20L42l88lM18j32j59K68k9k22J93m8k90
6008b24J81K01l02M96l29P7j06K27n1o1r2K22j80K9o0K8k30L14P2k67K30k72K79
6031A82j10N9j23k52M2J79J13l3p3j69j77O49j53j13j94M37l29K8M3L6j18%j28
6054b04K20j39j67M98k85J80m8J3Knj00r7L05k91J93m5R0l54M68l05M6M0qL2n9
6079b0K11j01r6m5Q6l2p7J01M0l7J11PM1j21N9O5k05P1J09j89J41q0k1K96pl29
$$ plain form
5916 36 172 0 168 -125 -206 -295 82 105 327 -72 179 131 141 172 122 173 162 -33 68 24 -207 119 82 -199
5940 -199 116 -107 82 278 -205 -36 159 -113 -247 -263 -163 -327 139 -315 226 123 -125 151 -104 -21 -29
5961 -29 -56 -12 29 57 26 -52 53 -20 28 -205 2 -128 -166 -19 -294 -51 -96 -44 -74 -331 7 -84 -246 114 -51
5986 -51 -196 258 -46 -182 -40 4 -173 132 46 -174 168 -220 -223 195 63 -96 172 143 -79 114 66 -224
6008 -224 -43 158 -144 352 23 100 -6 221 170 109 17 239 59 88 28 56 -174 140 212 -55 175 -97 182
6031 182 72 131 8 -244 -202 -23 90 57 -16 -185 -362 287 134 21 -173 264 -65 -37 6 42 -76 -76 -204
6054 -204 16 -123 -290 208 -77 103 55 68 70 65 -35 -132 173 -118 75 30 120 -234 234 -71 -25 15 7 39 -20
6079 -20 191 90 -6 -51 35 3 -74 27 67 30 141 148 189 68 127 192 -13 58 167 -22 119 39 18 314 307 -22
6105b2k43M68n0Jk61R6L5m19L69R9j49M2K54n71M81j21J83o9l19J72j8O2p9M12
6129C53k82K32j26k68J8J60k89L4L06J10m38N4J47M9Lj23q2O1j53K40J77q2l25
6152b24L25l38K80j3q9O1K32k55K12j4K66j75k44M8k88J78R8m3o5J28o4n3O0q3
6176f0L06k27J52j44J17J29l12J20J2j36P5j21K1%J29k45O5J54J35l51J77M9L5
6199H0Rj18P9j68L5L32l90J29J51j40J07j62R0m3p6K8p9K50K7j11O4j00m7M4L1
6224B2J17j10k12K49k45M22l15N6J79j17J4J71l18R7J55P8l78L20L3m46L66n50
6246d12K27J93q2K40j40K33j54K58k97n5K7k3j66J06L9j3k1k05J05J30J39M5k78
6269a04J43N9J64j00k66J68K4M2j87rR0N9j52J66l07K86n5l8j53o3K54J37k97
$$ plain form
6105 -22 -265 203 153 154 -107 -11 24 -395 -26 73 -76 -34 220 -351 130 9 192 123 -196 -24 -42 20 -59 353
6129 353 71 303 177 -91 -73 87 -202 -168 138 248 -190 -136 11 60 63 -60 -142 -81 -234 6 183 101 -224
6152 -224 101 -237 43 30 -59 2 234 -21 191 177 443 268 24 72 -216 -38 60 17 -48 80 16 -37 23 -60
6176 -60 246 19 171 27 144 273 -39 81 93 -43 32 -89 -68 -68 61 -184 -119 35 170 -181 -4 45 80
6199 80 89 -29 50 -118 -83 249 -141 -12 139 -1 106 -56 34 -9 -85 -57 -136 114 141 30 94 -6 -53 -9 22
6224 22 139 29 -183 66 -179 243 -72 -16 163 46 60 231 -87 10 165 243 -135 185 218 -228 138 -412
6246 -412 -185 8 -74 166 26 259 105 363 66 11 38 15 -151 -45 -6 -19 -40 -245 -140 -10 129 174 -104
6269 -104 39 98 262 162 -104 64 88 130 -57 -66 24 83 -69 97 -210 76 21 -17 -170 -233 21 158 -139
6292a39p3K90j32K30k14K84n26K93k16K04J10j42Jk02N09l32J89Pj35J02j27M0
6314B1mk71L14kK1j76l0O9N2R2R6j07N3j80j70L82Pk35M6q6N1j51J91j20J79Q1
6340A23l9J60K60p01L81l77K12k41J74L53o24L85r6J74j54j02k7J98p2o7L98j88
6362A30P2j02J4n2M1q5k8o9J18J21k95Rj15L40j29j76K64L3l7J2J08P1m32J90
6386Cr3q1Q0J34Q3J69k33l7k35K57O2j03j26J02K42k30n2P4l13L96j02k8J87p6
6410H0L6mP6q6k40j7j91K78J35lj80L6k1m5o2J38J76K46k94l08K32q8L06NJ8l43
6436a20J61J94l66K27M5J49l08P7J25p6p4k1L7K45m90Q7j76O8O6K13q3k2L8j08
6460a12j11K06p5j13l3M22o8n3K5m3O4j24J4J21l20K30L2o8j83J54N2j32J91N7
$$ plain form
6292 -139 -212 78 -54 176 -38 246 -280 13 -203 1 111 -31 -30 -232 277 -55 134 141 6 108 -19 21
6314 21 17 -254 60 58 79 -97 -127 -58 -6 86 182 75 128 -52 -222 160 167 -68 -22 -108 -57 -208 -17 -137 42 123
6340 123 84 244 504 -197 184 -193 19 -222 -48 305 -319 66 -30 144 -10 -112 -139 59 -13 -80 318 130
6362 130 202 100 114 62 103 18 -10 -79 39 160 -135 -126 -241 99 -30 -206 58 91 54 66 174 245 -187 3
6386 3 -90 -171 -91 43 126 295 62 25 -210 47 109 6 -120 -18 224 -6 -58 16 -297 99 -3 -31 156 80
6410 80 116 112 188 102 -138 -155 -346 -68 67 64 -116 -80 -101 -146 -208 -70 106 352 58 -250 -18 -106 200 205 223 -120
6436 -120 41 235 -131 96 141 290 -18 59 184 108 34 13 50 295 -195 -108 -284 -216 -150 63 -20 -42 -4 -112
6460 -112 -223 -17 -92 -205 -238 184 116 63 88 45 109 -15 -1 120 -200 30 62 -6 -189 -35 17 -115 76 133
6484A33O4j93M4k7J76Jl93L36j05Kl5j14K1L16k02o6K3k16L2Q9K53j25l3L0j90
6509a79K72Q2k0j27j43L28k83K64o1J69l01k77O18l54N1j29j86K9L04k35J78j33
6531a33J38j9K89n27L51j18OJ65J36r6j70Nl8l2J37l67K63q0J02r2l2N3K97j28
6555A10R9j38m03M90j08k1J89m08K16k60L17l5j67Q5P2J9m4j91J92l76J57M08
6577B03k73J55l8J32l14K67J13n33N14l04k28K26R2J63k60J57q5j35J96mK8o3
6599IN7l8j08j04J94K54l45K8j1j15R9L2J29j33l60M05K39j90R4j62J48k06q3
6622a67L10k7Jo4L5j1p9Q4J7O9j51M8j3r6O0k53n8N24k57k45J63j04K70o0K68
6647B64k96J13K8j53J32k27K39j18r5K61k22L03k54j27J25j5J00k8j41K42k56
$$ plain form
6484 133 197 4 48 21 197 198 -195 141 36 38 3 -111 -90 226 24 -42 -19 -235 -203 -114 139 14 -19 11 -179
6509 -179 93 175 155 28 -115 213 -70 194 133 302 1 -276 342 -12 39 -90 -276 -247 57 -178 0 -133
6531 -133 5 -14 275 -252 99 -19 -13 152 288 192 22 27 -11 -43 94 -273 -10 -90 12 -80 -112 -59 238 110
6555 110 209 71 -332 158 50 29 218 -190 26 -234 83 48 -119 -34 38 57 13 -178 14 -362 -205 203
6577 203 -70 85 47 179 -135 132 245 -288 226 -78 -306 -80 12 175 -85 72 -13 -148 48 44 72 9
6599 9 66 28 -80 -184 10 264 -81 -53 -64 -179 -80 -48 81 -52 -412 -7 232 42 136 -26 122 -84 -167
6622 -167 143 116 117 53 88 77 -2 82 99 168 17 65 52 -44 16 -237 -295 229 -28 -273 -110 -214 56 -4 264
6647 264 -32 81 109 -44 88 -139 100 -18 -113 148 -74 229 -25 -152 -27 -42 58 30 -111 131 -125
6668a25m0L32m45J36j22L66l24J42j14L14k03MJ37J70j65q8j88J86N3J95k2k97
6690i8K21k01J04j25K87l74R2J81l2p3L6J73k41K03l33J56N3kJ8p5o3J73K08k01
6714H7k43L59k27J73l42K09p0n0P8j00K35o7q8J90k14R2L3K64l61r6L02j45l2
6737a3O5j11Q1j06R1J81O0l6l53jK15K52l21k10K90N1q8j08K26k30L25q3k61O9
6761a5j7m8L41J5k88L99n77K54K4j52p0K05k21p1L64l50L24j82j07N0j22K09M89
6784D54l33r8j68q4L91q6Ro0q2J44j97J21P9j04L13m54K69j83K05j00m8K10n05
6807c07N79m61R1K06J44jj74k36K94k57j1M7J12pK07j20J07l07p4O6K78l88J12
6830a00K14l28Q5K39k99K54J21k93j33M10j94J31r5O3J57l23L7n4K83m4r6k49
$$ plain form
6668 -125 -165 167 -278 -142 -264 102 -222 -80 -194 120 -83 -79 58 228 63 -25 -213 -27 26 221 199 -98
6690 -98 123 -78 26 -99 188 -186 -94 87 55 -18 18 191 -50 153 -180 -24 29 27 45 -30 -93 80 288 87
6714 87 -156 203 -24 149 -193 16 -54 -104 -26 -126 109 42 -46 144 -70 22 55 319 -42 -138 164 19 -13
6737 -13 52 -59 22 -84 7 188 248 212 -141 -142 73 325 4 -206 84 135 47 -61 165 -65 260 177 -84 -15
6761 -15 -32 -80 261 276 -12 387 -190 64 88 -64 -134 71 -150 -221 143 -207 117 -65 -172 -122 -244 -35 454
6784 454 121 23 -145 -229 162 76 85 25 -57 87 -110 11 90 -14 299 -155 114 -69 136 36 -12 198 -307
6807 -307 272 -189 -98 108 252 251 77 -159 135 -122 -133 -86 26 19 226 106 213 -94 -168 -102 176 -212 -100
6830 -100 114 -214 -129 110 -189 65 186 -107 -240 170 -24 107 12 75 232 -91 -54 -108 175 131 35 -214
6852b14J07J77M9n6Q6q5m84N21k44P0k07L18J6Ok79Q3Q8k0K05j16j32L9K00k01
6876g3J63J21m16L6J62M1j60N7j1rR4k9k06J42J9m3MK45j85Q0O6j07J37j71O2
6901A9J04q7k43L09p1k8M9j08J30k09J58k31M35k3k69j0l8J96Pk0n2k27J63k0
6925f6j5J37l4J23Jk71K95j99N8j14L43j96q9j6J50j09Q8J05l44M49k63K9nl2
6949B5J31O1j81j20O5j1R0O8k32r%J00m3J14P1l14K89Q9k18j62M8N6k4k24J91
6974a40Q0j43M24k98K8Mj12L61q0k8j76q2M0M16l98L5J06L6k47j22K96q3Q5nJ09
6999A06j77j92J83K06K28n81J88J90m8k33k2L3L05P2k59j6m8L07k13N3j15K05
7021A72o9P3r8J00m03K20r8J44J71k70m3J28k23K68Mj96R0k42J57L0m1O2K69m
$$ plain form
6852 -214 -107 70 119 63 149 64 -420 101 -143 -73 -280 38 54 60 -219 -136 -48 -68 137 21 -111 -72 128 -73
6876 -73 90 211 -205 -169 -7 34 -126 -69 -80 -89 5 -24 -230 -88 -69 -112 -108 137 -48 32 98 -9 128 -43 19
6901 19 123 36 -207 102 31 3 52 -56 74 -135 23 -208 227 204 -65 -75 -113 83 90 70 18 -209 -46 -66
6925 -66 -81 56 22 145 146 -125 170 -29 29 -85 258 62 -27 -43 107 -2 86 191 -153 296 33 62 57 25
6949 25 156 217 36 -84 -19 -30 60 128 -104 -113 -113 -13 -56 58 129 -185 104 193 -25 -187 -139 -83 -107 -331 -140
6974 -140 -60 -203 221 -77 -49 -45 -157 204 124 96 -80 -162 -122 294 -104 -69 37 73 -174 -296 0 -83 2 -3 106
6999 106 -71 -263 -80 126 354 -227 -39 151 103 -130 -152 -119 186 258 -1 -17 -65 242 29 82 -33 172
7021 172 103 176 78 178 -225 -5 -103 41 212 -58 -101 27 -196 72 76 -120 -30 -272 -115 -85 -126 -64 205 201
7045B01l06J15J91j84M5P1l0j51J25P2k4l70L30l2j13RO8n6J48lR4p6J3j38j50
7070a51J89J04j09p0nj21K71m71O42j74L5j19M2J14k29QOj43L91j54j54K19Q3
7093B04m08J09R5K89k68j67K79j59J9l24K56K24j72J9j09L9l14L57k7J3M9J28
7115A32j56P9n7l7j57M11l67K16J08mj27J42j74o8j66M94l33P2o6n8J06r7J58
7138E1J96j34k63L2J97q0O5rr0L07k33j10k6J09L66j93l20L98l35j5j2O0k6K15
7162A50m30K69J01m3K22m19L73j95J53l13j20J15J45l4L00l49J50K0N2k94J85
7183C8j25n4K49k85K23o4Mm3j01L36j36k98R9J86o0J14j57o9L76k62K80k27l3
7206iq2K80j51k00P2J5j11K88l64M7K56K5k1J74j20j63P3J90j30Nn4M3J16l29
$$ plain form
7045 201 -105 10 201 17 62 133 103 -48 77 149 125 -245 85 53 -60 -51 17 -39 109 106 200 124 137 -1 -151
7070 -151 38 142 33 -37 -42 -163 108 -363 279 105 140 21 63 177 -52 -44 -38 -181 210 56 -98 121 204
7093 204 -204 -95 0 289 21 -146 133 -26 -7 -331 -75 149 -23 -4 -113 -74 -388 -31 -58 -45 4 132
7115 132 -24 55 -2 -39 -196 215 -152 64 172 168 41 183 9 -59 -225 269 -64 8 -58 -116 -10 -107 51
7138 51 247 113 -150 -118 79 -1 64 55 -35 272 39 -71 -97 12 378 185 -135 263 -72 -87 -99 -39 -65 150
7162 150 -280 -11 90 47 269 -150 223 28 181 -132 -252 -137 8 -26 274 -75 75 95 147 -147 38
7183 38 -87 -141 108 -177 46 -18 -14 -57 -158 178 42 -256 -157 29 -31 83 -74 -143 233 -29 251 24 -9
7206 -9 -91 189 38 -162 -90 -75 -186 102 -262 -215 41 66 45 219 99 -64 9 199 69 74 20 63 179 -150
7230a50N39j02j92j90j56K11m6n1M6K09k75J43q0M0Q5p7n2J85l9j00J29qK7p2
7254B4k2j13J77Lj08N0J1pkj32j06K39q5J66Kk64J94j41K08j26O8o8K31j50P0
7279A19J96j67l12K25P1J16l45l02L48q1K56P4j83Q5k05K04j21J3J93p1k72M2
7301a17m9K61k04j21J75k7K83j65M8J40j71K01j45kk19M63m25J35j99M06k22K05
7323B51o3m15L48j15q4K8J19P8M7r1m4j78J91k3l19LN25j32j56j33K8J18m9J35
7347F9N0j04q0J95k05j25L29k66J00L2K73k22k48M31j76k2J34l41J57J70j01L7
7369H7N4m30J45K86J70m50L77l55j39L22j8J4k43L5O4j63L32n8k48M49j05j2j4
7392A00Rk05J17j02J4J56k59k2K42L95l94n3j34J45Kk9J58l57J81J90j98o6R9
$$ plain form
7230 -150 389 287 95 -95 -251 -40 -86 -137 -91 118 -157 -14 -94 -54 31 -46 -98 87 48 -52 77 69 96 24
7254 24 2 -111 66 69 -39 11 22 15 13 -119 -225 14 -71 95 97 -167 27 -114 94 -32 36 -32 199 49 119
7279 119 315 148 -164 61 132 248 -97 -399 -51 -132 124 198 15 100 -105 99 -22 -9 184 113 -159 -117
7301 -117 -166 95 -109 -230 -55 -82 201 36 84 224 53 254 109 107 -112 351 -74 61 -138 268 46 251
7323 251 188 -227 121 6 -78 -50 69 147 194 103 59 -119 72 49 -270 -267 258 126 -30 -163 -135 -17 -66 69
7347 69 119 15 -65 130 -75 -200 129 -137 -37 -5 268 46 -202 229 53 31 165 -176 -19 151 50 87
7369 87 141 -289 -144 142 312 -138 239 -116 -255 67 49 63 -180 -145 -81 -244 88 30 -218 231 126 114 100
7392 100 109 -96 21 -81 -67 89 -170 -192 50 445 51 -2 -136 9 11 -18 140 -217 -36 154 -44 -110 -11
7415a1O9J9o6j9j41J42j70K92j92K71o9J7m8r7J22n8K5N7n8rJ81m14J55m0J80
7440A38O5q9j70L0Q8M5l3O7l30L85l6l02L10j2k86r7L40p1k53J30J6K03l38K98
7464I8k7m8p7j01K08j36n9J08J05K4j98J08j02J62L7R5m20K87l36M77j82j11k31
7487c19M47j18lQ2k07n6RK89k27K53p9j47oJ42R2J50j26l64J72J5o2K3J02K6r3
7512eR3K99m72K7j26J71Q3K19p9k69P3p4Q8J85j51j03J26n3J37l07J4M1K95l87
7536a75j85M46j87J00J63l22L05r0M8k75K55k93L26k3k74n7M76l19M9K88l50l1
7558a25j73L99k32K81j01P8k60k6O1J0L30k84l4K53k92J14K8J42j24l2j53Q0r1
7581a51K42rk10K11j17J85l67L64j37j81K54K4P8l54K67j47m3J62k93K96K0k04
$$ plain form
7415 -11 58 77 11 -8 -149 -7 -177 115 -77 194 125 142 94 -3 119 61 86 143 85 76 257 -157 -2 -42 138
7440 138 203 114 -56 -26 62 107 74 141 -189 196 160 -142 168 156 -130 -227 113 42 -211 -81 -65 138 -200 98
7464 98 71 23 -54 -155 53 -83 -142 -34 71 95 -103 5 -97 65 102 197 -223 64 -272 205 23 -88 -319
7487 -319 128 10 7 89 -118 -174 -165 124 -103 150 71 -76 -82 60 152 302 176 -188 -16 -1 -63 -40 62 88 -5
7512 -5 88 387 -85 -58 -184 -13 70 289 210 -59 14 -60 28 213 62 -41 85 32 169 -138 -124 -83 212 -175
7536 -175 -360 86 -101 -1 162 -160 145 55 103 -172 83 -210 116 93 -181 -238 238 -81 -32 256 -94 -125
7558 -125 -298 101 -131 150 49 127 -133 -159 -98 -88 242 -42 -76 177 -115 -1 27 169 45 13 -140 -60 -151
7581 -151 91 82 -128 83 -34 151 -216 148 11 -170 84 108 186 -168 99 -48 -91 71 -222 74 94 -110
7603a10n4o1N00j92K81m34q3J07j41K29J07r8K06j37k76K61n5j47K79l6j69M1
7625A8K6k0j11K15j85J37Mk44M7L05Qk24k23M81j29k52L33o3j89R3k8P3l5J87
7649B24k35L7J76p3o9o1K83k66k85J89M8J45l50J65K62r4n9R2k41J25P9k30J00
7672c8k23J71j06L08m4j7m3M06n33J52Rn2M5K6J12l58K98j82R5k2l7oO3j76J59
7697Gj2j7j00L04k3j83l19M49L32l89J20k95r8R4J59j21J15L3J6j17J25J4K1K5
7721A40j46j64j55J35K56j01L05l91m5O7K10J83l84Op1O2M03k05j85L21l19j4
7743i2J25k77M44k93J76j84J28J47k51RN7Q1j11J67l31L6K5M23k20J17p4p7j58
7766a33r3K44p0J35k31p9K14j02J13Pj22N1J78n1N9L6j42J53l7oJ2j47L3M4L56
$$ plain form
7603 -110 -164 -225 275 83 364 -70 -153 -46 -187 42 149 51 257 120 -156 105 50 -97 182 146 -23 18
7625 18 44 24 -87 128 -57 80 84 -160 -113 192 200 -24 -247 234 105 -147 186 123 -66 27 -1 72 37 224
7649 224 -11 26 202 129 60 -1 282 16 -269 -80 -32 113 -237 -72 190 96 37 129 -112 13 92 -138 -38
7672 -38 -261 -90 -196 112 68 51 8 414 -119 33 42 -10 35 61 173 -185 113 -69 26 4 -33 -39 24 -152 7
7697 7 -5 -22 -122 182 159 -24 -343 106 438 49 169 -126 -224 -130 29 -92 23 56 72 -45 80 94 115 140
7721 140 -6 -170 -325 -190 66 -35 270 -121 -166 -99 111 294 -90 -84 -155 -93 310 105 -80 241 -78 -92
7743 -92 33 -244 200 -93 83 -101 27 174 -77 -68 -11 70 -41 126 -205 -169 -144 279 59 176 102 25 -133
7766 -133 -226 18 -52 83 -148 -227 -13 -115 -2 5 -117 -66 112 61 120 156 14 167 130 124 136 -11 22 66 422
7791D22m37J6KO9j46QL0J32k00K3Q1o5P2j8m0N9q0K3po7OK24k41J96J29j12J18
7818A97j60j67N5J44Ko8J47J42m08J77r7l38L33J5K70j78j06L13l09k95K01m7
7840a77R4J40q3K7l7l5M7k32Q6K33j20n3o3J64n4K50j91j11J88k0Q5m3k65L32
7864A62m23K00oK76k48K50l30P8K27l04J61L9Q3m37J65J53j67L36j82K00j38j20
7886b5j78p4M12j57J02L5j53L4L8k37K53p6J30j09N5K81n69M87j15K5l02J18l7
7909f2j91K68Qj2L76m54o8J24j94K58j4J96l09J94n8J56l42P5j74M87k47K06j88
7932C5L9O1j41J55J1l89J72j93L24o9o4R1j61rK87k53L06l13%k9J19l5j28K35
7956E1j02Q8k55J69P6j9Pl5Q4j23L52k92K10q9j37K7r2k1K8J94k60J60jJ6m6k16
$$ plain form
7791 422 -15 1 3 72 -74 -66 -36 96 -104 -81 0 -65 7 -11 -51 8 -72 -49 -56 -123 -117 107 -134 62 191 79 197
7818 197 37 -130 -75 69 71 3 150 292 -116 61 -36 -374 -41 -26 244 66 -40 273 -36 -331 -130 -177
7840 -177 -83 57 -26 1 -36 -71 -24 -256 -170 63 -57 -110 -173 -9 -63 187 -4 -115 73 53 138 95 -170 162
7864 162 -261 -61 -67 209 -39 211 -119 -41 186 -118 43 82 165 -272 -107 46 -121 215 33 233 95 -25
7886 -25 -203 -277 135 -22 80 115 -38 -4 34 -203 50 -26 104 -5 50 331 -238 249 134 159 -143 -25 -62
7909 -62 -253 15 23 11 387 -67 -135 -11 -205 53 39 235 -74 120 62 218 -124 -49 -223 264 17 223 35
7932 35 74 135 -6 149 160 -229 -57 -250 74 5 -59 32 -129 -138 149 -104 202 -111 -111 -140 -21 -56 -184 51
7956 51 -51 37 -218 -49 27 8 15 -20 64 -59 293 1 211 122 -15 12 -80 -101 -73 121 -139 21 20 36 -10 -226
7982b26kK35lk4K07k30q4J28L8j67K04J56l38K3j40K06R4O4r6j74O7M31m77K72
8006A64j35k26K20r7o3N3L40P7k7l33j26J7k0n3J87K9j26J21o7q2P0n3O7L64l71
8031g0j18L35j41j59j05K96j23Q8R4k04J45J27l65J04k03K67j59J91Jj48K74p
8053A20k21J26J37j54R7L7o0n9J03l48M00j35l24J21J75m8O1j59l5M19j88K52
8075C17j80j77J54j93M06j22k79J96q5J89m80M61l8j85J30J9j56l6J60K54k37
8096A18N8j1j37p0k4L03l12K89k5k62L96j10j98J15k87j59L08k63M91l36j28L12
8118F8q9Q2K20k36k38K32P2k23M7L6J63l51L61l58J27PJ44j05Q9J75l5j56p4J40
8142I8m8r4N0j03J97r0J39j31j8J21k52J1J00Nn5Q8J13j56k7n3NK36k46P3mj06
$$ plain form
7982 -226 -228 7 4 -20 187 -43 -127 1 39 -128 76 232 -106 -83 -223 -17 77 141 45 -129 -62 369 -108 164
8006 164 29 -197 23 -74 -137 -84 256 333 306 -27 -153 -136 -156 -209 -22 7 -119 2 -65 -147 -77 -130 -63 301 -70
8031 -70 -188 147 6 -153 -258 38 -85 3 97 -107 38 165 -200 -96 -299 -32 -191 0 1 -147 127 120
8053 120 -101 25 162 8 105 142 82 23 126 -222 178 43 -281 -160 15 -33 28 -131 -166 253 65 317
8075 317 137 -40 114 -79 327 205 -74 122 37 226 -254 207 169 -16 114 133 -23 -59 101 355 118
8096 118 176 165 28 -42 -66 237 -75 214 189 -73 323 213 15 130 -157 -316 -8 -271 220 -116 -244 68
8118 68 -21 61 281 45 -193 39 111 -112 -65 -29 134 -217 144 -214 -87 -80 64 -41 48 223 188 32 -42 98
8142 98 50 -44 6 -97 100 10 149 18 0 121 -131 -120 -20 -15 -70 18 131 -25 -52 -105 -100 136 -110 -37 -41 -147
8168a47J54k04P6J50k9J07o4K53j85l27J77K80k13K0j36Q4j46K47l4J55j52n7
8190Ij04
$$ plain form
8168 -147 7 -197 -121 29 0 107 43 296 111 -216 -39 241 28 48 -88 -4 -150 97 63 218 66 9
8190 9 -95
8191i5
$$ Imaginary data points
##PAGE= N=2
##DATA TABLE= (X++(I..I)), XYDATA
0@%%%%%%%%%%%jRj6J6j6K4l2L2m0N4o2P2q8J04j20J38j62J90k16K47k85L22l64
34a94M12m65N24n88O58p35Q19r10J011j122J242j371J513j670J841k030K236k462
52a291K714k992L305l656M052m506N027n639O370p254Q353r764J1649j4315J8400
67A0453k5516M1477j47173K3774J58688j36801L8764Q2331k3660k8998O1053k3936
79C0456k2830L8214K650o2058L3794L2003n6533j0633M5935n5627l4123M9763
91h989j132l4270K7407J0302j3296J2642R735n581K3352J6244k7816q585M1497
104D1510p08m1111j002L735k2466Q115M296k1208J3323J7807j8838J544K4939
117I936j381q794J1353K336j6911J553J8480o978j1721Q704m071r321Q262j493
$$ plain form
0 0 0 0 0 0 0 0 0 0 0 0 0 -1 8 -8 8 -8 16 -16 16 -24 30 -32 40 -48 56 -64 74 -88 102 -114 133 -152 170 -194
34 -194 218 -247 277 -311 347 -388 431 -479 532 -590 652 -719 794 -876 965 -1065 1171 -1291
52 -1291 1423 -1569 1736 -1920 2132 -2374 2653 -2986 3384 -3870 4483 -5281 6368 -7947 10453
67 10453 -15063 26414 -120759 -96985 61703 -75098 -36334 45997 22337 -6661 54392 30456
79 30456 7626 45840 48490 -13568 20226 52229 -4304 -14937 30998 -24629 -58752 -8989
91 -8989 -10121 -44391 -16984 -6682 -19978 -7336 2399 -3182 20170 36414 8598 13 41510
104 41510 40802 -309 -1311 2424 -20042 -11927 -7631 -28839 -15516 2291 -16547 -15003 9936
117 9936 8555 -239 11114 13450 -3461 -1908 16572 9594 -2127 6577 2506 -6815 1447 -46
131d6q016M613m049r411O041R882J861k330K074P285K006p48K058j617l702k642
147C259n513k384J018o38M82k625k835M319J966N92N505j095m601L477K441j312
163B056J865J759k562k748J241J598j807L16l88n774m48K468k835N40M467j451
179a703j120L827J912K06J954k08l704j266R56q64j500R37j883k238L547R67j146
196a326K792p5k655J325J586p73J59J495j352j644J255J162j785N97M37l871o95
213c368K315j292m17J839n63j128K749K140J70J71J029j249j492J316o26j747
229a53J21o64k335Q84R91o93L55P15m12L8L65J500J8j18O55q13P11J098M8o65
249A646k2j666n55N80j215k51R5j049O25J61P54J067L71L21k6L16M38O97j322
$$ plain form
131 -46 -8062 -3449 -7498 -16909 -10868 -986 875 -1455 619 7904 9910 9162 11220 9603 5901 3259
147 3259 -2254 -4638 -3620 -4258 -3776 -6401 -9236 -4917 -2951 -2359 3146 2051 -2550 927 3368 2056
163 2056 3921 5680 3118 370 1611 3209 1402 1718 1330 -4444 -4892 -2424 -5259 -4719 -252 -1703
179 -1703 -2823 1004 2916 3122 5076 4868 1164 -102 854 -10 -1510 -573 -2456 -4694 -1147 -180 -1326
196 -1326 1466 1391 -1264 61 1647 874 1033 2528 1176 -468 787 1949 164 761 1198 -2673 -3368
213 -3368 -1053 -2345 -2762 -923 -1486 -2614 135 2275 2445 2616 3645 2396 904 2220 1594 -153
229 -153 -32 -696 -3031 -2147 -1156 -1849 -1494 -779 -1191 -1153 -788 712 730 612 1267 454 1165 2263 2311 1646
249 1646 1624 -42 -597 -17 -1232 -1483 -1388 -2437 -1812 -1651 -897 170 541 862 836 1152 1590 2287 965
268I65K72n79j284K94L5k70L20q63p98Q63j01Q38p0m78Q25J82J00J027L83l75
288A286L55n28l37P3q07k2p24r64J7O90p93J212L20n47Q66J87K94O63J96j57m22
309H58p12P78o8p81M95o50o64M02n65o1N56k96j15J23K19O41N49l33O07q9j49
330G45O00k86l52m6j044k11J52k68K67p1l93L20J39J69N75m6j76M63l00r8Q95
351A034o56L99Jq13M13l25l82M17o61j21j56J93k26Q20m57K75L72m7O90j8j02
372F50K14m25l71J44l81p0K87n64j19M68j86K36N6k96L84j01j79P75j12k10K68
393D68m33L00Mq7K19n17m78P4O2P0J83l14j9K68K11L8K94Q5J37l96j10J14J63
416C36l67P5q8l51K36M3K6J14q6N9n5j17K71q4j87L97k56K07J07o7J61j41k72
$$ plain form
268 965 1237 658 -626 -332 -297 -567 -247 -1110 -1908 -1045 -1146 -308 -378 -856 -31 151 251 1278 1661 1286
288 1286 1641 1113 776 849 42 20 -704 -1668 -1651 -961 -1754 -542 -222 -769 97 284 578 1241 1437 1280 858
309 858 146 924 856 75 570 -80 -744 -342 -907 -968 -412 -708 -823 -700 -481 160 709 376 983 894 745
330 745 1345 1059 707 661 -383 -594 -442 -710 -443 -514 -907 -587 -448 -279 296 250 74 537 237 139 1034
351 1034 378 777 778 -35 378 53 -329 88 -573 -694 -850 -657 -883 -63 -520 -245 127 80 770 752 650
372 650 864 439 68 212 -169 -239 48 -516 -635 -167 -353 -117 -61 -357 27 -74 -253 522 410 200 468
393 468 35 335 339 252 471 -46 -524 -450 -388 -318 -135 -449 -468 -200 11 49 343 428 565 169 59 173 336
416 336 -31 44 -44 -395 -159 -116 -90 24 -62 -3 -58 -175 96 12 -175 222 -34 173 280 213 374 233 -39
439c9R3j20j60o1L58k00p6J21J58l91L20K30l87J47O0Q8Kk66J39j28k02M16j02
462@L9j2k32jJ42L38k55p2J18q7j04J69K9O6k51K54j15j80K34J34n92K60J52m27
486c93M72J31k29K77k59j73K46k97K54o1K92l30Pj68P0K25j37J84k08J39j25%
508h3J25p7J01K5o9n6K38l66J83m8N3l03JL47P1k34Kk7M9J04J7O0l45L4M54p7
534A79k97l1K22J27k95K17k88K3m9N1L6QL32m2l59J00J14M0pk39K85q2p8j06J50
559A1J10M4j51j28J50l26K72K0N7o06N10j34J07m1K79J0l79J08J04K0p1J5N9K16
583B56o5j99M2J28k43j41L61k19k0K56l78M24j9j36l4R4k12k16n3K85j4K96k03
606a0k86K33J67J13j91j7m5m2J14nM9j46J55j54o7R9j04K14r9J10k90R4L75l28
$$ plain form
439 -39 54 -66 -226 -287 71 -129 -205 -84 74 -317 3 233 -154 -7 53 141 143 -123 16 -112 -314 102 0
462 0 39 27 -205 -206 -64 274 19 -53 65 -22 -126 43 72 138 -113 141 26 -154 80 214 -378 -118 34 -393
486 -393 79 210 -19 258 -1 -174 72 -225 29 -32 260 -70 -63 -231 -161 64 -73 111 -97 42 -83 -83
508 -83 42 -35 66 91 22 -34 204 -162 21 -27 26 -277 -276 71 142 -92 -90 -117 -68 36 53 113 -232 -198 256 179
534 179 -118 -149 73 200 -95 122 -166 -143 -192 -141 -105 -97 235 193 -166 -66 48 88 81 -158 127 45 -33 -139 11
559 11 121 165 14 -114 36 -290 -18 2 59 -547 -37 -171 -64 -105 174 184 -195 -87 17 37 -34 -19 40 256
583 256 191 -8 34 162 -81 -222 139 -80 -100 156 -222 202 183 47 13 107 -105 -321 -374 -89 -103 193 -10
606 -10 -296 -63 104 217 26 9 -36 -78 36 31 80 -66 89 -65 -132 -33 -137 77 -22 88 -202 -108 267 -61
630f1J65J68j34k51j41L84k2k8o3j23J83Q8M4j44J9j52R5k37J56K5o3J85L9j56
654b4O7j16K98j24k54O5J25j86K93J24j55k4P5N3l7k37J23j58j66J57l3K34j63
677f3M9o7k0J63p9j8j54M45k96j51R8o8M2J59M4J29k73%j05K18l54J38j8J33L9
702ij76M66n9n7k66k1lJ89J53l50K38j13K40m46J86jK24J7j45k0K94j97j86Q7
726D5J53k65J97q6K4k84J40j8J52j20k38L00l63M30l68K13L24j39L3j40J41k7
748A04j72J26O8o2k47K87p6J96L9m64L70k71j09J64n3Q7r5J91qm4m3K07q9j53
772d7N9j40J91k60K02j09j66K49l8L8j56o0K53k1M4m1j09j1J52J5O0n00L53Jl7
797g8J95k50n0K39N1j10K67k32Q0N0j70j32K78J27j73j09J0L1J7J81M0l80N5J70
$$ plain form
630 -61 104 272 138 -113 -254 130 108 80 17 -106 77 165 209 65 84 -68 27 -210 -54 -29 -92 93 132 -24
654 -24 43 -73 225 101 -153 -88 37 -149 144 268 113 89 164 217 180 -57 66 -92 -258 -101 -134 100 -63
677 -63 -14 -81 -101 62 -17 -35 -189 256 -40 -191 -93 -161 -119 40 84 213 -60 -60 -165 53 -301 -163 -181 -48 -9
702 -9 -185 281 222 165 -101 -122 -125 64 217 -133 105 -8 232 -214 -28 -29 195 212 67 47 341 144 -42 45
726 45 198 -67 130 44 68 -216 -76 -94 58 -62 -300 0 -363 67 -301 -88 236 97 130 -10 131 104
748 104 -68 58 126 64 -183 104 28 224 263 -201 169 -102 -211 -47 -100 -13 -108 83 75 31 -12 195 106 -47
772 -47 12 -128 63 -197 5 -104 -270 -21 -59 -21 -177 -237 16 -5 39 -2 -111 -122 30 45 105 -395 -42 -41 -78
797 -78 117 -133 -183 56 107 -3 264 32 112 162 -8 -140 138 265 92 -17 -7 24 41 222 262 -118 -63 107
821A07j14j54Q2M4J67J2O0j35L0j18J04K36k70q5k38L61j16k67L00m8L09l51R7
844A3J09o0P9m07K31J1K03l58K62P5j66J66j65nJ42k61K65j46j0K9k27J26M2N6
868Dj23K08Q8m18L62j50J5J75j3j43r3K79n82R2K82K13j44J7l2o0Q1P1p5j71o8
893a85J09J64l65L81j6J38jj21r4J60k35J70k05J55O2J14l84K1K70k61K25R8k19
916a9M5p9L4M2O1J44j37k13J70J46l82K84j78mk23L62k73N20n9k47PJ47p1m0p9
941d2O4O1m9o5j58j0J01K72j96R6k8j05L25k43J49k58K4l5J03k44M32j67R4k35
965a14J03K94k18r4J43J95o21L15p4k58O25j47l00J85K8O7K5q4P8n4J37n50J87
988a32o8J26J4J93j3j87K93j78O2k78J22J4kK99k25K59k08j40p2l0k25M57n9J2
$$ plain form
821 107 -7 -161 -79 -35 132 144 204 69 99 -19 85 321 51 -34 -272 89 -27 -294 6 -42 267 -84 13
844 13 122 62 141 -266 -35 -24 179 -179 83 158 -8 158 -7 -12 130 -131 134 -12 -22 7 -220 -94 -52 4
868 4 -119 89 177 -241 121 -29 -14 161 148 5 -88 191 -391 -299 -17 196 52 69 37 -23 58 129 54 -117 -185
893 -185 -76 88 -277 104 88 226 225 104 10 170 -65 105 -100 55 117 231 -153 -132 138 -123 102 200 -19
916 -19 26 -53 -19 23 84 228 91 -122 48 194 -188 96 -82 -86 -309 53 -220 300 241 -6 1 148 77 37 -42
941 -42 22 83 34 -31 -189 -199 -98 174 -22 74 46 -59 266 23 172 -86 -62 -97 6 -238 194 27 121 -114
965 -114 -11 283 65 -29 114 309 -312 3 -71 -329 296 149 -151 34 62 129 154 70 148 94 231 -319 -132
988 -132 -200 -74 -60 133 120 -67 226 48 110 -168 -46 -32 -34 265 40 299 91 -49 -121 -151 -376 81 22 34
1012C4J46j85j15P7K0k12J01J07RK36j62j15J36P4l04L43q8j88K53k84K42j51
1034b6k7L61j76k40M87m39N8O1O4j28k12L32j82L16k50q4j9J43K24k03m7p8k68
1057c33L94K9J45l82J16P7J16l22L8K08J18K1l01J30K0j44o7J26p1K93l10O64
1079E65m81m20L63j45P6Q0J26j94J6O3k09K92Lk23j44M57l53M20k92m3P4n6j34
1102a59J23L7K3qJ77j41j46q2K02J94l28K75j95N4k4j25PK54Jj80J6q3L90j96
1126H6J46j14O2m71L25P5l99L76n2j0J26nk07j5K7J46n4k62J74MK6j38K4K47K63
1151C80n6m91K09j83J33o4j20Q7P9k00L14q2J97j26j30J66J91l27K34l08J56n7
1173Bj15N0O9j55J58n2R5M3J19j01k93J11R2j2J59M0J70j96j82k90K28J17k7j16
$$ plain form
1012 34 180 -5 -120 -43 -23 -235 -134 -27 -18 218 56 -59 77 151 -153 190 102 -86 167 -117 125 -26
1034 -26 -53 308 132 -108 379 -60 -2 59 123 -5 -217 115 -67 249 -1 -85 -104 39 263 60 13 -65 -333
1057 -333 61 90 235 -147 -31 46 162 -160 -122 86 204 225 -76 54 74 -70 -137 -11 -82 211 -99 565
1079 565 84 -336 27 -118 -42 38 164 -30 -14 49 -160 132 135 -88 -232 225 -128 292 0 -43 31 -25 -159
1102 -159 -36 1 24 16 193 52 -94 -176 26 220 -108 167 -28 26 2 -123 -116 138 139 -41 -25 -108 282 86
1126 86 232 118 180 -291 34 109 -290 86 34 24 150 145 -62 -77 -50 96 42 -220 -46 -42 -16 -154 -130 117 380
1151 380 324 -167 42 -141 -8 -72 -192 -105 -26 -226 88 6 203 77 -53 113 304 -23 211 -97 59 2
1173 2 -113 -63 6 -149 9 -43 52 95 214 113 -180 -69 23 11 170 210 380 184 2 -288 -60 57 30 -86
1197h6k02Q2J28L8M3R4j64K53l08jL10l44J67J98k46Q6r1J52o0j8j64J13p5Q5
1221a0Q9r4N0R3k0K3l1j93k5J80k9R5J3l24K19j40J14J85k91l6K05o9n9L0K31
1246B06q7m28L45m2j62J59p9lJ80j49J68j16l6N0J2Lo8J35ll4j58J46J58k35k3
1271f1K2K2j07K95j12j75l8J81n5o6M8M2j03J67L10k95j25J26N0j7l73k54L55
1294a63L31j64o9J2r2K98J55j71j66q2J5K59r1p1J31J09k87Nj38J73j81M08l79
1317a58K4J38j69J28K4N7k23O2K91r4l55N10l56J67N2N9j74J50k32J39q0L69k10
1340A19J2j86J11o3P5n0q5J27o7l0l00L75k31L4k08N64l44K29j8j51L00j73J72
1363B12j33J3j47J15l90j34M18O4o8p4L73l39K88m07L22j45j10M6O0PJ1N4j64
$$ plain form
1197 -86 -288 -206 -78 -40 3 97 -67 186 -122 -123 187 -157 10 208 -38 48 -43 109 49 31 -133 -20 -95 -10
1221 -10 79 -15 35 128 108 131 100 -93 -118 62 33 128 141 -183 36 -104 10 195 -96 -132 73 4 -55 -25 206
1246 206 119 -309 36 -6 -168 -9 -88 -91 89 -60 108 -8 -44 6 18 21 -47 88 85 51 -107 39 197 -38 -61
1271 -61 -39 -17 -124 171 59 -116 -154 27 -28 -94 -46 -4 -107 60 370 75 -50 76 126 109 -264 -518 -163
1294 -163 168 4 -65 -53 -145 153 308 137 -29 -111 -96 163 72 1 132 241 -46 -41 -179 -6 -187 221 -158
1317 -158 -134 4 -165 -37 -13 44 -179 -117 174 80 -275 235 -121 46 98 157 -17 133 -99 40 -40 329 119
1340 119 131 -55 56 -7 68 18 -67 60 -7 -37 -337 38 -193 -159 -367 197 -147 82 64 -87 213 40 212
1363 212 79 92 -55 60 -330 -464 -46 18 -50 -124 249 -90 198 -209 113 -32 -142 -96 -36 -29 -18 36 -128
1386a28O7K18l5j14J5j96J41L23j95j57P3K72j74J82m80L85k38k9Q5j05J4o5K02
1409F1k22L46k24lO6m10L31j32J91l19M83j73l18L09J20j8j59J07m7p6j90J69
1431a08K5R2R0L5l35n6M78j25j37k8j56K29J11lj17l44L45j73K32j76j3L4J51
1454E1o8q3J6Nq9J06Jj27K97j39r2L53k35K16j62j21J43k37J92j22M7K23j83K88
1478B80j85j25P1n1o1J7k08K18J70j28L39m56L0J78j57l7P6L7q9l2n5K02q5R6
1502D5j54J69l54K69J37k44J36o8J55pl01L22r1n1j1J30k8k10M51j96j10J1J50
1525A50q0J87m53J44L29m09J1P2N3P6j61O5k7j76N05r9j17J27n20K34P1k43L60
1548I9ml39K73l29J41L34j89k22J65P0L67m87N4L36l83K23l1p3l4L36j75j0j30
$$ plain form
1386 -128 -61 157 122 8 23 -173 -32 291 96 -61 12 284 110 292 -188 197 -41 -70 15 -90 -76 -141 61
1409 61 -161 185 -39 -42 24 -386 -55 -187 4 -315 168 -5 -323 -14 106 88 -71 36 -11 -87 -277 -108
1431 -108 -83 9 99 134 -201 -257 221 96 -41 -69 -225 4 115 112 -5 -349 -4 -177 55 -121 -134 -100 51
1454 51 -17 -100 -84 -79 -168 -62 -61 -188 109 -30 -122 231 -4 212 50 -71 72 -165 27 -95 -48 175 -8 280
1478 280 95 -30 41 -10 -71 -54 -262 -44 126 -2 337 -119 -89 89 -68 -105 -29 8 -81 -113 -168 34 -51 45
1502 45 -109 60 -294 -25 112 -132 4 -64 91 84 -217 105 14 -37 -48 82 54 -156 295 99 -11 0 150
1525 150 70 257 -196 -52 277 -132 -121 -49 4 80 -81 -16 -43 -219 286 187 70 197 -323 -89 -18 -261 99
1548 99 95 -244 29 -300 -159 175 -14 -236 -71 -1 366 -121 -67 269 -114 109 78 5 -29 307 132 122 -8
1571hJ13j67j91M01k73Q4J98k14K8J35O1j76K00j04J3r5P3MK28k64q9j02q1M38
1595B12k59Q3J80o1k75Q5K19p5k64J64J32l73K11n2k28K13K03k19O0J48j50q1
1617a27j71J57K00l25L67j76L23l73K48R5k14Rj04K74j46J61m39L62j09j8N3j24
1639g7L64n27l7R5M7o2R8L36r3j64r9L03j53lr7M9j86J66O9r4J91r2J42k25O5
1664A6J73n6k98P4J71L8j71K04j00k3O2k19m2J18J04j60L98n02L11j17J63k72
1686a28K57k01L79m11oJ17R2r6j14J49k70k6J02R9k16L04o6K2K89l43K09l27J52
1709c3J16k96L99j79J69j38k57N05j73l91L20J62l26KJ37n2K20j33jl9L34j71
1731A75j26j86O5J96j40R2QJ1k27L54l93K42k19J22L2n9K20o8j00n8J67r5M2p3
$$ plain form
1571 -8 105 -62 -253 148 -125 -41 157 -57 -29 106 167 -9 191 87 100 5 78 82 310 46 -43 -145 -226 212
1595 212 -47 36 216 155 -120 -35 184 109 -155 9 141 -232 -21 -73 -301 -88 115 -104 -44 104 -46 -127
1617 -127 -298 -141 59 -266 101 -75 248 -125 123 218 4 13 -91 183 37 198 -241 121 12 -6 47 -77
1639 -77 287 -240 -277 -182 -135 -197 -99 237 144 -20 -119 184 31 28 -69 -20 -206 -40 29 -65 126 34 176 -49 16
1664 16 189 133 -165 -91 80 118 -53 151 51 28 90 -129 -171 -53 51 -109 289 -213 98 -19 144 -128
1686 -128 129 -72 307 -104 -110 7 99 3 -111 38 -232 -258 -156 -57 -273 31 -35 -13 276 -67 142 -185 -33
1709 -33 83 -213 186 7 176 38 -219 286 113 -278 42 204 -122 -120 17 -35 185 52 51 12 346 175
1731 175 49 -137 -72 124 -16 76 84 95 -132 222 -171 71 -148 -26 6 -53 167 99 -1 -59 108 13 55 -18
1755a8J4j29N1J5o9J29J03p6Q1j56J17O4l38N22m22L09j32k23J02J99J6k58J76
1778G7J26l42n1K48q9O8M4P4M3j51p4J08k07R4j43K73j37O9J79M6p2l39L19k38
1802g5K12k91P3J91k68L61r2k53P8K49k41J12J21k25J80K04l57K9%l0j46N9j32
1825b41K85p4J21j75k35L50j54O8m4P6n5K96k8k45p9n6N7m1L53l11K43O8k25J48
1849A02qk51J04K46l87N17k93j40m2J24J30j05jK92j88k33K24Q1r3m2K18l09p9
1872a33r2L5j12R8K87L3j48L28p1n0j41L8k91L59j78K47j15P8m13K51j84L60k87
1895a01j48K53m08M59j46O8n2oJ67l17K18K67l61R7J3L3j40R3m6K74k38q5n1J28
1919b9J47j82j03K59p9r5J66m7jm7K67j97p8J64k58J88q6R0j25j16J93l7k9m5
$$ plain form
1755 -18 -4 -133 -82 -67 -136 -7 96 20 101 -55 62 126 -212 310 -112 197 65 -158 -56 143 159 -99 77
1778 77 203 -139 -190 58 -31 37 81 155 198 47 -27 81 -126 -32 -175 98 -39 30 209 255 183 -156 163 -75
1802 -75 137 -154 -81 110 -158 203 111 -142 -64 185 -56 56 177 -48 132 336 -21 8 8 -22 -168 -109 -241
1825 -241 44 -30 91 -84 -319 31 -123 -55 -99 -23 -78 218 190 -55 -134 -190 -133 -174 179 -132 111 179 -46 102
1849 102 94 -157 -53 193 -194 323 30 -110 -152 -28 102 -3 -4 288 100 -133 91 172 79 37 255 -54 -133
1872 -133 -225 -190 -302 -204 83 116 -32 296 225 175 34 72 -219 140 -38 209 94 172 -241 10 -174 186 -101
1895 -101 -249 4 -404 55 -91 -23 -75 -81 86 -231 -13 254 -107 -10 3 36 -104 -11 -57 217 -21 -106 -157 -29
1919 -29 118 -64 -167 92 13 -82 84 37 36 -11 256 59 -19 145 -113 75 -11 79 -46 -162 31 -6 -35 -80
1943h0m8N1q1M2K92O2l72K29j55Q4j40M13m65K50J75l44R9Omn5q6K22p1j0j26
1968a12J22k1J80k68J89r3k40M25N4n17M9K9K80j61j58J23J18k1j28L6J6K72l7
1991A37m03o1J12L79l31K83j02l3j1j76K51j00K30k01P0N4R4o1k58K02L0J76l51
2014g0r8L69k88j4J97K77j94l97K62J32J31l71J35r3L2M0J8L4j73o3O0o2K9J23
2038A6J06l08J65O6j46j16K58N1J5o8j03L03j60q6K4p6p5J96JJ82k2l74J17R9
2062F5N3k37J70l18J58n7J90J09m43J06J32J52P2M6k0L6k65J33r2P9k88L02k96
2085b13L70j86J98k70L08ol13J54J26J82k20m33O15k53j56Q0k0J18j38l4j49O1
2107a79M07j42j76K64j04L1j13n3J57k48J34J3k97K38rJ93j80K34k12J47k09L64
$$ plain form
1943 -80 -128 -77 -158 -116 176 238 -134 95 -60 24 -116 297 -168 82 257 -87 12 18 14 -41 -127 95 24 14 -112
1968 -112 10 -11 169 -99 90 -3 -243 182 236 -281 -232 -203 77 -84 -242 -119 -1 -22 -150 -114 -98 174 137
1991 137 -266 -327 -215 164 -167 116 14 -19 -30 -206 45 -55 175 -26 44 98 192 131 -127 75 105 281 -70
2014 -70 -168 201 -87 -101 96 373 179 -218 44 176 307 -64 71 -22 10 50 68 102 -71 -134 -74 -136 -107 16
2038 16 122 -186 -21 45 -101 -217 41 92 107 39 -64 239 79 -7 17 -59 -134 62 63 245 223 -151 -34 65
2062 65 118 -119 51 -267 -109 -166 24 133 -310 -204 -72 80 152 198 178 214 -51 82 -10 69 -219 83 -213
2085 -213 157 -29 169 -101 207 201 -112 42 168 350 130 -303 312 59 -97 -17 -37 81 -57 -91 -240 -179
2107 -179 228 86 -90 174 70 101 -12 -65 92 -156 -22 -9 -306 -68 -77 116 -64 170 -42 105 -104 260
2129B60k51q5K85l31J37j27J97N2o8j69j61L46j98K20J70l01J87k48k8j17N21
2150B91k25k24P7M8j2n9K97l69J14N3R8O9o3r5J8j18J02J14k16m8K59j79r8L36
2174A70j17m3MK64k21k0m7K3j42j26J73J56j25J50l75L19k7J00j56K02l61M9J23
2197b7l14M07l57K27k74L7Q3K65J06k23J77J32p4j26j08j43L30J79k58M9j54N9
2219gr9K05k70K73k03O1N7R7l50j8K0J8J82Q5k39L59q9q9n5Mq8j6qK63l95L78
2245G6l02K34J4J47J59m01K51l92O7K96m89K48J81k42L44j79l20M55J08l44q1
2266a70q0K24j07LJ45nl4rP7j23K79r1O9j57j4M4M0j99R8P0k75J00p6K01Q1p0
2292B1N9J85m26K80j0j62P6m0J54j82J3M7O8n20M86J48j48q5j09K92j83j0l2L03
$$ plain form
2129 260 9 -76 209 -122 15 -112 85 137 69 -100 -261 85 -113 107 277 -24 163 -85 -113 -230 291
2150 291 66 -158 -81 -33 -45 -104 193 -176 -62 -9 89 158 95 0 18 -100 2 116 -100 -148 111 -68 -166 170
2174 170 53 10 14 278 57 37 -10 13 -129 -255 -82 74 -51 99 -276 43 16 116 -40 162 -199 -150 -27
2197 -27 -341 66 -291 -64 -338 -301 -218 47 153 -70 107 239 165 39 -69 -212 118 297 39 88 -66 -7
2219 -7 -106 99 -171 102 -101 -40 17 114 -236 -254 -234 -216 -34 51 -188 171 82 -7 -62 -58 -146 -162 -170 93 -302 76
2245 76 -226 8 22 169 328 -73 178 -214 -147 149 -340 -92 89 -153 191 12 -308 147 255 -89 -170
2266 -170 -250 -26 -133 -130 15 10 -24 -33 44 -79 200 109 178 21 7 51 91 -108 -10 60 -215 -115 -191 10 91 21
2292 21 80 265 -161 119 109 -53 23 -17 137 -45 -32 15 83 -437 49 197 49 -36 -145 147 -36 -46 -78 225
2316B25j46k3j92J93k35K07K2k8m0J70k30L25q1k00N1k05M80k44J07jk61K90l29
2339a45P4N5j67J45j3P7j00J84J94j40J11o2k82J49j99J66k65L60r1j67K16M4
2361A44o0k02K83m75N08j91J39j97n1j30K82K52p74O65k46N7j76L0K66j95L13
2382B42l67l1J80J85k45O0N7j31m5K57j59Mm9j13j28M06O8j15kk00P7k32J62J38
2406A9J21m28R0N7O5O0k72L32j76k8P2j0J93k5o4j21K19L1j54J88n8l32Q4K42
2430A05j35n2R1j61K14k07L16j46k12K70l5k72K34J32k06K07m22L25J91n02K45
2451b0k01N0K19j62j76J49K11m6p6R4R6R1j76q9J60K6j77R5J32l96n8M51j15m9
2475C3p8j44L40l39L68k27O3L2J7k91K13k37K03J63o9m2L9j1J8N2q7k4m3J98l63
$$ plain form
2316 225 79 56 -136 57 -178 29 51 23 -17 153 -77 248 167 -33 18 -187 293 49 156 155 -106 184 -145
2339 -145 -71 -16 -183 -38 -51 26 -74 110 304 164 275 213 -69 80 -119 47 -218 142 51 -116 100 144
2361 144 84 -118 165 -310 198 7 146 -51 -102 -232 50 302 -472 193 -53 4 -172 -142 124 -71 242
2382 242 -125 -156 24 209 -36 24 81 -50 -95 162 3 7 -42 -155 -283 123 191 76 74 -126 -49 -281 -119 19
2406 19 140 -288 -198 -141 -76 -16 -288 44 -132 -160 -88 -98 95 70 6 -115 104 135 -19 169 111 -221 -137 105
2430 105 -30 -82 9 -152 62 -145 171 25 -187 83 48 -224 10 142 -64 143 -279 46 237 -265 -20
2451 -20 -221 -171 48 -114 -290 -141 70 24 -52 42 138 229 53 -36 124 150 -27 68 200 -196 -254 197 82 33
2475 33 -45 -189 151 -188 180 -47 16 48 65 -226 -13 -250 -47 116 47 5 44 33 51 103 16 -8 -51 147 -216
2500b16k3K30j4j37K80p6K5j37N2j53N07l55O1N6J95k10j42O9Q2O6j26r1k1J2
2524f6J00K81j69j14j61o8J43n9J39%j1j14J66j24J71j89r9oJ31J68Kk11L33p5
2548A68m8m3M4l67K55l22K58J00m7j4J90n4k3J08m9j92J18J47j35Ql44L76m67
2571c33J54L71j08O6j46J6J52q2m7L2p1R4J71j63L1j61O9j61J65o6J59J51j72
2594A21n0o9k6j05O6o0J69O5l80L52o6%q0r2L25k25L4j08j53J89j28J60j10J07
2618f4j79J77R0K1l13K67J48l06K03l08L76M8J8ok27L46m07k68J60K11K37m87
2640b63M9J34J9o9n1o7M23J9j42km4q8k8MQ7K12j21M6R8r2j28K3j4k6R5j8k34
2667a78J75KN9o6nj36M27m07M0N05k58l4j62Q9M4j78R8k1R4k37o1K84J21m83M15
$$ plain form
2500 -216 -239 -9 -23 -160 120 44 69 -68 -16 -169 338 -17 44 100 295 85 -57 12 94 160 34 -57 -78 -66
2524 -66 34 315 146 32 -129 -197 -54 -113 26 26 15 -99 67 -57 114 -75 -174 -180 -49 119 121 -90 243 168
2548 168 120 77 121 -246 9 -313 -55 45 -2 -16 174 120 97 205 156 -36 82 229 94 102 -242 134 -333
2571 -333 -179 192 84 150 4 20 172 90 43 75 4 98 269 106 137 -24 45 -116 49 -17 142 293 121
2594 121 71 2 -24 -129 -63 -123 46 111 -269 83 17 17 -63 -155 170 -55 -21 -129 -282 -93 -221 -61 -171 -64
2618 -64 -243 -66 24 45 -268 -1 147 -159 44 -264 112 160 178 172 -55 291 -116 -384 -224 -13 224 -263
2640 -263 -214 -80 -61 -130 -181 -248 175 194 52 50 6 -82 -110 -106 -19 193 72 118 216 124 -4 19 5 -21 74 56 -178
2667 -178 -3 -1 58 -8 -13 -149 278 -129 -89 416 158 124 -38 51 95 -83 15 -6 88 -149 -210 74 195 -288 127
2692A27R7m39J64K96l46J27j64N9J06l07L27j03J0o5Q3J16j25p3J19o4r9K15Q3
2715A44k11r0j5M31q3k15J63j49J40j77RN0J56j73L5O9J07j68K50m59J70O9OO4
2739A23m86M10k04R4J71j2j19j18N10j65k94J60mMl30J85J98j81J74Pl39K26P7
2762H7J40l99L62p5J8j23J07k0k64Q5qJ77j25J14k80K30l7n3L93n53K33M1n3j99
2786b02R3L64k00j11J61J47m14J29J97k35J47K03m38J25j31K77l18J99l1K22l83
2807a99J86J25J23q7n30M25J15J61m05J04l0k24K24K90m3k05j45j8M6M61l86j8
2829c0j55L51K16k91R1k97K83k20M1J60Q8j10k40K04l07K72j1k45K11m3P2Q8m06
2852b78J96J46j57K89N5j32J0L5k66j98L53qp1j09J43r0j09K91k35j08J46J25
$$ plain form
2692 127 224 -215 -51 245 -101 26 -138 -79 27 -280 47 -56 -46 -111 -28 88 -37 -110 9 -55 -154 61 144
2715 144 -67 -157 -172 259 176 -39 124 -25 115 -62 -53 -3 153 -20 15 84 191 23 273 -186 -16 53 59 123
2739 123 -363 47 -157 -63 108 96 -23 -141 369 204 -90 70 66 70 -260 -75 123 -58 116 123 -216 10 87
2762 87 227 -172 190 115 133 10 117 97 -167 -82 -90 87 -38 76 -204 26 -11 -64 329 -224 9 50 -3 -202
2786 -202 -109 255 55 -56 105 252 -162 -33 164 -71 76 279 -159 -34 -165 112 -206 -7 -38 184 -199
2807 -199 -13 112 235 148 -382 43 158 319 -86 18 -12 -236 -12 278 235 30 -115 -133 -87 374 -12 -30
2829 -30 -185 166 382 91 182 -115 168 -52 -11 149 237 127 -113 91 -216 56 45 -200 11 -32 40 128 -278
2852 -278 -82 64 -93 196 251 119 129 164 -102 -300 53 45 -26 -135 8 -82 -191 100 -135 -243 -97 28
2874B8j33k5J34Jj2j41K17J92k66j98J05J34J07J80k67j83Q9k14L78j70O1k2J10
2897A05j61j98L78K8J01l7j29J93l99rJ75l2R8k6K23l42L67j03k35K7M1O5K7k67
2921a10M20l57M7j29j63M02j89K10J69k28l2O3j84N9Q4K05k06k90L39j45j15O6
2943h4J13l1J67j81j44J86K15k85q1k31l3L94J49k24q7l3M93k17J25l56k5Q8R0
2966Hj1M0J03k2o8k61J90N1L58n72J49K02j03r4l9J86j46R2P3p7j73M1J36PJ75
2991B45j67j6j07r4J38j33j56K58K37j86r2J35L1O5J04j74J30k61p6K31q6j61
3013a35J54j85J01J02K6R9N2k04p7O4j49J07j5P9n4J5J27l93L64k53O3j04%K66
3037E0j79P6OKJ00J2n9K8P3N1L1k93j3L3Q4j36N3J99k39L18k85O8K28k58k6J53
$$ plain form
2874 28 -105 -130 4 5 -7 -148 69 261 -5 -203 -98 36 143 323 56 -127 -38 -252 126 -44 17 -5 105
2897 105 -56 -254 124 152 253 216 87 280 -119 -128 47 15 113 87 310 -32 335 232 -3 24 65 130 157 -110
2921 -110 310 -47 0 -129 -292 110 -79 131 300 72 40 103 -81 -22 62 267 61 -229 110 -35 -150 -84
2943 -84 29 -2 165 -16 -160 26 241 -44 -125 -356 -389 5 154 -70 -157 -190 303 86 211 -145 -170 -82 8
2966 8 -3 37 140 118 50 -211 -21 30 388 -184 -35 167 64 -30 -69 117 -29 63 136 59 -114 -73 63 70 245
2991 245 78 62 -45 -139 -1 -134 -290 -32 205 19 -73 62 93 158 262 88 218 -43 -119 112 26 -135
3013 -135 19 -166 -65 37 63 162 214 10 -67 -3 -152 -45 -60 19 -35 -20 107 -286 78 -175 -112 -216 -216 50
3037 50 -129 -53 -47 -45 55 67 8 36 109 160 191 -102 -115 -82 2 -134 -81 118 -121 197 -88 -20 208 -50 -76 77
3063G7J6k0p6j74K73j01N5k02L14k57j69M11m7j63L5j69L3J61J37O4l87K52j45
3086h2J58j59K9K23n86M98JJ20l04P4J61J30l14l3J17k83L46o2j63J32J6j04K46
3109A61k05n9J6L00l46J10J66n1J00mJ01l91l9J73r3J01P6j17J02j3o7l4k02M75
3133B60k63J04j50JJ0K31j27m6r1j26L27k55Q7j62K37n1k09m7K56Qp0j56L08j05
3157b9O6m7j3P2k70J81L47j7j82j26M5Q5k51lK90k05l0k5K16j73J17K83l25j14
3181a08k9J5L16J2n1n8j97m8L88m21M15k63K83p0p8o1q4J73l27L73k78m4J79Q
3205D5O4j02J48J50m90K78k41K40q8n4r7J49P8j56J26M8J27k20l55L77J83k83
3227g3K36j82K93k58o4L6n3M9j58K57o6Q9j83k48N4L25k45r1K27J34k06K20L1
$$ plain form
3063 77 93 73 -3 -177 96 -5 50 -152 162 -95 -264 147 100 -63 -28 -197 -164 -3 134 198 -189 63 -82
3086 -82 76 -83 -54 169 -417 81 82 202 -102 -28 133 263 -51 -84 33 -250 96 34 -129 3 19 -85 161
3109 161 -44 -103 -87 213 -133 -23 143 92 192 188 289 -102 -141 32 -61 40 116 -1 101 88 21 -13 -215 260
3133 260 -3 101 -49 -48 -38 193 66 20 -71 -197 130 -125 -38 -200 37 -14 -223 -270 -14 -6 -76 -232 76 -29
3157 -29 37 -10 -23 49 -221 -40 307 290 108 -18 27 112 -139 -142 148 -57 -87 -112 104 -69 48 331 6 -108
3181 -108 -137 -122 194 206 155 97 -100 -148 240 -181 234 -29 254 184 106 45 -39 134 -193 180 -98 -142 37 45
3205 45 109 7 155 305 -185 93 -148 92 4 -50 -147 2 80 -76 50 98 225 5 -350 27 210 -73
3227 -73 163 -19 274 16 -48 -12 -65 -16 -174 83 17 106 -77 -325 -271 54 -191 -282 -55 79 -127 93 124
3250A24l32K86j40K49k54j35L49ko06O87l0k52J08k95J98l06L95J06L8p3k32Q2
3272c5J65j07k24K06M0n2q9RK21O0J56k29j35mj67J56k5J32k66J29K18j60R2k68
3296a77J86J15k7k69J66K5J44l70K53L1L6j55J60O6n43L07K96j28k15L08l25j34
3318b50J84j3L10l99P6L80k84J17j74P3j00J42l06K23j24L79j24k78J98o2q4J09
3340gnN1o9p3J18J09j2R0k00j38k11J90J08lK45k64K02l09J99k25J93J82l63J83
3364iK84l83KM6J76%j36J03k87P0l6M6q3J30P3J77k36q6J59j76J50M0K21l8l56
3389a49K77n6p9j81K5qP4j1L3J26j17N9p4K24n1j16rq0J34j72L64j33k03J44l03
3414b82K36L7j04J13j6jJ58o9m14K87L29k29r4lRR5L4N2J49k24P3K3j12p9r0J59
$$ plain form
3250 124 -208 78 -62 187 -67 -202 147 145 -461 226 196 -56 52 -243 -45 -351 44 150 188 115 -117 -35
3272 -35 130 23 -201 5 45 -7 -96 -87 134 194 350 121 -14 -18 -185 -29 -54 78 -188 -59 159 -1 91 -177
3296 -177 9 124 97 -172 -6 19 163 -207 46 77 113 -42 118 184 -359 -52 244 116 -99 209 -116 -250
3318 -250 -66 -79 231 -168 -92 288 4 121 -53 20 -80 62 -244 -21 -145 234 110 -168 30 -32 -116 -7
3340 -7 -12 39 -30 -103 15 124 112 202 2 -136 -347 -157 -49 -52 193 -71 131 -178 21 -204 -11 171 -192 -9
3364 -9 275 -108 -106 -60 116 116 -20 83 -204 -134 -170 -124 -207 -77 -4 173 -63 -149 10 -166 -16 24 245 207 -149
3389 -149 128 72 -7 -188 -163 -171 -97 -108 -75 51 -66 -7 -81 143 92 -24 -33 -113 21 -151 213 80 -123 21 -282
3414 -282 -46 -9 -113 0 -16 -17 141 72 -342 -55 274 45 -49 -52 -43 52 86 138 287 63 136 159 47 -32 -122 37
3440C7r9J98J37k75O1N1k3m3l5j13Q1K28l55J88j20m2L48l02J13J53N6k63R4k77
3464b02K0J01K33q3j15r2K13l5mJ83j59J48k9o1j02r1L81k59M3q1j26j8Q0K15
3488A60p4k8k65N38k60k68L9K06l47L90J1k79L40K21k10m8k92R4N2J34p6k00K65
3511A03N5k64K31pj29q2J81K37m00j49K40O9l88J44Q2K36l36K74j65K43j37n4
3533a6K3J03l30N83n7o11L46j89J87J58j20k45L55l04K6K67k7k08J61P4n40M65
3555A01l69J81j0p6m6J83K41l73L3K73k92K52q1j92J85m2l5j99O0L01R0k11k47
3578b73L33J04k32J6N6m9O2J95n0j28J38Ml92K53j85K18k51L12q2k06J43J21j81
3601g4N6k11J02o0n6K04r0L54j27k38q8L0K48Mj42L14l63L58l91j2K45j80J90
$$ plain form
3440 37 -62 136 273 -2 59 110 87 44 9 -104 -23 205 -150 38 -82 -124 224 -78 35 188 244 -19 75 -202
3464 -202 -182 -81 152 69 -46 -138 75 40 36 219 60 208 179 118 16 -75 306 47 90 9 -117 -135 -55 160
3488 160 86 58 -207 331 71 -197 -158 48 -299 91 102 -177 163 384 174 126 -166 -72 -20 114 38 -162 103
3511 103 158 -106 125 118 -11 -93 88 325 -75 -224 16 85 -303 -159 -77 159 -177 97 -68 175 38 -16
3533 -16 7 110 -220 363 306 -305 41 -148 39 197 77 -168 187 -117 -91 176 149 -59 102 176 -364 101
3555 101 -268 -87 -97 -173 -219 -36 205 -168 -135 138 -154 98 17 -175 10 -32 -67 -266 -206 95 185 -26 -273
3578 -273 60 164 -68 -52 4 -45 17 212 162 34 172 176 -216 37 -148 70 -181 131 49 -157 -14 107 -74
3601 -74 -18 -229 -127 -187 -243 -39 -129 225 98 -140 -228 -198 50 54 -88 226 -137 221 -170 -182 63 -117 73
3624G3J6j51J83j11k8k3J24N2j70j9J06j18K53j37k78K24j12k4jL88k99m8p6J74
3648bj10J80r9L2K59j60J52m75J25J8Q0o8N7J66j75M8R0j31J24l37m4L79lo9m1
3673dJ5J17l16J32n6J65P3j96L16m26j3P9J29J85j10NNl46L5J87K3R2k61P0l09
3698d09N29k25L05k11J21j47R6m4qJ9j88K62J70ql65J99k30K84J00l34k10M39
3720A45j84J80q2o8J8K55j87K3k6j77L00l37o9K10J74k52Q2N2j49J62k28J53j06
3743a11J37K0j52N5K32l22J44Q4J69l27M34k27K34p13L41M7l09K82O2j2n1m5P5
3766D7%K63j08r3j99K27l23qJ99J05J66j38j0l64K61j79K95j47NJ38k17J05p8
3789e3J09j57J04N9o3K9K76m43K70j52k85K82J7J46o8J40j20j96K6L14k85L0K12
$$ plain form
3624 73 89 -62 121 10 -18 -41 83 135 -35 -54 52 -66 187 50 -228 -4 -116 -140 -141 247 -52 -100 -176 -2
3648 -2 -112 68 -31 1 260 100 252 -223 -98 -80 0 -68 -11 155 -20 28 118 -13 111 -226 -270 109 106 37 -4
3673 -4 11 128 -188 -56 -112 53 126 -70 246 -180 -193 -114 15 200 90 95 100 -246 -211 -24 -1 91 -170 -100 -409
3698 -409 120 -105 200 -11 110 -37 59 15 7 26 -162 100 270 262 -103 96 -134 150 250 -84 -294 145
3720 145 -39 141 59 -9 9 264 77 100 74 -103 197 -140 -209 1 175 -77 5 57 -92 70 -158 -5 -111
3743 -111 26 46 -106 -51 181 -141 3 87 256 -71 363 136 370 -343 -2 45 -264 18 80 68 17 -28 47
3766 47 47 310 202 109 -90 137 -186 -194 5 110 276 138 128 -236 25 -154 141 -6 -1 137 -80 25 -53
3789 -53 56 -101 3 62 -1 28 304 -139 131 -21 -306 -24 -7 139 71 211 91 -105 -79 235 -50 -20 192
3812A92k06J6L76m37r7N43m32J19J48R6j63l9k45j2K37oJ5j37n8J0J38l0J71j97
3836Br7J18R3m0k72M40j10l95J93J88j99o6J03J03L01k76l3J29l2o4j59J50j90
3859a13J98N9k22k81M68m51L65p7J65jj69j89M41j04q8l1L5j4k14M75k43K15k69
3882d5j36J52j8J75j33q9j8j18N38j25j18j04l3K25l52M8K37j57j19K70m6k00
3904a66L59ok29J82k42K0%L17l01Q7K23o46L66m9j57R7J78P7q7J7O2r6j02K92
3928A96p3r6N5j94O4k39M62j81K46l38K23l08J73q3N8k4Q4OL1k65K12N1k04M3
3952a01L17l22K7K54j76J86r4K20j66q0k81O8m5L12m53M19J79j59j95j40K05J60
3974A35k03k70J98J82pj27J70k42J89q9K03J26m08J22J2l6M1j21K81m67L35J67
$$ plain form
3812 192 -14 2 378 -59 -156 387 -45 74 222 318 155 116 -129 -141 96 90 105 -32 -90 -80 58 28 199 2
3836 2 -95 23 116 76 -196 244 134 -261 -68 120 -79 -145 -42 61 362 86 53 182 150 86 -73 77 -113
3859 -113 85 144 -78 -359 109 -342 23 -54 111 110 -59 -248 193 89 1 -30 5 -9 -223 252 9 224 -45
3882 -45 -181 -29 -47 128 -5 -94 -112 -230 308 183 65 -39 -72 153 -199 -151 86 -71 -190 80 34 -166
3904 -166 193 187 -42 140 -102 -82 -82 235 -66 21 244 -402 -36 -85 -242 -145 33 110 23 40 102 6 -96 196
3928 196 123 27 82 -112 -48 -287 175 -6 240 -98 125 -183 -10 -93 -35 -59 25 31 62 -203 9 60 -144 -101
3952 -101 216 -106 -79 175 -1 185 91 311 145 65 -216 -148 -193 119 -334 85 264 105 -90 -230 -25 135
3974 135 -68 -338 -140 42 35 -92 78 -164 25 -64 139 265 -143 -21 -9 -45 -4 -125 156 -311 24 191
3996A91j26J22j32k44K87o6J19j16q3J10o2Q5k35N04j81Jn2k48P9m8K70k42P7
4019A0p0J69J95l11J92k91o6K10k18J48oJ20P8m31K68k04J55j32K48o1k27K55
4041C1k00J8L03l17K59j14m7k8k9J26o3J75n21M30j60N0M9K46j33L3R6j46k46
4064a88P6m9J61L22m50J61O2J8j31k2Q5j16JP5J86l24K57l05J67j41J58K36k07
4087C2p5k0j8j07J75N8J23j08l73M09J85k92P1k34M10o4l03Q5P4j12j49K34K12
4110B13l49J03p3J04j44J70J94m67O1K26q8J89m4k0j17J45n5J00l46L24j65l18
4132c57M60k9J84m50L76m63J87P8j25L10K2m90M09k60OJ48L9r6J35k52J19k38
4154b87K01k60M76m0j38j09R4L58j04k90m1K74k91J66K6j42k25L26J1q0O3Mo9
$$ plain form
3996 191 65 187 55 -189 98 32 151 35 -48 62 0 85 -150 354 173 174 122 -126 -47 -95 175 -67 10
4019 10 -60 109 304 -7 185 -106 -172 38 -180 -32 -38 82 160 -271 -3 -207 -52 -184 64 3 -224 31
4041 31 -169 -151 152 -165 94 -20 -67 -95 -124 2 -61 114 -407 23 -137 -87 -38 208 75 108 204 58 -188
4064 -188 -112 -161 0 322 -128 33 95 113 -18 -40 45 -71 -70 5 191 -133 124 -181 -14 -155 3 239 32
4087 32 -43 -63 -81 -188 -13 45 168 60 -313 96 281 -11 60 -174 236 172 -131 -46 28 -84 -233 1 213
4110 213 -136 -33 -106 -2 -146 24 218 -249 -188 38 -50 139 95 75 -42 103 48 148 -198 126 -39 -357
4132 -357 103 74 258 -192 184 -279 -92 -14 -139 171 193 -297 112 -148 -142 6 45 -51 84 -168 -49 -287
4154 -287 -86 -346 130 90 -48 -157 -63 295 191 -99 -140 134 -157 9 35 -107 -332 -6 5 -75 -12 -8 -77
4177g7J50M6l2k37K64j64P2j5m3J29j18K32j56J42j51ok58L17j37P5j10L27l56
4200a06N5K61l10k1J19P7pK2Km5p7K3L9J9j50N4j52N13l14q1Q0k7p5M5N9K50k38
4227A5l8k09L26J9j34Rj19J82M7l99L7k8K49J67l42l8K66MP1l0m8k89K78J13j70
4252f1J43N8l67M67l03lr6j15K41Q4O8m16M23l4j87OJ75J89j93kl27j15L27j00
4276a38K21j77r2J32J49J45q6j99k9o2J68K86m13J95O2l62K09j51M7R3k00L29
4298A27k45O7j9K80k84k33N83J3j48r0K16k36l34J43L7J95j79k5J76j72J45k3
4320fJ6m7K0j56K35J31l49K38J71o34M76m4J8J6L9l9k32n3K49j25p0or9K80K68
4345B97m93J23n1K21J68m48L57m07K35j46J24K04j89J47r4q6J2J53J6k73J49J5
$$ plain form
4177 -77 73 119 87 -150 114 -50 22 7 -36 93 -25 207 51 193 42 36 -222 95 -42 33 -77 250 -106
4200 -106 -51 210 -100 -121 -2 75 68 90 92 47 -30 -7 32 51 -99 -45 -197 316 2 -79 1 -26 -101 -56 3 253 15
4227 15 -23 -232 94 113 -21 -12 -131 51 98 -301 -264 -292 -43 124 -218 -256 10 14 85 55 7 -282 -4 109 -61
4252 -61 82 140 -227 240 -63 -66 -162 -277 -36 48 116 -300 123 89 -98 -92 83 272 79 77 -250 -365 -38 -138
4276 -138 83 -94 -186 -54 95 240 154 -45 -74 -136 32 318 -95 100 162 -200 9 -142 -95 -2 -202 127
4298 127 -118 -51 -70 210 -74 -307 276 289 141 51 267 31 -303 -160 -123 72 -107 -132 44 -128 17 -6
4320 -6 10 -37 -17 -173 62 193 -156 82 253 -381 95 51 69 85 124 85 -147 -200 49 -76 -146 -152 -251 29 297
4345 297 -196 -73 -124 97 265 -183 174 -233 2 -144 -20 184 -5 142 48 -38 -26 127 143 -130 19 34
4367C4R7k73J51K46l72O5N9M4l7J13j15K61l20Rj11o0J89j05K03j22p6L48j02
4390A26l30N62l11N0j57O9k1l6Q2p2L08j37J28k99P3j64J14q7J62l3j81M13k20
4413C9M5J71m24K97j18j7j98R8J89M6O7m16Q7K33K19l07R1J79j12m2j01j1k05
4436a90J03J15oj45j3j87N20j49qqJ95l63K45j58K40k71L6J30M4k83Q3K47l13
4459a36K58j43Q8j51J47J85m32M14l26K25k18J60Pj35N3J64J82n79K42J40qk62
4481a25J67N2jj57j53J72R8k86K54j32N9j38K53M3n5k50L5K86j95N7l27M18Mj52
4505g3K67j75mJ3j2j40J30r4P7r9J69j16M2r7R4J50j54M5J02m98O12k70k23N6
4529a98L60J11m88N1j42J50q8K84j88R8K19k9l21Q2J91l9j14L77k84p3J00k12
$$ plain form
4367 34 131 -142 9 255 -117 -52 7 51 14 127 12 273 -47 -38 -149 -209 -20 -125 78 -44 -120 228 126
4390 126 -204 358 47 97 -60 9 -12 -48 34 -38 270 133 261 -38 35 -129 -15 -102 60 27 -154 259 39
4413 39 84 255 -169 128 10 -7 -205 -107 82 128 195 -221 -134 99 318 11 102 281 169 127 26 15 -190
4436 -190 -87 28 22 -123 -136 -323 197 48 40 32 227 -136 109 -49 191 -80 -44 86 130 -153 -70 177 -136
4459 -136 122 -21 67 -84 63 248 -184 230 -96 129 -89 71 78 -57 -4 160 342 -237 5 145 137 -125
4481 -125 42 94 93 -64 -217 -45 53 -233 21 -111 -52 -190 63 106 51 -199 -164 122 -73 -16 -343 75 79 -73
4505 -73 194 19 15 28 16 -124 6 -88 -11 -110 59 -57 -15 -112 -18 132 -22 23 125 -373 239 -31 -254 -198
4529 -198 162 273 -215 -164 -306 -156 -244 40 -148 -50 169 140 -181 -99 92 53 -61 316 32 -41 59 -153
4551a53L05j36j03j4J38O5j07J16k75J66n3L3J04k00J04r2J33O5q1M7l2j19q5
4574a74K35j50O2j47J75j27K5R4l31M83p1k6J7k84L48p8j60J77O9j83O7j39M2
4597g6R0J93l30J17k2k9P6j77K61J82m35J46O9m27M20N2k35J99k29K18j98J79
4619D4j99J10J65Pj13Mj37L46j3r3l51J49j05K88Nj57N5J54J14k95M0j97o4N4
$$ plain form
4551 -153 152 16 -87 -101 37 102 -5 111 -164 2 -51 -18 86 -114 -10 -102 31 96 15 62 30 -89 -174
4574 -174 61 -89 -27 -174 1 -126 -101 -7 -338 145 74 48 65 -219 129 51 -109 68 137 -46 21 -118 -76
4597 -76 14 207 -123 -6 -28 -57 19 -158 103 285 -150 -4 65 -362 58 110 -125 74 -155 63 -135 44
4619 44 -155 -45 120 127 14 18 -119 227 214 121 -230 -81 -186 102 107 -50 5 159 273 -22 18 -179 -243 -189
$$ [...]
8191i4
##END NTUPLES=NMR FID
##END=
