##TITLE=1H_DE-87_ch_6
 200.13MHz, CDCl3,
 8 sc
 
 23.4.2025
##JCAMPDX= 6.0         $$ Bruker NMR JCAMP-DX V2.0
##DATA TYPE= NMR FID
##DATA CLASS= NTUPLES
##ORIGIN= UXNMR, Bruker Analytische Messtechnik GmbH
##OWNER= pz
$$ XWIN-NMR		Version 3.5
$$ Wed Apr 23 14:27:32 2025 Russian Standard Time (UT+4h)  she@DPX200
##.OBSERVE FREQUENCY= 200.1313
##.OBSERVE NUCLEUS= ^1H
##.DELAY= (6, 6)
##.ACQUISITION MODE= SIMULTANEOUS
##.ACQUISITION SCHEME= undefined
##.AVERAGES= 8
##.DIGITISER RES= 18
##SPECTROMETER/DATA SYSTEM= spect
##.PULSE SEQUENCE= zg30
##.SOLVENT NAME= CDCl3
##.SHIFT REFERENCE= (INTERNAL, CDCl3, 0, 14.3821)
##AUDIT TRAIL= $$ (NUMBER, WHEN, WHO, WHERE, WHAT)
$$ ##TITLE= Audit trail, XWIN-NMR		Version 3.5
$$ ##JCAMPDX= 5.01
$$ ##ORIGIN= Bruker BioSpin GmbH
$$ ##OWNER= she
$$ F:/spectra/data/she/nmr/H-C/1/audita.txt
$$ ##AUDIT TRAIL=  $$ (NUMBER, WHEN, WHO, WHERE, WHAT)
(   1,<2025-04-23 14:26:16.78 +0400>,<she>,<DPX200>,
      <created by zg, POWCHK disabled, PULCHK disabled
       configuration hash MD5:
       00 E9 B6 7A A2 85 ED C7 34 08 36 98 17 FE 4E 26
       data hash MD5: 16K
       B1 86 A5 EA 22 4F 9C 16 38 0A 67 63 92 88 C6 9A>)
$$ ##END=
$$ 
$$ hash MD5
$$ 8C 3A 99 09 5D A0 DA 2C 78 FB 24 23 A2 63 8D E3
##$RELAX= 
##$RELAX= 
##$RELAX= 
##$RELAX= 
##$RELAX= 
##$RELAX= 
$$ Bruker specific parameters
$$ --------------------------
##$DU= <F:/spectra>
##$EXPNO= 1
##$NAME= <H-C>
##$PROCNO= 1
##$TYPE= <nmr>
##$USER= <she>
##$AMP= (0..31)
100 100 100 100 100 100 100 100 100 100 100 100 100 100 100 100 100 100 
100 100 100 100 100 100 100 100 100 100 100 100 100 100 
##$AQSEQ= 0
##$AQ_mod= 1
##$AUNM= <au_zg>
##$AUTOPOS= <>
##$BF1= 200.13
##$BF2= 200.13
##$BF3= 200.13
##$BF4= 200.13
##$BF5= 200.13
##$BF6= 200.13
##$BF7= 200.13
##$BF8= 200.13
##$BYTORDA= 1
##$CFDGTYP= 0
##$CFRGTYP= 5
##$CHEMSTR= <none>
##$CNST= (0..31)
1 1 145 1 1 1 1 1 1 1 1 1 1 1 1 1 1 1 1 1 1 1 1 1 1 1 1 1 1 1 1 1 
##$CPDPRG= <>
##$CPDPRG1= <>
##$CPDPRG2= <>
##$CPDPRG3= <>
##$CPDPRG4= <mlev>
##$CPDPRG5= <mlev>
##$CPDPRG6= <mlev>
##$CPDPRG7= <mlev>
##$CPDPRG8= <mlev>
##$CPDPRGB= <>
##$CPDPRGT= <>
##$D= (0..31)
0 0.7 0 0 0 0 0 0 0 0 0 0.03 0 0 0 0 0 0 0 0 0 0 0 0 0 0 0 0 0 0 0 0 
##$DATE= 1745403976
##$DBL= (0..7)
120 120 120 120 120 120 120 120 
##$DBP= (0..7)
150 150 150 150 150 150 150 150 
##$DBP07= 0
##$DBPNAM0= <>
##$DBPNAM1= <>
##$DBPNAM2= <>
##$DBPNAM3= <>
##$DBPNAM4= <>
##$DBPNAM5= <>
##$DBPNAM6= <>
##$DBPNAM7= <>
##$DBPOAL= (0..7)
0.5 0.5 0.5 0.5 0.5 0.5 0.5 0.5 
##$DBPOFFS= (0..7)
0 0 0 0 0 0 0 0 
##$DE= 6
##$DECBNUC= <off>
##$DECIM= 32
##$DECNUC= <off>
##$DECSTAT= 4
##$DIGMOD= 1
##$DIGTYP= 9
##$DL= (0..7)
0 120 120 120 120 120 120 120 
##$DP= (0..7)
150 150 150 150 150 150 150 150 
##$DP07= 0
##$DPNAME0= <>
##$DPNAME1= <>
##$DPNAME2= <>
##$DPNAME3= <>
##$DPNAME4= <>
##$DPNAME5= <>
##$DPNAME6= <>
##$DPNAME7= <>
##$DPOAL= (0..7)
0.5 0.5 0.5 0.5 0.5 0.5 0.5 0.5 
##$DPOFFS= (0..7)
0 0 0 0 0 0 0 0 
##$DQDMODE= 0
##$DR= 18
##$DS= 0
##$DSLIST= <SSSSSSSSSSSSSSS>
$$ [...]
##$SUBNAM0= <"">
##$SUBNAM1= <"">
##$SUBNAM2= <"">
##$SUBNAM3= <"">
##$SUBNAM4= <"">
##$SUBNAM5= <"">
##$SUBNAM6= <"">
##$SUBNAM7= <"">
##$SUBNAM8= <"">
##$SUBNAM9= <"">
##$SW= 18.0517328524113
##$SWIBOX= (0..15)
0 0 2 0 0 0 0 0 0 0 0 0 0 0 0 0 
##$SW_h= 3612.71676300578
##$TD= 16384
##$TD0= 1
##$TE= 0
##$TE2= 300
##$TE3= 300
##$TEG= 300
##$TL= (0..7)
0 120 120 120 120 120 120 120 
##$TP= (0..7)
150 150 150 150 150 150 150 150 
##$TP07= 0
##$TPNAME0= <>
##$TPNAME1= <>
##$TPNAME2= <>
##$TPNAME3= <>
##$TPNAME4= <>
##$TPNAME5= <>
##$TPNAME6= <>
##$TPNAME7= <>
##$TPOAL= (0..7)
0.5 0.5 0.5 0.5 0.5 0.5 0.5 0.5 
##$TPOFFS= (0..7)
0 0 0 0 0 0 0 0 
##$TUNHIN= 0
##$TUNHOUT= 0
##$TUNXOUT= 0
##$USERA1= <user>
##$USERA2= <user>
##$USERA3= <user>
##$USERA4= <user>
##$USERA5= <user>
##$V9= 5
##$VALIST= <valist>
##$VCLIST= <CCCCCCCCCCCCCCC>
##$VD= 0
##$VDLIST= <DDDDDDDDDDDDDDD>
##$VPLIST= <PPPPPPPPPPPPPPP>
##$VTLIST= <TTTTTTTTTTTTTTT>
##$WBST= 1024
##$WBSW= 4
##$XGAIN= (0..3)
0 0 0 0 
##$XL= 0
##$YL= 0
##$YMAX_a= 60437
##$YMIN_a= -91211
##$ZGOPTNS= <>
##$ZL1= 120
##$ZL2= 120
##$ZL3= 120
##$ZL4= 120
##$ABSF1= 10
##$ABSF2= 0
##$ABSG= 5
##$ABSL= 3
##$ALPHA= 0
##$AQORDER= 0
##$ASSFAC= 0
##$ASSFACI= 0
##$ASSFACX= 0
##$ASSWID= 0
##$AUNMP= <proc_1d>
##$AZFE= 0.1
##$AZFW= 0.1
##$BCFW= 1
##$BC_mod= 2
##$BYTORDP= 1
##$COROFFS= 0
##$CY= -3
##$DATMOD= 1
##$DC= 2
##$DFILT= <>
##$DTYPP= 0
##$F1P= 0
##$F2P= 0
##$FCOR= 0.5
##$FTSIZE= 0
##$FT_mod= 4
##$GAMMA= 1
##$GB= 0.15
##$INTBC= 1
##$INTSCL= 1
##$ISEN= 128
##$LB= 0.25
##$LEV0= 0
##$LPBIN= 0
##$MAXI= 10000
##$MC2= 0
##$MEAN= 0
##$ME_mod= 0
##$MI= 1.114404
##$NCOEF= 0
##$NC_proc= 0
##$NLEV= 6
##$NOISF1= 3.799351
##$NOISF2= 2.8
##$NSP= 1
##$NTH_PI= 0
##$NZP= 0
##$OFFSET= 14.38212
##$PC= 1
##$PHC0= -831.0984
##$PHC1= 9.992201
##$PH_mod= 1
##$PKNL= yes
##$PPARMOD= 0
##$PSCAL= 0
##$PSIGN= 0
##$REVERSE= no
##$SF= 200.129724274929
##$SI= 16384
##$SIGF1= 3
##$SIGF2= 2
##$SINO= 400
##$SIOLD= 16384
##$SREGLST= <1H.CDCl3>
##$SSB= 0
##$STSI= 0
##$STSR= 0
##$SW_p= 3205.1282051282
##$SYMM= 0
##$S_DEV= 0
##$TDeff= 0
##$TDoff= 0
##$TI= <>
##$TILT= no
##$TM1= 0
##$TM2= 0
##$TOPLEV= 0
##$USERP1= <user>
##$USERP2= <user>
##$USERP3= <user>
##$USERP4= <user>
##$USERP5= <user>
##$WDW= 1
##$XDIM= 8192
##$YMAX_p= 0
##$YMIN_p= 0
$$ End of Bruker specific parameters
$$ ---------------------------------
##NTUPLES= NMR FID
##VAR_NAME=  TIME,          FID/REAL,        FID/IMAG
##SYMBOL=    X,             R,               I
##VAR_TYPE=  INDEPENDENT,   DEPENDENT,       DEPENDENT
##VAR_FORM=  AFFN,          ASDF,            ASDF
##VAR_DIM=   8192,          8192,            8192
##UNITS=     SECONDS,       ARBITRARY UNITS, ARBITRARY UNITS
##FACTOR=    0.0002768,     1,               1
##FIRST=     0,             0,               0
##LAST=      2.2672688,     0,               0
##MIN=       0,             -91211,          0
##MAX=       2.2672688,     60437,           0
$$ Real data points
##PAGE= N=1
##DATA TABLE= (X++(R..R)), XYDATA
$$ [...]
1851c4n4K34j17J40l43L15j22j9n8J31P9%k38J2k84L78J54L2mk96J16N3j02O8
1875D1k77J53J7J22P4k2j22n0J02j42J48j53M07m53N9K3L2r2K1K03J15l70K42
1898G8j61K81j4j48k28K19Q2l9R6N%l14L57n63J54J52q8J71n8L6k04K43L7j29
1922c5k19K12j48J19Q2j54PJ67j35j11K41K02m7m4p2kk00J33j04K30o4K31j36
1945A53J05k28Q1m68J78K75k12J06p1k18K86K02j05o0o3K49l96M40l83K60k59
1966a28N9K7r9m0L1J63j59O0J16ok53K28j90J51J36o6J14p7j22j0J62j35k2J22
1990F2j78J56N5k12J14Q1m29L77J41k58P3Kj35J13n7N0L8j51J34J03j07J07j60
2013h1J51j60L25j74j64K11j19J09n8J34l3j22NRn7m2P2Jj23K86j54j12J67j02
$$ y = [-34, -88, 146, 29, 169, -174, 141, 19, 0, -58, 73, 152, 152, -86, -74, -358, 20, 174, 206, 202, -94, 22, 75, -27, 41, -236, -83, -66, 56, 130, 108, -14, -64, 38, -104, 44, -109, 298, -155, -96, -73, -41, -133, -112, 91, 206, -164, 78, -83, 198, 184, 36, -192, 27, 109, 70, 166, 171, 171, -143, 214, -349, -195, -43, -131, 40, -18, 18, -186, 57, 94, -35, -254, -42, -190, -71, 11, -143, -136, 31, -104, -215, 26, 228, 181, 137, 65, 63, -137, -4, -108, 122, 58, 289, 153, 258, 30, 111, -357, -179, 96, -116, -10, -81, -299, -13, 189, 84, 24, -39, 210, -186, 254, -129, 131, -128, -69, -42, -141, -181, -150, 13, -146, -86, 30, 24, -229, -1, -191, -40, 96, 30, 144, 67, -55, -65, 97, -38, -60, 62, -116, 40, 95, -117, -3, 78, -351, 26, 167, -91, -18, -16, -151, -38, -95, -45, -7, -158, -24, 79, -28, 79, -81, 70, -90, 235, 61, -103, 108, -11, 98, 40, 174, 141, 19, 24, 33, -24, -66, 6, 7, -116, 170, 16, -96, 71, -31]
2037c1l9Q5J79%k72O9j13K28k39m4J45j35nL46Nj72J44k36L55k52j20J19mk29
2061b16M00j20Jk16K9J5Q8Kj0q7L6m1K15R2R3k51j68K59j28K32l04J55p4j7k51
2086b66K73j06N8L45j85k62j15K45O7k34l0oK06NO5j35J49j09N2r8l7j4p3L12
2110A07j69o0N8q3K71j74J53j62k5K10Nk79L07p1J52k84J18j68K39j3j61j7N4
2133Hj64L00l27L92k93o6L05o8K7q1n0j62J89j13J59k10L67k48L5j09O00k96m17
2156b22K02j5o0r7J1K76j46P6K3P6R2j67k17K90j52Q9j12J49j66l2L6J20k50J11
2180h5J47J46r9o1j39J51j31R1K53k78J91j99Q7k33J9L34Rj97n5K9L8j16L14l27
2204a11K26p5l09K08l2LK70k61J15M5j20K59l55J30q2J09N5l59L89q4Qj16L5K8
$$ y = [-31, -70, 15, 194, 194, -78, -9, -122, 106, -133, -177, -32, -167, -172, 174, 179, 7, 151, -85, 270, 18, -102, 17, 13, -216, 184, 64, 65, -151, -122, -107, -19, -17, -27, -114, -78, -119, 96, 188, 281, 30, -138, 121, -7, 225, -79, 76, 2, -15, -266, 7, -99, -41, 304, 119, -143, -258, -13, 54, -180, -210, -216, -10, -5, 60, -75, 74, -35, 17, -81, -118, -132, -205, 107, -62, -122, -64, -147, 124, -50, 103, -59, -84, 126, 131, -148, 159, 88, 240, -44, 74, -94, 145, 132, -29, -46, 8, -156, 144, -183, 209, -84, -150, 155, 87, 114, 33, -17, -179, 10, -103, 56, -154, 213, -35, 0, -109, 491, 195, -222, -20, -35, -95, -192, -181, 95, -51, 25, 48, 124, 216, 49, -168, 122, -30, 59, -53, 96, -70, -102, -66, 54, -196, -85, 62, 208, 109, 48, -91, 60, -71, 20, 273, -5, 186, -13, 74, -159, -140, 194, 203, 6, -49, -20, 18, -98, 216, -111, 115, 40, -269, -61, -93, -90, 180, -81, 34, 79, -41, 218, -137, -7, -89, 20, 75, -284, 105, 21, 29, -87, -52, -24]
2228b4J31m90M69M9p7k80M84K7l28J05J09n3j09J23k90k4J09K04k17K40j51k29
2250b22K00m4R0Rj42Q4J00nJ89l85J2R8L3J42j56J94j98j2r3K39j17J32j80j00
2274a32L48k78J50r7J3o2J01k66N19l29Q9pj27O7k59K01o4K28r0j21N2P2J13o8
2298E3L44l35Lk0l37K59j16P6K25j60J3ML1m0n5k4J85j88K08Lk26K43k01Q5j87
2323a57K62j7j65j77K31P3Q2j1k95K34j40n6L40m16K47j46K4O1j89L80L0j41j97
2346a43P3J34j64k00K19J10%k8J25Rj54P0j63J83j81J10k62K34J25j24K01j71
2368Cm7k6J52L7q5J05K0J41m57J1J61j82R3j5K52j97m2K87l73O3J18R1k19K7k16
2393b98L92j58L59j52j45j01K91l94J75M23o37L47J08m57K18K51o5k23J46k89
$$ y = [-24, 107, -383, 86, 135, 58, -222, 262, 289, -39, 66, 175, 122, 13, 136, -154, -178, -69, 135, -82, 158, 7, -222, -22, -66, 24, 33, -109, -25, 75, 70, 259, -126, -114, -16, 17, 159, 3, 197, -1, -13, -106, 133, 16, 148, -32, -132, 216, -62, 88, -9, 4, -58, 43, -223, 296, -33, 56, 49, -78, -11, -270, -69, -133, 95, 5, -116, -64, 8, 121, 53, 397, 62, 65, 45, -292, -33, -149, -73, 152, -8, 5, 9, 40, 0, -55, -79, 106, -82, 126, 129, -97, 146, -55, 30, -157, 105, 88, -77, -254, -23, 50, 132, 121, -174, 60, -80, -136, 204, -212, 35, -111, -87, -26, -215, 165, 195, 54, -143, -70, 64, -100, -300, -81, 29, 29, 1, 126, 135, -19, 51, -112, 71, -110, 0, -262, -28, 97, -27, 174, 3, -44, -70, 82, 119, 34, 139, 159, 300, -157, -146, 15, -167, -74, -89, 163, -34, -76, 211, -162, -99, 19, 110, -109, -82, -298, 94, -64, 295, 143, -2, -103, 188, -206, -31, 392, -245, 102, 210, -247, -29, 222, 157, -66, 80, -209]
2413b09J70o9J99k00J85rj96J96L6p0O9n2Nj0j95L36J08k04J26nl65R2n1J0J02
2438aml01L46j41J16J3J6j22O1M6m1j28L06l47K8L88k28j1J63J77k53o2l42M72
2462A51j49j09J98k27M70k43r7j06J35l49K77J10l20M50j82m5r2J13O1k18M6K06
2484H0l8K56K2k07q2L7j70K46l37J75k1O1mJ59l41J22P1k27K62N6m04K17N3j32
2508a46J84L7k96k6L09O5k27k86L75K44n72O34l82m4K18j24J20PJ19j90k00j35
2530c16J62M7n9K73k4k2k46M66l37Q5J88k27o6J83j88N8k5J63k08R9j32k24O19
2553B69m52R2J31R6k36J87l8j03L3J72j21P7k34o9O0K13n2J83q6Oj40J80L7k88
2577h3p1L25k27l0J4l7N1j31M48l18K83n25K29O3j07lp7K48m9q1K22J19l17p2
$$ y = [-209, -39, -108, 91, -109, 76, 67, -129, 67, 103, 33, 102, 50, 55, 45, -150, 186, 294, 90, 216, 211, -154, -62, -113, -103, -1, -5, -306, 40, -101, 15, 28, 44, -78, -17, 29, -12, -140, 166, -181, -153, 235, 7, -4, 159, 336, 83, 21, -321, 151, 2, -107, 91, -136, 334, 91, -6, -112, 23, -326, -49, 61, -259, 191, 9, -36, -128, -15, 46, -172, -126, 80, 42, 298, 320, 113, 31, 68, -102, 144, -193, -18, -39, 22, 18, 177, -164, -42, 29, -198, 64, 120, -284, -67, -14, -146, 38, 75, -221, -247, 62, 127, -100, -386, -11, 233, -339, 295, -87, -131, 87, -37, 83, 90, 209, 19, -181, -316, -154, -107, -166, 107, 83, 61, -185, 281, -56, 29, 217, -10, -76, 107, -81, -23, -48, 115, -93, 6, -126, -350, 269, -183, -91, 40, 136, -100, 87, 49, -54, -21, 151, 30, 107, -127, -196, -136, 77, 25, 208, 122, 128, -12, 168, 205, -83, -154, 171, -56, -86, -72, -109, -58, -189, 259, -59, 224, -301, -72, -9, -116, -119, -196, 52, 3, -78, 144, 263, -54, -126]
2601a26K90l0j39J83J7r9k47K01j27J41k47K22N9rJ9Q4k32J36m6p0J97j44k3O
2625A6pK5k9Pj4l8l0J23J64m30L98l32N7l50N16o7k12L12j17J62k54J6J00MJ11
2650A31J4n18L77j52K83M4j26J34l04J38j28O9j05M60k18o4M9N6k27K36j8J31
2672B62l62K15o9j43J04j33M9mQ9j63J71k1Q4j71m8L35l21J9J43j20K23p3k11
2695a45K45r2J8j14K08M6j23j71N3m0J99J00qL4m28L62J45m17j57L23m2K5m6J5
2719a0K08j35k38M16k70j38J72J28l45J01M3J31j38j88K46j39J78J81k63K05j34
2740A1p3O4J79n9j67K33l34J31J6J17r2lJ07M1p0l15K73k03P3J02M1R3l76K94
2764H3n7N6J30l62r7L62j12J35k65K22o6k8j38JL15l57P0K22r5j57L08Qr7j74
$$ y = [-126, 164, 134, -5, 178, 195, 96, -151, 50, -77, 64, -183, 39, 98, 89, 108, 192, -40, 96, 50, -20, 177, 33, 10, 16, 9, 34, 5, 12, -2, -40, -70, 53, 217, -213, 185, -147, -90, -440, 76, 9, -203, 109, -8, 154, -100, -84, 16, 20, 131, 145, -373, 4, -148, 135, 179, 53, 187, -117, 21, -107, -38, -143, 317, 99, 35, 84, 140, -87, 149, 131, 262, -100, 115, 46, -97, 7, -126, -77, -81, 8, -155, 16, -5, 79, -92, -140, 195, -126, -107, 36, -84, 139, 66, -145, 100, 8, 26, -88, 120, 166, 43, -128, -75, -115, 84, 184, 176, 210, -218, 144, 289, -128, -285, 38, -4, 21, -25, -10, 198, 63, -175, 241, -29, -167, 5, 133, -212, -111, -68, 63, -75, -263, -17, -156, 22, 203, -60, 145, 11, -62, 2, 181, 122, -45, 188, -146, -15, 1, 118, 26, 23, 130, 171, 101, -214, 59, -144, -71, 31, 72, 165, -211, 83, 26, 82, 212, -150, -247, 115, 3, 138, -127, 95, 29, 1, -137, -136, 179, -178, -108, 114, 19, -138, 170, 178, 81, -93]
2788i3J22J10j37p8J25j47k4oJ46p3K93j93k46L13L9j63j9k00L06o2J23m23O6
2811b21L69l3j2j7Q5k16k08J88J12J36j33k09J71k96M88J5m09k7M39p4j79J5M8
2834C2j06J70q8KJ25r8j17Q7J68j60J29p7k29Q4QJ36j20RR5j77P0J64p9Qq0r5
2860a39J21k22ON27j49k57L42l91K20K4k28L13K9j75L1r3J90j89P6Oj14p5n3K05
2884Ek96K68K82k28K58j35l32j1K27r8K3k9k4M05l18j78R4J74n9k6oJ77k19J23
2908G7m8O3J90j96k09q0M43n15K16M9P4k5j9L00m58K65j33PN7m3J6j61J54P3j60
2933f3nJ62k17M1j11L64l54O1J22o1J50k12j2K23kl37K48J06j24Q7K5j68L34r0
2957A67j77L87n29K38k8j90L62k43Q9R7j24n23N93j07Q7o4k83M57m8m9k93N6K34
$$ y = [-93, 29, 139, 2, -76, 49, -98, -122, -128, 18, -55, 238, 45, -201, 112, 151, -12, -31, -231, 75, 13, 136, -287, -221, 148, 115, 103, 86, 171, -45, -253, -65, 47, 183, 50, -159, 12, -284, 204, 219, -190, -217, 222, 148, -31, -16, 32, -74, 96, 8, 10, 135, 37, -80, 7, 175, 15, 144, 67, -162, -78, -70, 66, -54, -45, 50, -127, -57, 107, 28, 36, -44, -139, -18, -240, -234, 293, 144, -113, 229, -162, 58, 82, -146, 167, 196, 21, 52, -41, 149, -40, 36, 42, -72, -147, -200, 5, -291, -23, 259, 31, 289, 154, -178, -189, 38, -60, -37, -66, -90, 315, -3, -181, -87, 87, 28, 2, -4, 173, -46, 77, 29, 92, 282, 86, -123, -203, 240, -275, -59, -10, 64, 39, 20, 320, -138, 127, -6, 1, 58, 15, 31, -130, 24, 97, -63, -68, 94, -123, -82, -193, 171, -183, -122, 0, -61, 89, -123, -135, 88, 86, -251, -3, 103, -21, 66, 91, -77, 257, 167, -10, 377, -152, 86, 58, -132, 230, -13, 76, 173, 49, -474, 119, 12, 99, 35, -248, 209, 161, 112, -181, -125, 109]
2980A09j67N0nM9M9j65m0L47l70K15J32L6Pl72K41k70K23k38L59l38J31O5OJ43
3004A97j85j06K68l89L41j38J64L5m01L30k37k02L98j46Q1J24j56k3p2M9q7K44
3026H9l7L25l93P2K35l42L0k0N1k58J77L32n79K75j18K77N1oq9o9J88j85K74n15
3050b35J36Q4K4M07m08o4N2P8M6m3j84l8J31m6K58k14J58j74J06k24%K32N1j23
3074A0p6K32q1R5l91K45K83j31j45J67O5j54P7j20k07J87q2J10k24J70o0K5k9
3097c4J00p9j59M1K03r5l8l7K83k47L9k4j27K03O0k12O2L54m34K30j47M3J13m2
3121E6j67K9j06Q4L10l49K2o6K62r2K9n0q9K13o7k94K55J95K01l43R2j71J73j47
3145b0K75m19m3L05r4j02j5Q4O6J94k71J89k74K70j12j39K98n4j60J8J14n4J72
$$ y = [109, -58, -8, -13, 36, 85, -80, -120, 227, -143, 72, 204, 240, 247, -125, 116, -154, 69, -169, 190, -148, -17, 48, 54, 197, 12, -94, 174, -215, 126, -12, 152, 187, -214, 116, -121, -323, 75, -71, 10, 134, -22, -45, -117, -68, -155, 89, 52, 377, -16, 56, 291, -51, -21, -41, 10, -248, -71, 261, -318, -43, -161, 116, 167, 161, 72, 3, 191, 6, 280, -235, -99, -15, 9, 416, 8, -56, -4, 74, 120, 77, -107, -145, -14, -60, 198, -16, 142, -32, 74, -150, -150, 82, 133, 10, -66, 166, 85, 180, -211, 34, 317, 186, 41, 208, 273, 119, 196, 76, -131, 56, -26, 84, -140, 30, -30, -5, -34, 66, -13, -172, -131, 72, -23, -61, -98, 185, -62, -23, -47, -174, 29, 89, -123, -61, 293, -141, 89, -58, -15, 98, 56, -111, -82, -188, -104, 206, -143, -121, -187, 75, -17, 12, -38, -127, 86, 19, -275, -20, 175, 376, 33, 125, -46, 127, -20, 255, -164, -207, 98, 4, -98, -113, -29, 37, 231, -40, 149, -125, 145, 33, -106, 192, 138, -22, -4, 110, 56, 228]
3168B28k77j30Q5K51p8j4J34j57Q0j15o8J08K5J56k39j23K2J21K99l77K30k27
3190f6N4J11j07q8J65j49j08M04k27q6R0K32k60K7O5k27K03K13k07j72J88L3O8
3213A56l26K01J62j90P3K02j29j43Pr4K45k85M8n1J77k52J92P8p1P2Lj26k91J69
3237a73n1L75J6k7p1j66N4J57j82qK74k41J58q5o6M28m36j06J60k48L61J37j08
3260A52k18Qj66K55K74m93K81j02K88j04k34L77k25N0o6p8p5J81k11K24j15j45
3282a42L33k83J67L1J23n5j53kj51L0n8K41j45J17L57m80j48L55J17O0l26K1J6
3305B5K42j66k7K8k71N31k25l22L41j1l46J22j0l7J49l1l52M90p3j60p7M4P3P7
3329A4j38j18M0K72q3k9j04M47k15p5m63L02O0j47K66o1P8n0N5k38J35j04J59
$$ y = [228, -49, -179, -94, 157, 79, 65, 199, 42, 122, 7, -61, 47, 72, 228, -11, -134, -112, 9, 308, -69, 161, -66, -12, 99, -8, -96, 69, -80, -188, 216, -11, -97, -7, 225, -35, -8, 57, -170, 33, 246, 39, -133, 55, 88, 156, -170, 31, 193, 3, 76, 278, 149, 6, 13, -81, 164, -121, -73, -124, 53, -199, -7, 71, 0, 72, 75, -51, -342, -173, -224, 151, 167, 140, 69, -97, -43, 114, -68, -76, 198, -43, 115, 30, -36, 392, -44, -150, 10, -238, 123, 260, 152, -66, -58, -224, 31, 305, -188, 93, -9, 279, 175, -59, 318, 93, 143, 77, -1, -76, 105, -106, 118, 3, -142, 191, -92, 75, 106, 229, 174, 21, 19, -132, -102, -160, 81, -64, 53, 410, -70, -218, 137, 254, 314, -12, 9, 25, 267, 101, 74, 102, -169, 362, 137, -185, 156, 145, -201, -79, -89, -126, 23, -8, -360, 130, 57, -103, -180, -136, -63, 14, -124, -242, -202, 70, -13, -42, -146, 301, 86, 11, -452, -150, -90, -237, 29, -32, 46, -4, 51, -187, -52, -156, 3]
3352CL59l23J3K51j65J74n17M27n81K35L39m16L84j69m4k0J13k1j3J43m9k83L13
3375A53p3r0K19l49J31j75J33%J7l55N30k41J57Pk22L83k71m5J37K12P1k38j81
3398i0O7J02l03M6J87K11l10RJ82l21J08J47j28J85K03l98L80q8l20K99l34K32
3420F6J46l04R5R8m30M33m4K6j64Q5r3J56j93j15K82j51P5M7k1J27Nk73J0L38
3444B01l23J90j07j18J52M2K08k87J52k14K11k92j83L43Nj88K96k81J96K62r9
3465A66j81J73q8o9q4L7k14K73P6j39N1M2j3kj95J97j64L18m2j65R4j67L06l1
3489A79o2m9j96J10j70J55j93J69L44l08J54k61Q0j11Q2N4k89N54k63j71J84J66
3511A58J80j02l41J85j77j85J89j42J85j73K30N2K16n27Q9r4J53K26j8oN7J24
$$ y = [3, 362, 39, 52, 303, 138, 312, -205, 222, -359, -124, 215, -201, 183, 14, -30, -50, 63, 42, 29, 172, 123, -160, 153, 80, -10, 209, -140, -9, -184, -51, -51, -34, -389, 141, -100, 57, 64, -158, 225, -46, -91, 46, 258, 329, 91, -90, -23, 79, -224, -178, 9, 220, -90, -81, 101, -220, -112, 35, -93, 92, 295, -103, 277, 189, -131, 168, -166, 66, 212, -92, 3, 101, -329, 104, 60, 86, -78, 7, -86, 70, -123, -238, 44, -107, -32, 15, -6, 121, 126, -147, -137, 201, -122, 68, -39, -157, -5, 37, 245, -42, 110, -104, 107, -185, -368, -25, -20, -208, 88, -193, 3, 265, 166, -15, 158, 70, 1, -83, -46, -260, 13, 89, -50, 1, 43, 30, 28, -167, 30, -134, 184, 142, -23, 71, -96, 210, 179, 117, 68, -128, -18, -188, -33, -226, -57, 287, -21, 133, -128, -48, -159, -77, -23, -312, 242, -21, -192, -8, 158, 338, 236, -105, 80, -97, -282, -93, -235, -50, -223, 7, 59, 275, -252, -163, -257, -104, 122, 104, 98, 155, 279]
3533B79l12J14R3l77L69m07J99K5K0q4K99j58l29L07k7J78j32o7R7L0p4j6r4l7
3557a04K47p8j47L35l88M9j32K70J09k60K79j53r1J61l10J58Q6j52L3Q6j6J66
3579A48r1q5P3K61l79P7N4k36R0J67L3J25m15O0L75m89L61j70O0q2J57l6oj40
3603h8j40K04Rj36L50m0k32O3J65m37J72O5q7q2L73j87O4q4J71P8j45j17L70k29
3627H0k15J17J02j18J26k4M7q2k6P9m1L77o56L19k12L50k20L26m63J48k63K73
3649B4j13p3J40K11o8j00j77K24qq6Q2j16K46k60J34j24N9k3K08k81Q2k05L80
3672A56l45L39j76J62k30K90n0j6L4q1j38k25L38k89J87J78J3j55R0j45j43M10
3694B04k14m0K00J2j84J46n2k69K01o2M6J63j33k7m9J18j03qK08k77J62N9p3J26
$$ y = [279, -33, 81, 174, -203, 166, -241, -42, -17, 3, -81, 218, 60, -269, 38, 11, 189, 57, -10, 87, 117, 43, 27, -67, -104, 143, 65, -82, 253, -135, -86, -218, 52, 161, -99, 180, 27, -64, 97, -213, -55, 31, -121, -88, -2, -18, 148, 57, -28, 45, 306, -73, 4, 58, -178, -88, 79, 112, 237, -178, -118, 257, -232, 129, -41, 19, -63, 94, 58, 52, -88, -228, -24, -15, -151, 199, 159, -73, -10, 155, -282, -110, -45, -132, -214, 159, -28, 36, -48, 123, 201, 56, -61, 309, 80, -135, -18, 84, -34, 92, 68, 115, 33, 7, 86, 45, 422, -234, 85, -127, 223, 3, 329, -134, 14, -249, 24, -89, -162, -22, 189, 121, 21, -156, 68, 60, -26, 56, -60, 186, -74, 60, -64, -5, -28, 180, -101, -19, -224, 156, -189, 150, -26, 136, -94, 196, 146, 130, 164, 83, -55, -280, 58, -231, -44, 134, 147, -8, 82, -63, -206, 204, -10, -50, 150, 162, -22, 124, 72, -197, 4, -58, -12, 151, 18, -9, -58, 60, -43, -51, 157, -120, 42, 101, 28, 154]
3718A54k07m7L8K61j13j22j81J05j6J6J53l55L92l52K89N7J9k18N4K31R7j53k48
3741a46K49J91k01k8l44J12O7l5L52j10J74j12k33j36K98j27%R2p8l7q0L79l12
3764f5N8K71k30k9k8K8J48o4j40O1J08j52M1J10P4k55j34m2L67oj75P3L8o1q5
3789h9K41j83j19J26L6o6M2Q0J76j24k12L6J15j13J13k56M38k35N2n4k42N22l22
3812c8n6L8J35j5Q8j5r3k16K51L3l3r4m7nJ19k8K3j46K63j92J80oL7j9j82J79
3838A61j38M6l8m8k4P5L7k09J89Q9m07K96j07r6Q5K21l06J12K25p4p0P3k55L10
3862A47j13N1q9l8J4j30J79k83J63M5qj2M1p8JkN8j80K96r1j68J60J78k45k5J90
3888F1j06J89P6k78n4J39j5n5K44k61J58M0O6l31k66L38L5J09J45k80R9%n8R3
$$ y = [154, -53, -100, -62, 199, 86, -36, -217, -112, -128, -112, 41, -314, 78, -274, 15, 72, 91, -127, -73, 158, 255, 102, -146, 103, 294, 93, 65, -279, -167, -100, -135, 217, 107, 281, 169, -64, -200, 98, -29, -29, 63, -15, -52, -132, 247, -65, -7, 264, 34, 5, -23, 5, 153, 89, -51, 10, 118, -34, 7, 117, 191, -64, -198, -240, 127, 121, -54, 19, 57, -4, -89, 152, -31, -150, -24, 12, -54, -12, 68, 244, 120, -92, -56, 59, -54, 59, -197, 241, 6, 58, 4, -238, 284, -38, -94, -56, 79, 64, 152, 137, 44, -172, 79, 112, 79, -15, -62, -67, 52, 24, 47, -99, 164, -28, 152, 146, 183, 164, -18, 161, 23, 69, 31, -17, -41, 34, 71, -138, 51, 140, -267, 29, -78, -174, -89, 132, -174, -62, 163, 89, 19, 92, -163, 147, 34, 85, -4, -42, -28, -158, 21, -262, -99, -54, -62, -74, -33, -111, -110, -112, -54, -234, 62, -29, -197, -37, 141, -104, -129, 61, -45, 144, 220, -58, -112, 27, 12, -43, 201, -60, 98, 138, 204, -127, -393, -55, -20, 89, 234, -46, 53, 53, -5, 88]
3912H8o8lj79M50m58Q0K36l54J1O8J2L00k18N2j00Q3J3j53L80l51R8NL9J09j21
3937A9j16j60K67k04J81O8m9j53K53j42P0j39R1K0j78K03l58L75n3K8n0j59L27
3960A41k86J01r0L81m44J31K51k58K90m45K15J6l8lJ51l43N9K70k32J45Lj47J33
3983Ap3J02n9m7R0L1j05P2P1k91K28l33K65p8K19q7N3P2j00L5j60J5m1Q6N7J56
4009A79k61pJ11RO2n6k3jj5N5j0j51J42R4o8j49J53q8L4J58l3k23RM37m76J8L5
4036f5J64o3J4K69n07N07l42R9o6J4k9k7r5N0J50J69m67Q6J37O0%j5k3o9K87l03
4062f5n3J92k4M7j08Q4j37J34k6j40K00l00P0J3J91k99K89o4k16L91j75j07J47
4085D4L3P3m65L91j33k2J33k52j2L88M1l79p3K61j4L2j09P1j05R1L1o2P1j40J80
$$ y = [88, 20, 17, -162, 288, -170, -90, 146, -208, -197, -129, -117, 183, -35, 17, -83, 0, 13, -140, 240, -111, -13, -8, 31, 140, 19, -97, -257, 10, -194, -13, 55, 6, -147, 106, -36, 34, -105, -14, 6, -172, 31, -327, 48, -5, 23, -27, -186, 141, -145, -44, -134, 247, -197, -66, 185, -73, 217, -228, -13, 3, -35, -38, 113, -230, -171, 99, -133, 12, 15, -132, 1, -72, 30, -29, -76, 14, 45, -60, 12, 83, -208, 20, -313, -48, -126, 93, 6, 59, 131, 31, 66, -94, -79, -120, -34, 23, 179, -82, -89, 22, 31, 93, 37, 14, 13, -2, 53, 43, -108, 34, 128, 60, -89, 64, -24, 10, 168, 135, -88, -79, 358, -118, -100, -65, 99, 36, 50, 319, -188, 319, -23, 76, 10, 24, -5, -32, -127, -77, 73, 242, -225, -139, -2, 58, 58, 43, 20, -49, 238, -65, -118, 74, 50, 97, -11, 73, -64, 70, 44, -96, 104, -196, -126, -113, 78, -221, 68, 4, -212, 179, 4, -103, 44, 77, 150, -315, 76, -57, -79, 54, -198, -210, 178, 219, -160, -233, 28, 14, 46, -63, 8, -97, -6, 25, -37, 34, -106, 74]
4110G4p7j70K86j69J14R4j63n1L28j87o3j58K34R5n23L43K52l59j27M47k17j66
4132a63L1J80j11M3J13M8l40J67J07j01J41L5j68q3K32m22K24L40l37K65l55K87
4154A33J03l11J90l38L32n5k5J07l23J00K09k15j52K39J56j81j04J88J00l54L02
4175A01P2P1m10K79j14R0j59K38r6k35J5L1J88q9p0k01K63K2q2j5J07J78l39L00
4199A45j24q5R1PL4l5j94K62j62J5l61J67K48K36N1k96j05J00l09L59J30n90L26
4222i0n3Q7p2j07J71P9j93k4J45K4j6K71j59j29Q7k09J95P0j45j71o2K20N9k53
4246b75M00L6o1p0J37J6K85m14m0J64m16L68j39J95l23O9p9k98L59N6k09O13l31
4269D3j49J68q0k43K60j31K06M9k31M46n28N03l04O5Q6O3k24J96k32n9j51N15
$$ y = [74, -3, -173, 113, -56, 58, 152, -11, -62, 266, 79, 16, -142, 92, 187, -336, 7, 259, -100, -227, 220, 3, -163, -132, 48, -63, -20, 93, 141, -199, -32, 75, -26, 115, 150, -18, -101, 131, -291, -67, 273, -64, 201, -154, 133, 236, -75, 115, -223, 109, 54, 29, 136, -187, -87, 122, -93, -245, -6, 150, -31, -135, 53, 153, -201, 101, 173, 244, -166, 113, -1, 89, -70, 168, 72, -163, -148, -117, 71, -18, -88, -289, -26, -4, -86, -101, 6, 184, -155, 145, 21, -64, 27, 34, 68, 33, -161, 101, -61, -46, -407, -240, 8, 244, 295, -1, -106, -6, -315, 44, 174, -416, -90, -143, -56, -128, -235, -64, 15, -178, -202, -57, -33, -49, 222, 63, -66, 21, -188, 7, 77, -68, -239, -301, -81, -22, -275, 125, 161, 100, 30, 167, 183, 468, 54, 14, 178, -238, 130, -9, 186, -137, -68, -147, -445, -86, -30, -239, 374, 43, -106, 62, -18, -261, -1, -132, 74, 123, -108, 338, -190, 313, 9, 74, 160, 223, -1, 195, -37, -96, -247, 268]
4291B68n65N23j21l57R7J48Q6j35J12j87K56j88K98l21K58k01l1J20j24j03L10
4312A43k45n0M07k31n0k4J64j99J87K0kj29nJ68P0k07N0k29J14R2l70J33L71k6
4336A52m16J58O9rJ55m63M15j96mJ29pJ30J6l36K60j97K03J92J1k16K36k91r5
4359a04K11P9r2j20r3N0n0J2K12j41M6j1j08K6j41J29K48j58o6K0k0m6J89k58
4383a86J16j3k35L43J1k2K05m57L97k71J47j66N3J90j66QP5j13jJ04j39J91r3
4406b2R3k35J99P9k42J12r4j17J74j25J51P2N9M4j23j66l6J26K77l40mL4L7Mr2
4431a35J13R9j60J66N0j91J24j70K08J32k12l9K40k92K12n3Pk0q9LJ41l23m1K97
4455F7j93Q1J91K24k89K71n24K13l6k8l03K76j44J40j16K15K3l65K49j58L26p9
$$ y = [268, -297, 226, 105, -252, -155, -7, 79, -56, 56, -131, 125, -63, 235, -86, 172, -29, -60, 60, -64, -167, 143, -102, -152, 255, 24, -26, -50, 114, -85, 102, 122, 120, -9, -14, 154, 224, 17, 67, -162, -48, 44, -326, -193, 178, 152, -264, -106, -37, -46, 109, -354, 61, -135, -139, -10, -17, 113, 129, -207, 53, -144, 59, 251, 262, 46, 282, -9, -104, 107, 186, 94, -26, -119, -69, -119, -107, 105, -36, 10, -1, -109, -83, -224, -95, 153, -5, -71, -51, -71, -117, 72, -186, -70, -83, -318, 25, 36, 14, 219, -238, 159, -112, 35, -131, -78, 112, -54, -46, 29, -84, -85, 19, -120, 71, -22, 71, -164, 35, 114, -128, -16, -110, -227, -53, -178, -27, 45, 104, 148, 25, -141, -177, -51, 226, -114, -118, -84, -47, -43, -135, -22, 77, -83, 83, 133, -58, 66, -104, 104, 236, 24, -15, 225, -67, 145, 92, 99, 79, -10, -7, 134, -189, -230, 67, -126, -45, 146, 370, 81, 352, -172, 41, 5, -23, -326, -50, -194, -54, -170, 45, 68, -297, -48, -206, 120, 41]
4477D1j55R3J14k38P9J10q2K4p3k04M00j40l3K46J95k79J02J48k20N7m54M09l90
4500b50M53n4Qj46r3J74j53J19J95k89k17J60J66k27R3q2J82j64m4R2Q3K0%QK
4525C6k28J14K50l25j29L60P9j80lL6J47l6Qk12K44k6j58R5M2k67J22%m8J37Q4
4550A42l8j90j02J77J79k82j7Q1lL55l80J9Q5n9Q3M2K5j42o7O4p2N4nJ58n57K53
4576a97K31j4L06n18L23Q9l60K73k53J59r0M9K31j09k12J67k69N0K62n41J60J5
4598b48J37K94m00J20n7L96k92j08L08j20J1J66l20lJ22K9L3m69N72l17J65l57
4620c38L83Q9Ln7P0l57J1K74m6r0P4J17j23N5J31k76L3J48o4m9J14m08J68j04
4644b42k8K93Q1l93L80l3J05p5l71K25ll8K16l03M10o0l13M46l69J48J1k97R4
$$ y = [41, -114, -21, 93, -145, -66, 44, -38, -14, -87, -291, 109, -31, -64, 182, 377, 98, 200, 348, 128, 185, -269, 140, -250, 203, 149, 157, 11, -82, 92, -61, 58, 253, -36, -253, -93, 73, -154, -61, -143, 39, -125, -169, -77, 6, 26, 26, 34, 36, -192, -78, 172, -153, -282, 78, 157, -23, -26, 10, 157, 121, 129, -83, 161, 135, -23, 72, 114, -153, -31, -31, -79, 58, 142, 104, -86, -188, -11, 168, -114, -131, -50, -53, 302, -78, -59, 26, -33, 50, 92, 117, -25, -92, -28, -100, -46, -51, 107, -450, -197, 34, 20, 326, -192, 131, 220, -140, 133, -120, 39, -51, -2, 229, 120, -92, 75, -194, -144, 118, -423, -263, -248, -111, 183, -217, -97, -154, 242, -50, -158, 150, 30, 41, 207, -113, -116, 6, 35, 68, -401, 171, -146, 19, -338, 45, 134, 137, 80, 150, -207, -196, 78, 32, -58, 16, 133, 10, 65, 196, -80, -47, 101, 37, -12, 102, -306, -138, -242, -270, 23, 104, -289, 91, 58, 163, 88, -283, -58, -61, -99, 117, -186, 224, 164, -149, 297, -72, 76, 87, -210, -116]
4667a16m3L03j03k2Q6K2n0k20M01k84J84M5j64k58K10k06R7J2K72l1l07N38m61
4690i5R6O1j82j64L63kn5Q4k0K1k98K51R3r7J4M8r2P5Q2q6k62O0j05P7J99k91
4716b25O9L58k41j77J93N1k4J01k90jK69K6l38J15N4j95K68m6J00K23m27L43Q2
4739B88j48Jj93p3l8k9K71j86N7K20M0n5l59J04L21l46q7K43k1k53M43k30K55
4762B25L1k30J62l32K64l32K04K59k96K02k16L56j35j71J29p6J30n7L5l99K32
4783a5J39k54K52k87L67k91K53k39J00q6pK32J2l06j43L16N5j25l9L6lJ11k10
4806a32J51N6k93L54m33M07m1J6j23J36m0k38K74j83P2K75m7k35p0j95K46j05
4828a48L59k93o5L3J25P6p8J13q4J90k96O4k9rl01L70j25J70J17l63K31j30j7
$$ y = [-116, -159, 144, 41, 19, 105, 127, 77, -143, 258, -26, 158, 203, 39, -219, -9, -215, -118, -106, 166, 135, -172, 366, -95, 1, 62, -120, -284, 79, 77, 22, 106, 86, 107, -191, 60, 153, 56, 70, 118, 26, 101, 183, 97, -165, -105, -210, -133, 66, -225, -156, 202, -39, -216, -23, 28, 4, 105, -185, -186, 83, 109, -229, -114, -60, -255, 13, -33, 67, 290, -137, 206, 288, 140, 141, -52, -125, -163, -192, 79, -107, -50, 170, 210, 155, -204, -100, 221, -125, -212, 31, 10, -243, 200, -30, 225, 256, 26, 188, -144, 120, -212, -8, 251, -45, 157, -59, 297, 162, -9, 120, 44, 174, 117, 152, -247, -15, 124, -130, 122, -165, 202, -89, 164, -75, 25, -61, -68, 164, 176, -130, -273, 43, 98, -27, -66, -30, -33, 78, -132, 19, 75, -218, 136, -297, 110, 69, 85, -38, 98, 58, -180, 94, -89, -17, 258, 211, -24, -94, -289, -43, -148, 211, -82, -147, -114, 11, 87, 9, 122, 38, 228, -68, -4, -33, -42, -343, 27, -98, 72, 189, -174, 57, -73, -90]
4851i0j57J49P6J75k81Q8J57J9j1j42j5K95l01j14j76K84R8j83L62j29n9k10j24
4874b89QL75r1pm7j86L19n2j22O2Q2J55n2j89p6k03L80KR6k18Q8o2Q7R2j1k73
4900a32J88j46K96j94l8J00p2M2J3l37K15K78m41K77J17k13j00N88l49n3J58k52
4922e5J67q2K3l3n2j55L02k09L0J97k61J07L7K8J5J33l13J53k47K42M3l7r5Q4
4946B2P4N5lk51K18r6M1q3J04P4P9l3j62J10j24J02Ok32J49k54K62k42L28l81
4970b37j49J57L36k61k5J37J77r8j70l6K39L5j16M3M8k78K84j25j10n0J81J42
4992A24k38J87K17o09N40k42o9J44k86L45j2j00L9Q1k19J60J55l37Q2M9rj11N0
5015e9PQ0K65m0j86r9Q8N5K44k69n5n0K35j01n9k51l5P5K56k01N8jj08Q2k89P1
$$ y = [-90, -247, -98, -22, 153, -128, -40, 117, 136, 125, -17, -32, 263, -38, -152, -328, -44, 54, -129, 233, 104, 45, -165, -289, -281, 94, 3, -4, -51, -237, 82, 30, -92, -30, 52, 207, 155, -34, -110, -313, 67, 69, 165, -53, 35, -27, 60, 152, 141, -132, 56, -90, 206, 12, -26, 74, 2, 44, 57, -280, -65, 213, -228, 49, 166, -47, -147, 441, 92, 39, 197, -55, 112, 30, 53, 20, -32, -187, 115, -94, -64, 133, -128, -21, 16, 44, 59, 192, -121, 32, -215, 27, 70, 33, -62, 22, 96, 151, 148, -103, 115, 19, 60, -23, 81, 155, 234, 201, 39, 149, 25, 127, 133, -99, 50, -204, 58, -184, 144, -237, -386, -229, 107, -154, -179, -42, 135, 37, -133, -169, 70, 105, -11, 32, 80, -198, 86, -39, -149, -199, -18, 124, -114, 73, 290, -319, 221, -21, -90, 54, -232, 113, 101, 1, 40, 121, -98, 62, 217, -120, -38, 11, 2, -109, -59, -52, 28, 293, 253, 67, -32, 56, 111, 355, 86, 31, -19, 216, 115, 56, -195, -230, -155, 101, -100, -42, -43, -151, -69, -358, -287]
5041b87L14L84k28l9m12L35M8k65K29o7r0m8K05m7q2J57J47k70P3P0k14j4J48
5064D7l2p1J08p2q2p5M84m51J04n9J28j93J04k85L56R8k89J78k24J66M8K61l64
5087a15O5Q5K76n44K77J42k80J15j66r8M22j21k39NK19M7k4j8K4J83m69J28K62
5110A76j20R7j18p2L0q4J60j90K23l52K79J8QJ68r7k77K30j97n8L08n4K4j64K26
5134A64L3m11K74j22j71M46m85J58J26j08j74M8J1J90L5m1L22Q4m14mk9N8N8J29
5158A77k32O9L40j17K3k32J26M8k85Q4J07M8j6q2J52k33J70l71J38j8K44k16K4
5181e2K58k87p8R3J45k42J05K66n00J94K08l18K55l32L63K2k07M59j65k57K61
5202A91j04kr5j89K74L4n9K02j20N4l77L06k18K74j90j6n3p5K22k12K46j43K2
$$ y = [-287, 27, 411, 183, 144, -268, 67, 115, -150, 79, 12, -78, -126, 79, 32, -50, 107, 254, -16, 57, 127, -87, -101, 47, 15, -56, 52, -20, -102, -177, 307, -144, -40, -99, 29, -164, -60, -345, 11, 109, -180, -2, -226, -60, -12, 249, -115, -50, 35, 311, -233, 44, 186, -94, 21, -145, -243, 179, 58, -181, -176, 43, 90, 66, 48, 72, 255, -214, -86, 176, 56, 153, 35, -37, -7, -91, 69, -121, 102, -250, 29, 47, 55, 223, 126, -151, 79, -118, -176, 132, 78, 102, -62, 164, 197, -214, 60, -62, -233, 213, -272, -114, 12, -96, -270, -222, -211, -21, 14, -27, 295, 379, -35, -39, -68, -10, 48, 177, -55, 14, 354, 237, 260, 28, 154, 202, -83, 1, 108, 156, 140, 58, 210, -23, 147, -224, -86, -104, 140, -76, -52, 206, -81, -159, -66, 79, -163, -58, 208, -292, -98, 110, -208, 47, -285, 78, 100, -107, 352, 187, -70, 191, 87, 85, -10, -199, 75, 109, 50, 252, 132, 186, -191, 115, -103, 171, -19, -35, -88, -163, 59, -153, 93, -50, -28]
5225b8j2j39N33k13l9j93J23j85J5L86p2J41m51J06po4J26j68Q6Q6j05Q9L6J04
5249A55l41J00K32mJ07m76J82j49L67J40O6n66K92n4R5k53K37j94J76j98J55j5
5271E4j86R4J01M5pj00Rj37K96j78K5K06j09p0q8J81k23m8J57k53K40L2j79O6
5295g2R5p3r3k78M88J67j37k40L86l42p6K36j46J5K04j28k63M27k95J65J46%k64
5318g8Qr7L95n34O46k36j26J47k89K45j04j96M45q4Mmj14J0j87pK60K12n25L93
5342A84k10nk9K70j66j70J47j57K48n1P5m55K54J13q5J47k5n1j17J88o3j16K3
5365e1j67K97O2r5k20J74N2K5o1L6l0L8P8j27k82K54k62M38l69K08J87j76k41
5388b32K85J58k17J01q4P1k06O0K2J17j57P0p6j1L06k77j21K32MR6J6k04qJ4N8
$$ y = [-28, -40, -179, 354, 141, 102, -91, 32, -153, -138, 248, 176, 317, -134, -28, -35, -99, 27, -141, -55, 31, -74, 15, 51, 155, -186, -86, 146, 142, 249, -227, -45, -194, 173, 313, 379, -187, 105, 51, 146, -107, 130, -64, 112, -86, 69, 54, -132, -38, 63, 108, 101, 1, 10, -127, 169, -9, 16, 222, 113, 43, -45, 136, -87, -135, 22, -231, 9, 41, -138, -72, 23, -50, -143, -421, 67, 234, 97, -143, 243, -99, -175, 61, -85, -70, 134, 6, -257, 170, -125, 40, 186, 186, -78, -70, -167, 228, -306, 340, 104, -22, 125, -164, 81, -23, -219, 226, 142, 146, 142, 28, 38, -149, -156, 104, 316, -209, 184, -26, -31, -60, 210, 44, -126, 21, -136, 112, 61, 136, -319, -65, 48, -37, 110, 85, 34, -83, 105, 42, -74, -51, -218, 79, 141, 46, -174, 0, 52, 77, 16, 52, 22, 60, 138, 11, -271, -17, -279, 159, -210, -2, 185, 9, -232, 53, 211, -6, 95, 11, 82, -124, -64, -42, 75, -82, -12, -88, -99, 207, -70, -191, 41, 45, 141, 157, -47, -55, -41, 17]
5413A7K56l48r7N9J06J43k98L6j82M29l5j47K16k18J48k18M87l12p5O8K32q5j36
5436D6k1K52l84m0K35pJj74Rr1K86r2j26K48j01J65j55J29k55J67q3l47K29M6
5460f3M9O8J75r3q3m2k32J61o1M5K26k75L20l13K67r8R4m05L63k58K92j66M8R0
5484A09j21L6J85m93N01N0m63j9J57J97k12P5j8P3K36m3j06j13M8r6K5r1N4Q9
5508F0k26K72j47K3j61J99p6j91M11k56Q4O3l33%M05J79k96K15j12o4j84J80j4
5531C1q9J30r7n6K59o2K54n02m9KJ57l2k69N01k22j4q7K42J50l23J45j62n5L29
5555A81k10N1p5j7n9J06J54j43l7M8k12K44L1j40o2J08J20J92l51J19j31l8J5
5578a06K24k1o0N6m82K30N35l90p4J68J72j22k14P9J59p4j42P9n7j89Q0M09m88
$$ y = [17, 273, -75, -172, -113, -7, 136, -162, -126, -308, 121, 86, -61, 155, -63, 85, -133, 354, 42, -33, 35, 267, 182, 46, 25, 277, -107, -147, 88, 81, 82, -92, -83, -174, 112, 20, -106, 142, 41, 206, 51, 180, -75, 92, 9, -338, -109, -63, -14, 54, 229, 136, 53, 11, -221, -60, -121, -76, 150, -125, 195, -118, 149, 51, 145, -260, 103, -155, 137, -29, 19, 109, -12, 24, 209, -284, 217, 267, -196, -215, -58, 139, -73, 2, -16, 57, 293, 250, 144, 31, 79, -17, 8, -83, -29, 60, -166, 106, -41, -18, -179, 20, -56, -247, 164, -92, -8, 55, -278, -278, 127, 306, 10, 225, 113, 49, -135, 45, 31, -58, 72, -25, -81, 178, 116, 370, -132, -181, -179, -22, -54, -323, 178, -44, -58, -145, 97, 247, -76, 69, -93, -148, 181, -29, 22, -53, -70, -129, -23, 131, -12, -49, -1, -213, 31, 62, -78, -140, -32, 88, 280, -71, 48, -83, -121, -106, 118, 97, 37, 93, -389, -159, 376, -14, -88, 80, 252, 130, -84, -5, 154, 80, -62, 17, -40, -229, -149, 260, -228]
5601b28M73j36k68J09M0m1O5l90N74J64k97Kl0k61K66k09k5j1O0M5%J01r9M4j42
5626a94J86j46K18J16j22l9Q4J9j95l5m7J28k10J59L11m77M87p7l4k09J25J72
5648B20k15l49J60M04j97p2J54j50K15k7m65M38j34L34n25L81q8L5j50k7k0k7
5670a05J31N5q2l2l0j21J14J61j39Q7j13j06J84m4o0N5J23j64J7j77J47L89k52
5693C8k44L25k42L11m89M09j09N7l6jk2J18M1k66O6j56J76n4k3K59R5n43M48k01
5717d3J06K10l37j26L44k82L09m31M10o30M81L9j09J52j60K0k22K65KN4l82N26
5739A96k66J0J5J56j70K96j96N2p9K39k04p3J64m2k90K28O9j2J21R3l17J07k44
5762a47L76k64j67L14j05N1r9J52m3K0%m2m4K08j90R1j60J67k77K47Q8l97L28
$$ y = [-228, 245, 109, -159, -50, -10, -51, 14, -376, 198, 362, 65, 67, 37, -224, 42, -167, -192, -203, -143, -98, -98, 3, -96, -52, -194, -8, -154, 64, 180, 58, 19, 103, 122, -73, -108, -155, -27, -237, -78, 233, -244, 243, 166, 132, -77, 48, 220, 5, -344, -184, 220, 23, -49, 105, -45, 170, 143, -322, 116, -18, 316, -209, 172, 84, 119, -31, -58, -78, -105, 26, 81, -1, -33, -63, -184, -70, 91, -48, 39, -74, -180, 4, -40, -100, -45, 78, -86, -69, -246, -99, 290, 38, -206, 119, -123, 188, -301, 108, -1, 56, 20, 19, -3, 115, 156, -110, -44, -200, -24, -78, -101, 158, 253, -290, 158, -43, 63, 273, -64, -190, 154, -128, 181, -250, 160, -470, 11, 50, -59, 93, -67, -47, -269, -4, -2, 52, -330, 196, -70, -60, -45, 111, -59, 237, 41, 93, 14, 253, 49, -24, 140, 98, -192, 36, 105, 93, 214, 307, -10, 97, -147, 229, -35, -202, 112, 7, 58, -41, 111, 68, 88, 88, 46, 2, 210, 20, 111, -49, 118, -159, 88, 176, -221, 107]
5785A07j63p7J03q8L18k82J82k70N87n10p1J95Q6q0J95j33j38j5J84o7j84M4K47
5808A70j31l30K76q9M67k17Q5l82J8J79j82M06k42k09K72k00K69j23q0J21j55
5829g7j35P5J22J6J05l24L93J6l0j27QQ0r5Q4k08Q0J62l72J85j47L45j6j02o5
5853b7N8N0j34p5L14j95k82J73n7o2J96r7j6J67j6k01K11J10j37M7p7l0j02J13
5877f9k58M11J55l91L03l37K28K81m13K5j80K18K03k15J0q1j01M14l31JJ75k22
5899a74Q1q1J94k25K83j25J15k19J70J72l24R1j08K48j17K6j20J35j93K68N4j34
5921A7j22K10m71J92J89k2%k04K08k61K11J42n5p3m3L3L8L45k47R0K1k3K2m6r2
5946E9k13L14j10n4k06L22M9J12m13k1J13K94k93m5K97j86m06L72O7j65J82P3
$$ y = [107, -56, -133, -30, -118, 200, -82, 100, -170, 417, -93, -164, 31, 117, 37, 232, 99, -39, -54, 130, 63, -121, -77, 170, 39, -291, -15, -104, 363, 146, 231, -151, -133, 46, -136, 270, 28, -181, 91, -109, 160, 37, -43, 78, -77, -212, -137, -15, 1, 106, -218, 175, 191, 161, 34, 42, 122, 27, 111, -97, -17, 145, -227, -42, -189, 156, 140, 38, -27, 31, 81, -53, -128, 186, -9, -291, -118, -175, -237, -41, -138, -154, 13, -3, -204, 7, 117, -20, 27, -50, -80, -182, -69, -327, 84, 239, -152, 151, -186, 42, 323, -90, -65, -245, -27, 176, -39, -29, -110, -211, 203, -128, -127, 48, -174, -93, -174, 20, -205, 78, -47, 68, -151, 19, 191, -133, -42, -150, 98, -19, 7, -113, 22, -171, 97, 151, 17, -105, 105, -366, -174, 15, -7, -7, -211, -3, -264, -53, 89, 34, -39, -82, -49, -11, 334, 87, 177, 198, 175, 197, 151, 59, -154, 160, 50, -4, -210, 112, 161, 273, -140, -161, -48, 246, -47, -92, 205, 19, -387, -15, 52, -113, 69, 142]
5968A42j60j19M24m12J97r4m4J05l1K87l51K39k11k0J32j74p0J72R1k39L71k31
5990Dj00j35J10L2j85J55j83K05J32k5q8N8l0K56k49j14J49m1J90j15m0%J08K1
6014A15j2Q8K9j09k62K95nl81P2Q0K06j73qO5J07J7k24J60k6J97j66J01l12J68
6038B2K93n88J79L17k55L2r4M01n59M19j46K3M8k13J17Pj53L23k34P9n2j66N9
6061a41L78j73q6M44k11q8k77l5L9Q1J52j88r4K04J17J10m10J92O3j18Ll4k8J77
6085G7k00K79jn3j75K10l61M97k4m23K42K8k53K70r7Q6q3k6L53l09j10QK83l71
6109a53K36j60J12l32K36M6j55K32k14J17J99l23J04K48j13j5p4k12L24j57O4
6130A0M8R1j94J8R1Q2M1k65J42Ok3Q2l3n7r3pQ4m7m2l2J96J81l13J88k50M5O0
$$ y = [142, -18, -137, 287, -125, 72, -22, -66, 39, 8, 295, -56, 183, -28, -48, 84, -90, -160, 12, 103, -136, 235, 4, -96, -231, -121, -89, -274, -119, -302, -97, 35, 10, -78, -20, -50, 206, -43, -157, -8, -49, 141, 26, -14, -14, 94, 115, 103, 191, 220, 111, -151, 144, 139, -242, -170, -90, 116, -57, -65, 0, 107, 124, -100, 60, 34, 231, 65, 166, -146, 22, 315, -273, -94, 223, -32, 0, -94, 307, -252, 167, 21, 44, 92, -121, -4, 3, -150, 173, -61, 18, -34, -200, -141, 237, 64, -22, 422, 211, 123, -154, -189, -150, -69, 83, -105, -199, 5, 122, 232, -178, 14, 77, -41, -38, -72, -100, 77, -123, 156, 155, 102, -73, 137, -224, 273, 249, -174, 68, 96, -157, 113, 16, 102, 19, -7, 346, 37, -73, -65, 218, -153, 83, -77, 35, -297, -61, -15, -170, 62, -152, -35, 164, -159, -55, 193, 80, 65, -9, -221, 103, -54, 10, 58, 149, -45, -27, 64, 146, 187, -78, 64, 70, 47, 129, 96, 39, -54, -61, 23, -24, -66, -98, 98, 279, -34, 154, -96, -51, 9]
6157Ij17J11q4J1N32k66n4j16K66p9k54N0o6j78R7P3K9J82Q9m5r5o6l0K55m31
6182a77J63Q4j08M7K37k70Q7j32J53k90J87K0j23J39O9J5j37j96K29J50j59K75
6204B63l36k2K76J02k94J67m4k42L81k83M8j08J72j2q5k00K25L2J66n24K34K46
6226A62k61J42m3k87N41j67l07K73j56M1O1k1J2J50l6K4k28pk4m9K46J22k2n6
6250A10L7k39j46K30J81p6j07J15k76J24K67p0j96r7K36K4Pk20J36Q0k6k6Pj58
6274h3L41J15n63M26j52J6j27L18j25k53J67j24M53k87L6l8j24J65k03n2J20J08
6296A34o5L6o7P1j69K3J2J64j37j15Q5J82l4j07J11k55K36n7J41m22J86L5J56
6319A44k5k35J18k83K72k1J2N0P4l92L86l01R6J13K5O4N1J21l75r7OJ8J21l0K9
$$ y = [9, -108, 3, -81, -70, 462, 196, 142, 26, 292, 213, -41, 9, -57, -235, -138, -65, -36, 146, 235, 190, 95, 29, -1, 254, -177, -14, 70, -38, 9, 246, -24, 63, -69, 84, -206, -19, 1, -122, 17, 86, 101, -36, -232, -3, 147, -12, 263, -73, -95, 181, 283, -11, 156, 112, -130, 251, -32, 16, -92, 80, 68, -17, -217, 8, 40, 206, -318, -84, 162, -99, 43, 0, -287, 254, 87, -220, 53, -103, -62, -1, -22, -10, 140, 104, 128, -100, -107, -131, -180, 66, 188, 166, 110, 147, -92, -238, -8, 173, 97, -10, 105, -171, -47, 220, 150, -46, -143, 93, 117, 124, -96, 40, 120, 94, 68, 75, -83, 258, 373, -190, 236, 84, 100, -27, 291, 166, -87, 80, -44, 409, 122, 158, 120, -4, 161, -42, -94, 26, 134, 69, 105, 38, 109, -60, -37, -25, 139, 2, -113, -28, 154, 120, 13, 124, -131, 105, 48, 189, -233, -47, -12, 144, 119, -116, 2, -281, -9, -30, -18, 32, 106, -286, 100, -201, -105, 8, 33, 97, 148, 269, -106, -203, -197, -179, -58, -88, -59]
6344e9K29q8k55K20j95J63nr2j06J28O7J07J3j77l5L03j35l4j88K07j18l4J84
6367A00Nr6J04o7m58M52l10J97Q3KK51m30M53m27K7L0K93l02J49k51N2L86j00
6390A43l36L05m18J49J56Q7r7o7jR2j72R9N2j84J40L7l4K13k45j8K11j94l1R3
6414b0k5j43J58RK26l15P4J58J08j14k06J09p1K47m25L65j55O1r0N3NN9n5Q4j9
6439G8N3J9j8j70l2k36Q7M27j91J88l35o3J86mk27N65k31J33l61L70l08k79L74
6462B5j5K37n01L06pj72J11n1J24q9M0j02Q2j25N3j28L41j00K66k79L2j03J36
6485H1k15n0Q4q5J6J93K86k8k31p5k09K54LK23m87J11K04k70J20J77k17j29L12
6508F8Jo7K7j8JJ69j23o7p8Ml4n3K12j60K69m69O09k45J28j87j10K73J00j52J4
$$ y = [-59, 170, 82, -173, 47, -148, 15, 10, -82, -188, -60, 7, 114, 127, -50, -85, 218, 83, 49, -139, 68, -50, -84, 100, 105, 9, 113, 46, -412, 40, -270, -73, 10, 12, 263, -167, 286, -141, -114, -84, 209, -93, 56, -195, -143, 243, 143, -193, 112, -306, -157, -1, 86, -11, -78, -79, 13, -159, -60, -8, -192, -52, -15, -49, 164, -81, -99, 112, -82, -113, -20, -45, -188, -30, -21, 205, -110, -36, 122, 230, 116, -90, 19, -52, 195, -230, 135, -20, 41, -49, 4, 9, 68, 13, 97, 78, 131, 150, 132, -38, -70, -306, -219, 208, 17, 205, -130, -193, -7, -11, -238, 327, 96, 229, -132, 238, -70, -349, 25, 10, 247, -254, 52, 45, -127, -16, -67, 57, -32, 8, -94, -12, -137, -84, -212, 129, 29, 295, 16, 48, -55, 81, -134, -184, -100, -185, -169, 24, 310, 282, 51, -24, -233, 21, 24, 247, -240, -129, 75, -195, -75, 102, -115, -244, 68, 69, 2, 29, 11, 12, 181, 58, -9, -87, -83, -117, -170, 42, -118, 151, -318, 291, 46, 174, -13, -123, 150, 250, 98, 112]
6533A12j9n7L2J40j70j55L68j79k45K60K5l07K30l3j13p5L62k83J97j84j13L24
6555A17j75J3Q7j0pJ2o6k11K24k8j8j20J70K70j60j40K83p1k53OL08k46J60k26
6579h1K6K31k60j29K10j49M44k87k52J79P1J59k52J50l59M84l6R8k21m8J15K6
6601A19l20J95J10m44K94n4m0J56J20L1l13J08R7j27K88j60k50K36j60r6P8J98
6623F6L5p4q0j45K54%j78K30j94J04j4J88l72j43K60m9J14J1j42J85j72k3K41
6646A02j78p4R5J58j96p0Q1J0K27j60k4K51m5k72J26J2M2k09N5M00k59j68N0L50
6670C04l84N1o5r8R1r3N41l26k62K04J07qp9Q2l49K08k08N26l41k31M11k02J87
6693F6p7j39M08k19o6j02L81k76K67k11j37k34N63J7k81l41L21J42p1J55q3j34
$$ y = [112, 93, 36, 68, 208, 38, -117, 251, 72, -173, 87, 112, -195, 35, 2, -111, -186, 176, -107, 90, -94, -207, 117, -58, -45, 42, 32, 25, 37, -29, -240, -16, -44, -62, -182, -12, 258, 98, -42, 241, 170, -83, -77, 231, -15, 145, -81, -55, 176, -84, -213, -3, -152, 292, 5, -247, -68, 3, 162, -90, 60, -299, 185, 149, 247, 26, -22, 93, 119, -201, -6, 104, -340, -46, -100, -140, 16, 136, 167, -146, -38, 59, -68, 220, 60, -190, 46, -114, -210, -132, 66, 101, 27, -53, -198, 56, 56, -122, 108, -86, 18, 4, 192, -180, -323, -63, -112, 2, 13, -129, 56, -116, -139, 102, -76, -150, -55, 103, -93, -163, -82, -72, 155, -5, -29, 222, 177, -95, 31, 43, 85, -124, -69, 331, 72, -96, -46, 304, -80, -29, -94, -192, -101, -194, 347, 21, -241, -37, 70, 62, -17, 65, -284, -76, -284, 242, -99, -330, 81, -121, 66, -11, -150, 258, 39, -27, -129, 252, -24, 243, 32, -105, -339, 224, 241, -40, -381, -60, 82, 11, 166, 83, -51]
6715e1K71j50J9J18l99J36J51k72p1M01j67j4l5R4M6q8O6j31J41K2nk46J79j04
6739h9l0j7Q4K60j96l21J81N72k20K11m45j37kL13j64%m35M39J17K6o7p7mJ10
6763A09j03J23k79J84J7ok9Q4J03k09p0j16L22o9J4k4j3m1J23l1k87Q5Q6P2O2
6788A07j3Q3m81J36K39l64M35j34k25L89rl25j24L79j91J93j78J10k32N5J67p3
6810e6QP7l61K12J77K40k31j13k96N23k64J19l3OJ98k89jJ72rj61j2n1L11J71
6834C37m99J41J61k23k05Q9L11k0M4m04K33j36J14k7M1kk3K18J00j75k74N36m78
6857a41K8K87k99K82l43J52j33K43J55l35J73k9K13l13J45J97p3k82L20j33k73
6878a59J7L14j02M9J5m81L30l9k8m10O69J2l22M75j09j65O6O1j55j19m9K01k7
$$ y = [-51, 220, 70, 89, 207, -192, -56, 95, -177, -248, 153, -14, -28, -63, 31, 77, -11, 55, -76, 65, 87, 82, -164, 15, -89, -119, -136, -52, 208, 12, -309, -128, 444, 224, 435, -10, -147, -149, 164, 0, 0, -435, 4, 121, 147, 80, 3, -1, 109, 6, 129, -150, 34, 51, 45, 16, 100, 203, -6, -76, -192, 130, 61, 75, 51, 38, -3, 120, 89, -198, -113, -27, 45, 107, 94, 177, -304, -168, 71, -293, 142, 8, -217, 172, 163, -162, -286, 93, -98, 95, -83, 27, -205, -150, 17, -56, -48, 29, -332, -120, 57, 297, 66, -47, -343, 180, -84, 35, 2, 8, 206, -83, -84, 88, 79, -82, -94, -145, 166, 337, -162, -21, 140, -83, -288, -199, 112, 92, 136, -268, -35, -171, -57, -84, -43, -45, -68, 150, 250, 75, -199, 337, -141, -113, 174, -125, 157, -186, -34, -167, 76, 231, -104, 69, 40, 253, -60, 85, 282, 209, -73, 247, 114, -159, -142, 172, 70, 119, 134, -347, -17, -56, -84, -494, 175, 187, -135, 340, 231, 66, 132, 193, 38, -81, -130, 71, 44]
6901D4P0j79J17r0p9J42Ko6K01k87K27m99K17L79n6k28K26j46J31j34l15L94K25
6924B96k27l5J13j22J8o5j29O4m2Q7J20l19j48M07l48N07l04L4K54k88J61J65
6946A99k02K9N4J6m28j9L41k14K38n9j26K01l0J1J79k47K25k91M2P8j63M97k13
6969A18j35j24J79Q1k01p5Q0K55l28K98j30j1J69k31K6J21j12j36M24l43l0o3
6991a68M27k56j10j1J72J6NL6m30M71R8j03j01j20K58ol37m6K76K9k49J74j06
7014h1K96j42J01k69nK71l14J03K09O4l74k9M37l33j97K20K08J7j7q8k21L45j16
7037H5N0q9R4k27O4j4J18k9K07J40m21j39K17J70k41J1R8l09K62r0k9k66M67K7
7061A56mJ09m36Q9O7R1q0j24J19L00l10J88m6%k93J80M2j80K5K25M3l21L23l74
$$ y = [44, 114, -65, 52, -38, -117, 25, 27, -39, 162, -125, 102, -397, -180, 199, 143, -85, 141, -5, 126, -8, -323, 71, 296, 69, 34, 147, 25, 43, -22, -151, -87, -129, -42, 78, -241, -389, 18, -330, 177, -127, -93, 161, -127, 34, 199, -3, 26, 80, 96, -332, -351, -10, -224, 14, -45, -171, 30, 0, 11, 190, -57, 168, -123, -81, -3, -166, 331, 118, -17, -141, 38, 119, -82, -157, -77, 178, -150, 148, 18, 7, 176, -55, -29, 92, -20, -156, 268, -75, -105, -168, 259, 3, -107, -118, 54, 70, 75, 111, -319, 152, 250, 147, 46, -74, 184, 178, -159, -205, 71, 100, -149, 25, -81, 215, 73, 174, -95, -100, 171, -143, -40, 169, 233, -141, -170, 267, -66, -263, -43, 165, 182, 165, 77, -144, 201, 85, 135, 46, 140, -87, -23, -37, 81, 52, 259, 399, -22, -161, 56, 226, -15, -4, 94, -215, 47, -43, -72, -338, 129, 156, 152, 261, -175, -86, -19, 72, -8, -132, -13, 287, -23, 165, 119, 119, -174, 6, 48, -132, -107, 118, 161, -160, 163, -211]
7085b11K01J40O0j61J40j61J06P1k87J41J44l06J88j70J84Q5qk76J32k08K93k13
7107a16K87J81m73M5R7L8j39L13l12J08K36m86K46K3O0l84L71j95j80N07j83j38
7129i4n5jJ01K12J79k60L8j46j2K54N9k12l3O3OJ24m25J60Q1K3j42P3K8Q9j88
7154g8P2M8n5m5P4k46K20J31l09l3N0K02l54K30J4J14j31K07n9j22K52O0k28J68
7178A82n4l8K9k1k83L86j42j13J48j88M46l80m2o2n5J80N3l2j25K24j05j2J75
7201A71l94J71N8l3J94k13J09J33j83N9k51J92L0J04N8m20K96k0k1J48k71j02
7223a85Q2J33K4j71k8L12k82k18M76l25L1J2J70k88J61K77p0Nrj50r1K00k10M18
7247B74k31j49K58m23J71K42j14l5K62l18P0o8o5O6l8J11j68M04j6k40R2j55J44
$$ y = [-211, -10, 130, 190, 29, 169, 8, 114, 185, -102, 39, 183, -123, 65, -105, 79, 164, 156, -120, 12, -196, 97, -116, 171, 352, -121, -76, 21, 59, -80, 233, -79, 29, 265, -221, 25, 48, 108, -276, 95, -100, -280, 227, 44, -94, -149, -150, -49, 163, 342, 82, 120, -26, -38, 216, 275, 63, 30, 93, 99, 223, -202, -42, 39, 62, -80, -7, 21, 110, -78, -6, 42, -13, -58, 16, -230, -10, 121, -188, -221, -171, 31, -323, -93, -79, 35, -96, 111, 52, -70, 182, 242, 14, 182, 128, 90, 119, 98, -185, 201, 59, -54, 94, -94, 352, -28, -70, -132, -187, -7, 46, 14, -111, 113, 8, -4, 171, -223, -52, 6, -27, 167, -46, 63, 196, 13, 72, -179, 13, 43, 147, 205, -215, 81, 61, 40, 188, -83, -185, -103, 30, 54, -117, -145, 167, -115, -333, 143, -182, -151, -139, 31, -257, -96, 181, 111, 116, 107, -43, -134, 66, -144, 274, 43, -106, 152, -271, -100, 142, 28, -7, 255, -63, 7, -61, -126, -60, -98, 13, -155, 249, 233, -7, 85, -70, 74]
7270G4O7k41J20N6j41J76l5l47rN72j35m6P1l29L77k26L9J55k46K16k01l2k62
7293c27K39P4p3K21m58M07k93J77L9j57r3J81oj35J04L23j84j22L79m44J87LM5
7316H7L1o37N19R0j78k01K45l7P2J7J10J66j94l88M81p01L56L2J03K59q6R5k34
7339Gl3J42L19m91J34K6k44R5Qk00L67l8n0k60L42l04L00j73r8J05L2j14K78l08
7363a58J72j23n3R6K3J25J43j34k8j09P5P6rk00m1K78K7m92J97N1l12M30jQ5l14
7388a96M81L0j78n82O52j64k77K51J16j22k%J84p4j77J28l62J5N10l06J46J01
7410A74l17L93k28j32J54q0j6l0L87j23j42k79K96K5l32L46J9r4q8L83o1j16m23
7433b84P0J68J52k34j6K39j23L92k28k33N6j65N92j30l84J05R7j15O5K19l79l0
$$ y = [74, 141, -100, 20, 76, -65, 111, 76, -271, -280, 292, 157, 111, 182, -147, 230, 4, 43, 198, -48, 168, -33, -65, -327, -88, -14, -87, 134, -324, 83, -210, -33, 6, -151, -244, -63, -69, -204, -100, 223, 39, -83, 296, -148, 39, 42, 87, 118, -519, 0, 90, -88, -289, -44, -81, -9, 8, 118, 284, 90, -298, 183, -518, -162, -130, -27, 232, 146, 241, 7, -26, 116, 435, -56, 78, 104, -140, -45, -37, -237, 130, 92, 42, -218, 124, -180, 120, -53, -151, -46, -14, -128, 150, -158, 14, -109, -162, -66, -43, 82, 225, 91, 63, -46, 29, 105, 96, -104, -145, 133, 160, -332, -135, -84, -396, 34, 33, 118, -196, 285, 315, 137, -445, 207, 43, -234, 17, 133, 11, 9, 9, 193, 119, -58, 70, -292, -277, 233, -73, 73, 174, -143, 250, 22, -110, 44, -36, -52, -82, 305, 182, 40, -239, 57, 82, -250, 96, 115, 21, -67, 316, 255, 139, -284, -214, -46, 106, -128, -144, 95, -28, 364, 136, -97, -41, -206, 386, 256, -128, -23, 74, -41, 24, 243, -136, -166]
7455a66K14n4M6JJ65j98l8O9k17N06l65J57j49r0j17L6K67j40L53k12j13J89k20
7478g6K78k52K27j68N9k08J38O3n1q5K36k92j13J90r2M41l08j18K60j89K41m31
7500b50L22j04j0J96l15K84L4j61k10K79j37J41j6M0K9l1k45P6K29j45O9j90N3
7523f2J20l0n7J15k6j85Q6R7L6Jk97K03N3j74L16ml23k45K79q5J86l66O34n42
7547b70M10p9JkK36m8l66K26o8l18R1K36j15P2n8J73n9P5k09JK54j27k46K12k34
7572b12K28M28k07j48J57j49k8J3l49J03J66N6n7R7Q0Rm27L39J13k48K4K95k19
7595F4j66N4J40j65n3mK47j50j33J62q7j61J01K51l3r4L0j2N3j08o8K5J41l20
7619b86M02k45Q0M09l13j77O7NJ29J47J1j59qn3K03r6k1o1K0j27J30j02Qk27M03
$$ y = [-166, 48, -6, 40, 41, 206, 8, -30, 39, -178, 328, -37, 120, -29, -119, -236, -200, 67, -73, 280, 68, -45, 144, -76, 202, -50, 177, 9, 68, -140, -2, 61, 10, -75, 161, -131, -244, -54, -146, 295, -13, -131, 129, -60, 181, -250, 72, -32, -42, 154, -161, 123, 157, -4, -214, 65, -72, 69, 53, 93, 122, 91, -154, -78, 151, 6, 75, -115, -62, 58, 28, -29, 86, 60, -125, -39, 58, 94, 95, -202, 1, 54, -120, 196, 192, -131, -376, -97, -182, 4, -362, 272, -270, 140, 61, 62, 60, 296, 248, -118, 108, 40, -278, -187, 49, -66, 6, -52, 121, 62, 137, -72, -71, 183, 56, -190, 22, -212, 16, 444, 237, 89, 246, 97, 69, 82, -267, -164, 2, 58, 1, 98, 178, 187, -240, 99, 212, -36, -12, 283, 64, -102, -48, 92, -73, -126, -130, 117, -33, -166, -4, -91, -252, -151, 100, 67, -27, 3, -9, 44, -64, -132, -107, 34, -286, 116, -129, -49, 360, 47, -130, -63, -58, 71, 218, 229, 70, 62, 9, 212, 116, 95, 34, 54, -73, 57, -45, -37, -264, 139]
7644A39o4J40j84k58L26rj91k17M74l5k56K50J07k57PM4j65R3Q9Q3o0k33J5N2
7668a10O6K09k41R5j23J18q5L06k78L60l14K4K2k01R4L1k05J90o5K14j07lJ61
7691A58j70l38M50n0j8L2k24K28m8j39J42m9K36q0j84j45Q1J9RK31l64Q5J91j7
7715C6l22J28K79m7o3N4M8K8J43k59n7J8O1l6K32k01J07k87Q5J5K41J6p3l57O2
7740a49J52j34J53p4l8r8J55J86l6K11l21N6L6j2L64l95j11J43k6j91R8o5K01
7763A05k83M2M3J09j75l5L75J59l15k65K35j85J03J60l46L21q3J26l7j04q8L51
7785B13r6l31q3N31n23K53K67j74l39l2N71m70J04j55J71j15K53J47k20j9j05
7806a52J68q6J71m3o8k58K62l2k6j64M51k05j45J52M8j07m06M51P0j30K39l55
$$ y = [139, 75, 215, 31, -227, 99, 90, -101, -318, 156, 121, -135, 115, 222, -35, -28, 16, -149, -56, 33, 116, 56, -177, -162, -110, -44, 165, -76, 19, -104, 14, -71, 235, -43, 317, 3, 27, 49, -152, -58, -27, -232, -42, -107, 107, 0, -3, 158, -12, -350, 100, 50, 32, 64, -160, 68, 20, -119, 23, -26, 210, 130, -54, -199, -118, -99, -90, 141, -223, -138, 53, 36, -286, -158, 121, 74, 11, 65, 113, 141, 284, 25, -32, -14, 47, 11, 243, 42, 149, -138, -53, -38, 203, 219, 146, -211, -149, 3, -131, 22, -52, -90, -188, -33, 153, 117, 328, 7, 63, 99, 87, 451, 56, -55, 88, 62, -129, -31, -96, 105, -178, -136, -93, 16, -159, -194, 181, 340, 25, -240, -5, -190, -87, 73, -273, 48, -35, 91, 54, -50, -138, 213, 117, -214, -297, 234, -289, -36, 231, 57, -282, -314, 257, -213, -109, -264, -93, -208, 45, 192, -28, -47, -152, 16, -70, 101, 58, -10, -268, -6, -38, -64, -228, 223, 18, -127, 25, 73, -34, -440, 11, 81, -49, 190, -165]
7828a65M15l51m4K68n4k32J07k1j8J3J22P2j98J89J48k34l56M98j26j27K61k98
7850a31J33n6m8J43l89K71rM0j20K44M1Ol48K14J7K91l02l38N52r3k27KQ4N0j58
7875a31K59k30l3J45k01Q0J47j47K35n0o4O9j75P6K04j26l54L84O8Ko7p3n4O6
7899C0j08j74K78l95M53l5j41N6N8j62J29Mj61M06m34K12j69J27j55L4j8K28j36
7922g3J39O3k34M42l37RR1p8j09L9J1K29l50J08J13l7K29n5J44m03o3P4J06o1
7946cJ30%j7k42L57q1k91j17N3K43j51P5N0J76J3j73j14O6o7P4L9m3J67j11n7
7971b4J50q3J14j17l95L67j1m6j33J64N6k59M82l41J0K31l8k22J34Lk12K27J07
7994A64l54P1o3K28j3Q9l59K52O1l6q4p8J6q8J99j76O4r7L96l43o6N13j01k07
$$ y = [-165, 250, -101, -145, 123, 69, -163, -56, -77, -95, -82, 40, 112, -86, 103, 251, 17, -339, 159, 33, -94, 167, -131, 2, -54, -102, 41, -348, -77, -86, -46, -166, 78, 119, 125, -223, -9, 8, 299, -3, -341, 211, 118, -109, -107, -23, 27, -131, 128, -102, -135, 10, -191, -111, 36, -111, 124, 74, 10, 79, -96, -20, 184, 58, -296, 88, 156, 158, 91, 18, -36, 30, -78, -252, 26, -369, 84, 49, -92, -36, 22, -140, -11, -7, -168, 238, -196, 16, -153, -26, -181, -147, -165, 63, -73, 66, 129, -105, 337, 0, 9, 100, 22, -87, -48, -37, 192, -158, -50, 63, 26, 255, 200, 344, -59, -122, -48, 58, -3, 127, 127, 110, -132, 225, 144, -147, -264, -211, 32, -119, -44, 6, 182, 195, 22, -92, -26, -93, -19, 20, -23, 144, 33, -24, 126, 43, 157, 40, -355, 12, 1, -45, -178, -14, 42, -217, 265, -76, -66, 165, 127, -95, 39, 42, -170, 57, 164, -190, -119, -182, 46, 33, 122, -237, 15, 76, 40, -44, -122, -106, -194, 5, -171, -107, -204, 192, -151, -217, 296, 195, -12]
8018a2j15j90M97l60N87l40P8P0k85K17m8k14O0J15J51j14k40M00k97J09k26O7
8040i0O3J22l32N86l42J77k95K37Jl24L10l37M9K32j31J25j96J27j31j13M17N9
8062B14k72n3J01j13P0J02j07n0r0K49o0K38l55O8K29j98j64p3K68N2P7J15l11
8085f3k72K21J55K4pR5j26K7P0j31q3jJ07L5J58l57M15m46r4J26R8J48k92J22
8109g1P3j29N7P9r2j0k3R8J3P7o6m6j49J53j19J00J58j15J17ll08L3K77j96J79
8134H7l3J83l34P2K89j99j16N8R5k40L02j78p2q3L88q9j29J99q2p9Pj28J65n8
8158B5J84j28R5j68j4J92k43O4J4m07N41k16L3L32m80J38k45L50J0O4l18M44l95
8181a28j91M10o1m6Q4n5j25J21N0k19
$$ y = [-12, -127, -317, 180, -180, 407, 67, 145, 215, -70, 147, 99, -115, -55, 60, 211, 97, -143, 257, -40, 69, -157, -90, -27, 95, -237, 349, 7, 184, -111, 126, 127, -197, 113, -224, -175, 57, -74, 51, -145, -18, -149, -262, 155, 214, -58, -111, -10, -123, -53, 49, -58, -108, -198, 51, -9, 229, -126, -58, 171, -27, -191, -264, 4, 56, 133, 248, -63, -335, -114, 41, 65, 58, 153, 27, 54, 124, -7, -90, -91, 16, 51, 209, -148, 267, -179, -273, -147, -49, 99, -193, -71, 2, -127, -70, 9, -83, -93, -116, -18, -5, 72, 6, -40, -189, -36, -155, -55, 103, -12, 105, 102, -206, -173, 104, -92, 87, 54, 237, -97, -25, 264, 65, -51, 7, 102, -138, 164, -14, -86, -169, 219, 130, 1, 200, 118, 39, 46, -82, 83, 25, 209, 81, 176, 8, -6, 186, -57, 7, 21, -386, 155, -61, -28, 304, -176, -38, -283, 67, 77, 141, -177, 267, -128, -319, 91, 30, -16, 68, 13, -112, 9, 59, -160]
8191a60
$$ Imaginary data points
##PAGE= N=2
##DATA TABLE= (X++(I..I)), XYDATA
0@%%%%%%%%%%%%%qJ6j6J6j6K2l0L2m0M8n6O4p2Q8j04J20j36J56j80K05k32K62
35A39k96L31l71M17m65N18n77O41p09P84q66R57j058J165j283J414j559J721j897
54i94K092k314K565k852L185l573M034m593N286o176P364r039J1601j6059K6044
69A6571r3457K1041R0019r4157L0571N8915j4991j5207M4667j3498j8145K1441
81C3770j771m8231J5501K2780l3598m348L5754k9111j9918K8464j912k2298J3455
94a1463O453l775N952L017j034J4148Q446j4596n820K1852k882k3036J698K97
108g43j2695P002j13j2250J0980Q930j1305M022J3867k088m407P094J816j1728
122a618L73J1151o469o385P509l167n573N228k955l652L939k691m879K600N616
$$ y = [0, 0, 0, 0, 0, 0, 0, 0, 0, 0, 0, 0, 0, 0, -8, 8, -8, 8, -8, 14, -16, 16, -24, 24, -32, 32, -40, 48, -56, 64, -72, 84, -96, 109, -123, 139, -157, 174, -197, 220, -245, 273, -304, 337, -372, 412, -454, 503, -555, 610, -673, 741, -818, 903, -994, 1098, -1216, 1349, -1503, 1682, -1891, 2143, -2450, 2836, -3340, 4024, -5015, 6586, -9473, 16571, -76886, -55845, 34174, -59983, -29412, 29503, 14512, -695, 43972, 30474, 12329, 33770, 31999, -16232, -731, 22049, -11549, -15897, 19857, -9254, -29172, -708, -2620, -24918, -11463, -5010, -8785, -2833, 184, -850, 13298, 21744, 7148, 1328, 23180, 20298, -2738, -1040, -743, -13438, -6436, -6549, -18799, -7819, 1111, -10194, -6172, 7695, 5607, 1200, 8294, 10110, -1618, -1245, 9906, 3437, -2948, 4561, 1394, -4179, 1049, -1906, -5558, -1619, -4310, -9189, -6589, -973]
137i73J580k616K370N814j150J39K663k783j837k69m187j423L6r22J235k294j003
154e620L408j07R12L941j577j624K116J65n13J082L73l9k098O0J846k430m2J340
172A193l607m58J596k130N16K579q13R40R67M42J746l56Nm42k403Q5K25j721P14
191i22q98j500K411J76n32K507m97q98J611l17m92M53j61k00o61k58Q40j324L91
210b71R84k159m84J695j237j47J781p33j06J272M74M34J75M17q0j612K10K53j665
229g99p1N10j766K83P90q7K56P75K91K81j95L75P31n91J25M1q28J01l3l22K86
250A53k41q43M45o19J43O76n71r1Q54k7M56N22J04L67p34L6n4l37m4j58q53j7
272h33J14l86M05M03j07J12P3L64L20J22J30K20q56L03L57q89P09n13k39P4k97
$$ y = [-973, 607, -2009, 361, 6175, 5025, 5164, 7827, 5044, 3207, 2938, -1249, -2672, -2636, -3558, -2323, -4617, -5620, -2212, -2319, -1407, 2534, 957, -667, 1449, 1614, 1101, 2183, 2556, 2517, 419, 479, 2325, -105, -147, 1193, -2414, -2872, -1276, -3406, -2890, -311, -1124, -184, 783, 1225, 2971, 2615, 2620, 2178, -225, -140, 85, -1636, -922, -1820, -3320, -909, -733, -1265, 1242, 745, -153, 1458, 1141, 649, 1102, 941, 741, 80, -178, 662, -662, -271, 713, -1446, -1930, -235, -1472, -1619, 162, -571, -677, 595, 1069, 1503, 1678, 2095, 2015, 403, 613, 866, -799, -870, -360, -2126, -1843, -1053, -1140, -884, -109, 182, 463, 268, 643, 1374, 783, 908, 949, 121, 222, 189, -133, 153, -88, -931, -486, -1105, -962, -286, -857, -948, -94, -121, 335, 857, 961, 1328, 594, 630, 576, 239, 195, 37, -816, -833, -719, -1105, -700, -297, -404, -292, -219, 145, 465, 587, 717, 937, 81, 384, 741, -148, 561, 48, -191, -117, -414]
293d14L9J18l48j53M3K11M06K96p5M41O2M0K9nj93l03r1kk94l42M43l94k10L30
317c66K08k38K76R5q3M22j35J72J7j42K79n4l58j59L86k88J65m08o4k04j33K1
339e91J79J30L6K82k89L85M21j39J10m24n5J91l57J4K16r8k62M0O8O2l46J44J
362b82L17Q2k31N9J69j23J78K31j99k67M11l76j52J43j19j08K86J55J3k94k83
383c90J51K45j43N05R3l99j26J42P0j41k13L10p4k42K33r1J06m4O5j57J34j20
405h6PK15j08K52j40j99M41k99j40L75l12l5J3M4j43o0L8K16r0l3J07N3j38j31
429a53N8ol7R5N8J74m02K18K41l78M55o73L53k5j03J56J6j45l8M82j74J8j54j3
453B3K85n16k9L25j14K27k08l2J42k49J2K69pQ1J31l49p2M13j69j25K21l88J33
$$ y = [-414, -375, -257, -605, -758, -715, -504, -98, 198, 123, 564, 626, 666, 695, 690, 497, 194, 103, 101, -193, -535, -92, -486, -696, -366, -158, -396, -120, -25, -108, 314, 179, 351, 368, 226, 505, 451, 93, -66, 320, 32, 197, -211, -275, -479, -612, -591, -412, -282, -246, 36, -253, 132, 553, 414, 524, 100, 45, 236, -121, -107, 109, 11, -251, -211, -143, -81, -427, -283, -282, 35, 117, -114, -55, 114, -9, 169, 400, 201, -66, 345, -31, -183, -40, -159, -267, 19, 174, 187, -107, -390, -239, 6, -137, 368, 461, 62, -64, 78, 148, 7, -206, 104, 30, -212, 21, -70, 36, -8, 57, -100, 34, -86, -79, 136, 28, 280, 140, -59, 382, 83, -57, 318, 6, -29, -16, 28, -115, -175, -137, 79, -11, -44, 63, 116, -22, -153, -95, -101, -138, -43, 15, 189, -213, 5, 246, -132, 323, -350, 3, -22, -125, 31, 47, -98, -136, 346, 172, 190, 36, 23, 308, -208, -237, 88, -26, 201, -7, -39, 103, -146, -134, 135, 128, 209, 340, -9, -81, 332, 163, 38, 259, -129, 4]
476DJ02o90P57l07J7j87J87K91J83j49j17j48J28j65K55K9k86K18J02ll03q1J63
499@j98K09k1p6j47M7J40J77qk84J46R9lj16J24nJ27j91j94J08p4O0m4K66j12
524C0l98J64K45l2K28k64p3L7L26j66J51k62J09K6j16o5n7J74J37k09N9o2J38
547A20J20o0j26k81J52J9M4J6j76K87M3k9j18j82j9K32J29k22J1L16q9m7l38J68
571c0N6j12P5M21P6n40J6q8K22j74J16j31j33K13n3k75K91K4l1R2k2q2j16k24
595d09L13L95l09j93K92m1l1J24p8K39l01j28J33j81K01m3q4r3J39L30l52L08
617B31k41J49j58J10k14J80j08O0p3N7j38K55Q7j01J62m10k1K98k58K66j61J99
639A71k22j4O0QO9l83L26l2J03j2j68K30j32o1K08Ll62mL08q8k42K32k48K30j5
$$ y = [4, 106, -584, 173, -134, -117, -304, -117, 174, 357, 208, 91, -57, 71, -94, 161, 190, -96, 122, 224, 221, -82, -163, 0, -198, 11, -10, -86, -233, -186, -46, 131, 123, -161, -15, 84, 81, -35, 89, 84, 211, 20, -174, -66, -140, -80, -124, 142, 30, -368, -204, 41, 9, 237, -27, -100, -63, 263, 97, 248, -14, 95, 121, 5, -60, -117, 57, 194, -15, 44, -18, 120, 240, 180, 54, -227, -75, -56, -12, 4, -172, 115, 158, 129, 11, -171, -190, 42, 171, -51, -40, 276, 187, 140, -198, -30, 26, -86, -11, 410, 486, -54, -38, -126, 96, -78, 38, -93, -226, -13, -66, -341, -50, -26, -57, 35, 13, -69, -185, -409, -96, 299, -10, -203, 89, 48, 17, 141, 63, 302, 1, -127, 6, -175, 26, -17, -101, -194, -55, 275, -77, 231, -10, 139, -19, 91, -123, 57, -51, 9, -64, -7, -145, 110, 197, 96, 258, -152, -173, 125, -133, 133, -28, 171, -51, -65, -5, 3, 72, -311, 15, -17, 86, 74, -94, 136, 4, -57, 151, 154, -208, -212, 96, 8, -234, -2, -250, -20, -35]
664c5K49j18jJ61l07J28J07k34j60L28N3l78J80k5J09j2j82M5K02M7l84M29j94
687Hj48n8j8J96j29O6K69j2K04k90j8j0p9M1j12K03K5R0j85j58Q8p1mJ74j99L35
713B08Ql25r1K33r6K44l00J07R1R3k86J04l6L1k5K6r6J83O6j77O5ml4l4pJ01j08
740e9J19j85pL30l95R9QK40k26J88R1l8j45K3k7K9j79J51J2k56K10J4j82L41k01
765d5j54K79j62P2l67N35m39k3L67r2N4j97K05j35K0rk0J54Nj99L48l1j46J81
789B01m57K74j52K13q9k96J52K35Jj24J79j69%j0LK2M8k62L65j44J78q3l51K29
813c7k3O5k52K04r7K90M8m73K62J23Q7m88N54k94M2O6O3J4k50J92k03l5K15j21
837d8K90l26K61m22M67l7k1o5m7k7m1p5K70j50q4P8j34J96k42P0Q3k20J36K79
$$ y = [-35, 214, 96, 95, 256, -51, 77, 184, -50, -210, 118, 171, -207, -27, -52, 57, 45, -137, -92, 110, 157, -227, 202, 8, -140, -198, -216, -20, -149, -83, 186, 174, 378, 88, 70, 60, -19, 22, -90, 113, 138, 228, 43, -115, -27, -98, -102, 72, -127, 208, 216, -109, -200, 33, -63, 181, -119, -12, 79, 172, -114, -10, -46, -15, -40, -14, -110, 73, 139, -38, 27, 23, -11, -45, -52, 49, -59, 60, -125, -132, 198, -197, -98, -90, 150, -76, 112, 203, 165, 20, 43, 16, 45, -134, 17, 29, -227, -17, -3, -185, 156, -45, -199, 80, -82, -10, -377, 158, -281, -304, 63, -29, 25, -172, 33, -102, -82, -91, -111, 43, 48, -151, 197, 166, 20, 201, -256, 18, -134, 79, -10, -306, -154, 81, 82, -42, 137, -32, -32, -42, -39, -17, 31, -231, 134, -10, 168, 85, -266, -37, -60, 5, -247, -43, -140, 150, 198, -275, -13, 110, 197, -291, 263, -31, 11, 77, 140, 154, -96, 96, -107, -142, 73, -48, 242, -84, 177, -245, 222, 185, 164, 99, 52, 25, -16, -91, 179, 29, -55, 23, -111, 85, -157, -87, -4, -224, -88, 191]
861A91k36J53r5J95j16l00L25k08j82L24J7j10R1J12l75O5J87o7L8n7J85J88l42
884a7r0k36M54N6k44RJ4J12o5j56M51l43j63K09n3n2J70J52k95L13k94j88K54
907bJ22j59K12n04N70k06J74l25n7K17j21K19k04o0J77k09K05q8k4j1K68j12r8
930a6r8r9L41m26L49j96J26k14K64k02j42N16k55K17k83J69P2k80K53k37J98j46
952h9L94j22o9k41J89J77q3k08J18r0N5L6J8J6m7j42j7J32J82j61O4pj60M0j05
977a20L06p0J46k04j42n7nk21M86J66k87J64k98J5l0n7jL12l87M16j59k51M53
1000A75J57k78j31Q0q1L40n09L05J57k68j62L65k32q0K51p4N2n4j03n8j07L01
1022D6K06Q4m18O2J60Jm32K08J75j47j59K01j0k87L37k26L05k60N8K63r4J02j53
$$ y = [191, -45, 108, 13, 208, 92, -208, 117, -91, -273, 51, 68, -42, 49, 161, -214, -149, 38, -29, 9, -48, 137, 325, -17, -107, -343, 111, 167, -77, -68, -54, 58, -7, -163, 288, -55, -218, -9, -62, -114, 56, 208, -87, 226, -68, -256, -2, 120, -39, 173, -331, 239, 33, 207, -118, -175, 42, -79, 140, -64, -124, 53, -156, 49, -39, -63, -74, 194, 82, -16, -114, -213, 128, -298, 51, -145, -19, -233, 31, -171, -313, 203, -52, 165, -118, 51, 123, -157, 96, -141, 57, -89, 305, 183, 114, -127, 62, 239, 156, -52, 66, -24, 31, 67, 85, 101, 54, -88, -105, 27, 209, 48, 112, 105, -55, -15, -120, 186, 116, 262, 58, -84, -141, -146, -367, 119, 285, -2, 162, -136, -121, -151, -208, -209, 103, -284, 132, -27, -278, 175, 332, 54, -77, 3, -78, 262, -247, 58, 215, -53, -215, 150, -82, -162, 89, 15, 67, 13, -90, -148, -255, 46, 252, 336, -82, -20, 140, 141, -291, -83, 92, -55, -214, -13, -23, -310, 27, -199, 106, -154, -96, 167, 73, 175, 22]
1045B2J09k98J53J51k84O1N8J7M7j48k31K73K80j62j40M2N8L0J18k91K38j00J93
1068A96l59M22n02P3K28M0j13K63k27k02M28m59J98l7kJ04k96Q8J98K0k42K45
1090F4K16l47j12Q1r9J47j73J48J60l64K93L4n0m6K6R9q3O9k6J57k51J1K9n9l3
1115a09L02q9o3J8j02p4P8j1J09o7J17m28M04k68M23l53K32K2k99M09j06l87L13
1138G1K4J03p9k32PJ60m8N0K39o17L41J1j63L20j48N7j35L7R6jj95N0j59J53Q5
1163B7l25L71J6k52K79j0J6o9l83K96k18K43Q1j35K01p4o4L16l87rK18k8j42q5
1187a17K81j43k4j30J14K12k85K9K21N8k96k06J97K59l06J6L81n1r7j23K71l73
1209a12R2L6J08k05j48J22O6m4P3P8J27O3k22q8k62L08j07j56K27J32j4k09K25
$$ y = [22, 131, -167, -14, 137, -147, -86, -28, -11, 36, -112, -343, -70, 210, 48, -92, -50, 8, 38, 156, -135, 103, 3, 196, -163, 259, -243, -170, 58, 98, -15, 248, 21, -181, 247, -212, -14, -51, -53, 51, -245, -157, 41, 61, -181, 64, 280, -67, -179, -98, -197, -50, -223, -75, 85, -279, 14, 48, -2, -48, -22, 77, -6, 63, 37, 194, -57, -46, -17, -76, -109, 193, 104, 41, 59, -43, -117, -39, -50, 59, -8, 109, -319, 85, -183, 240, -113, 119, 141, -158, 251, 145, -242, 71, 95, 198, 119, -113, -106, 54, 6, 56, 295, -322, 19, 30, -133, 187, 39, 96, -39, -2, 94, 93, -102, -52, -211, -58, 27, -298, 73, 89, -163, 116, 106, 122, 53, -330, -34, -252, -9, 72, -63, 138, 64, 0, 316, -71, -80, 138, 110, -32, -117, 164, 21, -3, -133, -19, 193, -92, -63, 158, 216, -80, -286, -89, 170, -136, -120, 261, 210, 113, -10, 261, -112, -20, 16, 124, -81, -229, -107, -41, -85, -12, 66, 193, 256, 34, -54, -316, -8, -115, -271, -44, 88, 74, -135, 90]
1232I0j90M6K16q0Rj15j57M7J93rPkj13J60q7K68k10k97J25Q5q5J78r6Q2J3j44
1258f6J33L0n68M82j24k54L97j48R6q7Q7o5J51p7k32K07l2N8R4l23L56O4qJ24
1282B95k36r7O7n9J84j59j68j17M73Rm00L41j81O7nrlO8j13J40l8J72l73q9L25
1307I4j06K71l61J08l68M14q8k06j3J80K49l51J1N00m88K05J4j6r8L39n24P7K66
1330A09Mk49J25K51K6Q3n17K13j79J03J47J88k91K75k43K25j93l95R8j21M10n4
1352A5RP2KJ7k10J53J96j06j81K47k58k49Q7M47j77l37J16K33k96J53n7L57R2
1375C25k60k30J61O1J46l28P5J99o8m5o5p2K21o7pJ23l43N6R3J7K19l75N8J66
1399F0k2p5j34j4J57J68k09K75r8J82j8n18J66J47J79k26L4q7nK32j24L5j14q6
$$ y = [90, -100, -54, 162, 82, 91, -24, -181, -134, 59, 50, 57, 55, -58, 102, 15, 283, 73, -224, -99, -14, -99, 79, -17, 65, 78, -66, 67, 97, -471, 11, -113, -367, 30, -118, -22, -109, -22, -87, 64, -13, -245, -38, -70, -12, 82, -241, 115, 179, 171, 295, 59, -38, 29, -30, 154, -5, -173, -290, 183, 192, -208, 133, -48, 19, 14, 5, 2, 70, -43, 97, 59, 231, -142, -231, 94, -12, 259, -102, 6, -362, 52, -36, -242, -255, -75, 174, -177, -166, 334, -154, 51, 65, 49, -49, 290, -234, -157, 109, 113, -136, -11, 240, 266, 349, -168, 45, -134, -31, 116, 304, 13, 288, 45, 270, 77, -318, -220, -341, 69, 15, 24, 96, 98, 115, -95, 58, 254, 148, -33, 214, -44, -293, -206, 241, 64, -273, -157, 76, -220, -67, -124, 233, 325, 65, -165, -4, 57, 203, -125, -50, 149, 81, 36, -29, -101, 120, 53, 46, 169, -174, -118, -25, -8, 211, -164, -106, 60, 38, -37, -171, -185, -28, 140, -69, 206, 108, 290, 272, -246, -80, 67, 246, 20, 54, -33, -38, 194, 70, 105, -9, -95]
1423i5J71j18k76L77L6k40K58NRj94j36MJ89j31lK08O5q5j42k11L38J59j98kJ01
1448H9J9M4j59j81NK82k7R8j43l8on9J74k57J74n9J82j58o9K99J5j37M3k70m8
1473a87K83p6J45j52N6J2k09K51l11K16N2O5k27L54l29R7p8L4k31M9K80J6r9j25
1497a14O3L10m8m74M16l11J50O4J07k86N9L15k33m4j24K40Q1j52J18k01k8M0j64
1520b16J78L8K53k70P3l4M8K1pJ14k82kL12j03j95J58j33O6k06K03o6J06k05Q8
1544f1K44j98j15N9J66q1m8K99n11q0L82k78K58K69k30k96J40K41k69J50O0k86
1566a85L88j89j8Q1J63k09k49j21O11n05J15j6K32k78L63j73l72N15k70K15J72
1587B70m95M19k39O0L0r9R3K26k94j7R5O4m23K85J83k11J42o9O2k23K44j72J58
$$ y = [-95, 76, -42, -318, 59, 95, -145, 113, 118, 127, -67, -203, -199, -10, -141, -144, 64, 129, 44, -98, -309, 29, 188, -10, -12, 89, 108, 152, -7, -188, -183, 99, 72, 170, 27, -11, -17, -76, 98, -159, 15, -44, 138, -20, -89, 210, 225, 88, 131, -139, -187, 96, 20, 165, 13, 69, 81, -128, 123, -188, 28, 80, 145, -82, 272, -57, 40, -38, -4, -235, -186, 94, 110, 11, -114, -51, 259, 211, -263, 153, -158, -8, 56, 163, -123, -64, 251, 18, -26, -150, 90, 171, 19, 137, -64, -92, -52, -216, -38, 0, 253, -17, 56, 22, 70, 91, 84, 198, -84, -86, 226, 123, -72, 86, -47, 19, -187, 16, -50, 56, -149, -61, 183, -15, -130, -71, 95, 14, -34, 265, -246, -326, 56, -222, 36, 305, 75, -221, -81, 160, -109, 41, 101, -185, 203, 14, -4, 77, 240, 31, -218, -339, 272, -233, -118, -134, 98, -180, 183, 10, -362, 153, -117, 98, 270, -225, 194, -45, 15, 45, -54, 39, 265, -29, -46, 49, 113, -310, -25, 158, -53, 89, 20, 82, -141, 103, -69, 89]
1610H9K53m51J84J38l33O3J73q7k5l2j1O9K01p0m4Q0j66k84L97k31K52j37j6O6
1634G8m50O46m73L54k72J17K00l50J30qk25L96l58L82m5o7j71j3J1J58j32K48
1656A56k27j78L58J74n50K24J20l0N0j38j81j8L38j97K7J75j3n4j25Q7p2j30J98
1679fK00k82J0nJ3J69N0k07O4n9J4j65J18J03J6K27n14J66K90K7k58J53l32M14
1703B06n11J76j81L43K05l19Q0L8j99J51K05k99P6O2p1M7j77J46m31L09K88k22
1725g8L14l84K15J2J11k31k18L27j5L9o3R0j63q5O3K1j08K50k00K05J13j86m4
1748a5k08j24K42J30j40J68pJ52j26P7k36j06K23J61M8l62J45k6L5j5%N0k59J08
1772h5M0J68O5j72n2q7K73J5k93r2J83j0k13J38j07L28k01Q5J48o0l0M3n5J62
$$ y = [89, 342, -109, 75, 213, -120, -57, 116, 29, 4, -28, -39, 30, 231, 161, 117, 197, 31, -253, 144, -87, 165, 28, 12, 78, -372, 274, -199, 155, -117, 0, 200, -150, -20, -28, -253, 143, -215, 167, 122, 55, -116, -129, -118, 40, -92, 156, -71, -249, 109, 283, -267, -43, 77, 47, 97, -41, -222, -240, 98, -99, -72, 103, 90, 36, -89, -2, -74, -204, -6, 194, -88, -78, -83, -70, 99, 149, -58, 6, -53, -39, -204, -86, 17, 33, 260, -254, -88, 202, 229, -29, 124, -208, 206, -305, -129, -310, 33, 238, -81, -1, 37, -162, -11, 194, -105, -29, 33, -38, 9, -168, -22, -453, -144, 144, -78, 236, -148, 67, 79, 190, -41, -259, 68, 53, 92, 29, 119, -44, -129, -66, -45, -153, 97, -103, 102, 215, 29, -15, -223, -347, -105, 25, -115, 53, 46, 198, 72, 149, -87, -193, 30, 191, 239, -123, 22, -4, 31, 16, 16, 66, -193, -85, -45, 123, 188, 16, -36, -123, 150, 165, -128, -220, -37, -47, -260, -122, -229, 99, -102, -17, 131, 71, 41, 84, 29, 191]
1796A91k72J57M6k19L46k49o5M27l56k07M83nk11J8j73j8J69q5r1K51R7j95l5
1819DJ57k67k8J26J60k08L1N9J12j43j12j6P0J60m1j16L53l00n0J42R9j73j05
1842h6K21k85K9L08J1k6j77J05j83K05j50L79n39M24j74j15J43q5J10P2j87J05
1864A05k15J77k3Lo1l77M47JJ08o5j65m6K42k6j91L1j7K09j72j59J09j88L70q0
1888A7K3J54l88K08j62j08K88N0k06J57MK66m80M9J68j98M0L93m70r2N64r9r7
1911H1k04J37J4o8J00j80J96j64r9M39k31J88m71J50k4m4J43n0R2J6r9j5J2Q3
1935BK34o5j97j13L79k27K28j63k71K69J41k98Q9q0J29k21J11N6j42M7j71L15
1957E2N4j29NJ98k30j68Q2K24j24J10j4k6j37L4J81l36L35r6K3k76M10k07L3R5
$$ y = [191, -81, 76, 122, -97, 249, 0, -65, 362, 6, -201, 282, 277, 66, 84, -89, -107, 62, -23, -114, 137, 234, 39, 4, 161, -106, -134, -8, 152, -56, -25, 34, 146, 3, -109, -125, -55, 105, 64, -52, 301, 1, -49, 93, 192, 19, -86, 135, -150, -121, 187, 198, 172, -5, 100, -83, 122, -28, 351, -188, 236, 62, -53, 90, 5, 115, 187, 0, 105, -110, 67, 44, 47, -14, -391, 56, 57, 165, 100, -65, -111, 131, 105, -86, -55, -72, 137, -35, -194, -85, -273, 97, 17, 40, 194, -194, 14, -148, -256, 32, 82, -124, 33, 37, 303, -177, -128, 40, -158, -118, 275, -195, -287, 277, 178, 81, -123, 14, 28, -40, 60, -120, 76, -88, -187, 252, 21, 209, -262, -112, -136, -180, -37, -87, 5, 21, -78, -93, -81, 2, 236, 171, -26, -139, 240, 13, 241, 78, -193, 76, 217, -81, 8, -72, 57, -164, -53, 3, -139, -92, -263, 52, 106, -23, -18, 180, -50, -218, -136, 88, -36, 74, 60, 34, -103, -69, 112, -224, 111, 15, 38, -238, 172, -35, -2, 93]
1981I3k06j49L22R3J92m27j61J1Q3l1R9J33q0o7o5nJ81j99L14m50L54k04J06R8
2005C5m7J64m19N05J73l68q9K41m7n0P5j14j44K08q5PO5r0j39K51L3o1j96o9K97
2030A36k35L57k10r5j10J97l76L91j60M37k46Q3k82K47j95J29j30O4K68j85k88
2051b03M47n07L97j93lL3k59J91pK52k41J44j89L46j62j42po3K67k47L52k02L
2074GJ88j31j68k9J75K6J63m86L33j66J74m19M53j69M2j36N1J9K33j68k4l60L86
2097fk82N00j81j34n7k4J83J91m52P3J65J30l22N7J50J80k75j64K67k90O72n84
2119b03K87o6l33J28K65l40J14J88j60J35k72M34m04J86J29j53L22m51K32k0l5
2140a7J02n4N0k37J93q6K18k24QK29j56K27o2l77K54L9r8j90K44M3j3k18l5J86
$$ y = [93, -113, -262, 60, 153, 345, -82, -243, -232, -149, -180, -81, 52, -28, -95, -160, -165, 16, -183, 131, -319, 35, -169, -63, 35, -12, 152, -267, 238, 411, 43, -46, 195, 148, 98, 173, 59, -85, 123, 38, 45, 110, 20, -119, 132, 165, 104, -92, -161, 136, -99, 258, 48, -47, -157, 40, -336, 55, -105, 332, 86, 169, -113, 134, -61, 68, -62, 2, 270, 85, -203, 244, -263, 134, -59, -62, -29, -288, -97, -104, 148, -93, 51, -138, 208, 46, -96, -103, -166, 101, -146, 206, 4, 7, 195, 64, -104, -133, 42, 68, 231, -255, 78, -88, 86, -333, 120, -49, -7, -143, -92, -73, 160, -8, -32, -392, -6, -288, 212, 31, -103, -160, -184, -1, 190, -262, -189, -24, 106, -216, -159, -9, 171, -104, -268, -1, -291, 381, -203, 84, 18, -315, -187, 78, -262, -148, 40, -120, 15, -257, 177, -227, -41, 88, -65, 257, -194, 38, 18, -17, 85, 31, 81, -156, 37, -49, 169, -55, -47, 182, 26, 253, 191, -186, 68, 107, 9, -181, 63, 106, 93, -125, -160, 26]
2164B6N6J7r9P3j07J70K8l10J35J28P0l17JJ05O6J57j66n8M9J01k21J78m5mj41
2189a08K01r7J8K4N1Q6m33J84k3J41J28rk86K50j71k92L38j98j7J95J45q2q7P9
2213C7k78Q2K07k70j40M08L2o7j56P6L3J97j12k38M48n6j14q8J22l33J12j31K31
2236BQ3m7J7l7j77K28j79j80J81J82%Q2j65p6J08l23L04r2J44j28K18j35J27K8
2260A65m01K44O5j73M0m3J61j03K58j92K56j03m26K51M5k52K43L1j07K11j6n6
2282I8n7kM09m85rJ3j87L72l61K71j58K29k78K05L52j73m32K76j33n2J02O9q5
2305a6K7l54M16Om5J12j36KP1r8k36J00o3M11L4k42l1J23j23k1P7O3n1J45j52
2330A9m64L25k08M15k28J26J1k08L76k09P7J96j50k90R3J40k6j71O7J88J4K4k70
$$ y = [26, 82, 99, 0, 73, -34, 136, 164, -146, -11, 117, 187, -130, -129, -24, 42, 199, 33, -25, 24, 125, -96, 82, 37, 33, -108, 93, -4, 14, 38, 89, 175, -258, -74, -97, 44, 172, 163, -123, 127, -44, -336, 2, -196, -213, -18, 127, 45, -42, 37, -241, -159, 48, -222, -362, 46, 78, 11, -145, -69, -36, 161, 49, -189, 259, 203, 89, 1, 123, -210, -98, -229, 2, 85, 38, 55, 18, -159, 69, -110, -290, -109, 73, 73, 155, -10, -86, 22, -301, 3, -89, 55, -73, 145, 10, 137, 165, -236, 8, 73, -100, -60, -103, 58, -45, 213, 21, 277, 174, -252, -1, 44, -208, 35, 66, -41, 170, 154, 98, 41, 39, 448, -37, -46, -33, -220, 152, -209, 62, -96, 133, -145, 60, 412, 239, -193, 83, -50, -102, 0, 69, -16, 11, -343, 73, 79, 34, 146, 10, 12, 83, -15, -251, -151, -214, 197, 231, -11, -42, 81, -42, -63, 14, 77, 26, 171, 19, -445, -120, -328, 87, -141, -15, -4, -212, 164, -45, 32, 228, 78, -212, -119, 21, -5, -176, -109, 79, 93, 117, -153]
2353a53J19K46j71j06R1n9J31k08L0j8l9J19J81o7j39K3L8j89K9j83J41L22k60
2376a22J05nJ75j44L4K8k01K99j65J13m51J50O3K47O3k40J39l34J87R6j84K09
2398F2J10q2m5jk81J84k3l5L21k27j49K80o4M8p4k06J45j34J55J17j67J25j94
2421a35K6Q1j07J90K49l48j6R2o9j88J34K41l33k6J65O6q5J10r0K61n0l09J20
2444b1P1j37K7j98K45P4R3j06j74J91l18K51Q5n7J8o0M5j51J28KK31j35r1QN8
2469G9pk45J77J0J50J65m16K71o4j96j0J37l65K33J37Lm3lJ71p3J46k77N0q5j12
2494a67n7J21L39p3j52k10RL80o5l76K14J76l76M11J42k99l27J55R8Q2J49k48
2516g4j06K61j59l3J72p1%k05Q9J12K11r0j35q3K12j25Q0N7k42Kn8K54K9J14k57
$$ y = [-153, -34, 212, 41, -65, 26, -33, 98, -110, -80, -98, -137, -18, 163, 96, -43, -20, 18, -171, -142, -325, -184, 138, -122, -17, -22, 153, 9, 43, 71, -130, 169, 4, 117, -334, -184, -121, 126, 189, -51, 88, -246, -59, 37, -147, 62, 172, 90, 45, 44, -237, -53, -76, -111, 210, -17, -166, 114, 50, 98, 24, -182, -37, -171, -16, 101, -66, 59, -135, -109, -28, -135, 55, 304, -44, -60, 32, -37, -225, -91, 150, -183, -209, -44, 22, -63, 47, -43, 218, 168, -141, -21, 50, -87, -60, -258, -13, 61, 154, 48, -126, 65, -253, -2, 83, 26, 44, -16, 29, -122, 6, 8, 239, 104, 13, 21, 79, 72, -173, 4, 14, 164, 329, -87, 184, 120, -76, -86, 51, -314, -81, 56, 59, 16, 13, 184, 111, 257, -20, 30, -55, -167, -224, -103, 236, 163, 11, -199, -190, 190, 125, -251, -37, 139, -237, 174, 316, 17, -310, -155, -57, 25, 174, -74, -180, 81, -78, -111, 61, -10, -10, -215, -126, -14, 197, 107, -28, -111, 101, -24, 56, 113, -129, -127, -185, 69, 98, 212, -45]
2541d5Q1O5k73K49j64L12k81o0R3K0k93O54j51l05j01J26J75Q1j37p1Q1k21K19
2564E4k7K14k73J15J44k36m0J89k69n1K98j2j02M7J32l08L00J13j58J10Pk1j42
2587H4k9J3Jj72K70j60M3L9k6j18K19k59O6l04J33L76l59K32p7M8J31J01m82K99
2611F9k41O7J95qk55M8K40m7J77j03j61J77j95K38j20L5j9q6r1m2J25k53R3N8
2635i9M3O7l45J34K42p2RJ03j80J02p8K42l12j8o6J63K15j66J4j77N4p5M57k80
2659b3k26M09J84l84j03Rk65L94k9J69p4l8M0j55kK82p3k7M2pq9L12j92j2k83
2684a41J43O4j15K9j75K53k51K77n6N3K4k74K13J30m06K50J01k52J29jj62J19
2706d8N5k37K80M7k31J63J04j03k01L5K18Q4l70J45ol4J62j13j73J30K0M35k07
$$ y = [-45, 36, 101, -172, 77, -87, 225, -56, -116, -23, -3, -296, 358, 207, -98, -199, -73, 102, 183, 46, -25, 56, -165, 54, 27, 241, -32, 83, 227, -9, -49, 140, -129, -180, 118, 106, 4, 51, 183, -125, 175, 288, 130, 240, 247, 226, 84, 55, 68, 69, -103, 167, 7, 50, 89, 63, -55, 164, -95, -29, -333, -200, 176, -183, 49, -28, 20, 151, 252, -230, 69, -172, -105, 90, 82, -173, -125, 115, 68, 245, 142, -19, 158, -37, 201, 81, 116, 97, 11, -80, -122, 3, -250, -157, -99, -56, 11, -334, -200, 42, -30, -21, 82, -98, 4, -74, 168, -144, -162, -228, -65, 150, -16, -2, -179, -125, -200, 257, -23, -249, 160, 344, -40, -143, -134, -399, -5, -34, 135, 61, 23, 63, -92, -94, 188, 115, 88, 130, 123, 34, 346, 154, 142, -141, 2, 66, -49, -20, -195, 58, -193, 84, 28, 81, 105, -169, 44, 174, -232, 18, 119, -133, -4, -5, -167, -48, 7, -230, 50, 97, -134, 29, 133, 30, -171, -136, 82, 166, -204, -59, -65, -99, 63, -50, -223, -93, -73, 362, 155]
2729A55j77J52j76M3m5j10J58J1J77O9j85j53j32L85o53M25l26M98j3k93K68k09
2751a31K02j00j38l0K08K92l24P5P1l16j14P2J80l1OJ91N1n1k32p2J21J55k81
2774a96M41l09M8M0J28k6k58K0J53l4q4M9o3l7O4R7O0j08r6J90j96qJ75M7k92
2799a95J31Q6LK41m23J92l06K18J21l11L42r3j56K75j03p1q5J12M5K11j60j30
2821e6K9M9k11J1m4J30P1N8k4j87j14M53j2j28O1l2j99J96mj73j26K00j6kLj04
2847a71M65n47M62j8k99j32J52o0j47J90J43j22j82K89j89K02o1kR3p9o4j08J02
2870h3M34j87k01j25K11K1r8J6J27k99J46Mj95K64L8M0j71J76n0Q2nl44L7k00
2894c62M83p6k07K06k27M9j18Q0j7M41l35p1L61k58J85j79pNL04l46j21O7J84
$$ y = [155, -22, 130, -46, -3, -48, -158, 0, 11, 188, 257, 72, -81, -213, 172, -481, -56, -382, 116, 103, -190, 78, -131, 71, -29, -167, -197, 11, 303, -21, 54, 125, -191, -305, -233, -53, -84, -78, 113, 164, 113, -119, -191, -70, 85, -196, 245, -64, -16, 24, 152, 126, -132, -112, 41, 7, -77, -28, -91, -128, -64, 33, 93, -15, -111, 79, -117, -125, 50, 97, -195, -64, 22, 25, 266, -157, 35, -271, -53, 68, -243, 99, 6, -150, 125, 22, -49, -134, -22, 23, 234, 74, -56, -27, 22, -189, -178, -222, -92, -21, 37, 13, -174, -288, 165, 153, 25, 86, 54, -145, 51, 47, -126, -252, -52, -68, -70, -67, -171, 294, -253, 209, 191, -108, -240, -88, -148, -295, -105, 38, -84, -266, 23, -166, 36, -25, -27, 66, -13, -77, -185, -83, 351, 164, -37, -162, 49, 70, -28, -12, 115, -184, -38, -34, -229, 35, 73, 113, -58, 118, 68, 150, 145, -199, -162, -362, 121, 45, -162, 44, -183, -134, -252, -172, -189, 252, -83, -154, 207, -51, 134, -45, -52, -47, 257, -89, -210, -143, 41]
2917D1l8K7m1j96l9M24k72Q3k52L04k47K98Q3l52K79k88J96%r4j1J62r9l8L6k03
2942b37l9K22J36M9j02j11J62K6j24r8k19L96%J17Q0k41J38j99p4J30J2J51j94
2965a9p3L74k73O4J06j35j70KK33J5q1Q9j20J55l20K9J97L79l27j19J83k17q5
2988a13J55j3m4J86j24j27K45l46J12K14k92J62j11N39n02j61L39J53n82K48J65
3009A03k26Q6p0J67j77j68L12R7r1k52N09k52l4k9l7L1J1J31j61R2L9k46L05K7
3033A67k37p0J48j74L84m45L66L29o62J13K61j10r0J40j73J10Ok2q9j4K04j54
3055a2n0J10J41k99k6O8J64k31M09k22K9Nl44J78n8K6k6q7L33J20k36p7J19q7
3079e3J41Qk8q0J4K14k26r2J11o5q8n3l5J04m0j9K12k15J99j23k4K51J14k71o0
$$ y = [41, 3, 30, -11, -207, -246, 178, -94, -11, -263, 41, -206, 92, 175, -177, 102, -186, 10, 10, -84, -95, 67, -32, -70, -34, -237, -276, -54, 82, 131, 29, -82, 80, 106, -18, -116, -335, 61, 61, 178, 258, 17, 155, -44, -118, 12, 24, 175, -19, -92, 282, 9, 73, 179, 44, -126, -124, 109, 124, 43, 132, 12, 167, -153, -124, 73, 452, 125, 6, 189, -28, -113, 42, 29, -15, 171, 47, -80, 165, -181, -69, 145, -147, 15, -96, 443, -59, -220, 119, 272, -310, -62, 103, -123, -37, -107, 60, -117, -285, 27, 124, 33, -219, 290, 38, 4, -25, -62, -31, -20, 111, -50, 42, 81, -165, 140, 167, -70, -140, 8, -166, 218, -227, 139, 468, -194, -81, 180, 70, -20, 120, -53, 57, 63, 41, -48, -62, 142, -12, -62, 48, 189, -110, -136, -68, 96, -135, 274, 52, 81, 86, -258, -80, -138, -112, -138, -225, 108, 228, -8, -85, 34, -53, 88, 96, 68, -12, 2, 216, -10, -102, 9, -56, -144, -197, -232, -128, -168, -187, 25, -190, 9, -114, -138, 113, 227, -44, -104]
3104a04J19k4M4R8K8k3ok02r3R3L30j87j62l3J47J4j26R0j02N1J05p3jP2j85L55
3130B25l01J20K18k60q7j1J10o9q7J71K09k40N4j2J9K4j14q2K05k70J64O7j21
3153f8L75m99K00k58J84K22j04LM3r3p6R0J22j15J51j67k9P2O8p9Q5j89K6J56
3177A20j02l39M26k66J62J7O1k4k56K06p0n3P2J5j43K99k95P6j60M6J66k7O0k50
3201b59K00l6n8L04j04P7m25M75O4l94K29J0p8N8L8l12K50k42J49k26N47M6l60
3224d7J06p2O4l34L48J12j84O2O4p0J29j35j69k1J1K70K0q6j79L29k28j46K15
3247E9j6n7j72j1K29K19k15L6j1m5K6j02P9J01m09L62l09K16K7K9np6m9J20j61
3272a35K30K38k32j66P9Oj77K15j60O1L6q3J16m6M2q8J01R1k15J11k93K60J30
$$ y = [-104, 15, -9, 35, 133, 161, 138, 132, -70, -163, -70, 260, 73, -89, -122, 25, 39, -87, 3, -99, -48, 57, -16, -17, 55, -130, 225, -76, 44, 262, 2, -85, -96, 14, -55, -142, 29, 238, -2, 52, 40, 59, 83, -31, -113, 92, -178, -14, 53, -68, 307, -192, 8, -250, -66, 156, 52, 55, 98, 5, -71, 19, 141, 26, 177, 10, -19, 53, 121, 42, 127, -62, -36, 120, 18, -321, 105, -161, 1, 18, 79, 55, -201, 5, -65, -118, -46, -31, -174, 125, -170, -94, -254, -208, -42, -69, -9, -259, -59, -95, -153, 151, 47, 124, -301, 174, 238, -156, 73, 83, 5, 63, 101, -211, 39, -203, -54, -280, 267, 313, -47, 59, -13, 51, -283, 65, 177, -7, 55, 119, 49, 178, 43, -126, -147, -136, 134, 154, 68, -111, 218, -10, -156, 59, 43, -14, -186, -197, 32, 251, 36, 72, 61, 16, 42, -60, 19, 120, -289, 73, -236, -20, 7, 36, 31, -45, -94, 26, -135, 95, 333, 101, -65, 14, 20, -157, 58, -102, -41, -5, -88, 28, -18, 24, -64, 37, 128, -87, 24, -269, -9, 121]
3295A21k57K01L3j7k57N49n53J71K4j55M1K65j99k7j46m0L53l77M99k03q1j91
3317b46K22J13j42j02J46k86K04j20J11R3j3j78P2K81q4n8oJJ01q1o6K60k09P5
3341H8J07k84J26k8p4MK44j38K1j4J67l99J68J06j25K98m22K2mK71K6j73m3K78
3365B22L5l33J3R5k87J07J31j73K28J56j44j26n3J25n3k23L53J9q5l1j64N50l54
3388HR9J21m09J69O5l00K85N0L88n29J00j20K81kj87J16k5oj55K69l36Q0j12M46
3412B96k10j20P6J49k27O3J10l8k76J97K8R7Q2m40J83QJ69l63L39j41j43J40N0
3435B9O9N3k48K17k17K09o7N8k02M5J70q2m3o5j73J73R7j10r9L4L2K23M8m07K15
3460d1k17L92J7j61J07k10K23l2k02K11k1r4J32J95m53K55k88K22k86l2L31k49
$$ y = [121, -136, 65, 98, 81, -176, 373, -180, -9, 15, -140, -99, 166, -33, -60, -206, -246, 107, -270, 229, 26, -55, -246, -24, 89, -53, -155, -9, -295, -91, -211, -100, -7, -20, -198, -126, 155, 71, 13, 7, 8, 109, 28, -38, 222, 13, 88, 195, -89, 37, 9, -65, -61, 183, 45, 66, 52, 219, -180, -12, 94, -31, 267, -155, -133, -137, 134, 160, -13, -56, 222, 257, -76, -63, 32, -255, -148, -17, -190, 38, 194, 50, -76, -129, -4, -57, -280, 73, 92, 7, -24, -188, 362, 8, 107, 228, -181, -12, 53, -247, 38, 88, 476, -53, 47, -73, 208, 206, 19, 135, 110, 104, -51, 218, -118, -38, -150, 296, 86, -34, 42, 191, -36, 27, 137, 99, -177, 20, 48, 145, 227, -213, -30, -22, 147, -216, 123, -18, -161, -21, 29, 98, 151, -97, 120, -97, 112, 45, 103, -99, -54, 116, 34, -9, -74, -247, -74, 23, -87, -186, -152, -120, 103, 151, -256, -41, -258, 134, 151, -10, 97, -113, 110, 78, -124, 87, 66, -28, 104, 299, -154, 101, -187, 35, -251, -283, 48, -201]
3482b01L58k68K52j10l3l9J7j17k6K13l30L39k7O9j03J30j53j3K07l18L44N1n7
3505A85Q3l61K43j96N4nK3J60l25O8M32m09l8J95j92j98M86k79J71j4k43J76j80
3528a64O12m60K58k04Q4J71l25j00l0J96L8k28R5J02ql5j04Q5j06K80l1J44m62
3551a92J95j9RP4k06J67k78K72M7l47M03k66K12N4k49J98J10j59Nm1j88J71n8
3574h6P9N9J16l2j75j18L96m69L31l76K57K01k90q9p8J50K7j81K35k32J83M89
3596C97m57p0N6J0J58j53J51L93n04l7P5n1J63l06K50j79J07L66j60nq1k2j20
3619a9J06j84K26j77L7R4k53L49j85j42R7j26J82J8k17K70J08j95j82M53l48K39
3641A51j07k11j3J74L22j89k90J91J66k42n2J57k00L67j97l4j61J11J15j55J40
$$ y = [-201, 157, -111, 141, 31, -2, -41, -24, -141, -167, 46, -284, 55, 28, 97, -6, 124, -29, -42, 165, -153, 191, 242, 185, 268, -93, 150, -46, 8, 3, 26, 186, -139, -71, 361, -48, -86, 109, -83, -281, 205, -74, 97, 83, -160, 16, -164, 448, -12, 246, 42, 126, 297, -28, -128, -158, 38, 76, -152, -57, 45, 37, 2, -102, -17, -123, 157, 126, 270, -192, 3, -16, -7, 67, -139, 28, -250, 22, 69, -278, 125, -141, 71, 125, -124, 74, 184, 25, 30, -11, -199, -28, -86, -7, 52, 168, 136, -39, -157, 239, -230, 101, -275, -18, 183, -107, -196, -274, -124, -97, -278, -43, -275, -92, 397, -60, -130, -74, -64, 94, -59, 92, 485, -19, -56, 19, -32, 131, -175, 75, -104, 3, 369, 209, 204, 123, 101, -19, 87, -97, 129, -48, -11, 83, -170, 179, -6, -148, -51, -177, 5, 23, -194, 76, 184, -11, -193, 260, -88, 151, 44, -167, -180, -6, 316, 127, -163, 28, 194, -48, -100, 57, -143, 224, 27, -7, -168, -57, 58, -97, 43]
3662D3p2j05j12K37j22L23j65J4P6k8j65M2Lr5J97j06k6J60k16J92j12k12L56
3685A07k31k83N35R6k96J48k05K24l61J10J10R0J21P6j78q0p7L12l5%R5r7N5l16
3709h0j41L71j07q2M97l36k71Q3j09J52J21j08M9k8m6J02O6j09k44J21J0j23J10
3732a02L6q6K46J08k65R2k34J14m9K15q5P4k70K40k02L40J42k44j13Q0Q7k37K87
3755A74k04m7j87K60L2o8p0k16L97K6k78Q9J55j74K3J0J07M9J82n36M38j94K29
3778A97k40nj95O9K00m87O07p1j59L5J97k8l07K23M2l00l8K99j1L8n3K3k31mJ01
3803i8J94m7p5mj9K97k44o4kK1O7J49m91M22o7k6j14K23q4k28Q3K06n5O9K07l96
3829g6K10k59L7M21m29L15m22K8K27k31N21m91q8K59l00J89J49q8k87L01k51L2
$$ y = [43, -29, -134, -246, -9, -131, 192, 27, 41, 117, 89, -76, -34, -31, -126, 71, -35, -61, 99, -117, 75, -37, -249, 107, -124, -407, 128, 224, -72, 76, -129, 95, -266, -156, -46, 44, 165, 241, 63, -17, -94, 218, 183, 183, 278, 181, 236, -80, -221, 150, 43, -39, 458, 122, -149, -66, -175, -23, 98, -10, 39, 11, -35, 67, 133, 24, -220, -99, -89, -212, -102, -66, -152, 94, 202, -63, 29, -205, -91, -140, 75, -10, 64, -206, 34, -168, 172, 314, 70, -43, 37, 124, -113, 174, -30, -77, -264, -4, 28, -40, -110, -326, 71, 97, -181, -92, 63, -111, -88, -78, 29, 78, 260, -276, 162, -32, 197, -43, -48, -243, -174, 26, -461, 146, 75, -84, -49, 148, 120, -187, 36, 78, -222, -260, 39, 28, 66, 13, 36, -195, -199, -98, 96, 49, -26, -30, -49, 248, 4, -60, -62, -41, 26, 175, -316, 106, 39, 13, -101, 122, 38, -190, -107, 99, 44, 113, 320, -76, 134, -125, -88, 333, -96, 219, -203, -175, 52, -179, 342, -149, -237, 22, -278, -89, 60, -28, -315, -14, -265, -233]
3851b33K84o2r5k7J46JK2o2j38J81k27J60K95k96K6l40M71j04j97j4J61k4o3J69
3875C4m7K30k54K6L0r5R9j16M9r1J26R3k49p6m6J35O3Q9l01M29o0jq2j44L39l01
3901a21Q1L81k94J01m95L02rq1K15K9J35k85N1J47n0l37nL36k21R0J17k55Q5K0
3925f3P5j28j13L75l36K42J5k82L84r9o8K1K4j20j69L27P6l89k2M46l72m1p7M03
3949A09j52j91K94J69k40K4j30Q0o8N1J31l09J94R0j12j19p2LK93j84J37M4P3
3972A15m8p9j24K72j54Q8l31N62k60j51j42J85J99k77L6M18m67j38J75J76Mk17
3994a58J06K84q2j35k14M10p9J69l84K8J95PQ3L69n68j79k7J18N6j19L94k91L0
4017A3n1J12k6K2P6k51O3J61j1J3k42L15j10k35M88m50j40N34j44k40L2j8J94
$$ y = [-233, 51, -11, -106, -133, 13, 14, 36, -26, -164, 17, -210, -50, 245, -51, -25, -365, 106, 2, -195, -209, -48, -72, -135, 34, -13, 217, -37, -11, 19, -76, 23, -93, -44, -135, -9, 84, -165, -241, -287, -152, -89, 0, -301, 128, 68, 67, -15, -159, 180, -121, -40, 341, 47, 148, -347, -45, -54, -135, 80, 109, 244, -41, 10, 157, 107, -230, -235, 101, -120, -30, 87, -168, -83, -63, 12, -116, -229, 146, -190, 52, 67, -215, 169, 70, 2, 23, 47, -73, -242, 85, 161, -228, -250, 196, -176, -217, -294, 109, -43, -234, 60, 229, -11, 13, -117, -37, -105, -54, 77, -232, -38, 52, -60, -179, -251, -248, 45, -139, -2, 42, 115, 67, -12, -136, 136, -18, 70, -261, 301, 41, -110, -252, -67, 132, -145, -109, 309, -158, -296, -121, 55, 59, -158, -52, 232, 150, 15, -199, 211, 132, 301, -83, -55, 140, 147, 230, 599, 31, -148, -175, -57, -1, -120, 274, -17, 13, -38, 74, 48, 70, 146, -105, -42, 119, 108, 121, -121, 194, 84, -151, 337, -113, -253, 281, 137, -103, -71, -89, 105]
4040A05k21k7Q0R9k54l6K60k0O8Ok43K86k53J25J76r2j02j49K66m09L75Q6k42
4063a16k6R1L3r3l9K65j80J90j20l3r2j09K81N5j55J89l06L24j63k12K56J02j52
4086a0k94J14K45k32K63k43J54q2k21J48K53k04m2K54k27J78p6n9K79L9j08j82
4108e3M6p4m5j56K10k05J24J39r8J03K16j89k34M56k94k28J25K54j72J42j8L28
4130C77k96k4J36k39J44l91N00k82K5n8J46m4R9r5O4l1k07J06J43k17J10O6n7
4153b5J20j98K50k2j90j4%J77j29j68L52j77q1K51q3J98m21O0J62k2rL5k14K71
4177A23k58K83r3k70K28oj23J03R5m5k25K64q9m8O3j8kl4k32N24m71L49k21J67
4201F4PK18q0k69K65k15K46j45K1J98k46o7J62k44K67n4k00K56l29P0j54J93K91
$$ y = [105, -116, -143, -63, 36, -218, -254, 6, -14, 54, 60, -183, 103, -150, -25, 151, 59, -43, -192, 74, -335, 40, 126, -116, -142, -51, -18, -111, -150, 115, -65, 125, 5, -28, -120, -229, 52, 107, -48, 141, -165, 159, -4, -216, 40, 142, -10, -304, -190, 55, -177, 86, -157, -3, -85, -306, -158, 95, -109, -151, 103, -124, 54, -22, -81, 198, 237, 129, -53, -7, -81, -126, -282, -72, -277, -153, -14, -112, -9, 207, 18, -216, 240, -54, -282, -157, 97, -75, 67, 49, 377, 81, 57, 193, -46, 98, -293, 207, -75, -50, -108, 38, -6, 93, -2, 62, 31, -176, -70, 73, -144, -34, 32, -25, 95, -103, 147, 125, -65, -79, -79, 98, -31, -199, 153, -24, -105, 146, 63, 261, -160, -100, 62, 40, 31, 66, -148, 123, -135, 148, 55, -215, 13, 7, -116, -13, 82, 37, -188, 76, -13, -61, 2, -16, -18, -52, -284, 240, -231, 118, -103, 64, 71, 289, 209, -60, 205, -10, 236, 91, 112, 310, 64, -3, 159, -85, 182, 128, -72, 184, -145, -75, -229, -36, 255]
4224B55n43L01j33K35l02J02J16K98j02j61k8J33j18O5k79M9j9K9j12J2o8L94
4246A24m73L35l07M56k32qO4K97k73J61r0J06J64l53J52j77J55l44l4J41J93Q3
4268A40j70k16L54j35J31r2j68Q3K8K2Mn7J56Q9j88m8J57k0o0J64k46K63j03j82
4292i4j8M4M3J61j17k51J67j1J36k46L33L6j98K98l16J56j53N1Q5J25k66K04j07
4315F2m8k11J47K80k07K3N5Q0j33k64J54N5R5m31K70M3j36M7M95l97R9k38J84
4338B4j42L44j22m52N88l05J13J07J8k84J88q9l3J01k40Q8J64l1p7j1N4j04j82
4361b83M23k45J0O4J74Oj56j61l6J76r8K3K77j27n6K7J27j49MJ55p2k50J63pJ37
4386A26n8j40J06k2k07L5J48poM7L3j02k5J41j55J12L05k88L75n76m6K28l06O6
$$ y = [255, -288, 13, -120, 115, -187, -85, 31, 329, 227, 66, 38, 171, 53, 118, -161, -112, -131, -102, -214, -202, -270, 124, -349, -14, -321, 135, -97, -105, -41, 256, -17, 144, 54, 160, 324, -29, 123, -54, 101, -243, -277, -136, 57, 140, -30, -246, 108, -27, 104, 12, -156, -73, -45, -23, -19, -76, 80, 169, -19, -67, 90, 70, 10, 174, -72, 191, 88, -94, -112, -68, -25, 136, 19, -232, -65, -76, 60, -186, 147, 183, -15, 283, -33, 123, -30, 21, 106, 231, -35, 169, 62, 14, -197, -50, 230, 23, 46, 101, 181, 48, -216, -62, -7, 88, -343, -73, -30, -166, -119, 376, -21, 78, -160, 24, -118, 226, 104, -348, 240, -65, 48, 155, 173, -111, 77, -12, -45, 56, -184, -96, 68, 37, -40, -51, 3, -101, -283, 140, -105, -95, -31, 143, 149, -7, -168, -204, -28, -126, -103, 174, 47, -9, 18, 145, -4, 0, 155, 83, -167, -4, -11, 126, 68, -72, 34, 12, -195, -160, -12, -19, -25, 22, 55, -47, -72, 69, -86, 26, 331, 43, 418, -158, -204, 24, -282, -216]
4410b16K44J20j11J0k47J74Lk96L97l13J71J16J75l26j54J76L49J73n75J05N8
4431C3K11j94J04k31M04n09J93l65J56J7K76o3MK0k76L44k00k09L64R2l94J18
4453a05J0Q4r4J99k63J69r0Q5p4m1K55j79j00J20kL8R6j03J31j90R2R5k68J56
4477B1j68J74k61K63Jk18k18K43K45M4k48l1K5J90k20K91O6m75K78q1K69k88L92
4500B94%j65l61L73j2k17oL61k52l1P1N8j91J17m0K59k60nj02J64k70K39N6j0
4524G0j67L79l89L19lk47J67j26K16j03m1k88K00Jk42J19J70L4k78K83n1k12L11
4547A22k45j03K43m3J31j98l8L21p5J02o2k54J85j06j12J11K18k39J93k26J52
4568G7P5k45L24n73M37L95l61l0j32n2j94K13k84L06R5j39k45M79o8K40j98J89
$$ y = [-216, 28, 148, 37, 47, -200, -26, -23, -319, 78, -235, -64, 52, 227, -99, -253, -77, 272, 445, -130, -25, 33, 244, 50, 154, -77, 327, -182, 11, -354, -198, -181, 95, 32, 36, 56, -220, 124, -76, -285, 79, 171, -223, -105, -95, -11, -105, 94, -169, 0, -90, -5, -79, -120, 135, -44, -144, -24, -26, 12, 108, 5, 136, -54, 38, 133, -135, 21, -147, 27, -234, 29, 30, -188, -406, -163, 82, 126, -122, -153, -128, 62, -158, 133, 199, -276, 2, -79, 190, -98, 294, 294, 129, -232, 141, 129, -88, -94, 267, 15, -16, 55, 113, -78, 39, -1, 258, -2, -7, -109, 55, -215, 24, 80, 70, -97, 282, -107, 212, 209, -38, 129, 3, 219, 116, 75, -213, -13, -12, -254, -135, 35, 69, -209, 74, 23, -189, 122, -123, -226, 17, -26, 105, -93, -131, 190, 115, 217, 155, -99, 86, -20, -132, -21, 197, -42, 151, -75, 77, 152, -93, 231, -342, 95, 490, 129, 99, -33, -85, -279, -66, -350, -44, 51, -88, -333, 146, 78, 318, 120, 309]
4590C09k51k23L44k63K02n3j53K72j81l0k92L22K0k08Q6L12j79j56m8K49o8j13
4612a02J46P2r0J36j22J6j78o5L93k71j0J30L5p9K18k44l4J5l6k9O6R2l25L83
4636A17O1k58J06j06K92k35J64l7j14J85k06L18k22j11r1O7J10j33J02p5L04m63
4658b25j30M26j56M37m15k75O0Q2K73J03j17j15P1j15pm5L01J3n1k43J57j7o9
4681e7J60j33rk1jl50L99o7J93j61J90r1J74l38J53K63k57j6l39L70j01M6R9k58
4705a52K50k42K35j87qJ52J6J53k59K65l49l8K45J73j82N2jj95M0j22J53j3j11
4728a25j14K21k1J51q9K04j86K10p36M83p0l26L47j56J29K31j77j73L59j08R1
4749A45k47L06j62NR0j71N1K59k11j7J6J21j95J75j59k39J06L35n8k03QL74l53
$$ y = [309, 58, -165, 179, -84, 118, 65, -88, 184, 3, -27, -319, 3, 23, -185, -99, 213, 34, -122, -170, 79, 11, -102, 44, 116, 26, 162, 40, 56, -122, -187, 206, -65, -75, 55, 90, 11, 229, -15, -49, -34, -70, -99, -33, 59, -266, 117, 178, -80, 26, -80, 212, -23, 141, 104, -10, 175, -31, 287, 65, -46, -137, -70, 40, -93, 9, -66, 238, -225, -355, 71, -85, 352, -63, -338, -278, -196, 77, 180, 63, -52, 19, -96, -103, -148, 153, 166, 115, -128, 29, 12, -57, 103, -30, -39, -60, -61, -411, -12, -79, 114, -47, 143, 52, 226, -112, 41, 304, 47, 31, -308, 62, -39, 7, 106, -152, 98, -144, 91, -96, -104, 48, 64, 217, -42, 223, -126, -164, 81, 254, 72, 124, 123, -72, -32, -154, -1, -14, -125, -239, -18, -39, 112, 23, 227, 41, 251, -485, -2, -72, -398, -51, -207, -78, 153, -24, -197, 162, 54, 145, -102, 204, 42, 47, 137, -34, 17, 276, 65, 48, 64, 185, -10, 165, 6, -233, -127, 208, 150, -53, -45, 329, -24]
4772b4j3R6J3p2j1k7r5j56L43k46M79j99k93L61j19p4K41l35m7L93j34k43J12
4795e0R5O5n4r7p1K34l2j95j21K29m2j36P2J88j89NJ7p7M97k40J40j69k1j50p4
4820a76M6l1J08R7m0Nk05K93k77M18k22j13q8K95L2q4j89Q0R9j84j5J24j21rK13
4845E6j8j6p0p4n7j6J39J03k52M3K0J56k29L25l12N0J91r2KM0K62J0k08k00n3
4870b00r8L69J89l02m0l8Pj25Q8K60j79J98j72M9K79j83o4L0k1k63Q0K96r2J52
4894B20l25p4Q5N7K33j37j4qj62R1j23K40Q1R8k07p5n0J19j62K11j39k95K49J38
4918E1P5l73L62l13L25p7K6l8O0mP3k26K83Q1m20J36n9J74j37J02k48L87j32O1
4942A69o0o9K8j97K42k44J9L4J57j32l1J59r8p2R8k18N2M25k38n2o1J40J89j99
$$ y = [-24, -37, 59, 72, 0, -11, -38, -133, -289, 54, -192, 287, 88, -205, 156, 37, -37, 204, -131, -178, 215, 81, -162, -50, 45, 110, 56, -41, -112, 122, 90, -105, -226, 3, -39, -175, -103, 85, -104, -99, -82, -159, 338, 98, 238, 69, 48, -102, -176, -130, -161, -53, 44, 4, 9, -196, 97, -180, 238, 16, -97, -185, 110, 142, 58, -131, -51, 48, -136, -151, -27, -148, -157, 56, 38, 22, -48, -122, -179, -195, -56, 47, -205, -162, -142, 14, -215, 110, -202, -152, 39, -53, -51, -11, 251, 261, 53, -147, -200, -298, 71, 260, -42, -82, -120, -113, -238, -150, 110, -69, 129, -43, 6, 285, 102, 38, 68, 47, -216, -136, 160, 68, 220, -105, -179, -94, -37, 196, 59, 45, 37, -125, -34, -157, 83, 164, 262, 55, -20, -70, 49, -113, 98, -41, -336, -87, 51, 126, -247, 115, -198, 127, 50, 76, 38, 98, 94, 167, -59, 224, 305, -115, 21, -38, 136, -1, 101, -147, 240, 108, 169, 109, 40, 68, -129, 113, -131, -112, -78, 79, -53, -84, 75, -23, -95, 3, -215, -163, 262, 24, -28, -89, 51, 240, 41]
4966D1Q7m15J41J38j32K71j96J62m0N2l6l00K03J09l7M6l15L67j15j81m3p1K59
4989ej66J87l2k27M68k99J7L24j97p5l17K6M29j00j93K17J22k31K17mJ03k57L2
5012C9j08J61o0j11K78j17O5j60k00N44k19j66M9J37k18K03J14o4k28K79k92J16
5034D2j80mJ79Mn6j56J02RL85l29J41K3k06p6J26K47l20Kj41J81j21J73k21M7
5058a49K18K29J22l91r9L3K08l9m4k03lK7J05J97k59L5o7k0j18K44j28J69k96
5081b29L26J8J03j16J63l95M7J47N6o4Q6l48J01J25k2n0m8P2j50N21l39K21n02
5104b77P40m53N4k77L08r5O4k5Q0k36J87j02l2J84j51m0K91n0j84j3k9p6P7J14
5128E9j07J86j57L04j86ok20J62j5l0o6P9l4j56J0L35k20J42q7L28l37o6k1J2
$$ y = [41, 128, -287, -146, -8, -140, 131, -65, 97, 57, 109, 73, -227, -24, 85, 48, 94, -221, 146, 31, -150, -193, -264, -5, -171, 16, -16, -243, 225, -74, -57, 267, 70, -5, -322, -296, 133, 33, -160, 57, 179, -52, 165, 161, 264, 7, 39, -69, 92, 32, -79, 199, 82, 147, -13, -213, 331, 112, -54, -5, 132, -86, 117, 231, 167, -61, 218, -74, 42, -138, -142, 37, 41, -15, -171, -69, -60, 325, -4, 137, 160, -46, -122, 4, 251, -69, -67, -208, -27, -148, 25, -196, -149, 69, 298, 420, 29, -70, -37, 171, 132, 88, -115, -118, -91, 14, 211, -48, -13, -80, -100, -218, 26, -102, 67, -229, 97, 115, 218, 102, 265, -130, -83, 64, 120, 56, 142, -206, -105, 20, -2, -52, -100, -28, -178, 343, 4, 225, -277, 463, 10, 64, -213, 95, 0, 64, 39, 119, -117, 70, -32, -64, 120, -31, -71, 220, 170, -14, -27, -56, -132, -55, 59, -48, 138, -19, 285, 99, 93, -127, 35, 20, -10, -76, 3, -31, -187, -177, 158, -62, 80, -7, 321, -16, -82, -103, -91]
5152i1J29J1P2k15R7j78L15L5j62q5p0N2l0Q0J52k3k34J67j80L5L9p1J67m5k45
5177b78N8K89J47q4k1k54J10q5j13J64K66j22K3j36rM1O3j68J38p7k14J75Q0J03
5201I6m5R4l47L17k58L02l73L26l66K48Lj73J58k70L77J0Q6k41K12k07lN36n21
5224c9Q8N0m3K28j24o8J20n35L58j79J65j70q4K33K41j56J33m0k15j45J66kj04
5247a22j7J68J53k77j58L79R5m73L55N6k94k28K40j2K22o2n4n2J7k99L68k3K11
5270A93k19j3J62k13M3m5P9l9k46L13Mr4l7O6n1J73k10K18j21j34K67k6J37j86
5294B1M2J35l40j22N22k55j47J47J83l22J89O9j29Q3m7j01L23k35n4K35l2J42
5316C07l45n9J1j9N1n5K1Q5K32r0l21M6P4J23j5O9k00R9m5M1j30O2K92j51l13
$$ y = [-91, 38, 49, 121, -94, 3, -175, 140, 175, 13, -72, -142, -90, -120, -40, 112, 89, -145, 22, -158, -123, -84, -155, 12, -33, -278, -220, 69, 216, 132, 111, -143, -33, -118, -231, -67, 199, 77, 100, -36, -45, -4, 59, -109, 29, -48, -262, -87, -7, 96, 51, 145, -202, 115, -143, 159, -214, 112, -254, -6, -3, -176, -18, -288, 89, 99, 185, -56, 156, -51, -54, 482, -39, 49, 99, 56, 284, 160, 92, 212, -323, 35, -144, 21, -149, -233, 0, 241, 85, 218, 178, -37, -182, -16, -18, -122, -139, 29, 182, -95, -253, 126, 221, -252, 103, 159, -135, -363, -123, -135, 87, 25, -29, -81, -64, -363, 5, -18, 193, -26, -39, 123, -90, -47, -92, -13, -52, -298, 15, 19, -75, -112, -46, -97, 76, -134, 84, -37, -171, 96, 70, 207, 21, 63, 198, -142, -264, 258, 3, -144, 3, 186, -136, 53, 122, -7, 76, 29, -72, 251, 16, -38, 197, 165, 307, -38, -97, -86, -105, -54, -109, -88, -3, 229, 139, -182, -136, -62, 61, 46, 115, -85, 14, -31, 10, -120, -58, 234, 83, -230]
5341b30M38k00P6K9o3p4K7J35j27J79k38J15m8J26K37m87J13l05L45l4r9P7J05
5364I7j32K15l17k04J59K30j26K12l77M06J41l33k24M53j65l3Q1k22k23M45r6
5385a3J30o8j58K60k99M90m58K80p5k61K11j91J07j20K63oo0Q3l13Q1j10N02j94
5408H1n9j61K3J25P5P2l91L83j3J80j72k64Q2L9J43j06L52n04L5K84k51l14L91
5431C0n4o1Q0j62m2J54j1p3K36oj78O5r9Q5J76q4j49J86l12K68j04O0K45M4m84
5456a90L54n6j50k06L69o1K7L6k69j2J32L24k40j69K69j29Q1o1p2K0k23K43j34
5479a17j27K13L2M5o3M6j38J88j50o7K53p1N0n5j30k20L50J07l11K2J0J1J27L6
5503D1r1L7p7k3J52l2J09qL9K7j30j29J74q0J3K02j94K2k86K30j4k1J04ql4J29
$$ y = [-230, 208, 8, 84, 113, 50, -24, 3, 138, 11, 190, -48, 67, 19, 145, 382, -105, 8, -297, 48, 14, -85, -8, 97, -35, 180, -137, -341, -182, 48, -78, 134, -243, 163, 304, -29, -253, 200, 35, 2, 83, -139, -362, 83, -13, 117, 49, -109, 151, -148, 342, -116, 164, 89, -172, 39, -152, -45, -165, 98, 92, 32, 115, -198, -117, -227, 275, 81, 22, -139, -116, 9, 84, 156, -235, 148, 135, 315, 143, -121, -39, 0, 143, 37, 389, -115, -80, 204, -47, -361, 30, -24, -85, -5, -167, -209, -55, -66, -139, 97, 91, -87, -22, -121, -36, 140, 56, -93, 93, -219, 49, -55, 5, 250, 294, -190, 164, 108, -42, -248, 121, 60, 87, 123, -146, -158, -26, 298, 58, -111, 158, 29, 110, 49, -23, -3, -226, 17, -117, -244, -31, 1, 46, -17, 29, -109, 79, -71, -138, 115, 44, 94, 39, -91, -311, 39, 146, -165, -143, -133, -122, 5, 41, -50, -13, -90, -113, 39, 7, 116, 108, 147, 174, 44, -85, 89, 9, 22, 224, 30, 52, -234, -4, -18, -39, 65, 57, 23, 152]
5529A52j25J60m92N6L61j24k5M7O0q0P1j58Rm5J19J9L9j64l8J07Q5P9k10Q0N3
5554C6o2j6J30k36J93m6J0J68l29K96k13Kq8K07j74J77J2l5q8p2K34j55o4j56
5578b69K19L63m83J85l53J29K06J14l5r5O1k22K22m8nj09K45k1L9n69M30J82j66
5601B0k73P7M32l84L77j67n0J7N0l30J49K05k34J35l0j37J17QJ5M0N9l26K34m7
5625d3jK06k11P1o8Q7j01J25q6K69k58jk55K57J95l40k0J44Q5J1o2Q8k67L97k73
5650e1L1K87P4k74j94RM1K82l11J53j1j30J70Q8j07J27j29j08rK47j65K02j22
5673A00R0m10K61P0l89K94l9j30R2K6M8j10J15k57M27j94P0J30k34K16l96P7J20
5696b3Q9Q9j80K69k13r2j7j54L31j72J14j32K6J55qk33L14k39J0K16N9J98m92
$$ y = [152, 27, 187, -305, -249, 112, -12, -37, 10, 70, -10, 61, -97, -88, -133, -14, 5, 44, -120, -158, -51, 34, 113, -97, -17, 36, -26, -42, 88, -148, 45, -1, 9, 177, -152, 144, -69, -67, -155, 52, -122, 55, 67, 32, -56, -128, 106, -49, -113, -269, -50, 313, -170, 15, -338, -209, -3, 111, 76, -19, 42, -180, 42, -6, -11, -120, 125, 104, 143, -426, 4, 186, 20, -253, -176, 256, -128, 249, 82, 32, 49, 99, -231, -82, 123, -111, 24, -6, -143, -26, -18, -3, 37, 96, -230, 4, -43, -44, 162, -49, 22, -46, 41, -60, 65, -21, 248, -10, -11, -266, -9, 186, -154, -174, -30, 55, 66, 4, 92, -175, 222, -51, -20, 267, 341, 67, -127, -118, -77, 205, -106, 47, 36, -94, 76, 164, 57, 184, 55, -53, -62, 185, 20, 222, 100, 190, -220, 41, 111, -278, 16, -23, -153, -61, -35, 13, -97, 18, -239, 188, -6, 64, 194, -40, 176, -220, -143, -23, 66, 155, -25, 244, 31, -61, -78, -232, 99, -73, 41, -91, -65, 90, 82, -151, 163, -76, -66, 150, 209, 407, -85]
5719h5n5K01j28L07j28O2r6j88J92k47K58O5k13k4l5L10m13K40N6k25o7L57o2
5742H2l39J82K28m41L66j71q6J19k3K07j94J12K0kq9R4k11m2K4K33N6p8J25mr4
5767G4j5j10q1o8j2K6J96n4K46j63J29k60J24j44K77j12p2J01j50K49M9k89J45
5790H6M9J22k87rL41q2k52L9j80N2M6m3O3M1J20j05p7L7jk1Q5m03L07j2J51m44
5816c77K88j12J19L8jK72l47K84m3j27P3J00k55P6lk98K44j88K90j39k2J33n1
5839d6k62M49k12J55k58J1j47K73K06m21M84l85K9L34k93J31J81k76k2K86n20
5860c03K57k9k0K55j59j81M6J37J56j49K3k16L21k55N6L43l38j42K20J06k53J90
5882F5k13Kj65j4J4R1J19O6L19k28nJ48l33O9p6l6J91j30N5J48q0N8K28m85O3
$$ y = [-85, -140, 61, -67, 240, 112, 174, 78, -110, 82, -165, 93, 158, -55, -79, -114, 196, -217, 23, 79, -146, -213, 144, 82, -257, -75, 153, -288, 78, -93, -179, -60, -83, 124, -70, 42, 62, 60, -29, 65, -146, -188, -164, 69, 125, 47, 172, 168, 74, 59, -51, -132, -200, -212, -186, 10, -44, 202, 39, 168, -92, 32, -112, 165, 53, -19, 82, -68, 181, 230, -59, 86, 135, 257, -30, -39, 302, 220, -32, 7, -173, -121, -75, -118, -55, -14, 106, 1, -76, -39, -40, -61, 24, -379, -72, -84, 67, -377, -89, -201, -82, -44, -45, 227, -120, 164, 121, -6, 67, 167, -88, -12, -15, -313, -69, -257, 33, -106, -128, 5, -46, -308, 141, -71, 84, -174, -163, -310, -37, 169, -252, 232, -153, -124, 210, -83, 48, 229, -47, -69, 217, -303, -46, -75, -95, 160, 1, -180, -134, 3, 159, 10, 33, -183, 138, -117, -61, 282, -56, -198, 22, 128, -125, 65, -148, -146, -311, -325, -311, -220, -101, -35, 284, 56, 51, 199, -134, -65, -141, -177, 14, -116, -61, 87, 7, 65, 293, -192, -129]
5907a29k08J32J88r4r0K48j46L43k30mJ11J16l12l18N74o6j33K7k17K21p1kJ13
5930E3J11j05j13J09j46N3j07L8J38q8J32j76J1r1J50l4J58j78k3k19J35J30N0
5953a2J20j10j24J26RJ0J01J13l40KK78k77J93j64J93k19J25r3j6L78k91L25l86
5976e9j87K40n6L96m91J84k10M5M25m35L1M1M1K18j24j18J17p8J27k28K41J06
5998B26l77L98l77R1q4L23l22J63n7K63k55j60J66j43N21m60j0J0Q2O3m9n4L7
6021eo9M7Q1O5j78q1J38j07j21K32P2k51K32j15j21L98m58o8K63K29n6k64M12
6044B75l36J08k63J07K90Mm34K21O9j18L97k07p5k13j83M97j4k05l0K69N2j80
6066C1L6K7j82L46k04mr1L3j34J74j26J9L24l54Q0kJ20q4n0J8n4o8Q5K79p1k07
$$ y = [-129, -337, -205, -17, -111, -201, 47, -99, 244, 14, 10, 121, 237, -75, -393, 181, 115, -18, 9, -208, 13, -58, -60, 53, 164, 59, -54, 55, -91, -38, -145, -107, 31, -57, 75, -101, -90, -181, -31, -65, 93, -85, -108, -327, -192, -62, -12, 108, -2, -126, 0, 9, 19, 120, 233, -107, -105, 173, -104, 89, -75, 118, -101, 24, -69, -85, 293, 2, 327, -59, -246, -6, -62, 334, -157, 27, -183, -138, 287, -148, -117, -76, -35, 183, 59, -59, 58, -20, 107, -121, 120, 226, -151, 247, -130, -39, -123, 200, -122, 41, -16, 247, -8, -168, -2, -145, 376, -84, -94, -84, -2, 61, 12, -42, -5, -74, -27, 54, 119, -59, -140, -2, -109, -230, 2, 74, -177, 55, -60, -181, 217, -241, -309, -46, 183, 127, -137, 275, -61, 47, -216, -109, 181, 185, -249, -28, 41, -77, 320, 113, 38, -175, -358, 139, 125, -80, -110, 159, 211, 31, 67, 94, -88, 258, 54, 50, -41, -8, -142, 32, -94, -75, 249, -105, -25, -27, 93, 9, -41, -23, -77, -145, -60, 219, 148, -59]
6092e9p9N4R4l0o5L37j81k06J15J0o3J66k5m7J18k17J29J40K05l02J21q2j26M2
6116D9j10l30L95P1j91K6J59n0l72L89J52j16j34NJ25L29m23l4n7J4P5M9K69j71
6140A19j23Q9j74J58J69l59J0j75M18L5j19l6j03p8R0mk8J69n8p4jJ06p5Q6J21
6165A63l65K52m9K54K3m71k8q5L21m0J18k6O1j50L00k92r8J89J11J30l37J87k52
6188h4l11M51L2j82J88j8o8L4j60k29N57l64K39k53K34J54j71nl97K80J83j94
6210h4k0L50l06k4R3j78R7J00P3l11L64k66M1K5L16l64l6Q4J93J52l91J19j31
6233a04J51K3l4M8J86l81K26l7o4k29K33j3n5J1L4K8p5M9K9L3R5j04k56L39J05
6258B38n3r8k92K44k84L13k2j5J12l13J46O3o5l3j00N11l28J19k85L54l40J72
$$ y = [-59, -138, -84, 10, -20, -85, 252, 71, -135, -20, -10, -73, 93, 68, 21, 139, -78, 51, 191, 396, 94, 215, 133, 7, 49, -61, -391, 4, 75, -116, -90, 69, 19, -353, 36, 188, 72, -62, -57, 68, 397, -26, -60, -117, -103, -28, 21, 290, 119, -4, 85, -89, 69, 238, -121, -111, -286, 132, 167, 48, 12, -91, -169, -79, -83, -111, 58, 0, -74, -75, 31, -44, 42, 163, -202, 50, 1, 255, 278, -193, -221, -306, 15, -25, 93, 67, 128, -22, 278, -14, -112, 77, 188, 318, -19, 168, -84, -395, 56, 88, -94, 94, 76, 8, 42, -118, -347, 210, -154, 85, -168, 66, 220, 49, 44, -353, -73, 110, -84, -104, 246, -60, -84, 9, -169, -72, 28, 101, -210, 154, -112, -71, -46, 270, -94, -130, -46, 147, 299, -92, 27, -104, 47, 70, 36, 84, 270, -111, 115, 78, 14, -215, 18, 5, -50, -39, -5, 23, -52, -3, 26, 59, 154, 50, -206, 133, 238, 185, 87, -205, 39, -245, 68, 46, 31, 143, -170, -24, 39, -26, -59, -159, 352, 24, 143, -142, 212, -128, 44]
6280D4K21n16N15j0k36o3J47K39k93r9M1j18j13K85k82J12J95j40L21m5l55m1
6302a91L43j32k8K0k85K03j2J42mk24K17J23k99K54o0k3k22K82J05j78k38K90
6324H3o8k13J81rO9k08K96j17Q3k48n1K26j69Q4k1n5j1L28K7k38K14j14j4j76
6348a21Q3N0J68k03J7j93L70k36K02p9K5j04J07k16J71k58L23J31p5J07k56k28
6370b15K76q5M5M8m36K28N7L45K7j69l16j27N32n1J17k47l77K94J97k09j20R0
6392i6K14q0l40L27j51L11k28K67j60j13J49k13N9O6j54Q2m8P1j02K89r4j59P9
6415b4K55l86J48O5O8L7j34l74J21K95p8lJ44j64j23K02l0J6mj75JK23k73P3j01
6440b21k1K2J83k08N7P3K77k5J27n25L25k8j26qJ2J00N4j22K32oj51j34R3oq9
$$ y = [44, 265, -251, 264, 254, 18, -45, 102, 341, 48, -51, -10, -128, -241, 44, -238, -126, 69, -71, 250, 205, -150, -191, 152, 20, -8, 12, -273, -70, -82, 60, 56, -168, 49, 172, -127, 127, 67, 44, -178, 104, 209, 31, -207, 83, 15, -198, -17, -26, 43, -165, 131, 14, 97, -151, -202, 24, -145, -61, -82, -137, -148, 180, 207, -31, 183, 69, 55, -121, -38, 12, 180, -23, -6, -199, 171, -65, 137, 58, 83, -21, 86, -130, 41, -217, 106, 237, 162, 269, 13, -215, 61, -24, 21, 69, -367, -139, -82, 263, 290, 121, -195, -322, 210, 159, 276, 29, -348, -54, 143, -66, -186, -96, 118, 38, -302, 25, -126, 185, -43, 224, 64, -49, 100, -113, -54, 12, -142, -60, -108, -37, -139, 150, 56, -103, -24, 231, -155, -7, 58, 126, 163, 29, -345, -224, 71, -7, -10, 134, -30, -153, 49, 19, 35, 31, -144, -143, 80, -193, -120, -221, -242, -220, -37, -245, -188, -115, 162, 137, 264, -261, 64, 36, -90, -98, -86, 14, 68, -54, 178, 172, 21, -113, -20, -26, -115]
6465a15J6l47K45J32L16n10L22Q9k47K67J27q1j05j22m9J5k15L00J19m36N60k43
6487C8o2j5j56K43Ok60K40j20P5m7K8q1L7L1R5o1r8j00L1RkK89q7J1L6k6k14K10
6515E0k1l0K05j75l13M49j49j66O0J3J44M5q9J83j86k25J64j08K36k53PJ77R0
6538A08j37qJ34M8l16K23M5k66L2K57k5p8k1j1J29N6l88K33j69L23j19J33j82
6561An8K52r3j63j88L64p7k79J62J39L1k49K79m7j29j40M28k22m8o0J27k0K9l7
6585BK03l1p6j31j09J10O7J60k29J45l45J60l6l9k80M33m4j0K81k82J82j05j55
$$ y = [-115, -99, -446, -201, -69, 247, -263, 59, 148, -99, 168, 295, 214, 109, -13, -62, -47, -262, 38, 157, -279, 281, 38, -24, -39, -195, 48, 54, -206, 34, -86, -11, -58, -30, -111, -74, -43, 52, -9, -107, -207, -176, -167, -169, 120, 33, 44, 80, 54, -160, 50, 29, -1, 204, 29, -284, 165, 16, -150, -90, -77, 67, 112, 23, 206, 20, -205, -41, -149, 87, -166, -159, 18, 108, -29, -37, 97, 145, -171, 52, 97, -169, -137, 120, 95, 17, -4, -15, 114, 170, -218, 15, -154, 169, 50, 183, 1, -57, 195, 102, -61, -249, 115, 38, -241, -79, 60, 91, -158, 121, 74, -55, -195, 233, 11, -37, -97, 30, 10, 39, 2, 205, 174, 98, -33, -142, -32, 35, 195, -34, 111, -234, -74, -110, -149, -429, 4, -40, -50, 231, -51, 131, 26, -129]
$$ [...]
8191B57
##END NTUPLES=NMR FID
##END=
