##TITLE=1H_DE-87_ch_5
 200.13MHz, CDCl3,
 8 sc
 
 23.4.2025
##JCAMPDX= 6.0         $$ Bruker NMR JCAMP-DX V2.0
##DATA TYPE= NMR FID
##DATA CLASS= NTUPLES
##ORIGIN= UXNMR, Bruker Analytische Messtechnik GmbH
##OWNER= pz
$$ XWIN-NMR		Version 3.5
$$ Wed Apr 23 14:14:37 2025 Russian Standard Time (UT+4h)  she@DPX200
##.OBSERVE FREQUENCY= 200.1313
##.OBSERVE NUCLEUS= ^1H
##.DELAY= (6, 6)
##.ACQUISITION MODE= SIMULTANEOUS
##.ACQUISITION SCHEME= undefined
##.AVERAGES= 8
##.DIGITISER RES= 18
##SPECTROMETER/DATA SYSTEM= spect
##.PULSE SEQUENCE= zg30
##.SOLVENT NAME= CDCl3
##.SHIFT REFERENCE= (INTERNAL, CDCl3, 0, 14.3821)
##AUDIT TRAIL= $$ (NUMBER, WHEN, WHO, WHERE, WHAT)
$$ ##TITLE= Audit trail, XWIN-NMR		Version 3.5
$$ ##JCAMPDX= 5.01
$$ ##ORIGIN= Bruker BioSpin GmbH
$$ ##OWNER= she
$$ F:/spectra/data/she/nmr/H-C/1/audita.txt
$$ ##AUDIT TRAIL=  $$ (NUMBER, WHEN, WHO, WHERE, WHAT)
(   1,<2025-04-23 14:13:28.70 +0400>,<she>,<DPX200>,
      <created by zg, POWCHK disabled, PULCHK disabled
       configuration hash MD5:
       00 E9 B6 7A A2 85 ED C7 34 08 36 98 17 FE 4E 26
       data hash MD5: 16K
       1A AF FB 34 51 1E 09 CE B4 13 03 7B DB 39 8E AD>)
$$ ##END=
$$ 
$$ hash MD5
$$ 48 38 13 AF 86 69 8D 84 4B 6A FF 82 1B F7 7A 77
##$RELAX= 
##$RELAX= 
##$RELAX= 
##$RELAX= 
##$RELAX= 
##$RELAX= 
$$ Bruker specific parameters
$$ --------------------------
##$DU= <F:/spectra>
##$EXPNO= 1
##$NAME= <H-C>
##$PROCNO= 1
##$TYPE= <nmr>
##$USER= <she>
##$AMP= (0..31)
100 100 100 100 100 100 100 100 100 100 100 100 100 100 100 100 100 100 
100 100 100 100 100 100 100 100 100 100 100 100 100 100 
##$AQSEQ= 0
##$AQ_mod= 1
##$AUNM= <au_zg>
##$AUTOPOS= <>
##$BF1= 200.13
##$BF2= 200.13
##$BF3= 200.13
##$BF4= 200.13
##$BF5= 200.13
##$BF6= 200.13
##$BF7= 200.13
##$BF8= 200.13
##$BYTORDA= 1
##$CFDGTYP= 0
##$CFRGTYP= 5
##$CHEMSTR= <none>
##$CNST= (0..31)
1 1 145 1 1 1 1 1 1 1 1 1 1 1 1 1 1 1 1 1 1 1 1 1 1 1 1 1 1 1 1 1 
##$CPDPRG= <>
##$CPDPRG1= <>
##$CPDPRG2= <>
##$CPDPRG3= <>
##$CPDPRG4= <mlev>
##$CPDPRG5= <mlev>
##$CPDPRG6= <mlev>
##$CPDPRG7= <mlev>
##$CPDPRG8= <mlev>
##$CPDPRGB= <>
##$CPDPRGT= <>
##$D= (0..31)
0 0.7 0 0 0 0 0 0 0 0 0 0.03 0 0 0 0 0 0 0 0 0 0 0 0 0 0 0 0 0 0 0 0 
##$DATE= 1745403208
##$DBL= (0..7)
120 120 120 120 120 120 120 120 
##$DBP= (0..7)
150 150 150 150 150 150 150 150 
##$DBP07= 0
##$DBPNAM0= <>
##$DBPNAM1= <>
##$DBPNAM2= <>
##$DBPNAM3= <>
##$DBPNAM4= <>
##$DBPNAM5= <>
##$DBPNAM6= <>
##$DBPNAM7= <>
##$DBPOAL= (0..7)
0.5 0.5 0.5 0.5 0.5 0.5 0.5 0.5 
##$DBPOFFS= (0..7)
0 0 0 0 0 0 0 0 
##$DE= 6
##$DECBNUC= <off>
##$DECIM= 32
##$DECNUC= <off>
##$DECSTAT= 4
##$DIGMOD= 1
##$DIGTYP= 9
##$DL= (0..7)
0 120 120 120 120 120 120 120 
##$DP= (0..7)
150 150 150 150 150 150 150 150 
##$DP07= 0
##$DPNAME0= <>
##$DPNAME1= <>
##$DPNAME2= <>
##$DPNAME3= <>
##$DPNAME4= <>
##$DPNAME5= <>
##$DPNAME6= <>
##$DPNAME7= <>
##$DPOAL= (0..7)
0.5 0.5 0.5 0.5 0.5 0.5 0.5 0.5 
##$DPOFFS= (0..7)
0 0 0 0 0 0 0 0 
##$DQDMODE= 0
##$DR= 18
##$DS= 0
##$DSLIST= <SSSSSSSSSSSSSSS>
$$ [...]
##$SUBNAM0= <"">
##$SUBNAM1= <"">
##$SUBNAM2= <"">
##$SUBNAM3= <"">
##$SUBNAM4= <"">
##$SUBNAM5= <"">
##$SUBNAM6= <"">
##$SUBNAM7= <"">
##$SUBNAM8= <"">
##$SUBNAM9= <"">
##$SW= 18.0517328524113
##$SWIBOX= (0..15)
0 0 2 0 0 0 0 0 0 0 0 0 0 0 0 0 
##$SW_h= 3612.71676300578
##$TD= 16384
##$TD0= 1
##$TE= 0
##$TE2= 300
##$TE3= 300
##$TEG= 300
##$TL= (0..7)
0 120 120 120 120 120 120 120 
##$TP= (0..7)
150 150 150 150 150 150 150 150 
##$TP07= 0
##$TPNAME0= <>
##$TPNAME1= <>
##$TPNAME2= <>
##$TPNAME3= <>
##$TPNAME4= <>
##$TPNAME5= <>
##$TPNAME6= <>
##$TPNAME7= <>
##$TPOAL= (0..7)
0.5 0.5 0.5 0.5 0.5 0.5 0.5 0.5 
##$TPOFFS= (0..7)
0 0 0 0 0 0 0 0 
##$TUNHIN= 0
##$TUNHOUT= 0
##$TUNXOUT= 0
##$USERA1= <user>
##$USERA2= <user>
##$USERA3= <user>
##$USERA4= <user>
##$USERA5= <user>
##$V9= 5
##$VALIST= <valist>
##$VCLIST= <CCCCCCCCCCCCCCC>
##$VD= 0
##$VDLIST= <DDDDDDDDDDDDDDD>
##$VPLIST= <PPPPPPPPPPPPPPP>
##$VTLIST= <TTTTTTTTTTTTTTT>
##$WBST= 1024
##$WBSW= 4
##$XGAIN= (0..3)
0 0 0 0 
##$XL= 0
##$YL= 0
##$YMAX_a= 90616
##$YMIN_a= -135653
##$ZGOPTNS= <>
##$ZL1= 120
##$ZL2= 120
##$ZL3= 120
##$ZL4= 120
##$ABSF1= 10
##$ABSF2= 0
##$ABSG= 5
##$ABSL= 3
##$ALPHA= 0
##$AQORDER= 0
##$ASSFAC= 0
##$ASSFACI= 0
##$ASSFACX= 0
##$ASSWID= 0
##$AUNMP= <proc_1d>
##$AZFE= 0.1
##$AZFW= 0.1
##$BCFW= 1
##$BC_mod= 2
##$BYTORDP= 1
##$COROFFS= 0
##$CY= -3
##$DATMOD= 1
##$DC= 2
##$DFILT= <>
##$DTYPP= 0
##$F1P= 0
##$F2P= 0
##$FCOR= 0.5
##$FTSIZE= 0
##$FT_mod= 4
##$GAMMA= 1
##$GB= 0.15
##$INTBC= 1
##$INTSCL= 1
##$ISEN= 128
##$LB= 0.25
##$LEV0= 0
##$LPBIN= 0
##$MAXI= 10000
##$MC2= 0
##$MEAN= 0
##$ME_mod= 0
##$MI= 1.114404
##$NCOEF= 0
##$NC_proc= 0
##$NLEV= 6
##$NOISF1= 3.799351
##$NOISF2= 2.8
##$NSP= 1
##$NTH_PI= 0
##$NZP= 0
##$OFFSET= 14.38212
##$PC= 1
##$PHC0= -832.7551
##$PHC1= 9.992201
##$PH_mod= 1
##$PKNL= yes
##$PPARMOD= 0
##$PSCAL= 0
##$PSIGN= 0
##$REVERSE= no
##$SF= 200.129724274929
##$SI= 16384
##$SIGF1= 3
##$SIGF2= 2
##$SINO= 400
##$SIOLD= 16384
##$SREGLST= <1H.CDCl3>
##$SSB= 0
##$STSI= 0
##$STSR= 0
##$SW_p= 3205.1282051282
##$SYMM= 0
##$S_DEV= 0
##$TDeff= 0
##$TDoff= 0
##$TI= <>
##$TILT= no
##$TM1= 0
##$TM2= 0
##$TOPLEV= 0
##$USERP1= <user>
##$USERP2= <user>
##$USERP3= <user>
##$USERP4= <user>
##$USERP5= <user>
##$WDW= 1
##$XDIM= 8192
##$YMAX_p= 0
##$YMIN_p= 0
$$ End of Bruker specific parameters
$$ ---------------------------------
##NTUPLES= NMR FID
##VAR_NAME=  TIME,          FID/REAL,        FID/IMAG
##SYMBOL=    X,             R,               I
##VAR_TYPE=  INDEPENDENT,   DEPENDENT,       DEPENDENT
##VAR_FORM=  AFFN,          ASDF,            ASDF
##VAR_DIM=   8192,          8192,            8192
##UNITS=     SECONDS,       ARBITRARY UNITS, ARBITRARY UNITS
##FACTOR=    0.0002768,     1,               1
##FIRST=     0,             0,               0
##LAST=      2.2672688,     0,               0
##MIN=       0,             -135653,         0
##MAX=       2.2672688,     90616,           0
$$ Real data points
##PAGE= N=1
##DATA TABLE= (X++(R..R)), XYDATA
$$ plain form
0 0 0 0 0 0 0 0 0 0 0 0 0 0 0 0 0 0 0 -6 8 -8 8 -8 8 -9 14 -16 16 -20 24 -25 30 -33 38 -42 48 -55 62 -70 78
39 78 -85 94 -105 115 -127 141 -155 171 -188 207 -230 253 -277 306 -338 373 -416 461 -517 582 -658
60 -658 756 -876 1030 -1241 1541 -2001 2787 -4376 8797 -47840 -135653 27279 79674 8519
74 8519 46748 90616 36423 35790 66995 30240 8265 38652 -6735 -69099 -30846 -19750 -75292
87 -75292 -38636 10603 -36152 -40687 11100 6446 1151 29668 27298 11822 17887 14986 10300 30115
101 30115 28002 -21839 -30249 12729 5278 -24028 -11515 -14519 -27490 -8229 -7298 -15571 9012
114 9012 16919 -2167 4446 24894 22244 14825 25006 20142 -9809 -14556 -4053 -15477 -16421 -7738
128 -7738 -20669 -23214 -6940 -932 6738 14502 6109 -836 4442 12311 12664 5175 5304 6472 -791
$$ packed form
0@%%%%%%%%%%%%%%%%%oJ4j6J6j6J6j7K3l0L2l6M4m9N5o3P1q0R0j03J17j32J48
39G8j63J79j99K20k42K68k96L26l59L95m37M83n30N83o44P11p89Q77r78J099j240
60f58J414j632J906k271K782l542M788p163J3173n6637q7813J62932N2395p1155
74H519L8229M3868n4193o33L1205l6755k1975L0387m5387o2364L8253J1096n5542
87g5292L6656M9239m6755m535N1787m654n295K8517k370j5476O065k901m686J9815
101C0115k113m9841q410M2978p451k9306J2513l004j2971J9261R31q273K4583
114I012P907j9086O613K0448k650p419J0181m864k9951m747J0503j1424r44Q683
128g738j2931k545J6274O008P670P764q393o945N278P869L53p489J29J168p263
$$ plain form
143 -791 -572 1841 -1513 -1124 -5607 -13881 -13962 -11683 -5665 1375 -1755 -2335 2957 1427 7072 15806 12369
160 12369 6577 3129 -293 777 2098 1415 -2796 -9417 -7417 -5135 -7285 -673 2958 -3270 -1527
175 -1527 1238 -1720 1701 5453 2356 395 -1172 -1090 1187 3488 4962 813 -3593 -1123 -1224 -1793
191 -1793 2632 -168 -3517 -430 -693 920 6041 4109 827 695 -761 -2081 -2487 -1316 -1136 -5267
207 -5267 -5274 -2792 -3109 1070 4413 507 484 2415 923 3119 5953 3688 576 -614 -135 674 149
224 149 438 -1154 -5080 -3392 -2415 -3402 -414 -211 -2933 -1482 483 1091 3011 4114 3685 2570 521
241 521 1329 2123 898 366 -1900 -3871 -2651 -2321 -1627 218 -923 -1755 -782 -102 1847 2831 1415 1376
259 1376 1259 271 1186 1617 1377 996 -1381 -1852 -1442 -1758 -1228 -978 -2288 -1942 -1272 -927 1513 2045 1313
$$ packed form
143g91K19K413l354L89m483q274q1K279O018P040l130n80N292j530N645Q734l437
160A2369n792l448l422J070J321o83m211o621K000K282k150O612L631o228J743
175a527K765k958L421L752l097j961j567Q2K277K301J474m149m406K470j01n69
191a793M425k800l349L087k63J613N121j932l282j32j456j320m06J171J80m131
207e267pK482l17M179L343l906k3J931j492K196K834k265l112j190M79Q09n25
224A49K89j592l926J688R77r87K988K03k722J451J965O08J920J103m29j115k049
241E21Q08P94j225n32k266j971J220L30O94J845j141q32R73O80J949R84j416l9
259A376j17r88R15M31k40l81k377m71M10l16N30K50j310L46O70L45K440N32p32
$$ plain form
278 1313 1272 998 1586 2344 1397 1323 136 -1798 -1316 -1048 -1198 -529 -1322 -1861 -1095 -1276 235 1097 737 1063
298 1063 401 287 1286 2089 1706 1582 565 -345 165 -312 -580 -300 -1682 -1757 -1651 -1372 -57 -34 -218 251
318 251 280 444 1339 1494 1310 767 204 101 252 -227 183 -237 -1100 -1084 -767 -722 -60 -435 -340 -745 -557 59
340 59 773 543 981 623 -258 387 606 547 563 -391 -328 -660 -735 -358 -191 -354 -82 -548 -205 640 517 591
362 591 626 231 61 228 188 561 280 -208 -218 -282 -385 48 -28 -235 -442 -719 -353 -99 147 249 370 -302
384 -302 334 260 296 508 355 -404 -311 -619 -226 -134 -218 -177 -350 -132 -44 136 78 418 50 -60 235 424 422 83
408 83 -85 -128 -146 -46 163 -136 -260 -285 -360 -209 2 -31 256 43 -17 355 -109 -108 115 301 -116 -221 74
431 74 -88 235 -112 145 -65 -207 52 291 -3 -71 -168 124 283 225 133 11 -78 13 -157 -173 -356 -214 38
$$ packed form
278A313m1k74N88P58r47p4j187j934M82K68j50O69p93n39P66j81J511Q62l60L26
298A063o62j14R99Q03l83j24j017r10N10m77k68K80j382p5J06K79J315K3j84M69
318B51K9J64Q95J55j84n43n63j03J51m79M10m20q63J6L17M5O62l75R5m05J88O16
340E9P14k30M38l58q81O45K19n9J6r54O3l32p5L77J67j63K72m66L43Q45j23P4
362E91L5l95j70J67m0L73k81m88j0o4j03M33p6k07k07k77L66K54K46J02J21o72
384c02O36p4L6K12j53p59R3l08L93R2q4M1j73K18Q8J80n8L40l68j10K95J89kl39
408H3j68m3j8J00K09k99j24k5p5J51K11l3K87k13o0L72m64JK23J86m17j05K95
431G4j62L23l47K57k10j42K59K39k94o8r7K92J59n8r2j22q9R1j70j6j83J42K52
$$ plain form
454 38 -233 182 -265 144 149 270 -215 -39 -35 40 -17 335 175 20 16 -204 225 112 76 55 116 -199 -39 -22 -116
479 -116 73 58 -95 245 28 99 -139 -52 -145 -86 -157 -89 43 -147 -86 -108 329 -86 26 244 311 44 -39 -11
503 -11 205 151 -3 81 -26 288 66 146 87 -182 -349 -118 -197 -277 128 -372 103 235 169 -47 -88 -122 -81 112
527 112 -127 -31 -150 -246 217 -242 77 -107 -171 -289 -136 -228 -171 64 74 52 -129 -25 90 -33 46 -38 173
550 173 -162 207 37 -51 -2 -15 17 -188 240 -288 -224 -267 -75 -184 32 37 273 52 -106 -113 -94 319 57 105
574 105 90 -107 13 -78 -131 45 -352 78 -152 306 -7 85 84 170 -31 -39 118 -51 -43 -89 -138 -24 -58 48 129
599 129 14 138 -245 -304 -53 -52 -69 152 -125 123 -189 77 -11 -97 175 35 -35 -64 120 -195 27 -269 324
622 324 -99 -53 -122 70 184 -201 187 -83 68 122 41 343 82 -49 101 -63 256 -3 143 310 93 -177
$$ packed form
454C8k71M15m47M09NJ21m85J76MP5n7L52j60j55mk20M29j13l6k1O1l15J60J7r4
479a16J89j5j53L40k17P1k38Q7r3N9p1O8J32j90O1k2M37m15J12K18O7k67q3K8
503a1K16n4j54Q4j07L14k22Q0n9k69j67K31p9q0M05n00M75J32o6k16m1l4M1J93
527A12k39R6j19r6M63m59L19j84o4j18J53r2N7K35J0k2j81J04J15j23P9q4K11
550A73l35L69j70q8M9j3L2k05M28n28O4m3J92j09K16NK36k21j58pJ9M13k62M8
574A05j5j97J20r1n3J76l97M30k30M58l13R2jQ6k01qJ57j69Qm6m9J14l4J06Q1
599A29j15J24l83n9K51Jj7K21k77K48l12K66q8q6K72j40p0k9J84l15K22k96N93
622C24m23M6o9J92J14l85L88k70J51N4q1L02k61j31J50j64L19k59J46J67k17k70
$$ plain form
644 -177 -59 -65 260 109 -6 -80 24 62 83 -62 -271 -76 -76 -9 -236 38 -60 120 31 -38 -11 121 147 201 183
669 183 169 62 65 36 -91 -84 -75 -139 82 -50 -51 281 -241 -41 -81 -137 48 -15 49 24 117 16 401 362 -110 -34 -116
696 -116 155 91 142 126 -15 -86 -66 134 -86 269 -30 -98 45 -180 -270 -15 -105 73 -288 -2 74 247 253 -25
720 -25 56 383 -236 162 -92 125 -28 1 46 -35 -47 -268 -41 378 -118 -142 174 -86 -131 24 272 -185 89
743 89 40 183 97 15 -183 8 169 131 218 101 174 71 62 -68 156 32 -18 7 -106 -167 94 -70 44 -124
767 -124 86 7 10 -34 122 77 112 -64 137 -288 -33 46 -153 54 119 87 -66 -54 149 -28 36 -83 -130 -120 73
792 73 51 -39 198 -44 -151 58 11 126 161 7 83 225 -134 -440 -63 -193 -3 169 122 -113 57 8 44
815 44 -73 -238 43 -204 219 135 -90 74 152 180 -119 13 -4 -205 -42 -123 35 160 181 184 -30 -95 8 65
$$ packed form
644a77J18oL25j51j15p4J04L8K1j45k09J95%O7k27K74r8J80q9o9K7J32K6N4j8
669A83j4j07Lk9j27PRo4K21j32jL32n22K00m0n6J85o3O4k5R3j01L85l9m72P6q2
696a16K71o4N1j6j41p1K0K00k20L55k99o8J43k25r0K55r0J78l61K86P6J73Ok78
720b5Q1L27o19L98k54K17j53K9M5q1j2k21K27M19m96k4L16k60m5J55K48m57K74
743H9m9J43q6q2j98J91J61l8Q7j17P3j03rj30K24j24n0K5j13o1K61j64J14j68
767a24K10p9Lm4J56m5L5j76K01m25K55P9j99K07O5l2j53J2K03j77O4j19m7J0J93
792G3k2r0K37k42j07K09m7J15L5j54P6J42l59l06L77j30J90J72m7k35J70m9L6
815D4j17j65K81k47M23q4k25J64P8K8k99J32j7k01J63q1J58J25K1Lk14o5J03N7
$$ plain form
839 65 -28 -147 67 7 -25 243 -22 166 -132 -253 30 -172 -250 -65 -189 89 122 -37 -15 -11 -35 -230 -16 -85
863 -85 1 62 -68 -73 222 -91 139 -74 103 183 150 65 185 106 65 231 -193 312 28 98 -14 -52 147 307
887 307 -261 -187 89 86 -167 15 300 17 7 -335 -191 78 245 -123 131 113 184 -57 -239 -161 156 -172 49
910 49 75 74 -195 7 27 191 168 -296 -37 -210 105 -63 142 197 -117 74 284 2 -202 -30 255 49 -134
933 -134 -95 -12 133 73 91 180 69 -60 -288 99 256 -31 125 101 -74 -1 56 226 -6 -132 -257 36 -46
956 -46 297 82 318 -29 359 176 44 23 -7 183 -54 150 -150 -17 -109 -8 15 105 -68 -212 -282 -154 17
979 17 -259 -164 43 -19 123 -186 -94 -65 186 16 -1 186 -85 267 -397 18 -60 22 147 182 -49 -81 230 44
1003 44 1 97 -41 -1 204 -83 82 -250 335 66 -91 -6 -89 -7 48 65 198 -56 -232 -100 249 -119 179
$$ packed form
839F5r3j19K14o0l2K68k65J88k98j21K83k02p8J85j24K78L3j59K2Mk4j95K14o9
863h5Q6O1j30nK95l13K30k13J77Q0l3q5J20p9m1J66m24N05k84P0j12l8J99J60
887C07n68P4K76lk53J82K85k83j0l42J44K69J67l68K54j8P1k41j82P8L17l28K21
910D9K6jk69K02K0J64k3m64K59j73L15j68K05N5l14J91K10k82k04J72K85k06j83
933a34L9Q3J45o0J8Q9j11j29k28L87J57k87J56k4j75P3N7J70k32j26j25K93q2
956d6L43k15K36l47L88j83j32k1l0J90k37K04l00J33r2J01K3R0j73j44p0J28J71
979A7k76R5K07o2J42l09R2K9K51j70j7J87k71L52o64M15p8Q2J25L5k31l2L11j86
1003D4m3R6j38M0K05k87J65l32N85k69j57Q5q3Q2N5J7J33k54j76J32L49l68K98
$$ plain form
1026 179 2 -99 109 -30 -191 -131 16 -85 56 -155 -73 -118 151 177 -78 10 -119 38 7 -24 -158 64
1048 64 113 269 13 -19 -306 22 19 -92 30 -42 -21 -179 -48 -20 -122 215 8 -174 -47 -39 -149 102 13 30
1072 30 -96 16 1 -24 -148 -144 -93 -32 208 -10 74 41 -161 -96 132 60 64 -50 -79 -61 172 214 -65 129 17
1097 17 -2 -113 -142 58 -145 -32 52 304 151 116 -184 16 86 -135 -26 -47 215 -31 207 -112 -331 108
1119 108 -363 -4 -61 158 108 -51 -101 -180 173 186 62 105 196 -265 131 79 -98 228 218 185 -46 47 -29 -9
1143 -9 -165 68 -164 180 88 41 111 91 -23 173 18 44 -49 -85 89 -93 -78 -326 135 -188 55 108 55 178
1167 178 185 -39 86 -49 157 171 -141 -46 112 -98 -59 -218 132 122 -87 -25 78 166 -134 -139 6 28 102 70
1191 70 254 109 -260 -378 -227 273 -117 -83 -10 -77 -145 -95 -202 -91 475 -222 18 215 12 -61 142 -276
$$ packed form
1026A79j77j01K08j39j61O0J47j01J41k11Q2m5K69K6k55Q8j29J57l1l1j34K22
1048F4M9J56k56l2k87L28lj11J22p2K1j58J31K8j02L37k07j82J27Qj10K51q9J7
1072C0j26J12j5k5j24MN1O1K40k18Q4l3k02O5K28p2Mj14k9J8K33M2k79J94j12
1097A7j9j11k9K00k03J13Q4K52j53l5l00K00P0k21J09k1K62k46K38l19k19M39
1119A08m71L59n7K19n0j59n0p9L53J3j24M3R1m61L96n2j77L26j0l3k31R3p6K0
1143ij56K33k32L44r2m7P0k0j14J96j55K6r3l6J74j82J5k48M61l23K43N3n3J23
1167A78Pk24J25j35K06J4l12R5J58k10L9j59L50j0k09O2J03Q8l00nJ45K2P4l2
1191G0J84j45l69j18J51N00l90L4P3o7o8N0j07J11N66o97K40J97k03p3K03m18
$$ plain form
1213 -276 -4 217 159 -251 130 -6 -304 85 -92 -225 113 -154 -107 28 6 107 -3 73 47 -74 -305 47
1235 47 45 -118 99 -115 -200 261 15 344 1 87 -90 189 -85 34 -17 -249 100 -76 -22 -198 166 6
1257 6 -28 5 104 6 108 -138 -304 201 275 -94 169 -33 129 204 84 -142 120 220 -162 -388 144 -53 311
1280 311 -217 -22 -31 -143 -81 135 245 -93 26 -9 104 13 59 94 -125 102 -26 113 243 14 -150 -51 303
1303 303 -121 245 27 5 157 323 -213 27 -64 81 -139 -120 59 -133 -123 -63 59 -366 -159 -201 -175 -282
1325 -282 17 -24 -136 -189 79 -412 -170 150 44 -63 -102 114 32 142 308 179 -123 -199 211 197 55 242
1347 242 -3 110 -253 81 -102 129 -150 295 -106 27 -31 188 -153 261 317 192 20 -123 188 -174 -179
1368 -179 83 74 -22 55 238 60 148 40 174 -23 70 97 108 58 163 99 -12 -33 -165 -224 -330 194 153 -26
$$ packed form
1213b76K72K21n8m10L81j36k98L89j77j33L38k67M7J35k2J01j10P6k6j21k31L52
1235D7kj63K17k14q5M61k46L29l43Q6j77K79k74J19n1k32L49j76N4j76L64j60
1257Fl4L3R9r8J02k46j66N05P4l69K63k02J62P5j20k26K62J00l82k26N32j97L64
1280C11n28J95rj12O2K16J10l38J19l5J13r1M6L5k19K27j28J39J30k29j64R9L54
1303C03m24L66k18k2J52J66n36K40r1J45k20J9J79j92J0O0J22m25K07m2K6j07
1325b82K99m1j12n3K68m91K42L20j06j07l9K16q2J10J66j29l02p6M10j4j42J87
1347B42k45J13l63L34j83K31k79M45m01J33n8K19l41M14N6j25j72j43L11l62n
1368a79K62rr6P7J83j78Q8j08J34j97R3K7J1n0J05o4j11k1j32n9j06N24m1j79
$$ plain form
1392 -26 -65 36 -10 102 134 120 139 -137 -82 83 123 -42 -10 -50 -18 65 146 -111 -235 -20 -198 81 -129 79
1416 79 68 8 107 27 -74 31 -61 -180 103 -105 25 -232 43 -94 22 11 -118 1 -80 -49 -28 140 -59
1439 -59 -34 -99 -91 11 28 -319 30 -93 29 -49 197 229 -118 -117 203 62 233 -169 152 -131 -125 39 -22 139
1463 139 10 -157 -38 106 -8 -212 -227 116 283 1 -44 53 111 -90 -68 -37 217 57 -112 22 -84 195
1485 195 20 -159 125 -52 -162 147 111 -11 379 49 32 109 -102 -224 32 -176 -45 -90 60 -41 -195
1506 -195 253 -31 -146 -110 -234 33 -127 -193 -61 134 0 -191 -108 -31 99 -16 72 -32 -37 -75 249 -107 -48
1529 -48 -22 -32 115 128 68 282 32 -111 -33 -239 103 54 -143 -103 14 -5 -116 274 1 11 -69 118 5 -19
1553 -19 166 -9 175 -102 -196 -92 74 -137 45 35 -112 23 34 34 -84 35 130 -172 -114 216 125 26 4 -50
$$ packed form
1392b6l9J01m6J12L2j4J9k76N5J65M0j65L2m0L2Q3Q1k57j24K15j78K79k10K08
1416G9j1o0R9q0j01J05r2j19K83k08J30k57K75j37J16j1j29J19q1L1K1J68j99
1439e9K5o5QJ02J7l47L49j23J22p8K46L2l47JL20j41J71m02L21k83OJ64o1J61
1463A39j29j67J19J44j14k04j5L43J67k82m5R7N8k01K2L1K54j60j69J34j06K79
1485A95j75j79K84j77j10L09l6j22L90l30j7P7k11j22K56k08J31m5J50j01j54
1506a95M48k84j15L6j24K67j60o6J32J95j34j91Q3P7J30j15Q8j04nl8L24l56N9
1529d8K6j0J47J3o0K14k50j43P8k06L42m9j97M0J17j9j11L90k73J0q0J87j13k4
1553a9J85j75J84k77r4J04J66k11J82j0j47J35J1%j18J19R5l02N8L30r1r9k2n4
$$ plain form
1577 -50 -5 -114 106 -221 85 132 153 172 49 -108 12 56 95 -56 -154 69 60 -29 -89 41 -257 91 55 -198
1601 -198 -11 -181 106 -82 -175 -52 212 -188 24 45 -12 8 81 -246 66 85 -106 55 -75 -288 129 292
1623 292 -89 59 20 91 232 -164 -190 226 32 -116 -270 40 -92 67 -123 181 -89 -114 -173 -11 -93 -153
1645 -153 158 -42 8 62 -157 -146 41 -12 -152 107 118 27 42 -75 38 -127 -8 -118 -24 47 -20 58 -180 9
1669 9 -189 -125 -137 -30 129 -189 129 -138 -10 32 -52 213 86 61 -211 -36 -197 -7 -46 107 -77 38 29
1692 29 -82 82 -38 -93 -139 -97 -291 -248 72 97 20 -14 182 -68 -68 248 9 130 18 -38 41 -139 52 57 155
1717 155 -87 -93 -107 -11 -242 72 98 -30 -230 -90 30 -226 -47 110 191 6 193 176 -96 -102 -139 -87 46 227
1741 227 -125 70 242 70 -107 -143 -107 -140 -29 -104 134 62 12 -92 64 -175 -95 57 78 -31 112 85 15
$$ packed form
1577e0M5j09K20l27L06M7K1J9j23j57J20M4L9j51r8K23rq9o0J30k98L48l6k53
1601a98J87j70K87j88r3J23K64m00K12K1n7K0P3l27L12J9j91J61j30k13M17J63
1623B92l81J48l9P1J41l96k6M16j94j48j54L10j32J59j90L04k70k5n9J62q2o0
1645a53L11k00N0N4k19J1J87n3j40K59J1r1J5j17J13j65J19j10R4P1o7P8k38J89
1669Ij98O4j2J07J59l18L18k67J28M2q4K65j27k5k72J75j61J90l9J53j84J15r
1692B9j11J64j20n5m6M2j94M3L20K5p7l4J96k50%L16k39J21j12n6P9j80J91NR8
1717A55k42oj4R6k31L14K6j28k00J40J20k56J79J57Q1j85J87j7k72ol7N2J33J81
1741B27l52J95J72j72j77l6L6l3J11p5K38p2n0j04J56k39Q0J52K1j09J43k7p0
$$ plain form
1764 15 -215 114 23 -56 -4 -28 129 60 -37 -64 -223 2 85 117 41 188 208 -119 264 41 -103 113 194 16
1788 16 -39 -107 37 -260 -117 197 -48 32 -123 152 252 -101 19 -177 -119 -45 -68 -88 -25 -40 107 -86 -158 186
1812 186 309 45 -16 -50 -76 180 -53 337 250 -77 -82 246 -73 -47 91 -138 41 -164 -17 48 -147 36 -83
1835 -83 -155 123 -166 -114 -67 95 -136 230 -136 -114 -9 247 20 -105 -97 187 -280 67 64 -241 -71 -81 -55 54
1859 54 84 24 -34 -100 94 106 147 38 148 -158 -105 -295 179 117 41 131 43 235 26 -179 -13 68 -165 17
1883 17 -133 -18 142 88 44 -18 -432 44 218 -39 207 72 -157 246 60 -141 -134 -66 36 -169 133 -224
1905 -224 175 45 66 -16 -47 -227 121 157 114 -120 -331 180 -226 181 15 239 73 191 18 -68 31 -4 -75
1928 -75 172 -27 88 69 56 -89 80 -53 13 178 66 370 -278 -111 -52 -322 -37 91 -39 1 -62 252
$$ packed form
1764A5k30L29r1p9N2k4J57o9r7k7j59K25Q3L2p6J47K0l27L83k23j44K16Q1j78
1788A6n5o8J44k97J43L14k45Q0j55K75J00l53J20j96N8P4k3k0O3j5J47j93p2L44
1812A86J23k64o1l4k6K56k33L90q7l27nL28l19K6J38k29J79k05J47O5j95J83j19
1835h3p2K78k89N2M7J62k31L66l66K2J05K56k27j25QK84m67L47ll05J70j0K6J09
1859E4L0o0n8o6J94J2M1j09J10l06N3j90M74o2p6R0q8J92k09k05J66Q1k33J82
1883A7j50J15J60n4m4o2m14M76J74k57K46j35k29M03j86k01PO8J02k05L02l57
1905b24L99j30K1q2l1j80L48L6m3k34k11N11m06M07j66K24j66J18j73q6R9l5p1
1928g5K47j99J15j9j3j45J69j33O6J65j12L04o48J67N9k70K85J28j30M0o3L14
$$ plain form
1950 252 17 196 70 -50 31 173 257 -76 47 217 161 261 -64 48 159 -5 242 -306 -159 92 -57
1971 -57 41 -224 32 54 191 51 -99 112 98 -80 222 9 -166 -16 3 -62 -126 -302 -115 6 -161 119
1993 119 42 -34 77 -81 177 77 -205 13 211 -151 -200 -114 -56 165 46 -58 5 -53 146 260 -82 12 202
2016 202 -265 -148 140 -340 103 -136 -304 -75 -193 67 260 -65 174 -5 -31 -35 -85 300 -68 260 -184
2037 -184 55 43 -8 27 -89 -159 -2 29 -131 -144 -159 -80 137 3 77 -40 -96 48 126 13 -113 -101 5 -13
2061 -13 -184 -32 56 -95 -35 -60 -80 14 106 95 5 35 -60 98 -85 141 -146 60 -110 -175 73 102 148 53 -146
2086 -146 -30 -54 268 84 71 11 98 9 143 5 -4 101 -117 -218 144 -158 9 -64 -445 149 138 135 -10 -45
2110 -45 124 208 271 414 -90 -213 -78 95 -85 -151 -91 53 -264 -205 89 94 -145 -38 -48 301 -22 100 -30
$$ packed form
1950B52k35J79j26j20Q1J42Q4l33J23J70n6J00l25J12J11j64K47n48J47K51j49
1971e7R8k65K56K2J37j40j50K11j4j78L02k13j75J50J9o5o4j76J87J21j67K80
1993A19p7p6J11j58K58j00k82K18J98l62m9Q6N8K21j19j04O3n8J99J14l42R4J90
2016B02m67J17K88m80M43k39j68K29j18K60J93l25K39j79k6mn0L85l68L28m44
2037a84K39j2n1L5j16p0J57L1j60j3j5P9K17j34P4j17n6J44P8j13j26J2J06j8
2061a3j71J52Q8j51O0k5k0R4R2j1r0L0r5J58j83K26k87K06j70o5K48K9M6r5j99
2086a46J16k4L22j84j3o0Q7q9J34j38rJ05k18j01L62l02J67p3l81N94j1lj45l5
2110d5J69Q4O3J43n04j23J35J73j80o6O0J44l17N9K94Nk39J07j0L49l23J22j30
$$ plain form
2133 -30 147 184 131 -44 -83 164 -141 -164 -149 -2 22 -179 -134 -229 -226 52 -104 -127 99 218 -132 -276 -43 -137
2157 -137 120 -26 51 -24 -82 156 40 -33 -85 197 -67 84 -113 79 61 -33 -176 160 -200 -107 94 161 -54
2180 -54 -231 -118 98 44 -10 71 30 83 45 -178 87 141 -270 -326 131 195 -22 -217 85 106 202 116 -192 89
2204 89 0 -8 -139 -73 -46 -274 2 94 216 146 -245 110 -4 -6 -112 248 -40 66 202 37 281 -46 61
2227 61 46 -59 58 236 -75 -183 -160 59 -63 -130 -176 -224 201 165 -40 -221 147 120 27 -91 66 -10 -17 -21 203
2252 203 -219 24 -3 -249 281 -59 -4 -176 8 -10 22 -123 -11 -116 58 -229 138 -89 166 -32 -39 -176
2274 -176 39 -98 102 -167 73 -164 314 -24 117 361 -142 34 29 -79 -106 -165 5 -30 103 257 -87 217
2296 217 111 207 -135 74 66 23 49 142 -150 95 -244 159 -20 -89 -74 -74 26 -299 171 -144 -79 -10 13 59 -14
$$ packed form
2133c0J77L7n3j75l9K47l05k3J5J47K4k01M5r5LK78j56k3K26J19l50j44K33r4
2157a37K57j46P7p5n8K38j16p3n2K82k64J51j97J92j8r4j43L36l60R3K01O7k15
2180e4j77J13K16n4n4Q1m1N3l8k23K65N4m11n6M57O4k17j95L02K1R6q6l08K81
2204H9q9qj31O6K7k28K76R2J22p0l91L55j14kj06L60k88J06J36j65K44l27J07
2227F1j5j05J17J78l11j08K3K19j22o7m6m8M25l6k05j81L68k7r3j18J57p6pmK24
2252B03m22K43k7k46N30l40N5j72J84j8L2j45J12j05J74k87L67k27K55j98pj37
2274a76K15j37K00k69K40k37M78l38J41K44n03J76nj08k7n9J70l5J33J54l44L04
2296B17j06R6l42K09qm3K6R3k92K45l39M03j79o9J5%J00l25M70l15O5O9K3M6p3
$$ plain form
2321 -14 115 312 38 46 -53 -228 114 178 -13 58 10 -238 152 51 -185 111 -74 200 -81 96 366 82
2343 82 -106 94 100 -239 131 -234 59 -66 -57 205 -156 121 -134 126 212 160 184 -22 55 197 24 -34 -236
2366 -236 212 -51 -8 58 -183 -96 66 255 42 -323 57 288 143 84 141 168 -10 103 104 -29 -22 7 -120 -250
2390 -250 -25 165 258 53 158 -336 23 -23 71 -68 -240 -6 -9 245 -25 -9 288 238 165 41 106 -40 178
2413 178 -7 209 -3 0 -7 281 177 128 -33 -24 47 -67 246 -207 -76 -11 36 -25 -186 82 -99 -147 26 -262
2437 -262 202 -10 -7 216 135 161 54 3 -107 -131 80 -81 45 81 147 -6 131 25 38 84 25 -48 30 99 -198
2462 -198 -209 -195 118 130 -61 99 214 47 -63 2 -240 78 310 149 -47 -46 -87 116 -215 178 74 -143
2484 -143 -144 -274 -144 -107 92 -52 57 61 238 174 285 -94 264 238 -76 186 -146 153 53 81 -191 -244 136
$$ packed form
2321a4J29J97k74Qr9j75L42O4j91P1m8k48L90j01k36K96j85K74k81J77K70k84
2343H2j88K00Ol39L70l65K93j25RK62l61K77k55K60Q6n2K4k06P7J42j73n8k02
2366b36M48k63M3O6k41Q7J62J89k13l65L80K31j45n9N7K7j78J13Jj33PK9j27j30
2390b50K25J90R3k05J05m94L59m6R4j39j72K34lK54k70J6K97n0p3j24O5j46K18
2413A78j85K16k12LpK88j04m9j61RP1j14L13m53J31O5M7o1j61K68j81m8J73k88
2437b62M64k12LK23q1K6j07n1j10k4K11j61J26L6O6j53J37j06J3M6n9p3P8O9k97
2462a98j1J4L13J2j91J60J15j67j10O5k42L18K32j61j96Jm1K03l31L93j04k17
2484a43jj30J30L7J99j44J09MJ77o4J11l79L58k6l14K62l32K99j00K8k72n3L80
$$ plain form
2507 136 -97 -94 11 -38 230 -190 -191 10 -137 -131 104 -1 -284 32 -126 -21 -81 -82 197 8 56 -278 -53 160
2531 160 -11 11 50 80 89 110 116 -312 52 -97 91 24 43 -55 -56 -85 -41 239 201 257 -272 -85 -27 -125 106 115 -16
2558 -16 -114 95 61 175 10 51 119 9 369 -260 187 6 -27 204 -23 -114 -228 291 16 -28 -15 -70 -111 16
2582 16 126 -73 19 -167 58 3 264 52 -99 223 -77 -109 162 184 183 -95 273 -123 14 -46 121 5 -60
2605 -60 -42 198 285 124 85 43 28 -193 34 159 -323 -53 -56 -219 236 150 78 21 -35 233 125 61 -136 15
2629 15 86 -75 -184 54 201 135 -57 261 71 -275 196 -11 -31 44 84 75 -92 33 -150 -231 -54 -52 53 -263
2653 -263 365 -278 6 -52 -236 269 -218 307 153 -67 182 -44 -191 -33 29 153 -43 102 72 -110 -150
2674 -150 42 130 28 26 195 -82 44 83 -73 -258 25 229 -82 -11 -138 121 166 -12 -27 15 129 -42 37
$$ packed form
2507A36k33LJ05m9K68m20jK01j47OK35j05k83L16j58J05o0jK79j89M8l34K25K13
2531A60j71K2L9L0RK1Om28L64j49J88o7J9r8jk9M4K80l8N6n29J87N8r8K31Rj31
2558a6r8K09l4J14j65M1O8j10L60o29M47j81l3K31k27r1j14N19k75m4J3n5m1J27
2582A6J10j99R2j86K25n5K61k12j51L22l00l2K71K2jk78L68l96J37o0J67j16o5
2605f0J8K40Q7j61l9m2j5k21K27J25m82K70lj63M55q6p2n7n6K68j08o4j97J51
2629A5P1j61j09K38J47o6j92L18j90l46M71k07k0P5M0rj67J25j83q1J77KJ05l16
2653b63O28o43K84n8j84N05m87N25j54k20K49k26j47J58O2J24j96J45l0j82m0
2674a50J92Q8j02kJ69k77J26L9j56j85K83K04l11P1j27K59M5j78j5M2J14j71P9
$$ plain form
2697 37 30 32 109 142 8 -14 -47 16 329 88 -73 -59 121 33 -118 -226 -325 -143 71 -11 -58 -112 -10 -79 -64 19
2723 19 -158 64 -264 174 -29 -133 -33 27 -93 54 50 8 -28 -127 -151 -3 -1 28 -5 15 -114 -195 -98 165 238
2748 238 59 8 73 -10 -74 50 80 -125 -162 -70 125 -67 232 135 121 -2 167 -263 -237 -60 -28 -34 -113 35 -25
2773 -25 110 187 -158 221 -146 -95 12 -133 -141 -4 96 224 76 -122 147 129 7 134 -279 59 126 -1
2795 -1 56 40 25 7 303 248 146 -114 -101 5 93 -127 15 -27 167 -77 46 -122 292 80 141 75 -141 209
2819 209 148 -139 -23 316 -101 167 -255 110 -125 181 218 -153 116 37 66 -68 92 163 -198 83 90 -31
2841 -31 139 -147 89 -64 13 247 233 194 -136 201 -52 52 -102 -145 65 275 -19 88 -148 -37 43 -21
2863 -21 151 144 -152 -117 27 22 200 163 -120 -11 -148 -163 -116 222 -161 83 -69 -98 22 -240 17 41 52 -26
$$ packed form
2697C7pKP7L3j34k2l3O3L13k41j61J4J80q8j51j08r9J82K14q2m7n4J02o9J5Q3
2723A9j77K22l28M38k03j04J00O0j20J47mm2l6r9k4J48KK9l3K0j29q1R7K63P3
2748B38j79n1O5q3o4J24L0k05l7R2J95j92K99r7j4j23J69m30K6J77L2op9J48o0
2773b5J35P7l45L79l67N1J07j45qJ37J00J28j48j98K69j8j22J27m13L38O7j27
2795aN7j6j5j8K96n5j02k60J3J06Q8k20J42m2J94k44J23j68M14k12O1o6k16L50
2819B09o1k87J16L39m17K68m22L65k35L06L7l71K69p9K9j34J60P1l61K81Pj21
2841c1J70k86K36j53P7K34j4l9l30L37k53J04j54m3K10K10k94J07k36J11Q0o4
2863b1J72pk96L5J44nJ78l7k83J09j37j5M7L38l83K44j52k9J20k62K57K4J1p8
$$ plain form
2887 -26 -209 106 220 193 -110 89 95 -266 -14 230 -8 -135 -331 41 15 111 244 -63 24 18 57 -123 0
2910 0 48 119 1 189 -89 -261 143 96 54 -107 141 189 130 85 -242 54 150 33 -176 -296 140 59 129 -41
2934 -41 -293 111 31 37 17 -98 -62 -7 -218 -55 -104 69 132 77 -225 -81 -157 8 151 -71 155 -10 -109 39
2958 39 105 -82 -132 -53 146 159 86 57 117 315 -224 -70 36 11 28 345 -173 -411 161 -111 97 291 111
2981 111 -184 102 -98 64 -109 -156 187 -122 -104 260 68 95 113 -73 -385 -261 110 29 179 -51 -53 272
3003 272 90 -139 197 -134 -64 125 121 -16 -120 -128 394 6 -48 98 -63 -194 109 -19 28 -39 -78 -11 -68 -80
3027 -80 -84 -30 -119 -51 -10 279 11 101 204 -198 -349 41 -115 109 21 -73 -230 -14 137 -109 343 87 153 -160
3051 -160 -188 94 194 158 -62 48 -110 248 120 -128 -35 272 -101 -41 -48 -16 -86 -35 21 -95 -23 10 -21 122
$$ packed form
2887b6j83L15J14k7l03J99Ol61K52K44k38j27j96L72k6R6J33l07Q7oL9j80J23
2910@M8P1j18J88k78j72M04m7m2j61K48M8n9m5l27K96R6j17k09j20M36q1P0j70
2934d1k52M04q0Ok0j15L6N5k11J63m9J73O3n5l02J44p6J65J43k22K26j65r9J48
2958C9O6j87n0P9J99J3p3k9O0J98n39J54J06k5J7L17n18k38N72k72K08J94j80
2981A11k95K86k00J62j73m7L43l09J8L64j92K7J8j86l12J24L71q1J50k30kL25
3003B72j82k29L36l31P0J89mj37j04qN22l88n4J46j61j31L03j28M7o7l9O7n7j2
3027h0mN4q9O8M1K89k68R0J03m02j51L90j56K24q8r4j57K16J51k46M52k56O6l13
3051a60k8K82J00l6k20J10j58L58j28k48R3L07l73O0pL2p0N1N6j16P2L3l1J43
$$ plain form
3075 122 -340 49 -45 -104 -103 -233 -269 27 237 -340 -23 -237 -57 16 8 -285 -32 -79 -105 -75 112 250 388 -139
3099 -139 -17 116 -177 88 303 85 154 21 25 87 106 2 -80 58 -100 132 234 -79 -150 -200 277 -61 99
3122 99 23 22 -168 374 -6 54 -153 -43 -24 149 37 75 278 -100 140 -39 73 -81 214 -30 -168 -148 -227
3145 -227 309 55 112 -7 21 -125 -125 14 -156 108 19 412 92 -148 118 -63 -61 44 109 103 152 90 8 40 -76
3170 -76 -40 54 -61 -114 -81 -114 -1 -140 -178 161 152 134 -176 -15 31 -140 27 103 -50 -148 -32 -191 218 -191
3194 -191 -55 -119 10 6 -211 146 -13 -18 -73 -193 188 9 270 -129 -171 10 78 100 -27 -224 96 304 87
3217 87 66 -50 -121 194 -74 -118 98 139 71 107 34 -102 -90 -133 -113 -62 96 28 27 122 -88 -386 6 -26 171 227
3243 227 -43 136 -171 -128 -25 -44 93 -170 -400 128 163 -34 -36 258 -102 204 92 295 -17 -102 165 -88
$$ packed form
3075A22m62L89r4n9Jj30l6K96K10n77L17k14J80P3qk93K53m7k6L0J87J38J38n27
3099a39J22J33k93K65K15k18O9j33MO2J9j04q2J38j58K32J02l13p1n0M77l38J60
3122I9p6jj90N42l80O0k07J10J9J73j12L8K03l78K40j79J12j54K95k44j38K0p9
3145b27N36k54N7j19K8j46%J39j70K64q9L93l20k40K66j81KJ05O5oM9o2q2L2j16
3170g6L6R4j15n3L3l3J13j39l8L39rj8l10J61M6j71J67P6j53r8J16j59M09m09
3194a91J36o4J29mk17L57j59nn5j20L81j79K61l99m2J81O8K2j27j97L20K08k17
3217H7k1j16p1L15k68m4K16M1o8L6p3j36J2m3K0N1J58o8jR5k10k98L92l2J97N6
3243B27k70J79l07M3J03j9J37k63k30N28L5j97kK94l60L06j12K03l12q5K67k53
$$ plain form
3265 -88 -56 -3 -136 336 423 187 -30 355 77 -175 83 152 465 -158 -27 51 -141 5 122 137 271 75
3287 75 12 -32 -143 -118 -152 -87 42 51 201 -64 58 -20 -27 -74 -5 -122 -24 39 90 -390 -225 -12 159 -123 -35 50
3313 50 -81 190 -240 -56 -130 -107 191 175 221 115 66 195 103 172 23 -5 122 120 238 22 99 -18 -122 -141
3337 -141 265 168 35 -123 -30 -165 169 -36 88 83 277 143 -84 149 -257 -204 -102 85 -201 -113 -210 448
3359 448 -28 -6 -35 -221 -111 -28 109 164 -128 -30 -88 48 30 -295 67 351 130 153 90 -75 -3 -170 116
3382 116 -158 -224 88 -147 46 83 -13 66 -128 397 5 -75 -153 -96 76 -136 -59 -235 -211 97 287 48 -144
3405 -144 -85 51 -236 225 43 -24 -373 10 -39 54 221 -255 -143 18 234 110 -10 -185 102 -54 -57 -188
3427 -188 -7 -392 -51 -210 -215 26 234 84 -109 -73 104 108 -176 317 -103 -30 -119 -280 55 1 -161 -289 181
$$ packed form
3265h8L2N3j33M72Q7k36k17L85k78k52K58O9L13o23J31P8j92J46J17J5J34j96
3287G5o3m4j11K5l4O5J29RJ50k65J22p8pm7O9j17R8O3N1m80J65K13J71k82Q8Q5
3313E0j31K71m30J84p4K3K98j6M6j06m9J29r2O9j49k8J27kJ18k16P7j17j04j9
3337a41M06r7j33j58R3j35L34k05J24nJ94j34k27K33m06N3J02J87k86Q8r7O58
3359D48m76K2k9j86J10Q3J37N5k92R8n8J36j8l25L62K84k21K3o3j65P2j67K86
3382A16k74o6L12k35J93L7r6P9j94N25l92q0p8N7J72k12P7j76K4L08J90k39j92
3405a44N9J36k87M61j82o7l49L83m9R3J67m76J12J61K16j24j20j75K87j56lj31
3427a88J81l85L41j59nK41K08j50j93L6J77Mk84M93m20P3q9j61L35n4j62j28M70
$$ plain form
3450 181 -69 192 215 -131 -28 -22 -31 -117 -49 42 34 75 164 140 126 24 -47 -198 -70 -84 -52 42 121 88 -72 -5 125
3477 125 -153 -141 196 -144 110 -62 138 -6 112 -129 -51 -97 -123 55 5 77 20 -43 75 125 150 230 -78 -23
3501 -23 8 29 160 -9 127 -47 -129 -50 207 -29 51 -334 -85 -44 119 -276 219 -55 -45 130 25 175 -20
3524 -20 -117 2 54 -40 -20 140 184 36 59 -12 34 -113 215 -97 92 -9 70 -30 -104 173 217 -95 -94 104 54
3549 54 156 -33 336 -99 -77 90 79 -257 -121 -266 -123 -183 -20 -128 -135 -48 121 69 -94 40 -133 175 -275
3572 -275 184 -339 -77 73 144 -169 -205 -107 -124 2 62 -113 58 -159 45 8 35 65 -174 -70 23 -61 -121 -145
3596 -145 -69 -154 -55 -80 -233 94 260 -191 -201 198 116 30 151 -59 -102 185 186 115 -158 -108 -188 -137 -79 -128 102
3621 102 -64 488 88 57 34 -242 -198 20 113 -168 34 144 91 -29 130 61 -297 164 103 -123 181 24
$$ packed form
3450A81k50K61K3l46J03Orq6O8R1qM1Q9k4j4j02p1j51J28j4L2R4P9l3j60O7J30
3477A25k78J2L37l40K54j72K00j44J18k41P8m6k6J78n0P2n7o3J18N0K5Q0l08N5
3501b3L1K1J31j69J36j74q2P9K57k36Q0l85K49M1J63l95M95k74J0J75j05J50j95
3524b0r7J19N2r4K0J60M4j48K3p1M6j47L28l12J89j01P9j00p4K77M4l12JJ98n0
3549E4J02j89L69m35K2J67j1l36J36j45J43o0J63j08pQ7J69n2j63J34j73L08m50
3572b75M59n23K62J50P1l13l6R8j7J26O0j75J71k17K04l7K7L0k39J04R3q4o0k4
3596a45P6q5R9k5j53L27J66m51j0L99q2q6J21k10m3K87Jp1k73N0q0N1N8m9K30
3621A02j66N52m00l1k3k76M4K18R3k81K02J10n3j20J59o9l58M61o1k26L04j57
$$ plain form
3643 24 161 117 -116 -180 -11 -22 139 -173 -334 -115 25 32 257 323 -265 -308 42 -94 -56 -194 92 113 40 287
3667 287 50 -28 -215 27 -208 8 94 135 -27 18 -107 30 -16 24 21 88 31 -27 30 66 115 -72 -170 -300 187
3692 187 -120 187 -39 160 24 -175 -31 165 -293 -32 -32 87 365 -61 233 39 184 26 -50 -353 -119
3713 -119 25 -124 -36 14 -72 -106 148 121 -298 -136 -174 -30 25 -64 113 67 149 218 -48 -22 -238 0 -27 -58 -258
3738 -258 -62 -76 -140 -100 -186 62 -174 -184 -247 -122 -3 3 54 59 330 -116 209 -44 -86 31 129 -180 -55 7 48
3763 48 246 71 40 278 183 -312 70 -123 -101 139 253 -49 86 -4 -93 94 94 -77 196 221 -162 84 66
3786 66 -17 -24 95 17 -170 -5 -42 -201 35 183 -12 -13 -92 -272 183 -7 99 -110 -6 22 235 281 105 -56
3810 -56 -92 -121 147 -231 189 94 -92 7 13 -26 -102 28 188 28 227 50 -336 -94 -395 -19 -208 2 -29
$$ packed form
3643B4J37m4k33o4J69j1J61l12j61K19J40PK25O6n88m3L50j36L8j38K86K1p3K47
3667B87k37p8j87K42k35K16Q6M1j62M5j25J37m6M0lO7n7n8N7L6M9j87r8j30M87
3692A87l07L07k26J99j36j99J44J96m58K61%J19K78m26K94j94J45j58p6l03K34
3713a19J44j49Q8N0q6l4K54k7m19J62l8J44N5q9J77m6Q2O9k66K6k16K38k7l1k00
3738b58J96j4o4M0q6K48k36j0o3J25J19ON1NK71m46L25k53m2J17R8l09J25O2M1
3763D8J98j75l1K38r5m95L82j93K2K40J14l02J35r0q9J87%j71K73K5l83K46j8
3786F6q3pJ19p8j87J65l7j59K36J48j95jp9j80M55j90J06k09J04K8K13M6j76j61
3810e6l6k9K68l78M20r5j86R9Ol9p6J30J60j60J99j77l86K42l01L76j89K10l1
$$ plain form
3833 -29 -148 -316 109 13 162 97 95 -58 73 -173 -5 -13 10 -256 -165 310 509 88 -43 17 -198 28 124 209
3857 209 28 -7 -31 -10 -154 -153 -44 99 153 -180 114 298 -64 217 -41 15 328 -74 -46 -121 -198 15 -30 -79
3881 -79 87 -60 -165 5 62 31 9 44 -86 -46 -10 11 8 0 68 -49 -43 232 -16 -98 13 -72 -16 -97 -25 117 -71
3908 -71 -187 -7 45 11 -180 -32 181 -20 -34 67 -12 28 -290 12 157 -335 234 7 7 275 76 118 -150
3931 -150 -453 -22 -97 -74 -193 -54 182 49 466 97 239 -254 77 -27 202 -195 -245 -109 -54 103 9 206
3953 206 -26 -44 -88 -16 -260 297 64 -79 -116 39 -178 -148 -6 137 157 -12 352 -254 43 -119 147 56
3975 56 -188 -319 110 7 -193 17 -44 -146 -48 -134 -53 68 -187 179 138 -191 -48 -92 133 28 -113 -30 34
3998 34 1 219 157 25 180 238 50 -11 -322 -34 -16 -44 -16 -122 88 294 104 -137 241 244 36 -124 421
$$ packed form
3833b9j19j68M25r6J49o5kj53J31k46J68qK3k66R1M75J99m21j31O0k15K26R6Q5
3857B09j81l5k4K1j44JJ09J43N4l33K94J84l62K81k58N6L13m02K8p5p7K13m5m9
3881g9J66j47j05J70N7l1k2L5j30M0L6K1lqO8j17OK75k48q2J11q5N6q1P2J42j88
3908g1j16J80N2l4j91J48K13k01j4J01p9M0l18L02J45m92N69k27%K68j99M2k68
3931a50l03M31p5K3j19J39K36j33M17l69J42m93L31j04K29l97n0J36N5J57r4J97
3953B06k32j8m4P2k44N57k33j43l7J55k17L0J42J43K0j69L64o06K97j62K66r1
3975E6k44j31M29j03k00K10o1j02R8q6Q1J21k55L66m1l29J43m4K25j05j41Q3O4
3998C4l3K18o2j32J55N8j88o1l11K88J8k8K8j06K10K06j90k41L78Lk08j60N45
$$ plain form
4021 421 113 199 14 34 216 206 129 -13 96 1 90 132 244 -28 -148 -53 -207 2 -23 88 -78 265 -158
4044 -158 100 -58 24 162 16 43 -24 -26 -4 137 146 -123 -330 -181 159 128 15 -33 27 -34 -179 42 -293 -131
4068 -131 -115 122 140 120 118 8 120 191 -111 65 95 188 -4 145 160 260 -68 97 23 -282 41 58 -5 -192
4092 -192 -10 155 41 324 212 -6 130 -78 -26 -161 -115 -180 -156 146 -7 -95 152 197 96 -51 -41 52 -74
4115 -74 -61 334 219 -134 98 14 -30 -101 -61 55 -128 -130 79 305 4 65 -147 -72 101 -161 -84 191 71 -142
4139 -142 217 -191 -132 63 96 -55 -46 -100 -218 17 -202 -95 141 -44 -8 -86 -259 -104 80 -131 -138 -203 58
4162 58 -17 110 -292 -64 209 -28 127 -48 -132 93 269 -16 152 -87 42 -175 -193 167 77 41 87 139 194
4185 194 -3 -123 -98 -185 58 178 -141 36 -138 455 115 -6 -189 151 112 -141 194 -238 97 -162 117
$$ packed form
4021D21l08Q6j85K0J82j0p7j42J09r5Q9M2J12k72j20R5j54K09k5J11j66L43m23
4044a58K58j58Q2J38j46K7o7kK2J41Rk69k07J49L40l1j13m8O0o1j45K21l35J62
4068a31J6K37J8k0kj10J12P1l02J76L0R3j92J49J5J00l28J65p4l05L23J7o3j87
4092a92J82J65j14K83j12k18J36k08N2j35M6o5K4L02j53q8K47M5j01j47J0R3j26
4115g4J3L95j15l53K32q4m4p1M0J16j83kK09K26l01O1k12P5J73k62P7K75j20k13
4139a42L59m08N9J95L3j51Rn4j18K35k19J07K36j85L6p8j73J55J84k11po5K61
4162E8p5J27m02K28K73k37J55j75q4K25J76k85J68k39J29k17j8L60r0l6M6N2N5
4185A94j97j20K5q7K43J20l19J77j74N93l40j21j83L40l9k53L35m32L35k59K79
$$ plain form
4206 117 118 134 33 92 29 -44 132 67 48 134 152 341 262 26 -118 -3 -145 28 213 -21 -141 89 143 567
4230 567 -165 -68 106 -177 115 -180 -188 -133 -242 15 64 11 112 90 -1 -53 -141 95 215 -48 -132 -30 49 5
4254 5 46 -64 121 120 138 182 -34 296 -8 77 -1 -71 303 -184 74 -158 200 205 219 -15 -144 -126 -173 -181 16 -199
4280 -199 -270 99 -44 -40 10 -26 76 72 48 -63 57 -124 -115 99 91 70 22 -40 -102 20 91 -61 21 -173 -338 72
4306 72 132 248 16 45 99 -292 65 140 95 -18 -16 -95 55 -97 3 -158 -45 -230 -98 -153 217 6 304
4329 304 61 -204 70 95 -29 -61 25 180 72 102 130 -73 -71 -128 108 95 24 9 35 166 35 1 -19 -27 8 100
4355 100 -323 -11 -144 180 -63 -207 158 -79 -53 46 -253 123 -11 52 -51 -85 390 17 221 -80 42
4376 42 -6 -261 -184 -62 45 -20 -54 -27 -153 49 -181 -61 -122 -134 206 -196 22 53 150 -98 96 -5 -98 66
$$ packed form
4206A17JJ6j01N9o3p3J76o5j9Q6J8J89p9k36j44J15j42J73J85k34j20K30N4M24
4230E67p32R7J74k83K92k95qN5j09K57M9n3J01k2r1n2q8K36J20k63q4J02P9m4
4254EM1j10J85jJ8M4k16L30l04Q5p8p0L74m87K58k32L58NJ4k34j29J8m7qJ97k15
4280a99p1L69j43MN0l6J02mk4j11J20j81RK14qk1m8o2o2J22P1j52Q2j94j65M10
4306G2O0J16k32K9N4l91L57P5m5j13Kp9J50j52J00j61J13j85J32n5L70k11K98
4329C04k43k65K74K5j24l2Q6J55j08L0K8k03Kn7K36j3p1j5K6J31j31l4k0qL5R2
4355A00m23L12j33L24k43j44L65k37K6R9k99L76j34O3j03l4M75l73K04l01J22
4376D2m8k55P7J22J07o5l4K7j26K02k30J20o1j2L40m02K18L1R7k48J94j01r3J64
$$ plain form
4400 66 62 -53 -116 -17 185 -127 75 -158 -36 120 212 48 -80 241 -92 122 -37 203 -105 -34 -62 -12 -147
4423 -147 -69 23 75 6 -24 -49 -29 171 -212 -99 207 -107 345 -8 -206 18 -70 315 -35 -14 165 -235 307
4446 307 135 -165 -111 73 206 -126 -57 -96 -148 -63 67 -88 -238 -72 145 -29 -39 -105 316 -16 13 0 126
4469 126 -77 353 183 -109 65 120 78 45 -113 115 211 -101 -130 55 91 236 184 33 137 -120 30 1 -245
4492 -245 171 135 -440 -70 155 -155 -39 3 -52 -71 42 112 -49 56 -85 59 -2 -119 -263 94 -150 -236
4514 -236 110 336 -184 -1 269 86 -198 -49 65 -259 -111 123 15 -34 -61 131 -73 -94 96 64 53 72
4536 72 8 174 -84 -103 -122 76 164 -222 95 109 -231 133 137 -36 202 203 209 91 83 -108 9 143 16 -124 185
4561 185 172 149 -98 209 -24 119 26 -21 40 74 61 -114 8 14 361 233 315 -54 19 -34 67 32 -81 89
$$ packed form
4400F6mj15o3R9K02l12K02k33J22J56R2j64j28L21l33K14j59K40l08P1k8N0j35
4423a47P8R2N2o9l0k5K0K00l83J13L06l14M52l53j98K24q8L85l50K1J79m00N42
4446C07j72l00N4J84J33l32O9l9n2Q5J30j55j50J66K17j74j0o6M21l32K9j3J26
4469A26k03M30j70k92J74N5m2l3j58K28R6l12k9J85L6J45n2j51J04k57J50k9k46
4492b45M16l6n75L70K25l10J16M2n5j9J13P0j61J05j41J44o1j17j44L57k44q6
4514b36L46K26n20J83K70j83k84J49J14l24J48K34j08m9k7J92k04k1J90l2j1J9
4536G2o4J66k58j9j9J98Q8l86L17J4l40L64Mj73K38JOj18qj91J17J34j27j40L09
4561A85j3k3k47L07k33J43r3m7O1L4j3j75J22OL47j28Q2l69P3n3J01l5j13J70
$$ plain form
4585 89 55 -64 68 -15 71 110 -85 -151 248 -103 108 173 -144 63 2 -119 210 -74 263 86 -205 16 -44
4608 -44 -53 80 -18 -103 216 40 -240 99 111 20 198 55 -9 280 -27 -109 -5 -91 -170 23 93 129 88 -177 163
4633 163 -205 244 169 -298 -36 15 88 7 -211 -59 -95 -132 200 -67 -211 -155 -186 -250 -261 39 -460 -50 204
4656 204 152 181 -96 15 -332 13 46 20 -16 50 272 -197 -116 -119 277 -181 55 119 19 90 -37 -114 -144 -58 -93
4681 -93 56 137 202 -67 -40 -156 -21 2 105 -87 -115 -12 -120 69 108 -199 -78 -67 112 -160 159 -205 3
4704 3 -61 177 -165 -339 -97 82 -70 -239 -16 -78 73 -87 17 -7 77 -185 -120 286 -55 -222 83 -73
4726 -73 -72 -107 59 4 112 83 87 20 73 51 0 -196 -51 16 -44 40 45 84 -10 -132 -36 -132 -120 159 165 52 53 -82 103
4755 103 123 -300 -59 158 -31 -307 77 -51 -10 -149 63 54 63 40 -95 48 -130 15 243 239 -185 36 76
$$ packed form
4585H9l4j19J32q3Q6L9j95o6L99l51K11O5l17K07o1j21L29k84L37j77k91K21o0
4608d4rJ33r8q5L19j76k80L39J2r1J78j43o4K89l07q2J04q6p9J93P0L6m1k65L40
4633A63l68M49p5m67K62N1P3q1k18J52l6l7L32k67j44N6l1o4j1L00m99M10K54
4656B04n2K9k77J11l47L45L3k6l6O6K22m69Q1lL96m58K36O4j00P1j27p7l0Q6l5
4681i3J49Q1O5k69K7j16J35K3J03j92k8J03j08J89L9l07J21J1J79k72L19l64K08
4704Co4K38l42j74K42J79j52j69K23o2J51j60J04k4Q4k62O5M06l41j67L05j56
4726g3Jl5J66n5J08k9Mo7N3k2n1j96J45O7o0Q4NL9r4j22R6r6J2K79Oj13Jj35J85
4755A03K0m23K41K17j89k76L84j28M1j39K12rRk3j35J43j78J45K28mm24K21M0
$$ plain form
4778 76 0 -93 131 -103 81 158 -72 -57 277 -123 -410 -6 -77 198 -37 69 -106 117 199 -78 224 88
4800 88 -54 198 -33 104 -35 -102 -112 177 -191 67 88 67 101 76 157 -198 -202 -64 208 179 6 113 -164 294
4824 294 211 189 -2 -27 243 -136 -61 -151 11 291 -190 -63 -195 66 -57 -60 -193 -87 22 -47 -30 101 -182
4847 -182 -218 -244 -3 52 83 -11 190 14 5 -38 -37 1 147 -73 -3 -400 140 -89 -74 208 30 115 -243 -68 6
4872 6 33 -184 -107 226 124 165 -71 40 -56 -102 35 84 163 -15 -233 -205 -131 -132 -176 177 -168 -140 140 25 -62
4897 -62 -79 -94 163 132 -141 163 -3 -14 44 -23 -136 104 99 103 -33 134 -201 213 100 8 306 165 106 213
4921 213 99 29 -65 -226 -132 -109 -79 9 41 -8 95 115 -134 138 62 180 -24 56 -219 179 90 -100 155 -267
4945 -267 24 -109 -365 151 74 -3 303 -164 -24 -207 12 52 -30 -50 70 47 -395 67 96 -2 -36 -225 123
$$ packed form
4778G6p6r3K24k34J84P7k30J5L34m00k87M04p1K75k35J06j75K23Q2k77L02j36
4800H8j42K52k31J37j39o7j0K89l68K58K1k1L4k5Q1l55mJ38K72k9j73J07k77M58
4824B94q3k2j91k5K70l79P5r0J62K80m81J27j32K61j23lj33J06J09o9J7J31k83
4847a82l6k6K41N5L1r4K01j76rm3JL8J46k20P0l97N40k29J5K82j78Q5l58J75P4
4872FK7k17P7L33j02M1k36J11r6m6J37M9P9j78k18K8P4jm4L53l45K8K80j15q7
4897f2j7j5K57l1k73L04j66j1N8o7j13K40nMj36J67l35M14j13r2K98j41n9J07
4921B13j14p0r4j61R4K3L0Q8L2m9J03K0k49K72p6J18k04Q0k75L98q9j90K55m22
4945b67K91j33k56N16p7p7L06m67J40j83K19M0q2k0J20k3m42M62K9r8l4j89L48
$$ plain form
4968 123 -128 -35 376 -114 102 0 140 213 -205 47 -14 -177 48 8 301 138 -21 98 160 4 -97 -153
4990 -153 32 -10 27 -318 221 83 72 61 51 -20 -22 83 132 124 -33 -79 140 259 -145 -419 -162 -47 98 -56
5014 -56 -146 52 -31 240 15 70 -277 19 -275 -244 45 -141 -87 234 143 7 115 5 -57 319 -101 -101 -106 395
5038 395 58 22 -193 -155 -133 -88 178 43 -129 479 -165 -177 43 -274 -58 62 -126 -88 -14 -51 106 -152 24
5061 24 82 60 116 -251 -33 140 90 -68 152 15 207 20 259 67 -194 200 105 234 -220 -45 20 -201
5083 -201 -12 56 66 -46 -91 193 78 379 61 -23 45 17 174 -163 80 205 -103 154 156 175 187 77 -34
5106 -34 -140 130 59 12 71 98 -57 -367 -41 -215 81 -215 35 -128 77 -65 -86 192 -63 -88 -154 429 286
5129 286 -199 -28 183 60 171 103 215 102 -100 -8 34 228 -14 56 -56 -227 -42 -83 104 -38 -209 -8
$$ packed form
4968A23k51R3M11m90K16j02J40P3m18K52o1j63K25m0K93j63j59J19O2j56j01n6
4990a53J85m2L7l45N39j38j1j1j0p1kJ05M9qj57m6K19J19m04k74K57J15J45j54
5014e6r0J98q3K71k25N5l47K96k94L1K89j86N4L21r1j36J08j10o2L76m20%nN01
5038C95l37l6k15L8K2M5K66j35j72O08o44j2K20l17K16J20j88L8P4l7J57k58J76
5061B4N8k2N6l67K18J73n0j58K20j37J92j87K39j92k61L94r5J29m54J75O5k21
5083b01J89O8J0j12m5K84j15L01l18q4O8k8J57l37K43J25l08K57KJ9J2j10j11
5106c4j06K70p1m7N9K7j55l10L26j74K96k96K50j63K05j42k1K78k55k5o6N83j43
5129B86m85J71K11j23J11o8J12j13k02R2M2J94k42P0j12j71J85m1J87j42j71K01
$$ plain form
5151 -8 -50 96 128 -61 113 123 81 -67 -120 -54 303 22 253 -14 1 162 -398 -91 -199 -27 85 -173 -218
5174 -218 294 226 -8 -44 -271 132 -50 125 16 44 141 223 95 -68 43 -252 -51 9 74 -19 10 -50 -78 -167
5198 -167 -131 -254 60 164 217 143 72 227 152 -44 26 -30 131 285 -29 1 256 -21 78 16 -162 128 37 100
5222 100 2 164 45 -145 -46 305 5 -95 -288 1 199 -24 113 2 168 -31 -119 -159 132 99 25 102
5244 102 -182 -38 31 27 47 167 106 279 170 302 -116 -3 354 124 11 -106 -174 121 -128 140 240 51
5266 51 225 -319 64 9 -14 -375 -54 127 212 -266 -96 40 -8 -315 -17 -70 1 -62 40 120 -474 56 91
5289 91 536 -115 -61 33 229 -111 -94 80 -8 -210 -72 -84 -317 260 -356 -136 -134 35 102 217 -229 209 -41
5312 -41 45 112 159 -124 184 -128 -211 -278 -52 -114 -219 -38 128 -106 160 -141 46 35 -450 64 -40 -273 176
$$ packed form
5151hm2J46L2j89J74J0m2j48n3O6L57k81K31k67J5J61n60L07j08J72J12k58m5
5174b18N12o8k34l6k27M03j82J75j09K8R7Q2j28j63J11k95K01O0O5r3K9o0k8q9
5198a67L6j23L14J04N3p4p1J55p5j96P0n6J61J54l14L0K55k77R9o2j78K90r1O3
5222A00r8J62j19j90R9L51l00j00j93K89J98k23J37j11J66j99q8m0K91l3p4P7
5244A02k84J44O9mK0J20o1J73j09J32m18J13L57k30j13j17o8K95k49K68J00j89
5266E1J74n44L83n5k3l61L21J81Q5m78J70J36m8l07K98n3P1o3J02Q0n94N30L5
5289I1M45o51N4R4J96l40J7J74q8k02J38j2k33N77o16K20KJ69O7J15m46M38k50
5312d1Q6O7M7k83L08l12q3o7K26o2j05J81J66k34K66l01J87j1m85N14j04k33M49
$$ plain form
5335 176 381 -159 -2 -49 -204 -12 167 -54 -27 60 333 63 -259 -290 119 -105 -112 2 96 -158 -194 33 69
5358 69 -6 258 101 175 121 147 -6 -81 117 -320 19 86 -105 -109 -21 113 25 40 -51 175 27 279 31 -36 129
5383 129 158 73 61 87 -76 -148 -109 -69 221 363 217 240 214 -107 184 -112 24 10 24 -144 69 -107 -134 3
5407 3 -224 -27 -14 380 -51 155 143 204 -23 177 63 -324 -121 127 77 -193 -54 183 24 -143 19 139
5429 139 228 -28 -57 -176 9 -69 201 303 12 -146 119 -152 158 51 -263 -108 2 -27 76 -19 -107 -36
5451 -36 -111 -44 -29 174 75 186 284 -52 74 -8 11 -103 -28 101 -54 -165 97 -14 -74 -43 80 135 4 150
5475 150 152 -29 -135 36 6 -130 133 25 87 48 -56 -32 44 50 198 310 52 -137 -130 52 128 77 49 169 113
5500 113 -143 155 0 -310 77 -226 -111 203 -177 122 183 -128 -400 60 65 31 25 37 -98 59 80 99 130
$$ packed form
5335A76K05n40J57m7j55J92J79k21K7Q7K73k70l22l1M09k24pJ14R4k54l6K27L6
5358F9p5K64j57P4n4K6j53p5J98m37L39O7j91mQ8J34q8J5r1K26j48K52k48o7J65
5383A29K9q5j2K6j63p2L9M0K90J42j46K3k6l21K91k96J36j4J4j68K13j76k7J37
5407Ck27J97J3L94m31K06j2O1k27K00j14l87K03K48n0k70J39K37j59j67J62J20
5429A39Q9k56k9j19J85p8K70J02k91j58K65k71L10j07l14J55J10k9J03r5q8P1
5451c6p5O7J5K03r9J11R8l36J26q2J9j14P5J29j55j11K62j11o0L1J23N5j31J46
5475A50Kj81j06J71l0j36K63j08O2l9j04K4P6OJ48J12k58j89PJ82P6n1k8J20n6
5500A13k56K98j55l10L87l03J15L14l80K99O1l11k72M60Nl4oJ2j35J57K1J9L1
$$ plain form
5523 130 26 236 205 -15 88 184 140 25 209 -262 -32 166 4 327 91 -117 110 35 -10 -81 36 -33
5545 -33 154 141 -97 173 -53 -324 -81 -55 -40 -94 10 71 -21 -233 163 6 197 -231 -37 65 -55 202
5567 202 -117 85 -52 -94 -176 59 -204 -176 -68 97 -103 11 -212 -29 -39 65 147 -190 -44 89 20 244
5589 244 -53 -66 -135 -173 78 -132 307 49 6 -46 275 -278 -28 -231 142 18 -92 -95 -133 91 -10 -175 13
5612 13 120 -67 82 -220 198 -292 148 130 72 -32 47 -153 39 -59 -200 -108 175 -111 -41 -259 -76 131
5634 131 173 198 -303 -103 -131 -20 251 106 70 171 -137 -113 -198 25 62 -56 19 203 197 199 -29 -122 142 186 107
5659 107 205 116 35 103 8 12 -89 66 -504 -28 -83 88 75 56 24 -28 -78 6 147 -19 0 63 71 174 122 -160
5685 -160 72 -120 -74 -187 -220 -149 16 -104 -45 10 29 -148 -26 121 -77 -153 -91 321 -45 112 -98 -28 -91
$$ packed form
5523A30j04K10l1k20J03R6m4j15J84m71K30J98j62L23k36k08K27p5m5p1J17o9
5545c3J87j3k38K70k26k71K43K6J5n4J04O1r2k12L96j57J91m28J94J02j20K57
5567B02l19K02j37m2q2K35k63K8J08J65k00J14k23J83j0J04Q2l37J46J33o9K24
5589B44k97j3o9l8K51k10M39k58m3n2L21n53K50k03L73j24j10ll8K24j01j65J88
5612A3J07j87J49l02M18m90M40j8n8j04P9k00J92r8j41R2K83k86P0k18J83K07
5634A31M2K5n01K00k8J11K71j45l6J01l08K4q5K23L7j18P5J84oKk28r3K64M4p9
5659A07R8q9q1O8r5Mj01J55n70M76n5J71j3j9l2n2n0Q4J41j66J9O3QJ03n2k82
5685a60K32j92M6j13l3P1J65j20N9N5J9j77J22J47j98p6O2M12l66J57k10P0o3
$$ plain form
5708 -91 -137 -4 47 4 234 11 4 19 -65 185 -38 -10 -152 -48 3 -164 165 -220 178 84 45 127 -109 -163 36
5733 36 -29 155 84 -73 -220 40 26 7 311 -229 -6 220 -43 -485 126 234 -72 41 -138 -38 -293 -155
5755 -155 118 96 88 28 -118 -5 -315 34 98 -106 327 -77 -57 97 -8 -26 50 15 7 34 -22 15 -58 56 -34
5780 -34 -228 98 102 -44 -231 -105 36 -64 128 9 134 -135 113 -79 -221 -92 -127 111 50 -142 -128 -330
5802 -330 -116 -14 -111 45 6 -92 168 67 -363 69 -442 51 143 -141 -275 75 53 -17 -96 -63 41 124 62
5825 62 -34 125 207 257 97 169 14 201 -239 -149 -109 4 32 69 -209 -159 -70 8 39 -39 -186 -290 107 22 101
5850 101 78 227 130 -45 237 -88 -122 -115 161 65 148 103 144 -51 -133 -70 -170 -23 -33 85 153 -184 -90 -184 -279
5875 -279 -102 -140 103 -27 30 41 -13 -461 -160 302 44 -173 10 287 -47 -286 -209 -228 18 170 332 -18
$$ packed form
5708i1m6J33N1m3K30k23pJ5q4K50k23K8j42J04N1j67L29l85L98r4l9Q2k36n4J99
5733C6o5J84p1j57j47K60j4j9L04n40K23K26k63m42O11J08l06J13j79J00k55J38
5755a55K73k2qo0j46J13l10L49O4k04M33m04K0J54j05j8P6l5qK7n6L7p3J14r0
5780c4j94L26Mj46j87J26J41j00J92j19J25k69K48j92j42J29l5K38o1j92J4k02
5802c30K14J02r7J56l9r8K60j01m30M32n11M93R2k84j34L50k2p0p9L3J04Q3o2
5825F2r6J59Q2N0j60P2j55J87m40R0M0J13K8L7k78N0Q9P8L1p8j47j04L97q5P9
5850A01k3J49r7j75K82l25l4PK76r6Q3m5M1j95q2O3j00J47j0J18O8l37R4r4r5
5875b79J77l8K43j30N7J1n4m48L01M62k58k17J83K77l34k39P7j9K46J52J62l50
$$ plain form
5897 -18 87 90 272 -230 67 104 -113 0 -35 -73 -81 -168 97 -124 239 387 -2 -25 -208 -160 -91 -112 -16 -194 -182
5922 -182 -123 68 -84 -82 57 70 269 -23 -125 233 -133 -46 92 -414 28 173 -14 125 138 -70 211 117
5944 117 207 42 120 170 7 -318 -99 -85 130 43 75 -173 155 138 -111 24 142 55 -192 378 -25 -255 268
5967 268 -295 248 78 -92 -63 333 -64 66 -146 176 -16 -262 154 -211 99 95 -119 -121 -3 106 -115 29
5989 29 127 337 61 -205 375 8 -133 53 -199 -76 108 -164 -40 -26 -18 -5 -54 -85 -55 157 -132 -6 -182
6012 -182 55 107 -77 -24 302 309 196 98 -231 -108 -66 96 -153 85 1 -146 -291 203 127 68 267 -119 -85
6035 -85 168 -43 12 -40 10 62 -210 56 -131 -179 -21 94 117 102 213 -433 -120 -97 55 182 -16 -33 -163
6058 -163 -29 -5 242 180 -108 64 -192 27 -208 188 -155 225 -251 126 62 -51 154 -91 191 40 181
$$ packed form
5897a8J05LJ82n02K97L7k17J13l5l8qq7K65k21L63J48l89k3j83M8O9k1R6j78J2
5922a82N9J91j52KJ39J3J99k92j02L58l66Q7J38n06M42J45j87J39J3k08K81r4
5944A17R0j65P8N0j63l25K19J4K15q7L2k48L28j7k49J35J18q7k47N70m03k30N23
5967B68n63N43j70j70K9L96l97J30k12L22j92k46M16l65L10mk14kJ18J09k21J44
5989B9R8K10k76k66N80l67j41J86k52J23J84k72J24J4QJ3m9l1L0K12k89J26j76
6012a82K37N2j84N3L26Pj13r8l29J23M2J62k49K38q4j47j45M94p6n9J99l86L4
6035h5K53k11N5n2N0N2k72K66j87m8J58J15K3j5J11o46L13K3J52J27j98j7j30
6058a63J34K4K47o2k88J72k56K19k35L96l43L80m76L77o4j13K05k45K82j51J41
$$ plain form
6079 181 32 -119 34 -92 -80 77 308 169 81 -77 -19 -39 81 12 -203 226 -148 46 -160 49 102 -5
6101 -5 -74 -239 84 -128 -168 -37 -57 11 -121 256 -28 -29 -103 -42 -26 -65 3 225 357 -39 -250 -21 -242 -2
6125 -2 -328 -132 11 31 21 -162 283 -67 68 -173 -91 -82 -23 -36 -180 -10 78 -133 -175 -129 -188 206 -181 -157 -75
6150 -75 -280 128 77 -21 -15 -177 63 362 86 -22 -203 -55 -100 190 -89 -73 -43 -115 -11 163 -121 276 69
6173 69 151 -167 121 219 27 -31 -75 5 -68 -119 -143 -63 -181 -176 -97 -58 114 12 7 -99 -96 -61 3 5 -207 260 -114
6200 -114 130 -89 -365 -144 185 -420 -73 -30 -54 -114 -73 2 -32 -44 274 -95 95 91 -47 -86 97 78 -62 -70
6224 -70 -79 143 110 -46 237 7 255 46 -159 -75 -229 -187 -105 139 -234 -50 -189 -174 -229 0 -266 335 -60
6247 -60 -207 -62 -26 -96 -79 -64 -139 -7 -11 144 -10 -66 -152 73 -34 -106 -273 183 241 11 134 361 -91 -298
$$ packed form
6079A81j49j51J53j26J2J57K31j39q8j58N8k0J20o9k15M29l74J94k06K09N3j07
6101eo9j65L23k12m0J31k0O8j32L77k84jp4O1J6l9O8K22J32l96k11K29k21K40
6125bl26J96J43K0j0j83M45l50J35k41Q2RN9j3j44J70Q8k11m2M6n9L94l87K4Q2
6150g5k05M08n1r8Oj62K40K99k76j08j81J48m5K90k79J6L0p2J04J74k84L97k07
6173F9Q2l18K88R8j92n8m4Q0p3n1k4Q0j18NP9L9J72j02nj06LL5O4Kk12M67l74
6200a14K44k19k76K21L29o05L47M3k4o0M1P5l4j2L18l69J90mj38l9J83j9j40q
6224g0rK22l3j56K83k30K48k09k05Q4j54M2Q2K44l73J84j39J5n5K29k66O01l95
6247f0j47J45L6p0J7J5p5J32mJ55j54n6q6K25j07p2j67M56N8k30J23K27m52k07
$$ plain form
6271 -298 -308 153 -201 95 131 -12 117 66 112 -206 96 -114 -13 301 9 -85 60 202 288 -37 -254 -1
6293 -1 -65 138 27 -85 -119 -124 35 59 52 23 76 -36 72 55 -352 -221 -92 181 -14 -169 125 70 135 -74 -79
6318 -79 -27 163 149 -139 -260 276 73 93 295 32 175 -6 -2 29 -198 -92 135 71 155 88 -222 178 253 185
6342 185 134 -63 -130 -77 -57 4 -145 -169 17 -277 -82 -52 -43 82 -56 -241 63 -318 -184 63 -76 116 13
6365 13 82 -18 65 122 -256 28 183 169 -147 -90 -97 -44 61 -37 -18 49 75 87 70 -21 16 -13 -107 79 -66 133
6391 133 54 -234 -219 -358 -8 257 -213 333 -20 71 -201 -70 -107 -126 -106 -148 96 127 93 -94 255 15 -154
6414 -154 82 -46 116 138 68 -50 106 23 78 187 -51 112 -120 135 -81 -113 149 22 177 -183 161 -1
6436 -1 -159 130 -240 -39 114 -149 -88 -28 312 -40 -26 139 -245 -292 -184 -35 -187 -37 -15 -57 -115 -150 -46
$$ packed form
6271b98j0M61l54K96L6j43J29n1M6l18L02k10J01L14k92r4J45J42Q6l25k17K53
6293ao4K03j11j12l4nJ59K4pk9N3j12J08j7m07J31J29K73j95j55K94n5O5k09n
6318g9N2J90j4k88j21N36k03K0K02k63J43j81ML1k27J06K27o4Q4o7l10M00P5o8
6342A85n1j97o7N3K0O1j49k4J86k94J95L0RJ25j38j85L04l81J34K47j39J92j03
6365A3O9j00Q3N7l78K84J55j4l16N7pN3J05r8J9O7K6J2j7r1L7k9r4J86j45J99
6391A33p9k88J5j39L50K65m70N46l53R1k72J31l7j9K0m2K44L1l4j87L49k40j69
6414a54K36j28J62K2p0j18J56q3N5J09k38J63k32K55k16l2K62j27J55l60L44j62
6436aj58K89l70K01J53k63O1O0L40l52J4J65l84m7J08J49j52J50K2m2n8l5J04
$$ plain form
6459 -46 -40 54 42 42 175 102 -87 90 1 52 -160 195 -186 -83 47 -311 -73 363 -32 28 87 103 -137 70
6483 70 88 -181 361 -52 -21 -15 -4 -21 245 -43 -38 13 -41 -211 -59 168 177 -104 -253 -10 67 61 32 -24 106 -126
6509 -126 -68 7 -199 -6 13 -190 223 141 43 71 168 -168 -132 -108 0 -62 134 14 375 -282 169 220 116 -17
6533 -17 98 33 28 8 -63 -26 -153 -122 -20 92 57 -131 -118 -181 76 172 -107 -202 -114 -157 3 250 -210 -182 -6
6558 -6 281 34 -45 -176 -78 -304 81 -87 -201 -108 133 -2 -12 68 204 260 82 106 111 -121 290 76 135 32
6582 32 109 -228 -182 205 -25 -23 -20 -145 197 85 223 61 -93 -250 58 -5 255 -122 -345 -95 -47 81 -6
6605 -6 260 37 -2 -213 -289 72 11 -12 -182 14 -143 134 -15 180 119 -37 68 -36 -62 -21 108 -252 129
6628 129 -222 -269 40 -68 105 -53 -191 111 -59 -104 64 67 170 182 8 12 364 142 -85 104 230 -72
$$ packed form
6459d6OR4j2%J33p3j89J77q9N1k12L55l81J03J30l58K38M36l95O0N9J6k40K07
6483G0J8k69N42m13L1OJ1j7K66k88NN1n4j70J52K27Rk81j49K43P7ok9n6J30k32
6509a26N8P5k06J93J9k03M13q2r8K8R7l36L6K4J08o2J96j20L61o57M51N1j04j33
6533a7J15o5nk0p1L7j27L1J02J12l5j88J3o3K57R6k79r5Q8m3J60K47m60K8J76
6558fK87k47p9j31R8k26L85j68j14R3K41j35j0Q0J36N6j78K4Nk32M11k14N9j03
6582C2P7l37M6L87k30KLj25L42j12J38j62j54j57L08o3K60l77k23K50M8J28q7
6605fK66k23l9k11p6L61o1k3j70J96j57K77j49J95o1j56J05j04k6M1J29l60L81
6628A29l51m7L09j08J73j58j38L02j70m5J68LJ03J2j74ML52k22k27J89J26l02
$$ plain form
6650 -72 -3 36 169 222 -205 -123 -186 -15 -183 -174 -6 -238 69 202 216 -25 -156 8 66 -7 125 -211 -7 45
6674 45 -72 45 37 64 54 -187 -253 205 123 -104 -109 -156 139 5 37 142 70 -97 -211 201 -144 -120 -105 -55 -141
6699 -141 -52 -51 9 31 114 95 -74 235 -4 118 48 33 -112 218 -22 -118 -145 -31 244 84 26 -379 -72 -67 205
6724 205 -227 -121 274 -236 -160 89 32 54 -63 109 92 20 -306 -65 -209 -22 41 141 45 42 73 119 20 -14
6748 -14 43 22 -25 -40 12 101 -83 222 221 283 37 41 17 -20 -172 13 64 5 151 196 46 6 -23 174 9 -136
6774 -136 84 -33 164 126 -43 -32 54 166 265 -146 -27 154 90 1 227 154 -146 -36 36 -239 -387 -68 -81
6797 -81 -294 111 -49 -68 -52 -106 198 137 -54 83 113 -95 -119 -40 49 -159 -42 36 -31 19 -55 -282 42 175
6821 175 -130 -73 7 2 227 -94 -103 233 -96 -235 66 -238 9 19 -20 84 62 -316 -147 -113 -71 -15 -105 -67 -80
$$ packed form
6650g2O9L9J33N3m27Q2o3J71j68RJ68k32L07J33J4k41j31J64N8p3J32l36K04N2
6674D5j17J17qK7j0k41o6M58q2k27nm7K95j34L2J05p2j67j14M12l45K4J5N0q6
6699a41Q9JO0K2Q3j9j69L09k39J22p0j5j45L30k40r6k7J14K75j60n8m05L07NK72
6724B05m32J06L95n10P6K49n7K2j17J72j7p2l26K41j44J87O3J00r6lL1M6r9l4
6748a4N7k1m7j5N2Q9j84L05jO2k46Mk4l7j52J85N1n9J46M5j50m0k9J97j65j45
6774a36K20j17J97l8j69J1Q6J12R9m11J19J81o4q9K26p3l00J10P2k75j48L19j3
6797h1k13M05j60j9J6n4L04o1j91J37L0k08k4P9Q9k08J17P8o7N0p4k27L24J33
6821A75l05N7Q0nK25l21rL36l29j39L01l04K47J0l9J04k2l78J69L4M2N6r0L8j3
$$ plain form
6846 -80 -16 -157 54 -266 96 65 -328 174 76 78 18 114 102 -14 -17 1 205 105 101 -243 106 94 286 -92 -301
6871 -301 -77 45 184 -9 16 174 149 -251 79 40 -159 102 59 264 211 146 -190 4 314 60 4 243
6893 243 -141 4 -13 69 54 235 -49 30 -22 -39 -69 77 133 -15 9 137 78 -271 255 -123 10 77 -38 76
6917 76 -133 -140 121 -73 -64 285 -81 -86 148 44 249 9 -123 59 -142 304 19 87 -61 62 -38 -73 84
6940 84 265 63 29 50 -48 -106 -134 -55 -165 176 -69 -193 50 91 -286 110 45 -139 -123 -133 33 290 -92 -134
6964 -134 168 -68 -157 63 71 80 -110 -13 15 85 65 -47 76 33 62 14 173 -47 206 258 -81 -245 63 167
6988 167 30 -138 -158 -29 -55 4 60 -345 -147 -55 -289 100 -111 194 -36 61 -35 -239 12 -318 -123 331
7010 331 296 -344 -55 -214 37 182 -268 -45 228 -241 -269 249 -5 227 49 -173 158 -126 150 -105 62
$$ packed form
6846h0O4j41K11l20L62l1l93N02r8Ko0R6j2j16lJ8K04j00ml44L49j2J92l78k09
6871c01K24J22J39j93K5J58k5m00L30l9j99K61m3K05n3o5l36J94L10k54n6K39
6893B43l84J45j7Q2j5J81k84P9n2j7l0J46N6j48K4J28n9l49N26l78J33O7j15J14
6917G6k09pK61j94RL49l66nK34j04K05k40j32J82k01M46k85O8j48J23j00l5J57
6940H4J81k02l4K1r8n8k8P9j10L41k45j24K43M1l77L96o5j84J6j0J66K57l82m2
6964a34L02k36q9K20QRj90R7K8P0k0j12J23m3K9m8J59k20K53N2l39j64L08J04
6988A67j37j68k0J29k6N9N6m05J98R2k34L89k11L05k30R7r6k04K51l30J95M54
7010C31l5o40K89j59K51J45m50K23K73m69k8N18k54K32j78k22L31k84K76k55J67
$$ plain form
7031 62 363 108 -81 32 237 -93 -157 19 156 -81 117 20 -31 303 217 -107 -83 190 -120 301 -36 58
7053 58 293 -130 111 66 -55 16 62 71 89 28 158 -81 64 127 -85 356 162 -168 -137 125 -26 -409 6
7076 6 176 43 127 -145 285 16 -58 -183 100 77 -59 26 30 -203 -6 220 -19 28 242 15 -62 -152 -169 307
7100 307 -177 398 -53 260 183 -109 37 93 -102 35 -27 104 253 -43 72 -30 184 192 -113 -73 -80 103 -5
7123 -5 106 -38 169 246 57 216 -52 158 -5 -172 -73 85 -27 11 -24 -149 28 125 30 192 -175 -109 29
7146 29 208 -170 -243 -39 156 -245 -78 16 -138 -98 -123 -152 231 -36 130 165 -387 146 52 153 55 -2 -224
7169 -224 156 -30 38 -47 172 267 37 187 180 59 76 -212 58 255 194 5 96 -24 115 -24 157 114 128
7192 128 230 -216 -28 14 -20 -111 -220 -193 -18 17 119 98 -11 -76 108 50 134 -86 145 -28 -113 -305 51
$$ packed form
7031F2L01k55j89J13K05l30o4J76J37k37J98r7n1L34q6l24K4K73l10M21l37R4
7053E8K35m23K41m5j21P1M6RJ8o1J30k39J45O3k12M41j94l30L1K62j51l83M15
7076FJ70j33Q4k72M30k69p4j25K83k3j36Q5Mk33J97K26k39M7K14k27p7r0j7M76
7100C07m84N75m51L13p7k92J46N6j95J37o2J31J49k96J15j02K14Ql05M0pJ83j08
7123eJ11j44K07P7j89J59k68K10j63j67R9J58j12L8l5j25J77R7r5J62l67O6J38
7146B9J79l78p3K04J95m01J67R4j54M0k5k9L83k67J66L5n52N33r4J01r8n7k22
7169b24L80j86O8q5K19R5k30J50pj21J7k88K70J97o1j89R1j20J39j39J81m3J4
7192A28J02m46J88M2l4r1j09K7J75L5J02k1j09o5J84n8Q4k20K31j73q5j92L56
$$ plain form
7215 51 -106 -160 371 -180 -21 -19 275 62 70 -52 94 194 67 -211 11 136 -122 155 -29 -172 62 -175
7237 -175 -1 196 -4 -61 -237 64 98 -100 -80 28 100 227 332 -158 -153 8 -11 49 -125 -203 -36 -46 180
7260 180 -187 -3 -159 9 170 190 -4 -109 -33 180 -13 128 104 33 14 -185 -89 35 -5 -91 44 -24 3
7283 3 11 -181 118 56 -101 239 36 270 27 -80 -164 -242 -171 57 219 2 -38 55 75 113 221 -73 206 -42
7307 -42 -176 27 -8 -77 13 -168 76 86 -25 -3 -220 -29 -93 -139 100 225 -78 -285 65 97 -98 83 -225
7330 -225 -199 -159 233 61 -165 -92 -141 -25 -28 -38 127 36 -136 239 -37 -96 80 147 -49 -152 166 -112 109
7353 109 248 -41 46 -189 175 287 -321 73 -106 -221 9 -212 -136 73 -161 -94 384 -67 -172 30 -178
7374 -178 165 -290 117 -87 -271 -4 -221 -5 -194 -168 270 14 104 4 1 62 -80 -125 76 -50 -52 62 16
$$ packed form
7215E1j57n4N31n51J59KK94k13Qj22J46J00j27k78K22J25k58K77j84j43K34k37
7237a75J74J97k00n7j76L01L4j98K0J08P2J27J05m90NJ61j9O0j74p8J67j0K26
7260A80l67J84j56J68J61K0j94j05P6K13j93J41k4p1j9j99R6J24m0q6J35o8K7
7283CQj92K99o2j57L40k03K34k43j07q4p8P1K28J62k17m0R3K0L8J08k94K79k48
7307d2j34K03l5o9R0j81K44J0j11K2k17J91o4m6K39J25l03k07L50L2j95J81l08
7330b25K6M0L92j72k26P3m9J16lj0J65r1j72L75k76n9J76O7j96j03L18k78K21
7353A09J39k89Q7k35L64J12o08L94j79j15K30k21P6K09k34O7M78m51j05K02k08
7374a78L43m55M07k04j84K67k17K16j89K6M38k56R0j00lO1j42m5K01j26kJ14m6
$$ plain form
7397 16 -10 293 186 -258 191 -41 -233 -367 -37 -24 291 7 -31 184 317 -146 139 -25 81 -209 -14
7418 -14 153 -75 -66 35 232 14 137 288 -196 -110 -94 110 13 -69 -107 -108 94 -184 103 132 -107 94 -78 -16
7442 -16 -142 -86 -83 -167 -30 251 209 -178 24 13 -175 187 80 103 149 390 166 14 148 -94 70 -81 113
7465 113 -329 -131 -26 165 -1 -2 -103 -67 102 43 27 -260 -120 -111 219 194 207 -87 -5 -67 374 43 -180 144
7489 144 102 39 -140 53 22 154 105 138 -157 -130 208 54 -61 -14 9 -96 -20 -40 -46 -1 100 82 -27 43 122
7514 122 251 -274 104 -72 173 81 103 57 -139 -79 45 86 94 28 -192 -108 -279 -93 -108 -6 17 -131 44 9
7538 9 -91 -11 -18 -1 21 179 51 47 -33 55 -150 135 5 98 182 123 15 286 -81 14 92 109 0 239 3 -186
7564 -186 -397 -110 -54 -6 57 -125 27 -97 -46 -102 12 31 77 -422 11 52 -299 -28 -218 -258 -56 -154 53
$$ packed form
7397A6k6L03j07m44M49k32j92j34L30J3L15k84l8K15J33m63K85j64J06k90J95
7418a4J67k28RJ01J97k18J23J51m84Q6J6K04r7q2l8jK02k78K87K9k39K01j72O2
7442a6j26N6Lq4J37K81m2l87K02j1j88L62j07K3M6K41k24j52J34k42J64j51J94
7465A13m42J98J05J91j66jj01L6J69n9j6k87J40RL30k5J3k94Q2o2M41l31k23L24
7489A44m2o3j79J93l1J32m9L3k95K7L38j54j15M7K3j05P6k0oM5J01j8j09P0P9
7514A22J29n25L78j76K45r2K2m6j96O0J24M1Qo6k20Q4j71J86j5J02K3j48J75l5
7538Ij00Q0pJ7K2J58j28mq0Q8k05K85j30R3Q4n9j08K71l67R5P8J7j09K39k36j89
7564a86k11K87N6M8O3j82J52j24N1n6J14J9M6m99M33M1l51K71j90m0K02r8K07
$$ plain form
7587 53 100 27 -115 -110 -99 66 -161 221 154 27 -107 -141 35 20 54 47 165 -81 39 -130 56 0 -203 299
7611 299 140 113 -53 -89 -19 20 -58 -122 -28 -83 6 40 -87 -165 129 -115 -52 46 -170 -148 54 305 78 83 -105
7636 -105 366 125 -203 96 76 280 -105 91 -12 -55 -43 11 -2 -54 1 99 -117 -108 19 -171 -239 0 152 1
7660 1 -177 56 -206 -123 -93 175 -93 -267 111 138 -79 -111 -145 6 102 -73 54 -1 -69 128 -150 -115 35 29
7684 29 14 -89 12 191 84 15 -99 90 -40 49 -38 9 -73 -147 184 -161 34 -13 -130 76 -58 -24 -253
7707 -253 81 -144 33 -40 -9 -98 -153 22 -60 -127 -127 -272 -80 -151 139 19 2 -111 -153 -120 147 -235 170 155
7731 155 -90 -95 -97 41 -44 -96 -11 -65 113 33 -28 213 59 -106 102 14 -95 232 112 -100 -15 255 -50 155
7755 155 164 -141 39 -52 -186 -6 48 -30 -61 326 -45 42 -63 117 -121 -50 199 -55 48 -79 -121 -68 21 130
$$ packed form
7587E3M7p3j42NJ1J65k27L82o7j27j34l4J76j5L4pJ18k46J20j69J86n6k03N02
7611B99j59k7j66l6P0L9p8o4R4n5Q9L4j27p8K94k44O3R8k16K2K02K51k27Nj88
7636a05M71k41l28K99k0K04l85J96j03m3J2N4j3n2N5R8k16RJ27j90o8K39J52j51
7660Aj78K33k62Q3L0K68k68j74L78K7k17l2l4J51R6j75J27n5o8J97k78L5J50o
7684B9j5j03J01J79j07o9j14J89j30Q9q7M7q2p4L31l45J95m7j17K06j34L4k29
7707b53L34k25J77p3L1q9n5J75q2o7%j45J92p1K90j20j7j13m2L3K67l82M05j5
7731A55k45nkJ38q5n2Q5n4J78q0o1K41j54j65K08q8j09L27j20k12Q5K70l05K05
7755A55Rl05J80r1j34J80N4p8l1L87l71Q7j05J80k38P1K49k54J03j27m2N3Q9J09
$$ plain form
7779 130 -59 -16 57 29 245 -58 338 14 35 -100 76 217 24 87 51 221 -57 23 -190 291 81 297
7801 297 30 -239 127 -132 208 175 49 -50 166 521 380 -86 -260 -9 99 119 17 -51 -38 -32 -61 103 -32
7824 -32 -102 -43 103 4 -150 42 -111 79 277 -229 -4 -389 37 18 -252 103 233 263 287 -59 -6 -67 9
7847 9 -48 -38 116 207 75 71 193 96 14 -138 -291 -92 63 -88 193 -156 -88 -140 -16 -255 39 152 141 -184
7871 -184 -173 24 -110 -70 -163 -45 -105 -130 137 194 21 68 236 358 -285 -72 280 -129 36 164 -112 53
7893 53 -44 -92 -80 -76 19 -83 -81 -134 67 377 69 21 6 -94 -34 91 22 105 -8 -185 127 82 -3 49 -261 -22
7919 -22 20 140 -8 -186 -164 -53 -50 -109 265 107 267 -122 -201 106 315 -210 150 157 78 69 -174 -165 50 -316 137
7944 137 62 -23 8 36 115 -162 21 -33 96 -166 -16 -103 -129 26 -170 -8 176 -108 401 38 68 -135 -276
$$ packed form
7779A30j89M3P3k8K16l03L96l24K1j35J76J41j93O3l6J70k78Q0k13M81k10K16
7801B97k67k69L66k59L40l3j26r9K16L55j41m66j74K51J08K0j02o8J3Ok9J64j35
7824c2p0N9J46r9j54J92j53J90J98n06K25l85M26j9k70L55J30L0K4l46N3o1P6
7847In7J0J54R1j32mJ22r7q2j52j53J99J55j51K81l49O8n2J24k39K94J13j1l25
7871a84J1J97j34M0r3J18o0k5K67N7j73M7J68J22o43K13L52m09J65J28k76J65
7893E3r7m8J2MR5j02Kn3K01L10l08m8j5j00O0J25o9Q3j13j77L12m5q5N2l10K39
7919b2M2J20j48j78K2J11Ln9L74j58J60l89p9L07K09n25L60Pp9rk43RK15l66M53
7944A37p5q5L1K8P9k77J83n4J29k62J50q7k6J55j96J62J84k84N09l63L0k03j41
$$ plain form
7967 -276 -67 -67 -145 -4 250 131 124 -433 -305 -80 -55 -77 219 166 5 71 -271 -240 48 -265 -26 -25 -118 -175 -103
7992 -103 -19 45 -55 166 -79 6 162 204 1 -119 -144 -86 -161 47 156 75 -74 6 15 -69 -70 -185 -125 99 10
8017 10 -14 177 -51 -12 -37 -273 -115 70 214 -75 76 99 -56 -97 -94 -156 132 -112 15 -131 34 169 65
8040 65 -45 112 -10 -84 -144 -158 315 -74 -27 169 59 -47 -202 -11 12 -110 80 135 35 -80 17 -13 -7 55
8064 55 -9 28 -25 112 -4 -159 -223 -34 34 49 -54 -23 -116 150 -177 28 -36 -35 211 85 169 40 231 -60
8088 -60 294 -197 72 68 -247 0 -133 -1 10 -180 -35 58 58 -129 -112 -283 60 -80 -334 326 0 -183 -42
8111 -42 -10 89 -97 -62 0 -127 61 133 -112 58 66 18 -124 -31 256 39 -140 124 74 -3 -89 -66 75 -88 10
8136 10 -41 -57 -278 -19 123 -174 90 73 10 -25 89 1 20 100 94 132 38 40 75 -14 158 -33 -30 269 128 -173
$$ packed form
7967b76K09%p8J41K54j19pn57J28K25K5k2K96n3j61O6l42L1K88l13K39Jr3n7P2
7992a03Q4O4j00K21k45Q5J56M2k03j20k5N8p5K08J09q1j49Q0Rq4jj15O0K24q9
8017A0k4J91k28L9k5k36J58J85J44k89J51K3j55m1Lo2K88k44J27j46J65J35j04
8040F5j10J57j22p4o0j4M73l89M7J96j10j06j55J91K3j22J90N5j00j15R7l0OO2
8064E5o4L7n3J37j16j55o4J89O8J5j03L1r3K66l27K05o4JK46j26Q4j29J91k91
8088f0L54m91K69ml15K47j33J32J1j90J45R3%j87J7j71L43j40k54O60l26j83J41
8111d2L2R9j86L5O2j27J88P2k45J70Qm8j42R3K87k17j79K64n0p7q6K3J41j63R8
8136A0n1j6k21K59J42k97K64j7o3l5J14q8J9Q0oL8r4KL5q9J72j91LK99j41l01
$$ plain form
8162 -173 66 134 -45 27 -229 42 114 138 -150 -144 68 124 -255 -280 -116 -213 -27 -32 -49 -157 84 213 87 315
8186 315 -83 71 114 -172 -80
$$ packed form
8162a73K39O8j79P2k56K71P2K4k88OK12N6l79k5J64r7J86nj7j08K41J29j26K28
8186C15l98J54M3k86R2
8191h0
$$ Imaginary data points
##PAGE= N=2
##DATA TABLE= (X++(I..I)), XYDATA
$$ plain form
0 0 0 0 0 0 0 0 0 0 0 0 0 0 8 -8 8 -8 8 -16 16 -24 24 -32 38 -40 48 -56 67 -80 89 -104 120 -136 153 -175
34 -175 198 -222 249 -280 312 -349 388 -431 478 -529 585 -648 715 -787 867 -956 1053 -1160
52 -1160 1279 -1412 1560 -1727 1916 -2135 2388 -2686 3043 -3479 4031 -4749 5727 -7144 9394
67 9394 -13540 23769 -109021 -95337 35454 -85940 -48816 19115 802 -8212 61714 47237
79 47237 30925 61109 49801 -11220 27338 54356 -3272 -4821 40503 -19876 -55553 -11023
91 -11023 -14658 -45603 -21853 -17998 -31903 -16750 2082 7165 27761 34172 1947 -1516 46192
104 46192 42596 -2734 -741 2906 -20334 -12679 -9178 -27506 -13974 -2991 -22600 -16744 10343
117 10343 12160 3748 13320 16627 -3497 -3305 18587 13512 4408 11604 386 -10077 2281 2382
$$ packed form
0@%%%%%%%%%%%%Qj6J6j6J6k4L2m0M8n6P0p8Q8j04J23j47J69j93K24k56K89l28
34a75L73m20M71n29N92o61P37q19R09j007J114j233J363j502J654j823K009k213
52a160K439k691K972l287L643m051M523n074N729o522P510q780J0476j2871J6538
67I394k2934L7309j32790J3684J30791j21394L7124O7931j8313r014O9926j4477
79D7237j6312L0184j1308o1021L8558K7018n7628j549M5324o0379l5677M4530
91a1023l635l0945K3750L855j3905J5153J8832N083K0596O411l2225l463M7708
104D6192l596m5330J993L647k3240P655L501j8328J3532J0983j9609N856K7087
117A0343J817q412R572L307k0124J92K1892n075r104P196j1218j0463J2358J01
$$ plain form
131 2382 -5152 -6617 -17379 -24413 -14010 -2763 242 -2691 1449 10111 9149 10597 16347 12435 8362
146 8362 4375 -4442 -5171 -2376 -2786 -1464 -7647 -12720 -7142 -6137 -3842 4336 1240 -4824 -2210 1027
162 1027 5139 9140 8435 4923 174 1829 5348 2079 2338 3520 -5556 -7487 -3357 -5927 -4381 259
178 259 -2620 -3880 -1916 446 4148 5869 5378 1138 -3301 -631 962 -1741 693 -1042 -5873 -1743
194 -1743 1066 911 4636 3088 -1042 177 1354 1140 1785 2224 1912 -1569 -2490 712 -114 -685 651
211 651 -3944 -6220 -2746 -3024 -1888 1775 391 -1575 402 3424 5046 4556 3953 3195 -50 36 1762
228 1762 -397 -776 -1048 -4986 -4628 -1940 -2099 -699 163 -792 -630 -918 1183 3535 2479 1967 1307 14
246 14 1434 2421 1266 1306 -717 -3111 -2066 -2022 -1548 -883 -2695 -2100 -658 -494 1446 2767 2483 2072
$$ packed form
131B382p534j465j0762p034J0403J1247L005k933M140Q662r62J448N750l912m073
146H362l987q817p29K795m10J322o183n073N578J005K295Q178l096o064K614L237
162A027M112M001p05l512m749J655L519l269K59J182r076j931M130k570J546M640
178B59k879j260J964K362L702J721m91m240m439K670J593k703K434j735m831M130
194a743K809j55L725j548m130J219J177k14O45M39l12l481r21L202q26n71J336
211F51m595k276L474k78J136L663j384j966J977L022J622m90o03p58l245Q6J726
228A762k159l79k72l938L58K688j59J400Q62r55J62k88K101K352j056n12o60j293
246A4J420R87j155M0k023k394J045M4M74O65j812N95J442J64J940J321k84m11
$$ plain form
264 2072 956 754 2013 1293 666 351 -1474 -2091 -1584 -1757 -531 -381 -1987 -1614 -918 -306 1187 1240
282 1240 967 1095 443 1504 2233 1860 1331 322 -762 -758 -886 -1176 -939 -1721 -2369 -1917 -1556 -415 1099
301 1099 631 681 902 607 1475 1733 1457 1576 -210 -710 8 -153 108 -441 -1378 -1327 -1463 -1198 -120 52
321 52 4 -239 -153 214 1253 1286 1259 1480 216 319 181 0 321 -570 -1220 -1107 -1039 -466 -2 -494 -208 -275
343 -275 -470 563 808 813 782 588 273 387 185 323 76 -387 -532 -809 -801 -268 50 -522 -193 -537 81 241
365 241 168 514 445 -130 244 393 289 640 191 -169 -246 -349 -238 209 -120 22 -481 -679 -37 155 12
386 12 452 37 178 -121 77 259 484 53 -318 204 15 472 170 -60 -397 -102 -540 -24 -15 -43 385 -194
408 -194 -12 242 113 293 241 -174 -231 -169 -224 -60 -154 -258 -27 -177 -249 -53 -355 70 -87 -209 206 33
$$ packed form
264B072j116k02J259p20o27l15j825o17N07j73J226J50j606L73O96O12J493N3
282A240k73J28o52J061P29l73n29j009j084Mj28k90K37p82o48M52L61J141J514
301A099m68N0K21k95Q68K58k76J19j786n00P18j61K61n49r37N1j36K65J078J72
321E2m8k43Q6L67J039L3k7K21j264J03j38j81L21q91o50J13O8N73M64m92K86o7
343b75j95J033K45Nl1j94l15J14k02J38k47m63j45k77QN33L18n72L29l44O18J60
365B41p3L46o9n75L74J49j04L51m49l60p7j03J11M47l29J42n03j98O42J92j43
386A2M40m15J41k99J98J82K25m31l71N22j89M57l02k30l37K95m38N16Rk8M28n79
408a94J82K54j29J80n2m15n7O2n5J64r4j04K31j50p2J96l02M25j57j22M15j73
$$ plain form
430 33 175 -101 -52 -219 -4 201 26 57 12 64 -331 -275 -113 -94 -161 331 -65 115 118 112 249 94 118 52 68
455 68 258 108 34 32 38 -225 -61 34 65 112 158 -131 77 54 140 52 -95 328 -172 59 -134 -140 89 114 -189 -137
481 -137 6 96 -11 -101 1 52 363 -198 109 32 252 59 39 31 77 53 -100 165 -11 396 26 -21 83 255
505 255 -113 -450 -193 78 -48 -51 128 91 -26 -332 209 35 2 -311 165 -179 -164 -120 57 -36 -158 -138 -98
528 -98 -22 -29 -164 -127 37 4 96 76 17 54 133 -138 -64 -11 15 124 97 129 96 -2 228 115 -143 -102 26 -47 -274
555 -274 147 -203 -83 -114 -67 -207 50 -109 -106 92 -261 -301 67 -12 310 130 -82 -19 234 43 68 117 -33
578 -33 77 -39 82 -65 -40 -31 123 86 -143 61 -71 -76 80 -91 86 -374 50 60 -86 145 100 157 -70 -2
602 -2 73 11 -191 -7 252 -61 -214 165 47 -259 -319 -61 259 -113 -61 0 61 -102 213 58 -63 141 -223
$$ packed form
430C3J42k76M9j67K15K05j75L1m5N2l95N6J62J9o7M92l96J80LoJ37j55K4o6J6
455F8J90j50p4kOk63J64R5L1M7M6k89K08k3Q6q8j47M23n00K31j93oK29K5l03N2
481a37J43R0j07r0J02N1L11n61L07p7K20j93k0qM6k4j53K65j76M07l70m7J04J72
505B55l68l37K57K71j26lJ79l7j17l06N41j74l3l13M76l44J5M4J77r3j22K0M0
528i8P6pj35L7J64l3R2k0n9L7P9k71P4N3K6J09k7L2l3r8K30j13k58M1J28p3k27
555b74M21l50J20l1M7j40K57j59LJ98l53m0L68p9L22j80k12O3K53j91K5M9j50
578c3J10j16J21j47K5RJ54l7k29K04j32nJ56j71J77m60M24J0j46K31m5N7k27O8
602bP5o2k02J84K59l13j53L79j18l06o0K58L20l72N2O1O1j63L15j55j21K04l64
$$ plain form
625 -223 105 36 28 26 229 60 71 74 18 -67 -137 -64 59 99 -133 -101 -312 63 17 -61 -245 49 92 148 60 98 -11
652 -11 53 72 -112 161 115 172 -129 -55 -5 36 103 88 116 82 -137 -159 -117 241 -57 131 93 0 218 -344 374 71
678 71 67 24 107 122 -176 22 -160 36 83 -15 -22 28 1 179 58 85 139 -4 -19 -33 160 179 308 106 133 42 -46
705 -46 44 -42 -197 75 -38 188 82 76 207 -244 -207 33 -91 -77 6 -11 -185 -93 -301 -60 -52 -243 -115 85
729 85 -106 -37 56 154 110 -11 46 92 159 16 -82 -168 12 -73 295 -10 -77 147 238 -43 58 -50 -312 -82 -172
754 -172 171 142 84 26 -34 142 -159 -176 -62 72 -251 45 320 -90 -36 90 1 163 47 -44 -315 202 190
777 190 -103 -53 -252 -34 -152 1 -114 -193 -56 -58 0 -182 137 40 6 262 -10 51 82 -92 -212 -285 138 223
801 223 -74 17 -217 -176 6 3 -121 -180 -61 254 -41 -213 -70 -148 157 -153 47 0 53 -34 320 265 -311 225
$$ packed form
625b23L28o9qkK03j69J1Ln6q5p0P3J23M0k32L2k11L75m6p8j84K94M3N6q8L8j09
652a1O4J9j84K73m6N7l01P4N0M1O7j5K8l4k19k2M2L58k98J88l8r3K18n62P18l03
678G1mm3Q3J5k98J98j82J96M7r8pN0k7J78j21K7N4j43j5j4J93J9J29k02K7r1q8
705d6R0q6j55K72j13K26j06oJ31m51L7K40j24J4Q3j7j74R2k08K41Qj91J28K00
729H5j91O9R3R8m4j21N7M6O7j43r8q6J80q5L68l05o7K24R1k81J01j08k62K30r0
754a72L43k9n8n8o0J76l01j7J14J34l23K96K75m10N4J26q9J62j16r1k71N17j2
777A90k93N0j99K18j18J53j15p9J37kN8j82L19r7l4K56k72O1L1j74j20p3M23Q5
801B23k97R1k34M1J82lj24n9J19L15k95j72J43p8L05l10K00m7N3q7L54n5n76N36
$$ plain form
825 225 34 -141 28 251 -76 -263 -13 -12 18 71 20 -141 -146 -324 -270 -55 -377 113 104 -98 25 -155 206 -225
849 -225 129 -147 11 137 19 -176 -61 140 -98 -42 6 -251 104 -29 233 3 -37 -190 16 35 -151 230
871 230 301 -198 90 29 116 86 -112 44 -17 163 76 72 81 -6 -104 233 -240 83 43 236 -173 -166 20 -53 -100 -122
897 -122 17 3 98 -37 -10 -107 -294 -86 179 -90 8 49 -67 -28 25 114 7 -38 -31 138 114 -6 -163 134 32
922 32 -274 -6 -16 16 4 -37 24 -83 -126 -128 83 -124 170 49 153 41 -57 34 -254 -47 169 -69 -70 -108 -142
947 -142 -169 -31 -58 -246 25 96 -34 -69 -149 -55 -60 -15 -53 -62 -309 68 165 289 -50 -87 7 153 56 -110 -28 63
973 63 123 -18 115 -307 212 -116 69 -75 -39 139 116 -14 11 -136 -18 -67 -223 -119 -181 -73 -113 217 -58
996 -58 -36 96 -230 -61 -101 -68 6 98 6 57 193 88 -29 5 -203 -27 -54 3 151 -67 -51 28 133 3 -79
$$ packed form
825B25j91j75J69K23l27j87K50JL0N3n1j61nj78N4K15l22M90rk02J23j80L61m31
849b25L54k76J58J26j18j95J15K01k38N6M8k57L55j33K62k30m0j53K06J9j86L81
871B30P1m99K88o1Q7l0j98J56o1J80q7mRq7r8L37m73L23m0J93m09PJ86p3m7k2
897a22J39j4R5j35K7r7j87K08K65k69R8M1j16L9N3Q9j07m5PJ69k4j20j57K97j02
922C2l06K68j0L2j2m1O1j07m3kK11k07K94j21J04j12r8R1k88K07K16k38jl8l4
947a42k7J38k7j88K71P1j30l5q0R4nM5l8rk47L77R7J24l39l7R4J46r7j66Q2R1
973F3O0j41J33m22N19l28J85j44L6J78k3j30K5j47J18m9j56J04o2J08m0L30k75
996e8K2J32l26J69m0L3P4R2r2N1J36j05j17L4k08J76k7N7J48k18J6P9J05j30q2
$$ plain form
1021 -79 -30 -66 -35 -52 -275 -149 2 -76 92 54 72 -85 65 332 -78 3 -99 122 -101 -355 158 -243 29
1044 29 -34 -181 135 -188 22 -81 -153 -164 336 248 -180 140 167 -12 46 -131 -70 -96 -94 -121 -224 31 167 -133
1068 -133 -205 -111 38 195 -70 81 -28 293 16 -44 93 -10 -55 44 -20 -81 5 37 -10 -231 -174 106 154 -175
1092 -175 78 36 -35 -116 -57 -57 17 -242 -350 -23 237 170 -64 -197 -63 14 -214 -112 -133 93 -222 62 62 -252
1116 -252 -114 108 20 55 41 142 120 -43 -89 -303 86 329 21 137 221 137 22 -56 -84 97 268 97 303
1139 303 38 258 394 94 -36 -110 -34 31 98 -264 66 19 -37 -26 -60 26 169 -89 55 81 219 -67 -119 312
1163 312 -186 -114 70 110 97 -246 290 194 3 64 7 -10 -261 -110 15 6 96 33 -1 -128 88 -119 -13 0
1187 0 60 -44 -69 58 185 -84 -8 -47 87 11 -105 298 -121 97 105 -180 16 5 -78 109 -26 -86 20 -351
$$ packed form
1021g9M9l6L1j7k23J26J51p8J68l8J8j57J50K67m10Q1j02K21k23k54N13m01K72
1044B9o3j47L16l23K10j03p2j1N00q8m28L20K7j79N8j77O1k6Kk7j03K55J36l00
1068a33p2R4J49J57k65J51j09L21k77o0J37j03m5R9o4o1Q6L2m7k21N7K80M8l29
1092a75K53m2p1q1N9%P4k59j08L27K60o7k34j33J34P7k28J02k1K26l15K84%l14
1116b52J38K22q8L5j4J01k2j63m6k14L89K43l08J16Q4q4j15p8k8J81J71j71K06
1139C03k65K20J36l00j30p4P6O5O7l62L30m7n6J1l4Q6J43k58J44K6J38k86n2M31
1163C12m98P2J84M0j3l43N36r6j91O1n7j7k51J51J25rR0o3l4j27K16k07J06J3
1187@O0j04k5J27J27k69P6l9J34p6j16M03m19K18Qk85J96j1q3J87j35o0J06l71
$$ plain form
1211 -351 -98 5 -65 78 143 92 159 30 100 57 123 -1 178 41 -225 83 -22 -95 177 -83 -238 43 -158
1234 -158 -155 -108 64 46 -150 -161 -304 -4 146 -225 116 25 -19 43 -46 -27 168 106 -149 -62 77 -257 -13 -9 -109
1259 -109 127 -90 -52 -59 -194 18 276 17 20 53 -92 -34 87 178 58 -185 -8 -23 -76 93 232 -126 169
1282 169 164 10 350 -249 -238 -177 66 -10 41 45 -106 4 341 -145 -69 89 -130 -66 -330 156 213 310 -128 -52
1306 -52 -281 -2 53 -144 -34 -177 -247 30 80 -106 -17 -49 94 284 118 153 123 -104 -32 -79 -39 40 129 280
1330 280 -45 5 -77 18 299 -195 104 164 84 -172 31 71 -168 295 106 205 -212 39 -164 -247 152 -101 232
1353 232 300 40 -137 -201 33 -274 -62 129 -30 -216 109 -26 101 -17 -303 -114 136 137 89 7 121 -45
1375 -45 -99 103 106 -102 -19 48 97 46 -272 179 -218 192 -96 -202 -92 -25 42 23 -7 206 -127 -142 55 287
$$ packed form
1211c51K53J03p0J43O5n1O7j29P0m3O6j24J79j37k66L08j05p3K72k60j55K81k01
1234a58LM7J72j8j96j1j43L00J50l71L41r1m4O2q9J9J95o2k55Q7J39l34K44Mj00
1259a09K36k17L8pj35K12K58k59LL3j45N8J21R1j20k43J77j5n3J69J39l58K95
1282A69nj54L40n99J1O1K43p6N1Mj51J10L37m86P6J58k19O4k64M86N7R7m38P6
1306e2k29K79N5j97J10j43p0K77N0j86Q9l2J43J90j66L5l0k27P2m7M0P9Q9J51
1330B80l25N0q2R5K81m94K99O0q0k56K03M0k39M63j89R9m17K51k03q3L99k53L33
1353B32O8k60j77o4K34l07K12J91j59j86L25j35J27j18k86J89K50Jm8q2J14j66
1375d5n4K02Lk08Q3O7M9n1l18M51l97M10k88j06J10O7O7j9l0K13l33j5J97K32
$$ plain form
1399 287 125 -110 61 -204 25 -139 19 291 1 -56 -30 -45 47 -121 -230 125 154 -59 -243 78 -335 39
1421 39 48 1 256 59 -153 -156 -29 132 -64 -141 99 -99 5 105 -10 -113 166 101 -44 -347 142 -34 -21
1444 -21 -59 355 -162 315 -145 22 -9 -293 73 101 377 -355 263 63 -65 75 -178 49 88 -11 -191 -31
1466 -31 -72 -149 357 -94 -160 -110 -26 -116 -296 -46 133 -242 69 18 239 198 123 -152 -119 -52 239 129 78 144 -43
1491 -43 -97 -162 -22 19 -187 -15 123 3 58 -24 -93 -106 -58 35 7 158 57 -7 -193 181 -24 -125 119 86
1515 86 322 -85 -46 48 121 -52 -198 -14 -10 -131 -8 52 61 361 104 15 -103 -161 -71 -61 27 171 -22 48 -366
1540 -366 147 -168 -184 154 243 183 70 107 -1 78 -132 -181 42 -201 -99 227 45 34 58 -114 -69 -56 -90 86
1564 86 59 -108 -86 -11 48 173 -46 9 -227 166 27 -111 76 -75 -69 46 -87 -100 91 -364 -52 -230 -161
$$ packed form
1399B87j62k35J71k65K29j64J58K72k90n7K6j5R2j68j09L55K9k13j84L21m13L74
1421C9Rm7K55j97k12lJ27J61j96p7K40j98J04J00j15j03K79o5j45l03M89j76J3
1444b1l8M14n17M77m60J67l1k84L66K8K76p32O18k00j28J40k53K27L9r9j80J60
1466c1m1p7N06m51o6N0Q4r0j80K50J79l75L11n1K21m1p5k75L3O7K91j10n1O6j87
1491d3n4o5J40M1k06J72J38j20N5q2o9j3M8R3k8J51j01o4j86L74k05j01K44l3
1515H6K36m07L9R4P3j73j46J84Mj21J23O0RL00k57q9j18n8R0J0Q8J44j93P0m14
1540c66N13l15j6L38Q9o0j13L7j08P9k10m9K23k43J02L26j82j1K4j72M5J3l4J76
1564H6k7j67K2P5N9J25k19N5k36L93j39j38J87j51OJ15j33j3J91m55L12j78O9
$$ plain form
1587 -161 173 110 -192 72 55 36 109 -259 -159 127 19 10 8 -227 145 -68 262 -165 -202 -90 -223 4 -27
1610 -27 164 -180 313 4 -96 -53 81 72 115 -141 163 2 -144 281 -91 55 217 -18 -187 267 137 -75
1632 -75 -2 80 -255 -13 -44 11 -23 140 232 66 249 190 -46 68 -238 -55 16 19 -63 -8 -175 -146 81 -25 -4
1657 -4 147 -16 24 29 121 120 19 168 -205 42 -155 -51 453 -240 43 -45 179 -73 -158 -85 -155 33 -169 120
1681 120 38 -270 -137 146 192 -148 -69 -53 133 131 -107 108 -380 -171 223 30 -109 222 -149 0 -89 -25 194
1704 194 34 -3 -89 137 92 -55 -76 181 -31 -127 -157 73 -90 -8 -85 411 116 -125 129 113 121 144 95 145 215
1729 215 37 -45 -21 -4 30 -111 206 163 249 -136 -64 -68 -84 75 -26 -140 -119 279 137 163 144 195 106 -6 142
1754 142 9 -101 -28 260 250 -1 248 -165 246 191 290 -113 -45 181 142 191 57 -3 17 23 23 -221 256 76
$$ packed form
1587a61L34o3l02K64j7j9P3l68J00K86j08rkk35L72k13L30m27l7J12j33K27l1
1610b7J91l44M93l09j00M3J34rM3k56L04j61j46M25l72J46J62k35j69M54j30k12
1632g5P3Q2l35K42l1N5l4J63R2j66J83n9k36J14l06J83P1Lq2N5j67K9K27j06K1
1657dJ51j63M0NR2jj01J49l73K47j97J04N04o93K83q8K24k52q5P3p0J88k02K89
1681A20q2l08J33K83M6l40P9J6J86kk38K15m88K09L94j93j39L31l71J49q9O4K19
1704A94j60l7q6K26m5j47k1K57k12r6l0K30j63Q2p7M96k95k41K54j6QK3m9N0P0
1729B15j78q2K4J7L4j41L17m3Q6l85P2mj6J59j01j14K1L98j42K6j9N1q9j12J48
1754A42j33j10P3K88j0k51K49m13M11n5R9m03O8K26l9M9j34o0K0O%k44M77j80
$$ plain form
1778 76 -105 326 -35 -131 -35 417 -211 181 187 -141 -12 -4 -213 -213 134 9 228 -70 270 -96 69 -62 125
1801 125 -224 -25 128 2 -227 -51 -71 -69 73 82 81 -48 96 -3 113 43 63 -18 -29 -113 -264 99 174 42 152
1826 152 74 164 -132 -70 0 167 88 -47 -288 217 62 -246 -126 -88 -65 201 -266 108 -6 110 -124 -176 -297
1849 -297 30 145 126 89 65 -111 -137 -110 -28 -215 230 60 -120 -70 23 -57 17 -47 18 116 -124 70 -108 -7
1873 -7 -133 179 -187 -213 -68 192 58 -296 187 208 119 56 142 -67 -101 -45 -94 28 30 149 -75 -115 42 -347
1897 -347 133 -413 -136 -216 -175 -121 206 128 -52 20 -287 236 50 -64 129 102 -204 123 -112 72 -43 165
1919 165 153 48 160 78 197 -187 -136 78 -187 11 -60 -53 -26 -191 240 156 1 -181 277 55 -191 72 -24
1942 -24 3 -22 -160 -15 -77 -84 -283 302 59 18 1 185 -59 143 -17 59 51 -189 132 -216 -363 95 135 74
$$ packed form
1778G6j81M31l61r6R6M52o28L92Ol28J29Qk09%L47j25K19k98L40l66J65j31J87
1801A25l49J99J53j26k29J76k0KJ42Rjj29J44r9J16p0K0q1j1q4j51L63P5j32J10
1826A52p8R0k96O2P0J67p9j35k41N05j55l08J20L8K3K66m67L74j14J16k34n2j21
1849b97L27J15j9l7k4j76k6K7Q2j87M45j70j80N0R3q0P4o4O5R8k40J94j78J01
1873gj26L12l66k6J45K60j34l54M83K1q9o3Q6k09l4N6m9J22KJ19k24m0J57l89
1897c47M80n46K77q0M1N4L27p8j80P2l07N23j86j14J93k7l06L27k35J84j15K08
1919A65j2j05J12q2J19l84N1K14k65J98p1PK7j65M31q4j55j82M58k22k46K63r6
1942b4K7k5j38J45o2pj99N85k43m1j7J84k44K02j60P6qk40L21l48j47M58M0o1
$$ plain form
1966 74 -157 -73 -147 211 54 -111 -173 -90 174 84 153 78 106 -37 55 21 65 -253 23 18 -25 60 256 -122 29
1991 29 178 22 286 -327 -108 113 -25 -19 134 78 -82 55 -81 16 92 -79 93 55 57 -291 -228 59 -59
2014 -59 111 -156 51 -268 -38 -292 107 -137 154 -116 337 39 78 -92 18 -212 -70 -39 281 128 -46
2035 -46 161 70 204 -44 -161 34 263 -209 64 15 -226 -83 -5 83 -176 -20 -68 -188 -42 -107 306 -31
2057 -31 -55 45 180 9 -288 -136 -60 256 79 -33 -38 -67 -139 -101 -117 214 -7 76 -1 -106 155 136 7 -194
2081 -194 36 -119 -65 72 28 21 31 -218 96 -45 -216 -112 175 263 -101 169 -31 126 -434 149 381 60
2103 60 -32 23 -128 -81 15 152 -71 -248 203 113 -11 -233 206 -167 70 -89 84 -122 219 -244 -13 -69
2125 -69 34 -55 -88 -79 161 156 -87 187 -8 151 146 9 179 -7 -228 -48 238 -77 -128 1 78 88 109 -77
$$ packed form
1966G4k31Q4p4L58j57j65o2Q3K64r0O9p5K8j43R2l4M4l18K76nm3Q5J96l78J51
1991B9J49j56K64o13K19K21j38OJ53n6j60J37j36R7P6j71J72l8Kl48O3K87j18
2014e9J70k67K07l19K30k54L99k44K91k70M53k98L9j70J10k30J42L1L20j53j74
2035d6K07r1J34k48j17J95K29m72K73m9k41J43P8Q8k59J56m8j20J46o5M13l37
2057c1k4J00J35j71k97J52P6L16j77j12nk9p2L8j6L31k21Q3p7j05K61j9j29k01
2081a94K30j55N4J37m4pJ0k49L14j41j71J04K87Q8l64K70k00J57n60N83K32l21
2103F0r2N5j51M7R6J37k23j77M51r0j24k22M39l73K37j59J73k06L41m63K31n6
2125f9J03q9l3RK40nk43K74j95J59nj37J70j86k21J80K86l15n1J29P7J0K1j86
$$ plain form
2149 -77 -230 -8 -176 204 -154 -204 36 9 -182 100 129 -199 -95 -129 -49 -159 -17 296 57 93 66 -161 20
2172 20 75 70 13 -139 -70 238 112 -227 70 -119 -113 110 -106 108 -246 -142 -90 -99 170 286 126 39 20 201
2196 201 -80 84 323 -255 -65 -190 19 219 -6 24 76 34 -57 -71 84 -14 61 -223 -103 244 97 -246
2218 -246 -35 -32 -133 37 60 68 -166 -40 183 10 -98 205 -29 -82 229 -119 7 -5 -91 -182 67 -137 -66
2241 -66 -187 -21 291 -187 325 130 96 -48 -58 -96 -62 -105 -206 97 33 -68 -61 244 251 -110 176 -191 -69 51
2265 51 -19 -40 86 15 184 11 3 -81 -32 -11 253 -121 -330 81 -177 106 85 -85 -295 -112 59 308 -115
2288 -115 -57 178 75 -70 81 214 62 -97 -49 126 35 88 65 186 304 -172 -118 -31 10 104 -339 219 -205
2311 -205 -23 50 32 -138 -26 -136 227 -125 183 -123 -41 -90 123 -38 -215 -88 37 -135 -373 -141 -137 -19
$$ packed form
2149g7j53K22j68L80l58n0K40k7j91K82K9l28J04l4Q0j10J42L13k39L6k7k27J81
2172B0N5nn7j52O9L08j26l39K97j89OK23k16K14l54J04N2rK69J16j60q7j9J81
2196B01k81J64K39n78J90j25K09K00k25L0N2m2r1j4J55r8P5k84J20L47j47l43
2218b46K11Lj01J70K3Qk34J26K23j73j08L03k34n3L11l48J26j2q6r1K49k04P1
2241f6j21J66L12m78N12j95l4j44j0l8L4m3j01L03o4j01PL05Pl61K86l67J22J20
2265E1p0k1J26p1J69j73qq4M9K1K64l74k09M11k58K83k1j70k10J83J71K49m23
2288a15N8K35j03j45J51J33j52j59M8J75r1N3k3J21J18m76N4Q7M1R4m43N58m24
2311b05J82P3j8j70J12j10L63l52L08l06Q2m9K13j61j77J27J25j72k38K32MJ18
$$ plain form
2333 -19 237 -217 62 -10 51 132 145 -3 72 54 247 42 401 90 -61 436 10 84 -91 -116 -79 29 13 -258
2357 -258 357 128 -98 -164 -28 73 -22 -185 -160 -170 -53 -144 63 87 -87 74 0 -220 -21 129 -170 444
2379 444 -197 -10 -106 -193 60 173 -140 213 89 229 -53 -99 94 215 3 80 120 -1 56 224 -301 215
2401 215 55 -158 -41 -57 -124 -18 -34 -23 27 -99 -29 -143 -139 -99 -156 -68 -260 -105 119 -193 175 203 -54 94
2425 94 -57 27 -128 -52 157 148 140 -97 155 -236 -130 -267 82 -111 -69 -49 115 -67 -252 179 35 108 186 -6
2449 -6 -63 -80 -124 18 202 -107 -11 -245 82 -160 -72 37 -62 117 -21 154 11 297 -212 71 -142 -27 65
2472 65 -295 -94 -169 -46 105 213 123 352 136 -131 -142 -74 94 194 282 -196 34 44 -53 -1 -122 47 170
2495 170 -29 -95 -119 -46 -149 51 128 196 73 -162 -215 173 40 71 -100 54 85 -160 255 -63 -204 158 7
$$ packed form
2333a9K56m54K79p2O1Q1J3j48P5j8J93k05L59l11j51M97m26P4j75k5L7J08j6k71
2357b58O15k29k26o6J36J01r5j63K5j0J17r1K07K4j74J61p4k20J99J50k99O14
2379D44o41J87r6q7K53J13l13L53j24J40k82m6J93J21k12P7M0j21N7J68n25N16
2401B15j60k13J17j6o7J06j6J1N0j26P0j14MM0n7Q8j92J55K24l12L68K8k57J48
2425I4j51Q4j55P6K09rqk37K52l91J06j37L49j93M2K0J64j82j85M31j44P3P8j92
2449fn7j7m4J42J84l09R6k34L27k42Q8J09r9J79j38J75j43K86n09K83k13J15R2
2472F5l60K01p5J23J51J08r0K29k16k67j1O8J68J00Q8m78K30J0r7N2j21J69J23
2495A70j99o6k4P3j03K00P7O8j23k35n3L88j33L1j71J54L1k45M15l18j41L62j51
$$ plain form
2518 7 155 88 72 -70 -123 -5 -19 33 -1 103 147 42 94 -305 -129 79 -172 29 197 -434 14 -108 374
2541 374 138 119 88 -94 -174 48 -118 -226 160 160 69 106 -164 -245 -77 -5 100 65 105 -64 17 -133 190 -214
2565 -214 126 -247 84 -222 -61 23 -96 -13 -76 -47 -62 126 -13 -4 192 -30 -66 -213 20 202 219 244 392
2588 392 -2 51 101 -280 217 -287 -78 158 -108 -226 -54 119 -222 -222 -302 -33 -10 87 -163 180 26 51 22
2611 22 -381 5 -6 -87 140 75 159 -38 50 77 50 125 -200 101 -221 7 100 135 3 153 -144 -10 40 -201
2635 -201 170 -89 -10 -176 -77 -189 -142 53 132 191 70 124 -203 -88 68 -308 172 74 65 114 -139 171 -61
2658 -61 38 37 152 52 276 -40 50 -147 86 4 -51 -99 -51 89 -100 103 -24 -54 141 -127 -112 7 -257 112
2682 112 -100 58 52 -113 149 218 16 -8 75 -184 -43 1 2 30 32 -44 -111 -7 -97 -272 74 -150 -38 -82 112
$$ packed form
2518GJ48o7j6j42n3J18j4N2l4J04M4j05N2l99J76K08k51K01J68o31M48j22M82
2541C74k36j9l1j82q0K22j66j08L86%r1L7k70q1J68P2J05l5M0j69Q1j50L23m04
2565b14L40l73L31l06J61Q4j19Q3o3K9j5J88j39RJ96k22l6j47K33J82J7K5J48
2588C92l94N3N0l81M97n04K09K36k66j18J72J73l41%q0K69K3R7k50L43j54K5k9
2611B2m03L86j1q1K27o5Q4j97Q8K7k7P5l25L01l22K28R3L5j32J50k97J34N0k41
2635b01L71k59P9j66R9j12M7J95P9N9j21N4l27J15J56l76M80r8rM9k53L10k32
2658f1R9jJ15j00K24l16R0j97K33q2n5m8M8J40j89K03j27l0J95k68J5J19k64L69
2682A12k12J58oj65K62O9k02k4Q3k59J41M4JK8Kp6o7J04r0j75L46k24J12m4J94
$$ plain form
2707 112 146 33 -73 188 3 -15 -6 26 -99 -197 -132 -45 116 -59 244 -107 190 58 -380 149 111 -105 -121
2730 -121 163 -129 -20 -129 94 -116 123 -232 -330 -2 -139 36 215 -62 18 32 -213 -56 71 64 -32 -41 50
2753 50 213 221 79 -205 27 -181 187 -98 -111 21 83 208 -135 64 0 -17 171 324 71 20 -192 -111 175
2776 175 -34 -266 -154 -14 73 -171 -261 -211 -9 -18 252 -17 -28 -51 190 -38 -130 -79 180 226 -120 133 -24
2799 -24 -36 -198 -96 190 -15 37 -248 -118 -132 -87 -39 -49 276 -21 -182 148 12 228 58 -255 72 221
2821 221 121 240 17 -56 134 113 -77 144 108 35 -108 -293 117 -105 198 -17 204 172 112 36 -104 58
2843 58 -99 -258 -462 -310 134 4 -253 147 -15 52 -191 -1 -45 112 74 -63 -213 -270 34 -77 195 271
2865 271 212 122 200 -285 -109 -128 202 -95 11 237 -46 18 -292 -69 -168 342 40 -33 22 121 -83 -64 196
$$ packed form
2707A12L4j13j06K61j85j8RL2j25r8O5Q7J61j75L03l51K97j32m38N29l8k16j6
2730a21K84k92J09j09K23k10K39l55r8L28j37J75J79k77Q0J4k45J57J27pr6rR1
2753E0J63Qj42k84K32k08L68k85j3J32O2J25l43J99o4j7J88J53k53n1k12Q1K86
2776A75k09k32J12J40Q7k44r0N0K02rK70k69j1k3K41k28r2N1K59M6l46K53j57
2799b4j2j62J02K86k05N2k85J30j4M5M8j0L25k97j61L30j36K16j70l13L27J49
2821B21j00J19k23p3J90k1j90K21l6p3j43j85M10k22L03k15K21l2o0p6j40J62
2843E8j57j59k04J52M44j30k57M00j62O7k43J90m4J57l8j37j50n7L04j11K72P6
2865B71n9r0P8m85J76j9L30k97J06K26k83O4l10K23r9N10l02p3N5R9k04J9K60
$$ plain form
2888 196 -161 80 28 169 -186 74 -34 44 385 157 50 126 -136 -168 126 75 -88 -55 -160 141 -36 -79
2910 -79 -28 198 -160 40 26 -45 -139 -155 -116 -26 190 141 9 -168 30 -418 -71 -89 -17 196 79 32 77 -73
2934 -73 -4 63 -79 -22 273 -133 28 67 -172 108 -36 -66 -218 -251 92 -2 9 2 -177 107 -260 122 147 7
2958 7 -90 -199 112 118 91 44 33 33 20 -162 377 -107 -90 -89 49 74 266 -169 9 -74 -312 201 14 -12 56 77
2984 77 142 -259 131 -8 -72 -50 -53 59 5 55 -35 -218 120 64 -115 157 114 -154 36 -5 191 324 191 -172
3008 -172 67 -110 -49 -123 -16 41 -146 63 -114 174 -146 -94 -354 354 -13 66 77 206 45 -82 -197 -68
3030 -68 52 32 -93 -119 -45 83 142 239 77 -92 -80 -115 -225 227 -259 -104 41 -18 -217 -208 -21 -15 91 74 168
3055 168 -299 -5 134 27 -92 -2 -373 -1 -99 133 170 -177 -228 -34 278 149 -24 -19 126 -98 -74 62
$$ packed form
2888A96l57K41n2J41l55K60j08P8L41k28j07P6k62l2K94n1j63L3j05L01j77m3
2910g9N1K26l58K00j4p1r4j6L9R0K16m9j32j77J98m48L47j8P2K13j17m7M5j50
2934g3O9O7j42N7K95m06J61L9k39K80j44l0j52l3L43r4J1pj79K84l67L82K5j40
2958Gr7j09L11Ok7m7j1%j3j82N39m84J7JJ38K5J92m35J78q3k38N13j87k6O8K1
2984G7O5m01L90j39o4K2lJ12n4N0r0j83L38n6j79K72m3k68J90m1J96J33j33l63
3008a72K39j77O1p4J07N7j87K09j77K88l20N2k60P08l67P9J1J29j61j27j15J29
3030f8J20k0j25k6P4J28N9R7j62j69J2l5j10M52m86J55J45n9j99RJ87OJ06j7R4
3055A68m67K94J39j07j19R0l71L72r8K32L7l47n1J94L12j29j73NJ45k24K4J36
$$ plain form
3077 62 -12 155 -17 -150 -27 20 40 19 112 68 41 235 -269 22 46 87 -80 -60 172 -93 103 -186 -188 -61
3101 -61 160 20 -26 440 160 32 133 35 -103 9 -54 252 -24 -92 -136 -39 112 127 126 141 222 -165 127 120 8
3126 8 -96 117 33 -12 110 212 134 152 -115 159 -195 -64 -92 -254 109 -80 -20 103 31 -100 261 46 68
3149 68 343 -59 -67 304 70 -7 -172 -138 42 217 -79 68 -203 -51 170 -148 270 160 -111 198 -258 -182
3171 -182 -234 -36 -125 -45 72 74 52 -110 154 54 -282 16 167 -65 -81 -39 74 -130 20 -198 -149 310 116
3194 116 14 -186 164 210 18 67 -50 -160 -204 -61 -222 18 -154 -218 -228 312 234 103 174 -157 179 -28
3216 -28 -26 67 188 49 24 -215 104 -21 -29 -36 168 49 -39 97 143 -228 -132 -113 104 158 72 -231 102 -68 -179
3241 -179 -6 -105 -47 187 93 238 -216 33 206 73 13 79 55 -167 153 128 250 -105 132 115 214 -21 -152
$$ packed form
3077F2p4J67j72j33J23M7K0k1R3m4k7J94n04K91K4M1j67K0K32k65J96k89kJ27
3101f1K21j40m6M66k80j28J01r8j38J12o3L06k76o8m4R7J51J5jJ5Q1l87K92pj12
3126Hj04K13q4m5J22J02p8J8k67K74l54J31k8j62L63j89O0J23p2j31L61k15K2
3149F8K75m02qL71k34p7j65L4J80J75k96J47k71J52K21l18M18j10k71L09m56P6
3171a82n2J98q9Q0J17Kk2j62K64j00l36K98J51k32j6M2J13k04J50k18M9M59j94
3194A16j02k00L50M6j92M9j17j10m4J43j61K40j72o4j0N40p8j31P1l31L36k07
3216b8KR3J21j39k5k39L19j25qpK04j19q8J36M6l71R6J9K17N4q6l03L33j70j11
3241a79J73r9N8K34r4J45m54K49J73j33o0O6k4k22L20k5J22l55K37j7R9k35j31
$$ plain form
3264 -152 -267 48 -123 65 44 -38 -27 132 -294 -71 -91 -4 54 77 114 73 10 -311 -146 104 88 39 -114 18
3288 18 -121 -297 -111 120 -208 95 -73 133 -226 53 192 -112 -54 188 -296 30 104 -119 155 -4 -87
3309 -87 -314 40 -1 -117 -71 -86 -95 -157 306 78 -50 29 -23 -172 -171 -119 72 69 -62 -154 14 -15 188 95 -260 -74
3335 -74 -108 -23 -186 51 60 -252 -279 42 -131 -130 -44 -11 -111 -80 155 128 89 -167 -72 -84 195 85 13 120 -32
3360 -32 10 -72 30 98 -9 188 -248 51 -142 43 -264 -471 -42 194 61 77 107 76 -69 -245 82 143 -215
3383 -215 -33 73 88 5 -91 -93 75 -216 233 -94 -53 -40 172 83 -228 -86 23 285 -161 -139 -16 292 -126
3406 -126 91 111 106 -55 68 138 -256 -196 66 -296 177 202 14 -435 91 -36 211 56 -277 1 133 -56
3428 -56 -238 33 148 -137 -217 106 -235 20 181 -82 138 111 22 -101 -75 131 -95 -18 -29 -81 107 -98 32
$$ packed form
3264a52j15L15j71J88k1q2J1J59m26K23k0Q7N8K3L7m1o3l21J65K50j6m9j53J32
3288A8j39j76J86K31l28L03j68K06l59K79J39l04N8K42m84L26P4k23K74j59q3
3309h7k27L54m1j16M6j5ro2M63k28j28P9n2j49JN2J91lj31r2J68k9K03r3l55J86
3335g4l4Q5j63K37Rl12k7L21j73JQ6L3j00L1K35k7l9k56R5j2K79j10p2J07j52
3360c2M2q2J02O8j07J97m36K99j93J85l07k07M29K36j33J6L0l1j45j76L27O1l58
3383b15J82J06J5q3r6kJ68k91M49l27M1J3K12q9l11J42J09K62m46K2J23L08m18
3406a26K17K0nj61J23P0l94O0K62l62M73K5j88m49N26j27K47j55l33K78J32j89
3428e6j82K71J15k85q0L23l41K55J61k63K20k7q9j23K6K06k26P7j1n2J88k05J30
$$ plain form
3451 32 -235 83 76 -7 -104 180 -112 60 195 207 -215 219 64 -330 -84 -63 332 11 -45 -48 148 237 -33 -290
3475 -290 -84 -171 -48 -143 -428 -149 -212 -178 147 -74 -161 15 116 -4 203 -209 -193 -115 57 56 90 -74 98
3498 98 -96 87 185 -28 -36 -250 63 -159 -76 333 46 -136 110 -209 129 260 -128 -32 -25 135 13 -121 -44
3521 -44 313 166 53 -55 -158 47 117 -206 8 -68 -68 -13 -49 63 3 75 -54 -262 57 -239 56 15 -79 53
3545 53 20 140 -145 282 91 -26 -195 55 -74 -162 147 -153 -109 22 -275 -115 -153 -173 -121 -142 -84 -296 -149
3568 -149 -54 33 -226 -271 -293 162 169 80 94 -214 -191 74 161 209 -43 9 221 -139 -183 -162 85 -240 -167 -119 -356
3593 -356 -64 29 -197 -162 -120 141 -18 -89 -157 -135 28 -414 -160 13 -153 -161 160 29 -27 66 114 118 199 -8 -196
3618 -196 147 105 10 149 -20 -13 80 -74 -65 -33 -56 269 -171 -3 23 75 87 114 -18 130 226 -263 -140 104 344
$$ packed form
3451C2k67L18pq3r7K84k92J72J35J2m22M34j55l94K46K1L95l21n6lJ96Q9k70k57
3475b90K06q7J23r5k85K79o3L4L25k21q7J76J01j20K07m12J6P8J72jL4j64J72
3498I8j94J83R8k13qk14L13k22Q3M09k87j82K46l19L38J31l88R6PJ60j22j34P7
3521d4L57j47j13j08j03K05P0l23K14p6%N5l6J12o0P2j29k08L19k96K95m1r4J32
3545E3l3J20k85M27j91j17j69K50j29q8L09l00M4J31k97J60l8k0N2k1N8k12J47
3568a49R5Q7k59m5k2M55Pq9J4l08K3K65Q7M8k52N2K12l60m4K1K47l25P3M8k37
3593c56K92R3k26L5M2K61j59p1o8K2J63m42K54J73j66qL21j31n6R3M8MQ1k07j88
3618a96L43m2r5J39j69PR3j54RL2k3L25m40J68K6N2J2K7j32J48R6m89J23K44K40
$$ plain form
3643 344 -71 -155 4 -20 124 -76 179 -22 -194 95 42 149 179 -40 75 -175 85 -19 -111 -173 -118 191
3665 191 92 -47 -82 -80 -131 27 -80 -257 -25 43 43 22 155 -117 -113 62 -5 -189 -73 -4 106 184 143 -86 173
3690 173 16 108 -180 114 149 44 84 118 92 41 15 103 42 101 94 242 125 -181 -55 211 -128 -16 187 -135
3714 -135 109 -114 81 185 43 94 -14 140 -35 36 -92 17 -276 -295 -221 -191 52 37 230 -92 110 53
3736 53 140 -99 67 320 -45 -131 -1 28 47 -88 -173 44 -68 110 36 -42 -25 -7 -306 29 109 -261 -23 -55
3760 -55 102 101 -22 87 263 309 84 8 -67 14 -312 49 -20 157 213 8 -32 -233 80 305 168 -38 -280
3783 -280 21 -133 130 -78 -49 -240 139 208 -226 149 151 56 -90 -105 90 -21 5 -303 -67 -71 -50 97 111 118
3807 118 115 -232 -82 -11 -71 362 47 30 78 -108 -34 81 89 41 -140 67 63 328 174 -47 -53 -76 263 10 -280
$$ packed form
3643C44m15q4J59k4J44k00K55k01j72K89n3J07L0k19J15k50K60j04r2o2N5L09
3665A91r9j39l5Kn1J58j07j77K32O8%k1J33k72MJ75o7j84J16O9J10P8m1k29K59
3690A73j57R2k88K94L5j05M0L4k6n1k6Q8o1N9pJ48j17l06J26K66l39J12K03l22
3714a35K44k23J95J04j42N1j08J54j75P1j28J09k93j9P4L0K43j5J93l22K02n7
3736E3Q7k39J66K53l65q6J30K9J9j35q5K17j12J78p4p8J7J8k99L35Q0l70K38l2
3760e5J57jj23J09J76M6k25p6p5Q1l26L61o9J77N6k05m0k01L13K25j37k06k42
3783b80L01j54K63k08K9j91L79O9m34L75Kr5j46j5J95j11K6l08K36mK1J47J4P
3807A18ll47J50P1o0M33l15j7M8j86P4J15Qm8j81K07mK65j54k21ok3L39k53k90
$$ plain form
3832 -280 219 50 -47 -280 38 161 149 41 -107 245 57 -10 12 48 -5 171 7 -69 -26 -145 -68 153 32
3855 32 -190 -131 219 136 27 -231 -320 113 -229 -245 84 156 -23 84 -26 -172 66 26 -176 142 -196 -152 98
3878 98 -6 -114 -7 108 96 129 106 -92 26 235 -300 7 -231 151 -121 -92 34 127 -19 108 -76 52
3900 52 41 -327 -30 -208 -137 -255 -133 211 -293 -82 71 89 -164 340 187 -74 339 80 104 -89 193 46
3922 46 218 371 178 -29 50 -40 121 -89 -108 89 51 43 -34 32 1 -106 -149 -1 -176 33 -176 -42 113 -108
3946 -108 -74 76 32 -93 -65 -7 247 -158 -175 48 249 74 -267 -151 -138 -46 -110 -158 -44 104 540 96 -67
3969 -67 -234 85 175 -65 110 -176 146 103 -39 -441 120 322 -16 -1 -16 -6 -9 11 -127 7 104 -231 128
3992 128 -103 -87 102 -196 -127 -95 -32 -191 245 4 -155 -22 -181 -184 71 73 -5 166 -69 -200 -50 -54 -18 113
$$ packed form
3832b80M99j69r7k33L18J23j2j08j48L52j88o7K2L6n3J76j64p6M3j19P7K21j21
3855C2k22N9L50q3j09k58q9M33l42j6L29P2j79J07j10j46K38m0k02L18l38M4K50
3878I8j04j08J07J15j2L3k3j98J18K09n35L07k38L82k72K9J26R3j46J27j84J28
3900E2j1l68K97j78P1j18J22L44n04K11J53J8k53N04j53k61M13k59K4j93K82j47
3922D6J72J53j93k07P9r0J61k10j9J97l8qp7O6l1j07m3J48j75K09k09J34J55k21
3946a08L4J50m4j25K8N8K54m05j7K23K01j75l41J16J3R2o4m8J14J48M36m44j63
3969f7j67L19R0k40J75k86L22m3j42m02N61K02l38J5j5J0lK0j38J34R7l35L59
3992A28k31J6J89k98O9L2O3j59M36k41j59J33j59lK55Kp8J71k35j31J50mL6J31
$$ plain form
4016 113 55 217 208 115 -6 74 168 -1 165 -56 -330 132 -60 -148 -133 106 -100 92 -83 26 50 -48 -45 -300
4040 -300 -129 -56 87 247 32 -7 31 57 -48 27 319 120 84 -48 -112 131 85 7 -313 -127 -148 -51 223 240
4064 240 -36 -147 67 -38 -157 -98 109 91 -275 -2 211 201 332 83 33 189 68 -156 20 -72 166 -26
4086 -26 -23 -83 -164 -107 67 -139 252 115 155 -183 14 -367 68 28 -200 -67 -324 70 229 160 152 243 -200 69
4110 69 -79 302 -52 190 -19 97 78 -57 -77 -101 -180 -122 24 -228 40 -93 144 141 -83 13 -94 -224 229
4133 229 4 64 -156 -22 103 268 -110 -156 99 47 31 3 4 143 -24 219 77 139 84 335 79 -111 -166
4156 -166 218 96 -49 -76 119 128 -17 -179 96 -11 -114 -67 -94 -45 -107 235 -47 52 10 254 -285 123 -141
4179 -141 181 -10 -302 58 -54 -17 128 28 26 -156 -147 -35 20 -41 94 -53 -199 -96 -70 -28 -40 102 160 -93
$$ packed form
4016A13n8J62rr3j21Q0R4j69J66k21k74M62j92q8J5K39k06J92j75J09K4r8Lk55
4040c00J71P3J43J60k15l9L8K6j05P5K92j99l6j32o4K43m6p8l20J86k1R7K74J7
4064B40k76j11K14j05j19N9K07j8l66K73K13j0J31k49n0J56j21k24J76r2K38j92
4086b6Lo0q1N7J74k06L91j37M0l38J97l81M35m0k28J33k57L94J59o9qR1m43K69
4110F9j48L81l54K42k09J16j9j35k0k4p9N8J46k52K68j33K37lk24R6j07j30M53
4133B29k25O0k20J34J25J65l78m6K55n2j6k8JJ39j67K43j42O2n5K51k56j90n5
4156a66L84j22j45k7J95Rj45j62K75j07j03M7k7M9o2L42k82R9m2K44n39M08k64
4179a41L22j91k92L60j12L7J45j00kj82RJ12N5o1J35j47j46J03K6M2j2J42N8k53
$$ plain form
4203 -93 141 81 162 -20 -52 -99 -131 79 -138 284 -2 -176 55 63 -35 134 232 -45 -202 -207 4 51 114 14 -87
4228 -87 23 -136 -257 -75 154 -109 79 329 88 113 -144 -74 -232 159 -131 92 60 92 1 -193 -167 -13
4250 -13 -17 307 84 -23 -35 71 14 -32 216 156 -141 -17 87 -24 -10 -42 -62 -60 154 -4 64 108 -184 139 -182
4275 -182 -135 -179 9 128 -61 124 -87 -140 -5 -35 274 -148 -133 149 -43 32 16 38 -46 -23 7 171 -20 227
4299 227 -26 159 -157 -346 42 287 55 259 132 144 131 113 67 -28 151 -95 -45 -81 -94 70 -79 -201 147
4322 147 -101 -38 -56 -41 18 -71 -46 -129 -54 -112 -74 -27 138 -180 -24 -13 54 -98 -38 -17 170 46 -37 -202 159
4347 159 -159 -6 -27 5 339 -114 162 104 -40 -278 -129 -283 234 99 204 44 187 255 -44 -286 91
4368 91 111 -87 -23 153 -15 99 71 -70 -219 209 -135 -163 57 -4 -273 161 202 -102 186 71 102 -320 115
$$ packed form
4203i3K34o0Q1j82l2m7l2K10k17M22k86j74K31Qr8J69R8k77j57nK11M7O3j00j01
4228h7J10j59j21J82K29k63J88K50k41K5k57P0j58L91k90K23l2L2r1j94K6J54
4250a3mL24k23j07j2J06n7m6K48o0k97J24J04j11J4l2k0KK14j58O8M4k92L23l21
4275a82M7m4J88J19j89J85k11n3J35l0L09m22J5K82j92P5j6K2q4K3L0J64j91K47
4299B27k53J85l16j89L88K45k32K04j27J2j3j8m6r5J79k46N0l6j3J64j49j22L48
4322A47k48O3j8J5N9q9K5q3P5n8L8M7J65l18J56J1O7j52O0K1J87j24q3j65L61
4347A59l18J53k1L2L34m53K76n8j44k38J49j54N17j35J05j60J43O8k99k42L77
4368I1K0j98O4J76j68J14k8j41j49M28l44k8K20o1k69M34M1l04K88j15L1m22M35
$$ plain form
4391 115 -243 -105 -126 116 294 -81 -115 166 49 -197 -27 116 -115 -131 -72 -200 17 -49 181 -55 7 -158
4413 -158 -215 51 -293 -50 133 -77 222 309 -212 147 266 -34 36 -42 133 -43 213 100 73 148 -40 267
4435 267 -64 -57 -34 239 -222 -189 -53 113 181 78 -87 48 54 -55 212 -173 -228 -53 -55 55 96 -65 -175 -72
4459 -72 43 -100 -135 -100 61 181 -78 150 -264 -213 23 157 -78 45 43 248 -29 55 -100 -147 170 -216 -104
4482 -104 14 -105 -27 -235 -342 58 21 99 -151 -68 -49 77 43 -204 -294 -11 -122 -94 -264 228 -197 102 -267
4505 -267 181 -176 -175 -42 154 -64 -191 38 91 141 174 59 144 174 -216 103 -53 356 -27 144 -162 73
4527 73 89 -131 66 200 -284 -150 -81 -142 -103 -129 232 -126 66 19 -123 42 124 139 -263 -1 -117 9 -135
4550 -135 -170 -124 15 170 -214 106 -121 -259 -248 35 228 -103 38 27 -11 212 -116 -17 -5 127 -382 122
$$ packed form
4391A15l58J38k1K42J78l75l4K81j17k46J70J43k31j6N9j28K17o6K30k36O2j65
4413a58n7K66l44K43J83k10K99Q7n21L59J19l00P0p8J75j76K56j13k7P5j88L07
4435B67l31PK3K73m61L3J36J66O8j03j65J35Oj09K67l85n5J75kJ10M1j61j10J03
4459g2J15j43l5L5J61J20k59K28m14N1K36J34k35J23kK05k77Q4j55m7L17l86J12
4482a04J18j19P8k08j07M00l7P8k50Q3J9J26l4k47r0K83j11K8j70M92m25K99l69
4505b67M48l57JJ33J96k18j27K29N3N0L3j15Q5L0l90L19j56M09l83J71l06K35
4527G3J6k20J97J34m84J34O9o1L9k6L61l58J92m7j42J65Q2J5m02K62j16J26j44
4550a35l5M6J39J55l84L20k27j38J1K83J93l31J41j1l8K23l28R9J2J32n09N04
$$ plain form
4572 122 33 -10 -153 -297 -64 -48 -91 -144 -112 156 2 -99 -203 234 -10 -66 119 127 -56 61 55 -46 100 -139
4596 -139 252 -151 269 242 -129 17 -112 -99 98 -295 77 15 113 158 136 -25 18 -9 67 -13 25 -30 -121 304
4620 304 -146 90 -93 65 22 109 -44 -222 -52 -6 -136 -283 152 -112 -358 147 321 -80 58 155 -210
$$ packed form
4572A22q9m3j43j44K33J6m3n3L2K68j54j01j04M37k44n6J85Qj83J17oj01J46k39
4596a39L91m03M20k7l71J46j29J3J97l93L72o2R8M5k2j61M3k7P6q0L8n5r1M25
4620C04m50K36j83J58m3Q7j53j78J70M6j30j47M35k64k46N05J74m01J38R7l65
$$ [...]
8191A49
##END NTUPLES=NMR FID
##END=
