##TITLE=1H_DE-87_ch_4_TFA
 200.13MHz, CDCl3,
 8 sc
 
 23.4.2025
##JCAMPDX= 6.0         $$ Bruker NMR JCAMP-DX V2.0
##DATA TYPE= NMR FID
##DATA CLASS= NTUPLES
##ORIGIN= UXNMR, Bruker Analytische Messtechnik GmbH
##OWNER= pz
$$ XWIN-NMR		Version 3.5
$$ Wed Apr 23 14:02:15 2025 Russian Standard Time (UT+4h)  she@DPX200
##.OBSERVE FREQUENCY= 200.1313
##.OBSERVE NUCLEUS= ^1H
##.DELAY= (6, 6)
##.ACQUISITION MODE= SIMULTANEOUS
##.ACQUISITION SCHEME= undefined
##.AVERAGES= 8
##.DIGITISER RES= 18
##SPECTROMETER/DATA SYSTEM= spect
##.PULSE SEQUENCE= zg30
##.SOLVENT NAME= CDCl3
##.SHIFT REFERENCE= (INTERNAL, CDCl3, 0, 14.3821)
##AUDIT TRAIL= $$ (NUMBER, WHEN, WHO, WHERE, WHAT)
$$ ##TITLE= Audit trail, XWIN-NMR		Version 3.5
$$ ##JCAMPDX= 5.01
$$ ##ORIGIN= Bruker BioSpin GmbH
$$ ##OWNER= she
$$ F:/spectra/data/she/nmr/H-C/1/audita.txt
$$ ##AUDIT TRAIL=  $$ (NUMBER, WHEN, WHO, WHERE, WHAT)
(   1,<2025-04-23 14:00:44.25 +0400>,<she>,<DPX200>,
      <created by zg, POWCHK disabled, PULCHK disabled
       configuration hash MD5:
       00 E9 B6 7A A2 85 ED C7 34 08 36 98 17 FE 4E 26
       data hash MD5: 16K
       15 CF 1B DF 9F E6 99 63 0B 23 41 F0 9D F9 E4 21>)
$$ ##END=
$$ 
$$ hash MD5
$$ 25 0D 12 52 5B 5B 5F 45 EB 9B B7 45 E1 A9 9D 09
##$RELAX= 
##$RELAX= 
##$RELAX= 
##$RELAX= 
##$RELAX= 
##$RELAX= 
$$ Bruker specific parameters
$$ --------------------------
##$DU= <F:/spectra>
##$EXPNO= 1
##$NAME= <H-C>
##$PROCNO= 1
##$TYPE= <nmr>
##$USER= <she>
##$AMP= (0..31)
100 100 100 100 100 100 100 100 100 100 100 100 100 100 100 100 100 100 
100 100 100 100 100 100 100 100 100 100 100 100 100 100 
##$AQSEQ= 0
##$AQ_mod= 1
##$AUNM= <au_zg>
##$AUTOPOS= <>
##$BF1= 200.13
##$BF2= 200.13
##$BF3= 200.13
##$BF4= 200.13
##$BF5= 200.13
##$BF6= 200.13
##$BF7= 200.13
##$BF8= 200.13
##$BYTORDA= 1
##$CFDGTYP= 0
##$CFRGTYP= 5
##$CHEMSTR= <none>
##$CNST= (0..31)
1 1 145 1 1 1 1 1 1 1 1 1 1 1 1 1 1 1 1 1 1 1 1 1 1 1 1 1 1 1 1 1 
##$CPDPRG= <>
##$CPDPRG1= <>
##$CPDPRG2= <>
##$CPDPRG3= <>
##$CPDPRG4= <mlev>
##$CPDPRG5= <mlev>
##$CPDPRG6= <mlev>
##$CPDPRG7= <mlev>
##$CPDPRG8= <mlev>
##$CPDPRGB= <>
##$CPDPRGT= <>
##$D= (0..31)
0 0.7 0 0 0 0 0 0 0 0 0 0.03 0 0 0 0 0 0 0 0 0 0 0 0 0 0 0 0 0 0 0 0 
##$DATE= 1745402443
##$DBL= (0..7)
120 120 120 120 120 120 120 120 
##$DBP= (0..7)
150 150 150 150 150 150 150 150 
##$DBP07= 0
##$DBPNAM0= <>
##$DBPNAM1= <>
##$DBPNAM2= <>
##$DBPNAM3= <>
##$DBPNAM4= <>
##$DBPNAM5= <>
##$DBPNAM6= <>
##$DBPNAM7= <>
##$DBPOAL= (0..7)
0.5 0.5 0.5 0.5 0.5 0.5 0.5 0.5 
##$DBPOFFS= (0..7)
0 0 0 0 0 0 0 0 
##$DE= 6
##$DECBNUC= <off>
##$DECIM= 32
##$DECNUC= <off>
##$DECSTAT= 4
##$DIGMOD= 1
##$DIGTYP= 9
##$DL= (0..7)
0 120 120 120 120 120 120 120 
##$DP= (0..7)
150 150 150 150 150 150 150 150 
##$DP07= 0
##$DPNAME0= <>
##$DPNAME1= <>
##$DPNAME2= <>
##$DPNAME3= <>
##$DPNAME4= <>
##$DPNAME5= <>
##$DPNAME6= <>
##$DPNAME7= <>
##$DPOAL= (0..7)
0.5 0.5 0.5 0.5 0.5 0.5 0.5 0.5 
##$DPOFFS= (0..7)
0 0 0 0 0 0 0 0 
##$DQDMODE= 0
##$DR= 18
##$DS= 0
##$DSLIST= <SSSSSSSSSSSSSSS>
$$ [...]
##$SUBNAM0= <"">
##$SUBNAM1= <"">
##$SUBNAM2= <"">
##$SUBNAM3= <"">
##$SUBNAM4= <"">
##$SUBNAM5= <"">
##$SUBNAM6= <"">
##$SUBNAM7= <"">
##$SUBNAM8= <"">
##$SUBNAM9= <"">
##$SW= 18.0517328524113
##$SWIBOX= (0..15)
0 0 2 0 0 0 0 0 0 0 0 0 0 0 0 0 
##$SW_h= 3612.71676300578
##$TD= 16384
##$TD0= 1
##$TE= 0
##$TE2= 300
##$TE3= 300
##$TEG= 300
##$TL= (0..7)
0 120 120 120 120 120 120 120 
##$TP= (0..7)
150 150 150 150 150 150 150 150 
##$TP07= 0
##$TPNAME0= <>
##$TPNAME1= <>
##$TPNAME2= <>
##$TPNAME3= <>
##$TPNAME4= <>
##$TPNAME5= <>
##$TPNAME6= <>
##$TPNAME7= <>
##$TPOAL= (0..7)
0.5 0.5 0.5 0.5 0.5 0.5 0.5 0.5 
##$TPOFFS= (0..7)
0 0 0 0 0 0 0 0 
##$TUNHIN= 0
##$TUNHOUT= 0
##$TUNXOUT= 0
##$USERA1= <user>
##$USERA2= <user>
##$USERA3= <user>
##$USERA4= <user>
##$USERA5= <user>
##$V9= 5
##$VALIST= <valist>
##$VCLIST= <CCCCCCCCCCCCCCC>
##$VD= 0
##$VDLIST= <DDDDDDDDDDDDDDD>
##$VPLIST= <PPPPPPPPPPPPPPP>
##$VTLIST= <TTTTTTTTTTTTTTT>
##$WBST= 1024
##$WBSW= 4
##$XGAIN= (0..3)
0 0 0 0 
##$XL= 0
##$YL= 0
##$YMAX_a= 163819
##$YMIN_a= -166411
##$ZGOPTNS= <>
##$ZL1= 120
##$ZL2= 120
##$ZL3= 120
##$ZL4= 120
##$ABSF1= 10
##$ABSF2= 0
##$ABSG= 5
##$ABSL= 3
##$ALPHA= 0
##$AQORDER= 0
##$ASSFAC= 0
##$ASSFACI= 0
##$ASSFACX= 0
##$ASSWID= 0
##$AUNMP= <proc_1d>
##$AZFE= 0.1
##$AZFW= 0.1
##$BCFW= 1
##$BC_mod= 2
##$BYTORDP= 1
##$COROFFS= 0
##$CY= -3
##$DATMOD= 1
##$DC= 2
##$DFILT= <>
##$DTYPP= 0
##$F1P= 0
##$F2P= 0
##$FCOR= 0.5
##$FTSIZE= 0
##$FT_mod= 4
##$GAMMA= 1
##$GB= 0.15
##$INTBC= 1
##$INTSCL= 1
##$ISEN= 128
##$LB= 0.25
##$LEV0= 0
##$LPBIN= 0
##$MAXI= 10000
##$MC2= 0
##$MEAN= 0
##$ME_mod= 0
##$MI= 1.114404
##$NCOEF= 0
##$NC_proc= 0
##$NLEV= 6
##$NOISF1= 3.799351
##$NOISF2= 2.8
##$NSP= 1
##$NTH_PI= 0
##$NZP= 0
##$OFFSET= 14.38212
##$PC= 1
##$PHC0= -831.2185
##$PHC1= 11.3922
##$PH_mod= 1
##$PKNL= yes
##$PPARMOD= 0
##$PSCAL= 0
##$PSIGN= 0
##$REVERSE= no
##$SF= 200.129724274929
##$SI= 16384
##$SIGF1= 3
##$SIGF2= 2
##$SINO= 400
##$SIOLD= 16384
##$SREGLST= <1H.CDCl3>
##$SSB= 0
##$STSI= 0
##$STSR= 0
##$SW_p= 3205.1282051282
##$SYMM= 0
##$S_DEV= 0
##$TDeff= 0
##$TDoff= 0
##$TI= <>
##$TILT= no
##$TM1= 0
##$TM2= 0
##$TOPLEV= 0
##$USERP1= <user>
##$USERP2= <user>
##$USERP3= <user>
##$USERP4= <user>
##$USERP5= <user>
##$WDW= 1
##$XDIM= 8192
##$YMAX_p= 0
##$YMIN_p= 0
$$ End of Bruker specific parameters
$$ ---------------------------------
##NTUPLES= NMR FID
##VAR_NAME=  TIME,          FID/REAL,        FID/IMAG
##SYMBOL=    X,             R,               I
##VAR_TYPE=  INDEPENDENT,   DEPENDENT,       DEPENDENT
##VAR_FORM=  AFFN,          ASDF,            ASDF
##VAR_DIM=   8192,          8192,            8192
##UNITS=     SECONDS,       ARBITRARY UNITS, ARBITRARY UNITS
##FACTOR=    0.0002768,     1,               1
##FIRST=     0,             0,               0
##LAST=      2.2672688,     0,               0
##MIN=       0,             -166411,         0
##MAX=       2.2672688,     163819,          0
$$ Real data points
##PAGE= N=1
##DATA TABLE= (X++(R..R)), XYDATA
0@%%%%%%%%%%%%%%%%Pj5J6j6J6j6K1k9L2l7M5m9N7o9P7q5R8j14J30j46J62j80
38i5K02k25K50k79L10l43L80m19M63n13N64o19O82p53Q30r15J009j116J238j377
58g26J539j726J947k217K556k992L571m389N643p814J2623m2964K0013M3209p6127
73d7854P7555J20266j07576j08807J56594N4356j95866k3718J93713o4313k20761
84a66411Q2503J61804j39225j04641J70586R3992j39107o0792J42936Q0014j18988
95B671m5425J33642J3329j56097m287J44583k5225j47985L6466J08842r1798q0904
107a12188J28847M7319j25165M23J22449j8499j04813M3142J19550m5058j14988
118e8981N1710Q8290p5509p6544Q8416O4616j17385q1438J16065N7344j20494
$$ y = [0, 0, 0, 0, 0, 0, 0, 0, 0, 0, 0, 0, 0, 0, 0, 0, 0, 7, -8, 8, -8, 8, -8, 13, -16, 16, -21, 24, -25, 32, -37, 40, -45, 53, -61, 69, -77, 85, -95, 107, -118, 132, -147, 163, -180, 200, -219, 244, -269, 295, -324, 358, -395, 435, -480, 529, -587, 651, -726, 813, -913, 1034, -1183, 1373, -1619, 1952, -2437, 3206, -4608, 8015, -34949, -14936, 28273, -47854, 29701, 149967, 42391, -66416, 90178, 144534, -51332, -75050, 118663, 54350, -166411, -83908, 77896, -61329, -165970, 4616, 98608, -40499, -101291, 41645, 121659, 2671, -42754, 90888, 104217, -51880, -56167, 88416, 63191, -84794, -48328, 60514, -31284, -112188, 16659, 63978, -61187, -60764, 61685, 43186, -61627, -18485, 101065, 56007, -58981, -7271, 81019, 5510, -71034, 17382, 81998, -35387, -116825, -760, 56584, -63910]
129f3910j3659J28007q287j05075L8737J09478l3104q4314N8165O3282r5762n7274
141f3716R4232K1549j01572p862Q9260k3539r9787N1221J11254o2498r0145P8106
153c497O8024p7552m1024R0236M5028r1398m0886R0554J8317r1866P52Q3340k2288
166B7740r0133K2867Q0104l8876o1649O9274M2750q5495j6850Q8777K748p1968
178c0711J5903O6421l7347p3860M9579O8524n8941n7294N9057M3528o3444l8862
190e7447P9130M2792q4555k6350Q4693L02p7948K0885O9555l2559o6786L4721
202a3567N0268m6363k9939N8122J0343o0785j893N4386K33m6639J3121N5930k6862
215A6355n9433M2151N6252m9249m6353N1913L1628o9295l0203P7789J9565p6657
$$ y = [-63910, -77569, 50438, 42151, -62924, -24187, 85291, 52187, -32127, 26038, 89320, -6442, -63716, 30516, 52065, -49507, -57369, 31891, 8352, -91435, -40214, 71040, 8542, -81603, -3497, 64527, -13025, -54049, 36187, 81215, -10183, -51069, 39485, 57802, -34064, -33312, 50028, 27740, -62393, -39526, 40578, 1702, -59947, 9327, 52077, -33418, -50268, 38509, 41257, -30711, -14808, 51613, 14266, -59594, -10015, 58509, -432, -57726, 1331, 44859, -18585, -57447, 21683, 64475, -20080, -46430, 38263, 38565, -39383, -18498, 51057, 18498, -48288, -13567, 36701, -9662, -39601, 18521, 28864, -31921, -33814, 20572, 20805, -25834, -12713, 43217, 16355, -43078, -927, 55325, 6076, -40277, 11636, 43264, -26031, -56234, 21555, 41120, -35537]
227c5537m83O6028j4176n0156K6737M9029k6019m4296K8726L1104l9237j6079
239b4359M3285M099m5665l588M2954l801m4593K0763M8560l7450m4170M6082L7026
252C9143m3322k3457M8744J8299n8151j3128O1354L237n7612L332M2450j5182
264E707m2588J7652M3252k1753l4409L2534K2929l4074l396M0898R8l8703K126
277i727L5696j5816l8178K7986L1106l9971k8288L7792K1019l5419j4317M3081
289A4964J0420m9640k453N0601k481l9481J0167L4420j3679l4676J8155L3314
301B9631k4513k5791K4851P603l0221j371L0106j065k9408P566L2287j7117k5309
314b2751L3236K2970l4888j8743L0290J3077l4751j0227L8942M24m3477M386L8044
$$ y = [-35537, -36020, 30008, 15832, -34324, -7587, 41442, 15423, -28873, -147, 30957, -8280, -24359, 18926, 23025, -22640, -26228, 16726, 12925, -31668, -10905, 37655, 205, -43965, 2117, 39143, -4179, -27636, 21108, 39407, -18744, -31872, 29482, 32719, -24893, -21561, 20889, 5707, -36881, -19229, 24023, 2270, -32139, 395, 23324, -10750, -14146, 26752, 26850, -11853, -9727, 25969, 10153, -28025, -39, 31067, -8904, -37192, 600, 21619, -13800, -28117, 14964, 25384, -24256, -26709, 23892, 21411, -18070, -7903, 26517, 12838, -21838, -3683, 29631, 5118, -20673, 4178, 11781, -18440, -19811, 10295, 9230, -20178, -12612, 19675, 2558, -22751, 10485, 33455, -1433, -20176, 10114, 23191, -11560, -21787, 17155, 17579, -25898, -21512, 16532]
327A6532p059k8562J1388K8134j4728k8037K0610K4016k1851j2525K1275K320
339A1513k1611O20K3704l413k5609R935K0598k2100j6958K7908J3888k6859j2097
352b0481K7723J1507l0454k220L6660l864l5050N961K6696q755k5014J1029K2870
365A6608j8282k1475K1894J4827j8353l494J7063M64j7497K279J9702o014j8941
378a1219J3394J2088k1536q616K1806R008k2353r293K4464M419k8369K765L0493
391A7051o033k5582O742K2086o419j9525J2398J8598j8544j5683J7036P163j5411
404f123k830J3004m66j6576M571J8088q380j0996J5994O570j7495m250J8469N416
418A4996k0684m226K1177l277k3982O574K1630o940j9104N307J7626p166j5877
$$ y = [16532, 9473, -19089, -7701, 20433, 5705, -22332, -1722, 22294, 443, -12082, 9193, 11513, -10098, -9478, 14226, 10813, -14796, -4861, 15737, -6363, -23321, 4587, 18475, -8384, -20481, 7242, 18749, -11705, -13925, 22735, 18871, -16179, -10218, 16478, 7723, -17291, -6262, 16608, -1674, -23149, -1255, 13572, -4781, -8275, 8788, 9252, -8245, -5966, 13736, 7722, -11219, 2175, 14263, -7273, -15889, 5917, 14925, -7428, -16721, 7743, 12162, -16207, -13442, 17051, 11018, -14564, -7822, 14264, 7845, -11680, 718, 19316, 772, -14911, 2125, 9288, -6123, -8953, 4051, 3585, -12991, -8420, 9668, 1288, -9708, 6286, 12856, -4639, -8889, 9580, 14996, -5688, -9914, 11263, 7986, -15996, -9422, 12208, 5268, -13836, -8529, 9097, 1931, -13946]
431a3946J3818J4323j4681q325J3078N155j0208j475J1431k107j5610M859J1730
444H042j1479o786J2595K417j4174k737J6837M467j7778K184J9935o010j7866
457a0353Q039J6986o441j7056N346J4609j1032j2596J2943P717j2665m667Q208
470i62L153p327M44J0945k946r577P416O881q191k269R385J653j2704l743J4255
485F413K70j7049L904J5254q286j4133Q064J4579n425j3540R315J1678j1294p191
499g441J1494M717q156m510N644K286q347J596Q230n638o943O942K528p404j3
514e015R049J289j0981p5J3198k473j1423O323R915o651j0651M504J1993o662
528B340j1957R090P801j0742m941R285M657o772l066O714N81o954L716O093o316
$$ y = [-13946, -128, 14195, -486, -8811, 4267, 9422, -786, -2261, 9170, 7063, -8547, -3688, 8042, -3437, -10223, 2372, 4789, -9385, -12122, 4715, 9182, -8596, -6412, 13523, 7513, -10353, -2314, 14672, 8231, -8825, -3479, 11130, 98, -12498, 445, 8162, -4503, -9170, -962, 2191, -5136, -4692, 6253, 3307, -6270, 1146, 8027, -164, -2433, 6952, 8605, -4099, -7842, 6413, 6683, -10366, -6462, 8792, 506, -13627, -5563, 9016, 3591, -9949, -634, 11044, -250, -7441, 4053, 8770, 614, -3896, 1748, 4034, -4313, -2717, 5513, -125, -7068, -126, 2402, -5002, -5015, 4034, 5323, -5658, -5733, 7465, 4992, -6431, -108, 9807, 3156, -7495, -2991, 9002, 2340, -9617, -527, 7274, -3468, -8409, 876, 5533, -1239, -4305, 2409, 2990, -3964, -248, 5845, -471]
543d71k286M990K58n216n72Q097M41j0822J270J0687m957q474N930P911n638r608
559h460N918J0575p636p297R093M112q034l453N819N049n896l590O327n27n606
574c606L857L042m014j209L773K15n635k26Q848k182r699M310P822n710n595N674
590c35P307n023q127O012P620p513m516O910K415o191m175N705L553n749j647
605c754N809k312k919K964J201j322n09K465N72n086J891P255l618o613M024M857
621D905m408o257M291O979o009p687P370M575o421j843O069K925n161k726O108
636B710J835n011N42K907k697j235R68M2r29j184K407j16m923K417N838l780m174
653d383M265M471l632n088N391O470o883m724O419K078n293k558L949K613n312
$$ y = [-471, -2757, 2233, 2491, -2725, -3297, 4800, 5241, -5581, -4311, 6376, 1419, -7055, -1125, 6786, 1148, -8460, -2542, 8033, 397, -6900, 2193, 6305, -1729, -5182, 637, 5686, -210, -3800, 2527, 2000, -3606, 251, 3293, -721, -1930, 1843, 2058, -3577, -3803, 5045, 2863, -6836, -2526, 5296, -414, -6009, -335, 6972, 1949, -6178, -166, 7454, -59, -4575, 2335, 4750, -1441, -5616, 89, 3642, -2107, -3754, 2055, -257, -3176, -212, 989, -333, -842, 1623, 2195, -2891, -1000, 6255, 2637, -3976, 48, 4905, 497, -5760, -1469, 5510, -499, -8186, -816, 3759, -2662, -4505, 1564, 4489, -672, -3398, 2710, 4545, -466, 76, 2983, 286, -949, 19, 61, -868, -2052, 355, 239, -4684, -2267, 3571, -209, -4383, -118, 4353, 721, -4367, 1024, 7494, 611, -4113, 2306, 4384, -909, -3467, 482, 3095, -2217]
668b217k908N393K06l659K002J702o23q15J093J653j400n7L534k608m086M046
684A256K362m188k397L007K716m548m587O033M007n501k397M797K546l533k617
699c044M655L137n253j320M101o24k130Q51L96n72j695M42J393k599R79L310l319
716a292k123L686K054k517k054L525L542n603l158O545J666n582j400L797J653
731B739m175k543M965J698m692j17K467j34o91k53J256L44j693J749K48k304K002
748H66K047l311j285J937J582k224k420L972J997n756j259N211P96l578j516L618
764F77K591n032q76M762K06l035J15J328K21r60n53J243m36r08J345j517p60K203
782F14M83k180o57J720J793k217k229M688R87m552l53L699Q89l306j396L818R09
$$ y = [-2217, -5125, 268, 474, -3185, -1183, 519, -104, -919, 174, 1827, 427, 370, 3904, 1296, -2790, 1256, 3618, -570, -2967, 40, 2756, -1792, -6379, -346, 3661, -1840, -4237, 560, 3106, -427, -3044, 1611, 4748, -505, -1825, 2276, 1652, -478, 373, 769, 197, -1498, -1056, 337, -2262, -1283, 2027, -1292, -3415, 271, 2325, -192, -2246, 1279, 4821, -782, -3940, 2605, 4271, -1311, -2711, 1086, 2739, -1436, -3979, 986, 2684, -2008, -2125, 342, 208, -483, -736, 520, 864, -829, 920, 1168, -1136, 866, 2913, -398, -1683, 254, 1836, -388, -2808, 1164, 3161, -2595, -3854, 1357, 2153, -1425, -2941, 677, 3268, -1764, -2640, 2122, 2328, -707, -592, 736, 957, -3, -556, 687, 251, -657, 688, -829, -1589, 614, 1097, -1083, -1740, -20, 1773, -444, -2673, 2015, 3002, -1550, -1903, 1796, 2685, -621, -2017, 1801, 2710]
799B710n067L56L522o37j687r28J602M76j316J64J547j129P51O87k004L56K088
816A491Q1j404j214J825J639l864j073M123m8l369p70K733J523l001j136M270
832A806l8l543N83K457L99j369j158J921L79k005N21O46j047J065o72j681Q17
849i19J294n8j290j223L161Q55l962J114L337l42k666l01K425R48l350n97L601
866B027p47l124L56J439R83j940q40K418j55j235P96L14j23J160q89p28M79R46
884A137M84k439n24L236q22l307J065K114J15k950l00L351O3l251R51K664m90
901A097j675m99K078Q07k126l8J518p12l66n38l09R11L53j345r5K20R87O04k401
920a529O50K634j545j676J223J998J43k716n59L528p32k785Q31J647j67j897o78
$$ y = [2710, -2357, -2001, 1521, 884, -803, -1731, -129, 347, -969, -805, 742, -387, 364, 1051, -953, -597, 1491, 1572, 168, -1046, 779, 2418, -1446, -2519, 1604, 1556, -1813, -2583, 150, 1673, -1328, -2464, 1806, 1768, -1775, -1192, 1265, 1664, 295, -863, 1058, 1437, -568, -47, 599, -448, 617, -55, -1736, -919, 375, 317, -973, -2196, 965, 1820, -2142, -1028, 2309, 1967, -699, -1000, 1425, 2373, -977, -1574, 2027, 1280, -1844, -1488, -49, 934, -1006, -1846, 572, 417, -818, -22, 292, 169, 1329, 440, -288, 191, 1137, 1621, -818, -1342, 1894, 1072, -2235, -1170, 944, 1059, -1891, -2191, 1160, 1223, -2028, -1077, 1587, 1097, -578, -1077, 1001, 1808, -318, -356, 1162, 450, 84, -454, -763, 148, 501, -844, -939, -719, 268, 872, -1529, -879, 1755, 210, -1466, -243, 1755, 1898, -818, -1377, 2151, 1419, -1366, -535, 1112, 945, -952, -1630]
937a630K009P7j536P16M46n92R10o87L6J288k26n18j08k36J568o65k085J371J202
956A340j432j518M55K105m44k408M69K861j276j551N70J805M19j813o38K107P4
973A125j046N96n84J70K92j262R9R39k17p8j243L09J582r46j530J827R36m02j350
992g83M83K155o93k735J830J436j298j128n92K251qk471K61J769l92n42j67K91
1010c33J297j031n34O24Q8M62P0j547J090J218j473q11R24P94p53j718N06K295
1028A168j410j726J536J129k49j566K92K389n90j871O12J220j35l41j140O76Q32
1045H26j315j02K4L38R94j158j149J376Q62j274k24N71J500q59j658J512J405
1062A669j293j010Q02R36k55j992L27J837j033r60M47N22J7p00n18J440K75p66
$$ y = [-1630, 379, 456, -1080, -364, 82, -510, 400, -287, -251, 1037, 811, 293, 185, -51, 1517, 852, -1233, 138, 1340, -92, -1610, -1155, 950, 506, -1902, -1433, 1428, 152, -1399, -829, 976, 1395, -418, -1056, 1051, 1125, 79, 675, 91, 261, 553, -709, -610, 329, 112, 34, -1209, -900, 682, -264, -1794, 33, 969, 567, -783, -300, 1855, 1162, -1573, 257, 1693, 395, -733, -1325, 926, 918, -1553, -1292, 477, 85, -457, -624, -333, 964, -67, -601, 23, 111, 573, 643, -904, 186, 1404, -69, -880, 44, 838, 85, -1633, -1127, 1168, -242, -1968, -432, 697, 448, -1118, -826, 1563, 973, -898, -286, 934, 799, 458, -682, -6, 826, -489, -591, -567, -229, 765, -393, -1542, -166, 696, -578, -802, -231, 1269, 410, -1248, 264, 1669, 376, -634, 168, 1104, 849, -1143, -816, 1021, -12, -972, -525, -3, 14, -686, -1204, 236, 511, -255]
1080b55q7M0N09R18j350j52J176om61q95M09J482j481j452J298P88o78o37J10
1099g24J613m03j728J392R53p66m75P6N61L57p93n49J167J8o77l36o17J249j43
1118A75j224K49Q95K94p33q78J355J335j268o45Q41N42k49j075L57J168q79j400
1136a140Q37P06n21p58k80J364j5j077L35J133k15J66o93k20J180j23r15K02N33
1155D99M72j198j057J450O51j494m10R66N66o29r70Q00J356j074p23J140L98J33
1173H76q59k61J367m42j017J67n4N46k70r52L39R04n02m76O0N25J036j374l79
1192g66J669k66o81l55M89J146o84j618J357N62r11l49m16J063j2j082J38Q34
1210A18r1k64O2j34Q13q8o35L34N73k29k94q83J104L04j425J61P81J98p93p17
$$ y = [-255, -342, -302, 207, 1125, -225, -377, 799, 793, 332, -563, -154, 1328, -153, -1605, -307, 481, -197, -834, -724, 889, 486, -1242, 150, 1103, 337, -138, -62, 499, 856, 63, -486, 681, 699, 22, -314, -931, 318, 175, -1049, -800, 95, 389, -344, -1222, 133, 1468, 200, -445, 396, 938, 689, -386, -29, 1139, 260, -1140, -303, 403, -118, -876, -1156, 208, 193, -884, -549, 584, 369, 535, -158, -378, 802, 679, -236, -34, 499, 971, -227, -1284, 166, 817, -677, -1087, -121, 445, -184, -1154, -354, 1002, -72, -795, 345, 743, 876, 17, -244, 1123, 681, -336, -169, -223, 323, 53, -899, -560, 344, -158, -634, -574, -49, 987, -387, -766, 903, 637, -44, -399, 90, 1236, 552, -1066, 291, 853, -58, -407, -823, 240, 228, -854, -716, 118, 27, -237, -175, -309, 504, 416, -219, 115, 688, 459, 165, -718, 386, 690, -735, -574, 207, 405, -388, -1105]
1230a105O51J400j288r02J599J81n59n08J66J049j47q25L21N05j78j41p65N64
1248A8N31q09o42M27K96M62p68l14J420k70j161M17O99L87o66m83Q99O20j242
1267a79l83J071Q7m47j030J09J410o92r24J067k02J86K0q11J080L21l99k71L4
1286D7L56J98j011J84J012l34r53j2M24L19o52n61J394j9j004p9P31O26r8j253
1306f85R56Q87r52j62j97O04M56j241m54R38L3m31k45r8J000k30j081P05O66P0
1326E39m58l44P11O42j273m55J192j85k87m45L57M15n44o94Q64J84m12n4k21P18
1346B50K99q30k01J040l71K31p89M23R77o52q02N16K09J51q15o26R88K71q91R2
1366e30N35O2j54o57O88P47q28j27L11L69l45m08K20Q74n28m51k70K54N14j75
$$ y = [-1105, -454, 946, -342, -1244, 355, 536, -23, -531, -365, 684, 537, -288, 33, 538, 360, 219, -546, 18, 549, -260, -902, -475, -179, 283, -485, -799, 621, 351, -810, -393, 306, 693, 27, -456, 443, 1063, -179, -562, 509, 596, 149, -881, -772, 638, -54, -978, 89, -113, 73, 93, -718, 362, 683, 284, 13, 47, 403, 601, -410, -226, 786, 452, -501, -513, -89, 230, -422, -983, 411, 392, -612, -691, 40, 666, 568, -685, 271, 1158, 206, 44, -153, 451, 907, -334, -788, 150, 183, -248, -493, -591, 409, 179, -902, -197, 469, 539, 81, -263, 448, 1090, -183, -638, 554, 369, 82, -363, -6, 409, -135, -829, 35, 219, -193, -247, -468, 250, 549, -281, -482, 558, 187, 418, -371, 52, 1029, 377, -425, 91, 300, 451, -364, -990, -2, 269, -622, -530, 5, 67, -87, -744, -56, 691, -137, -264, 47, 416, 71, -337, -117, 757, 229, -222, -492, -238, 276, 101]
1386A01q62O51O79q87j8P1M10M53j026M13Q98p60l62J51M60L44q01o47R70n8n09
1407c29q2L87K23m42l70L37R36q38k2j7L17N56n23n13R02J39m23m56J5P05m61
1428D1n21j6R15o01j42N6J12Q31r14N0L77N18n04m56M94J52K23j042K80L62J73
1449C88m37n37K86P47p19k58L51O5k84j60J10J036j00j027O78L82k89r4l13M41
1469B66K37r74J78M56q1j6m17O1Q29o35L6j9O2K42l15j80M44M48o94r2L73l0N8
1492B37o46J81L66r5l85Q5K01j1l04l66R22L0m47j84M98J75O4p73P87J38l68m43
1514c38M01J07K66o58l60P50l47k96L08K95l46L07m95K49P55k30m43m9N32J4p18
1535b96j0O86J6n45j59M16K43n69m65Q27K17n32j87j3O14R7l73k48M67Q6q4k62
$$ y = [101, -761, -110, 569, -318, -336, -265, 145, 598, -428, -15, 883, 123, -239, -88, 372, 716, -85, -732, 238, 180, -329, -411, -24, 199, -243, -613, -276, 660, -178, -200, -217, 100, 656, 133, -380, 522, 661, 238, -218, -203, 502, 41, -480, -496, 419, -182, -324, -268, -156, 675, -239, -189, 188, 706, 202, -254, 240, 392, 615, -427, -147, 215, 388, -49, -586, -300, 447, -272, -530, -179, -114, -398, -558, -448, 588, 488, -539, 139, 521, 232, 138, -175, 266, 503, -471, -293, 163, 82, 66, -351, -290, 539, -96, -60, -79, -17, 225, -90, -270, 174, 622, -72, -164, 209, 179, 237, -409, -228, 138, 43, -342, -257, -56, -67, -371, -737, 185, 215, -232, -416, 82, 257, 321, -452, 335, 473, 105, -338, 63, 170, 436, -222, -582, 168, -179, -475, -167, 128, -218, 89, -406, -157, 598, 368, -75, -124, 408, 422, -296, -306, 380, 396, -149, -308, 108, 351, -218, -683, 144, 361, -171, -358, -371, 243, 340, -33, -281, 186, 272, 188, -74]
1557g4L58L53m83o37O65P8k95k92N1O16j79q21M60K76R1m44P4L72K64m64J45K16
1579C30J00l72j49J09Q0N2n99J11L43J94m50j34L33L78n19K5J62L62k52k33J00
1600b9P26p08MN3L69j71m83l53N60J82k75p0L56r1j37j78R0M32j25l11J18M0M07
1623D06p23J07N50o4o64j42O02J3Q3q22K49M57N0n37M01J99K08o68J50N48l45
1644E8j36j14K83L18q4p09K27L40j70m62K84N1L21o31j7P68l19l02l00O36M24
1665D66j3l22j36K90l64j93J21L13K8n62L52J65k14j44p2L30p3j85m5M57P6j39
1687A36m34QP71k91n11Q5N90q8j40j89J78J88l69k70M08J8qm40K06O23p3o16J71
1710d7K67J80m56j33K91N59o04kR1j18j58J9q5L79k48q5MM09j71l79m2O74J03
$$ y = [-74, 284, 637, 154, -483, 182, 260, -35, -327, -276, 340, 161, -660, -200, 76, 167, -277, -203, 169, 433, -31, 114, 330, 430, 58, -91, 18, 98, 150, -449, -338, 5, 199, -251, -385, -52, 326, -193, -168, -6, 356, 104, -129, -29, 697, -11, -7, 46, 415, 244, -239, -592, -32, 150, -125, -195, 161, 70, -67, -245, -155, 277, 152, -159, -41, -1, 406, -317, -210, 340, 276, -388, -530, 72, 85, 168, -654, -405, 52, 102, -435, -34, 165, 373, -295, -145, 403, 58, -78, -192, 91, 409, 325, -384, -157, 183, 13, -449, -165, -114, 207, -424, -441, 327, 8, -294, -594, 42, 466, 453, 131, -5, 285, -79, -272, -151, 162, 190, -372, -20, 145, -69, -213, -285, 45, -28, -213, -258, 199, 275, 136, -298, -290, 481, 190, -321, -236, 354, 266, 126, -63, 115, 303, -66, -336, 72, 90, 82, -358, -152, 471, 398, -218, -47, 220, 400, -56, -189, 102, 661, 57, 55, 146, 28, -130, -111, -196, 183, -65, -150, -146, 263, 92, -287, -329, 345, 448]
1733D48n92K10q9K85N1o27QP76m55k34m2K00J13M1p29R60j49l57M5J76N02n58
1755a7J18l28N43k42k86L25J74R9p44K34K80j94k06KJ94N48m95J18k25M17l70
1776e5K34k07J81M35r62K22J92J66k25r0m23P83l36l00P0L15k09M71l50K71K42
1797D25l20k46K19o8K8k22J61K54n4n45L43K07j14j20k44J85K52n12J99M14k88
1818d6J36l64K67K35j89r5J54j60K33l6m95N37j12l40K81OP6l00K27j38K01m08
1840c30J57L50K40j53l51K94n1nm79J45K38L0k00j91K18N76p32n2K09K5L60n67
1862b69J12J53o7j6K81j07J36j41k11K34J07j96k65l0L76j95j56nR3N7O5j12N0
1885a06K2K30m84O68l78M3n6J37K15M9m15o5M40m17K04l44L0M90j88l84L56mK7
$$ y = [448, -144, 66, -23, 262, 313, -314, -306, 470, 15, -219, -261, -61, 52, 93, -636, 324, 175, -182, -137, 39, 541, -17, 101, -227, 316, 74, -212, 113, 287, 386, -358, -124, 156, -38, -244, -242, -48, 500, 5, 123, -102, 315, -55, 179, -28, 153, 588, -374, -152, 40, 206, -19, -109, -532, 251, -85, -385, -315, 0, -209, 262, -88, 183, 425, 105, -141, 78, 10, 38, -184, -23, 231, 177, -368, -25, 182, 68, -52, -296, -111, 141, -371, -172, 242, -46, 90, -274, -7, 228, 39, -56, 98, -62, 171, 135, -360, 177, 65, -275, 6, 12, 88, -212, 15, -123, 78, -330, -173, 177, 417, 264, -87, 207, 156, 151, -328, -183, 55, 85, -115, -306, -88, 488, -244, -296, -87, -62, 298, -269, -157, -4, -71, -87, 194, 87, 223, 82, -129, 105, 212, 16, -249, -279, 97, -98, -254, -259, -166, -109, -44, -156, -106, -84, 146, -338, 330, -48, -5, -61, 76, 291, 340, -75, -140, 300, -117, 87, -257, -227, 263, 75, -309, 47, 43, 70]
1908G0N4nL57m62M9K56j49m4L0m85M56J35k27j10K06k0k32m27N19K19m22K2J79
1931c1L83k97k29p7M97j56l15l3MM60p7m25L86L53p19J53J87O4j90qk02L13J69
1954B10l19K71J5o8j69RJ06L56p41L66k49K28j80k73M66j18K08o0J65l45M51j77
1976A52l70K54J37p9l53L30L55l06k19J40jN2p2k21J60k5o9j31J96O0j11L10m01
1999b12K36O2m33O23j55j15o8J49L5j02K3k88M05K35n58J29J2n1K01o09L59K71
2021A49pO2n58M22J74k63r9J93K0j70j27L4L84k57k76K79J60j95J42k42M47k6
2043B46n72K81J30J01j10M1j0J64j41r5n4J67j33J99m09K48K41q97M11K57J84
2064B49j79q3J32L8Q7l27K05J28R5j92l37P22m26j37k25J68q6O39n47j40M98k54
$$ y = [70, 124, 119, 476, 14, 63, 319, 170, 126, 156, -329, 127, 262, 35, -75, 131, 111, -121, -548, -29, 190, -232, -210, -31, 352, 55, -174, -251, 246, 90, -225, -258, -254, 206, 129, -296, 90, 443, -276, -123, 64, 128, -62, -70, -272, 41, 210, -109, 162, 177, 109, -60, -51, 55, 411, -330, 36, -213, 15, -165, -438, 28, -90, 118, 58, 223, -122, 329, 152, -218, 36, 173, 94, -259, 71, 426, 120, -99, 41, 40, 92, 20, -201, -41, -66, -135, -266, -70, -10, -121, 189, -212, 24, 86, -347, 276, 121, 6, -62, 87, 122, 20, 43, -245, 160, 395, -163, -34, -22, -73, 128, -481, -122, 149, 142, 204, -354, 68, 242, -21, -120, 73, 93, -77, -204, -170, 214, -43, -319, -40, 120, -75, 67, -175, 272, 246, -326, -45, 85, 186, 76, 117, 107, 271, 130, 35, -19, 148, 15, 214, -195, 53, 294, -603, -192, 65, 249, 70, -13, 119, 157, 244, -83, 122, 250, 345, 153, -184, 538, 112, -25, -250, -82, -168, 471, -76, -216, 282, 28]
2086B8k02J13J02o7P1j54K59m3Jk14J49J34r5k32J40l6RK29m24n1L86l68K79L05
2110C19k25j88J96o8J61k60k9K52l15P3J46l56L80p7m51J51P65m12k19l2M90j7
2132B84n48K39Q9j02K6K1o7OQ3j94K08R4j47k9q3q4PJ35l33M25R9l80K07k25N65
2157B96l94q1J72M01k40k66j57Q4L95o98M34K53j39J85m10J7L11j47Q9j52M70
2178D23l31k42O1K01L0r5j40j78L67k43k5J1P6j00j25L22Q3N1q4k73M64m02m6
2201a95K14n6q8J25l63N81J32j66l20K5L6J83j02j97j01M02k18L36j94mj25j49
2223b44N55j33j40m8O8Q5r2q8Q6J08j18k08j07R2K58p3N1j4k34K42l61J78J05
2246c2K28j09l51N20j32j3j0j35K98k06l51L12m3J65N9l78L03J27n34n7O94l18
$$ y = [28, -174, -61, 41, -26, 45, -109, 150, 107, 108, -106, 43, 177, 82, -150, -10, -46, -37, 192, -232, -283, 103, -265, 14, 319, 94, -94, 102, 34, 195, -65, -94, 158, -157, -84, 62, -294, 86, 9, -442, -291, 474, 62, -157, -189, 301, 284, -264, -25, 64, -38, -12, 9, -58, -52, 31, -163, 45, 139, -8, -37, -120, -204, -197, -62, -395, 30, 129, -251, -44, -269, 296, -98, -179, -7, 394, 154, -112, -269, -185, 210, -488, -54, 199, 60, 245, -165, -148, 163, 16, 105, -47, 423, 92, -150, -89, 112, 142, 47, -93, -271, 96, -147, -172, -161, -85, -185, -310, 12, 95, 146, 62, -211, 253, -149, -195, 19, -37, -125, 0, -363, 218, 350, 184, -136, -111, -75, 108, 6, -191, -292, 110, -108, 228, 34, 30, -95, -244, 311, 178, 38, -10, 58, 143, 51, -37, 49, 157, 39, -169, -276, -184, 74, 1, 52, 38, -196, 46, -315, -137, -32, 196, 87, -264, 256, 124, 111, 101, -34, 264, 58, -293, 19, -24, 141, 200, -178, 125, 252, -282, -339, 355, 37]
2268C7R6r9j17J60j37k1K40n7j24j21LK89ol57J72J60N2l84J04K49j84J11k7L1
2292G0J21j43K5n7k3J11j77K57k53L00k90k1K50N0n83K67J59J03j63O4m4L96l01
2315A18O0M7k64K91k58j85K33J14l45K40k45K48J29l06K41j30O1l6k72M58n5n6
2337H8k61OK77m2o9J2J2k03J79l65L16k62J21R0R7p3k53L39M1J04k23K00l1J29
2361B29L2j93K89l54J60j77K1N9k44O0lJ71k58j5L40j49K02J30l57Q9p7J48j72
2384f9lK76j96p6K6K14k99J94k65O9J27l22L74J92j48M7k27j28K68J98m85M18
2406A85m5j10n1l5j57L92k47j11K25K0j91j43jL61r1r8K16l03M17n03L98J16j17
2429A27Qj05m5j28J60k62L14j68k8k0j53K10P5n0p4q7J79N0q5n7K16J15l33k8
$$ y = [37, 133, 34, -83, 77, -60, -81, 159, 102, -22, -143, -140, 149, 143, -214, -42, 118, 170, -214, -110, 139, -45, 66, 39, 70, 191, 48, 73, 16, -7, 104, -73, 184, -69, 231, -59, -80, 170, 220, -363, -96, 63, 166, 3, 67, 23, 419, 118, 178, 225, -39, 252, -6, -191, 42, 156, -189, 51, -194, 54, 183, -123, 118, -12, 49, 13, -259, 199, 144, 88, -173, -167, 110, 68, -1, 11, 23, -180, -1, -366, -50, -312, -191, -101, -4, -77, -330, 9, 50, 154, -69, 131, 100, 229, 261, 68, 357, 3, 163, -14, 7, 66, -178, -118, -121, 50, -208, -223, 117, -32, 170, 300, -57, 32, -45, 103, -69, -72, 204, 8, -68, -42, 172, -127, 67, -198, -129, -2, -324, 50, 242, 94, 141, -86, -214, 54, 252, -233, 185, 140, 30, -21, -56, -213, 179, -68, -179, 46, 66, -125, -268, -269, 92, 1, -97, 119, -184, 233, -270, 128, 244, 127, 135, 30, -15, -143, 17, -245, 69, -99, -127, -147, -300, -90, -15, -65, -139, -226, -47, 3, -82, -139, 77, 192, -141, -169]
2453a69L03R4r3l81K11l8RJ94L00k83m13M75j82J16k73p6J80K40l50K12QJ97q8
2476A93l00L18j08l60J16L00J33l99J09l9O6K32k12J7j04NN2j81k9J55L18m16
2498a34M23k61J10j00J24L5n49N33l92j04M67k68J5K5j36J30L0L9K5L50o19L07
2520E0k46J00L58k34p2M2m12J73L07k3j45J04j81J85K7J6M5l23M20K9L4m26M88
2543C16Jm23L68n72L06P0q9R5q4l49M68p3o1K63l71m7L45j16k42k6L53J01k7n58
2567c52K84M30k88r1K9jPj85L03k08j02j27L00n4L61nm96N65j70j69J37j27l42
2590c01L77j49j8L55k00l2r1J78J02k33j3J22J02k67J69K5m11L33p5l8q9J39K84
2613B69k46K3J46l83J15O7J70k27P9o2p9J0J11J30P0j8kj32K19k93j29K40j75
$$ y = [-169, 134, 228, 135, -246, -35, -73, -64, 130, 430, 147, -266, 209, 27, 143, -130, -206, -26, 214, -136, 76, 84, 281, 193, -107, 211, 103, -257, -141, 159, 292, -107, 2, -37, 29, 261, 49, 66, -38, -33, 19, -162, -191, -36, 282, -134, 289, 28, 138, 38, 162, 197, -352, 181, -211, -315, 152, -116, -101, -76, -212, -82, -52, -13, 12, 362, -257, 50, -196, -96, 262, 28, -44, -2, -414, -241, 66, 43, -102, 2, -179, 6, 33, 49, 94, -229, 191, 220, 254, -172, 316, 317, -106, 262, -310, -4, 66, -23, 72, -12, -361, 107, 34, -27, 236, -135, -182, 163, 47, -195, -221, 132, 233, 206, -352, -68, 362, 74, -17, 12, 11, 18, -167, 136, -72, -174, -301, -1, -55, 306, 301, -195, 370, 200, 31, 168, 41, -301, 76, -73, -91, 264, 64, 32, -59, 119, 221, -12, -25, 97, 199, -68, 101, 126, -285, 48, -27, -65, -154, -15, 269, 23, 46, 192, -191, -76, -9, 161, -66, 13, -49, -128, -118, -7, 123, 193, 175, 173, 41, 260, -33, -162, 78, -97]
2636i7L38k80k77K32J05j67J87j50J45n8o9kJ13q0l4K78j07K2l7l21J97K22k08
2659d8M0j81J70L7k21J57L1J76k15M9K13j76O2j38J63k19Q0L9o1J49J6j8K6l04
2683a73J34r6K33k11J16O3l46J99J11l9N7j71N4R5j63K47k50M37k94O7k9J5M0
2706I6k29K43j51L17l40k9k49K73J87r5M2n1j49k09L67J15m03r3M44Mn1K9p0K03
2730B01r5l12K58o3K96l80j83L80j92o1K98k27J02J33j50j16L48k43j46K0J59
2751B7j9p5k67N14j75o5QR1l3l2j63J79K58m98J36J45J88k45n4P4j96J05QK70
2775A81j39J14%q6mm5n2PJ41j63K8j85j82M64j52Qk9K56q4jr5l1L1j5j13L90m31
2802a87N3K18n8j44K0j4M6K9L00k74k09J76m4q8l67N06mr4J45k01J53r0o2K59
$$ y = [-97, 241, -39, -316, -84, 21, -146, 41, -109, 36, -22, -91, -93, 20, -60, -94, 184, 77, 99, 62, -259, -62, 160, -48, -8, -189, -19, 18, -203, -46, -15, 161, -54, -5, 208, 32, 94, -44, 119, -100, -20, 19, -42, 107, 123, 105, 131, -173, -39, -135, 98, -113, 3, 66, -280, -81, 30, -9, 48, -123, -69, 26, -137, 110, -140, 297, 3, 70, 41, 56, 96, -133, 110, -41, 276, -64, -93, -342, -69, 118, 23, 65, 14, -135, -344, 23, 138, -265, -358, 86, 90, 39, 68, -2, 201, 106, -206, 52, -11, 285, -95, -278, 102, -90, -151, 147, -80, 22, 155, 5, -111, 237, -6, -152, -132, 27, 8, -67, -334, 180, 5, -60, -52, 39, 6, -26, -189, -10, 248, -250, -114, 31, 219, -26, -80, -6, -202, -97, -89, 181, 42, 156, 156, 70, 66, 21, -31, -24, 117, -46, -18, -203, -385, 79, -73, -65, -94, 162, 78, 77, -18, -49, -18, -33, -146, 244, -187, -134, 84, 26, -118, -98, -112, -66, -37, 263, -11, -220, -44, -88, -176, -543, -37, -41, -135, 10, -191, -38, -128, -190, 69]
2826F9m5p5L6M5K1J77l42j64K56J87l03J72m1L13l16J15j78M6j07q1J75Qk09K08
2850c3O7q4J53j23m8J65jk11L10k20PJ57j01Q0q8j44K98l14Q0k27L75M7l44K37
2874C8j77j36K80N2j59q5L02q5J5R7p5k17q1J82k30P46m74k56m6L37m93N99J04
2897B38l13K31j18k42J10J97k95J46J3J08P2j82J06k93j36N40k25P4J0p4J37j49
2919d5K90n7j7k4j07p6r8k22N97k57J37j24Q2j4J36m74R3R9J95j35l4J78p4n0
2943aK68l16K5ql87J73L20K84n56L32j29J34k3m7K20m25o8J92Qk07K30K7j36P9
2967a1n3j4J49M8m8J30k43J38m4l47R2J03J00N6J45l07J65k04Q6K14j25o3R7J15
2991A79l69M15k75K24l81J72J60j71N0O2K09k02o2l4K05n7P1o2L1M0J33m63l3
$$ y = [69, 24, -51, -15, 30, 51, 228, -114, -278, -22, 165, -138, 34, -7, 306, -10, 105, -73, -27, -134, -215, -40, -32, -241, -33, 34, -50, 103, -20, -68, 97, 96, -115, 195, -25, -18, 139, 38, 118, 30, -114, 184, -130, -50, -277, 98, 145, -199, 38, -139, -275, 5, 57, -102, -187, 115, 30, 45, 142, 67, -150, -231, -49, -279, 467, -7, -263, -309, 28, -465, 134, 238, -75, 156, 38, -204, -94, 103, -192, -46, -33, 75, 147, -35, 71, -222, -358, 182, -43, 31, 41, -33, 104, -45, 245, 188, 171, 147, 40, -36, -134, -356, 241, -16, 121, -3, 79, 65, 201, -273, -180, -81, 114, -21, -55, 123, 49, -1, 267, -49, -24, -32, -419, -246, 74, 358, -198, 134, 5, 139, 116, 69, 289, -136, -204, -12, -4, -211, 19, 46, -90, -11, -64, -78, 71, 119, 71, 201, -42, 96, 52, -295, -203, -100, 0, 56, 201, -106, 59, -145, -59, 155, 30, -33, 64, 179, -190, 225, -50, 174, -207, -35, 125, -46, 4, 66, 275, 73, 11, -23, 182, 125, 196, 134, 165, 205, 338, -125, -158]
3014a58J02j47K76j5q0j45P0L1r2m4M2P3J37j70J46J10j79j9l0J04J15J71j86
3037A12q6m4q4J25R8j13R3o6J11J43l09O4j44l0j22J06P4M4o6M9N0j13KK03j82
3062h5O7Pk8J67j30r0K44p0l12K89RLj62J17o1j37K21K7qqrj59K47j1P9k77J29
3089E9J80l02K09L0l47K67j69O5Q0k58P9j42L14j94OK04Q2p4q9J61j19R6m5o0
3113C3j28J28RLpk93J68J88r5m05N45k33L75j77KP4J25j88P5j91k78K70j06J83
3137G7J6l1j47J17qj57p7L11J51k57J92k73j31K1OK37j46Q1K64J51l09j32j80
3160b24P9J40P5j90N4J96r5j38M5j2J40m10J63K24J20k76M2P5l87J03J98P4j13
3183a17K02m7k37K25l08M41j90m5K8R8k88L7J81k47P3P8N0P0rL00l10lp5J51j38
$$ y = [-158, -56, -203, 73, 58, -22, -167, -97, -66, -158, -202, -160, -87, 50, -120, 26, 136, -43, -62, -92, 12, 127, 298, 112, 26, -18, -102, 23, 121, 8, 101, 35, 146, 289, -20, 44, -100, -130, -252, -146, -72, -28, -94, -45, 5, -108, -106, 97, -85, -18, -11, -39, 128, -2, -92, 152, 82, -230, 59, 68, 71, -91, 26, -35, -172, 49, 76, 68, 60, 51, -108, 139, 128, 207, -70, 59, 239, -63, 146, 176, -171, 96, -73, -8, 72, -186, -107, -249, 65, -129, -123, 81, 163, 89, 0, 161, 42, 138, 93, 33, -95, 33, 42, 45, 38, -255, -87, 101, 6, -399, 146, -87, 288, 111, 113, 187, 312, 124, 199, 8, -270, 0, -106, 77, 93, 62, -85, 32, 24, -133, -210, 101, 252, -5, 187, -86, -217, -196, -190, 47, -99, -18, 246, 397, 88, -44, -224, -145, -5, 70, -120, -66, 130, 35, -103, -58, -70, 70, -340, -177, 47, 167, -109, -67, 8, -379, -276, -78, -4, -117, 85, 38, -199, 26, -282, 159, -31, -76, -48, 50, -238, -201, -20, -267, -194, -116, -66, 4, -5, 295, -15, -18, -93, 58, -80]
3208h0o7Q1n6K15M7k43R0J90L6l61J53j32J52J17p9k14L65m06M82m12K84k02r7
3231a37J07k4k40M95k46J7J32k32O4n7J91l25L13n3n01N28J5o2m61L13L03J59
3253B99m68J15L61l44k05OJ15j39J90o2J72K8l60K98j97K84m2k99L22j06K09j81
3275dK31j75M2j64J8Q8J64j09j84J25j00J35k75L12J50k91J51P7q7j89n3J16k99
3298c21L8L42J36J19p1k61J20q4Kr7k6J64j69J06j70J71J76j12k1p4M6P9J20j06
3322A07r1NN4j47J62j72J21m8p9K88j44r8j23J48J0j11L0K66j97m42M68l0j16
3345a39P3K5K88j30j99Oj37L5O2q9pM88j84k79J7L81l39mL26l60J18K6J89k60
3369i3K67n76K13L13M1l09O2J56j68K14m7K3m53L03K71l47M43l39o6J25J5M6m5
$$ y = [-80, -147, -66, -122, 93, 140, -103, -13, 177, 213, -148, 5, -127, 25, 142, 63, -151, 214, -192, 290, -122, 162, -40, -137, -30, -54, -294, 201, -45, -28, 104, -128, -64, -121, 70, -255, 58, 5, -496, 32, 47, -15, -476, -163, 140, 299, -169, -54, 307, -37, -242, -236, -121, -260, -70, -132, 40, 68, -292, 6, -191, 93, 51, -248, 74, -32, 177, -4, 227, 52, 94, -70, -52, 36, 200, 91, -93, 32, -68, 67, -208, 104, 254, -37, 114, 191, 104, -85, -138, -22, -321, -283, 59, 195, 314, 243, -18, 102, 18, 20, -77, -103, 61, -108, -2, -172, -1, 175, 63, 42, -32, 14, 93, 213, 107, 16, 21, 75, -72, 90, -82, 39, -9, -88, 200, 56, -42, -165, -17, -7, -118, -88, 178, -19, -461, 7, -23, -139, -66, -41, 247, 117, -82, -76, -213, -178, -116, -205, -212, 276, 92, -187, -170, 211, -128, -132, 194, -166, -48, -22, 167, -93, 174, -402, -189, 124, 165, -144, -82, 74, -94, 120, 73, 96, -357, -54, 217, -130, 313, -26, -92, 33, 48, 94, 49]
3392D9J17j56K0M5j56J84m08j09J98K86j66L30m52J53o1mK27p2q0n9J3L05k64
3415f0J94J96l12J0m21L12k55J94O8K77m9m01L72j86J4P7K8N6j10k49J93J09J99
3438B56o3l96K40j44mJ71mp1j59M7j88K41J56l32k6L0J5J50P5l2j9rn0m5J34l1
3464e8q5K55r4J2J40k13k08J05J27R0M6r2jJ32m0m9l6j22N0R5o9M6J12k1j58J69
3490A33l28K60L1j45o3J52j2p4m9K12J9r8J64q7j37k53L57p2j55jJ22j8J17Q2
3514A57jj83P4p5K3J70o3j05N0pk88N36k43j31O8k52J58J56j43K83j43j19N2j
3538b7J00N8k07R2K28q8l09K56k58K5Ll3L15l25M01m8k20K06l83J83M9j39N02
3561C81k81k6j62K32j42j24K52L21l62l43M21p5m8K11m48M0J13k02K22k89K84
$$ y = [49, 166, 10, 30, 75, -81, 103, -305, -414, -216, 70, -96, 234, -218, -65, -126, -130, 97, 25, -55, -114, -101, 204, -60, 134, 330, 18, 28, -393, -81, -336, -142, -74, 203, 154, -247, 125, -61, -47, 30, 58, 114, 4, -245, -52, 57, 256, 193, -203, 37, -107, -111, 60, 56, -15, -174, -127, -315, -74, 82, -250, -276, -246, -231, -81, -6, -38, -57, -66, -116, -161, -27, -58, -143, 112, 18, 30, 170, -43, -251, -146, -19, 71, 117, 25, 24, 156, 116, 67, 31, -91, -41, 54, -15, 31, 143, 122, -36, 133, -195, 65, 96, -49, -112, 40, 28, -46, -95, 117, 136, 38, 202, 115, -22, -275, 82, 10, -145, -146, -24, -42, 75, 157, 156, -27, 47, -28, -5, 165, 102, -3, 47, 40, -248, 288, 45, -86, -18, -270, -112, 44, -99, 184, 41, -78, -26, -27, 73, 131, -76, 16, 244, 156, -153, 103, -155, -130, -127, -160, 155, -170, 231, 183, -37, 169, -214, -31, 18, -121, 381, 100, 74, -88, 144, 2, -122, 130, 451, 89, -254, 167, 92, 44, 255, -193, -153, -40, -242, -20, -309, -25]
3582b5k25O4K04J92j92O8j06J15j09K12l06L6J46%l61L32N0j19J07k8K55m77j27
3605b94J74P1j09L53r0j71mj53O3O1p2K09nJ89l59J6K55l54j5M01m47lK45J3K32
3630B06k89j11J93Q4k72K11K05n40L92j40J33N6l10K16K1n4j13M13k27M4k40J42
3652B0rJ11q9j19O3J40j41Mj89K57k2K5Q5j58K3R3j03j44L83j39J25l84j07J07
3676a68K37j03j02L2K32L9l73L41j40nJ85k11m6J90R4j59l6J6J82L6j37j90K53
3699A67q8j05l4L5K2M28m20j83Q2K08k01Op7J69k74L45O7J10l1n8p3j57K00J51
3723B89l15N8k1R1l15QJ81rR2P5k35O1J16j44n2K37Q8k24K79j15j73n9P7o7K78
3748B01j68j33K69j04j73J20k16Q2j74L50J7j97n6r8K19n3L4j80K14n2J25J3p3
$$ y = [-25, -250, -186, 18, 210, 18, 86, -20, 95, -14, 198, -108, -72, 74, 74, -287, 45, 95, -24, 83, 55, 310, -167, -294, -120, -49, -158, 195, 105, -66, -70, -223, -160, -99, -171, 38, 33, 222, -137, -121, 134, -220, -235, 166, -281, -284, -39, -26, 206, -83, -194, -1, 83, -189, 22, 227, -313, 79, -61, 72, 128, -182, 34, 55, 1, -112, 301, 74, 118, -122, 20, 11, 122, 33, -86, -23, 117, -24, -20, -209, 48, 26, 51, 136, -22, 1, 94, -9, -153, 230, 91, 216, -168, -275, -168, 69, -34, -136, -104, 128, 167, -206, 135, -5, -10, 175, -36, -82, 108, 202, 43, 7, 23, 205, 241, 104, -86, 167, 79, -26, -60, -25, -3, 425, 5, -178, -96, 112, -89, -83, -160, 9, -265, 80, 147, 257, 226, 168, 95, -62, 138, 289, -26, 32, 11, 102, -213, -205, -24, -33, 59, 134, -101, -40, 76, -68, -120, 117, 205, -19, 260, 145, -28, -87, -10, -77, 201, 33, -100, 169, 65, -108, 12, -204, -122, -296, 54, 71, -126, -182, -280, -61, -114, -80, -260, -46, -98, 27, 40, -33]
3771c3j87M37k65R5q2k35K73O3j26K14J05k52j44J93k06K9K31k3P8l09K20J36
3793B12l44q2K52Km1k49M88n67N12j82m20J10K14K91k27O5j64o4J21J05nj6L8
3816D9q8L1M3J43k19J16O2j89P0l4K8q1K20k32P2k30K70o0r2K95j00k90J84O5
3840C3J32j7L2k30N7K79n63Q4j04L24k25J67O9l7P5k72J8O9m5j3J25j57K95l05
3864b09L6J49q6K89k63p4P0j9j06l8L41j20L9oJ00q7QJ46l69M08k70J48N3o0j53
3889g3L63l12K17K40o19M7K02j51o5K12k88L94k28R8q9K52k84l7J34k39j53M78
3911I9l50K61p3K13o4l44K95k20P2j3J19J62m54K19K05l12L12k60P0J42k73j2
3933b06M52j69q6j42K78j08j46m2L62k37J03K24l24m2j59K87l8J4n6R9p4j1k0
$$ y = [-33, -220, 217, -48, 47, -35, -270, 3, 66, -60, 154, 259, 7, -137, 56, -150, -121, 110, 87, 165, -144, 76, 212, -132, -214, 38, 40, -1, -250, 238, -329, 183, 1, -419, -309, -95, 196, -31, 34, -130, -194, -73, 32, 27, 11, 49, -39, -8, 35, 178, -41, 75, 137, -52, 18, -16, 12, -69, 151, -81, -9, -239, 31, -29, -121, 174, 74, -216, -32, 33, 165, 148, 180, -50, 7, 286, -277, -193, -297, 27, -198, -31, 38, 1, 76, -196, -178, -109, -154, -167, -42, -199, 96, -209, -173, -24, -110, 179, -84, -158, -88, -107, -213, -251, 90, -30, 9, 3, 103, 16, 24, 170, -199, 209, -61, 87, 140, 80, -73, 290, -22, 195, 435, -184, -137, 65, -86, -151, 61, -227, 167, -61, 37, -52, 200, -84, -121, 13, -226, -379, 99, -251, 10, -63, 150, 86, -258, 37, -183, -111, -124, -5, 157, -297, -78, 127, -185, 127, -133, -63, 79, -194, -206, 246, 77, -9, -151, 127, 19, -127, -169, 193, -44, 59, 283, -41, -83, -242, 45, 7, 21, -35, 64, -10, -21, -41]
3956d1J83l31J92m6n7L24n17J17J34o9M0K21j21l3m6J49k78J99p2J18j73J66j62
3979a03K40j44J02N4K0k90J77Q9l85J28N4L11m75M95k51k3q1j6j96K75j08J48
4001B1OJ73m30K29p5j3l20M85j46P5J36L5j3k85J57k79K05M0Kj5k83K54J0J80
4025A49O0l79N0J36J33M7l26J31Q0R6k9k74n0QL99j90J14l28L45m17J14K03R6
4048A68J39l93p9l0L64m05j0J23J06k9q3J27l01L32J50k31L2J06j32ln0J67J07
4071A75j06RQ1j58P9K7p6n7nM37n82N8K32J88l66L12m79K43J1K10k43j05L2j25
4095b08M54l91L02k41J19k81K38k76M70j34j79L5K16j10J19R7j82P5q4P8j46j83
4117b12N6J23j0M1j05K61k33R8n5K8rp3O4J22K0k10J34j72J3J82nP5K03j85l18
$$ y = [-41, 142, -189, 3, -43, -100, 224, -293, -176, -42, -111, -71, 150, 29, -4, -50, 99, -179, 20, -52, 66, -107, 59, -103, 137, -7, 95, 149, 169, -121, 56, 145, -240, -112, -58, 253, -222, 273, 22, -1, -82, -98, -294, -19, -127, 21, 27, 200, -230, -1, -76, -89, -409, 76, -70, 5, 141, 176, 163, -122, 35, -244, -39, 1, 3, -12, -295, -41, -31, 149, 209, -170, -120, 16, 149, 196, -130, 1, 81, 177, 148, -126, -176, -168, 231, 41, 155, -173, 172, -245, -131, 72, 168, 307, -86, -165, -195, 169, -236, -246, -123, -17, -46, -129, -2, -303, 29, 179, -52, -20, 86, -46, -49, -99, 68, 175, 69, 78, 159, 1, 80, 107, 31, -26, -31, 406, -176, -118, 114, 302, -64, 248, -231, 12, 23, 233, -10, -115, -83, -208, 246, -145, 157, -84, 35, -246, -8, -284, 186, 52, -127, -92, 124, 14, 133, 230, 48, 123, 39, 117, -29, -212, -156, -33, -43, -2, -107, 154, -79, 19, -36, -8, -17, -90, -26, 96, 116, -94, 40, -132, -119, 63, 58, 133, 336, 151, -167]
4142a67K97j99J49l26J82J32Pk50J38P7o0K41m03K19j39o6J17K21k30l01M59R6
4164A94k87Q3N3r4p9j59L04M18l04k26J42q5j77J64j43M62n32J88J49k59R0Q7
4186a1K8j2J46k77j77M61L3k93K60j43J38R5k12j90R6J8r4K4J09O5k10K08n4J5
4210B3J82m0l06L08j15k72J39K21M9k90J54o7K15j41k9l45M72K52m00O9j10J59
4232A28lj5k05L64p7k53M04m65L27O9k72l1J50k54K20k81j07N93k86j61K21j09
4254d3J15Q2j51N6J35j42K27m41K3J73j10L9J05r5N7j56J26K0o1K61K5j28j11
4277FJ79p9P9j19O4l58K50lM6o2j97K95q4kL1k1K71l46k5L6j63L61j59Kj3l02
4303c13K45J4r5j11K02K60m25J73K75j98j33K3M3K96j52j76J84mk58K25J73j53
$$ y = [-167, 130, -69, 80, -246, -64, 68, 75, -175, -37, 40, -20, 221, -182, 37, -102, -168, -51, 170, -60, -361, 98, 194, -93, -10, 43, -51, -130, -289, 15, 433, 129, -97, 45, -40, -217, -53, -196, 266, -266, -78, 71, -188, -98, -11, 17, 5, 151, -126, -303, 158, 191, -102, 158, 15, 153, 248, 36, -154, -58, -40, -134, -110, -1, 64, -146, 62, 8, 23, 205, 165, -141, 167, 52, -220, -81, 140, 189, -101, 53, -14, 201, 60, 31, -314, 158, 410, 10, 79, -31, 128, 125, 110, -95, 269, 192, -61, 343, -122, 205, 274, 2, -29, 121, -133, 87, -194, -301, 292, 6, -155, 66, -43, 72, 154, 3, 59, 194, 52, 279, -162, -139, 34, -76, -37, 68, -27, 30, -126, 0, 20, -41, 220, 245, 117, 6, 185, 106, 185, 66, 130, -228, 22, 19, 65, 3, -194, 101, 17, 15, 46, 25, 296, -50, -75, -39, -202, 159, 0, 2, -11, -313, -68, -54, -149, -260, -58, 202, -223, -50, 225, 27, -106, -83, -40, 256, 104, -72, 112, 108, -150, 75, 248, 95]
4325I5l8k7k03J63j27O1l9K40J93m63j20L99o2k30J91m1j58K79j14J25J04l79
4347a51J00J74l88K30j03n1L03Q4j58J57j83j02P7j8k4O9m5j1J4J48k53k17L61
4370A3k79L52j88Q8k4J10k26j7J68K27k10j02K9J27n7j66J15O6J71j7pj17kn5
4394am6j21m8L74m02N30l36J75l50L66k62K49j74J30r0j17O8M7m9J70k27K98J36
4417C20m77J92m2j61n6L38r3k19R9nMJ96k42P7j0J40j12J87l18J51j00J68J14
4440A51n40J90L14j3j86O7o2P2R8m4M9k9j02q8J71n9j69J95O3j15k4L0r3l4J96
4465C8L3K7Q0l75K19k25L12j98KR8L5j51j3J20k2R3P5p5o1L6j23L1J75q2K0J58
4491B27l07N6J10K5k95J47K19R7k08p8k18L17j4j09K08j86k51L93j61K53l3j12
$$ y = [95, 57, 30, -173, -10, -137, -76, -115, 125, 318, -145, -265, 134, 72, -158, 33, -8, -166, 113, -1, 124, 228, -151, -51, 123, -265, -35, -138, -189, 114, 198, 40, 197, 14, -88, -11, -29, -53, 16, -29, -40, -26, 122, -131, -348, 13, -266, 86, -102, -14, -38, 72, -154, -171, -3, 224, 14, -88, -59, 68, 11, -155, -40, 26, 197, 180, 173, 56, 54, -1, -47, -168, -216, 158, -244, 286, -50, 125, -225, 141, -121, 128, -46, 84, -6, -123, -55, -8, -57, 113, -114, 184, 320, -157, 35, -7, -168, -224, 114, 21, -198, -99, -104, -100, 96, -146, -69, -79, 61, -51, 136, -182, -31, -131, 37, 151, -389, -199, 115, 102, -84, -17, -79, -7, 91, 47, 96, 67, -35, -123, 48, -11, -180, 15, 78, -37, -61, -31, -124, -158, 38, 71, 98, 178, -197, 22, -203, 109, -89, -87, 11, 46, -105, -118, 2, -20, 73, 148, 73, 12, 48, -75, -44, 131, 49, 69, 227, -80, -24, 86, 111, -184, -37, 182, 279, 71, -7, -225, 92, 78, -31, 177, -9, -260, 133, -28, 225, 192, 80]
4513H0l1j14N48q39M33p4J42q1o2k21P1M34l0m90M4L17K4j11Q1k39JQ9Mj74L70
4538A72l54J85K5k7K20K4k45L17k06p1Q6J03m02O0J47q8mJ81m7j53L10k00L1N7
4562A21J7O0l37l0K35R1k66J27o2pJ45r7Nk69M74m07K86O1j74K44l58Q4L16k82
4586b3kp3J32l36L35J7N6JOO3j51j81j35L43J18PJ8m49K42J84m82M66o8o7Qk57
4612b28K40L29k98j14K73k20L45k43k14K9j28R1J77J8j47J15k61N5L65p8L4L8
4634A78O8r7j1j41J53k67J36O2k6K31n9p6k21J67Pj53j84J98L1j33J95k47nJ33
4658f1j51M05m74M46j43K81m63K89m40K37m5j0L6K33k0J0j91J56j72J13K34l16
4680d6J95k52K28j69J00L5k27K81L6J12l31k3K90k28k1l82K07K46k3l0J01k21
$$ y = [80, 49, -65, 483, -356, 77, 3, 145, 64, 2, -219, -148, 286, 256, -234, -190, 127, 151, 40, 121, -118, -117, -28, -24, -198, 172, -182, 3, 28, 1, 221, 245, 0, 317, 111, 40, 126, 229, -173, -113, 34, -54, -58, 123, 76, -77, 233, 33, 64, 121, 138, 198, -139, -169, 66, 157, -109, 18, -44, -51, 94, -3, 2, -267, 207, -200, 86, 147, -27, 217, -141, -57, 259, -23, -25, -98, 34, -302, 33, 50, 106, 107, 113, 176, 25, -156, -291, 52, 170, 177, 195, -254, -12, 172, -310, 156, 88, 21, 29, -228, 12, 341, 43, -71, 202, -18, 327, 84, -130, -101, -229, -138, 39, 57, -90, 25, -236, -181, 184, 106, 140, 178, 246, 149, 138, -3, 150, -117, 19, 81, 55, 286, 227, 151, -70, 97, 104, -49, -233, -35, -4, -137, 58, -189, -194, -61, -212, 193, -281, 165, 22, 303, -160, 129, -311, -74, -119, -129, -93, 140, 120, 130, -61, 95, -77, 36, 270, -46, 149, -103, 125, -44, 56, 91, -136, 145, 181, 293, -38, -61, 229, 1, -20, -402, -195, 51, 28, -2, 99, -122]
4702a22K8j33M03k73K7J71k44J02J78m6j37j72L98l56P8O4L10k44j13J77j66O4
4724fm5K51%k41J11l46J77J09m6J68j69K24l66L32l08lJ57k4q4P9j28Q3K95j72
4748D8p8J67lk69J94j90M6K1L9O0L4p3K15l06K09j54j03J0L21j59j40J63mK8k43
4773a67p9K23K50m70m1N64k79p1L7O7N6j63J59j62L62l38l1J74n8m1l5M2L6p8
4797d3J8p5J52q8P4J07j69N9n1M7m5k59L57J09j73j23m3L4L6L2J02O7q3o7j48
4822a73J16p4J41J4J44l51L68k16n6n4L13j12Kk05J12j88K11k27J16L0J40l9K12
4845B24j71l36L17j70L29rp4p9P0r2o7m4J83j42K90l7j24K46k39q0j0J33j16j05
4869a03J62Qpl21K5K60j31j54L37K52k47m6K90l17k00K44J5j64pJ71p1m2J92J71
$$ y = [-122, -94, -227, 176, -97, -70, 101, -143, -41, 137, 91, -46, -218, 180, -176, -98, -34, 276, 32, -81, 96, -70, -6, -51, 200, 200, -41, 70, -276, -99, 10, -36, 132, -37, 187, -179, 153, -155, -158, -1, -25, -109, -30, -158, -75, 220, 48, -30, 137, 134, -135, 59, -131, -85, -64, -25, 35, 69, -4, 211, -95, 114, -40, -143, -133, 188, 29, -111, 52, 48, 76, -167, -246, -23, 227, -243, -284, 280, 1, -70, -33, 34, 90, -73, 86, -76, 286, -52, -83, 91, 33, -8, -43, -1, 35, -43, -25, -100, 52, -36, 38, 145, -24, 35, -16, 31, -14, -273, 84, 193, 20, -103, -146, -112, -76, -44, 58, 125, 42, -25, -173, -57, -131, 10, 24, 168, -183, 185, -31, -87, -141, 172, 60, 62, -143, -31, -219, -8, -235, -119, -89, 51, 12, 224, 53, -283, 34, -136, 193, 184, 110, 31, 101, 9, -58, -102, 81, -61, 229, 192, 68, 314, 75, -5, -15, 118, 2, -103, 59, 67, 60, -261, -236, 24, -107, -261, 76, 328, 81, 35, 325, 8, -192, 52, 67, -97, -104, 67, -4, -46, 146, 317]
4893C17m68K81o5j2L25o62O58l59j25K03l64N14l46L9Q0j31K45j4j28o4O4j82
4915a94J8J12J66o7j18J12j15K93k99K33KL6NP8n28j0K18P4j52O7K21M7j82j51
4939a34L29k46q7o5N7K23M0j94K04k4K98o19L53Q2k35j7r9p1L52m3j51K3Q8jj89
4964a26K41p5j28P5J24m02L14l5J62j11j35q6L04p3j5j10kj79L4j16J55K49j51
4987h6R6J54j76O7q0J96m5j70L18o7p7q7j09j3J8R5Q6p9j03R9O5mk27N7J53k5
5013E6j0J00j30J7k15L65l82R5K09k65k9K50j10o8J77J3k55J14J29j62K63k30
5035f8K28K62n42k9L04n74L16K28m8k50J57m0K98m31L14q6rj2j81K42j09J03k95
5058b22J43k6K21j8p1q0O1p7J83j22n0L5K85l03l3N5j48L47K1k50N3k4L07m00
$$ y = [317, -151, 130, 65, 53, 378, -284, 374, 15, -110, 93, -271, 243, -103, -64, 16, -115, 130, 116, -12, -76, -12, -194, -176, -64, 102, 35, -83, 29, -86, 207, -92, 141, 143, 179, 184, 262, -266, -276, -58, 16, -136, -69, 152, 199, 17, -134, 195, -51, -138, -203, -146, 77, 117, -77, 127, 103, 401, -218, 135, 217, -18, -35, -134, -205, 147, 104, -47, -24, 64, 63, -126, 115, 40, -88, -13, 111, -291, 23, -12, 150, 39, -96, -182, 122, 49, 34, -76, -78, -257, -223, -339, -184, 65, -86, 10, 164, -12, 55, -25, 171, 126, -44, 274, 207, 130, 43, -66, -79, -61, 34, 120, 41, -62, 37, 102, 98, -129, -72, 81, 56, 46, 146, 16, 33, -182, 183, -199, -104, 105, -160, -189, 61, -49, -117, 60, 73, -182, -68, 61, -101, 162, -68, 160, 422, -120, -149, 155, -419, -103, 125, 77, -173, -16, -56, 242, -189, 125, 39, 30, 18, -163, 79, -30, 73, -222, -79, -105, 116, 98, 27, -53, 8, -69, 114, -8, -58, -23, 262, -41, -74, -19, -167, 180, 201, -49, 4, -20, 287, -113]
5082a13J35K24l58J99m0O5k56m3K90M9j18k4j27J46J22m1J7j15R8m1P1j77K38
5105B01j90j71m7O4k22K46P4j5l30O34j26j69J89j03J94j17J40m98J75m3R9J49
5127A34j6l19M68m15P1K01k29r9K52k43J24p9L21j73J90j21l3mj12K55m21K26
5149b2%Q8j37K3O2n0J05l2P9k70K87o9l6Q9J07r9m8k55K24p1Q0j66L53k4j74O0
5175A04m16K11j5L70k64k48N2J46j76M53j64k04K12j80K03j60k1L29l39L24L7
5196B54k75p6K28j59J95P1q3N1j80k6k7n9N0P6Rj20q2K83j43K2m8O3k25K07OP5
5222H7k72r3L64o7q5K7q9K72j99k30K37r2K23j6L1l09M77l98L03j09j03J56p6
5245C9k4K6J66j15k1qLo0K96n15K57j58j55K53k9L67k90j93Q8J6K3J75n6n8j53
$$ y = [-113, 22, 246, -112, 87, 47, 112, -144, -187, 103, 152, 34, 10, -117, 29, 151, 110, 127, 12, 110, 69, 140, -37, 201, 11, -160, -207, -143, -365, -119, -45, -60, -390, 244, 118, -51, 138, 35, 229, 112, 252, -246, -71, -114, -15, 134, 118, -201, 267, -148, -77, 124, -105, -204, 48, -195, -71, -150, 171, -2, 188, 67, 34, 30, -82, 173, -248, -22, -22, 66, -71, -48, 14, -36, 69, 37, 116, -154, 133, 64, 28, 117, 224, 125, 77, -178, 46, -25, 55, -111, 242, 218, 44, 104, -312, -101, -116, 254, -10, -258, -206, -60, -236, 217, 53, -151, 61, -119, 84, -76, -97, 232, -107, 217, 254, -21, -97, 131, -28, 167, 238, 155, 206, 26, 0, -27, -86, -36, 40, 49, -71, -153, 130, -13, 9, -39, 24, -201, 6, 12, 87, -185, -278, 86, 19, -66, -39, -128, 144, -55, -285, -48, -140, 83, 67, 98, -211, 266, -132, 171, 62, -41, 115, 39, 15, 41, 207, 92, 71, 63, 66, 6, 302, -213, 44, -114, -269, -16, -45, 322, 32, -161, -73, -57, -34, 141, 85, 27, -126]
5270a26K02J24k81J09K30j45m07N41k72n8L3Kr9J07j08R7p4J11K1j39Qj81L87
5293H2k3M4KJ06k0j54K5M6j81R7O7R7k07r1O4M4q2J78j73N4k3K7J76k92P6J48
5319H7m8j93K84j26p3j17l0K99k63L21l39L33ok07r4q1K73j20K2J33k07K02j44
5342i4J34q9J45r7J5Q7k2j94J32K06n14N17j11l40J23N4r0j74J19M43n7j14M2
5365A21P8l09R0K7k43L31j26j30Q8K92m58M44m38M06j35k62J75O4k06J8J44k1
5387e0J12j40r3J15L39K9k54O1j98K8J18k60K40j12K99k2n93L02N8J38J12j54
5409G5J12k07K16l48QJ05q0K30Jk35J69l7m2J4q4l9j72M23Q0j39J22l34L59j68
5433B9j45L10R7j48j55o6K42k87J65L1j97K9J64K76l74J23n3j07l0J25j45PJ9
$$ y = [-126, 76, 200, -81, 28, 258, 113, -294, 247, -25, -83, -50, -48, -147, -40, -148, -51, -125, -14, 7, -132, -124, -305, 82, 59, 103, 105, 211, 191, 37, 62, 108, -73, 24, 91, 188, -19, -110, -46, -2, -84, 94, -79, -25, -48, -21, 155, -137, -61, 87, 39, -154, 130, 4, -69, -186, -216, 83, -180, 141, -198, 135, 129, -78, -172, -253, 20, -100, -78, 55, -152, 50, -94, 40, -49, 96, -1, 14, 101, 79, -115, 17, 223, -291, 226, 115, -225, -102, -48, -138, -312, -193, 250, 193, 79, 121, 199, -110, -20, 7, -236, 95, -31, -161, -73, 219, -239, 205, -233, 173, 38, -224, -49, 15, -191, -173, -29, -50, 62, -78, -171, -56, 283, 312, 58, 119, -79, -51, 67, -193, 47, -65, 234, 212, -381, -79, -21, 117, 229, 75, 187, -20, 196, -152, -144, -39, -119, 111, 112, -123, 46, 9, -33, -19, -103, -142, -314, 109, 189, 50, 172, -162, 197, 29, -116, 194, 291, 143, -12, -78, 164, -123, 42, 73, -124, -95, 69, 345, -29, 94, 41, -66, -96, 29, -116, -109, -90]
5456i0M46k52J4j1Q0k33K46l42M17m31K75K6j43o7K36k49K26n1k3L12m47j3n8
5479a32J22j94l0O8J31J39k25J90k10K54k32K07j8l3j01N5j29J45K8o2j11K12
5501G4Nj68M70k01j66J27j31j31N2M21l06p1m9J39M2mj83K36k64m0L81n5m18J75
5525f5P2Q3k45o3J05%K03j94M04m34P3N6P3p3j36J21j9J67l06M8K42K49k16L3
5549A78j04k53K52j75p5M52k70J53j21J19J3l15K15j03J0m3J89j10m0J80k85R5
5571c8J4M7J93j30n7K0l2m6N1n3r4Ll8K89J2Q2j63j92J46m7K1L8K1j41n7P8J48
5598G5j52OK58j32j80J63k51L27j55J43k69P7q5J17J85j33j38N3K28J19j29K45
5620C72j21ko3%l85L53kj00P9q8j94K77pl20J97n7K30j70J30j46m2j51J45K12
$$ y = [-90, 356, 104, 118, 107, 187, -46, 200, -142, 275, -156, 119, 145, 2, -65, 171, -78, 148, 97, 74, 386, -61, -74, -132, -10, -204, -234, -166, -35, 104, -121, 69, -141, 113, -119, 88, 70, 37, -64, -9, -138, 7, 35, -27, -138, 74, 79, -89, 381, 180, 14, 141, 10, -121, -69, 352, 46, -25, -74, 65, 107, 103, -80, 156, -108, -148, 233, 178, -240, -65, 7, 90, -155, -218, -113, -113, 90, -104, 300, -134, -61, -5, 68, -5, -141, -20, -39, 128, -178, -130, 112, 361, 145, 178, 74, -179, 73, -102, -177, 275, 5, 158, 37, 156, 169, -146, 69, -34, -24, -67, 122, 12, -28, 152, -133, -38, -24, 23, 216, 86, 29, 49, 17, -29, 22, -31, -125, -122, -160, 129, 141, 223, 60, -132, 14, -33, -12, 26, 47, -94, -151, -73, 75, -77, -71, 187, 55, -125, 38, -213, 114, -41, 102, -167, -90, -175, -58, 127, -6, -144, -91, 137, 256, 127, 372, 251, 249, 186, 186, -199, 154, 152, 52, 131, 43, -151, 126, 119, -201, -4, -61, 169, -1, 129, -17, -59, -210, -65, 147]
5644A47j26K6j37j00J92J50k69J59J2n3J4R0p7k21L23k69J35J6j29K43p6Mn5N6
5668E5k14J52k97L35k14J7M23l84P9J88k40J81K15k74j39q6J71r5K96N4L3l77
5690a21m2L85j81n0J8l8Ml33J61Q7J36O9j04J56k29J36o8k3M0J20J45l92J86j84
5714a22L69l44o0M49l07J80J0r7j54Q8O0k59L44k79K15J35l34l7N4J34j3k89L09
5737E2j92J58K37R5l03j8l1J88j0m40L21j64m0R3q5J75o5k88M65k4l64k4L69p8
5761B7j35J6R7j51J47p6K59j46o7k8K10j15n5J63l50K25J44j92M9N3m3n7M6K3
5785D4J80k36Q3j92J0Q6J06J44j43J91m04M0K16k56K38p1j20J21m4R0j06j35O3
5808i5N7R7K34m02j4o7K45L4K55l46j50q7J62J65j01L37k32j08q7m9J0L10j36
$$ y = [147, 21, 47, -90, -190, 2, 152, -117, 42, 54, 1, 15, 105, 28, -193, 130, -139, -4, 12, -117, 126, 50, 54, -1, 55, -159, -7, -304, 31, -183, -166, 257, -127, -48, 140, -100, 81, 296, 22, -117, -203, -32, -127, 169, 223, 256, -121, -163, 222, 41, -9, 9, -29, -25, -358, -197, -110, 26, 95, -9, 147, -82, 54, -14, -37, 3, 123, 268, -124, 62, -122, 247, -97, -157, 292, -15, 165, 175, 78, -76, 12, 72, -187, 157, -122, 93, 228, -106, -143, -89, 45, 32, -257, 52, -140, 18, 255, 350, 47, 29, -2, 186, 176, -264, 57, -107, -147, -54, -139, 36, -29, -317, 148, 124, -240, -264, 105, 27, -108, -92, 5, -146, 1, -75, 184, 38, -29, -57, 153, 38, -17, 146, -204, 21, 165, -27, 22, 75, 32, -25, 21, 44, 224, -12, 71, -121, -111, -25, 81, 225, 82, 273, -131, -91, 125, -131, 107, 36, -84, 37, -7, 83, -23, -158, -95, -38, 59, 293, -109, -123, -190, 55, 89, 344, -2, -152, -239, -77, 88, -13, 324, 92, -16, -103, -152, -142, 168, 32]
5831C2l66L51J05j89pJ29M6k61J59r7K8NJ2J48l23M41l1k60j12L06j06j63K86
5854A33j86l5j42K2J95J39N0K0m43J5L22Q3k63J28J86k47k40K8J94J41m1l24K11
5877e4j89K77K9k13J81rr0n0k34L25J49j4o1Q5k48J50k0N2k59J84j19K14k11K33
5901A08j05L2n6K7J40l2j27K37j27n7K28j61l36K22q2K2L32k55K48l87j7k7K2
5924a51Q8L0j56K05L98n19J17o7m7J70K6pj56K47l13P6k35M70l1m56L19K29j20
5947A17j37l07K63N0K30j17l8k28J72j61K16j75R5J60l01J54K73j63Rk3p3q6L2
5970c8K91l08M87o33P6OQ2M8j47N4K38l53pK60O8n6J22j76k19L56j82P8J39j82
5994Dl6l7j38J54o4O2j67K96j55K55l15L41k40L18l28K15j08j59J26k65J07K12
$$ y = [32, -334, 17, 122, -67, -74, 55, 101, -160, -1, -98, -70, -65, -53, 95, -228, 213, 182, -78, -190, 116, 10, -153, 133, -53, -88, -230, -208, -13, 126, 176, 196, -247, -232, 90, 173, -90, 38, 224, -23, -263, -235, -41, 100, 59, -265, -54, -243, 34, 63, -150, 31, 22, -68, -118, -352, -27, 122, 108, 47, 132, -116, 34, 14, 66, -193, -9, -128, 86, -125, 108, 3, 35, -21, 6, 146, 114, -13, 224, 97, 40, 268, 107, -229, -7, -89, -67, 265, 10, 258, -129, -146, -173, -151, -63, -33, -189, 16, 414, -105, 12, -55, -102, 68, 94, 87, -69, 178, -135, -59, -294, 176, 145, -311, 8, 237, 117, -20, -327, -64, -14, 216, 99, 61, -167, 5, -156, 60, -115, -20, 140, -161, -7, 266, 103, 112, 89, 16, -70, -38, 253, -55, 432, -201, -125, -119, -37, 11, -136, -82, 156, -197, -204, 56, 124, 68, 190, 14, -205, 151, -31, 47, 186, 4, -32, -69, -207, -53, -117, -55, -222, 74, -81, 174, -141, 200, -40, 278, -50, 165, 57, -102, 24, -241, -134, 78]
6016G8k7Q5q4k14K71R8j53j6M4l05R5O9j06L91l12J17Pj40j51K3J44j6K6J33l54
6041b97L85Mk1j95J61J60l33P7o0J03J47k3r5J43j90J21l32M65m7l50M71l78J24
6064D0P5L2j74M6Q8L14l67j89j96K67j6q3J67k4J3j01J09j81L35r3J90k3k08r5
6088g4J28j82j95M47j11q2j03M33o00M34l03J59l2q7K61p8M0o7K94N3k36rk20
6111a30L86l41J09j23J33N1j0j48K08q0R0J32n5m04K7M7l1L25n2Op3j0P1M4l0
6136A42l60K84L6O7l8j22k51L1K59l74K73J5K0J08P7j08k65J00Q7J07j27r6J32
6159ck57M41k03L5q9mJ16j94j00N2j6K54K0K00k70K01l98N1K03j84J60M7nj41
6183h4NL1j0J26L3j54j34J98ro6j74J01K88j20J03l75L53M7q0j53J71p7k53L14
$$ y = [78, 51, 136, 52, -162, 109, 207, 54, 38, 82, -223, -128, -59, -165, 226, -86, 31, 38, -102, -253, -230, -86, -102, -76, 57, -297, 88, 92, 71, -124, 37, 197, -136, -59, -119, -16, 131, 108, 13, 156, -34, 87, -245, 220, 173, -177, 294, -84, 40, 115, 147, -27, 19, 107, 421, 54, -135, -331, -64, -80, -163, 4, -20, -7, -108, 1, -180, 155, 62, 252, 229, 21, -74, 54, -128, -323, 124, 13, -69, -172, 261, -339, 95, -208, -49, -81, -168, 93, 15, 55, -12, 282, 335, 99, 90, -130, 256, -85, 24, -99, 34, 85, 75, -73, 135, 55, 145, 277, 222, -182, -155, -108, -139, 186, 134, 140, 67, 57, 128, 172, 142, -218, 66, 102, 169, 131, 9, -242, -211, 48, -326, -53, -38, -18, 90, 167, 59, -206, -106, -19, 88, -39, -135, -3, -260, 181, -22, 13, -76, -80, 36, -158, -258, -206, -222, 32, 52, 252, -18, 183, -215, -164, 39, -145, 15, 62, 57, -84, -79, -48, -58, 68, 101, -53, -187, 11, 2, -64, -238, -137, 151, 31, 134, -241, 112, 159, 79, -74, 97, 20, -233, 81]
6207H1p7K5j14K90n4k20J62K71l41j19K32r7l54K48J62l5k10q6L61o3k07o4M09
6230B00l35L37l59K47O0n09L26r7K78k27N8j61l2J46J58J28m65L39j03j09K28
6251A08k95J13P6P4J7J7l77K57J06p1Mrj38M9o6R5MK24k47J63L0K0k9j61j53L81
6277A92N3l36K78J7k98J47j8l00L39m1J15j39Qk3J31j02J30jp5l09L66J04l91
6300a53M26p08O11k26nj6K09p3pJ76j31j81r5L47j21j77M3J22J1m62M49j01k4
6323h6K60l06Q4J49j50j26K15K7J49k35K34r0j44M4O4p0o6Q2j57J2J04j4JJ53
6347A34k80L12j82K07l12K70l04M5K13J3j34m3K3J1l9j12J13k07R1J22k1k03M39
6370A56j86O9j72K99J44m36nk35M25K3nk33N8K89M8n73L54P6p2j70j25K12Qn6
$$ y = [81, 4, 29, -85, 205, 151, -69, 93, 364, 23, -96, 136, 39, -315, -67, 95, 60, -150, -236, 125, 62, -145, -209, 200, -135, 202, -157, 90, 150, -359, -33, -130, 148, -79, -21, -182, -214, -68, 90, 218, -247, 92, -11, -120, 108, -187, -74, 2, 76, 93, 110, -267, -10, 96, 25, 29, 20, -118, -69, -135, -40, -36, 188, -59, 104, 134, 154, 125, -36, -189, 192, 245, -91, 187, 204, -94, 53, 35, -265, 74, 33, 148, 9, 17, -6, 125, 23, 153, 152, 77, -232, 134, 238, -153, 273, -435, 176, -50, -55, -71, 138, 65, 58, 234, 103, -78, -173, 174, 53, -124, -81, 41, 52, -410, 39, -62, -86, 174, -132, -48, 101, -49, -175, 40, 67, 216, -19, 215, 125, -19, 25, 89, 19, -47, 35, -122, -110, -6, -20, -19, 134, -146, 166, -16, 191, -121, 149, -155, -110, 103, 116, -18, -61, -38, -27, -66, -178, -65, -272, -181, -59, -80, -283, 156, -30, 39, -133, 166, 310, -126, -131, -366, 59, 82, 77, -156, -98, 191, 239, -334, 20, 96, 24, -146, -271, -59, -51, -107]
6394a07k34M29M8j65q6j51M36k48Q2j59O6K23rm7k21R9M3n2j97M9J54j10J55k02
6418b04Q8M9q4K43L2j28j70L20m2k65J45J69m4j20P3l40K28J00j8J15J58p4l06
6441g5M2M5l14M49l87L31l25K1p7O8Q0L64l34O5K21j72n5M2Q7j21J61j1j67M3
6465a9K33q7q4p1j55K35j66k3j24kL15m0L0l8R1j11j22K24J5J8l26k9J05K58j5
6490A12p6j8k15N2K27q1J85k02m0J08k48J35P2k57J90J4k8P0m5j63J70K54k07
6513Ik32j45K27L34l79K27K82l04j10K19j9j63j1j94K29K71j01j91J57k06K90
6534A90r0ml78K93J0J43l82K15k89K64L3J23J95m94L2K05Nn2j8j67K51m79L29
6557f5J67m7j48J34L2L3l11K78K9J29j91j57n8j83K59M0J35R1m2j10j89N8JM8
$$ y = [-107, -341, 88, 136, -29, -115, -266, 170, -78, 4, -155, -89, 134, 125, 78, -143, -44, -1, -53, -250, -201, -47, -157, -2, -204, -116, -67, -151, 92, 124, -4, -174, 146, 104, -161, -16, 153, 109, -11, 62, -278, -50, 50, 32, 147, 305, 231, -75, -33, 12, -302, 147, -240, 91, -234, -213, -290, -222, -142, 222, -112, -47, 174, 2, -53, -11, 76, -45, 116, 105, -62, -19, 214, 127, 43, -28, -183, 52, -114, -137, -261, -263, 52, 12, 42, 4, 95, -16, -138, 86, 101, 119, -207, -236, -131, 127, 112, 36, 18, -197, -145, 82, 1, 186, -16, -56, 52, -196, -61, 11, -246, -56, -42, -70, 0, -45, -208, -38, 216, 9, -223, -368, -141, 193, -186, 41, 323, 19, -91, 128, 109, -54, -65, -259, -30, 241, 140, -51, 106, -100, 190, 100, 96, -282, 11, 21, 164, -218, -3, -292, -28, 5, 128, 323, -171, -139, 66, 71, 19, 1, -166, 85, -394, -65, 102, 55, -93, 41, 73, 106, -205, 73, 102, 231, 40, -117, -175, -358, -99, -59, 76, 167, 125, 15, -174, -116, -115, -67]
6581f7K6N8k5J64q5j03k90L31j44J72J07q6k9J16J13l38J41o1j67K79R4j59j65
6604a18K65j25k14L83j26j29J84p3j21J36l51P04n07J28J14m0k08O4M5Rj58L51
6626B13l14j05K10K5L7J81n13J22R8q6L97o43M85j82K61n7j13J10j65j66M02r4
6648A03L4j83j76J56q5K49K0j02j63K19K2j97J51k3N1j35o5J2J17J47l28N03o25
6671b98J81J39l1j52K78Lo6k13K01j6k35J79q8M7J20m5M0j73K15J5k68j95M05
6694D3j17K23l4j63r6r7K92J88l35j84L18R8l01K25q2J78k25l6N1k64L72m9k8
6717b3l9q3K27p0oo9r4p5J54K52l79L61j10J09l04K58l5l15L88j27M5r2kR9J10
6742A80k45J51k2k17J67Q9K4j99J90j68o6KK45j05J65j57K74l93J42k66J00R3
$$ y = [-67, -41, 17, -8, 156, 71, -32, -322, 9, -135, 37, 144, 58, 29, 145, 258, -80, 61, 0, -167, 112, 206, 47, -118, 147, 22, -192, 191, 65, -64, 120, 47, -74, 62, -289, 415, -92, 36, 150, 110, -98, -34, 11, 20, -138, 213, -101, -206, 4, 29, 66, 247, -266, -144, -46, -132, 265, -378, 107, -75, 186, 129, 16, 126, -39, -205, 197, 103, 137, -46, -222, -66, -151, 98, 118, 16, -147, 72, 94, -103, 48, 25, 76, -59, -124, -112, 5, 152, -176, 327, -298, -117, 22, -9, -161, 117, 120, 54, -159, 42, 26, -209, -30, -118, -71, 49, 4, 44, -129, 86, 101, -167, -362, 43, -74, 149, 115, -48, -144, -241, 51, 239, -96, -280, 38, 136, -165, 60, -22, 156, -69, -105, -54, -318, 54, 5, -23, -62, -145, 82, 12, 6, -63, -157, -232, -78, 174, -205, 156, 46, 155, -149, 109, 74, -241, 147, 20, 65, -27, -29, 70, 180, -65, 86, 64, -153, 14, 103, 127, -72, 118, -50, -116, -114, 131, 26, 191, 34, 308, -85, 57, -209, -109, -16]
6764a6Jj13K47k24J0M3p8J70J45k19q1K60K0j45p4J51l08J46M47l17k03J96o7
6787i%Q9L9j30K28q7r0J56r0rr4j34L61k64J47j08m7J09n5j53J59K38o72J39M48
6812A71J20j97j67P3J2P8M4j32j15J27o0M1P4j18K23k08J80k88P2q1L54j17k21
6835a35K33j4m6J2J26j14o8K13k97P7N8r5K3k20M34l55L14j37q2J80M2j48j8o4
6859h1Q4j55J88L22m26Q8K31j44j50J3j51N8K28j61J84j12J34j08j76J31j62j91
6881c56M76m4n3k5j72N0L24j48J37k48j20J28n5J23k18L57j0j36o9P6m3k34K39
6904b1k00p9O75l59J04k28R1L07j88j96P9j35J09p9K16j62K1L5j01J99L1l73M48
6927A94l53j08L8J08rM4J48P6q6p6J43m8r8J23K6J60k25l0K33j32k18N8l08J42
$$ y = [-16, -15, -128, 119, -105, -95, -52, -130, 40, 185, -34, -115, 145, 165, 20, -54, 97, -211, -65, 382, 65, -138, 58, -9, -9, 80, 119, -11, 217, 130, 40, 196, 106, 97, 3, -131, 230, -34, 113, 5, -42, 67, 12, -141, 18, 256, -416, -277, 171, 291, 94, -73, 0, 12, 90, 134, 2, -113, 14, -46, -5, 69, -49, 174, -34, 146, -142, -70, -151, 203, 86, -135, 98, 84, 38, 50, 176, 62, -6, 207, -90, -13, 45, -50, -27, -247, 187, -168, 146, 9, -73, 107, 149, 1, -17, -81, 3, -152, 36, 358, -68, 20, 251, 107, -43, -30, -181, -123, 105, -56, 128, 16, 150, 42, -134, -3, -165, -356, 120, 76, 23, -2, -174, -124, 200, 52, 189, -59, -179, -51, -106, 17, -201, 156, 146, 10, -59, 17, -26, -260, -21, -221, -300, 375, 16, 120, -108, -17, 290, 102, -94, -15, -150, -41, -120, 96, -66, -45, -10, -111, 88, 119, -254, 194, -159, -267, -229, -121, -130, -86, 62, 138, 52, -24, 119, 71, -27, 96, 122, 282, 57, 27, 260, 128, -90, -32, -340, -198]
6951a98L22j1o1K10n2l54m0L05R6m03K68j00l5R6j71O7J87j79p2K57j41j45M18
6974B64m51J86K44n2m0m32K65J86j50m4kK00k17O1o8k0O1r9J82O2k44J32k35K52
6998D1Q6k9j71J34j17J97J02j33j49M8K37k36J51m6j64p0K18N3ql61K05r1J19
7021A6K00l73MN03k97q2Ml1n4J39j26K76k07m5jJ50k10J58k9N5O9j54k05R1o3
7046b12K90q1j34K02k5j75J47k25L57j82l3L01j11j32q4J07k35K02J06l02J72
7067d7m8M9R8j33p8P0J94k13L0K13p3q6J09J23j03j59l6Q8l4j65J56J58L9k84
7091a32k31N07k05k24L56j77o9L0OL32l21K01j09q0K7J57L1k18Nn9L50j92K44
7114B29o8j10l1r2j09j33M46p4L0r7n1L38j36k69R9j65K92j58m7l5J8Q4R6J32
$$ y = [-198, 124, 113, 52, 262, 210, -144, -184, 121, 217, -186, 82, -18, -53, 43, -128, -61, 126, -53, -125, 132, -9, -154, 264, -187, -1, 243, 191, 151, -281, -16, 170, 20, -24, -26, 174, -43, 18, -50, -70, -9, -108, 74, 136, -108, 24, -211, 41, 127, 98, -73, 61, -56, 141, 243, 110, -39, 9, 246, 10, 161, 115, -49, -119, 99, 152, 144, -217, -12, -103, 16, 216, -157, -153, 350, 53, -29, -25, -56, -110, 29, -97, 179, -28, -73, -74, 76, -134, 24, -5, 50, 119, -35, -240, -149, -212, 78, -3, -137, 65, 40, -135, 12, -213, 144, -38, -71, 230, 119, -13, -97, 10, -225, -23, 83, -219, -47, -95, -46, 52, -81, -159, -89, 105, -108, -78, 135, 62, -24, 85, 208, 105, -54, -90, -2, -36, -201, -45, 113, 152, -132, -363, 144, -61, -285, 71, -106, -175, -145, -139, 193, -128, 73, -36, -116, -89, 68, 99, -119, -114, -173, 177, -15, 229, 161, 51, 20, -72, -181, -314, 132, 58, 88, -9, -60, 278, 142, -127, -28, -193, 99, -59, -106, -141, -123, -39, 57, 189]
7138A89P1j04n6j92J94j71J39J60l19J76j70L73n75K90k0n4J81j31J8L1J54k69
7160h5J70l82L03K1N7K26m01K22k81J41p5J4Q7k06N22l74o6o0J14L91m13J84J55
7183B64l29J92j89J15k90J61J49l9Q7k01Q5n6L3N6k44J27J3o6M04j23JN8m26K52
7207C4J08k31L32N5k94j06L47j46k28K81j86LJ30l00n5J33m3j72M10L2n0J41m13
7230b18L2R1l08K36K81R7k35j49O2j02K10O9j42P9J7N0l6K78m35K30k74P3j11
7253b05K49k74M26m20K94k64J67q7K57l1o7R7j37R7k16J09j7N3j58L43r7p7O3
7276A05m40L32o3l6J28K51o7r6k28J96N6m22J48n9L40j36J45j05l94K11J09K01
7298A76r2p0J28j75k22J79K10n1j80O7p5M0m4QK99k41l1N3j0j27J40J06j34M5
$$ y = [189, 260, 156, 100, -92, 102, -69, 70, 230, -89, 87, -83, 290, -285, 5, -15, -69, 112, -19, -1, 30, 184, -85, 85, -297, 6, 27, 84, 310, -91, 131, -150, -9, -84, -70, 17, -189, 333, -41, -107, -167, -53, 338, -75, 109, 264, -65, 127, -62, 53, -237, -76, 73, 34, 121, -80, 5, -51, -18, 38, -206, -79, -66, -132, 272, 149, 150, 208, -218, 34, 142, -89, 243, 298, 4, -102, 245, 99, -129, 152, -34, -31, 99, -201, -256, -123, -166, -338, 72, 104, 54, 195, -218, -186, -95, -403, -167, 114, 211, -24, -173, -111, -213, -3, 66, -76, 3, 20, 70, 34, 312, -123, 107, -167, -94, -205, 44, -230, 196, -224, 70, -194, -27, -114, 143, 112, 45, 142, 5, 102, -114, -5, -22, 31, -127, 216, 119, 42, 105, -335, -3, -66, -102, 26, 277, 210, 114, -114, 82, 138, -284, -136, -195, 145, 9, 154, 49, -345, -134, -25, 176, 84, 14, 142, -33, -255, -76, 134, 83, -97, -30, -105, -65, -109, -101, 198, -43, -74, -21, -31, -158, -18, 88, -46, -1]
7322aj05J07n5J49K0k88K64N9m16L61j7m7r0J4k0J98k8k42J81q5n5k1K25P1l97
7347b18K16J46j20K24k88j43N0o5K28k06K10N6q2L8Kk1J21q9r8J8j3O0J10j53
7371a7J08j87J6m9M5M2O8O4m1O8k81K5K67l25R9R3J39o7K1j79R2q7q2K40j09n2
7397h9L0j37J27j21J25M4p1J71j98K32K3n0j6k25J85p3o4k11P8N4Q1K64j03k44
7421a88M45n8l34q8K89j43M1r9O9p8J9O7l4J86j68R0j47J84j44j25J24J62N9r3
7445C6j73J39K21l53J51k78M62m13K10j23Q4J65k03J12L53k50J51m43J13p6J52
7466C7R7k59J78n5j31KK70j95N3P9l00L89l28K36j66J21j02l9O1rK27j64J34j05
7490C1j01Q8j9J69l17J13J81K46k60k34K45n58K38J72OJ4K03q5j92l3M6o2n7K69
$$ y = [-1, -106, 1, -54, 95, 115, -173, 91, 150, -266, 95, 78, 31, -59, -45, -65, 133, 105, -137, 44, -41, -96, -117, 108, 179, -218, -2, 144, 24, 248, -40, -183, -133, -198, 30, -176, 34, 90, 8, 46, 48, 27, 148, 59, -39, -21, -34, 26, 136, -17, 91, -96, -80, -129, -84, -42, 26, 90, 49, 117, -164, -139, 128, -197, -98, -5, 134, 67, 88, -91, 1, -86, -168, 72, -37, -89, -59, -196, -69, -190, -65, -21, -92, 79, -119, 113, 136, 86, 70, -155, 30, -43, -107, -318, -240, -186, -105, 159, 56, -188, 257, 199, -135, -223, 66, -77, -36, -135, -66, -144, -125, -58, -92, 94, -74, 16, -131, 53, -91, -216, -92, 70, 129, 36, -137, 2, 223, -130, 21, -257, 205, -208, 2, -121, -37, 128, -75, 37, 390, 140, 291, -152, -39, -115, 37, 134, -125, 53, -2, -133, -131, 139, -56, -3, 76, -224, 165, -163, 73, -93, 28, -74, -113, -52, -61, 166, 2, 136, 31, -70, 18, -1, 168, -149, -36, 145, 391, 131, -103, 142, -416, -178, -6, 0, 14, 217, 132, -60, -93, -47, -109, -166, 103]
7514A03p8j08J04K9k20J55M5j47J46j83J72J16q6J27j53O6N3j22j28K58j67k94
7536c12K02J77K23k36r1K45k59K12k32J62k56L07l65O2J10rk3J70j17O3O8q8K9
7559D2k82K60j1K19l23K38J37j92n8M0J87k53L43j97k10K3m3J06m8j36n1L42j06
7582B7p1q7L38j80j68K44n5m1o4J71k04l5J25j00M83m86K10p4O1j91P8k2J99J37
7606B95j40l48J71o9L64r7O0Nk29K7J66j83l1J3PJ67nn0q8k8J75k35J78J61q3
7631B03j5k27n6R6K42l91P1K20N1k51K76m17L67m4j98J87j03J19j26j22M6J33
7653F1j3j11K07j72P8jQ4Kl60M69l62QL31k26j4N2r0pK41J02j36N0l86K25Pk22
7679a83K25P6k07k9P1l5Q1P7Jk29J51j78J53m9j35K40o6K0OQ8l22L99l59j3L49
$$ y = [103, 25, -83, 21, 50, -170, -15, 30, -117, 29, -154, 18, 134, 48, 175, 22, 88, 141, 19, -109, 149, -18, -312, -110, 67, 290, 54, -37, 208, -51, 161, -71, 91, -165, 142, -223, -161, -51, -60, -83, 87, -30, 33, 101, 13, 42, -240, 20, 9, 228, -95, 143, 280, 88, 30, 70, 257, 4, 347, 150, -60, -37, -80, 26, -22, -158, -209, 133, 27, -44, -131, 207, 27, -141, 103, 48, 7, -57, 114, -90, -125, 0, -100, 383, -103, 107, 33, 94, -97, -19, -41, 158, 295, 155, -193, -22, -91, 273, 176, 236, 241, 12, 39, 205, 22, -9, 4, 11, 178, 173, 123, 35, 7, 182, -53, 125, 286, 203, 188, -39, -95, 1, 243, -148, -77, 143, 194, -57, 219, -198, 169, 125, -73, 114, 11, 130, 4, -118, -72, 61, 48, -63, 144, -28, 50, 49, 133, 135, -225, 244, -118, -110, 221, -5, -19, 33, -57, -64, 177, 279, 143, 193, -193, 32, 39, -183, 42, 118, -89, -118, -47, -82, -1, 76, 77, -152, -1, -179, -26, -75, -210, 30, -36, -16, -10, 78, -244, 155, -204, -217, 132]
7704A32n5p9q5j7J18J13m0J40j8l75K57n5K75m96J99J67n7j01r2J77l21J09l1
7727a35P5j6rj30K3J80j14J39L0m9J38r1j71l2J31j67k0K45P7k00J91j1J3j42
7751d5J98K84k83k27k11L08o4p4J74J42l13J52L67n79j17M12j48Jn0j76L89j84
7773d4K06k41K03l7k39J02J30J57k07l5n7L07k95K93l67K46m9j19J52j99NJ17
7795B9P7J09k39QJ6j23jJ54K63k38r6m7m0J44J12j86L51n1k1k86P3j34j03K79
7819E0p2J4J81k64R9M40n81k1K71j41k1j08R8J2k6R5l39M10J08J49j64j58m7J02
7843H7J39j74N7p1mk82L45k35N6O5K7P0j30n6J17J33o5l2J14j04k11K09j95M3
7867i7mK38q1J21k90K67j71p4J26k54J32L58m83Q5M7j50J21L77k02k54K48l40
$$ y = [132, 77, -2, -87, -104, 14, 127, 87, 227, 209, -166, 91, 36, 311, -185, 14, 181, 124, 23, -69, 108, -213, -104, -135, -60, -76, -85, -215, -192, -12, -126, 13, 43, -6, 132, 41, -130, -162, -31, -198, -218, 27, 104, -96, 95, 84, 97, -45, 153, 437, 154, -73, -284, 24, -40, -114, 60, 202, -111, 41, 408, -171, -288, 124, -24, -23, -73, -249, 140, -44, 162, -79, 124, 87, -152, -50, 80, 237, 30, -5, -62, 245, -50, 243, -124, 122, 73, -46, 106, -93, -88, 29, 106, 215, -24, -16, 0, -123, -124, 30, 293, 55, -41, -88, -128, 16, 128, -58, 293, 242, 221, -65, 8, -126, -229, 50, -22, -8, 173, -91, 8, 448, -133, -154, 117, -24, -45, -153, -55, -43, -69, 26, -313, 97, 205, 354, 190, 32, -15, 87, 226, 52, 109, 38, 34, -248, 97, -138, -82, -17, 10, 80, -50, -106, 11, 144, 79, 47, 161, 57, -154, 55, -140, -97, -101, 137, 56, 177, -113, 154, -17, -91, 35, -219, -87, 271, -212, -127, -80, -230, -109, 268, 66, -188, 60, -280]
7889b80K73p1Pj53J66J75l15J63j22K05j09J42K50m61n0L62l89L52n8k70M35l13
7911f1k10K79k78J15o1L18k31N4P0j10K53k77O4M42l58j25K56k14L7O3j53N6J37
7934F6r0j86R2M58q1o8j25n3j80J65j26L3q5K04q5J84l96J13l5P4R0J90j35l5
7958a1o8K76j60L58l54Oq2O2J1k98R6M4R2J00k16P4K22q2q5mN7mq8J68n5j73L89
7985B75l68n3J09j30L03k40m5O4Q9O3l1M3k38J22q4L59k44J47J6K1j81k82L22
8008C7J30q4L2J59l46K97k84J75l45M06k99j08Q8j4K81oQJ5k93M9L10l22M8j57
8032b23j79J57K69r7l7K66k83J61K36l03J01k29J15J51n6j37K36p7j69J09o0J11
8054F2l5j33K14M9k21M7N2K14k8l06L9m2K4K51l99M39l14K4J93J8j3K08l82j21
$$ y = [-280, -7, -78, -71, -224, -58, 117, -198, -35, -157, 48, -61, 81, 331, -130, -180, 182, -207, 145, 87, -183, 252, -61, -271, 8, -270, -155, -216, 102, -129, -75, -5, -115, 138, -139, -75, 367, 9, -116, 140, -74, -37, 26, -127, -71, 66, -24, -210, -118, 340, 259, 191, 66, 13, -167, -2, -128, -95, -180, 24, -61, 123, -273, -160, -195, -121, -31, 159, 24, -11, -79, 197, 37, 395, 41, 47, -35, 27, 38, -260, -164, -120, -28, 72, -144, -70, 152, 70, -15, -19, 38, 34, -54, 114, 59, -114, 275, -93, -146, -37, -167, 136, -104, -149, -85, 4, 67, 36, 79, -159, -37, -121, 238, -6, 141, 157, 178, -3, -285, 37, 167, 83, 115, 274, -72, 225, -59, 116, -229, 177, -122, -230, -142, -156, 125, 119, 127, 142, -151, -102, 208, -114, -66, -223, -402, -245, 24, -73, -110, 156, -127, 34, 270, -33, 68, -161, -46, 105, 49, -88, 148, 71, -98, 11, -49, 62, 27, -106, 108, 157, -64, -17, 35, 249, 221, -85, -46, -88, -64, 187, -212, 227, -87, -63, 130, 148, 135, 343, -39, -160]
8078a60K57O5m9l8j21K54j08O3k80j75L29M7P0j37P7l3q7J36m9n3J47l81R9K51
8102A24l76K56j16R5J4j30m8m1K10Q6j67o0J15J06j88J89n0j17J93k97L62k74
8124a14j3J24j03J8L19l23N0j03O8J26m4o3J03k47L92l46K69K1j10J6k48L35o3
8147F4L6J6k73Q7K22o1Q0l30J03r7L03k1n10K50J77o3J64k04M4Q3j19N2o2J31
8171G2J25l96K37k33NM14n4m11L23K1j36q5J48J21j06K3o9kN7K
$$ y = [-160, 97, 162, 113, 75, -46, 208, 100, 163, -117, -292, 37, 84, 154, 17, 94, 61, -26, 110, 61, 8, 155, -226, -127, 124, -252, 4, -112, -17, -3, -133, -181, -222, -12, 74, -93, -153, -38, 68, -120, 69, 19, -98, 95, -202, 160, -114, -127, -3, -106, -88, 231, -92, -42, -145, -77, 49, 5, -58, 45, -202, 190, -156, 113, 134, 24, 40, -208, 127, 64, 100, 116, -157, -70, 152, 91, 171, -159, -56, -153, 150, 129, -381, -131, 46, -17, 147, -57, -13, 70, -49, 3, -59, 72, 197, -199, 38, -195, -190, 224, 170, -241, 82, 103, -33, -118, 30, 151, 45, 68, -1, -3, 54, 56]
8191E6
$$ Imaginary data points
##PAGE= N=2
##DATA TABLE= (X++(I..I)), XYDATA
0@%%%%%%%%%%%qJ6j6J6k4L2l8M6n6O5p3Q8j07J31j52J76k06K38k73L11l56M04
33B14m59N19n84O59p40Q27r21J025j140J265j402J552j716J896k091K305k541
50a332K798l081L394l744M136m576N074n643O300p070P988r104J0496j2282J4675
65H029j8070K3289l2425N2996j85805L4522K81283k31585r3106J85558R1198j65983
77e0099l112J53093K5873j39540l037R8868q132j25291J1480J23387l5642j53517
89a05669O1067J02185j17649o2734J59082K0697j53496J8710J59394l0845j17121
100f6379Q3231J14869j10766j03784J06339Q6999j11063r4603R6767P0239j35825
111f3976o2575J51761L7675j36895J6173J35241l8287j09787Q2451J15371r1615
$$ y = [0, 0, 0, 0, 0, 0, 0, 0, 0, 0, 0, 0, -8, 8, -8, 8, -16, 16, -22, 24, -32, 33, -40, 48, -59, 72, -80, 96, -110, 128, -145, 166, -190, 214, -245, 274, -310, 349, -391, 436, -485, 540, -600, 665, -737, 815, -901, 995, -1096, 1209, -1332, 1466, -1615, 1779, -1965, 2171, -2405, 2669, -2974, 3326, -3744, 4244, -4860, 5636, -6646, 8029, -10041, 13248, -19177, 33819, -151986, -117464, 163819, -67766, -160872, 24686, 115884, -50099, -53211, 99882, 125755, -13785, -16822, 82046, 73914, -51377, -39897, 83490, 47848, -105669, -44602, 57583, -60066, -122800, 36282, 56979, -96517, -77807, 81587, 50742, -66379, 16852, 131721, 20955, -82829, 23510, 110509, -554, -95157, 1610, 71849, -63976, -126551, 25210, 62885, -74010, -57837, 77404, 39117, -70670, 11781, 127152, 35537]
122C5537r1970R1038L2381j12749p737J03828j8014j13554J7089J08654l5088
133I415r9334P3099R7612q7325p7734R6173P1287q6079m3125J04907K9562j18560
145c0102j8060J06061n045r7984P622P0873l9448p9723N8776Q0631o9940m8840
157f5179Q9740K3382q7680J0575R7840j8650r5361L0810Q0782n9374p1079P4607
169A0413N5444p9596n3261O8123M4932p0166l0150Q8677J7015r6541j376R0934
181D4448q269p4291K5025O4572m7602n9959O2086M0576o8048j3979O3347r564
193A8342o2793J7686O8152j6288o3662L0432N9343m6960m9461N9189M6704o5642
205d958m9730O2822L3345p6093j4398Q4654n163p7816J7805O5721k0903m7258
$$ y = [35537, -56433, 34605, 66986, -45763, -53500, 50328, 32314, -81240, -64151, 44503, 9415, -89919, -16820, 80792, -6533, -84267, 11906, 83193, -2886, -46011, 58896, 88458, -30102, -48162, 57899, 52854, -45130, -37508, 33365, -6083, -85806, -27030, 53601, -16339, -65179, 24561, 47943, -39737, -29162, 68678, 50028, -45333, -14523, 66259, 6885, -64194, 10413, 65857, -13739, -67000, 1123, 46055, -24111, -54261, 34416, 51431, -45110, -46486, 44448, 36179, -38112, -13087, 51485, 3883, -56076, 6010, 46586, -21462, -35441, 27906, 18342, -44451, -26765, 41387, 25099, -38563, -8131, 51212, 4252, -45209, 13980, 60684, -4958, -54688, 8134, 41479, -34614, -49012, 35642, 30479, -47337, -29532, 36189, 15286, -31972]
217c1972L3594M1894m4155l4857M7619J9413m3123l583L9431q175m8726R015N6120
230C2495j8884n6462L4017M6140m8021l5387N8928L6716n7162k7811O1001J2790
242C8360o5844L227O0833j5571n5377J1637M1829j7352l6196L0643L4836l8419
254g394k2719M2695J2911l4303J825L6832j1745m5583J7686M4107l0857l6631
266c3176L8176K3368m5956k1614M6644K2307m6745j5434M9611L516m8018J0576
278a6745M8477r033l9535J0634L5386j9907l1427K9255K0601l9238j5259L0548
290C757K380k8458O883L3545j1882l4323K4475L3587k8771j9676L5303J3241m0016
303i955j6341M0705J2741m3540n379M1116p999l8299J1533L5206r080l1677J1953
$$ y = [-31972, 1622, 43516, -639, -35496, 12123, 31536, -11587, -15170, 24261, 16086, -32640, -23625, 32495, 13611, -42851, -8834, 37306, -10715, -46102, 12826, 49542, -7620, -35431, 25570, 38360, -27484, -24257, 36576, 21005, -34372, -22735, 19094, 1742, -34454, -3811, 31025, -7394, -30113, 12582, 25493, -8810, -6985, 29847, 18102, -27481, -9795, 34312, 3455, -33176, 5000, 28368, -17588, -39202, 7442, 29749, -16996, -32430, 17181, 20697, -27321, -16745, 31732, 22699, -16836, -6202, 29184, 9277, -22150, 7105, 27706, -11532, -26791, 3757, 6137, -22321, -15438, 18107, 6225, -28098, -3623, 29964, 1193, -18483, 16820, 30061, -9955, -26296, 14409, 27150, -16390, -21769, 19347, 11348, -26951, -15418, 19788, 10708, -20969, -9016]
316i016K7076k0070j8496K9577J2846k6935n818K3203Q2k4487O414K7438j7869
329C945k9508K1582J9583k6680j0963L0266J1662l2816r696L9105P024l6253L385
342i364L2717j1717l1254R258K8285j0346k7092J4424J9133k1488j0044K4429
354F941N703j9224j702J7257k660j9838J1164K2636j7797j8507J9879J1034k1065
367f179p966K3864P515l1287o692L2299m35k8784Q128K6405q695k4774J0137K6286
381A9822j1599k0448J6184J0496k0511o139J6688K660j5224p64J5340o211j5759
394a5465J5366J6047j6906r629J6840O190j7786n217K3085L510k7770p14K4741
407A2292n697k1391P878J9964q967k2014R724K1622j2356j3315J6241P085j4384
$$ y = [-9016, 18060, -2010, -20506, 9071, 21917, -5018, -10836, 12367, 12449, -12038, -5624, 21814, 3945, -25563, -3981, 15602, -11078, -22041, 8225, 19887, -12929, -22625, 16480, 23504, -12749, -9364, 23353, 11636, -19618, -10360, 17925, 7579, -19513, -5089, 14044, -7444, -17488, 6941, 12644, -6580, -8282, 8975, 6315, -13523, -2359, 20277, 2480, -16027, 3852, 14886, -6179, -14145, 9719, 17234, -14053, -20745, 11554, 11119, -17665, -9537, 16868, 8173, -16601, -6464, 19822, 8223, -12225, 3959, 14455, -6056, -12195, 4493, 7153, -8071, -8835, 6505, 294, -15465, -99, 15948, -958, -10587, 6253, 12443, -5343, -10560, 12525, 16035, -11735, -12449, 12292, 6595, -14796, -6918, 13046, 4079, -17935, -8211, 13411, 1055, -12260, 3981, 11066, -3318]
420c318l433J3961L391j3300Q39J2373j0755j3224J4459Q229j5816n463J4245
433B188M252j6884j216K3220p0k1566N075J8267o386j5427P656J6060r566j8929
447a3326J0254J3708j3089q248J1867L670j1048l761J1418K941j0289N176R700
460H973r613o263J3442M195j1244l907J1383J834j8765P2J9729n050j7811N705
474g320J4201o142j2997Q959J5530r822j2649J2510P679j0843k381Q309K494r160
488a632l551Q491o23q515N547M634r439l159Q833L586q958j521J3214m16j5357
503h866M862J5860n539j2977N039J0947o718j2620P997J1817j0622r329R573N118
517D542q101k234Q270K687q532q15Q980l034n427P057K013p620q41O199J196q453
$$ y = [-3318, -6751, 7210, 10601, -2699, -1860, 10513, -242, -13466, 993, 9222, -6594, -12057, 2188, 6440, -10444, -11660, 11560, 11490, -10076, -5001, 13266, 6880, -8547, -891, 15169, 5603, -13326, -3072, 10636, -2453, -10701, 1166, 4836, -6212, -9973, 1445, 4386, -5903, -727, 8973, -640, -6903, 6539, 10734, -510, -4417, 6966, 8800, -9965, -9893, 9836, 4786, -13025, -7320, 6881, 739, -12258, -3299, 12231, 2409, -10240, 2270, 9949, -894, -3275, 5034, 7528, -1632, -5183, 3308, 2685, -5830, -283, 4351, -5088, -8247, 586, 4172, -4786, -6307, 6907, 6491, -8866, -4004, 11856, 6317, -6660, -1621, 9326, 2608, -10012, -2015, 9802, -820, -10149, -576, 4542, -3559, -5793, 2477, 5164, -3368, -4183, 4797, 1763, -3664, 3393, 5406, -2214, -3055, 3144, 4340, -4113]
533d113K24J0860m382j2068N418J0675m771r532M697J0653o308j0761R755R203
547I550r370n315O970K522o009k534P011J736q368J189N665m108j993N425R04
562C275n314k085O673N47q805K791J0202o106r107O447Q223m784p940N607Q803
577H427q158p869Q876N473p171l976M502L473n838k390P438J44o388K253L109
592A905l746o78M450J292m758j105O639j169p125M791O731n990o750M399N896
607D782m043q080O647O935r149m536Q227L582m972k993N014K979n377j053N631
622C594j258l009J772j03k462j81K378R60m637m76O110l269n242N419M920m284
638B32m637M056O698n282n523P567L966q199l307N726K340m738l180M417J099
$$ y = [-4113, -3889, 6971, 2589, -9479, -4061, 6614, 1843, -7689, -2992, 7661, 1353, -9408, 347, 9550, 180, -5135, 1835, 4357, -1652, -4186, 2825, 4561, -3807, -2618, 3047, -1061, -3054, 2371, 3275, -2039, -4124, 2549, 3096, -5709, -2918, 7284, 1178, -7929, -1482, 6741, 1957, -5983, -376, 8427, 269, -7600, 1276, 6749, -422, -4398, 104, 3577, -2261, -4651, 2787, 2931, -3457, -1204, 1905, -1841, -2519, 1931, 3223, -1535, -2640, 3999, 2830, -4295, 496, 7227, 1237, -5513, -1114, 4782, 739, -7341, -694, 6241, -2908, -7444, 783, 4365, -607, -3600, 1414, 4393, -984, -2037, 3594, 2336, -673, 1099, 996, -1466, -1647, 731, 1691, -2946, -3422, 2688, -581, -5823, -404, 4516, 232, -4405, -349, 6349, 1067, -4456, 3111, 7077, -1122, -4429, 1297, 3637, -1101, -4281, 136, 1235]
653A235m955N79L681r85m11R95K29n09m29L598Q5m361J723M038m336l973M376
670E80K998l752n199L944N116o159l132O744K497n215k240M612L726m431k146
685b057N548M07m769L54K123o42q86l54N2j809L6L077j557l285L813K356l588
702a181j858L697L921l647l905M643K980n725j576M624J440m414k825M045K309
717B528m898p39M039k87k513L31J501J549j251q6J235j798K24K890k552j727L229
734A675N46l275k136L227L317m543k975N264J091m849k87M371J523l658k097M295
750A489J369m144O87K804o47j962o69J171J034j797M77N33k180J598R59k159p
767a444K524N71k190k336L638L186m884j752M870O02l818j065L578K100m718j454
$$ y = [1235, -3720, -3141, 540, -445, -856, 139, 368, -141, -570, 3028, 3113, -1248, 475, 4513, 177, -3796, 580, 3578, -174, -5373, -1429, 3687, -2472, -5604, 1140, 3637, -1578, -3818, 794, 4520, 89, -2057, 3491, 3898, -871, -517, 1606, 964, 78, -276, -224, -2033, -1997, 1080, -477, -3762, 51, 2407, -1181, -3039, 658, 4579, 932, -2973, 1670, 4650, -1075, -2651, 1973, 3413, -1001, -3826, 219, 2528, -2370, -3109, 930, 643, -1870, -1539, -38, 1511, 260, 174, 1409, -389, -165, 2725, 173, -1554, 1675, 2221, -1054, -3190, 37, 3354, -1189, -4164, 1100, 2191, -2658, -2945, 1426, 2949, -709, -2806, 1489, 2858, -1286, -599, 2205, 1558, -404, -1073, 98, 1132, -665, -188, 345, -1835, -237, 722, -1437, -1444, 1080, 1651, -539, -2875, 763, 3949, -935, -2687, 2183, 2785, -1033, -2098, 1480, 3580, -1138, -2592]
783b592M178n00k915O20J757p6j034j077J562K72n59J077m28j049K000k81j670
800g15P08J151J086k953j793L858J220m746p1L043O02l069j657L992K093m366
816a617m34L751m84j334l30J573O47j799m05J590j590K45P48j393M2J295o06j167
834a268j78J993Q75l055n69M488m04l053N42K473Q65l802j084M308J08l906K43
851a424K243j37j710q43J840Q08k050N98P64p60J241K70j257R12N20m6j046q36
869i13K367L73l956Q75K750j188k167j9K807M30l884K87M200n41k515L20J963
886A189P33k049j155K600J65j452l27M2k68R88o50n19M25P0N72j525l00K931k40
905A230k836J238J950k24k086k63L183j32l698O41K534p86j694l11J794L43k304
$$ y = [-2592, 1586, 1086, -1829, -1209, 548, 472, -562, -1639, -77, 195, -364, 713, 285, -764, 1236, 955, -715, -7, 1144, 2230, -723, -2516, 1342, 2562, -2184, -2255, 788, 1390, -1679, -3336, 656, 2749, -1617, -2051, 1700, 1216, -118, -448, 1125, 1772, -27, -432, 1158, -432, -187, 561, -832, -790, 505, -101, -1268, -1446, 547, 1422, -1633, -2202, 2286, 1882, -1171, -629, 1844, 2709, -1093, -2177, 2131, 2239, -1667, -1424, 819, 682, -1028, -1871, -31, 777, -1273, -675, 89, -671, 570, 840, -417, 495, 1015, 969, -77, -913, 1454, 1827, -2129, -1254, 1496, 308, -1859, -1878, 929, 1359, -2525, -2238, 1962, 1421, -1094, -774, 1189, 1922, -127, -1282, 1318, 1483, 31, -296, -254, -522, 466, -184, -703, -278, -208, 364, -1161, -1461, 1470, 1230, -1606, -368, 1582, 1358, -728, -991, 2192, 2060, -1638, -997, 1537, 751, -943, -1254, 540, 883, -1421]
922a421j14K376m62k96k95m92Q32N52n94L62j08N77K11j992J95K617j312j798
940a162K80J200K95k093k30L390r94k566P90J978j6j261k10J734J87k225Q15J058
958I70m45j18p97r3Q80k28n58m3j11J212p25k096J742J690r91j322O11J523N66
977A667k670N50K425j269j830P48J153L06k191j88K312o64j767P99K46P43k85
994H5q02M59Q65l33J24n09L05J655j286j372R21J130r25j499K25J967r42j993
1012a925R00K086j042j049K93J452L09j859K49K086j129l20k48K23J176j079p27
1029f04P28j64J36m69o49Q74J187j654p07J146J022m10j397N74K586j505k003
1046a309J312J149m14j550l2J879m60j682N41P24l03k52n45N04J024j076R4M05
$$ y = [-1421, -1535, 841, 379, 83, -212, -704, 128, 680, 86, 448, 340, 917, 1128, -864, -669, 1948, 636, -1162, -882, 318, 613, -1480, -1710, 1680, 686, -1880, -1090, 888, 872, -389, -599, 1135, 1322, -903, -88, 970, 525, 407, -390, -483, 397, 169, -389, -432, -543, 669, -56, -2152, -410, 1280, 289, -1033, -422, 1101, 1667, -1003, -453, 1972, 703, -1127, -379, 774, 1080, -1111, -1299, 1013, 349, -1418, -619, -373, 370, 85, -717, -258, 607, 274, 398, -111, 194, 1849, 563, -809, 112, 1242, 317, -1182, -957, 1010, 68, -1925, -1025, 1061, 19, -1030, -737, 715, 1024, -835, -586, 1500, 371, 51, -197, 26, 1202, 123, -604, 124, -40, 96, -373, -1022, -148, 1039, -615, -1322, -176, 846, 436, -961, -387, 2199, 694, -1309, 3, 1152, 738, -812, -844, 1035, 575, -1107, -566, 158, -145, -397, -942, -438, 586, -490, -396, 9]
1064IL02M81p89l65J159P78j906l11Q62M48m90j898J494J580k118q31R78J278
1082F61l06j737O09K064q60j142J111L6M36p80o16R95K75q83k35nL42N25j327
1101h37l57J616j83n12p26P47J404j251j114J655J106j431n75M37J312n38j793
1118a040R06J155j195q15K32O58M17r53j93R41L7j16p8l19J070K58j388J7J447
1137A041m49n01r25J000Q41j768n81J666K08q26q02O05J235n26j169O48J025j85
1155E37o72L8P38Q19j677l5P85l47J02j184K50J234n92p77J34P41M19r34n55J320
1175C44O35j449J76J047om10q18O84J020j421n08N36N87k24r23o1R48J34r85K72
1195d22K99P68O3j320P86J065o63o69k52N15R22j417m01J189r1j040K2K47R32
$$ y = [9, 311, 792, 3, -362, 797, 1575, -331, -642, 220, 668, 178, -1720, -226, 1354, -764, -1595, -617, 661, 355, -1382, -773, 1291, 431, -711, 400, 436, 872, 92, -524, 471, 746, -137, -372, -377, -35, 490, -837, -1194, 422, 239, -273, -999, -252, 1152, -99, -1213, 442, 1548, 117, -458, -21, 1291, 753, -1040, -134, 1021, -174, -989, -757, -99, 318, -635, -828, 113, 150, 34, -44, -363, 707, 965, -423, -406, 1041, 592, 91, -834, 166, 1007, -761, -1342, 324, 532, -294, -1096, -491, 744, 218, -951, -303, 722, 537, -135, -97, 641, 1460, -217, -252, 533, 186, 288, -896, -646, 588, -4, -781, -647, 94, 513, -421, -976, 344, 979, -470, -294, 753, 747, 337, -481, 203, 1223, -198, -706, -170, 417, 193, -730, -791, 157, 291, -694, -422, -123, 645, 708, -612, 174, 1239, 576, -93, -345, 170, 1092, -325, -726, 463, 372, -668, -646, -399, 533]
1214E33o97r78J290M73q48k03O04M35K08j154N06P56m48m52j48JR30p79j130Q90
1234b11N02k27o86k79J102L60j136l0J135n9o95k64P60P87q96j034J374M7p73
1253b23k76K36O47j31j059N21P12l78m74m8L12O24o17l43J072M8k24o81Q4Q48
1273F50J41j287L20M27j19l91r00J398M19j283M7Q82J9j42q56M59R78l67n75N03
1293C23M7j42j35q77J043J74q74J7L74K06J02j142L97J184o30n52L53L36N42q80
1313a34l67J352pj039J81j88O87l93r86P17O53p60k05oN78lm00J50M45j12k00
1334c7j8l8P09J45j270L69O72m13n81k03J183j69j416K60R14J91p15j51M28R61
1354H21p67p11J005K99k01l25q7L00P0n69J49L4j02j97K0k77Q61o16l23R31J10
$$ y = [533, -164, -1142, 148, 621, -227, -430, 174, 609, 817, -337, 169, 925, 477, 25, -123, -122, 808, 29, -1101, -211, 291, 64, -622, -901, 201, 561, -575, -605, 530, 471, -224, -488, 272, 1059, 163, -871, 503, 550, -223, -499, -263, 384, 253, -806, -285, 427, 49, -425, -473, -161, 463, -154, -497, 575, 623, 399, -282, -198, 650, 791, -496, -176, 251, 132, -259, -1159, 239, 658, -625, -578, 304, 323, 181, -675, -216, 762, 395, -180, 323, 370, 228, 93, -784, 259, 433, -441, -424, -50, 156, 258, -884, -487, 697, 67, -485, -132, 204, 746, -134, -501, 851, 844, -195, -14, -202, 485, 92, -894, -177, 476, -284, -489, -495, 83, 80, -320, -170, 275, 163, -37, -55, -93, 616, 761, -509, -140, 532, 119, -462, -665, 518, 349, -1067, -807, 107, 298, -417, -568, -140, 821, 54, -657, 348, 647, 446, 121, 34, 334, 404, -165, -16, 18, -84, -281, -261, -538, 323, -293, -616, 315, 425]
1375D25l94m1k08R77k05j184L45P10q3p41j16N68N00p66m87P54j00j06l05J25
1395c32M71J2p74O21M01j53P2n71L28O54p45l11K37N79k61n52j53N33q9n50M53
1416a30L22K37o12m78J090K21r87K69K00J28M09j128L05O65m42m66PJ92N24n05
1436a79q08Q44L96k91k87m2R57l84m06P9Q82n68m82M18L07M1r57J54P18j09n10
1457b27k48K14N78l47q08N26O00k93j93n5M17O54r05k64O68Q0L9o36J92O46l43
1478B95r82N63L97k74k77j04M47K54q08L97K92K3j85k99J78Q55n33l32R3L29r7
1499B32j71m23M86L37p59l83M26N54k13n80L22P55o96k61J91O82j51n61O0P86
1519F33k98o02K57k22j01M80o62M12L03m74J11K65J72L7m89k47O37J04k67n5J5
$$ y = [425, 31, -10, -218, 759, 554, -630, -285, 425, 342, -399, -515, 53, 553, -213, -700, 54, -46, -152, -457, -332, 139, 151, -623, -2, 399, 246, 318, -253, 75, 729, -16, -327, -90, 489, 228, -324, -477, 56, -33, -583, -130, 192, 429, -183, -661, 429, 650, -337, -68, 132, 260, 669, -459, -154, 511, 69, -397, -390, -198, 326, -179, -987, -143, 253, -38, -325, -367, 590, 206, -200, -121, 761, 193, -289, 129, 436, 477, -480, -326, 392, 283, -227, -475, -261, 317, -30, -838, -312, 288, -5, -198, -253, 164, 818, -87, -351, 317, 397, 436, -200, -8, 638, 295, -687, -124, 273, -1, -278, -382, 65, 319, -489, -92, 200, 223, 38, -261, -83, 772, 239, -93, 0, 329, 232, 61, -362, 124, 461, -298, -681, -255, 299, 86, -494, -172, 583, -113, -374, -183, 499, 348, -213, -153, 633, 335, -267, -10, -232, -333, 147, -515, -103, 200, -274, -163, 102, 274, 311, -178, -425, 212, 316, 49, -6, 9]
1540IM64o31k19L39K38l74m54M32M02k83k78jQ16k20o97M21J39M57o08j09K64
1561A07K48l51j20J52K71R7r31K21P37m65j06k55L32M30l85l48M34N43o68k20
1581b77J31O89l62n92L63M97r1n60J12L04J35o31k45M96J11k40k40J50O68J6m41
1602gj40M63j19J47m44L51J55n89j41K67K23j78j10q4N51m79n52N88L19J39o17
1623b57J57L47J07m57R1J54j71L25m49j44O89m93l10M00J73k31k36J45K18J72
1643B30n29Q4J69K05J82p87N53L30k16k97K15M8J15m14k87N55ok44l9r4O13m04
1665a8n91M70L63k77j90M12J19j70n59L1L62M1j62K77j74L08m85l06N71J51n34
1686c61K14N9K61J22l76j11M47K61l39k16n3N68n94k64J81O01l83j44%J35L1m52
$$ y = [9, 473, -158, -377, -38, 200, -174, -628, -196, 206, -77, -355, -356, 460, 240, -457, -36, 103, 560, -48, -157, 107, 355, 4, -116, 36, 307, 404, -527, -306, 431, -34, -140, -395, -63, 367, -18, -366, 68, 611, -57, -277, -146, 543, 181, -411, -48, 449, 358, -202, -90, 214, 349, -282, -527, -31, 80, -160, -400, -250, 418, 434, -7, -147, 316, 197, 344, -100, 251, 406, -183, -324, -57, 166, -12, -122, -206, 345, -134, -686, -98, 221, 360, -257, -100, 247, 354, -103, -12, 142, -29, 296, -153, -297, 392, -101, -411, -11, 162, -69, -305, -160, 58, 230, -299, -215, -46, 159, 341, -446, 107, 437, 221, -76, 139, 187, 302, -112, -399, 156, 150, -94, -133, -227, 386, -18, -609, -139, 224, -53, -243, 169, 288, 118, -441, -410, -48, -7, -169, 108, -66, 242, -243, -549, 22, 173, -361, -147, -88, 173, 295, -81, -192, 255, 516, 177, -39, -92, 476, -118, -382, -201, 400, 17, -127, -127, 8, 39, -413]
1708d13m4M35L16l99k03N06K10k42o08N35J81l12j27k33Q32J3n71j06J41K55k97
1729a31k59N09K94p68J94N05j3k97r7k6M31M5n33K0L33r0n7l91L73K05l73n04
1751f30N19P8q9K1k14P49p03M56k29L11J33j12o77O45L61o84j73K31J5j45l43
1772d80J78N83j54n77K04J85L93n54MO93k26j96k88J02N26j29k10j5L24k05m11
1793b53K22K2n7j45K4M09l48J71J82k82L56k63l38M30M30k73o65P3M01J45l97
1814a56j13L57N4m71k17M68M17k92m5J08j71Q8j87k0Q42n24l40K20R6J30l87K5
1836a18n4M62l02l77P3L71kk52k3N40l20j46K7K27l4%n17N19M6M1k86n2K62J14
1860A99n39K15J96l87J03L8M1K16J1k81M58R2j67l11K93J8j22j6k74M09j28m4
$$ y = [-413, -457, -22, 294, -105, -308, 198, 408, 166, -442, 93, 274, -38, -165, -398, 434, 447, -124, -230, -89, 166, -131, -390, 119, 413, -355, -161, 344, 331, 34, -63, -89, 342, 387, -146, -126, 207, 117, 60, -331, 42, 247, -126, -630, -111, -33, -122, -101, -315, 434, -269, 187, -42, 269, 402, 290, -387, 258, 619, -65, -238, -7, 8, -137, -480, -302, 281, 127, -450, -246, -61, 332, -222, -218, 475, 249, 53, -235, -133, 393, 264, 54, 39, 363, 158, -253, -31, -9, -66, -211, -187, 222, -126, 45, 227, -55, 301, 38, -300, 130, 560, 287, -378, -305, 96, 241, -156, -269, 88, 142, -329, -546, -78, 339, 47, 2, 110, -61, 27, -160, -180, 662, 138, -202, 18, 114, 244, -143, -118, -172, 290, -12, -389, -316, 55, 53, -199, -222, 318, -2, -148, -121, 106, 72, 72, -445, 74, 120, 161, -125, -177, 85, 199, -340, -125, 71, -316, -213, -175, -134, 82, 93, -188, 270, 362, 195, -116, 177, 195, 73, 57, -217, 192, 64, 20]
1882B0N5j71L92m33j36N57J4m64R9J16M97m69n7k49O67m03K27n31K48J48l92j37
1904d02N21k7k75j48J58M21k80n4M1Q5p5K37m43K15L81m47N6K20p0O3j5k14J48
1927I6j01l23R3M61k80p0j55L93L64m63K16j51K18m99n0K90M35l78K0k66K52k12
1949a10j04J84q0L01k99k51N38l99J11qJ24o4j41p9K84j02M9m7R7J67k44J72k03
1972a04J13k28K00n41M73J87j13k5m4k12M18o1o3M07k01m61J58o4M1M8M7J20L5
1995A30l47j58N62j29j25j33P6M01n25K08k25M75j24J6m69N12j37Kj8L0R4J12
2017B28k59k52M99m58J99j30K48M5k61l4J45P6j13J56j20r3L64m11K04J25j57
2038AR0l46L25j02j8j61K74k16K15j57j85O10l44j96M27r1j05n7O0J10k08l3j98
$$ y = [20, 75, -96, 296, -137, -273, 284, 298, -166, -67, 49, 546, 77, 20, -229, 438, 35, 262, -269, -21, 127, -265, -402, 119, 92, -183, -331, -173, 248, -32, -86, -45, 40, -35, 202, -241, -26, 355, -92, -36, 184, 114, 177, 162, -52, 96, -5, -328, -235, 226, -54, -124, -279, 114, 478, 15, 231, 80, 298, -201, -251, 39, 474, 96, 116, -150, 102, -110, -214, -30, -110, 191, -108, -359, 179, -220, -109, -117, 7, -57, -198, -277, 7, -95, -46, -93, 4, 171, -73, 99, -104, 9, -219, -19, -560, -87, 100, -13, -38, -82, -294, 124, 63, 0, 407, 206, -255, -97, -161, -120, -72, -25, 95, 130, -217, -375, 187, 58, -67, -200, -124, 277, -248, -40, -265, 210, 86, 102, -367, 145, 8, 10, -8, 22, 116, 228, -31, -283, 216, -242, -43, -173, 75, 120, -141, -175, -30, 46, -67, 89, -31, -124, 240, -171, 33, 158, 1, 91, -255, 70, -32, -50, -211, 63, -153, 62, -95, -280, 330, -14, -210, 217, 126, 21, -36, 24, 134, -74, -107, -305]
2061c05L70q3R0k22J53J04j11k40M07J76n5l04K4o3J86J19n04M09kp3Q7l86J79
2084d4J31l95K95j11J65j39L1K09nl08J73K26k96K43j21l2J66k07j36L59j40J41
2106B05j17l46N41k70k2Q2n1K00j80k85M76m7Pk27L44k32N5l25k10O27j44l40
2128b59J0N6K10Nm60M16k7K57m15L0K77M2j62J13J35j59m31L85j2J82m42q9L32
2151fR6k60k4nL84m85K4K31j69K35O7L5j76J62J62m69L69r2q9j87KK71n8j35k07
2176c24M25k95J27R4Q3L48l56n3k36K81K18n91K45J39n7RR5k72L3n6j08J55K45
2199A49k82m3J28K15Rn09K35M93k22j86J64Q3k13j25L0n6l2k79K22J15P1J17l93
2222c09J97K02m95L89R4k61K21J8j40K52n8mr7o4K18o6l22L18P6k83K4K36l41
$$ y = [-305, 65, -18, 72, -150, 3, 107, -4, -244, 163, 339, 284, -20, 4, -59, 127, 246, -258, 151, 149, 76, 163, -223, -44, 87, -308, -13, -124, 41, -98, -67, 142, 137, -171, 2, 228, -68, 175, 54, 22, 188, -19, -155, 204, 64, 205, 88, -258, 283, 13, -9, 73, 22, 222, 42, -243, 233, 186, 193, -34, 310, 78, 133, -192, -402, 225, 81, -259, -249, -193, 17, 22, -438, -22, -49, 208, -207, -177, 100, 142, -20, 93, 228, 69, -362, 23, 11, 193, -249, -338, -6, 90, -170, -194, -199, 185, -300, -276, -45, -214, 21, 88, 123, -53, 109, 271, -198, 171, 79, -10, -197, -195, 76, 18, -117, -324, 101, -194, -67, 27, 110, 458, 102, 49, -187, 94, 312, -279, -34, 105, 48, 57, 152, -120, -87, -143, -251, -96, 149, -133, -176, -48, 167, 176, -333, -98, 395, 173, -13, 151, 234, 21, -104, -74, -130, -162, -441, -219, -104, -33, 84, -309, -112, 90, -405, -16, 78, -183, 38, 56, -84, 168, 110, 106, 9, -55, 163, 97, -225, 93, 169, -114, -90, 146, -195]
2245a95J16j73J31N22n07J46j30P0J89j93J2J48k49J36j77Q6K80j68m5j46J82
2266C5l53L41J49k27K93j72J47k52L70m30M28k51j54K19l22M40L2l98L9j42L47
2287A39k47j57J51r6o3K02r8k4M71j42j31QR1n1L27l33K0K53m98J65J91m00K49
2310B7M3q4p2J04j56QL38o9l46L12L72k05l33n1N7R3j53%J57J03k6l40J20j2L13
2335B00j16k81J55n0n3L78j56j92K15m1j04Q0pJ13k55J01R4m7k91P1J56O6j29
2358i3o4K25K80o97J16K22k32L01O3Q9j42n6j1R5J15j97j72j26M70k24j33J12
2380e9J99k20J52p2Q0j18P5j73J86J95k08k02K35O1k93O5N2K91m03L37L7K6o8
2403A75m84K49Q6K75l06J03m48N07j61k12L15K1J7K2l57J18K76l61O3j26L13r8
$$ y = [-195, -79, -252, -121, 401, -106, 40, -90, -20, 169, -24, -12, 136, -113, 23, -154, -68, 212, 44, -1, -147, 35, -318, 23, 172, -55, 238, 66, 213, -39, 331, -99, 329, 78, -76, 143, -179, 261, 293, -105, -66, -208, 139, -108, -265, -114, -210, -273, -71, -169, -193, 278, 136, 5, 13, 104, 53, 380, 47, 67, 320, -178, -13, 178, -222, 27, 70, -14, -86, 18, -138, -130, 208, 139, -207, 105, 477, 272, -61, -112, -55, 38, -115, -115, 42, 145, 119, -221, -101, -113, 200, 84, -197, -42, -92, -145, 233, 77, -115, 100, 59, -45, 35, 28, 141, -114, -13, 81, 34, -257, -186, -30, 36, -93, -157, 68, 348, -349, -233, -11, -243, 58, 121, 210, 68, 12, 1, 96, 211, 14, -158, -284, 186, -38, -171, -59, 140, -80, 72, 0, 80, -38, 37, -136, 50, 245, 37, -165, 70, 131, -162, -97, -45, 246, -157, 180, 217, 243, 175, -309, -60, 26, 301, -5, 98, -350, 157, -4, -216, 99, 120, 137, 159, -198, -80, 196, -165, -102, -228, 85, -13]
2425a3K60l65K03j35J02K3k1K39n42J02K73l8j27l1J89lj82J97j30N1%j35K75
2448A92l71R7R2k07L70j78l8J44k0J0j90nj33K26l4O3k2j71L45l25L91l60j58
2471b82L90k51P2p3K09l28M77j07j53j29J31K50j75l71M72j74LM0j06L08k42j84
2493b23K60O2n10K23J94K15l10J8M0J84k51NQ6k03J50O2m2N7O1k48r3J79jJ95
2517A10r4K34j71J91p1l45O9jK8Q2j9j2K27k56j08J17K30j42j10q8M1k62J65R3
2541i2K46k98m9J55J40J40k49j06J46k0j27K00pj69J3j38J47J93p0k35J6j7J43
2564c8K38m17J53J43j54J42K68m03r8J62q7J04j47J52j73J33J66j24r1J82r6j23
2586a08K12j00J1j65K57M8J12m39K16m25L10L4j4M0l9J81m25L04L0M0k45J44P9
$$ y = [-13, 247, -118, 85, -50, 52, 75, 54, 293, -249, -147, 126, 88, -39, -70, 119, 116, -66, 131, 1, 52, 52, -83, 192, -179, -82, 10, -197, 173, -5, -43, 101, 81, 91, -99, -104, -237, -11, -45, 18, -4, -175, 170, -155, 236, -124, -282, 108, -143, -71, -144, 65, -263, 214, 107, -46, -175, -44, 206, 31, -340, 132, -42, -39, 1, -105, 203, -39, -223, 37, 99, -411, -188, 6, 221, -89, -71, -31, 153, -98, -93, -7, -210, -60, 2, -40, 17, 78, -170, -263, -84, -85, 110, 16, 250, 79, 270, 199, -146, -77, -78, -50, 32, 13, 1, 228, -28, -136, -19, 211, 69, -41, -129, -88, -350, -185, -92, 154, -144, -193, -38, 102, 242, -7, -113, 33, 13, -114, 86, 79, -90, -77, -215, -68, 125, 55, -180, -164, -181, -38, 200, -217, -64, 79, -75, 67, 335, -68, -166, -4, -91, 13, -134, 18, -155, -22, 144, 20, -71, 111, 15, -108, 104, 4, 15, -150, 107, 155, 267, -172, 44, -381, -71, -37, -51, -11, -50, 131, -294, 10, 40, 80, -165, -21, 58]
2609E8j61J33J32j03nK53n07J30M08l01j66M7L3J33J54l23n3OK11P4k61J54Nj5
2633C6J96k63J96o6k19L09k35K41k72n5J19K92n88K34P8K09k95q5M4rK94k10J63
2656A14l1j43j07K46K9kk93K73M3n3j97J29L35j31j48j76J82j20j16K86p2O1k71
2679a62R6L29J40k92j0L3J00q2j58N6j03K50j14j80J2J40q0o3K20m56K36J20j1
2702B1J95j63o6J1J55K6k99Q7p6K66l94P3M03k59J08k06l6R3J38R1j19M7MP2J89
2727C61m75J01K12k23J51l15L12n89L38K28Nj94j6M8J50q2k7J15K5O0m1j67K78
2750B55j23K9l39L85k14P3M0j85K34l12P8LJ73k10R3L27k07j03l39K45r3K69j50
2773g1J70l53K85k03j12K76N2J01k68J51N2Lj43k41L85kk43J60L9J19j68p2J1
$$ y = [58, -103, 30, 162, 59, 54, 307, -200, -70, 338, 37, -129, -82, -49, 84, 238, -85, -138, -132, 79, 153, -108, 46, 51, 36, 232, -31, 165, 99, -120, 189, -46, 195, -77, -132, -13, 279, -309, -75, 3, 212, -83, -168, -124, -133, 161, -49, 114, 83, -60, -167, 79, 108, 106, -187, 86, 129, 76, -121, 8, 343, 212, 64, -112, 70, -50, -166, 120, 48, 109, -162, -66, 263, 403, 111, 101, 134, 234, 152, -6, 50, -53, 197, 83, -97, -85, 55, -25, -88, 132, -324, -88, 32, 21, 216, 53, -13, -2, 153, 179, -120, -33, -109, 157, -237, -164, 239, -20, 88, -118, -154, -61, 77, 168, 49, 96, 100, 172, 361, -114, -13, 199, -24, 127, -188, 124, -465, -127, 101, 106, -88, -104, -56, 94, 12, -15, 100, 125, 185, 144, -23, 255, 132, 161, -178, 207, -7, 66, 106, -79, 155, -157, -79, -76, 97, -113, -20, 307, 100, -3, -342, -97, -190, 79, -71, 99, -254, 31, -172, -284, -8, 44, 145, -123, 28, 80, 83, -60, -301, 84, 82, -161, -1, 38, 157, -11, -83, -72]
2796g2J48j42J80l40L93J49l91L23l2l28L96k09L8k46J04j2j53L48l22M02j31
2817A03k21J5K27J25j31j90L34k06o2J96k20m3m4J86k91M28m40K10K09k38K23
2838A70j05j48J98r4N5j1J63j21m4M00n47Q7Mk89J9K19k8Q4j04O1mJ23K10k58
2862D0k4mj9J58n5R2j13j91n3J61j03K43l35K08j28OJ26l33M03o1k1QR3J64k69
2887go8K73k18J75n7n2j80J58N6rk9k55L2PJ22L65p08L27J52n0J27Ok54k8q3o1
2913b59L26K3k89M68j44j71K12j74m3J20k08K61l81K01q2R3M8r4K24L7m4j80J10
2936E4q0J7j66J51j30K83M0k53J22o3O8L9k82K26L01o45K84J66k12Q6O1p8J34
2959A23j13l55J66K54r2j33K15j32J88k73N9J28n5J68J85o53K59L24l15K9K9N3
$$ y = [-72, 76, -66, 114, -226, 167, 316, -75, 248, 216, -112, 284, 75, 113, -133, -29, -41, -194, 154, -168, 234, 103, -118, -103, 124, 249, 118, -72, 262, 56, -6, 190, -30, -73, -117, 69, -222, 206, -234, -24, 185, -53, 170, 65, -83, 115, 21, 76, 65, 228, 107, 63, 463, -84, 3, 7, -282, -263, -44, -72, 12, -92, -31, -35, 88, 298, 40, 16, 12, -7, 151, 96, 188, 75, -116, -169, -8, -111, 132, -203, 5, -123, -117, 9, -324, 79, 18, -3, 5, 98, 262, -7, -75, 198, -20, 155, 98, 46, -134, 24, 80, 71, 42, -213, -181, -174, -52, 313, -395, -68, 84, 34, 161, 167, -87, -115, -198, -259, 67, 90, -199, 269, 125, -46, 166, -8, -51, 69, -139, 122, -259, -58, -140, -47, 1, -93, 131, 168, 124, -56, 54, -26, -9, -175, -24, -154, 129, 169, -84, 38, -25, 43, 82, -200, 26, 327, -318, -34, 132, -80, 6, 67, -11, 123, 10, -345, -179, 75, -17, -150, 65, -67, 121, -152, -93, 35, -20, 148, 333, -320, -61, 263, -52, -23, 6, 59]
2981E9m3o5k0j86L25j27j98J31n2K4n5P8L62k58q4L09J46o95L73Q5j30Q4M4l12
3005b05K79k91K74k95O65l04r8o5k7M1j3M21j07l71K16k41k7k38L07j88R6N7p5
3028a89J71p1K10k75J35n8o0K11j64K52n85K19M9j07N76n06L73ol29K37q7J42
3050A38l2q0j41j00K26p5J52n2L2j26K01J0k92j05L65k68M6m7O8K80j80r1j61
3073b32K28k71J90k4l1K4K03p4k78J66Q7p0j14M51j40j43q6O1J76l0r6l72M00
3096B5K74l67L87k83j96K74P2k07j8J90l2k14m8L71l06J71j37K31k08j31JJ72
3118B1J26Jj16k98J36K62l04J18O3k51L90k34o4j09M10j73P7Q2k13K2J00J5p9
3141a8P3j16P7m2k8J01K9m9r2R6J3K4k52K56J47L6j01j80o6O1M05m27LQ4J41M9
$$ y = [59, 16, -49, -69, -255, 70, -57, -255, -124, -176, -152, -207, -129, 233, -25, -109, 200, 346, -349, 24, 109, -21, 63, 107, -205, 74, -217, 57, -238, 427, 123, 25, -40, -67, -26, -39, 382, 275, -96, 120, -121, -148, -386, -79, -267, -171, -114, -189, -18, -89, 121, -154, -19, -77, -137, 74, -90, 162, -423, -204, -155, -262, 314, -192, 181, 175, -154, 83, -4, 138, 106, 26, -115, -215, 11, -64, 88, 36, 68, -58, 143, 153, -139, -244, 121, -147, -101, -148, -80, 200, 20, -71, -232, -4, -275, -85, -109, -140, -116, 87, 13, -265, -99, -12, -82, -196, 255, 115, -28, -114, -53, 123, 93, -3, -375, 25, 299, -68, 319, 36, -160, 114, 186, -21, -39, 151, 119, -95, -143, 228, -78, 93, -44, 187, -21, -152, -151, 21, 147, 148, 32, -266, -130, 132, -172, -54, 9, -242, 148, -86, -150, -259, 151, -22, 55, 137, -76, -54, 46, 61, -18, 55, -61, 16, -26, -54, 47, 76, 27, -65, 31, 44, 68, -184, 72, 219, 255, 154, -26, -92, -31, 374, -53, -50, 34, 175, 224]
3167B24k13o0P2q0K30j43l9J08K2k53N50q07K11K60j50Q3r9K35O1k27j47M25m85
3190b22J88K1K17k45R4k01n0%J32j4K43k90J79n0L7jR2Q7k75Q7K3k76J41N3Q5
3215E5k72J88J10o1P6P1j72Rp9P4P6n0l13J63K94k49J66j45k6Kj55K56j46J49
3239B1j51KL26j33l7M3j01J78j15l37M66j23qJ6j77K47P1j21k21J19K80l42J8
3262g9L48k66j17K35j9k31m9K21j51J19k21kK50q6r1k3J62j73J82nn4n7k48M13
3286E8J35l9m3J4j6l49J24M61k90m9J16k57O5L2J73r5k26K39j32j94K05M7k6K31
3310A84o2k41J16J13n3j7J2m9J1R5P4k77Q7L5j78K54k46K68k57K11k06J35j27
3333a18j2K34j13j15j78O08k85R1l29K74L7l08J22J87l8j00J43j55J57J30k7l6
$$ y = [224, 11, -49, 23, -57, 173, 30, -9, 99, 121, -132, 418, -389, -178, 82, -68, 15, -84, 151, 212, -15, -162, 263, -222, -34, -13, 204, -41, 53, -148, -198, -198, -66, -80, 163, -127, 52, 2, 39, 38, 130, 217, -58, 29, 52, -224, -83, -30, 55, -217, -29, 81, 20, 96, 167, -5, 4, -75, -1, 75, 25, -288, -125, 169, -80, 86, -59, -85, -83, -238, 18, -128, 21, -130, -128, 198, 65, 28, 71, -30, 148, 33, -304, 162, 39, 31, 47, -130, 117, 188, 67, -154, -35, 245, -97, -79, 269, 3, -114, 121, 102, -129, -178, 43, -108, 11, -210, -212, 38, -48, -139, -162, 0, -173, 9, 4, -50, -107, -355, 58, 193, 154, 111, 125, 109, -240, -116, 345, 55, 6, 122, -135, -70, -38, 135, 40, -186, 53, -79, -273, -68, -21, -47, 184, 122, -119, -3, 110, 57, 40, 52, 3, 14, 109, 183, -94, -7, 28, -150, 104, -142, 126, -131, 80, -126, 9, -118, -130, 104, -9, -124, -302, 306, 21, 112, -217, 57, 94, -214, -92, 95, 57, -43, 100, -55, 102, 232, 205, 169]
3355A69j90m2N7n4K15j15k45L06l9j74J85O2k83j15K35j57M87o0n71L41J74j46
3377D0L8l3q2L6j58M28n29M17l76L2K08R0q6qk67J43J43R9p9Q7pj28k35J60K20
3402A53j8j7k90l1K51r5J95k71L13l59K0lj7J5L14o4MJ60j36oJ3k67J29P9J67
3427B39k13m9K40k92j66r0L11j60l1Q0J73n4k21K55O7j10j9L80l11K2J1p0J35
3450A27l86R7J98L5k5l7J19k74J21J30Pj86L6j01QN1K18k09K20j76j37R0o9K40
3474I7k7J46k46J07m5j86L88l87J16K72l89J45l33M07O1j51q6p5N9n1J32J33J73
3497B60k21l21L86j64mn2J3L36k39J68k58k17L04p3K10j11l30N40J32k84j79J22
3519A8N3k42J72Q2J86j81%r0Nj91M96k42l69Q1M7M48k01j47K12N1m04O8k0L36
$$ y = [169, -21, -63, -6, -60, 155, 40, -205, 101, 62, -112, 73, 135, -148, -263, -28, -185, 302, 242, -329, 12, 186, 40, 78, 45, -37, -1, -159, 269, -260, 157, -219, -187, 21, 111, 25, 17, -250, -107, 36, 135, 56, 143, 136, 8, -227, -67, 153, 135, 118, -172, -203, 48, -47, 148, -123, 190, -169, -149, -152, -169, -154, 160, 96, 100, 260, 124, 118, 131, -136, -7, 72, 239, 26, -23, 217, -75, -241, -331, -20, -180, -211, -131, 42, -12, -233, 22, 89, -21, -40, 340, 29, 51, 62, -8, 127, -259, -162, 36, 71, 46, 9, 128, -146, -25, 105, 112, -74, -38, -139, -131, -80, 138, -71, 149, -27, -164, -74, -143, 97, 70, 216, -30, 77, 32, -154, 234, -153, -37, 235, -154, -9, -342, 65, 126, -25, -111, -186, -127, -178, -46, 87, 260, 39, -282, 104, -60, -64, -116, -103, 233, -6, 162, -96, -313, -9, -82, 128, 17, -313, 227, 359, 75, -104, 18, 71, -171, 1, 83, 269, 88, 88, -2, 3, -188, 308, 66, -303, -222, -175, 273, 72, -75, 137, 188, -216, -148, -168, 168]
3543A68k41N8j30O2n8J97R8m16K61j3j95Q4K92j73J25J65n56L23m9O3j32Q5n7
$$ y = [168, -73, -15, -145, -83, -141, 56, 154, -262, -1, -14, -209, -125, 167, -6, 119, 284, -272, 51, 2, 65, -67, 18, -39]
$$ [...]
8191a14
##END NTUPLES=NMR FID
##END=
