##TITLE=1H_DE-87_ch_4
 200.13MHz,CDCl3,
 8 sc
 
 22.4.2025
##JCAMPDX= 6.0         $$ Bruker NMR JCAMP-DX V2.0
##DATA TYPE= NMR FID
##DATA CLASS= NTUPLES
##ORIGIN= UXNMR, Bruker Analytische Messtechnik GmbH
##OWNER= pz
$$ XWIN-NMR		Version 3.5
$$ Tue Apr 22 16:25:40 2025 Russian Standard Time (UT+4h)  she@DPX200
##.OBSERVE FREQUENCY= 200.1313
##.OBSERVE NUCLEUS= ^1H
##.DELAY= (6, 6)
##.ACQUISITION MODE= SIMULTANEOUS
##.ACQUISITION SCHEME= undefined
##.AVERAGES= 8
##.DIGITISER RES= 18
##SPECTROMETER/DATA SYSTEM= spect
##.PULSE SEQUENCE= zg30
##.SOLVENT NAME= CDCl3
##.SHIFT REFERENCE= (INTERNAL, CDCl3, 0, 14.3821)
##AUDIT TRAIL= $$ (NUMBER, WHEN, WHO, WHERE, WHAT)
$$ ##TITLE= Audit trail, XWIN-NMR		Version 3.5
$$ ##JCAMPDX= 5.01
$$ ##ORIGIN= Bruker BioSpin GmbH
$$ ##OWNER= she
$$ F:/spectra/data/she/nmr/H-C/1/audita.txt
$$ ##AUDIT TRAIL=  $$ (NUMBER, WHEN, WHO, WHERE, WHAT)
(   1,<2025-04-22 16:24:19.53 +0400>,<she>,<DPX200>,
      <created by zg, POWCHK disabled, PULCHK disabled
       configuration hash MD5:
       00 E9 B6 7A A2 85 ED C7 34 08 36 98 17 FE 4E 26
       data hash MD5: 16K
       0C B3 3B B7 4B 5B 76 20 15 91 84 37 CC D2 31 52>)
$$ ##END=
$$ 
$$ hash MD5
$$ 10 61 A1 BF F5 C4 6F 3F 0D 10 54 17 F9 8C 04 90
##$RELAX= 
##$RELAX= 
##$RELAX= 
##$RELAX= 
##$RELAX= 
##$RELAX= 
$$ Bruker specific parameters
$$ --------------------------
##$DU= <F:/spectra>
##$EXPNO= 1
##$NAME= <H-C>
##$PROCNO= 1
##$TYPE= <nmr>
##$USER= <she>
##$AMP= (0..31)
100 100 100 100 100 100 100 100 100 100 100 100 100 100 100 100 100 100 
100 100 100 100 100 100 100 100 100 100 100 100 100 100 
##$AQSEQ= 0
##$AQ_mod= 1
##$AUNM= <au_zg>
##$AUTOPOS= <>
##$BF1= 200.13
##$BF2= 200.13
##$BF3= 200.13
##$BF4= 200.13
##$BF5= 200.13
##$BF6= 200.13
##$BF7= 200.13
##$BF8= 200.13
##$BYTORDA= 1
##$CFDGTYP= 0
##$CFRGTYP= 5
##$CHEMSTR= <none>
##$CNST= (0..31)
1 1 145 1 1 1 1 1 1 1 1 1 1 1 1 1 1 1 1 1 1 1 1 1 1 1 1 1 1 1 1 1 
##$CPDPRG= <>
##$CPDPRG1= <>
##$CPDPRG2= <>
##$CPDPRG3= <>
##$CPDPRG4= <mlev>
##$CPDPRG5= <mlev>
##$CPDPRG6= <mlev>
##$CPDPRG7= <mlev>
##$CPDPRG8= <mlev>
##$CPDPRGB= <>
##$CPDPRGT= <>
##$D= (0..31)
0 0.7 0 0 0 0 0 0 0 0 0 0.03 0 0 0 0 0 0 0 0 0 0 0 0 0 0 0 0 0 0 0 0 
##$DATE= 1745324658
##$DBL= (0..7)
120 120 120 120 120 120 120 120 
##$DBP= (0..7)
150 150 150 150 150 150 150 150 
##$DBP07= 0
##$DBPNAM0= <>
##$DBPNAM1= <>
##$DBPNAM2= <>
##$DBPNAM3= <>
##$DBPNAM4= <>
##$DBPNAM5= <>
##$DBPNAM6= <>
##$DBPNAM7= <>
##$DBPOAL= (0..7)
0.5 0.5 0.5 0.5 0.5 0.5 0.5 0.5 
##$DBPOFFS= (0..7)
0 0 0 0 0 0 0 0 
##$DE= 6
##$DECBNUC= <off>
##$DECIM= 32
##$DECNUC= <off>
##$DECSTAT= 4
##$DIGMOD= 1
##$DIGTYP= 9
##$DL= (0..7)
0 120 120 120 120 120 120 120 
##$DP= (0..7)
150 150 150 150 150 150 150 150 
##$DP07= 0
##$DPNAME0= <>
##$DPNAME1= <>
##$DPNAME2= <>
##$DPNAME3= <>
##$DPNAME4= <>
##$DPNAME5= <>
##$DPNAME6= <>
##$DPNAME7= <>
##$DPOAL= (0..7)
0.5 0.5 0.5 0.5 0.5 0.5 0.5 0.5 
##$DPOFFS= (0..7)
0 0 0 0 0 0 0 0 
##$DQDMODE= 0
##$DR= 18
##$DS= 0
##$DSLIST= <SSSSSSSSSSSSSSS>
$$ [...]
##$SUBNAM0= <"">
##$SUBNAM1= <"">
##$SUBNAM2= <"">
##$SUBNAM3= <"">
##$SUBNAM4= <"">
##$SUBNAM5= <"">
##$SUBNAM6= <"">
##$SUBNAM7= <"">
##$SUBNAM8= <"">
##$SUBNAM9= <"">
##$SW= 18.0517328524113
##$SWIBOX= (0..15)
0 0 2 0 0 0 0 0 0 0 0 0 0 0 0 0 
##$SW_h= 3612.71676300578
##$TD= 16384
##$TD0= 1
##$TE= 0
##$TE2= 300
##$TE3= 300
##$TEG= 300
##$TL= (0..7)
0 120 120 120 120 120 120 120 
##$TP= (0..7)
150 150 150 150 150 150 150 150 
##$TP07= 0
##$TPNAME0= <>
##$TPNAME1= <>
##$TPNAME2= <>
##$TPNAME3= <>
##$TPNAME4= <>
##$TPNAME5= <>
##$TPNAME6= <>
##$TPNAME7= <>
##$TPOAL= (0..7)
0.5 0.5 0.5 0.5 0.5 0.5 0.5 0.5 
##$TPOFFS= (0..7)
0 0 0 0 0 0 0 0 
##$TUNHIN= 0
##$TUNHOUT= 0
##$TUNXOUT= 0
##$USERA1= <user>
##$USERA2= <user>
##$USERA3= <user>
##$USERA4= <user>
##$USERA5= <user>
##$V9= 5
##$VALIST= <valist>
##$VCLIST= <CCCCCCCCCCCCCCC>
##$VD= 0
##$VDLIST= <DDDDDDDDDDDDDDD>
##$VPLIST= <PPPPPPPPPPPPPPP>
##$VTLIST= <TTTTTTTTTTTTTTT>
##$WBST= 1024
##$WBSW= 4
##$XGAIN= (0..3)
0 0 0 0 
##$XL= 0
##$YL= 0
##$YMAX_a= 61421
##$YMIN_a= -85871
##$ZGOPTNS= <>
##$ZL1= 120
##$ZL2= 120
##$ZL3= 120
##$ZL4= 120
##$ABSF1= 10
##$ABSF2= 0
##$ABSG= 5
##$ABSL= 3
##$ALPHA= 0
##$AQORDER= 0
##$ASSFAC= 0
##$ASSFACI= 0
##$ASSFACX= 0
##$ASSWID= 0
##$AUNMP= <proc_1d>
##$AZFE= 0.1
##$AZFW= 0.1
##$BCFW= 1
##$BC_mod= 2
##$BYTORDP= 1
##$COROFFS= 0
##$CY= -3
##$DATMOD= 1
##$DC= 2
##$DFILT= <>
##$DTYPP= 0
##$F1P= 0
##$F2P= 0
##$FCOR= 0.5
##$FTSIZE= 0
##$FT_mod= 4
##$GAMMA= 1
##$GB= 0.15
##$INTBC= 1
##$INTSCL= 1
##$ISEN= 128
##$LB= 0.25
##$LEV0= 0
##$LPBIN= 0
##$MAXI= 10000
##$MC2= 0
##$MEAN= 0
##$ME_mod= 0
##$MI= 1.114404
##$NCOEF= 0
##$NC_proc= 0
##$NLEV= 6
##$NOISF1= 3.799351
##$NOISF2= 2.8
##$NSP= 1
##$NTH_PI= 0
##$NZP= 0
##$OFFSET= 14.38212
##$PC= 1
##$PHC0= -827.4564
##$PHC1= 3.992199
##$PH_mod= 1
##$PKNL= yes
##$PPARMOD= 0
##$PSCAL= 0
##$PSIGN= 0
##$REVERSE= no
##$SF= 200.129724274929
##$SI= 16384
##$SIGF1= 3
##$SIGF2= 2
##$SINO= 400
##$SIOLD= 16384
##$SREGLST= <1H.CDCl3>
##$SSB= 0
##$STSI= 0
##$STSR= 0
##$SW_p= 3205.1282051282
##$SYMM= 0
##$S_DEV= 0
##$TDeff= 0
##$TDoff= 0
##$TI= <>
##$TILT= no
##$TM1= 0
##$TM2= 0
##$TOPLEV= 0
##$USERP1= <user>
##$USERP2= <user>
##$USERP3= <user>
##$USERP4= <user>
##$USERP5= <user>
##$WDW= 1
##$XDIM= 8192
##$YMAX_p= 0
##$YMIN_p= 0
$$ End of Bruker specific parameters
$$ ---------------------------------
##NTUPLES= NMR FID
##VAR_NAME=  TIME,          FID/REAL,        FID/IMAG
##SYMBOL=    X,             R,               I
##VAR_TYPE=  INDEPENDENT,   DEPENDENT,       DEPENDENT
##VAR_FORM=  AFFN,          ASDF,            ASDF
##VAR_DIM=   8192,          8192,            8192
##UNITS=     SECONDS,       ARBITRARY UNITS, ARBITRARY UNITS
##FACTOR=    0.0002768,     1,               1
##FIRST=     0,             0,               0
##LAST=      2.2672688,     0,               0
##MIN=       0,             -85871,          0
##MAX=       2.2672688,     61421,           0
$$ Real data points
##PAGE= N=1
##DATA TABLE= (X++(R..R)), XYDATA
$$ [...]
$$ plain form
1584 45 -112 -175 118 11 -101 49 -139 -208 106 110 55 37 187 46 189 173 85 -23 66 182 -18 189 -201
1607 -201 -136 -54 -179 -242 54 35 93 -83 -120 -248 78 117 242 160 -9 96 107 -32 100 57 -3 -43 -20 30 -43
1632 -43 50 -46 39 -67 -2 -19 -69 32 105 -17 -104 -66 68 149 62 -37 -92 -107 -106 38 -84 104 -98 -154 9 -126
1658 -126 46 241 -100 -186 267 -72 135 172 47 53 57 96 7 -60 -177 5 -243 -39 7 -25 -257 80 -300 134
1682 134 122 -353 240 85 151 -7 -77 -158 201 -50 70 -74 -341 -75 59 -46 75 240 -68 -222 -128 3
1704 3 88 59 130 -73 -134 2 128 11 97 -113 -66 -179 -179 -1 -56 61 101 -121 -100 -62 123 -244 10 222 118
1729 118 -13 -248 20 132 -128 136 -48 -8 5 169 -11 49 167 69 207 -90 -52 62 -272 178 9 -195
1751 -195 -93 -138 -38 20 124 6 39 -157 24 -42 -57 86 259 -229 74 -124 -113 -103 -217 45 -122 -222
$$ packed form
1584D5j57o3K93j07j12J50j88o9L14Mn5j8J50j41J43j6q8j08Q9J16k00K07l90
1607b01O5Q2j25o3K96j9N8j76l7j28L26L9J25q2j69J05J1j39J32m3o0m0K3N0p3
1632d3R3r6Q5j06O5j7n0J01P3j22q7L8J34Q1q7r9n5j5JJ44j22J88k02n6J63j35
1658a26J72J95l41q6M53l39K07L7j25OML9q9o7j17J82k48K04M6l2k32L37l80M34
1682A34j2m75N93j55O6j58p0q1L59k51J20j44k67K66J34j05J21J65l08j54R4J31
1704CQ5k9P1k03o1J36J26j17Q6k10M7j13%J78n5J17M0k22K1L8J85l67K54K12j04
1729A18j31k35K68J12k60K64j84M0J3J64j80O0J18r8J38k97L8J14l34M50j69k04
1751a95J02m5J00N8J04j18L3j96J81o6j5J43J73m88L03j98J1J0j14K62j67j00
$$ plain form
1773 -222 -35 125 -161 120 250 -56 68 -99 161 14 -71 -111 -130 -103 9 18 97 3 46 85 -17 -313 244
1796 244 84 75 259 4 25 169 67 112 72 23 237 98 20 204 52 -265 -286 168 -43 12 -278 100 -5
1819 -5 56 -54 -14 18 -80 124 -130 33 79 65 -49 -103 -205 -77 -127 -293 284 -205 -325 20 73 36 74 129 186
1844 186 53 -60 92 -65 -9 -40 -77 -224 -186 -6 -10 -60 -74 -47 83 -153 160 139 -87 26 -16 39 49 115 111
1869 111 86 68 -12 186 -120 -116 65 -55 97 85 -134 -128 -109 -250 -279 -45 -9 54 3 150 -129 -303 76 -75
1893 -75 183 92 -184 -72 97 -126 -150 285 -15 -146 -156 -65 156 -203 -43 -32 -157 186 17 200 105 -35
1915 -35 158 36 -154 -5 -46 203 -63 24 -30 -122 218 -71 32 -102 8 138 409 -27 -175 64 -50 31
1937 31 47 -131 -70 -11 15 -159 14 95 -51 -112 281 -132 83 39 263 -98 -34 135 -5 -42 92 80 40 0
$$ packed form
1773b22J87J60k86K81J30l06J24j67K60j47q5m0j9K7J12RP9r4M3L9j02k96N57
1796B44j60rJ84k55K1J44j02M5m0m9K14j39p8J84j52l17k1M54k11N5k90L78j05
1819eO1j10M0L2r8K04k54J63M6j4j14n4j02J28n0j66N77m89j20L45N3l7L8N5N7
1844A86j33j13J52j57N6l1l7j47L8J80mn0j4K7J30k36L13k1k26J13m2N5J0O6m
1869A11k5j8q0J98l06MJ81j20J52j2k19OJ9j41k9K34L6O3n1J47k79j74L79j51
1893g5K58r1k76J12J69k23k4M35l00j31j0R1K21l59J60J1j25L43j69J83r5j40
1915c5J93j22j90J49m1K49k66Q7n4r2L40k89J03j34J10J30K71m36j48K39j14Q1
1937C1J6j78O1N9K6j74J73Q1j46o1L93m13K15m4K24l61O4J69j40l7J34j2m0m0
$$ plain form
1961 0 187 -73 -3 -43 34 49 -187 -42 -106 79 95 -12 -190 -147 -9 -20 108 263 -118 110 98 -21 185 43
1985 43 115 69 40 -92 -251 18 -222 -225 55 79 30 -169 101 83 103 -146 58 222 -53 232 52 6 64 97
2009 97 35 222 96 -71 43 204 106 134 -181 -40 -21 -248 97 150 -53 31 15 -73 97 200 176 227 134 -104
2033 -104 -202 209 -34 43 185 -95 32 -65 -13 309 30 -48 127 61 -121 -63 -187 -19 -9 285 109 -50 141
2056 141 -84 212 155 116 -104 -54 151 3 47 29 171 -12 -114 -118 -114 -52 -33 121 190 140 63 -158 22 104 -49
2081 -49 -226 -7 70 -59 38 -61 -198 -257 38 217 47 125 -31 -66 136 74 57 -56 -133 24 -156 -178 194 35
2105 35 -230 -4 -108 152 31 -190 31 345 -7 85 105 -228 167 -73 -53 3 -247 13 126 -211 -24 -7
2127 -7 100 -46 39 43 -5 114 48 -63 -109 24 -88 8 -65 -72 -148 3 -13 -113 4 -49 -117 16 26 38 -76 -40
$$ packed form
1961@J87k60P0m0P7J5k36J45o4J85J6j07j78M3J38j1J28J55l81K28j2j19K06j42
1985D3P2m6k9j32j59K69k40lK80K4m9j99K70j8K0k49K04J64k75K85j80m6N8L3
2009I7o2J87j26j67J14J61r8K8l15J41J9k27L45N3k03Q4j6q8J70J03k4N1r3k38
2033a04r8M11k43P7J42k80J27r7N2L22k79p8J75o6j82N8j24J68J0K94j76j59J91
2056A41k25K96n7l9k20N0K05j48M4j8J42j83j02mMO2J9J54O9n0p7k21J80Q2j53
2081d9j77K19P7j29R7r9j37n9K95J79j70P8j56l5K02o2j7j13p7J57j80k2L72j59
2105C5k65K26j04K60j21k21K21L14l52R2K0l33L95k40K0N6k50K60J13l37J87J7
2127gJ07j46Q5Mm8J19o6j11m6J33j12R6p3pp6J51j6j00J17n3o8J33J0J2j14L6
$$ plain form
2153 -40 175 12 -29 279 96 29 151 34 82 157 30 -113 -83 138 42 124 26 -131 -45 -97 137 -100 -180 134
2177 134 -121 96 207 -22 118 49 76 76 64 -124 -103 -78 -215 -20 -164 -96 -123 -54 34 -132 -98 -123 259 -22
2201 -22 -188 -207 -73 44 89 93 87 -43 271 65 -34 85 67 -149 -105 28 -33 -138 -105 15 147 52 6 177 74
2226 74 277 131 2 -15 -242 56 299 -1 110 -32 87 62 -21 -222 -26 49 35 109 155 -242 4 101 182
2249 182 86 -107 -31 26 -17 207 -18 13 178 36 -57 11 8 -32 37 -54 26 158 -201 99 -95 -17 67 -43 -154
2274 -154 184 118 -110 -113 -31 44 7 -82 2 215 -143 -36 -131 -58 -124 94 18 63 28 127 -194 -33 182 -32 -71
2299 -71 -111 147 -75 183 -137 2 -204 -59 -95 132 -129 -68 -106 -202 36 -12 -71 3 23 100 177 -64 150 -90
2323 -90 94 -24 175 -91 -99 -80 -91 -158 40 24 180 -37 189 18 -143 209 37 -15 -101 -10 -289 -286 -77 -14
$$ packed form
2153d0K15j63m1L08j83o7J22j17M8P5j27j43L0K21r6Q2r8j57Q6n2K34k37q0L14
2177A34k55K17J11k29J40o9K7%j2j88K1K5j37J95j44O8k7O9Q8j66L4k5L82k81
2201b2j66j9J34J17M5Moj30L14k06r9J19j8k16M4J33o1j05L3J20J32r5m6J71j03
2226G4K03j46j29j7k27K98K43l00J11j42J19k5q3k01J96P5j4P4M6l97K46R7Q1
2249A82r6j93P6N7m3K24k25L1J65j42r3O8lm0O9r1Q0J32l59L00j94P8Q4j10j11
2274a54L38o6k28lQ2P5l7q9Q4K13l58J07r5P3o6K18p6M5l5R9l21J61K15k14l9
2299g1m0K58k22K58l20J39k06J45l6K27k61O1l8r6K38m8n9P4K0P7P7k41K14k40
2323i0J84j18J99k66qJ9j1o7J98j6J56k17K26j71j61L52j72n2q6R1k79LK09O3
$$ plain form
2347 -14 151 22 -83 -21 -27 153 -118 -86 68 -156 2 -63 98 159 -105 201 -35 -44 81 -76 -188 172 35
2370 35 -164 -18 -30 -10 145 2 -84 42 -10 -134 88 -17 10 1 132 43 214 187 57 -97 51 156 -164
2393 -164 17 -81 186 -86 9 -23 -103 -50 -143 25 121 -10 -118 -106 202 -3 88 70 -38 -286 -111 -221 52
2416 52 146 -2 -96 -9 -56 28 -12 14 -95 -37 30 -197 -143 186 -121 24 165 -94 -7 -11 107 -9 -53 -25 -140
2441 -140 9 -2 -134 -20 -20 -38 113 -218 -109 -83 -4 -232 73 -113 -52 -103 83 108 -114 -109 37 -162 -46 61
2465 61 178 124 -105 -190 -1 -6 -122 -87 173 150 10 -84 -29 130 -64 -94 171 -68 77 110 -73 -92 93 232
2489 232 -51 -54 -38 40 -181 -16 -41 -50 71 -246 -229 -92 -1 -139 -221 81 177 101 50 -183 -18 -107 -46 58 -110
2514 -110 -14 161 17 -4 -213 -56 167 51 -76 -34 -95 273 -84 6 179 -167 -78 59 -123 34 163 -75
$$ packed form
2347a4J65j29j05O2oJ80k71L2J54k24J58o5J61O1k64L06k36rJ25j57j12L60j37
2370C5j99J46j2K0J55j43q6J26n2j24K22j05K7rJ31q9J71k7j30j54J48J05l20
2393a64J81r8K67k72R5l2q0N3r3J68R6j31j08J2L08k05R1j8j08k48J75j10K73
2416E2R4j48r4Q7m7Q4m0K6j09N8O7k27N4L29l07J45J41k59Q7mJ18j16m4K8j15
2441a40J49j1j32J14%j8J51l31J09K6P9k28L05j86O1n1J86K5k22NJ46j99J16J07
2465F1J17n4k29q5J89nj16L5K60k3j40r4N5J59j94l0K65k39J45L3j83j9J85J39
2489B32k83lJ6P8k21J65k5rJ21l17J7J37R1j38q2L02R6p6n1k33J65q9O1J04j68
2514a10R6J75j44k1k09J57K23j16j27M2o1L68l57R0J73l46Q9J37j82J57J29k38
$$ plain form
2536 -75 -6 195 24 -120 77 61 -277 178 -117 73 199 -71 90 220 -25 124 -69 -79 -207 67 -172
2557 -172 41 -33 -169 160 163 33 -162 133 -9 74 190 -97 -75 -15 34 45 -112 46 -116 119 -56 -106 -123
2580 -123 77 69 104 -170 15 -2 -198 148 -70 -25 -256 199 65 141 -77 57 1 -72 -3 -73 69 45 27 -152
2604 -152 -159 61 -20 -83 77 38 22 139 92 87 -74 -144 -50 53 128 -209 -48 -71 92 -381 -202 -2 141 -177
2628 -177 -87 -7 -282 72 59 105 -2 215 -74 -65 -92 80 165 159 24 66 172 104 45 -50 70 -232 -203 168 182
2653 182 148 -24 101 4 -26 -139 33 230 71 2 -45 -199 -170 -165 -112 -121 4 174 -16 -84 53 32 36 178 90
2678 90 174 -7 6 63 22 -188 -290 79 143 108 -144 -56 142 -2 75 -105 121 59 -42 29 -37 64 106 -82
2702 -82 -27 -127 190 173 -73 46 -6 6 -19 -157 45 -62 -88 151 -67 -12 -50 201 259 176 144 -80 163 192
$$ packed form
2536g5O9K01j71j44J97j6l38M55k95J90J26k70J61J30k45J49j93j0j28K74k39
2557a72K13p4j36L29Lj30j95K95j42Q3J16k87K2O0M9J1j57J58j62K35j75n0j7
2580a23K00qL5k74J85j7j96L46k18M5k31M55j34P6k18J34n6p3O9p0J42k4j8j79
2604a52pK20q1o3J60l9j6J17m7nj61p0R4J03P5l37J61k3J63m73J79K00J43l18
2628a77R0Q0k75L54j3M6j07K17k89Rk7J72Q5oj35M2J06o8n9r5J20l02K9L71J4
2653A82l4j72J25r7l0j13J72J97j59o9m7j54K9NN3rJ25J70j90o8J37k1MJ42q8
2678I0Q4j81J3N7m1k10j02L69O4l5k52Q8J98j44P7j80K26o2j01P1o6J01M2j88
2702h2N5j00L17j7k46J19n2J2k5j38K02j07k6K39k18N5l8K51N8q3l2k24K43K9
$$ plain form
2726 192 -75 132 112 101 26 72 -216 -82 -26 6 109 23 -202 -113 19 115 317 307 -32 -78 175 58 -119 19
2750 19 -49 -141 198 -96 -60 98 145 202 -7 47 -157 99 -41 66 -20 -196 61 144 266 -70 -3 102 29 112
2774 112 -81 -4 -36 -78 605 -59 92 25 115 -18 -26 -144 -22 149 -178 86 -12 -93 -103 66 26 -190 86 -76
2798 -76 -108 23 -30 159 -60 -69 -126 89 12 -13 68 34 168 -43 -109 -177 91 125 274 -82 34 53 -86 -7 -55
2823 -55 -89 23 -104 -72 77 -67 -50 -35 -38 -90 70 -63 -85 41 -45 15 -133 -117 26 -119 67 -112 -87 47
2847 47 50 -40 14 6 -23 94 206 -136 64 145 14 -34 -83 -99 48 -173 -126 135 106 54 -5 -40 -61 -22 119 49 -116
2874 -116 100 343 167 194 78 110 -58 -56 -170 -140 22 112 164 130 -3 89 -34 107 -69 -146 22 15 159 106
2898 106 166 -7 -121 17 43 79 45 -7 85 -128 -23 -137 -37 -297 119 125 -31 -85 73 -19 -241 90 50 162
$$ packed form
2726A92k67K07k0j1p5M6k88J34N6L2J03q6k25Q9J32R6K02j0l39m6K53j17j77J38
2750A9o8r2L39k94L6J58M7N7k09N4k04K56j40J07q6j76K57Q3J22l36O7J05p3Q3
2774A12j93P7l2m2O83o64J51o7R0j33qj18J22J71l27K64r8q1j0J69m0k16K76j62
2798g6l2J31n3J89k19rn7K15p7k5Q1l4J34k11o6o8K68L4J49l56J16J9j39P9m8
2823e5l4J12j27L2J49j44J7J5ln2J60j33k2J26q6O0j48J6J43j45J86j79K5J34
2847D7Lr0N4qk9J17J12l42K00Q1j31m8m9j6J47k21M7K61k9n2n9l5k1L9J41p0j65
2874a16K16K43j76K7j16L2j68Kj14L0J62R0N2l4j33R2j23J41j76p7J68pJ44n3
2898A06O0j73j14J38K6L6l4n2R2k13J05j14J00k60M16Oj56n4J58r2k22L31m0J12
$$ plain form
2922 162 107 -113 42 -46 -26 -52 -128 -253 202 -89 -122 27 32 -25 -41 8 -79 126 -19 232 -23 82 192 156
2946 156 -71 102 46 -114 59 90 -221 120 -168 22 -82 43 -109 -212 25 -28 206 39 170 -67 12
2967 12 -25 107 -133 -123 -117 -121 -24 -16 29 -207 -11 -44 -22 -23 -126 -29 48 -54 -50 -159 8 9 -4 98 -39 -57 -43 91
2995 91 -153 77 21 -40 66 90 42 134 -61 294 -114 -206 -13 -62 18 61 -221 -31 33 -47 -173 85 -90 -84 127
3020 127 52 -37 84 -206 17 156 -138 0 -84 197 63 207 -1 -207 -144 -83 -125 -65 -85 42 2 48 139 118
3044 118 -89 -218 -128 141 -46 -65 -240 -208 -162 -25 -236 66 -62 -59 -99 255 -117 3 62 10 -4 -32 -99 -46
3068 -46 -256 -88 39 -34 7 50 108 62 265 -144 -97 92 26 13 -129 26 -4 -30 112 -162 28 -31 35 94 181
3093 181 119 -116 25 -122 -3 143 304 -65 -57 -58 40 35 -21 -184 -17 28 207 -15 -25 -66 -5 160 -159 -95 -116
$$ packed form
2922A62n5k20J55q8K0k6p6j25M55k91l3J49Nn7j6M9q7K05j45K51k55J05J10l6
2946A56k27J73n6j60J73L1l11L41k88J90j04J25j52j03K37n3K34j67J31k37P9
2967A2l7J32k40J0OmR7QM5k36J96l3K2jj03R7P7j02Mj09J67Jj3J02j37j8J4J34
2995I1k44K30n6o1J06K4m8R2j95L55m08r2J93m9Q0M3k82J90O4q0j26K58j75OK11
3020A27p5q9J21k90K23J39k94J38q4K81j34J44k08k06O3O1m2O0k0J27m0M6R1k1
3044A18k07j29R0K69j87j9j75L2M6J37k11L02j28Lm0L54l72J20N9n2j4k8o7N3
3068d6k10J68J27p3M1M3N8m6K03m09M7J89o6j3j42J55l0k6J42k74J90n9O6N9Q7
3093A81o2k35J41j47J19J46J61l69QjR8nn6j63J67M5J79k22j0m1O1J65l19O4k1
$$ plain form
3118 -116 -174 222 -107 -67 123 -99 275 31 37 -1 10 -7 167 -172 -17 -55 -12 -70 -162 -31 126 -75 -109 106
3142 106 140 161 -37 -165 30 -88 -64 -29 -135 136 101 107 167 103 -200 87 -47 38 0 -84 122 24 7 -30 39
3167 39 20 -142 -51 197 23 7 137 -66 -76 -30 -16 -45 -193 115 -23 154 61 -36 86 206 60 -14 158 -37
3191 -37 78 81 172 -12 -18 35 235 25 -24 108 -43 -87 146 196 -64 28 106 -61 -56 127 -55 -111 151 -110 -47
3216 -47 -35 -132 40 -10 73 -70 102 170 -35 -7 -2 107 87 -222 229 205 55 -227 -159 72 230 -112 112 -8
3240 -8 -95 179 41 -74 -99 85 -172 124 -38 -325 -110 1 -148 -1 -14 163 -14 -117 -5 16 50 -55
3262 -55 -52 -152 -44 -67 -27 -24 49 199 155 265 47 -132 34 287 27 136 228 134 -129 -26 -44 -151 -49 86
3286 86 130 -107 135 -121 -171 -58 -95 16 -4 -153 -141 -73 75 -270 -129 -83 171 132 -62 45 -307 -8 -116
$$ packed form
3118a16n8L96l29M0J90k22L74k44Ol8J1j7J74l39J55l8M3n8r2J31J57k01l4K15
3142A06L4K1j98j28J95j18K4L5j06K71l5OO0o4l03K87j34Q5l8q4K06r8j7l7O9
3167C9j9j62R1K48j74j6J30k03j0M6J4k9j48L08j38J77r3r7J22J20j46p4J72j95
3191c7J15LR1j84oN3K00k10m9J32j51m4K33N0k60R2P8j67NJ83j82n6K62k61O3
3216d7J2r7J72n0Q3j43J72O8k05K8NJ09k0l09M51k4j50k82O8K31J58l42K24j20
3240hq7K74j38j15k5J84k57K96j62k87K15J11j49J47j3J77j77j03J12K1L4j05
3262e5Lj00J08k3M0LP3J50m4J10k18j79J66K53k60J09R2r4k63J03j8j07J02J35
3286H6M4k37K42k56n0J13l7J11k0j49J2O8J48l45J41M6K54l9j94J07l52K99j08
$$ plain form
3309 -116 56 -183 150 -97 158 -177 -176 -127 101 -291 -47 141 -66 257 -174 -2 -26 -52 -88 50 57 35 -6
3332 -6 63 -175 -323 -85 145 32 -299 176 -81 -23 46 -142 209 -47 -44 -32 133 -30 48 -20 137 3 27 -60
3356 -60 -42 91 -129 201 227 188 -76 165 -81 -90 28 -18 -4 -150 -112 -28 159 -130 14 166 13 30 66 194
3380 194 9 8 138 1 75 158 215 158 231 79 -122 -29 119 -118 -8 35 42 -115 52 144 93 0 -71 21 -21 177
3406 177 107 -383 -20 -78 25 -56 275 53 17 7 120 -79 -75 -156 -56 -158 -113 -43 -166 -68 -213 182 -130 123
3430 123 -14 175 -3 -103 91 33 -20 -72 17 97 -113 50 -72 -7 -108 73 -53 -68 -10 43 20 18 52 -32 -55
3455 -55 160 -64 87 131 81 257 -1 -7 179 -4 25 124 90 18 125 -34 -63 -70 -115 -54 -166 -85 -104 -28 33 161
3481 161 -21 155 174 -152 -7 -306 98 23 -42 168 86 97 13 83 -193 8 31 -103 -63 -117 -36 12 -63 -2 -152
$$ packed form
3309a16J72k39L33k47K55l35JM9K28l92K44J88k07L23m31J72k4k6l6J38Pk2m1
3332fO9k38j48K38K30j13l31M75k57N8O9j88L51k56LJ2J65j63P8o8J57j34K4q7
3356f0J8J33k20L30K6l9k64K41k46rJ18m6J4j46L8Q4J87k89J44J52j53J7L6J28
3380A94j85jJ30j37P4Q3N7n7P3j52k01R3J48k37J10M3Pj57J67R2n1r3p1R2m2J98
3406A77p0m90L63n8J03q1L31k22l6j0J13j99Mq1J00j02M5P0j23R8j45L95l12K53
3430A23j37J89j78j00J94n8n3n2Q9Q0k10J63j22O5j01J81j26j5N8N3k3kL4q4k3
3455e5K15k24J51M4n0J76k58oJ86j83K9R9l4p2J07j59k9pm5O1j12Q1j9P6O1J28
3481A61j82J76J9l26J45k99M04p5o5K10q2J1q4P0k76K01K3j34M0n4Q1M8p5O1j50
$$ plain form
3506 -152 -8 34 161 58 162 -231 95 -128 -28 127 14 85 -118 48 -197 110 148 48 -7 -64 88 -2
3528 -2 -13 83 85 245 74 -52 18 136 -115 165 -66 -65 42 -193 190 176 -55 -106 -78 -104 3 55 -54 57 34
3553 34 118 89 -5 -79 62 -8 -56 62 185 79 292 121 62 -75 -7 172 -45 -54 -157 -18 265 -76 -11 0
3577 0 -70 17 -180 -246 -90 -117 152 -158 63 -29 160 -12 -8 268 -82 -196 -222 35 2 139 -39 7 164 -19
3601 -19 -181 69 46 191 168 -48 62 158 -148 172 -109 -35 -23 -110 157 -39 58 36 -96 107 12 73 40 -2
3625 -2 74 4 -116 -30 64 150 -40 93 -175 -1 -104 -66 -52 -92 11 51 -144 -46 -28 64 118 -69 47 81 -222
3650 -222 -78 69 78 66 62 211 10 163 -135 62 -115 49 63 -184 104 188 -51 -72 -88 -3 -41 -31 -139 -163
3674 -163 59 72 93 -25 -61 -179 143 66 7 -148 -76 68 -33 90 -14 -237 92 43 -172 96 -13 44 138
$$ packed form
3506a52J44M2J27j03J04l93L26k23J00J55j13P1k03J66k45L07L8j00n5n7J52r0
3528bj1R6KJ60j71j26P0J18k51K80k31JJ07k35L83j4k31n1K8k6J07N2j09J11k3
3553C4Q4k9r4p4J41p0m8J18J23j06K13j71n9j37O8J79k17rj03J39K83l41O5J1
3577@p0Q7j97o6J56k7K69l10K21r2J89j72MK76l50j14k6K57l3J37j78M6J57j83
3601a9j62K50k3J45k3k16J10R6l06L20k81P4J2q7K67j96R7k2j32K03r5O1l3m2
3625bP6p0j20Q6R4Q6j90J33k68J74j03L8J4m0J03M0j95R8J8R2N4j87J16L4l03
3650b22J44J47Rj2mJ49k01J53k98J97j77J64J4k47K88Q4k39k1j6Q5l8J0j08k4
3674a63K22J3K1j18l6j18L22p7n9j55P2J44j01J23j04k23L29m9k15K68j09N7R4
$$ plain form
3697 138 -83 -58 -22 6 88 246 -76 100 -163 51 95 -107 -43 23 -130 184 -63 141 -2 105 -35 86
3719 86 60 53 164 27 92 115 -182 72 109 -221 -11 59 -80 42 66 183 -66 168 -87 164 40 -76 -38
3742 -38 110 160 72 158 -50 1 10 136 -27 -5 145 16 35 252 136 41 12 -149 14 -63 82 90 161 32 119
3767 119 107 232 -8 174 60 103 43 21 79 8 -164 7 255 158 31 -150 119 -106 -241 -192 65 35 -222
3790 -222 116 -261 -117 83 185 -6 -43 -58 -119 -50 -359 -93 -86 -281 -52 11 -279 -83 129 26 160 -47
3812 -47 -76 -138 44 -186 33 288 -212 -107 84 -85 -194 92 -144 -110 41 -74 -79 239 235 128 -157 -37 197
3835 197 -108 48 133 26 -33 -48 -23 118 33 38 -262 108 6 -60 -80 60 -200 -84 25 -60 205 -149 135
3858 135 31 -150 -214 56 51 -14 122 -112 22 -62 -46 -40 -85 -132 8 -89 111 -138 -118 56 29 -62 -216 83 -8
$$ packed form
3697A38k21K5L6K8Q2J58l22J76k63K14M4k02O4O6j53L14k47K04j43J07j40J21
3719H6k6pJ11j37O5K3k97K54L7l30K10P0j39J22K4J17k49K34k55K51j24j16L8
3742c8J48N0q8Q6k08N1RJ26j63K2J50j29J9K17j16r5k9j61J63p7J45QP1j29Q7
3767A19j2J25k40J82j14M3o0k2N8p1j72J71K48r7j27j81K69k25j35M9K57l0k57
3790b22L38l77J44K00J02j91l7j5o1O9l09K66Pj95K29O3k90J96K12j03J34k07
3812d7k9o2J82k30K19K55n00J05J91j69j09K86k36L4J51j15nL18mj07k85J20K34
3835A97l05J56Q5j07n9j5K5J41q5Nl00L70j02o6k0J40k60J16J09q5K65l54K84
3858A35j04j81o4K70no5J36k34J34q4J6Om5m7J40r7K00k49K0J74k7r1j54K99r1
$$ plain form
3883 -8 -142 -260 -63 -69 -9 -21 77 65 155 -77 -176 87 -33 60 20 -23 124 141 -103 -22 -92 -4 195 -123 -100 -208
3909 -208 26 63 10 -16 69 106 45 36 84 70 10 264 143 -70 -36 43 19 -60 135 59 -114 215 34 76 116 181
3935 181 -131 113 269 -90 114 -12 -25 -101 204 -25 -150 -42 -242 -5 46 -99 -6 -241 235 30 131
3956 131 307 102 88 -217 -147 -55 19 78 42 0 32 -65 97 -91 58 111 218 111 128 -136 60 19 -177 -60
3980 -60 195 -115 110 270 64 89 -30 -71 -42 192 115 187 -44 -38 -44 33 -10 48 48 -30 -26 -260 -100 -274 34 -112
4006 -112 -138 -88 -28 -100 -115 -49 305 -91 -38 175 -19 91 -71 104 10 1 -137 -45 -170 -29 116 57 130 95 -61
4031 -61 1 -180 152 19 34 76 38 126 74 -127 120 -13 -17 -177 62 -33 -154 -108 -263 -9 53 57 -150 -101 1
4056 1 -302 -17 -30 -12 55 97 -113 -127 -151 21 120 -67 120 92 -63 -14 111 131 -25 -163 8 153 165 61
$$ packed form
3883hj34j18J97oO0j2R8j2R0k32r9K63j20R3m0m3J47J7k44Q1p0Q8J99l18K3j08
3909b08K34L7n3k6Q5L7o1rM8j4o0K54j21k13L4P9k4p9J95p6j73L29j81M2M0O5
3935A81l12K44J56l59K04j26j3p6L05k29j25J08k00K37N1j45R3k35M76k05J01
3956A31J76k05j4l05P0R2P4N9l6m2L2r7J62j88J49N3J07j07J7k64J96m1j96J17
3980f0K55l10K25J60k06K5j19m1K9K34p7P2k31OoP7m3N8%p8Mk34J60j74L08j46
4006a12k6N0O0p2j5O6L54l96N3K13j94J10j62J75r4rj38R2j25J41J45n9P3l5j56
4031f1O2j81L32j33J5M2l8Q8n2k01K47j33mj60K39r5j21M6j55K54O2Mk07M9J02
4056Al03K85j3J8O7M2k10j4k4J72R9j87J87k8j55M9J25K0j56j38J71J45J2j04
$$ plain form
4080 61 102 109 -45 -206 -64 -50 37 -27 65 55 -86 -130 24 57 -63 -153 179 24 -19 30 -5 107 241 83 48
4105 48 102 -89 62 30 132 -78 -194 -17 41 27 17 63 149 161 51 5 9 175 31 -32 -86 44 71 86 -55
4130 -55 -116 -128 66 53 -1 69 16 52 -64 161 1 121 -174 -128 -54 212 -86 9 127 128 -153 0 172 155 36
4155 36 -10 -15 256 -175 -80 -82 141 7 -51 49 -298 -18 -2 -205 26 -136 -284 -1 49 -111 119 -100 62
4178 62 166 80 30 31 18 -165 61 -97 7 9 -127 166 156 101 3 60 -40 -157 -118 93 27 28 105 74 -10 111
4204 111 -122 166 -15 -145 -156 -164 -80 2 89 24 22 -68 25 -57 -99 150 18 -2 -114 -3 -10 45 198 -28 88 43
4230 43 -1 2 3 92 103 2 57 -93 16 -7 19 187 -60 -48 -18 133 153 103 -136 -72 -54 -52 47 -144 54 68 36
4257 36 68 185 -3 8 17 27 3 -172 -67 133 0 -29 -5 -87 101 202 -111 -88 -62 85 57 -62 -3 -12 -46 -6
$$ packed form
4080F1M1Pj54j61J42J4Q7o4R2j0j41m4J54L3j20r0L32j55m3M9l5J12J34j58l5
4105D8N4j91J51l2J02k10j16J77N8j4j0M6Q6J2j10m6MJ66j44o3n4J30K7J5j41
4130e5o1j2J94j3n4P0n3L6j16K25j60J20k95M6P4K66k98R5J18Jk81J53J72j7j19
4155C6m6nK71m31R5kK23j34n8J00l47K80J6k03K31j62j48K83N0j60K30k19J62
4178F2J04q6n0Jj3j83K26j58J04Kj36K93j0n5r8N7j00j17L9K11o6JP7l1q4J21
4204A11k33K88j81j30j1qQ4Q2Q7o5kr0R3q2m2K49j32k0j12J11pN5J53k26J16m5
4230D3m4LJQ9J1j01N5j50J09k3K6J68k47J2L0J51K0n0k39O4J8KR9j91J98J4l2
4257C6L2J17j88J1RJ0k4j75J05K00j33k9K4q2J88J01l13K3K6J47k8j19N9rl4M0
$$ plain form
4283 -6 13 129 38 -311 -90 102 124 -59 24 -7 -171 -287 -31 76 116 -230 127 -1 142 6 91 -33 70
4306 70 -112 100 37 165 21 -129 0 95 -187 190 -108 206 -9 -139 -186 -295 166 -61 -92 -44 90 97 -102
4329 -102 -63 -109 138 -26 20 -63 30 -40 -21 -11 -19 0 31 131 72 -148 -81 22 -109 -109 34 50 42 7 -138 -40 -204
4356 -204 90 -49 -38 -210 203 -82 39 215 76 104 -35 72 -17 136 -160 60 76 -65 -201 21 -73 -81
4378 -81 104 52 -66 173 -99 57 -52 101 -109 -147 76 -169 -3 -90 44 5 39 -16 -7 192 -88 -41 255
4401 255 -23 -139 -48 -14 76 204 -16 216 69 -64 -135 -78 -124 21 6 16 20 -27 -29 9 116 117 -151 -237 -229 104
4427 104 -74 13 45 -66 -14 -93 -44 -75 -3 -44 -33 58 -201 8 -122 38 -23 -219 84 -81 48 -78 81 317
4451 317 -24 -108 -28 -114 6 146 -75 103 11 42 164 1 22 -164 115 33 116 -51 106 -39 59 119 -107
$$ packed form
4283fJ9J16r1l49K21J92K2j83Q3l1j64j16K56J07M0l46L57j28J43j36Q5j24J03
4306G0j82K12o3J28j44j50J29R5k82L77k98L14k15j30m7j09M61k27l1M8J34Pj99
4329a02L9m6K47j64M6q3R3p0J9J0qJ9L1J00n9k20O7J03j31%J43J6ql5j45R8j64
4356b04K94j39J1j72M13k85J21J76j39K8j39J07q9J53k96K20J6j41j36K22r4q
4378h1J85n2j18K39k72J56j09J53k10l8K23k45J66q7J34l9L4n5RJ99k80M7K96
4401B55k78j16R1L4R0J28k20K32j47j33p1N7m6J45j5J0Mm7kL8J07Jk68q6QL33
4427A04j78Q7L2j11N2p9M9l1P2m1J1R1k59K09j30J60o1j96L03j65J29j26J59K36
4451C17l41q4Q0q6J20J40k21J78r2L1J22j63K1j86K79q2Q3j67J57j45R8O0k26
$$ plain form
4474 -107 292 5 -58 -38 172 90 60 90 9 -65 69 -35 -1 52 62 -112 -49 -28 -179 -8 86 85 203 -42 -134
4499 -134 94 4 86 163 262 24 169 19 -224 38 -79 -60 41 36 165 -86 -72 213 -161 -223 10 -40 56 -124
4523 -124 80 147 -47 -24 111 -5 75 125 -38 58 11 -156 109 -245 -147 122 -60 -71 0 108 -39 65 148
4546 148 -7 -27 -206 -193 -31 -9 -203 210 62 -66 -152 7 -63 13 131 150 192 -86 93 -98 32 -123 96
4569 96 105 -37 286 64 82 216 -99 163 133 26 125 39 -18 -116 -125 -115 -140 -138 68 -96 185 83 -229 -81 -181
4594 -181 -109 -30 -33 -75 -41 20 -30 32 44 -22 127 -23 107 -3 -156 100 113 61 -250 -49 -53 17 -17 8 148 -101
4620 -101 117 -77 -56 21 -85 77 122 119 3 -13 -229 -184 -49 7 -62 132 46 -43 117 -210 105 -80 64 169
4644 169 176 -80 45 41 102 -230 80 163 44 14 40 86 1 -48 34 -5 -41 77 144 68 -42 139 -131 -41 -197 63
$$ packed form
4474a07L99k87o3K0K10q2l0L0q1p4J34j04L4N3J0j74O3K1j51J71R4jJ18k45r2
4499a34K28r0Q2P7R9k38J45j50k43K62j17J9J01nJ29k51J4K85l74o2K33n0R6j80
4523a24K04O7j94K3J35j16Q0N0j63R6m7j67K65l54R8K69j82j1P1J08j47J04Q3
4546A48j55k0j79J3J62K2j94M13j48j28q6J59p0P6J18J9M2k78J79j91J30j55K19
4569I6Rj42L23k22J8J34l15K62l0j07R9q6n7r8rJ0k5KK06j64K81j02l12J48j00
4594a81P2P9lm2L4O1n0O2J2o6J49j50J30j10j53K56J3n2l11K01mP0l4K5J40k49
4620a01K18j94K1P7j06J62M5lj16j6k16M5J35N6o9J94q6q9J60l27L15j85J44J05
4644A69Pk56J25mO1l32L10Q3j19l0K6M6q5m9Q2l9l6J18O7p6j10J81k70R0j56K60
$$ plain form
4670 63 -144 -1 -254 -245 37 -16 112 -180 -39 5 -12 -76 83 54 105 91 -1 171 86 -1 -162 26 228 -149
4694 -149 186 -12 98 13 193 -50 -66 -80 3 130 59 203 21 -200 45 44 6 -52 43 34 -139 126 -112 63
4718 63 81 21 212 23 87 -159 5 -139 33 -193 88 121 -85 -151 -287 -42 213 -71 -75 62 -106 33 -125
4741 -125 -16 122 22 -30 139 54 134 -84 186 78 -124 -108 11 74 48 -115 94 164 -22 81 112 70 -214
4764 -214 -129 239 -316 -143 -215 -182 135 207 -66 -164 75 -125 -91 144 225 104 18 83 161 133 93 -8 -96 -152 -158
4789 -158 67 -109 -30 -8 50 66 -93 -49 -39 27 148 107 -31 -13 -190 -84 -7 -160 56 -294 129 -116 169
4812 169 58 -103 -54 43 -41 -106 22 24 104 -81 -89 40 -13 19 -67 49 164 -96 199 -195 -30 -137 -101 19
4836 19 -107 21 51 69 59 -146 -193 126 117 449 116 -36 -5 -195 -164 -267 -33 153 -188 157 -66 -47 212
$$ packed form
4670F3k07J43k53RK82n3J28k92J41M4j7o4J59k9N1j4r2J72q5q7j61J88K02l77
4694a49L35j98J10q5J80k43j6j4Q3J27p1J44j82k21K45jl8n8R5rj73K65k38J75
4718F3J8o0J91j89O4k46J64j44J72k26K81L3k06o6j36K45K55k84mJ37j68J39j58
4741a25J09J38j00n2J69q5Q0k18K70j08k02J6J19O3k6j63K09P0j86J03L1m2k84
4764b14Q5L68n55J73p2L3L17P2k73r8K39k00L4K35Q1j21q6O5P8k8m0j01q8n6o
4789a58K25j76P9K2N8J6j59M4J0O6J21m1j38J8j77J06P7j53K16l50M23k45K85
4812A69j11j61M9R7q4o5J28KQ0j85qJ29n3L2q6J16J15k60K95l94J65j07L6J20
4836A9j26J28L0J8j0k05m7L19rL32l33j52L1j90L1j03K34J86l41L45k23J9K59
$$ plain form
4859 212 -128 22 -122 49 100 113 -3 -38 -97 -34 135 -126 -124 26 -17 -61 -106 171 -88 -17 1 -4 -121 70 -7
4884 -7 -69 -212 -155 -43 -110 -170 -102 22 57 -135 98 19 -110 117 71 7 -46 -134 6 68 22 38 92 -10 -25 23
4910 23 68 116 3 -16 10 -47 25 19 -163 -7 -185 80 107 -238 61 -103 -69 -156 81 69 -141 -267 149 36
4934 36 -50 -69 -229 -232 -101 -22 67 3 -117 28 -77 34 43 22 -87 -156 -95 -93 221 -144 -151 -74 -74 -120 -140 -16 101
4961 101 148 1 -5 -116 217 85 -182 37 -230 101 1 -73 61 276 80 24 83 29 -194 -134 -41 39 41 44 64
4986 64 73 -195 115 178 -33 102 24 44 13 86 117 -7 74 -48 77 88 -132 105 -168 -46 70 121 20 -173
5010 -173 138 -53 126 107 -126 14 107 -130 16 51 -14 -90 -111 74 55 125 -13 -75 53 -77 17 12 -98 18
5034 18 26 -103 118 -234 -39 50 69 -29 17 -29 -248 -126 -53 125 13 31 95 108 116 28 -47 -129 26 -40 75 104
$$ packed form
4859B12l40J50j44J71N1J3j16l5n9O3J69k61KJ50m3m4m5K77k59P1J8nj17J91p7
4884go2j43N7J12o7o0O8J24L5j92K33p9j29K27m6o4n3q8J40O2m6J6N4j02j5M8
4910B3M5M8j13j9K6n7P2oj82J56j78K65K7l45K99j64L4q7K37j2k10j26M16j13
4934C6q6j9j60lJ31P9Q9o4j20J45j05J11Rk1j09o9O1KL14l65pP7%m6k0J24J17
4961A01M7j47oj11L33j32k67K19k67L31j00p4J34K15j96n6N9n4k23O0R3Q0KLK0
4986F4Rk68L10O3k11J35p8K0l1P3L1j24Q1j22J25J1k20K37k73J22J16N1j01j93
5010a73L11j91J79j9k33J40R3k37J46L5o5p6k1J85j9P0j38o2J28j30R4nj10J16
5034A8Qj29K21l52J95Q9J9r8M6m6k19J22P3J78j12J8O4J3Qq8p5q2J55o6J15K9
$$ plain form
5060 104 -103 71 -85 189 109 -15 117 310 105 97 29 9 88 322 51 -194 -68 -138 156 45 59 65 54 -16
5084 -16 -63 38 -99 153 -18 -15 60 148 -34 -22 -214 -75 -73 -2 -89 -47 209 -92 -1 -110 30 -220 197 91
5108 91 19 -90 28 41 -15 -46 82 -103 -101 -98 164 13 -44 -149 101 0 289 225 82 88 -7 -38 -186 97 -14
5133 -14 88 -118 29 -56 -98 -239 -92 -181 93 -104 37 -57 -133 8 27 50 17 215 -28 -78 199 77 10 86
5157 86 63 28 -135 3 268 143 28 -78 -109 65 -83 -7 -244 -173 76 1 90 -109 -200 135 -37 -131 185
5180 185 -284 -97 99 -72 -46 -20 -96 78 -18 -116 95 50 19 50 -22 73 123 -143 -37 -64 -178 -8 39 121 4
5205 4 127 36 -100 64 -132 -56 -121 -87 -21 1 51 -64 -15 92 9 -72 101 -251 169 67 13 68 50 129 -69
5230 -69 170 122 -151 -92 66 -60 9 -174 85 77 141 -86 -187 22 -185 -68 55 58 105 -128 -122 -144 108 17 156
$$ packed form
5060A04k07J74j56K74q0j24J32J93k05qo8k0P9K34k71k45J26p0K94j11J4Oj1p0
5084a6m7J01j37K52j71LP5Q8j82J2j92J39KP1q7M2K56l01R1j09J40k50M17j06
5108I1p2j09J18J3n6l1J28j85KLK62j51n7j05K50j01K89o4j43Or5l1j48K83j11
5133a4J02k06J47q5m2j41J47q9K74j97J41r4p6J41J9K3l3J98k43n0K77j22o7P6
5157H6k3l5j63J38K65j25j15j06l1J74j48P6k37P1K49p5Q9j99r1L35j72r4L16
5180A85m69J87J96j71K6K6p6J74r6r8K11m5l1L1p2R5N0k66J06k7j14J70M7Q2j17
5205DJ23r1j36J64j96P6o5L4O6K2N0j15M9J07q3q1J73l52M20j02n4N5j8P9j98
5230f9K39m8k73N9J58j26O9j83K59qO4k27j01K09k07J17J23LM7k33Ok2K52r1J39
$$ plain form
5255 156 76 -83 6 -10 80 -52 32 98 201 10 -9 -63 13 -100 -472 24 124 266 155 -9 -79 26 15 277
5279 277 -51 106 10 -211 -124 52 -48 107 117 -8 52 -61 -9 56 25 -90 54 -72 229 13 -49 129 75
5302 75 -50 -150 75 130 100 95 83 -57 -39 -72 -73 -64 -15 -44 117 9 108 141 -108 162 26 -6 211 -7 50 27
5328 27 45 246 92 79 10 -21 16 -132 41 27 -13 -43 -118 -17 -41 51 -134 -76 107 208 -93 90 30 43 27
5353 27 98 68 107 279 74 -170 -321 -19 89 -187 -25 -58 -59 -58 -288 82 55 135 88 -216 -54 185 151 88 33
5378 33 -10 -74 110 88 148 31 94 231 -95 39 -21 73 56 -62 -73 70 -14 -46 20 -219 -203 -49 -3 123 23
5403 23 68 195 240 147 -134 -104 -85 56 79 136 -51 -225 -45 -13 61 3 117 223 93 -122 -61 -53 257 -45 -173
5428 -173 -124 49 -6 -66 9 -107 -14 -194 10 -94 -36 -111 -25 -18 -4 -217 110 48 -84 -173 112 7 90 14 -49
$$ packed form
5255A56q0j59Q9j6R0j32Q4O6J03j91j9n4P6j13l72M96J00J42j11j64p0J05j1K62
5279B77l28J57r6k21Q7J76j00J55J0j25O0j13N2O5l1j15J44j26L01k16o2J78n4
5302G5j25j00K25N5l0nj2j40J8l3jRM9k9J61j08R9L3k49K70j36l2K17k18N7k3
5328B7J8K01j54j3o9l1L7j48J73j4m0l0p5J01k4R2j85N8J83J01l01J83o0J3j6
5353B7P1l0L9J72k05k44j51L02J08k76J62l3jJk30L70k7Q0m7l04J62K39l4o3n5
5378C3m3o4J84k2O0j17O3J37l26J34o0R4j7j18j1J43q4l2O6k39J6J54M6J26j00
5403B3M5J27M5r3k81L0J9J41K3N7j87j74J80L2P4n8J14J06j30k15O1QL10l02j28
5428a73M9J73n5o0P5j16R3j80K04j04N8p5Q6PJ4k13L27o2j32q9K85j05Q3p6o3
$$ plain form
5453 -49 1 129 -98 -88 132 -75 2 100 87 -130 25 56 -35 33 -50 139 162 101 -199 -6 -3 -184 -25 -224 -23
5478 -23 -189 -39 195 40 12 -117 80 147 -98 218 85 3 116 -123 181 15 182 10 -142 52 -50
5499 -50 95 -131 -257 48 -50 156 18 177 -71 -12 -14 58 46 -104 -47 39 70 33 -27 -24 -98 -8 -102 18 49 59
5525 59 27 -22 -52 58 -94 -108 -80 35 116 -81 120 101 131 -31 -237 -48 128 -65 125 -142 40 217 -89
5548 -89 296 -140 82 -169 170 -106 -67 76 -97 15 -10 -58 -37 -15 -92 82 -51 152 -34 406 236 102
5570 102 92 129 2 -10 92 -268 -113 123 -108 -136 -82 93 -96 -71 18 -1 66 -32 70 155 -33 -18 112 1
5594 1 101 -104 5 61 174 88 27 188 116 -75 8 -17 -103 -71 128 65 -57 167 -107 228 -23 46 76 4 307
5619 307 16 43 -19 73 26 110 205 -120 -87 -111 -145 75 96 -47 129 -73 140 -71 -23 16 42 129 -90 147 -43
$$ packed form
5453d9N0J28k27J0K20k07P7R8j3k17J55L1r1O8q3J89K3o1l00J93Lj81J59j99K01
5478b3j66J50K34j55k8j29J97O7k45L16j33q2J13k39L04j66J67j72j52J94j02
5499e0J45k26j26L05r8K06j38J59k48N9kP2j2j50N7Q6L1l7o0Lp4R0r4J20L1J0
5525E9l2m9l0J10j52j4K8J15Q1j97K01j9L0j62k06J89J76j93J90k67J82J77l06
5548h9L85m36K22k51L39k76L9J43j73J12k5m8K1K2p7J74j33K03j86M40j70j34
5570A02j0L7j27j2J02l60J55K36k31k8N4J75j89K5Q9j9O7r8J02Q5j88J5J30j11
5594AJ00k05J09N6J13q6o1J61p2j91Q3k5q6L2J99o3j22K24k74L35k51O9L0p2L03
5619C07k91K7o2R2m7Q4R5l25L3k4l4K20K1j43J76k02K13k11M8L9K6Q7k19K37j90
$$ plain form
5644 -43 -40 134 -98 20 -143 54 -42 58 -170 104 -96 138 76 -273 -94 123 -56 -99 14 167 -48 -65
5666 -65 -85 138 -52 -99 137 76 77 -108 -79 -116 -105 -86 79 -28 -88 -31 -20 -155 -29 94 -4 -31 99 69 31 -243
5692 -243 -20 65 34 -185 -71 148 7 107 8 1 67 -53 -118 168 -126 -103 116 77 -10 -234 11 -9 -75 3
5716 3 -89 -224 56 -248 48 46 41 -180 142 -89 -20 -63 63 -78 -14 34 -111 51 186 91 -101 -154 185 -87
5740 -87 -97 125 -88 -124 -78 -31 -202 -78 152 -26 72 96 -191 -2 -69 195 -203 189 -64 75 -174 70 94
5763 94 -153 -51 133 108 -148 -350 95 82 -186 -1 -141 77 -50 120 39 -201 -162 -107 -80 -183 -239 13 229
5786 229 180 100 -54 0 116 185 230 102 -21 -58 -175 -18 -53 -281 106 164 -74 84 0 18 233 78 5 -138
5810 -138 92 26 -154 -116 -149 -275 -129 166 158 -98 -43 126 46 -2 -120 -28 23 13 119 24 -115 -127 -93 38 -95
$$ packed form
5644d3LJ74k32J18j63J97r6J00k28K74k00K34o2l49J79K17j79m3J13J53k15j7
5666f5k0K23j90m7K36o1Jj85K9l7J1J9J65j07o0N7J1j35J26J23r8k7J30l0l8k74
5692b43K23Q5l1k19J14K19j41J00r9pO6j20o5K86k94K3K19l9q7k24K45k0o6P8
5716Cr2j35K80l04K96knk21L22k31O9m3J26j41O4M8j45J62J35r5j92n3L39k72
5740h7j0K22k13l6M6M7j71J24K30j78R8K4k87J89o7K64l98L92k53J39k49K44K4
5763I4k47J02J84k5k56k02M45j3k68J85j40K18j27J70q1k40L9N5K7j03n6K52K16
5786B29m9q0j54N4J16O9M5j28j23l7j17J57l5k28L87N8k38J58q4J8K15j55p3j43
5810a38K30o6j80L8l3j26J46K95qk56N5J69q0m8j18R2N1j0J06r5j39j2L4J31j33
$$ plain form
5835 -95 -28 -51 -78 48 -69 49 -120 44 239 171 173 52 -92 -9 -134 33 88 -188 -2 -67 6 -134 -44 49
5859 49 38 26 88 58 -178 22 43 -54 -87 83 -5 -133 -87 68 -18 17 -17 101 -24 221 -57 -4 93 -46 106
5884 106 -18 43 281 -112 192 -72 -110 -42 2 -158 -162 20 -26 -4 84 -66 61 79 139 -29 -116 245 79 -66
5908 -66 -79 -250 -141 -99 4 -40 185 -9 -107 -40 80 77 -31 39 129 92 -16 32 32 64 16 -115 17 21 63 -149
5934 -149 -123 -128 147 -38 -19 -24 123 188 -47 -4 130 -99 -8 -62 139 162 -10 -15 85 -1 149 -64 47 -122 95
5959 95 85 104 28 99 134 42 -1 25 -58 -4 -108 149 -146 -121 -64 -20 112 22 -7 291 58 30 54 120 -8 38 -160
5986 -160 130 77 -65 171 211 -281 -9 -166 -23 -33 -71 17 115 -3 91 -14 206 -74 -82 -1 -156 94 -26
6009 -26 87 -5 -1 -192 126 101 112 154 -158 -91 -259 26 73 20 142 -97 -82 221 7 43 134 -85 122 1
$$ packed form
5835i5O7k3k7J26j17J18j69J64J95o8Kj21j44Q3j25J67N5k76J86o5P3j40R0R3
5859D9j1j2O2l0k36K00K1r7l3J70q8j28M6J55q6L5l4J18j25K45k78N3R7j39J52
5884A06j24O1K38l93L04k64l8O8M4j60mJ82m6K2Q8j50J27J8O0j68q7L61j66j45
5908f6j3j71J09M2J03m4K25j94r8O7J20lj08P0R0l7j08M8%L2m8j31J32MM2k12
5934a49K6nK75j85J9nJ47O5k35M3J34k29R1n4K01K3j72nJ00q6J50k13J11j69K17
5959I5j0J9p6P1L5r2m3K6q3N4j04K57k95K5N7M4J32r0k9K98k33k8K4O6j28M6j98
5986a60K90n3j42K36M0m92K72j57J43j0l8Q8R8j18R4j05K20k80qQ1j55K50j20
6009b6J13r2Mj91L18k5J1M2l12O7j68K85M7n3J22k39J5L03k14L6R1k19K07j21
$$ plain form
6033 1 -28 -22 205 56 -106 -213 112 293 102 138 126 -28 73 -170 4 10 102 -126 -82 48 107 -67 -41 -150
6057 -150 121 9 -240 -82 46 -140 -63 243 -173 26 108 -30 221 -140 53 109 34 -49 -113 -79 62 151 -104
6080 -104 -43 -60 120 -184 -63 4 52 -160 132 -113 -39 152 63 -128 186 -89 98 106 84 -144 -146 33 -139 48
6104 48 -86 94 38 -159 50 194 97 195 40 89 -83 49 76 72 -96 109 6 85 -5 -41 73 72 47 47 136 86
6130 86 49 -35 -54 -69 12 0 57 23 -28 8 -106 9 -24 109 -203 -73 289 -41 -59 -198 -20 -335 -47 -187
6154 -187 -13 58 -199 53 20 -21 -64 94 37 -207 204 34 18 267 -13 169 113 1 45 -59 30 -257 -20
6177 -20 -136 -19 -119 -19 115 73 234 -48 -7 -39 9 -132 78 -139 95 116 200 85 -178 -9 -89 74 55
6200 55 -29 -65 262 -108 -15 56 -196 11 -82 -34 -18 -33 -122 161 -13 52 -164 -79 132 -108 -69 -3 68 75 -30 -94
$$ packed form
6033Ak9OK27j49j62j07L25J81j91L6j2j54J01k43J74OR2k28M4J30N9j74K6j09
6057a50K71j12k49J58J28j86P7L06m16J99Q2j38K51l61J93N6p5q3o4L4J41Q9k55
6080a04O1j7J80l04J21O7M8k12K92k45P4J91q9j91L14k75J87Qk2k28kJ79j72J87
6104D8j34J80n6j97K09J44r7R8j55M9j72J32K7mj68K05j03P9r0l6J14jk5%Q9n0
6130H6l7q4j9j5Q1j2N7l4n1L6j14J15l3J33l12J30L62l30j8j39J78l15K88j40
6154a87J74P1k57K52l3m1m3J58n7k44M11j70j6K49k80J82n6j12M4j04Q9k87K37
6177b0j16J17j00J00J34m2J61k82M1l2M8j41K10k17K34K1Q4j15k63J69q0J63j9
6200E5q4l6L27l70R3P1k52K07r3M8J6j5q9K83j74O5k16Q5K11k40L9O6P1Pj05o4
$$ plain form
6226 -94 -87 137 276 -221 -197 -13 -29 -116 173 -131 22 -1 9 238 61 131 164 112 11 -146 -14 194 -166 54
6250 54 89 -84 25 -72 -55 -126 -59 -122 -9 81 57 153 -195 -40 -32 137 14 -53 -237 -302 25 24 -89 -94 102 -72
6276 -72 109 179 -7 198 -89 -2 57 195 -91 37 18 38 16 -28 5 -85 -10 38 -59 -114 -129 -78 21 126 131 -132
6302 -132 18 -241 -51 -26 141 48 -123 -259 205 -90 -70 11 -4 -110 102 -191 -139 -17 -13 62 -57 15 89 116
6326 116 -3 -189 81 -13 100 170 -55 175 7 -154 37 -117 18 33 95 102 38 95 127 92 -152 0 90 109
6350 109 -17 -2 -109 151 12 70 32 -54 120 112 105 10 -144 229 2 3 27 104 29 -126 -57 37 -140 -50 2 -71
6376 -71 -62 53 59 159 40 44 -17 10 -158 -4 -63 -101 -10 -264 -19 -28 144 -66 -137 -79 15 -91 -13 -60 116 128 139
6403 139 148 -96 72 9 -149 173 -160 24 42 -247 -199 67 124 -99 -139 -6 213 -68 77 -155 37 28 80
$$ packed form
6226i4PK24J39m97K4J84j6q7K89l04J53k3J0K29j77P0L3n2j01j57J32K08l60K20
6250E4L5j73J09r7J7p1O7o3J13R0k4R6l48J55QJ69j23o7j84o5L27jj13nJ96j74
6276g2J81P0j86K05k87Q7N9J38k86J28j9K0k2m4L3r0P5M8r7n5j5N1R9J05Nk63
6302a32J50k59J90K5J67r3j71j36M64k95K0Q1j5j06K12k93N2J22MP5j19P2P4K7
6326A16j19j86K70r4J13P0k25K30j68j61J91j54J35J5O2Po4N7L2l5k44J52R0J9
6350A09j26J5j07K60j39N8l8q6J74qpr5j54L73k27JK4P7p5j55O9R4j77R0N2p3
6376g1RJ15OJ00j19Mo1K7j68J54n9l8R1k54K45rJ72k10p1N8R4j06P8m7J76J2J1
6403A39Rk44J68o3j58L22l33J84J8k89M8K66N7k23m0J33K19k81J45k32J92rN2
$$ plain form
6426 80 -26 -76 -61 -156 125 -179 39 -111 198 31 163 -104 203 -20 68 -107 51 -22 -88 3 -112 -96 88
6449 88 80 90 -25 -58 -23 8 156 -284 95 -88 -9 83 -76 -63 -57 26 -116 -150 213 -18 -20 -6 36 24 -226 93
6475 93 93 -8 40 11 -168 34 -26 -13 -122 -231 40 -143 136 -31 102 64 9 225 89 0 172 135 75 122
6499 122 -158 -145 -110 83 66 49 129 -164 -25 90 -160 69 -83 194 159 -93 -41 39 -28 33 -92 58 143 63
6523 63 8 108 -37 46 111 72 71 4 -199 184 -107 -14 152 6 -53 74 -91 -67 -148 -100 60 25 167 152 182
6548 182 -25 -106 -46 -127 -77 -166 86 65 143 31 -1 81 -77 84 141 3 117 66 123 -65 181 -187 -146 -91 -116
6573 -116 -26 7 87 170 172 -43 -177 32 -189 107 110 24 -139 -111 182 -158 24 270 -20 81 -60 -197 81
6596 81 34 -207 244 127 -42 25 -80 -85 -128 -73 -10 44 -18 132 83 181 -5 147 -6 -49 -102 116 4 7 -33 -85
$$ packed form
6426H0j06n0J5r5K81l04K18j50L09j67J32k67L07k23Q8j75J58p3o6R1j15J6J84
6449H8qJ0j15l3L5L1J48m40L79j83P9R2j59J3OQ3j42l4L63k31kJ4M2j2k50L19
6475I3%j01M8k9j79K02o0J3j09j09K71j83K79j67J33l8n5K16j36q9J72l7o0M7
6499A22k80J3L5J93j7j7Q0k93J39J15k50K29j52K77l5k52N2Q0o7O1j25J50Q5q0
6523F3n5J00j45Q3O5l9jo7k03L83k91R3J66j46n9J27j65K4q1M8J60l5J42j5L0
6548A82k07q1O0q1N0q9K52k1P8j12l2Q2j58J61N7j38J14n1N7j88K46l68M1N5k5
6573a16R0L3Q0Q3Kk15j34K09k21K96Lq6j63K8K93l40J82K46k90J01j41j37K78
6596H1m7k41M51j17j69O7j05nm3N5O3N4o2J50m9R8j86J52j53m3n3K18j12Lm0n2
$$ plain form
6622 -85 -26 -129 53 -20 -5 -66 277 -245 105 -14 24 -22 74 73 95 64 -75 183 -34 84 37 97 193 -34 11
6647 11 223 -112 -89 197 -54 36 -220 -57 198 19 9 1 105 65 -206 70 91 -173 116 30 61 -58 -39 92
6671 92 92 -23 -57 -27 52 -8 -82 -249 -36 25 54 27 58 -115 -75 31 -13 -49 -145 -99 -110 12 61 30 -233 17 227
6698 227 -13 125 -262 35 73 -85 -39 247 43 51 -62 -22 -11 -90 -29 -8 -48 110 -39 -130 -65 -134 49 70 -2
6723 -2 -107 -165 64 -85 -41 16 -72 -34 -44 -106 -42 293 -7 70 130 -136 10 52 95 -94 105 -29 -88 224 -103
6748 -103 102 -52 -39 6 228 108 -65 -79 104 -31 -139 -5 -27 76 -136 -77 221 -63 156 119 13 141
6770 141 109 87 -23 -149 -36 29 -248 102 60 105 86 190 119 83 111 35 -162 18 23 -195 197 -79 55 -46
6794 -46 47 -4 -49 23 2 -35 59 -113 -75 131 -61 99 87 -124 -30 -203 -99 90 121 136 -76 -173 -8 -45 17
$$ packed form
6622h5N9j03J82p3J5o1L43n22L50j19L8m6R6jK2l1j39K58k17J18m7O0R6k27M5
6647A1K12l35K3K86k51R0k56J63K55j79j0qJ04m0k71K76K1k64K89q6L1j19J9J31
6671I2%j15l4L0P9o0p4j67K13O1K9k7L1j73M0J06m4l6r6M6j1J22M9l1k63K50K10
6698B27k40J38l87K97L8j58M6K86k04Qj13M0J1p9O1K1m0J58j49r1O5o9J83K1p2
6723bj05n8K29j49M4N7q8L8j0o2O4L35l00P7O0k66J46M2M3j89J99j34n9L12l27
6748a03K05j54J3M5K22j20j73j4J83j35j08J34k2J03k12N9K98k84K19l7j06J28
6770A41l2k2j10j26J13O5k77L50m2M5j9J04p1l6K8p6j97J80Nk18L92k76J34j01
6794d6R3n1m5P2k1l7R4j72L8K06j92J60j2k11R4j73J04J89L1J5k12r7J65l7O2
$$ plain form
6819 17 -79 -301 -159 -95 13 66 -41 -180 -7 180 46 44 -315 -68 216 250 173 -72 -68 -73 145 162 6 62 -115
6844 -115 157 -62 25 74 -37 29 30 -173 -95 -127 -117 -123 -74 136 -83 -214 170 -129 216 -38 -71 -105 10 -97
6868 -97 250 69 -55 -19 -22 -178 135 112 16 -115 116 -16 -77 24 143 29 -20 226 -54 154 -138 -17 -43
6891 -43 -159 6 171 -116 -59 57 165 -41 -95 99 -60 152 -10 134 37 -198 127 -74 -200 65 -43
6912 -43 39 -54 29 21 -231 -18 0 88 44 62 92 -69 -301 -46 3 -80 61 -79 -37 -55 -119 -29 -252 29 63 -50
6938 -50 96 20 94 -35 80 30 17 -128 -46 91 114 249 -19 -161 97 -62 81 -110 359 -198 0 70 77
6961 77 168 34 187 -127 185 2 -98 -8 -2 86 15 15 -45 -20 35 -40 100 120 105 49 -205 -84 90 -129 17
6986 17 10 -14 106 -2 -44 -2 92 -112 -171 5 -52 -2 -88 227 -53 -45 -6 -77 -174 -1 -148 49 -34 70 -206 140
$$ packed form
6819A7r6k22J42O4J08N3j07j39J73J87j34kl59K47K84L4p7k45MnK18J7j56N6j77
6844a15K72k19Q7M9j11O6Jk03P8l2J0oM9K10k19j31L84k99L45k54l3l4J15j07
6868i7L47j81j24L6lj56L13k3r6j31K31j32o1J01J19j14m9K46k80K08k92J21k6
6891d3j16J65J65k87N7J16J08k06n4J94j59K12j62J44r7k35L25k01j26K65j08
6912d3Q2r3Q3qk52K13J8Q8m4J8L0j61k32K55M9q3J41j40M2j8o4R0k23K81L4j13
6938e0J46p6P4j29J15n0j3j45Q2J37K3J35k68j42K58j59J43j91M69n57J98P0P
6961G7R1j34J53l14L12j83j00R0OQ8p1%o0K5N5p5J40K0j5n6k54J21J74k19J46
6986A7pk4J20j08m2M2R4k04n9J76n7N0q6L15k80QL9p1r7J73j47J97q3J04k76L46
$$ plain form
7012 140 -158 128 -61 60 -122 -91 196 116 16 -65 135 64 204 -158 -99 -115 176 71 121 22 -195 16 69
7035 69 -106 -4 301 50 -73 183 -83 -62 -72 -94 97 -117 -38 64 -21 -72 145 -188 -224 -95 184 -53 -167
7058 -167 7 -197 -47 -148 -53 -67 -97 -210 -47 8 -91 132 81 90 47 -65 88 -104 27 350 -16 118 -139
7081 -139 27 -47 46 -106 -233 -40 -122 -92 308 45 42 -43 0 -209 96 -58 -90 151 -48 -88 -68 74 202 -92
7105 -92 32 -109 -148 186 -271 215 60 140 150 3 -45 175 -73 -52 75 58 137 -56 -69 61 195 -9 -1 150
7129 150 34 -236 -175 18 85 -98 107 -99 -205 -91 -178 80 69 -36 -196 -137 59 -66 -129 -107 -102 311 19
7152 19 110 61 -151 26 17 127 -178 -34 -41 -153 -49 122 -170 -17 -116 53 97 -223 33 104 45 -26 95 -235
7176 -235 9 -257 141 -15 -328 24 -17 134 225 -85 84 186 71 -31 13 -228 85 -53 -69 -62 -135 178
$$ packed form
7012A40k98K86j89J21j82L1K87q0j00q1K00p1J40l62N9j6K91j05N0r9k17K11N3
7035F9j75J02L05k51j23K56k66K1j0k2J91k14P9J02q5n1K17l33l6J29K79k37j14
7058a67J74k04J50j01R5j4l0j13J63N5r9K23n1Rm3j12J53j92J31L23l66J34k57
7081a39J66p4R3j52j27J93q2L0M00k63lq5M3k09L05j54l2K41j99m0K0J42J28k94
7105i2J24j41l9L34m57M86j55Q0J0j47m8K20k48K1J27j7P9j93j3J30J34k04QJ51
7129A50j16k70O1J93O7j83K05k06j06J14q7K58j1j05j60N9J96j25o3K2NM13k92
7152A9R1m9k12J77rJ10l05J44pj12J04J71k92J53r9J69M4l20K56P1n9p1J21l30
7176b35K44k66L98j56l13L52m1J51R1l10J69J02j15j02M4k41L13j38j6Pp3L13
$$ plain form
7198 178 -230 -5 131 -195 26 -137 -1 158 140 22 -145 -45 44 27 -233 113 -79 -84 45 -121 -19 -71
7220 -71 39 70 87 -18 -9 163 68 131 -111 3 -86 -13 51 -88 -161 105 -4 80 146 7 4 -9 -82 101 -126 -90
7246 -90 -41 -42 44 40 -28 -260 -81 30 -159 43 17 -246 114 -25 -54 -11 93 -87 78 -51 -169 57 -143 -40
7270 -40 -33 127 65 -192 -105 -111 -87 -104 -237 -18 12 68 14 23 129 -182 82 36 242 28 -13 57 194 144 -73 216
7296 216 -147 76 -116 -121 -42 -133 106 20 102 45 -94 -7 298 -64 -150 -4 64 151 -140 -116 -267 -261 167 30 21
7321 21 -6 112 105 218 -24 53 270 -106 -15 104 -46 -119 -244 -238 297 -64 7 39 22 144 118 -63 -256 130
7345 130 -215 52 90 -72 57 -16 -23 -97 -65 78 139 -178 6 -137 188 -99 199 36 258 -23 -125 142
7367 142 64 141 139 -6 157 65 -62 -187 72 40 -81 161 5 -187 -62 213 -42 18 -46 -29 -7 61 70 -128
$$ packed form
7198A78m08K25J36l26K21j63J36J59j8j18j67J00Q9j7k60L46j92nJ29j66J02n2
7220g1J10L1J7j05RJ72r5O3k42J14q9P3O4j39p3K66j09Q4O6j39lj3p3J83k27L6
7246i0M9jQ6mo8k32J79J11j89K02k6k63L60j39k9M3J04j80J65j29j18K26k00J03
7270d0PJ60o2k57Q7oK4j7j33K19L0N6n4RJ06l11K64m6K06k14m1P0J37n0k17K89
7296B16l63K23j92nP9r1K39q6Q2n7j39Q7L05l62q6J46O8Q7k91K4j51OM28j37r
7321B1k7J18pJ13k42P7K17l76R1J19j50p3j25ON35l61P1L2j7J22k6j81j93L86
7345A30l45K67L8j62J29p3pp4L2J43O1l17J84j43L25k87K98j63K22k81j02K67
7367A42p8P7kj45J63r2j27j25K59l2j21K42j56j92J25K75k55O0o4J7K2O8Rj98
$$ plain form
7391 -128 -13 -167 122 115 33 9 -215 239 -178 7 -119 -126 -53 101 121 -20 118 38 45 41 21 47 2 38 -43 72
7417 72 64 -20 -165 86 193 -124 -6 -20 -212 325 132 61 -80 -92 29 12 168 34 50 45 98 -117 145 -32
7441 -32 -94 292 109 -51 -293 25 -11 198 -187 74 51 -24 -79 -196 120 -43 -23 59 -58 83 32 -225 -62
7464 -62 47 -158 -55 -49 -18 -53 -99 -52 -18 193 40 -23 -28 9 47 97 46 266 21 -216 -86 52 93 -33 -107 -8
7490 -8 -110 132 -69 45 -121 -255 14 -171 118 120 36 48 127 73 -52 146 -184 77 -183 5 6 60 75 -81
7514 -81 -17 -56 6 -15 -47 -173 29 -56 15 128 -55 15 144 -9 -104 -275 161 -342 -39 9 50 -86 -67 -110 -60
7539 -60 -380 -88 78 2 35 -2 283 157 -13 -123 56 62 -55 -31 -15 -199 -105 -107 111 -5 12 59 33 -10 -98
7564 -98 -127 -16 48 174 -109 22 -170 156 180 -19 112 -23 -32 -166 -112 -66 -76 -93 -159 22 16 76 42 33 90 166
$$ packed form
7391a28J15j54K89pq2k4k24M54m17J85j26pP3J54K0j41J38q0Pmk0K6m5L6q1J15
7417G2qq4j45K51J07l17J18j4j92N37j93p1j41j2J21j7J56j34J6nN3k15K62j77
7441c2o2L86j83j60k42L18l6K09l85K61k3p5n5j17L16j63K0Q2j17J41n1k57J63
7464f2J09k05J03OL1l5m6M7L4K11j53o3nL7L8N0n1K20k45k37J30J38M1j26p4R9
7490hj02K42k01J14j66j34K69j85K89Kq4J2P9n4j25J98l30K61k60J88JN4J5j56
7514h1O4l9O2k1l2j26K02q5P1J13j83P0J29j53r5j71M36n03L03M8M1j36J9m3N0
7539f0l20K92J66p6L3l7K85j26j70j10J79Oj17K4J6j84R4kK18j16J7M7k6m3q8
7564i8k9J11O4J26k83J31j92L26K4j99J31j35rj34N4M6j0j7o6J81oO0l4rN7P6
$$ plain form
7590 166 -47 124 114 159 -114 -116 41 26 -170 -13 43 -7 187 -76 -91 -74 -66 112 38 -7 -39 112 150 32 93
7615 93 -13 58 94 141 78 57 -2 -192 77 -83 4 -127 67 69 -204 -34 114 -28 97 90 6 38 78 -78 175
7640 175 -59 -170 -25 88 -39 61 130 211 31 52 83 -69 18 -108 9 -45 -98 -20 -168 84 227 -130 7
7663 7 43 135 55 44 221 138 -85 85 131 106 -18 206 -63 55 -112 -212 -49 -116 -74 74 54 152 -80 106
7687 106 127 -105 86 85 -172 123 -118 47 78 -3 169 -349 -154 -115 174 -59 97 22 20 43 29 -5 18 15 74
7712 74 248 22 -22 -74 -92 124 5 162 119 40 -130 -32 204 -75 -144 214 -63 18 49 -239 -48 241 -214
7735 -214 149 95 32 51 192 127 54 48 -42 6 -179 79 227 -109 -76 -82 -257 -97 96 114 15 -202 35 27 -95
7760 -95 -91 84 -33 34 -75 -109 136 -55 87 -110 211 -111 -50 -4 -52 127 85 -142 3 156 -242 -114 -122 -39
$$ packed form
7590A66k13J71j0M5k73kJ57j5j96J57N6n0J94k63j5J7QJ78p4m5l2J51L8j18O1
7615I3j06P1L6M7o3k1n9j90K69j60Q7j31J94Kk73J70J48j42J25pq4L2M0j56K53
7640A75k34j11J45J13j27J00O9Q1j80K1L1j52Q7j26J17n4n3P8j48K52J43l57J37
7663GL6R2q0j1J77q3k23J70M6k5j24K24k69J18j67j00J63o7M2J48k0R8k32J86
7687A06K1k32J91jk57K95k41J65L1q1J72n18J95L9K89k33J56p5kK3j4l4K3lN9
7712G4J74k26m4n2j8K16j19J57m3p9j70R8K36k79o9L58k77Q1L1k88J91K89m55
7735b14L63n4o3J9J41o5p3or0M8j85K58J48l36L3oj75J60J93J8r9k17K37qj22
7760i5MJ75j17O7j09l4K45j91J42j97L21l22O1M6m8J79m2k27J45J53l98J28qQ3
$$ plain form
7784 -39 63 -137 304 36 -123 -42 158 -14 -128 -58 145 -4 -78 33 9 -10 -48 78 113 -93 -63 -138 215
7807 215 179 -245 -14 159 84 49 87 7 -122 183 72 -10 -93 -141 88 -143 227 -67 135 -93 -18 -43 -33 43
7831 43 -10 56 -193 82 28 -2 -187 -26 -110 45 -23 12 42 25 64 7 -10 2 77 -31 -277 -7 -108 -111 41 56
7857 56 77 -177 180 -103 0 -118 138 43 13 -46 -124 74 110 34 -41 246 116 -83 7 -120 38 69 76 7 4
7882 4 157 -75 -67 89 76 -33 42 147 -180 60 -111 -273 124 9 143 -66 -128 8 51 -58 87 -253 1
7905 1 -61 243 -124 100 216 49 54 -306 -179 -25 15 15 -208 3 -184 -49 333 -40 -146 126 123 52 -141 -6
7929 -6 47 32 117 74 -115 -149 11 55 31 46 -76 -94 -72 -103 -42 283 17 -103 48 -124 33 68 -1 -55 6 -2 32
7956 32 -151 -63 56 285 -76 -56 139 -131 206 -36 -59 128 222 208 92 -25 173 93 39 101 -78 5 -86 21
$$ packed form
7784c9J02k00M41k68j59Q1K00j72j14P0K03j49p4J11k4j9l8J26L5k06L0p5L53
7807B15l6m24K31J73p5l5L8q0j29L05j11q2q3m8K29k31L70k94K02k28P5k5J0P6
7831D3n3O6k49K75n4l0j85J61q4J55o8L5L0j7L9n7j7J2P5j08k46K70j01lJ52J5
7857E6K1k54L57k83J03j18K56r5l0n9p8J98L6p6p5K87j30j99R0j27J58L1Po9l
7882DJ53k32QJ56j3j09P5J05l27K40j71j62L97j15J34k09o2J36M3j09J45l40K54
7905Ao2L04l67K24J16j67Nl60J27J54M0%k23K11j87J35L82l73j06K72lp1j93J35
7929fN3j5Q5m3j89l4J60M4k4J5j22j8K2l1O1L25k66j20J51j72J57L5o9n4O1qL4
7956C2j83Q8J19K29l61K0J95k70L37k42k3J87R4j4j16j17J98q0n4O2j79Q3r1J07
$$ plain form
7980 21 122 -116 62 -127 85 159 -152 -147 80 -166 -148 62 94 -41 -159 -272 -58 -178 -26 36 -71 71
8002 71 -61 -50 -70 18 -115 -124 105 37 85 48 137 181 -73 157 -70 -83 -68 -58 7 -309 -45 142 -203 147 143 -50
8028 -50 29 53 152 -248 -224 -236 41 -7 72 -13 127 -14 -46 196 75 -119 60 84 36 -51 2 -147 0 30 183
8053 183 28 77 118 85 22 -26 -22 112 47 -57 33 35 5 6 40 266 -58 -44 -19 136 -160 26 -109 -148 -60 -34 29
8080 29 84 11 -25 11 -13 129 16 -14 -37 -98 -17 130 -166 -12 175 -134 -90 137 22 -35 -66 -211 -1 -46 80
8105 80 133 -57 54 -9 45 9 -89 -99 -3 -43 165 -123 -50 -196 35 135 -95 42 146 -151 -39 114 -188
8128 -188 31 46 163 -84 77 160 138 -139 167 -208 60 -190 138 -39 -50 -114 121 144 78 -8 -44 -20 -40 -10
8152 -10 77 -18 -189 90 -28 -99 -148 -159 113 102 133 -54 -100 -28 -151 -12 206 104 25 -32 -177 21 220 -82
$$ packed form
7980B1J01k38J78j89K12P4l11NK27k46J8K10L2j35j18j13K14j20J52O2j07J42
8002G1j32J1k0Q8j33rK29o8M8l7Q9M4k54K30k27j3J5J0O5l16K64J87l45L50mj93
8028e0P9K4R9m00K4j2K77m8P9q5J40j41l2K42j21j94J79K4m8q7N3j49J47L0J53
8053A83j55M9M1l3o3m8MJ34o5j04R0Kl0JL4K26l24J4K5J55k96J86j35l9Q8K6O3
8080B9N5p3l6L6k4J42j13l0k3o1Q1J47k96J54J87l09M4K27j15n7l1j45K10m5J26
8105H0N3j90J11o3N4l6r8j0R6m0K08k88P3j46K31J00k30J37J04k97J12J53l02
8128a88K19J5J17k47J61Q3k2k77L06l75K68k50L28j77j1o4K35K3o6q6l6K4k0L0
8152a0Q7r5j71K79j18p1m9j1K72j1L1j87m6P2j23J39K18j02p9n7j45J98J99l02
$$ plain form
8176 -82 -40 -14 -82 -36 27 111 87 123 -184 80 1 -95 93 -159 36
$$ packed form
8176h2M2K6o8M6O3Q4k4L6l07K64p9r6J88k52J95
8191C6
$$ Imaginary data points
##PAGE= N=2
##DATA TABLE= (X++(I..I)), XYDATA
$$ plain form
0 0 0 0 0 0 0 0 0 0 0 0 0 0 0 0 8 -8 8 -8 8 -16 16 -16 24 -25 32 -40 43 -48 56 -65 78 -88 99 -112 127 -143
36 -143 160 -180 201 -224 249 -278 307 -341 377 -417 460 -506 560 -617 680 -746 825 -909 1004
55 1004 -1112 1234 -1372 1538 -1730 1959 -2245 2598 -3063 3694 -4610 6071 -8768 15459 -72571
70 -72571 -67433 18333 -52890 -30902 8375 -1918 -5379 42035 37161 24501 38591 32378 -5251
83 -5251 18293 38274 505 -1967 28793 -13801 -41869 -11031 -11926 -32335 -15431 -12924 -25388
96 -25388 -17495 2233 13899 27195 26269 2891 2652 40725 38312 2015 3854 6297 -16967 -13269
110 -13269 -8126 -20743 -12577 -7625 -23998 -17305 4972 7684 2244 11051 12943 -6889 -8828 14328
124 14328 13722 5414 12098 -840 -13181 -121 4721 -1083 -6630 -22491 -28302 -15553 -3629 816
$$ packed form
0@%%%%%%%%%%%%%%Qj6J6j6J6k4L2l2M0m9N7p2Q3r1J04j21J43j66J87k11K39k70
36a43L03l40L81m25M73n27N85o48P18p94Q77r66J066j177J297j426J571j734J913
55A004k116K346k606K910l268L689m204M843n661O757q304J0681j4839K4227q8030
70g2571N138Q5766p1223K1988L9277j0293l461M7414m874j2660J4090o213l7629
83e251K3544J9981l7769k472L0760m2594k8068L0838q95k0409J6904K507j2464
96b5388P893J9728J1666J3296r26k3378k39L8073k413l6297J839K443k3264L698
110a3269N143j2617Q166M952j6373O693K2277K712n440Q807J892j9832j939K3156
124A4328o06q308O684j2938j2341J3060M842n804n547j5861n811J2749J1924M445
$$ plain form
138 816 -325 5726 15074 11241 13330 23746 20208 13995 8305 -3058 -4390 -1990 -1561 1494 -6352
153 -6352 -16239 -12878 -12093 -8004 2964 -1681 -9900 -8909 -5295 3565 11898 11622 7459 535 2686 9587
169 9587 5465 6827 8563 -5276 -10301 -6165 -9897 -5409 1001 -4087 -6748 -4788 -2040 5126 9147
184 9147 8929 2016 -7290 -3714 -137 -1763 3788 620 -7702 -1697 2440 2758 10358 7711 -1275 -867
200 -867 314 1064 3284 4980 4821 -2355 -4672 1073 -945 -748 3321 -7541 -14351 -8090 -7959 -4425
216 -4425 3516 883 -3599 -837 4998 10334 10444 10068 7443 -1440 -654 3149 -1271 -306 -345 -9597 -9697
233 -9697 -5035 -4317 -492 961 -1288 -2790 -4710 622 6757 5653 6082 3706 -884 3714 6879 5519
249 5519 5920 -1006 -7783 -6443 -6627 -4693 -2321 -5938 -6009 -3603 -2509 4173 8351 7571 7025 2209 820
$$ packed form
138H16j141O051R348l833K089J0416l538o213n690j1363j332K400M29L055p846
153f352r887L361P85M089J0968m645q219R91L614Q860Q333k76m163o924K151O901
169I587m122J362J736j3839n025M136l732M488O410n088k661J960K748P166M021
184I147k18o913r306L576L577j626N551l168q322O005M137L18P600k647q986M08
200h67J181P50K220J696j59p176k317N745k018J97M069j0862o810O261J31L534
216d425P941k633m482K762N835N336J10l76k625q883P86L803m420R65l9r252j00
233i697M662P18L825J453k249j502j920N332O135j104M29k376m590M598L165j360
249E519M01o926o777J340j84J934K372l617p1K406J094O682M178p80n46m816j389
$$ plain form
266 820 4266 2818 3027 2274 -5201 -6636 -4880 -4590 -150 -512 -5391 -6064 -6316 -3139 2612 2820 3491
283 3491 3570 585 4818 9408 8264 8227 4322 -1489 -2537 -3929 -3649 -2075 -6789 -8861 -8193 -8371 -2098
300 -2098 2863 2032 2812 1676 697 4913 6616 7087 6502 1297 -351 680 -89 3256 2127 -4426 -5938
317 -5938 -6970 -7163 -2936 -2195 -2659 -2783 -4549 -446 4873 5886 8650 6981 1995 2628 2349 1628 3284
334 3284 -53 -4302 -5718 -6957 -3556 -742 -2009 -784 -2600 -4863 -524 2767 3350 4211 1204 210
350 210 2552 2622 4914 5440 1099 -628 -2901 -4293 -534 -1008 -3813 -3743 -5448 -4725 -280 1954 4355
367 4355 3729 -142 1230 2853 2731 5244 2751 -1492 -2151 -3560 -2212 1159 -211 -1079 -2580 -4467
383 -4467 -1621 114 643 2979 157 -2711 31 1495 3419 4891 2156 74 -718 -1819 372 907
$$ packed form
266H20L446j448K09p53p475j435J756K90M440l62m879o73k52L177N751K08O71
283C491P9k985M233M590j144l7l905n811j048j392K80J574m714k072O68j78O273
300b098M961q31P80j136r79M216J703M71n85n205j648J031p69L345j129o553j512
317e938j032j93M227P41m64j24j766M103N319J013K764j669m986O33k79p21J656
334C284l337m249j416j239L401K814j267J225j816k263M339L291N83Q61l007r94
350B10K342P0K292N26m341j727k273j392L759m74k805P0j705P23M445K234K401
367D355o26l871J372J623j22K513k493m243o59j409J348L371j370q68j501j887
383d467K846J735N29K336k822k868K742J464J924J472k735k082p92j101K191N35
$$ plain form
399 907 -1249 -2259 -5081 -5088 -942 -317 1144 2249 -540 -331 1597 2226 4742 3931 304 -744 -1729
416 -1729 -662 1868 1015 183 -1848 -4955 -2078 26 -526 1186 -500 -3747 -1313 342 1697 4102
432 4102 2824 549 122 -224 1802 1756 710 518 -3113 -4651 -761 -434 -312 1733 -1096 -2961 47
449 47 1363 2443 2941 923 -957 -2265 -523 2181 445 -74 -140 -3523 -2140 1217 112 574 691
466 691 -2198 -1825 -18 1327 2924 2457 942 -170 -940 1895 2612 349 212 -2251 -4803 -1912 -299
483 -299 -858 555 -956 -2608 -414 1068 2203 2749 1361 780 -591 -132 2613 1492 717 1023 -2364
500 -2364 -3037 -16 -234 -281 -136 -2841 -3209 -1450 585 2104 1300 185 298 -709 1566 3507 1640
517 1640 946 -311 -2323 -655 167 -650 225 -1098 -2341 -1241 -660 748 2204 680 -58 -440 -669
$$ packed form
399I07k156j010k822pM146O25J461J105k789K09J928O29K516q11l627j048r85
416a729J067K530q53q32k031l107K877K104n52J712j686l247K434J655J355K405
432D102j278k275m27l46K026m6j046j92l631j538L890L27J22K045k829j865L008
449D7J316J080M98k018j880j308J742K704j736n19o6l383J383L357j105M62J17
466F91k889L73J807J345J597m67j515j112p70K835P17k263j37k463k552K891J613
483b99n59J413j511j652K194J482J135N46j388n81j371M59K745j121p75L06l387
500b364o73L021k18m7J45k705l68J759K035J519q04j115J13j007K275J941j867
517A640o94j257k012J668Q22q17Q75j323j243J100N81J408J456j524p38l82k29
$$ plain form
534 -669 1132 2136 1580 884 -1779 -1676 833 415 412 185 -2401 -2666 -1014 -719 351 716 -371 192
552 192 237 1039 2586 1979 2020 915 -1564 -600 -7 -384 971 -1057 -3058 -1643 -1380 -703 1390 535
570 535 -1522 -1061 -69 1666 2127 1538 1449 131 -99 1359 420 1009 1470 -1376 -1805 -412 -1822 -718
588 -718 632 -663 -1629 -1223 -331 847 1581 1929 533 -1200 360 1513 228 1384 257 -2589 -982
605 -982 358 -743 321 434 -1007 -1015 -630 231 538 931 1188 -81 -937 1282 992 805 1729 -297 -1836
624 -1836 -602 -580 -327 563 -774 -1516 -1286 -561 1004 712 810 537 -540 525 1644 492 1054 1165
642 1165 -1193 -855 -287 -609 343 144 -1360 -1260 -1208 -490 532 231 684 -378 -1079 588 1433 850 1923
661 1923 430 -720 242 105 199 373 -677 -1452 -1086 -1246 201 324 203 538 -800 -534 1049 774
$$ packed form
534f69J801J004n56o96k663J03K509m18lk27k586k65J652K95J070L65j087N63
552A92M5Q02J547o07M1j105k479R64N93l77J355k028k001J415K63O77K093q55
570E35k057M61R92J735M61n89q9j318k30J458r39N89M61k846m29J393j410J104
588g18J350j295r66M06Q92J178P34L48j396j733J560J153j285J156j127k846J607
605i82J340j101J064J13j441qL85Q61L07L93K57j269q56K219k90j87R24k026j539
624a836J234K2K53Q90j337p42K30P25J565k92R8k73j077J065J119j152N62J11
642A165k358L38N68l22R52j99j504J00N2P18J022l01M53j062p01J667Q45n83J073
661A923j493j150R62j37R4J74j050p75L66j60J447J23j21L35j338K66J583k75
$$ plain form
679 774 903 887 -384 -525 401 227 1022 335 -896 -588 -1151 -647 493 65 -311 -367 -1062 -11 726 834
699 834 1242 275 -506 200 -29 543 1305 191 -1016 -709 -1042 -174 471 -53 -125 -460 -773 443 558 672
719 672 793 -607 -534 224 126 729 821 -483 -484 -455 -436 536 308 -173 -31 -1010 -644 445 345 843 109 -615
741 -615 -126 111 403 1014 149 -490 -496 -858 261 661 36 -176 -450 -766 315 584 419 786 -579 -613
761 -613 -9 -109 601 790 -90 -515 -667 -452 199 579 185 -103 -827 -591 408 409 734 584 -595 -155 121
782 121 345 1004 483 -507 -446 -921 -488 429 27 -192 -307 -655 -261 227 496 766 -201 -275 137 232 695
803 695 935 26 -337 -438 -676 135 23 -385 -47 -1060 -1076 161 -29 505 377 -377 5 457 286 1137
823 1137 736 75 -106 -421 -240 437 -7 -425 -485 -1071 -564 23 41 592 -24 -826 -19 265 828 1132 312
$$ packed form
679G74J29j6j271j41R26j74P95o87j231L08n63N04J140m28l76n6o95J051P37J08
699H34M08r67p81P06k29N72P62j114j207L07l33Q68O45n24p2l35l13J216J15J14
719F72J21j400P3P58r8O03R2j304jK9J9R72k28m81J42r79L66J089j00M98p34p24
741f15M89K37K92O11q65o39ol62J119M00o25k12k74l16J081K69j65L67j365l4
761f13O04j00P10J89q80m25j52K15O51L80l94k88p24K36R99JL25j50j179M40K76
782A21K24O59n21r90O1m75M33R17m02k19j15l48L94M88K69K70r67p4M12R5M63
803F95K40r09l63j01k38Q11j12m08L38j013j6J237j90N34j28p54L82M52j71Q51
823A137m01o61j81l15J81O77m44m18o0n86N07N87J8N51o16q02Q07K84N63L04q20
$$ plain form
844 312 25 10 -268 407 764 -99 -209 -817 -1105 -253 -409 -231 -70 -739 -643 -132 36 1052 875 164 250
865 250 8 109 718 750 111 -59 -868 -566 155 -138 115 -251 -1206 -632 -324 99 632 492 26 319 97
886 97 576 967 536 273 -47 -568 101 85 -98 -193 -754 -793 -426 -423 329 670 -466 -16 0 -86 630 873 577
909 577 188 -156 -114 553 169 242 -12 -760 -436 -702 -407 188 -135 -520 -339 -436 25 593 512 495 93 -335
931 -335 131 486 394 497 -337 -473 -103 -251 -74 126 0 -387 -497 -567 284 447 170 30 -191 -387 271
952 271 179 625 407 -333 -189 -38 -228 390 225 -408 -85 -607 -489 463 269 176 -19 -593 -55 189 167
973 167 451 109 -483 121 126 179 570 -104 -241 -144 -168 50 120 252 -139 -480 -560 125 36 131 409 -277 -160
996 -160 233 -2 504 470 -122 45 -89 62 262 278 -101 -139 -576 -72 148 -202 24 -50 -400 -74 64 78
$$ packed form
844C12k87j5k78O75L57q63j10o08k88Q52j56J78J61o69R6N11J68J016j77p11Q6
865B50k42J01O09L2o39j70q09L02P21k93K53l66r55N74L08M23N33j40m66K93k22
886I7M79L91m31k63l20n21O69j6j83r5n61l9L67LP52L41j136M50J6q6P16K43k96
909E77l89l44M2O67l84P3k54p48L24k66K95N95l23l85J81r7M61N68q1j7m02m28
931c35M66L55r2J03q34j36L70j48J77K00j26l87j10p0Q51J63k77j40k21j96O58
952B71r2M46k18p40J44J51j90O18j65o33L23n22J18R52j94r3j95n74N38K44k2
973A67K84l42n92O04NN3L91o74j37R7k4K18P0J32l91l41q0O85q9R5K78o86J17
996a60L93k35N06l4n92J67j34J51K00J6l79l8m37N04K20l50K26p4l50L26J38J4
$$ plain form
1018 78 456 181 -41 147 -67 219 337 110 188 -325 -351 248 134 -185 441 -387 -411 -178 -249 49 193 -379
1040 -379 -9 -8 -133 440 395 156 434 27 -37 440 107 174 161 -253 -170 -325 -3 -22 -166 -404 -248 -375 102
1063 102 536 230 165 78 -268 53 515 154 438 -106 -435 104 -120 12 73 -480 -187 -155 -423 193 -7
1084 -7 -119 98 -126 24 232 178 526 280 -181 83 225 -6 237 -6 -291 -191 -372 -371 23 -117 -95 -158
1106 -158 -561 109 269 265 621 99 -43 128 122 272 386 -165 -157 -86 -254 68 60 -315 -348 -179 -369 199 128 402
1130 402 349 61 39 236 -57 472 369 -157 -136 -314 -432 161 -128 -365 3 -919 -186 49 -69 226 -96
1151 -96 -298 -30 252 219 550 196 -283 -60 7 312 189 -149 -83 -442 -553 -39 -98 45 161 -305 -222 233
1173 233 244 370 629 218 170 -40 -21 280 226 -88 -198 -461 -346 105 51 -26 -170 -311 -142 -159 54 362
$$ packed form
1018G8L78k75k22J88k14K86J18k27P8n13k6N99j14l19O26q28k4K33p1K98J44n72
1040c79L70Jj25N73m5k39K78m07o4M77l33O7j3m14Q3j55L22j9j44k38J56j27M77
1063A02M34l06o5q7l46L21M62l61K84n44l29N39k24J32O1n53K93L2k68O16k00
1084gj12K17k24J50K08n4L48k46m61K64J42k31K43k43k85J00j81JL94j40K2o3
1106a58m03O70J60mL56n22j42J71oJ50J14n51QP1j68L22ql75l3J69j90N68p1K74
1130D02n3k88k2J97k93N29j03n26K1j78j18N93k89k37L68r22P33K35j18K95l22
1151i6k02K68K82l3L31l54m79K23O7L05j23l38O6l59j11N14n9J43J16m66Q3M55
1173B33J1J26K59m11m8k10J9L01n4l14j10k63J15M51n4p7j44j41J69j7K13L08
$$ plain form
1195 362 160 -70 374 -32 164 395 88 93 58 -327 39 -8 9 242 -146 -345 -255 -110 78 228 168 -53
1217 -53 -72 -6 450 432 101 227 -244 -130 189 218 -116 69 -116 -439 -127 53 221 -78 -305 -5 -313 -41
1239 -41 225 81 44 53 -194 256 252 -43 175 -99 -75 100 -49 -4 115 36 -243 44 -220 97 244 -18 2
1262 2 -105 -277 139 39 220 255 -49 -336 328 -107 437 378 -255 -56 -65 58 264 91 -173 -123 -337 -124
1284 -124 71 -83 -95 -122 -230 82 202 122 297 -82 -231 -167 77 -123 178 112 -50 127 -373 -108 -12 73
1306 73 33 -244 -74 16 254 350 221 -153 85 74 0 485 60 53 12 -284 -149 84 -286 -113 64 -335 -62
1329 -62 -254 -10 164 195 59 -85 82 240 446 21 204 -151 -351 -103 -67 -183 -85 -133 -200 -46 -265 -12
1351 -12 328 -248 21 -128 -94 191 254 137 -79 -39 -113 137 -142 114 -6 -457 -141 -126 -58 182 69 -156
$$ packed form
1195C62k02k30M44m06J96K31l07Nl5l85L66m7J7K33l88j99R0J45J88J50o0k21
1217e3j9O6M56j8l31J26m71J14L19K9l34J85j85l23L12J80J68k99k27L00l08K72
1239d1K66j44l7Rk47M50mk95K18k74K4J75j49M5J19p9k79K87k64L17J47k62K0
1262Bj07j72M16j00J81L5l04k87O64m35N44n9o33J99rJ23K06j73k64N0k14K13
1284a24J95j54j2k7j08L12J20q0J75l79j49O4K44k00L01o6j62J77n00K65R6Q5
1306G3m0k77J70R0K38R6j29l74K38j1p4M85m25pm1k96J35K33l70J73J77l99K73
1329f2j92K44J74L1j36j44J67J58K06m25J83l55k00K48L6j16R8m8o7J54k19K53
1351a2L40n76K69j49L4K85O3j17k16M0p4K50k79K56j20m51L16J5O8K40j13k25
$$ plain form
1373 -156 6 0 59 366 131 225 231 17 52 258 24 97 65 -151 35 -47 -16 -45 -217 -214 -31 -114 -37 95 72 -140
1399 -140 29 -33 104 20 325 7 -241 -156 91 76 101 -131 -230 -130 -104 71 -18 0 72 -12 -42 -115 220 -56
1423 -56 129 94 -251 121 -48 35 252 -208 -63 101 -234 -14 -21 -125 -64 -247 -179 -53 217 -84 52 -133
1445 -133 31 36 -31 42 -8 -56 -247 62 25 -41 264 -322 -61 -121 -172 -48 -38 134 262 -295 -20 216 -169 82
1469 82 84 18 -117 -15 -142 -6 140 -11 -50 -270 74 87 -174 91 -165 -140 110 -189 61 -38 52 219 18
1492 18 -65 150 315 8 -10 -118 23 86 14 -95 19 -265 31 -239 -226 96 -192 -60 70 62 43 101 -124
1515 -124 -14 70 30 70 101 -8 35 -58 -140 100 151 -136 -91 -308 57 -95 -129 83 -190 -101 -133 32 -90 105
1539 105 0 47 -44 -60 241 189 -76 -174 -81 -175 -56 97 -2 267 -2 -46 68 -183 164 -91 48 213 72
$$ packed form
1373a56J62oN9L07k35R4Ok14L5K06k34P3l2k16J86q2L1k9j72LJ83q3P7J32k3k12
1399a40J69o2J37q4L05l18k48Q5K47j5K5k32r9J00K6J75q9J8P2q4l0p3L35k76
1423e6J85l5l45L72j69Q3K17m60J45J64l35K20pj04O1j83O8J26K70l01J36j85
1445a33J64No7P3n0m8j91L09l7o6L05n86K61o0n1J24J0J72J28n57K75K36l85K51
1469H2Ko6j35J02j27J36J46j51l9k20L44J3k61K65k56K5K50k99K50r9R0J67k01
1492A8q3K15J65l07j8j08J41O3p2j09J14k84K96k70J3L22k88J32J30qj9N8k25
1515a24J10Q4m0M0L1j09M3r3q2K40N1k87M5k17L65j52l4K12k73Q9l2J65j22J95
1539A05j05M7r1j6L01n2k65r8R3r4J19J53r9K69k69m4J14k51L47k55J39J65j41
$$ plain form
1562 72 -103 48 37 25 36 -212 -182 -277 -80 121 173 -237 -167 35 -8 70 141 -59 124 -150 -174 36 -39 278
1586 278 63 -7 -16 -32 -178 184 -162 -251 27 -65 -2 16 12 31 -42 -204 -5 -117 82 210 5 -120 34 -45
1610 -45 171 72 -120 -109 -285 -76 45 -22 -71 -91 -180 0 59 57 125 141 -175 -141 271 86 -61 -46 100 74 -248
1635 -248 -232 -168 -24 -54 26 -103 43 127 -124 304 66 -60 87 -193 -230 41 212 -30 59 30 4 118 44
1658 44 49 -67 -202 18 -104 -64 93 42 -52 38 28 -43 291 103 137 175 -149 259 -71 14 -104 -30 -165 4
1682 4 -134 133 132 47 46 -180 -34 189 50 127 -28 -72 -31 15 -6 111 194 -34 164 115 59 -35 -288 64 -232
1707 -232 -172 14 60 -27 170 32 79 323 -335 122 83 63 -74 104 -16 252 133 -271 -73 -16 -186 -63
1729 -63 -78 -259 -132 -214 -146 12 35 60 -30 -148 -193 15 72 166 66 -71 40 -216 91 213 -160 -53 -240
$$ packed form
1562G2j75J51j1j2J1k48L0r5J97K01N2m10P0K02m3P8P1k00J83k74k4K10p5L17
1586B78k15p0rj6j46L62l46q9K78r2O3J8mJ9p3j62J99j12J99J28k05j25J54p9
1610d5K16r9j92J1j76K09J21o7m9k0q9J80N9kO8J6l16L4M12j85j47J5J46k6l22
1635b48J6O4J44l0Q0j29J46Q4k51M28k38j26J47k80l7K71J71k42Q9k9k6J14p4
1658D4Nj16j35K20j22M0J57n1r4R0j0p1L34j88L4L8l24M08l30Q5j18P4j35J69
1682Dj38K67jq5jk26J46K23j39P7j55m4M1M6k1J17Q3k28J98m9n6r4k53L52k96
1707b32O0J86M6q7J97j38M7K44o58M57l9k0j37J78j20K68j19m04J98N7j70J23
1729f3j5j81J27q2O8J58K3K5r0j18m5K08N7R4j00j37J11k56L07J22l73J07j87
$$ plain form
1752 -240 -43 -39 182 24 -122 -105 -115 -105 -98 224 186 -162 -70 275 -55 217 146 2 69 -77 -25 -28 -44 36 -41 37
1778 37 -61 -37 -154 -173 87 116 56 30 -112 169 87 1 197 -10 -89 19 92 -174 -120 -7 30 -131 -64 190 42
1803 42 -45 2 -50 41 9 57 -97 -1 -13 -13 -44 -129 -99 -258 -34 -39 -80 161 60 192 20 -68 -337 82 -113 -71
1829 -71 36 -14 38 -12 -22 112 107 25 32 -209 -8 176 115 -132 -72 -126 25 -110 -33 44 -132 129 185 -19 -72 -52
1855 -52 5 41 -51 57 -69 128 -203 -33 -147 -119 27 -13 53 93 -73 55 55 4 -85 3 183 -72 -108 80 -108
1880 -108 59 -116 73 -163 -164 19 -154 -40 -48 -190 30 -118 -160 148 -176 6 187 105 -20 -24 19 100 145 124
1904 124 -61 -85 -189 -71 -255 -137 103 46 -144 -270 -36 -5 -39 -83 -16 -72 -73 -114 -104 209 -260 -240 -26 -335
1928 -335 30 -87 -16 -133 28 -233 -143 40 -75 15 -83 -81 -48 -141 162 290 -49 -160 30 -102 16 197 -211
$$ packed form
1752b40J97MK21j58j46J7j0J0PL22l8l48R2L45l30K72p1j44O7j46N2lj6Q0p7P8
1778C7r8K4j17j9K60K9o0k6j42K81q2q6J96k07p9J08P3k66N4J13L7j61O7K54j48
1803D2q7M7n2R1l2M8j54R6j2%l1q5L0j59K24nm1K41j01J32j72q8k69M19j95M2
1829g1J07n0N2n0j0J34nq2Pk41K01J84o1k47O0n4J51j35P7P7j76K61N6k04n3K0
1855e2N7L6r2J08j26J97l31J70j14K8J46m0O6M0j66J28%n1q9Q8J80k55l6J88j88
1880a08J67j75J89k36jJ83j73J14qj42K20j48m2L08l24J82J81q2j25mM3Q1M5k1
1904A24j85k4j04J18j84J18K40n7j90j26K34L1l4m4O7n6jm1J0L13m69K0K14l09
1928c35L65j17P1j17J61k61R0J83j15R0r8KL3r3L03J28l39j11J90j32J18J81m08
$$ plain form
1951 -211 7 76 15 -332 120 -137 119 -33 -55 3 19 57 148 14 184 21 -39 69 17 94 74 -250 26 38
1975 38 -46 166 43 38 -8 106 -49 -50 217 -258 -140 -48 -123 -8 132 -158 -60 -68 -75 23 55 59 -149 -25 -84 -88 -40
2002 -40 -7 134 -31 -138 -189 17 218 -192 -16 -77 22 108 -79 170 -130 -121 54 -15 6 83 -126 227 167 24
2026 24 172 -120 67 -155 24 -39 -96 149 -66 -71 62 127 244 -153 8 -168 -48 -149 -3 -122 -23 264
2048 264 -9 117 56 -16 161 244 -212 133 -201 20 99 38 -67 63 31 -18 -154 120 -15 13 -102 4 -155
2071 -155 -64 -42 -63 -76 49 -72 -46 53 -32 29 -108 52 -33 69 84 -2 -7 -17 108 -62 71 147 186 21 -43 4
2097 4 -87 133 16 99 48 242 56 -132 -24 -45 -253 110 30 -110 -20 -127 197 -1 -371 -191 147 -124 112
2120 112 342 -56 -263 151 -46 123 81 -92 -96 -18 95 186 136 212 -8 50 252 -102 -88 -10 4 -77 -5 -71 -3
$$ packed form
1951b11K18O9o1l47M52k57K56j52k2N8J6L8R1j34J70j63o0J08n2P7k0l24K76J2
1975C8q4K12j23nm6J14j55jK67m75J18R2p5J15J40k90R8qpR8L2Mk08J24n9mM8
2002d0L3J41j65j07n1K06K01m10J76o1R9Q6j87K49l00RJ75o9K1P7k09L53o0j43
2026B4J48k92J87k22J79o3n7K45k15nJ33O5J17l97J61j76J20j01J46j19R9K87
2048B64k73J26o1p2J77Q3m56L45l34K21P9o1j05J30l2m9j36K74j35K8j15J06j59
2071a55R1K2k1j3J25j21K6R9q5O1j37J60q5J02J5q6nj0J25j70J33P6L9j65o4M7
2097Dr1K20j17Q3n1J94j86j88J08k1k08L63q0j40R0j07L24j98l70J80L38k71K36
2120A12K30l98k07M14j97J69m2j73mP8J13R1n0P6k20N8K02l54J4P8J4q1P2o6O8
$$ plain form
2145 -3 -39 61 15 -163 -92 -111 -88 33 44 -7 -27 -17 -66 27 109 14 -103 114 70 165 22 -48 -122 -108 45 -129 108
2172 108 -113 -87 -153 77 30 -45 106 126 -153 -42 -221 -130 -22 0 17 -249 11 -81 -25 -32 67 173 -47 82
2196 82 -176 -49 -41 -55 34 -6 -9 56 -118 -57 113 -81 -64 143 -131 -67 38 -29 -28 -46 -230 185 163 135 30 75
2222 75 -26 71 68 41 -176 139 282 124 17 1 -82 -68 60 87 9 14 -157 -1 -2 -50 106 -26 -17 -95 43 -76
2248 -76 64 -50 -96 -6 -51 -192 -108 60 239 61 -77 -72 169 -70 -69 -129 -25 -101 -74 231 -8 -191 75 31
2272 31 35 77 -14 140 3 31 -12 160 64 -103 81 291 -148 -38 54 -120 41 12 -34 -35 -118 -5 -170 275 18
2297 18 -67 206 3 -68 -110 33 8 -28 104 -26 -57 14 -8 74 -74 -28 -87 82 17 162 -133 -48 -55 -96 47 -91
2323 -91 -146 86 -67 223 -52 90 118 -85 102 -227 168 57 -64 -179 -172 43 146 187 -270 -106 -2 -40
$$ packed form
2145cl6J00m6j78P1j9K3J21J1n1k0J0m9R3Q2r5j17K17m4R5j43p0p4J4J53j74K37
2172A08k21K6o6K30m7p5J51K0k79J11j79R1J08K2J7k66K60r2N6pR9J06k20J29
2196H2k58J27Qj4Q9m0lO5j74O1J70j94J7K07k74O4J05o7Jj8j84M15k2k8j05M5
2222G5j01R7lk7k17L15J43j58j07j6q3J4J28K7p8Nj71J56jm8J56j32Rp8J38j19
2248g6J40j14m6R0m5j41Q4J68J79j78j38NK41k39Jo0J04p6K7L05k39j83K66m4
2272C1MM2r1J54j37K8m3J72r6j67J84K10m39J10R2j74J61k9m6jq3J13j65M45k57
2297A8q5K73k03p1m2J43k5l6J32j30l1P1k2Q2j48M6n9J69o5J45k95Q5pm1J43j38
2323i1n5K32j53K90k75J42K8k03J87l29L95j11j21j15PK15J03M1m57J64J04l8
$$ plain form
2345 -40 -15 129 117 76 128 -148 75 187 -174 -61 13 -159 -121 -6 -23 57 84 -112 -125 -190 77 -246 -72 180
2369 180 172 -74 173 -122 -21 -135 58 -28 85 -116 -35 145 17 -33 42 9 75 -67 51 108 67 12 307 29
2393 29 -110 -74 -98 2 8 -178 -11 -13 -36 -47 140 -22 -18 94 -12 -12 42 155 220 -78 -84 -108 -81 -97 93 16 -38
2420 -38 39 -80 -130 123 19 -136 259 -26 -132 -62 3 107 -26 121 -169 76 216 -82 94 -141 -44 -6
2442 -6 8 -40 -18 136 -56 153 101 120 192 62 -42 -54 -55 57 38 -196 -69 -80 200 76 -171 123 74 57 -187
2467 -187 -282 -19 -125 152 -90 50 46 161 223 -206 27 -24 55 -22 -24 21 -70 -210 -43 124 65 -46 -63 24 68
2492 68 -61 -85 -54 22 -13 -13 74 -25 -128 -208 -8 -13 -70 -62 -124 64 91 16 -28 63 2 -94 -18 -123 -92 -1 190 75
2520 75 153 184 208 -26 -285 -47 78 69 61 36 190 206 -180 -66 9 108 -59 -347 28 55 -24 68 -196 133 97
$$ packed form
2345d0K5J44j2m1N2k76K23J12l61J13P4j72L8J15j7Q0K7j96j3o5K67l23J74K52
2369A80qk46K47k95J01j14J93q6J13k01Q1J80j28n0P5l3O6j42J18N7m1n5K95k78
2393B9j39L6k4J00Oj86J67kk3j1J87j62MJ12j06%N4J13O5k98ok4K7j6J90p7n4
2420c8P7j19n0K53j04j55L95k85j06P0O5J04j33J47k90K45J40k98J76k35R7L8
2442fJ4m8K2J54j92K09n2J9P2j30j04j2jJ12j9k34J27j1K80j24k47K94m9j7k44
2467a87r5K63j06K77k42J40mJ15O2m29K33n1P9p7kM5r1j40J67J67n9j11j7Q7M4
2492F8j29k4L1P6l5%Q7r9j03q0K00nn7Qo2J88K7p5m4R1o1r6P6j05L1R1J91j15
2520G5P8L1K4k34k59K38J25rqk5J54J6l86J14P5R9j67k88L75K7p9R2k64L29l6
$$ plain form
2545 97 162 -82 102 -175 -102 58 -15 -190 -68 -34 42 -118 -138 196 185 -20 -216 41 -63 -39 44 154 -10
2568 -10 57 80 21 350 78 1 -4 132 -116 -128 56 110 -42 16 28 -77 6 27 -16 61 152 56 113 -33 -74 55
2594 55 -115 71 158 -174 13 263 50 89 96 86 -201 8 94 80 -246 55 -30 -52 103 108 -319 -69 -26 -58 36
2619 36 -120 -52 -79 -116 -175 -38 -135 -305 25 -94 -92 -150 179 179 -22 -142 -59 242 186 37 -15 -12 -83 84 -125 -131
2645 -131 -101 -158 11 153 -132 111 15 9 67 121 53 73 162 -106 -51 265 4 158 20 -158 -120 -25 -7 13 154
2670 154 77 191 -79 164 -16 125 2 -59 238 -172 30 -4 -184 93 -219 28 34 -74 1 12 116 213 -46
2693 -46 -31 -7 -37 26 -210 -69 -116 7 54 128 18 14 42 1 56 -135 -69 -76 -130 -4 -101 164 -157 -28 -32 -101 82
2720 82 78 119 84 -86 -46 -16 174 -39 -40 118 23 -45 -73 -196 -289 -133 22 110 98 -286 -82 324 7 88 121 35
$$ packed form
2545I7O5k44J84k77P3J60p3j75J22L4P6j60k0L34j1k05j96K57j04K4Q3J10j64
2568a0O7K3n9L29k72p7nJ36k48j2J84N4j52N8J2j05Q3K1m3P7R1r6N7j46m1J29
2594E5j70J86Q7l32J87K50k13L9Pj0k87K09Q6j4l26L01q5k2J55Nm27K50M3l2R4
2619C6j56O8k7l7n9J37r7j70L30j19Kn8L29%k01j20Q3L01n6j49n2Lp1J67k09o
2645a31L0n7J69J42k85K43r6oN8N4o8K0Q9k68N5L16k61J54j38j78L8R5J8K0J41
2670A54p7J14k70K43j80J41j23o1K97m10K02l4j80K77l12K47Oj08P5J1J04R7k59
2693d6J5K4l0O3k36J41m7J23M7P4j10mK8m1N5j91O6pn4J26r7K65l21J29mo9J83
2720H2mM1l5j70M0L0J90k13jJ58r5o8k8j23r3J56J55Q8j2l84K04M06l17Q1L3q6
$$ plain form
2746 35 199 -21 25 -123 -39 157 72 71 -56 12 -64 141 97 -43 -209 86 98 75 -105 -2 -9 -234 104 59 -34
2771 -34 144 -72 -6 91 163 -45 0 132 20 7 28 33 -128 -33 -13 -78 -6 3 143 -45 -10 -92 -178 -7 83 104 67
2798 67 -34 102 -144 -33 -21 64 -66 133 76 -23 89 152 -4 63 148 180 -30 -24 -99 120 122 84 23 47 -5 -49
2824 -49 -34 48 50 -98 96 -110 26 69 -35 -1 70 94 -45 -79 10 129 -71 15 138 36 7 56 -88 -43 57
2849 57 161 -87 -147 -150 214 27 214 170 -100 7 125 207 -67 -75 -238 -88 -208 60 -116 72 0 183 -62
2872 -62 -35 -144 354 -150 -18 2 -171 -31 163 24 -50 48 111 -123 66 -190 -192 347 69 -50 -60 -51 20 153
2896 153 258 30 -83 100 -93 10 -135 155 25 104 -67 -222 147 249 -51 150 30 213 22 73 68
2917 68 -236 71 -124 79 -95 -13 -116 84 -67 14 126 115 -30 142 -73 22 164 130 65 10 -102 -87 -77
$$ packed form
2746C5J64k20M6j48Q4J96q5jj27O8p6K05m4j40j66K95J2k3j80J03pk25L38m5r3
2771c4J78k16O6R7P2k08M5J32j12j3K1Nj61R5K0o5P2RJ40j88L5q2q6J71R0K1l7
2798F7j01J36k46J11J2Q5j30J99n7r9J12O3j56O7Q5L2k10Op5K19Kl8o1K4n2m4
2824d9J5Q2Kj48J94k06J36M3j04L4P1K4j39l4Q9J19k00Q6J23j02k9M9j44M5J00
2849E7J04k48o0lL64j87J87m4k70J07J18Q2k74qj63J50j20K68j76J88p2J83k45
2872f2K7j09M98n04J32K0j73J40J94j39p4R8O3k34J89k56kN39k78j19j0RP1J33
2896A53J05k28j13J83j93J03j45K90j30P9j71j55L69J02l00K01j20J83j91N1n
2917F8l04L07j95K03j74Q2j03K00j51Q1J12j1j45J72k15R5J42l4o5n5j12J5J0
$$ plain form
2940 -77 -118 32 -117 -301 26 15 -94 -72 3 127 -143 -112 2 -58 -93 117 -35 -38 143 -161 112 23 30 -85
2964 -85 -65 154 -251 -71 -33 -44 -126 -252 4 156 -7 301 43 -42 -87 70 -104 -47 155 -123 -24 -7 -9 -67
2988 -67 7 -166 -41 -2 42 -91 -50 20 -10 -100 84 -118 -53 -90 66 44 15 22 -119 79 82 -130 -91 165 -157 72
3014 72 -139 383 33 -97 20 -101 -30 98 31 -68 110 57 -243 -194 -174 -116 83 -12 97 -34 -163 3 -8
3037 -8 -22 -89 26 -80 -45 -42 -178 -314 -192 -194 -105 -45 11 -79 -29 138 -31 -28 -121 -6 149 70 120 -32 -241 -176 -186
3064 -186 15 -123 -145 -265 83 -196 75 38 67 -51 -29 32 -29 92 172 142 -138 31 -40 188 4 -94 25
3087 25 28 -57 92 -115 19 -170 39 37 8 -89 -85 81 34 -58 66 1 -72 -5 72 -46 -107 62 92 -54 53 82
3113 82 44 114 -151 -203 -140 -164 -68 -18 236 -53 4 -242 -78 -61 -201 -121 40 205 -116 18 -62 -100 -159 4 -22
$$ packed form
2940g7m1J50j49j84L27j1j09K2P5J24k70L1J14o0l5K10j52lJ81l04K73q9Pj15
2964h5K0K19m05J80L8j1q2j26K56J52j63L08k58q5m5J57j74N7K02k78R9J7kn8
2988f7P4j73J25L9M4j33M1P0l0r0J84k02O5l7J56k2k9Pj41J98Lk12L9K56l22K29
3014G2k11N22l50j30J17j21P1J28o7r9J78n3l00M9K0N8J99r5J09j31j29J66j1
3037hj4o7J15j06L5Lj36j36J22kQ9O0N6r0N0J67j69Lr3J15J55p9N0j52k09O5j0
3064a86K01j38k2j20L48k79K71l7K9j18K2O1o1J21Q0l0k80J69p1K28j84r8J19
3087B5Lq5J49k07J34j89K09kk9r7MJ66m7r2J24o5p3O7P7j18o1J69L0j46J07K9
3113H2l8P0k65n2O3k4R6N0K54k89N7k46J64J7j40Q0J61J65l21J34q0l8n9J63k6
$$ plain form
3138 -22 -122 125 -167 -207 117 -54 195 156 37 -244 118 -49 -221 99 22 -70 -55 -48 32 136 -133 -93 58
3161 58 -63 -90 -99 -39 80 -68 -41 168 28 -134 -1 112 -97 -134 -186 -123 48 34 -163 84 -157 -22 -365
3184 -365 101 -114 98 -50 109 -80 102 -220 -47 -101 206 8 115 -165 -4 -93 11 40 -11 44 -34 -45
3206 -45 114 43 67 175 -187 -32 64 -179 62 342 20 90 37 -82 63 65 88 -101 71 166 -77 -121 -62 3
3230 3 50 -148 125 41 0 209 -202 -4 215 -257 99 -116 -18 35 105 -257 -101 -63 -65 10 -62 80 127 -40 25
3255 25 15 128 -72 -38 -85 68 -130 -65 -62 -221 101 108 -66 -122 65 -64 184 58 25 35 -115 29 -81 19
3279 19 33 125 148 -53 90 -7 169 72 5 148 -2 187 49 37 -217 -44 -136 -64 144 -173 -63 22 28 111 91
3304 91 60 -16 -219 -6 3 98 -177 72 -12 -143 48 -157 166 -229 -112 -75 -120 198 -49 88 54 -122 -99 88
$$ packed form
3138b2j00K47k92m0L24j71K49l9j19k81L62j67j72L20p7r2J5PQ0J04k69M0J51
3161E8j21k7rO0J19j48K7K09j40j62J33J13k09l7n2O3J71j4j97K47k41J35l43
3184c65M66k15K12j48J59j89J82l22J73n4L07j98J07k80J61q9J04K9n1N5p8j1
3206d5J59p1K4J08l62J55R6k43K41K80l22P0n3j19J45KK3j89J72R5k43m4N9O5
3230CM7j98K73q4m1K09m11J98K19m72L56k15R8N3P0l62J56L8kP5p2J42M7j67O5
3255B5j0J13k00L4m7J53j98O5Lj59L22Pj74n6J87j29K48j26l3J0j50J44j10J00
3279A9J4R2K3k01J43r7J76r7o7J43j50J89j38j2k54J73r2P2K08l17J10Q5OQ3k0
3304I1l1p6k03K13RR5k75K49q4j31J91k05L23l95J17L7m5L18k47J37l4j76K3J87
$$ plain form
3328 88 56 -7 -181 -67 -199 -121 -99 -29 74 -84 -49 170 -132 -96 -305 10 -90 91 13 1 35 16 -89 -56
3352 -56 -83 21 342 -157 55 116 198 -147 134 128 73 38 70 33 -71 224 5 10 100 179 -20 -143 -9 135 -277
3377 -277 141 167 -169 89 98 -32 -15 198 235 24 52 170 38 162 -31 108 39 -14 82 -86 -38 -73 37 133
3401 133 21 -69 -149 81 -220 48 117 -146 106 16 -38 57 -108 118 181 -30 109 -74 31 26 1 -16 -74 49
3425 49 -176 156 183 60 -52 -51 214 -56 -154 215 1 -10 153 249 -43 -56 141 -76 35 114 51 -31 -213 -91
3449 -91 -56 -78 52 -71 -82 -18 67 41 -108 -53 -85 -43 -62 -184 4 33 -87 62 -71 -192 -101 107 -164 74
3473 74 -1 112 -13 124 -122 160 21 -181 -78 15 78 154 19 -64 129 -19 -67 -130 145 -195 189 51 -193
3496 -193 -118 66 87 80 -89 36 16 -108 -87 167 5 60 -228 -9 115 71 142 83 -88 -87 37 60 -57 14 -35
$$ packed form
3328H8l2o3j74J14j32P8K2P0J03j58L5K19l02L6k09L15j00J81p8j2L4j9j05L3
3352e6k7J04L21m99K12O1Q2l45K81on5l5L2l7j04K95k19NR0P9j99j23J34J44m12
3377b77M18K6l36K58Rj30J7K13L7k11K8J18j32J24j93J39o9n3R6j68M8l5J10R6
3401A33j12r0q0K30l01K68O9k63K52r0n4R5j65K26O3k11J39j83J05nk5j7n8J23
3425D9k25L32K7j23j12JK65k70r8L69k14j1J63R6k92j3J97k17J11P9o3q2j82J22
3449i1L5k2J30j23j1O4Q5k6j49N5l2M2j9j22J88K9j20J49j33j21R1K08k71K38
3473G4p5J13j25J37k46K82j39k02J03R3O3P6j35q3J93j48m8o3K75l40L84j38k44
3496a93P5J84K1pj69J25k0j24K1K54j62N5k88K19J24m4P1n9j71JJ24K3j17P1m9
$$ plain form
3521 -35 27 159 42 -129 39 -178 73 -138 -109 41 154 18 -46 159 -34 113 -88 132 -160 31 151
3542 151 55 -34 -57 -62 44 -262 -141 -16 114 11 -28 4 9 131 -92 -17 -243 -156 55 144 -21 57 -29 194 -126
3567 -126 -89 155 -143 25 110 127 95 9 -283 94 6 20 6 -40 24 19 -152 79 -29 38 185 -19 7 -60 -106
3592 -106 136 -116 78 -102 21 -334 94 -40 -74 228 -22 -131 110 -119 25 52 -295 -90 141 -103 91
3613 91 -152 32 6 107 -15 78 -4 145 317 -70 74 -122 -69 -110 -66 -78 -98 -66 -32 -248 -265 73 83 31 288
3638 288 -67 82 70 78 100 121 199 -152 238 -61 147 173 -82 -81 32 -114 129 162 -17 -130 -200 175 -38 7
3662 7 128 13 149 -159 12 114 -242 161 96 18 -122 -57 -67 172 35 77 -98 -125 -163 8 8 -157 -258 -28
3686 -28 142 93 120 -65 -68 27 -44 -48 59 -16 -65 84 -79 -179 -20 -65 -145 47 -235 -49 -48 122 -45 -155 130
$$ packed form
3521c5O2J32j17j71J68k17K51k11K9J50J13j36o4K05j93J47k01K20k92J91J20
3542A51r6q9k3nJ06l06J21J25J30j03l9L2NJ22k23P5k26Q7K11Q9j65P8q6K23l20
3567a26L7K44k98J68Q5J7l2q6k92L77q8J4j4m6O4nj71K31j08O7J47k04K6o7m6
3592a06K42k52J94j80J23l55M28j34l4L02k50j09K41k29J44K7l47K05K31k44J94
3613I1k43J84k6J01j22R3q2J49J72l87J44j96N3m1M4j2k0L2L4k16j7L38J0n2K57
3638B88l55J49j2QK2K1P8l51L90k99K08K6k55JJ13j46K43L3j79j13p0L75k13M5
3662GJ21j15J36l08J71J02l56M03o5p8j40O5j0K39j37M2j75k7l8J71%j65j01K30
3686b8J70m9K7j85lR5p1mJ07p5m9J49j63j00J59m5q0J92k82J86JJ70j67j10K85
$$ plain form
3711 130 43 198 149 96 81 -26 44 -196 -68 7 -60 120 207 71 -55 -59 -45 242 71 128 336 98 -188 104
3735 104 126 -213 -233 -48 -338 30 -63 113 15 -119 -151 -144 45 -58 -37 77 46 39 70 -120 197 -42 -59 -62 -97
3760 -97 -41 34 49 -115 -52 -230 41 56 -10 11 -66 5 -110 25 94 -260 -152 18 -273 121 6 -91 -75 -16 -121
3785 -121 89 -28 -269 96 -53 -145 -34 -89 -5 -53 -16 63 241 -65 38 -51 211 54 -34 106 -82 48 124
3808 124 237 38 -9 -161 -188 21 190 50 8 -85 -85 7 -4 -52 -15 -133 -9 -75 -121 21 149 -6 196 68
3832 68 91 62 -41 86 -115 -27 48 179 126 -127 -122 -33 14 55 22 39 -35 42 -50 -65 -129 -11 186 99 204 -33
3858 -33 69 -95 22 -205 3 69 -203 -160 -79 13 70 -85 222 196 247 2 -8 28 232 -85 183 -97 22
3881 22 2 -24 272 -59 155 26 -4 10 -71 38 -5 -117 -222 -20 206 348 98 -69 -131 -145 165 162 36 -22
$$ packed form
3711A30q7J55m9n3j5j07P0k40J28P5o7J80Q7j36j26mJ4K87j71N7K08k38k86K92
3735A04K2l39k0J85k90L68r3J76r8j34l2PJ89j03K1J14l1pL1j90L17k39j7ll5
3760i7N6P5J5j64O3j78K71J5o6K1p7P1j15J35O9l54J08J70k91L94j15r7J6N9j05
3785a21K10j17k41L65j49r2J11n5Q4m8L7P9J78l06J03q9K62j57q8J40j88J30P6
3808A24J13j99m7j52k7K09J69j40m2r3%R2j1m8L7j18J24o6m6J42J28j55K02j28
3832F8K3k9j03J27k01Q8P5J31n3k53NQ9M7M1l3J7p4P7r2j5o4J18J97q7J05k37
3858c3J02j64J17k27K08O6k72M3Q1R2N7j55L07k6N1k45j0L6K04l17K68k80J19
3881B2k0k6K96l31K14j29l0J4q1J09m3j12j05K02K26J42k50j67o2j4L10lj26n8
$$ plain form
3905 -22 -63 -60 -204 131 -146 55 -60 10 9 -78 95 -52 87 -64 -35 24 164 -117 96 113 185 -58 102 134
3929 134 -247 54 -50 267 243 147 104 194 -168 -132 91 277 -128 -5 64 -5 -190 -161 -92 88 178 116 60 72
3953 72 -32 58 -14 -40 -5 71 101 276 239 -74 26 119 56 -140 -25 -16 49 172 -58 -29 -25 -88 49 -211 35 294
3979 294 -165 13 -12 -113 158 -100 -207 -95 365 166 -124 -74 -26 -41 189 -104 -171 147 144 7 243 112
4001 112 -30 160 194 9 5 -180 108 27 -86 -93 41 -58 -37 52 -110 110 3 79 179 60 76 -6 -42 -99 189
4026 189 64 -20 -227 -154 230 174 52 -183 30 -230 58 -337 -144 -85 128 37 -82 89 -86 187 -144 28
4048 28 84 97 90 -46 -176 -188 -35 49 -11 195 147 142 159 102 4 -179 66 -187 -100 -158 105 100 -18 1 19 -89 -89
4075 -89 -121 6 80 35 -9 33 34 135 108 90 -35 -130 -37 69 -155 -70 53 79 98 -141 -305 1 176 56 110
$$ packed form
3905b2m1Lj44L35k77K01j15P0jq7J73j47J39j51K9N9J40k81K13J7P2k43J60L2
3929A34l81L01j04L17k4r6m3R0l62L6K23J86m05J23O9o9j85K9O9J80R0o2n6J2
3953G2j04R0p2k6L5P6L0J75l7l13J00R3o3j96J15RO5J23k30K9Mo3J37k60K46K59
3979B94m59J78k5j01K71k58j07J12M60j99k90N0M8j5K30k93o7L18lj37K36j31
4001A12j42J90L4j85mj85K88q1j13pJ34r9K1Q9j62K20j07P6J00j19J6q2l6n7K88
4026A89j25q4k07P3L84n6j22k35K13k60K88l95J93N9K13r1j19J71j75K73l31J72
4048B8N6J3pj36j30j2J53Q4o0K06m8nJ7n7r8j83K45k53Q7n8K63nj18J9J8j08%
4075h9l2J27P4m5m4M2JJ01k7j8j25r5R3J06k24Q5J23K6J9k39j64L06J75j20N4
$$ plain form
4100 110 159 -156 106 13 81 50 244 -16 79 93 -134 66 -18 -81 111 23 -35 35 64 -4 67 -70 5 7 102 -109
4126 -109 143 -91 4 120 56 79 15 47 -42 14 51 -26 41 -20 -110 -59 -5 -67 -148 60 41 -159 42 153 23 76
4152 76 -54 105 -73 13 218 88 -238 -64 -41 -16 68 -116 9 80 -71 141 -33 -60 -161 -203 79 -124 -40
4175 -40 -39 103 43 21 71 -62 79 139 147 22 -39 -31 47 17 -19 60 89 76 -4 -150 -10 -25 -97 -9 24 100 -9 -29
4203 -29 159 16 97 128 7 -35 -205 -51 -52 10 53 -45 99 19 38 59 77 166 63 -20 -12 148 116 -40 33 -48 167
4230 167 -20 14 -109 155 -18 53 239 -44 100 -10 77 61 104 57 189 -19 82 -70 -10 36 -7 -18 -65 -78
4254 -78 -154 136 -22 -126 159 107 207 105 14 182 86 -79 -125 -130 30 208 103 -13 64 47 -110 160 89 -24
4278 -24 -203 -136 -174 -10 9 -15 38 -132 -134 20 -22 -103 22 115 -9 -160 70 -39 -66 -69 -7 11 253 -65 -96 403
$$ packed form
4100A10M9l15K62r3O8l1J94k60R5J4k27K00q4o3J92q8n8P0K9o8P1j37P5KR5k11
4126a09K52k34R5J16o4K3o4L2q9N6L7p7O7o1r0N1N4o2q1K08j9k00K01J11j30N3
4152G6j30J59j78Q6K05j30l26J74K3K5Q4j84J25P1j51K12j74k7j01m2K82k03Q4
4175d0JJ42o0k2N0j33J41O0Qj25o1QP8l0l6P9K9j3q0j46J40j5p2Q8L3P6j09k0
4203b9J88j43Q1L1j21m2j70J54jO2M3r8J44q0J9K1J8Q9j03q3QJ60l2j56P3q1K15
4230A67j87L4j23K64j73P1J86k83J44j10Q7j6M3m7J32k08J01j52O0M6m3j1m7j3
4254g8p6K90j58j04K85n2J00j02r1J68r6j65m6nJ60J78j05j16P7j7j57K70p1j13
4278b4j79O7l8J64J9k4N3j70kJ54m2q1J25R3j24j51K30j09k7lO2J8K42l18l1M99
$$ plain form
4304 403 138 -35 -110 197 179 -54 104 -74 -138 166 -110 -78 15 -104 -139 -71 -24 -123 153 51 83 142 7 57
4328 57 45 -178 121 -77 8 88 13 -57 249 -107 31 -157 12 104 233 6 55 47 2 -92 -1 179 -59 188
4352 188 -29 -162 11 105 -36 -50 -155 -71 -139 -51 156 42 -43 -22 142 149 -141 102 -67 206 147 -20 168
4375 168 -156 -101 252 -134 -2 -27 -30 75 80 120 197 115 -43 -65 147 112 -64 39 -39 -108 123 -152 66 -44
4399 -44 -13 -29 -37 3 135 79 217 -91 -113 -5 -176 126 32 58 -51 22 52 65 -1 -7 -147 82 -96 33 130 110
4425 110 -89 37 166 -64 128 46 -318 4 154 52 -60 131 39 -118 -166 71 28 -50 6 -10 59 -12 7
4448 7 154 -15 -55 -89 -131 166 240 205 -26 6 32 87 -14 -182 -89 -44 -60 296 -123 12 -153 40 230 1
4472 1 167 -117 36 -17 148 -13 40 257 168 83 86 137 -151 72 -10 -1 162 80 -141 -72 -84 161 -89 206 -193
$$ packed form
4304D03k65j73p5L07j8k33J58j78o4L04k76L2R3j19l5O8M7r9K76j02L2N9j35N0
4328E7j2k23K99j98Q5Q0p5p0L06l56J38j88J69R2J29k27M9qm5r4R1J80k38K47
4352A88k17j33J73R4j41j4j05Q4o8Q8K07j14q5K1J64Pk90K43j69K73n9j67J88
4375A68l24N5L53l86J32k5lJ05NM0P7q2j58k2K12l5j76J03p8o9K31k75K18j10
4399d4L1j6qM0J32n6J38l08k2J08j71L02r4K6j09P3L0J3o6oj40K29j78J29R7k0
4425A10j99J26J29k30J92q2l64L22J50j02j12J91r2j57m8K37m3p8N6j6O9p1J9
4448GJ47j69m0l4m2K97P4l5k31L2K6N5j01j68R3M5j6L56m19J35j65J93J90k29
4472AJ66k84J53n3J65j61N3K17q9q5LN1k88K23q2RJ63q2k21O9j2K45k50K95l99
$$ plain form
4497 -193 -143 83 -207 13 -79 197 -261 197 -76 -156 34 -87 183 -218 8 -80 81 57 199 51 76 -37
4519 -37 -167 173 1 50 -109 -114 -184 -243 218 -79 23 25 -12 -13 24 93 -25 -75 60 -194 44 94 -6 35 -103
4544 -103 12 -2 111 -24 -125 298 81 -84 -32 234 87 -35 -20 -134 -37 -43 -146 -85 93 -56 -76 8 183
4567 183 34 7 -147 29 119 190 329 23 29 108 -10 -12 57 -69 -116 -54 -60 -31 160 149 136 78 -130 182 144 -84
4593 -84 -22 -199 -101 -38 134 16 -104 -15 61 200 48 -73 97 97 147 -43 -249 136 -92 -56 -21 -123 -164 160
4617 160 50 -78 -51 263 55 122 281 -172 70 -19 -195 -106 59 -116 -40 -97 -134 152 -101 157 -16 37 -20
4640 -20 142 20 36 85 262 -35 101 36 -189 -175 94 115 -144 102 -132 -17 -74 77 -36 -92 -181 174 -33
4663 -33 -43 -23 -56 29 86 25 -193 40 216 -243 -50 -4 -40 48 144 146 107 -91 -93 -146 -21 -38 -229 30 -56 -65 7
$$ packed form
4497a93N0K26k90K20r2K76m58M58k73q0J90j21K70m01K26q8J61k4J42j48K5j13
4519c7j30L40j72M9j59np0n9M61k97J02Kl7jL7O9j18n0J35k54K38N0j00M1j38
4544a03J15j4J13j35j01M23k17j65N2K66j47j22J5j14R7oj03O1J78j49k0Q4J75
4567A83j49k7j54J76R0P1J39l06OP9j18kO9j26m7O2oK9J91j1j3n8k08L12l8k28
4593h4O2j77R8O3J72j18j20Q9P6J39j52j21J70%N0j90k06L85k28L6L5j02m1L24
4617A60j10j28K7L14k08O7J59m53K42q9j76Q9J65j75P6n7l7K86k53K58j73N3n7
4640b0J62j22J6M9J77k97J36o5k25J4K69K1k59K46k34J15n7J51j13n6q9L55k07
4663c3j0K0l3Q5N7o1k18K33J76m59J93M6l6Q8R6Kl9j98kn3J25j7j91K59q6rP2
$$ plain form
4690 7 -142 81 -141 -33 108 -189 125 73 3 154 -17 35 -114 130 94 6 83 -76 57 17 -10 35 -178 26
4714 26 -125 6 -229 -270 80 251 191 -201 149 167 22 81 255 -170 267 6 101 -61 2 -40 -48 158 110 -49
4738 -49 56 50 116 -170 -250 168 132 110 188 -99 11 7 -35 117 -329 -131 -54 -127 110 -102 89 -198 -10 -32 36
4763 36 -81 43 106 -7 -289 -30 -65 -20 -92 221 233 10 3 -256 -114 39 16 -34 -49 -266 31 -186 -217 116
4787 116 -79 -95 -36 147 -189 -56 -35 -11 -56 0 -7 -28 -19 156 32 -175 77 180 128 -177 -98 -58 197 -82 134
4812 134 152 25 -134 142 -132 -206 107 4 140 69 37 -57 17 64 325 -95 152 6 62 -22 155 218 -136
4835 -136 -126 10 -273 53 -72 -189 207 -15 -173 -67 -43 23 -389 8 -209 -65 30 -163 208 -297 -5
4856 -5 148 -75 123 171 48 -78 -35 88 -117 134 57 173 -82 -253 37 -48 -94 -34 89 39 -1 -16 -3 75
$$ packed form
4690Gj49K23k22J08J41k97L14n2p0J51j71N2j49K44l6q8P7j59J33m0k7M5k13K04
4714B6j51J31k35m1L50J71o0l92L50J8j45N9J74m25M37k61R5j62O3m2qK06m8j59
4738d9J05oO6k86q0M18l6k2P8k87J10mm2J52m46J98P7p3K37k12J91k87J88k2O8
4763C6j17J24O3j13k82K59l5M5p2L13J2k23pk59J42J53k3n0j5k17K97k17l1L33
4787A16j95j6N9J83l36J33K1K4m5N6pk1RJ75j24k07K52J03n2l05P9M0K55k79K16
4812A34J8j27j59K76k74p4L13j03J36p1l2r4P4M7K61m20K47j46N6q4J77O3l54
4835a36J0J36k83L26j25j17L96k22j58J06K4O6m12L97k17J44R5j93L71n05K92
4856eJ53k23J98M8j23j26M3J23k05K51p7J16k55j71K90q5m6O0J23n0m0j5J3P8
$$ plain form
4880 75 31 89 -46 186 -161 43 -67 -163 -102 17 27 -96 206 -3 -97 -207 58 -61 -14 -158 151 12 -139
4903 -139 -69 54 157 -68 90 -114 -46 35 29 154 -32 71 -7 -91 51 131 -46 -76 64 -31 44 39 -222 -51
4927 -51 137 -2 -111 12 -15 -103 67 118 -62 41 -25 260 199 -120 -21 28 89 -105 -133 -72 211 -35 48 -61
4951 -61 -16 13 105 133 75 10 36 42 6 96 138 -14 -169 -160 -12 -159 82 -48 -89 187 -73 83 48 -96 46 11
4977 11 69 -33 170 163 61 -53 -15 79 -88 58 -214 105 191 111 -66 -152 110 -100 249 -144 -21 167 139
5000 139 -184 62 -126 -39 -240 -166 -188 -134 76 94 181 100 107 -6 47 111 91 -35 142 7 154 -75 109 -111
5024 -111 137 135 -89 150 -20 119 -181 67 -46 106 75 -218 103 85 302 -39 9 24 -233 160 -1 142
5046 142 2 -69 -82 99 66 -2 -81 113 107 163 0 112 -52 109 -24 5 -54 87 -63 -204 -95 -49 79 0
$$ packed form
4880G5m4N8j35K32l47K04j10r6O1J19J0j23L02k09r4j10K65j19M7j44L09j39j51
4903a39P0J23J03k25J58k04O8Q1oJ25j86J03p8q4J42Q0j77l0J40r5P5nk61J71
4927e1J88j39j09J23k7q8J70N1j80J03o6K85o1l19R9M9O1j94k8O1K83k46Q3j09
4951f1M5K9R2K8n8o5K6Ol6R0M2j52j55RJ48j47K41j30m1K76k60J56l5j44J42l5
4977A1N8j02K03pj02j14L8R4j67J46k72L19Q6q0j77q6K62k10L49l93J23J88k8
5000A39l23K46j88Q7k01P4k2N4K10J8Q7q1Pj13N3O4k0j26J77j35J47k29J84k20
5024a11K48kk24K39j70J39l00K48j13J52l1k93L21j8K17l41M8J5k57L93j61J43
5046A42j40p1j3J81l3o8p9J94oN6j63J12j64J61j33K9n9J41j50j41J09M6J28p9
$$ plain form
5070 0 98 67 110 22 -89 -112 -89 92 27 34 -296 126 99 -153 172 -128 -118 -5 -75 -58 -120 -43 -141 -37 -1 -25 -17
5097 -17 64 -19 157 209 80 -16 144 96 113 160 -74 -212 -95 69 -1 -79 -3 214 -2 -19 -29 128 -9 261
5121 261 99 63 137 49 48 16 -6 -106 -27 -95 -84 77 -21 -9 -5 19 32 56 -178 76 -97 -55 -58 26 -124 77 -34
5148 -34 -156 -157 49 -88 2 -214 77 -50 175 4 -109 -24 17 -21 73 46 204 51 -56 19 124 -95 3 -49
5172 -49 -100 -31 -49 -29 48 268 -12 112 -65 -34 -32 192 245 -45 -74 71 19 218 -32 -232 228 10 61 -24 -48
5197 -48 -109 -22 -63 22 192 -50 65 -166 90 212 41 -123 51 41 -27 75 -41 -35 -58 -171 77 92 121 -126
5221 -126 2 188 -54 -124 212 109 -18 107 98 140 97 127 -56 -119 19 267 136 -63 -5 11 5 7 11 -215 -165
5246 -165 143 -47 -177 135 -32 -96 -209 8 47 32 -141 -8 -6 346 -54 -264 243 -81 -15 -29 -16 -249 -79
$$ packed form
5070@R8l1M3q8j11k3K3J81o5Pl30M22k7k52L25l00J0J13p0J7o2P7r8J04L6k4Q
5097a7Q1q3J76N2j29r6J60m8J7M7k34j38J17J64p0p8P6K17k16j7j0J57j37K70
5121B61j62l6P4q8jl2k2j00P9o8J1J61r8J2MK4J3K4k34K54j73M2lQ4j50K01j11
5148c4j22jK06j37R0k16K91j27K25j71j13Q5M1l8R4k7J58j53j07P5J05k19R8n2
5172d9n1O9j8K0P7K20k80J24j77L1KK24N3k90k9J45n2J99k50k00M60k18N1q5k4
5197d8o1Q7m1Q5J70k42J15k31K56J22j71j64J74j0o8J02j16Ok3j13K48J5K9k47
5221a26J28J86k42p0L36j03j27J25rM2m3L0j83o3J38K48j31j99N8J6oKMk26N0
5246a65L08j90j30L12j67o4j13K17L9j5j73J33KL52m00k10N07l24O6j4J3k33J70
$$ plain form
5269 -79 -3 -193 -4 38 -285 164 81 9 168 181 -45 248 -24 -23 42 -88 74 -33 -160 28 5 203 -83
5292 -83 -18 77 -128 -118 19 -63 -245 169 86 47 23 -16 27 -46 -51 -140 -16 15 113 -14 6 -24 -158 26 130 27
5318 27 51 96 -72 81 120 44 106 -6 -13 38 164 121 96 -61 -78 201 186 123 -102 57 72 -86 27 -102 -167
5343 -167 -84 105 191 -224 -228 -33 -94 85 205 8 -70 -35 -4 -178 -75 153 109 21 41 -90 210 -8 33 78
5367 78 35 -83 114 -85 -52 -11 -153 8 -92 -15 109 -173 53 72 -93 -49 -226 -23 201 89 -4 46 -215
5390 -215 85 -240 -258 87 -92 -27 -20 -46 -75 35 -109 -31 -104 61 193 -180 -50 -29 15 35 -172 32 193 -98
5414 -98 102 -22 136 33 -119 80 82 155 -233 90 -19 81 0 -15 38 -14 -241 60 -27 85 -50 380 133
5437 133 -99 2 78 -196 6 -138 278 30 97 -33 -37 125 106 -68 -204 139 -105 -189 91 133 94 -218 33
$$ packed form
5269g9P6j90J89M2l23M49q3p2J59J3k26K93k72JO5j30J62j07j27J88k3J98k86
5292h3O5R5k05J0J37q2j82M14q3l9k4l9M3p3nq9J24L1R8j27K0l0j34J84J04j03
5318B7K4M5j68J53L9p6O2j12pN1J26m3k5j57j7K79j5o3k25J59J5j58J13j29o5
5343a67Q3J89Q6m15mJ95o1J79J20j97p8L5L1j74J03K28m4q8K0j31L00k18M1M5
5367G8m3j18J97j99L3M1j42J61j00P7J24k82K26J9j65M4j77K03K24j12r3N0k61
5390b15L00l25j8L45j79O5Pk6k9J10j44P8p3J65J32l73J30K1M4K0k07K04J61k91
5414i8K00j24J58j03j52J99KP3l88L23j09J00q1j5N3n2k27L01q7J12j35M30k47
5437A33k32J01P6k74K02j44M16k48O7j30mJ62j9j74j36L43k44q4K80M2l9l12K51
$$ plain form
5460 33 132 24 -109 39 20 -6 -19 -134 -145 -33 -47 128 51 35 140 101 -48 -77 -45 -170 -19 -113 35 75 -157
5485 -157 178 -16 134 -41 -250 -10 50 22 -88 87 10 48 10 -96 -126 -130 -183 19 283 81 -134 -62 12 63
5509 63 108 -35 -40 -143 -42 124 25 97 -15 -223 116 -74 169 158 -46 20 -8 -154 -49 -6 24 175 11 124
5533 124 -128 86 -86 158 58 43 -43 -159 -43 44 -27 106 15 -165 22 -45 119 -206 -216 40 6 3 -64 174
5557 174 62 7 -381 -82 141 110 -174 -118 0 -77 -69 38 168 -60 -172 -52 -210 98 -100 37 51 23 -28
5580 -28 -24 -97 14 -39 -38 207 235 216 36 240 -248 -104 -27 -211 -11 -112 -104 -124 1 -86 79 119 25 -5 112 6
5606 6 -94 61 -13 38 -15 -90 172 146 -163 -3 -151 -176 -120 170 147 59 -62 -69 162 59 34 -4 -90 -153 -86 108
5632 108 -18 11 -165 120 68 79 72 -273 202 3 -30 72 -125 -241 28 44 41 9 -31 108 31 154 156 188 -51
$$ packed form
5460C3R9j08j33J48j9k6j3j15j1J12j4J75p7j6J05l9j49k9L2j25J51r4J48M0k32
5485a57L35j94J50j75k09K40O0k8j10J75p7L8l8j06l0mn3K02K64k02k15P2P4N1
5509F3M5j43nj03J01J66r9P2j12k08L39j90K43j1k04O6k8j46J05M3L0J51j64J13
5533A24k52K14j72K44j00j5q6j16J16Q7p1J33r1j80J87o7J64l25j0K56l4lo7K38
5557A74j12n5l88K99K23l1k84N6J18p7QJ07J30k28j12J20j58L08j98J37J4k8n1
5580b8Mp3J11n3JK45K8j9j80K04m88J44P7j84K00j01Qk0J25q7J65M0r4l0J17j06
5606Fj00J55p4N1n3p5K62k6l09J60j48k5N6K90k3q8j21pK31j03k5l8q6o3O7J94
5632A08j26K9j76K85n2J1pl45M75j99l3J02j97j16K69J6ll2m0J39p7J23KL2k39
$$ plain form
5657 -51 -83 -86 114 32 -108 61 103 -195 -14 84 235 -50 -182 -23 19 -87 -32 13 31 -12 -22 -151 12 8 -26
5682 -26 41 94 -113 77 167 -82 5 132 142 -67 -209 -130 -52 -266 -192 -58 -28 75 183 -22 -22 -74 16 40 -56
5707 -56 -226 -41 -20 5 11 4 31 167 5 -60 -93 105 207 -139 -8 12 -148 74 -145 76 60 253 -69 270
5731 270 151 69 211 91 -124 68 89 207 -105 65 99 -117 -15 -132 0 85 44 -44 -58 -203 -24 5 -71
5754 -71 -71 -229 -16 193 -54 -130 89 -130 133 -77 103 -166 88 64 -75 67 -3 -59 -220 -52 -211 16
5776 16 44 151 3 136 -100 -13 -6 138 -161 -84 35 86 211 -88 18 76 9 -47 -36 136 16 2 26 55 161
5801 161 42 174 -74 119 137 -7 -90 15 -78 6 54 -95 7 -108 -186 -28 92 -235 26 -29 -33 28 53 -60
5825 -60 -86 -105 300 3 87 -46 -77 21 -314 -93 12 -42 148 44 327 35 55 184 -62 151 -167 -54 -186
$$ packed form
5657e1l2lK00q2j40J69M2k98J81R8J51k85j32J59M2j06N5M5J8m3j0j29J63ml4
5682b6O7N3k07J90R0k49Q7J27J0k09j42P9P8k14P4J34L0J03J08k05%n2R0K4r6
5707e6j70J85K1K5OpK7J36j62o5l3J98J02l46J31K0j60K22k19K21j6J93l22L39
5731B70j19q2J42j20k15J92K1J18l12J70L4k16J02j17J32Q5m1q8j4j45J79K9p6
5754g1%j58K13K09k47p6K19k19K63k10J80k69K54k4j39J42p0n6j61J68j59K27
5776A6K8J07j48J33k36Q7PJ44k99P7J19N1J25k99J06N8o7n6J1J72j20j4K4K9J06
5801A61j19J32k48J93J8j44q3J05r3Q4M8j49J02j15p8J58J20l27K61n5mO1K5j13
5825f0k6j9M05k97Q4j33l1R8l35K21J05n4J90j04K83k92K0J29k46K13l18J13j32
$$ plain form
5848 -186 60 8 -130 -268 -134 -14 97 -108 -74 -5 16 -49 130 -55 -119 -43 -2 114 -189 -171 93 -23 13
5871 13 42 -184 88 106 151 120 63 -214 -20 120 -167 -215 168 -32 -43 73 -60 79 -38 93 168 -19 -121
5894 -121 157 -16 -138 49 -78 69 20 114 -14 -92 114 -37 88 -127 138 -23 -120 -41 -51 27 -134 -15
5916 -15 -134 49 238 -56 80 81 14 -23 -81 -6 73 119 59 -1 -202 151 72 -41 -103 85 -17 23 7 -27 -183
5941 -183 16 -87 112 183 6 59 -2 184 -97 -9 3 -43 53 123 39 19 -59 -176 55 -15 -6 100 -87 14 26
5966 26 60 -1 50 -75 27 -47 -71 92 40 -115 -40 -156 -100 -161 45 -9 72 12 82 54 27 109 -49 27 -90 -30
5992 -30 92 34 -84 -18 -74 -181 81 342 -29 -16 -78 61 18 -5 52 -59 -38 -11 158 -266 -214 17 135 -9
6016 -9 -121 90 168 60 -158 73 81 -38 15 102 99 40 3 127 53 37 -61 -187 -216 144 56 -29 -172 136 -38 -67
$$ packed form
5848a86K46n2j38j38J34J20J11k05L4O9K1o5J79j85o4P6M1J16l03J8K64j16L6
5871A3K9k26K72J8M5l1n7k77J94J40k87m8L83k00j1J16j33J39j17J31P5j87j02
5894a21K78j73j22J87j27J47m9R4j28p8K06j51J25k15K65j61r7P9j0P8j61J19
5916a5j19J83J89k94J36Jo7l7n8P5P9M6o0o0k01L53p9j13o2J88j02M0j6l4j56
5941a83J99j03J99P1j77N3o1J86k81Q8J2m6R6P0q4k0p8j17K31p0RJ06j87J01J2
5966B6L4o1N1j25J02p4k4J63n2j55P5j16N6o1K06n4Q1o0P0k8k7Q2j58P6j17O0
5992c0J22n8j18O6n6j07K62K61l71J3o2J39m3k3N7j11K1K7J69m24N2K31J18j44
6016ij12K11P8j08k18K31Qj19N3Q7ln9l7J24p4j6r8j26k9L60q8q5j43L08j74k9
$$ plain form
6042 -67 59 -144 -9 170 132 40 -75 -29 -110 185 15 59 -200 154 -77 -33 37 -152 -114 -7 -30 15 -263 -164
6066 -164 -97 114 -124 95 3 69 -56 -131 -157 3 48 119 -54 -92 -71 151 278 276 36 38 190 98 30 62 49 -40
6092 -40 -366 -166 130 -48 117 75 -194 -23 -92 -120 -49 -15 -158 -6 9 -81 -121 -19 -7 -191 11 -72 85 100
6116 100 -19 29 163 157 136 -10 280 1 105 39 -152 166 182 -151 32 28 -39 17 -97 -29 64 -200 87 57
6140 57 9 146 253 -144 -5 -115 109 -118 17 96 126 -264 -79 -153 -86 24 -19 82 -150 -59 31 67 42 1
6164 1 -30 167 109 -40 17 205 63 -50 128 -133 117 -93 136 29 184 110 -97 66 -79 -13 -165 19
6186 19 -12 366 170 -57 -5 124 175 31 48 84 -10 59 2 1 -62 161 -39 -13 44 -146 -149 25 -22 81 127 -145
6212 -145 -99 -76 -87 47 -25 -22 162 -62 -79 24 29 148 88 -112 10 -198 294 -310 1 148 -118 -97 17 83
$$ packed form
6042f7J26k03J35J79l8r2j15M6q1K95j70M4k59L54k31M4P0j89L8J07k3M5k78R9
6066a64O7K11k38K19r2O6j25p5k6J60M5P1j73l8K1K22J27kk40KJ52r2o8L2j3q9
6092d0l26K00K96j78J65m2k69J71o9k8P1L4j43J52J5r0m0J02J2j84K02q3J57J5
6116A00j19M8J34ok1j46K90k79J04o6j91L18J6l33J83mo7N6j14O8R3k64K87l0
6140E7m8J37J07l97J39j10K24k27J35P9L0l90J85p4O7J10m3J01k32R1R0L6k5m1
6164Al1J97n8j49N7J88j42j13J78k61K50k10K29j07J55p4k07J63j45O6j52J84
6186A9l1L78j96k27N2J29N1j44J7L6r4O9n7jo3K23k00K6N7j90lJ74m7J03M6k72
6212a45M6K3j1J34p2LJ84k24j7J03NJ19o0k00J22k08M92o04L11J47k66K1J14O6
$$ plain form
6236 83 -150 66 -86 -92 -92 -71 -173 -104 222 121 -25 83 -102 30 184 -29 -112 166 39 70 -76 146 -112
6259 -112 112 115 220 -81 -120 30 245 -145 12 196 134 26 193 -21 -99 74 29 172 -38 134 25 40
6281 40 -128 -142 -104 -211 38 -265 60 119 -1 -103 117 366 -53 34 146 94 156 6 -18 86 -58 30 -143
6304 -143 196 -17 203 -74 147 99 -33 55 -139 -16 -25 103 -76 83 9 -83 177 99 -84 -32 207 -44 -77
6327 -77 23 6 -203 42 11 -152 -11 44 -57 -92 -41 78 -28 -174 34 -217 28 -45 -31 137 78 -119 159
6350 159 65 210 206 -120 43 -131 -33 -39 -4 234 -102 56 15 17 99 -46 81 -174 -28 192 -42 74 -95 -151
6374 -151 102 102 -101 -33 -158 249 86 104 -17 -137 -108 -205 188 -4 -106 -36 -335 83 55 -118 155 -65 292
6397 292 118 160 164 25 -102 -194 68 69 224 -79 82 -110 -125 -132 36 -203 -102 128 117 -147 52 -160 -89 178
$$ packed form
6236H3k33K16j52o%K1j02O9L26j01j46J08j85J32J54k13q3K78j27L1j46K22k58
6259a12K24LJ05l01l9J50K15l90J57J84o2j08J67k14p8J73m5J43k10J72j09J5
6281D0j68j4L8j07K49l03L25N9j20j02K20K49m19Q7J12n2O2j50k4J04j44Q8j73
6304a43L39k13K20k77K21m8j32Q8j94J23rJ28j79J59p4r2K60p8j83N2K39k51l3
6327g7J00j7k09K45l1j63J41N5j01l5N1J19j06j46K08k51K45p3J4J68n9j97K78
6350A59r4J45ml26J63j74R8oL5K38l36J58m1KQ2j45J27k55J46K20k34J16j69n6
6374a51K53%k03O8j25M07j63J8j21j20K9r7L93j92j02P0k99M18k8j73K73k20L57
6397B92j74M2Mj39j27r2K62JJ55l03J61j92j5pJ68k39J01K30j1k64J99k12P1K67
$$ plain form
6421 178 -160 -122 179 -208 158 168 -68 -158 -18 38 -39 -225 22 -12 52 166 175 -72 115 90 86 125 -6 -157
6445 -157 -32 -115 -161 44 -11 -84 32 -51 -128 -20 -65 133 -234 69 -44 -59 -21 -148 82 -163 62 -41 3
6468 3 25 -196 -132 -58 71 -13 -201 -23 25 81 3 102 -166 -5 44 -110 21 35 -39 48 80 -27 -38 -71 89 18
6494 18 35 -13 -5 9 66 70 2 152 56 94 119 88 -56 -48 197 37 -119 58 108 -135 -140 -95 -23 -86 195 167 54 71
$$ packed form
6421A78l38L8L01l87L66J0k36r0J40N6p7j86K47l4O4J14Rk47J87k5mL9j31j51
6445a57J25q3m6K05n5p3J16q3p7J08m5J98l67L03j13j5L8j27K30k45K25j03M4
6468CK2k21O4P4J29q4j88J78M8N6p8R9k68J61M9j54J31J4p4Q7L2j07j1l3J60p1
6494A8J7m8QJ4N7Mo8J50r6L8K5l1j44QK45j60j56J77N0k43nM5P2o3K81k8j13J7
$$ [...]
8191d4
##END NTUPLES=NMR FID
##END=
