##TITLE=1H_DE-87_ch_3
 200.13MHz,CDCl3,
 8 sc
 
 22.4.2025
##JCAMPDX= 6.0         $$ Bruker NMR JCAMP-DX V2.0
##DATA TYPE= NMR FID
##DATA CLASS= NTUPLES
##ORIGIN= UXNMR, Bruker Analytische Messtechnik GmbH
##OWNER= pz
$$ XWIN-NMR		Version 3.5
$$ Tue Apr 22 14:49:20 2025 Russian Standard Time (UT+4h)  she@DPX200
##.OBSERVE FREQUENCY= 200.1313
##.OBSERVE NUCLEUS= ^1H
##.DELAY= (6, 6)
##.ACQUISITION MODE= SIMULTANEOUS
##.ACQUISITION SCHEME= undefined
##.AVERAGES= 8
##.DIGITISER RES= 18
##SPECTROMETER/DATA SYSTEM= spect
##.PULSE SEQUENCE= zg30
##.SOLVENT NAME= CDCl3
##.SHIFT REFERENCE= (INTERNAL, CDCl3, 0, 14.3821)
##AUDIT TRAIL= $$ (NUMBER, WHEN, WHO, WHERE, WHAT)
$$ ##TITLE= Audit trail, XWIN-NMR		Version 3.5
$$ ##JCAMPDX= 5.01
$$ ##ORIGIN= Bruker BioSpin GmbH
$$ ##OWNER= she
$$ F:/spectra/data/she/nmr/H-C/1/audita.txt
$$ ##AUDIT TRAIL=  $$ (NUMBER, WHEN, WHO, WHERE, WHAT)
(   1,<2025-04-22 14:47:18.35 +0400>,<she>,<DPX200>,
      <created by zg, POWCHK disabled, PULCHK disabled
       configuration hash MD5:
       00 E9 B6 7A A2 85 ED C7 34 08 36 98 17 FE 4E 26
       data hash MD5: 16K
       EF 61 B6 50 D9 25 BC EE A5 D2 8B BA 12 5B E9 F7>)
$$ ##END=
$$ 
$$ hash MD5
$$ 92 47 38 9E 26 98 F4 EB 44 2D 50 CB E0 EB 09 9D
##$RELAX= 
##$RELAX= 
##$RELAX= 
##$RELAX= 
##$RELAX= 
##$RELAX= 
$$ Bruker specific parameters
$$ --------------------------
##$DU= <F:/spectra>
##$EXPNO= 1
##$NAME= <H-C>
##$PROCNO= 1
##$TYPE= <nmr>
##$USER= <she>
##$AMP= (0..31)
100 100 100 100 100 100 100 100 100 100 100 100 100 100 100 100 100 100 
100 100 100 100 100 100 100 100 100 100 100 100 100 100 
##$AQSEQ= 0
##$AQ_mod= 1
##$AUNM= <au_zg>
##$AUTOPOS= <>
##$BF1= 200.13
##$BF2= 200.13
##$BF3= 200.13
##$BF4= 200.13
##$BF5= 200.13
##$BF6= 200.13
##$BF7= 200.13
##$BF8= 200.13
##$BYTORDA= 1
##$CFDGTYP= 0
##$CFRGTYP= 5
##$CHEMSTR= <none>
##$CNST= (0..31)
1 1 145 1 1 1 1 1 1 1 1 1 1 1 1 1 1 1 1 1 1 1 1 1 1 1 1 1 1 1 1 1 
##$CPDPRG= <>
##$CPDPRG1= <>
##$CPDPRG2= <>
##$CPDPRG3= <>
##$CPDPRG4= <mlev>
##$CPDPRG5= <mlev>
##$CPDPRG6= <mlev>
##$CPDPRG7= <mlev>
##$CPDPRG8= <mlev>
##$CPDPRGB= <>
##$CPDPRGT= <>
##$D= (0..31)
0 0.7 0 0 0 0 0 0 0 0 0 0.03 0 0 0 0 0 0 0 0 0 0 0 0 0 0 0 0 0 0 0 0 
##$DATE= 1745318837
##$DBL= (0..7)
120 120 120 120 120 120 120 120 
##$DBP= (0..7)
150 150 150 150 150 150 150 150 
##$DBP07= 0
##$DBPNAM0= <>
##$DBPNAM1= <>
##$DBPNAM2= <>
##$DBPNAM3= <>
##$DBPNAM4= <>
##$DBPNAM5= <>
##$DBPNAM6= <>
##$DBPNAM7= <>
##$DBPOAL= (0..7)
0.5 0.5 0.5 0.5 0.5 0.5 0.5 0.5 
##$DBPOFFS= (0..7)
0 0 0 0 0 0 0 0 
##$DE= 6
##$DECBNUC= <off>
##$DECIM= 32
##$DECNUC= <off>
##$DECSTAT= 4
##$DIGMOD= 1
##$DIGTYP= 9
##$DL= (0..7)
0 120 120 120 120 120 120 120 
##$DP= (0..7)
150 150 150 150 150 150 150 150 
##$DP07= 0
##$DPNAME0= <>
##$DPNAME1= <>
##$DPNAME2= <>
##$DPNAME3= <>
##$DPNAME4= <>
##$DPNAME5= <>
##$DPNAME6= <>
##$DPNAME7= <>
##$DPOAL= (0..7)
0.5 0.5 0.5 0.5 0.5 0.5 0.5 0.5 
##$DPOFFS= (0..7)
0 0 0 0 0 0 0 0 
##$DQDMODE= 0
##$DR= 18
##$DS= 0
##$DSLIST= <SSSSSSSSSSSSSSS>
$$ [...]
##$SUBNAM0= <"">
##$SUBNAM1= <"">
##$SUBNAM2= <"">
##$SUBNAM3= <"">
##$SUBNAM4= <"">
##$SUBNAM5= <"">
##$SUBNAM6= <"">
##$SUBNAM7= <"">
##$SUBNAM8= <"">
##$SUBNAM9= <"">
##$SW= 18.0517328524113
##$SWIBOX= (0..15)
0 0 2 0 0 0 0 0 0 0 0 0 0 0 0 0 
##$SW_h= 3612.71676300578
##$TD= 16384
##$TD0= 1
##$TE= 0
##$TE2= 300
##$TE3= 300
##$TEG= 300
##$TL= (0..7)
0 120 120 120 120 120 120 120 
##$TP= (0..7)
150 150 150 150 150 150 150 150 
##$TP07= 0
##$TPNAME0= <>
##$TPNAME1= <>
##$TPNAME2= <>
##$TPNAME3= <>
##$TPNAME4= <>
##$TPNAME5= <>
##$TPNAME6= <>
##$TPNAME7= <>
##$TPOAL= (0..7)
0.5 0.5 0.5 0.5 0.5 0.5 0.5 0.5 
##$TPOFFS= (0..7)
0 0 0 0 0 0 0 0 
##$TUNHIN= 0
##$TUNHOUT= 0
##$TUNXOUT= 0
##$USERA1= <user>
##$USERA2= <user>
##$USERA3= <user>
##$USERA4= <user>
##$USERA5= <user>
##$V9= 5
##$VALIST= <valist>
##$VCLIST= <CCCCCCCCCCCCCCC>
##$VD= 0
##$VDLIST= <DDDDDDDDDDDDDDD>
##$VPLIST= <PPPPPPPPPPPPPPP>
##$VTLIST= <TTTTTTTTTTTTTTT>
##$WBST= 1024
##$WBSW= 4
##$XGAIN= (0..3)
0 0 0 0 
##$XL= 0
##$YL= 0
##$YMAX_a= 116048
##$YMIN_a= -188568
##$ZGOPTNS= <>
##$ZL1= 120
##$ZL2= 120
##$ZL3= 120
##$ZL4= 120
##$ABSF1= 10
##$ABSF2= 0
##$ABSG= 5
##$ABSL= 3
##$ALPHA= 0
##$AQORDER= 0
##$ASSFAC= 0
##$ASSFACI= 0
##$ASSFACX= 0
##$ASSWID= 0
##$AUNMP= <proc_1d>
##$AZFE= 0.1
##$AZFW= 0.1
##$BCFW= 1
##$BC_mod= 2
##$BYTORDP= 1
##$COROFFS= 0
##$CY= -3
##$DATMOD= 1
##$DC= 2
##$DFILT= <>
##$DTYPP= 0
##$F1P= 0
##$F2P= 0
##$FCOR= 0.5
##$FTSIZE= 0
##$FT_mod= 4
##$GAMMA= 1
##$GB= 0.15
##$INTBC= 1
##$INTSCL= 1
##$ISEN= 128
##$LB= 0.25
##$LEV0= 0
##$LPBIN= 0
##$MAXI= 10000
##$MC2= 0
##$MEAN= 0
##$ME_mod= 0
##$MI= 1.114404
##$NCOEF= 0
##$NC_proc= 0
##$NLEV= 6
##$NOISF1= 3.799351
##$NOISF2= 2.8
##$NSP= 1
##$NTH_PI= 0
##$NZP= 0
##$OFFSET= 14.38212
##$PC= 1
##$PHC0= -832.972
##$PHC1= 13.99221
##$PH_mod= 1
##$PKNL= yes
##$PPARMOD= 0
##$PSCAL= 0
##$PSIGN= 0
##$REVERSE= no
##$SF= 200.129724274929
##$SI= 16384
##$SIGF1= 3
##$SIGF2= 2
##$SINO= 400
##$SIOLD= 16384
##$SREGLST= <1H.CDCl3>
##$SSB= 0
##$STSI= 0
##$STSR= 0
##$SW_p= 3205.1282051282
##$SYMM= 0
##$S_DEV= 0
##$TDeff= 0
##$TDoff= 0
##$TI= <>
##$TILT= no
##$TM1= 0
##$TM2= 0
##$TOPLEV= 0
##$USERP1= <user>
##$USERP2= <user>
##$USERP3= <user>
##$USERP4= <user>
##$USERP5= <user>
##$WDW= 1
##$XDIM= 8192
##$YMAX_p= 0
##$YMIN_p= 0
$$ End of Bruker specific parameters
$$ ---------------------------------
##NTUPLES= NMR FID
##VAR_NAME=  TIME,          FID/REAL,        FID/IMAG
##SYMBOL=    X,             R,               I
##VAR_TYPE=  INDEPENDENT,   DEPENDENT,       DEPENDENT
##VAR_FORM=  AFFN,          ASDF,            ASDF
##VAR_DIM=   8192,          8192,            8192
##UNITS=     SECONDS,       ARBITRARY UNITS, ARBITRARY UNITS
##FACTOR=    0.0002768,     1,               1
##FIRST=     0,             0,               0
##LAST=      2.2672688,     0,               0
##MIN=       0,             -188568,         0
##MAX=       2.2672688,     116048,          0
$$ Real data points
##PAGE= N=1
##DATA TABLE= (X++(R..R)), XYDATA
$$ plain form
0 0 0 0 0 0 0 0 0 0 0 0 0 0 0 0 0 0 0 -8 8 -8 8 -8 8 -13 16 -16 19 -24 24 -31 33 -39 43 -50 55 -62 70 -78 88
39 88 -98 106 -120 133 -146 161 -178 197 -218 240 -263 290 -319 353 -391 433 -478 533 -596 670
59 670 -758 867 -1001 1176 -1411 1743 -2247 3109 -4839 9638 -51680 -156750 -6862 71322
73 71322 33617 63717 116048 96213 85766 90497 65960 31106 7695 -59267 -123290 -101877
85 -101877 -86715 -121514 -79883 -14152 -23490 -13395 32712 40401 54132 80542 74425 48605 24026
98 24026 9941 21623 36062 11906 -44968 -59505 -25843 -29043 -48804 -24527 -10532 -21298
110 -21298 -16147 -6201 20973 52204 33815 14470 40060 47814 15896 2756 24484 24200 -21596
123 -21596 -53720 -52961 -53092 -43862 -32039 -37440 -28906 -10764 2189 36763 62961 51153 38832
$$ packed form
0@%%%%%%%%%%%%%%%%%qJ6j6J6j6J6k1K9l2L5m3M8n5O4p2Q2r3J05j17J32j48J66
39H8j86K04k26K53k79L07l39L75m15M58n03N53o09O72p44Q24r11J011j129J266
59F70j428J625j868K177k587L154l990N356p948J4477o1318j05070J49888P8184
73G1322l7705L0100N2331j9835j0447M731k4537l4854k3411o6962o4023K1413
85a01877J5162l4799M1631O5731r338J0095M6107P689J3731K6410o117k5820k4579
98B4026j4085J1682J4439k4156n6874j4537L3662l200j9761K4277J3995j0766
110b1298N151R946K7174L1231j8389j9345K5590P754l1918j3140K1728k84m5796
123b1596l2124P59j31R230J1823n401Q534J8142J2953L4574K6198j1808j2321
$$ plain form
136 38832 37059 26564 13117 7033 6396 -8193 -32059 -30199 -17011 -17849 -18756 -15919 -6330 21
150 21 -17835 -23251 6954 25182 19798 11769 9104 18585 23634 14844 12755 9549 -8831 -27457
164 -27457 -30375 -14211 -4469 -15654 -15569 -3205 425 9180 18795 18435 18632 13469 3264 747 -4526
179 -4526 -8220 -2226 -3695 -16395 -25179 -18139 471 2434 -5692 1836 7466 1757 4810 14695 24710
194 24710 22961 3682 -1196 11419 10406 -1238 -8268 -9490 -11701 -21320 -25327 -14732 -7495 -5062
208 -5062 -3351 -3269 4547 13908 14608 19832 21225 8912 2017 1139 -455 -1565 -4435 -8290 -12602 -18084
224 -18084 -10529 962 315 -3299 -3897 -146 6539 4531 2135 12581 15600 6376 582 3268 8979
239 8979 4770 -6666 -8062 -7885 -15571 -17967 -11733 -3328 409 -3623 -2213 8122 13400 15551 15609
$$ packed form
136C8832j773j0495j3447o084o37j4589k3866J860J3188q38r07K837R589O351
150B1j7856n416L0205J8228n384q029k665R481N049q790k089l206j8380j8626
164b7457k918J6164R742j1185Q5J2364L630Q755R615l60J97n163j0205k517n273
179d526l694N994j469j2700q784P040J8610J963q126P528N630n709L053R885J0015
194B4710j749j9279m878J2615j013j1644p030j222k211r619m007J0595P237K433
208e062J711Q2P816R361P00N224J393j2313o895q78j594j110k870l855m312n482
224a8084P555J1491o47l614n98L751O685k008k396J0446L019r224n794K686N711
239H979m209j1436j396J77p686k396O234Q405L737m032J410J0335N278K151N8
$$ plain form
254 15609 9982 6012 2135 -1199 -758 -3575 -7692 -7212 -9188 -10831 -7427 -3151 878 -674 -5142
269 -5142 -1526 2827 1689 3421 7253 9148 6892 1186 3255 10169 7764 -269 -6007 -7649 -6113
284 -6113 -8796 -10927 -5053 -2901 -5224 -3019 2372 8018 9592 7275 6752 5208 702 -87 80 -2123
300 -2123 -2751 -4128 -5034 -3716 -2887 805 4452 808 -2886 -2290 675 2839 347 -1283 2656 2064
316 2064 -902 1051 4912 5611 1374 -3880 -2717 -1351 -3910 -4448 -3189 -1959 -1219 -2584 -342 5755
332 5755 6468 4360 3242 1634 624 -378 -1021 -778 -3182 -5329 -3409 -2099 -911 1585 2557 2499 797
349 797 -823 1718 3371 681 -1217 -816 -58 -358 -1758 48 3682 1105 -2763 -2428 -446 87 -1548
366 -1548 -2420 -87 241 -1300 481 2950 3966 2802 416 174 793 -439 -909 -1206 -2571 -3181 -3283
$$ packed form
254A5609n627l970l877l334M41k817m117M80j976j643L404M276M029j552m468
269e142L616M353j138J732L832J895k256n706K069O914k405q033n738j642J536
284f113k683k131N874K152k323K205N391N646J574k317n23j544m506p89J67k203
300b123o28j377r06J318Q29L692L647l644l694N96K965K164k492j630L939n92
316B064k966J953L861O99m237n254J163J366k559n38J259J230P40j365K242O097
332E755P13k108j118j608j010j002o43K43k404k147J920J310J188K496R72n8j702
349G97j620K541J653k690j898M01P58l00j400J806L634k577l868L35J982N33j635
366a548q72K333L28j541J781K469J016j164k386k42O19j232m70k97j365o10j02
$$ plain form
383 -3283 -1755 263 340 1283 2405 1131 202 1823 2819 2092 -73 -1660 -84 -112 -1312 -997 506
400 506 362 -1867 -3210 -1375 1107 -236 -1611 -377 916 1147 445 1754 3664 2346 108 -13
416 -13 520 -38 -652 -1687 -1995 -1961 -2784 -1350 -187 -273 369 250 545 512 658 1967 2161 297 -594 604
436 604 730 621 -518 -195 466 -1363 -2660 -1326 403 -4 -1195 -1503 291 1137 219 822 1730 1428
454 1428 536 -668 36 779 -342 -991 -870 -1235 -879 -124 299 736 212 -93 130 87 -109 667 835 311
474 311 -552 -689 971 1146 -253 -282 121 -223 -1328 -1393 -205 514 -475 -1297 89 1055 784 677 916
493 916 1465 233 -536 -253 123 -49 -422 -854 -493 54 -407 347 684 75 -142 56 -112 35 -106 -97 181
514 181 -871 -814 305 859 514 95 275 634 -304 -677 193 477 -242 -830 -936 464 850 91 209 879
$$ packed form
383c283J528K018P7R43J122j274r29J621R96p27k165j587J576k8j200L15J503
400E06j44k229j343J835K482j343j375J234J293K31p02J309J910j318k238j21
416a3N33n58o14j035l08L4q23J434J163q6O42j19K95l3J46J309J94j864q91J198
436F04J26j09j139L23O61j829j297J334J729m07j191l08J794Q46r18O03R08l02
454A428q92j204P04P43j121o49J21l65L56P55M23M37n24l05K23m3j96P76J68n24
474C11q63j37J660J75j399k9M03l44j105o5J188P19r89q22J386R66k71j07K39
493I16N49j232p69K83L76j72l73m32L61N47m61P54L37o09k17J98j68J47j41RK78
514A81j052N7J119N54l45m19J80L59r38l73Q70K84p19n88j06J400L86p59J18O70
$$ plain form
534 879 399 214 -522 -79 199 -814 -850 -789 -286 245 526 574 819 494 71 411 236 -222 163 -349 -712
555 -712 -616 -406 447 770 -140 87 149 -53 -78 -335 -4 184 -631 -343 400 846 244 157 185 506 0 -463
577 -463 -153 31 -427 -495 -779 -461 -57 59 351 606 120 88 566 328 569 -219 -310 -79 -559 -250 141
598 141 75 -36 -107 93 211 158 39 -207 22 -139 -514 141 699 244 -84 -209 250 305 251 -120 -136 -173 -829
621 -829 -905 -333 99 -358 -84 -322 308 316 312 511 468 204 -281 -107 -249 -9 131 182 -123 -136 -226 278 124
644 124 -183 -135 -215 221 -237 -96 241 491 56 87 36 259 176 -47 510 100 -173 -86 -132 58 51 -145 -230 -55
668 -55 140 -41 -2 100 -68 42 -115 279 74 49 263 -90 -64 -182 119 172 -245 -103 -299 2 -49 71
690 71 -177 282 92 -281 16 25 -249 165 -152 -123 111 -136 -353 226 80 -154 25 -138 181 -17 12 -245
$$ packed form
534H79m80j85p36M43K78j013l6O1N03N31K81M8K45l25m23L40j75m58L85n12l63
555g12R6K10Q53L23r10K27O2k02k5k57L31J88q15K88P43M46o02q7K8L21n06m63
577d63L10J84m58o8k84L18M04J16K92K55m86l2M78k38K41p88r1K31m80L09L91
598A41o6j11p1K00J18n3j19k46K29j61l75O55N58m55l28j25M59N5n4l71j6l7o56
621h29p6N72M32m57K74k38O30QmJ99m3k64m85J74j42K40J40N1l05j3r0N04j54
644A24l07M8q0M36m58J41L37K50m35L1n1K23q3k23N57m10k73Q7m6J90pj96q5J75
668e5J95j81L9J02j68J10j57L94k05k5K14l53K6j18L01N3m17J42j96L01n1J20
690G1k48M59j90l73K97Rk74M14l17K9K34k47k17N79j46k34J79j63L19j98K9k57
$$ plain form
712 -245 -80 -120 -308 70 -9 198 1 270 -138 47 70 167 161 106 -274 -110 110 -198 -122 325 -122 -222 -185
735 -185 -80 361 -262 -17 -190 -83 234 99 183 202 -4 -105 205 -83 -121 62 -46 -63 67 -254 -170 66
757 66 296 43 -3 -108 -303 6 -208 -161 -157 -421 -7 55 -44 33 102 60 78 -110 51 400 49 49 -47 -56 -287 -258
783 -258 0 165 -115 -123 66 162 45 -2 231 -141 169 128 291 88 314 -18 -28 -223 20 85 213 -111 -63
806 -63 -511 39 -218 -86 -254 2 299 -5 -140 172 215 265 116 -423 304 24 -69 -349 32 108 109 -66 208
829 208 -121 115 47 48 64 239 247 109 191 40 -68 -284 274 -11 -18 -88 -172 -201 -294 -69 138 -79 114 37 59
854 59 34 -26 -1 132 218 -225 -383 -40 -179 33 -371 67 113 -75 64 -112 -121 -163 -61 -73 238 223 -65 -46
878 -46 -279 300 125 -204 397 -93 86 -128 -392 -371 -79 -114 -109 -161 -55 241 11 50 192 240 -83 -104 -176 99
$$ packed form
712b45J65m0j88L78p9K07j97K69m08J85K3R7on5l80J64K20l08P6M47m47j00L7
735a85J05M41o23K45j73J07L17j35Q4J9k06j01L10k88l8J83j08j7J30l21Q4K36
757F6K30k53m6j05j95L09k14M7Mk64M14O2r9P7O9m2J8j88J61L49l51%r6rk31K9
783b58K58J65k80qJ89R6j17m7K33l72L10m1J63k03K26l32j0j95K43O5J28l24M8
806f3m48N50k57J32j68K56K97l04j35L12M3N0j49n39P27k80r3k80L81P6Jj75K74
829B08l29K36o8JJ6J75Qj38Q2j51j08k16N58k85pp0q4k9r3K25K07k17J93p7K2
854E9k5o0K5J33Q6m43j58L43j39K12m04M38M6j88J39j76rm2J02j2L11j5k88J9
878d6k33N79j75l29O01m90J79k14k64K1K92l5Nn2J06K96k30L9J42M8l23k1p2K75
$$ plain form
902 99 362 -73 -213 -140 -263 87 34 -23 157 82 103 152 119 428 -239 -9 -157 -60 -203 20 112 -38 14 56
926 56 -58 155 343 -12 -53 -183 -89 22 162 194 19 56 -48 -131 -209 41 -37 43 -356 -255 -157 -1 107 3
950 3 319 -176 -35 -82 223 192 114 -155 -14 76 -243 156 -109 -41 -234 -212 -18 8 208 213 -129 -22 240 120
974 120 -1 11 -246 33 90 -59 62 -72 -125 75 175 45 295 -27 -26 53 -160 -87 51 309 164 70 37
997 37 -89 -32 289 102 -136 -119 233 -155 -127 10 -17 -43 -4 -242 -12 -216 228 -110 338 198 -77 -135 53
1020 53 -28 33 294 61 -11 -151 -12 79 215 108 98 137 158 193 141 71 -5 54 31 -115 117 -127 53 -116 70
1045 70 -103 18 8 -32 32 -90 61 185 155 -30 118 -49 123 -85 -91 134 94 312 96 5 -119 -18 -19 -84
1069 -84 22 126 103 -100 -86 87 147 -125 135 -92 -117 -42 -210 -164 -120 177 -211 37 -283 -126 38 -141 -24
$$ packed form
902I9K63m35j40P3j23L50n3n7J80p5K1M9l3L09o67K30j48R7j43K23R2j50N2M2
926E6j14K13J88l55m1j30R4J11J40L2j75L7j04q3p8K50p8Q0l99J01R8J56J08j04
950CL16m95J41m7L05l1p8k69J41R0l19L99k65O8j93K2J94K6K00Nl42J07K62j20
974A20j21J2k57K79N7j49J21j34n3K00J00j30K50l22JP9k13P3J38K58j45r4l3
997C7j26N7L21j87k38J7L52l88K8J37k7k6L9k38K30k04M44l38M48j40k75n8J88
1020E3q1O1K61k33p2j40J39R1J36j07j0L9K1L5n2p0p6N9k3j46K32k44J80j69J86
1045G0j73J21j0m0O4j22J51J24l0j85J48j67J72k08oK25m0K18k16r1j24J01jo5
1069h4J06J04k3k03J4J73O0k72K60k27k5P5j68M6M4K97l88K48l20J57J64j79J17
$$ plain form
1092 -24 -234 -59 -101 -286 27 -36 261 -3 131 -105 9 -135 323 -124 77 87 142 -68 70 41 121 -3
1114 -3 81 94 304 35 0 -46 175 -174 -235 107 160 131 166 16 458 118 -360 -45 -123 -7 6 70 -21 -157 282
1139 282 -381 76 -298 -23 73 123 -14 -161 229 -112 154 -4 156 -46 117 128 -23 -8 -20 -79 43 141
1161 141 301 21 10 -35 33 132 258 -82 263 -49 61 46 69 97 -193 -28 -112 -176 -187 -197 -65 -49 -153 73
1185 73 -60 -201 -227 -62 92 107 -21 111 76 195 28 14 -16 -85 -128 -8 44 -164 224 120 -146 183 122
1208 122 -21 -142 27 -316 12 -17 73 230 -256 142 84 99 -66 0 -7 -162 26 19 187 -18 82 -25 -85
1231 -85 117 13 -99 40 -123 -92 -18 -64 -112 106 -95 274 233 -266 127 51 -62 293 314 95 350 184 -178
1254 -178 -192 128 -117 -192 -235 146 87 36 350 -18 -280 -120 142 -61 88 -211 180 -98 -205 -116 265 23
$$ packed form
1092b4k10J75m2j85L13o3K97k64J34k36J14j44M58m47K01J0N5k10J38k9Q0j24
1114cQ4J3K10k69l5m6K21l49o1L42N3k9L5j50M42l40m78L15p8J16J3O4r1j36M39
1139B82o63M57l74K75R6N0j37j47L90l41K66j58J60k02J63J1j51J5j2n9J22R8
1161A41J60k80j1m5O8R9J26l40L45l12J10j5K3K8k90J65q4o4j1j0J32J6j04K26
1185G3j33j41k6J65J54J5j28J32l5J19j67j4l0o9m3J20N2k08L88j04k66L29o1
1208A22j43j21J69l43L28k9R0J57m86L98n8J5j65O6pj55J88pJ68k05J00j07o0
1231h5K02j04j12J39j63L1P4m6m8K18k01L69m1m99L93p6j13L55K1k19K55j66l62
1254a78j4L20k45p5m3L81n9n1L14l68k62J60K62k03J49k99L91k78j07Q9L81k42
$$ plain form
1276 23 -307 -164 -70 91 160 -73 -267 -57 174 -98 63 -196 30 -155 -53 -119 -65 -334 58 181 120 96
1298 96 51 132 16 32 185 54 151 -89 151 -31 -44 176 28 -218 23 132 -96 -112 123 182 -432 23 -33
1321 -33 138 52 -68 -10 -10 140 107 -105 86 -40 -291 -393 -111 -58 80 115 22 13 119 134 -87 -125 110 -19
1345 -19 125 246 235 153 151 -205 57 -105 131 20 31 80 -186 -33 -72 -500 -204 -61 -183 217 -216 189 -36
1368 -36 308 233 -189 -105 216 217 280 -282 -277 -48 -269 -78 -20 -30 53 -34 35 4 -275 -35 -98 -69 11 169 9 41
1394 41 -62 -152 197 -36 -71 -82 -267 -58 -232 -140 -117 44 49 -67 120 85 136 -42 77 -105 42 134 78 -164
1418 -164 44 -60 320 188 267 54 10 -54 -502 -29 83 -43 240 54 -28 -152 -170 263 76 -226 -149 -89
1440 -89 108 -70 99 204 33 -457 92 -357 5 22 -222 56 -38 126 -58 -7 -156 34 -21 2 -111 143
$$ packed form
1276B3l30J43R4J61O9k33j94K10K31k72J61k59K26j85J02o6N4k69L92J23o1k4
1298I6m5Q1j16J6J53j31R7k40K40j82j3K20j48k46K41J09k28j6K35N9o14M55n6
1321c3J71q6j20N8%J50l3k12J91j26k51j02K82N3J38L5r3rJ06J5k21l8K35j29
1345a9J44J21j1q2kl56K62j62K36j11J1M9k66J53l9m28K96J43j22M00m33M05k25
1368c6L44p5m22Q4L21JO3n62NK29k21J91N8j0Q3q7O9l1k79K40o3K9Q0J58j60L2
1394D1j03r0L49k33l5j1j85K09j74R2K3J61Nj16J87l5N1j78J19j82J47R2n6k42
1418a64K08j04L80j32P9k13m4o4m48M73J12j26K83j86q2j24j8M33j87l02P7O0
1440h9J97j78J69J05j71m90N49m49L62J7k44K78r4J64j84N1j49J90n5K3j13K54
$$ plain form
1462 143 69 34 -205 -146 -85 164 116 -98 62 20 -95 -54 145 -81 197 -78 -126 142 242 -46 -8 177 317
1485 317 -221 189 -80 -144 -85 -193 -154 128 -29 204 -3 -4 86 30 -236 82 -47 13 -140 -29 -84 489 154
1508 154 72 -57 -269 -197 -162 28 -223 -44 144 -107 68 14 49 128 -118 -90 -136 -115 103 -182 30 91 -4 -69
1532 -69 -16 -13 186 119 -158 119 17 129 146 47 99 249 -31 126 208 -156 1 262 191 318 -155 96 -27
1555 -27 69 39 212 -126 -13 -102 -75 169 -89 109 96 252 79 101 -178 118 97 38 -57 -148 -240 223 144 -175
1579 -175 30 -4 65 166 -184 -267 85 78 -106 -119 76 132 -100 194 -79 163 -264 -52 -161 136 40 44 -23 187
1603 187 -172 16 156 -215 -83 -75 9 144 115 60 124 41 -127 -41 -226 23 44 -94 136 1 -228 -1 16
1626 16 333 158 -49 206 -16 -101 94 149 127 -40 -92 87 -134 -248 -206 103 -36 3 61 182 -27 -92 16
$$ packed form
1462A43p4l5k39N9O1K49m8k14J60m2j15M1J99k26K78k75m8K68J00k88L8J85J40
1485C17n38M10k69o4N9j08L9K82j57K33k07jR0n6k66L18j29O0j53J11n5N73l35
1508A54q2j29k12P2L5J90k51J79J88k51J75n4L5P9k46K8m6K1K18k85K12O1r5o5
1532f9N3LJ99o7k77K77j02J12J7r9N2J50k80J57Q2l64J57K61p1J27m73K51j23
1555b7R6l0J73l38J13q9K7K44k58J98j3J56j73K2k79K96k1n9r5r1r2M63p9l19
1579a75K05l4O9J01l50q3L52pj84j3J95N6k32K94k73K42m27K12j09K97r6Mo7K10
1603A87l59J88J40l71J32QQ4J35k9n5O4q3j68Q6j85K49K1j38K30j35k29K27J7
1626A6L17j75k07K55k22q5J95N5k2j67n2J79k21j14M2L09j39L9N8J21k09o5J08
$$ plain form
1649 16 -65 -113 234 -5 -140 -316 -154 -97 -114 1 39 127 115 75 -156 102 -218 -91 146 208 -127 -210 -111 137
1673 137 -95 74 -90 230 258 225 122 -23 211 -34 16 -221 -291 127 -217 -70 -131 45 -68 -183 -137 -49
1695 -49 -172 28 75 -29 65 -179 135 -29 120 -223 -51 -97 -24 34 -99 -107 -196 -158 -91 -185 46 -188 -223 -186 -100
1720 -100 -99 317 62 -5 -81 -78 -37 22 5 -54 -66 105 161 -232 -71 147 223 -196 -18 -115 218 -91 -114 -14 202
1745 202 98 -368 294 110 -9 -265 -208 -68 57 69 56 81 23 169 -37 -79 -86 -45 -38 204 -66 -28 31 -112
1769 -112 24 -89 74 -216 108 -294 -41 99 -257 34 -73 171 -18 -299 -40 11 187 -244 167 91 100
1790 100 -99 127 -116 -5 67 48 -7 -24 161 226 -163 -334 -62 -160 34 -43 302 172 -144 178 240 -109 0
1813 0 -62 -29 192 71 -105 108 116 -23 -155 -144 31 -125 -157 23 -62 135 -33 68 -158 -32 15 -74 50 49
$$ packed form
1649A6q1m8L47k39j35j76J62N7j7J15L8Q8j2m0k31K58l20J27K37O2l35q3R9K48
1673A37k32J69j64L20K8l3j03j45K34k45N0k37p0M18l44J47o1J76j13j15M6Q8
1695d9j23K00M7j04R4k44L14j64J49l43J72m6P3N8j33qq9L8O7r4K31k34l5L7Q6
1720a00JM16k55o7p6LM1N9j7n9j2J71N6l93J61K18P6m19J78r7L33l09k3J00K16
1745B02j04m66O62j84j19k56N7J40J25J2j3K5n8J46k06m2pM1PK42k70L8N9j43
1769a12J36j13J63k90L24m02K53J40l56K91j07K44j89k81K59N1J76m31M11p6R
1790A00j99K26k43J11P2j9n5j7J85O5l89j71K72r8J94p7L45j30l16L22O2l49J09
1813@o2L3K21j21j76K13Qj39j32J1J75j56l2J80q5J97j68J01k26J26M7q9J24j
$$ plain form
1837 49 127 -3 -44 -133 -73 63 25 -44 -166 97 37 39 184 -146 -95 -59 55 -88 -188 -45 127 194 -187 141
1861 141 -166 -3 259 -85 -19 79 -8 219 174 295 69 45 -120 -5 167 -47 134 28 71 133 211 -254 174
1884 174 -125 261 -19 16 -126 -223 -338 -29 2 -29 -76 -159 20 167 -122 290 -135 -12 205 72 -134 23
1906 23 205 -67 221 -60 193 -166 -4 44 -308 -153 132 58 -14 65 16 -200 16 99 217 -71 -64 -160 -70 203
1930 203 262 392 185 -84 50 -10 -59 -32 53 -10 -65 65 89 65 -105 -191 -214 -86 97 -187 134 -53 39 -62
1954 -62 -141 222 -112 117 104 139 -69 -106 -36 -89 -28 40 -153 150 35 -443 -141 117 116 -93 57 58 126 41 173
1979 173 108 -275 11 32 -113 48 106 -181 -349 -80 -115 108 -85 -27 -200 -8 -38 -93 162 -238 -84 163
2001 163 156 15 160 -137 184 -22 -24 9 -352 133 -46 -5 107 72 -99 -104 74 -5 123 -310 -209 -88 154
$$ packed form
1837D9P8j30m1q9O0J36l8o9j22K63o0KJ45l30N1L6J14j43j00J43J72O7l81L28
1861A41l07J63K62l44O6R8q7K27m5J21k26k4j65J15J72k14J81j06M3O2P8m65M28
1884A74k99L86k80L5j42r7j15L09L1l1m7q3J79J47k89M12m25J23K17j33k06J57
1906B3J82k72K88k81K53l59J62M8l52J55K85p4p2P9m9k16K16Q3J18k88Pr6R0K73
1930B03N9J30k07k69J34o0m9K7Q5o3n5J30K4k4j70q6k3J28J83k84L21j87R2j01
1954f2p9L63l34K29j3L5k08l7P0n3O1O8j93L03j15m78L02K58jk09J50JO8q5J32
1979A73o5l83K86K1j45J61N8k87j68K69l5K23j93N8j73J92l0n5K55m00J54K47
2001A63pj41J45k97L21k06kL3l61M85j79M1J12l5j71nJ78p9J28m33J01J21K42
$$ plain form
2024 154 22 -80 -28 -129 134 -73 -255 65 -70 -60 -114 146 -60 -203 -50 -134 -85 180 -139 -375 79 -87
2046 -87 -21 271 38 -54 -231 -123 -184 -150 -104 -145 -37 -145 102 77 238 59 115 288 -2 131 107 -107 5
2069 5 -5 -91 -124 16 -144 -82 126 -93 83 66 -137 -38 153 -128 74 -37 -33 117 81 -100 -36 -201 -70 -345
2093 -345 -26 -50 -245 17 191 -8 100 -99 -88 201 -153 -9 -87 -7 -77 21 27 -9 129 224 40 91 -408 -29
2117 -29 -29 489 -144 -67 -124 -94 -190 -73 -13 104 97 135 79 164 -60 -172 -254 83 -67 84 65 83 240 -78 -20 -132
2143 -132 156 -213 41 46 -11 94 9 97 331 102 78 -81 -73 -13 316 -24 205 -57 73 -278 46 -341 407
2166 407 -104 78 53 -16 34 -60 23 -167 241 -103 -157 -223 242 6 4 -17 40 12 -9 -47 -173 -28 -118 -24 -143
2191 -143 43 235 33 86 170 -33 -30 33 54 211 75 -31 137 92 62 69 -81 127 223 -380 8 -87 38 -112
$$ packed form
2024A54j32j02N2j01K63k07j82L20j35J0n4K60k06j43J53q4M9K65l19k36M54j66
2046h7O6K92k33r2j77J08o1L4M6m1J08j08K47k5J61j79N6J73k90J33k4k14J12
2069Ej0q6l3J40j60O2K08k19J76j7k03R9J91k81K02j11MJ50l6j81O4j65J31k75
2093c45L19k4j95K62J74j99J08j99J1K89l54J44p8Q0p0R8Ol6J38R5j84N1m99L79
2117b9%N18o33P7n7L0r6J17O0J17pL8n6Q5k24j12q2L37j50J51j9J8J57l18N8j12
2143a32K88l69K54Nn7J05q5Q8K34k29k4j59QO0L29l40K29k62J30l51L24l87P48
2166D07n11J82k5o9N0r4Q3j90M08l44n4o6M65k36kk1N7k8k1l8j26J45r0R4j19
2191a43J86J92k02N3Q4k03LO3K1J57j36j06J68m5l0Pj50K08R6o03L88r5J25j50
$$ plain form
2215 -112 -137 160 -94 110 32 -24 -62 -103 55 -99 -86 9 81 47 181 50 -225 46 -116 -16 -8 -118 -247 77
2239 77 -90 -66 171 37 -137 98 38 100 225 -81 101 -83 -109 9 -112 90 -90 -23 138 -17 -101 -193 -53
2262 -53 -112 -126 223 -48 -32 64 -87 -6 214 -81 -87 -223 23 155 -3 15 101 11 108 110 -140 41 -151 63 166
2287 166 81 -122 95 -190 127 294 -102 -256 -152 -71 60 -98 -59 121 327 28 -253 114 -218 47 -139
2308 -139 -67 314 -16 64 47 66 294 209 -20 -90 -8 25 162 -35 -354 155 -7 20 -7 98 54 -60 -18 -47
2332 -47 -39 26 178 40 -19 -214 92 25 -48 -181 -88 -32 48 -48 -24 79 -102 -63 -88 114 54 9 -62 -237 29 66
2358 66 140 126 97 131 -47 85 258 116 72 -109 199 96 -28 -42 -109 11 -425 60 -101 89 -113 125 187
2381 187 -6 68 -41 -322 46 -23 -57 -95 101 -231 -158 83 -216 19 -193 55 -9 -185 116 164 -135 -58 44
$$ packed form
2215a12k5K97k54K04p8n6l8m1J58j54J3R5P2l4J34j31k75K71j62J00Qj10j29L24
2239G7j67K4K37j34j74K35o0O2J25l06J82j84k6J18j21K02j80O7J61j55q4r2J40
2262e3n9j4L49k71J6R6j51Q1K20k95oj36K46J32j58J8Q6r0R7Kk50J81j92K14J03
2287A66q5k03K17k85L17J67l96j54J04Q1J31j58L9J80K06k99k81L67l32K65j86
2308a39P2L81l30Q0j7J9K28q5k29p0Q2L3J37j97l19N09j62K7k7J05m4j14M2k9
2332d7QO5J52j38n9j95L06o7p3j33R3N6Q0r6K4J03j81L9k5K02o0m5p1j75K66L7
2358F6P4j4k9L4j78J32J73j42m4j81L08j03j24j4o7J20m36M85j61J90k02K38O2
2381A87j93P4j09k81L68o9l4l8J96l32P3K41k99K35k12K48o4j76L01M8k99P7J02
$$ plain form
2404 44 45 29 10 -141 142 -218 -222 -24 -344 253 238 18 -103 -102 -34 369 107 104 70 99 89 -123 17 -220 233
2429 233 -122 208 -118 -30 96 -41 -25 -294 84 -144 -25 -50 0 30 -255 30 70 -52 -232 79 17 108 -71
2452 -71 -56 -68 70 224 -97 -102 111 -207 182 -153 200 -108 -138 166 -394 79 25 101 127 170 -226 248 33
2475 33 -455 -120 66 176 -184 -60 -51 -33 -132 -131 -149 -117 -63 72 -251 55 57 2 143 -118 49 95 -14 -62 -126
2500 -126 180 -106 -33 224 -121 -70 28 -250 174 326 -47 -238 -69 214 -362 262 -68 90 187 -23 5 -129
2522 -129 104 -96 -197 -61 -29 -316 -92 -280 -157 -130 5 143 -31 143 -79 -119 95 28 -135 -48 -111 -22
2544 -22 -52 -38 32 -24 -305 -174 218 -180 302 -42 -25 163 69 39 -112 -2 122 23 -58 471 -78 -9 102 -220
2568 -220 167 -139 187 -14 -76 -42 -25 232 -100 -60 175 150 12 -227 -67 -3 -139 219 -68 183 89 -124
$$ packed form
2404D4Jj6j9j51K83l60mJ98l20N97j5k20j21JO8M03k62ll4K9j0k12J40k37M53
2429B33l55L30l26Q8J26j37J6k69L78k28J19k5N0L0k85K85M0j22j80L11o2R1j79
2452g1J5j2J38J54l21nK13l18L89l35L53l08l0L04n60M73n4P6K6M3l96M74k15
2475C3m88L35J86J10l60J24RJ8r9Jj8L2N4J35l23L06Kn5J41k61J67M6j09m8o4
2500a26L06k86P3K57l45N1R8k78M24J52l73j91J69K83n76O24l30J58R7k10K8j34
2522a29K33k00j01J36L2k87K24j88J23K7J35J38j74J74k22m0K14o7j63Q7o3Q9
2544b2l0J4P0n6k81J31L92l98M82l44J7J88r4l0j51J10J24r9q1N29n49O9J11l22
2568b20L87l06L26k01o2L4J7K57l32M0K35k5j38k39J60O4j36L58k87K51r4k13
$$ plain form
2590 -124 267 321 208 211 186 191 320 189 -285 -5 -185 58 -165 -145 -201 91 250 30 217 355 -53 -138 74
2613 74 -102 -255 -101 -290 50 -115 -84 -131 -183 -81 101 15 -204 250 172 222 160 -77 153 114 3 -108 -278
2636 -278 99 159 -267 485 -125 33 208 -129 -145 -244 66 164 -177 -212 -4 -121 -83 87 -90 -61 -253 -27
2658 -27 -216 -58 -78 -91 -130 67 20 58 15 84 66 -48 174 -144 66 -86 -161 39 -32 -30 -63 -276 -191 24 -99
2683 -99 19 141 -161 108 240 -38 -47 -222 34 -67 -28 -87 186 -80 -72 100 143 -62 -22 44 -35 -100 -55 -149 -94
2708 -94 -188 -13 -94 318 2 -143 110 -67 -35 -137 -28 -108 -57 248 49 245 19 -142 115 91 176 310 -39
2731 -39 305 99 95 -94 -2 -187 52 25 -74 26 -62 -8 -76 64 -58 -239 -12 -27 -166 161 -196 -86 29
2754 29 -84 72 254 23 -12 -39 115 72 176 254 105 62 21 -76 -34 75 45 -142 -128 -29 24 -104 -172 417 -71
$$ packed form
2590a24L91N4j13Lk5NJ29j31m74K80j80K43k23K0n6K92J59k20J87J38m08q5K12
2613G4j76j53J54j89L40j65L1m7n2J02J82q6k19M54p8N0o2k37K30l9j11j11j70
2636b78L77O0m26P52o10J58J75l37j6r9L10R8l41l5K08j17L8J70j77K9j92K26
2658b7j89J58k0j3l9J97m7L8m3O9j8j14K22l18K10j52p5K00p1Kl3k13Q5K15j23
2683i9J18J22l02K69J32k78rj75K56j01L9n9K73k66QJ72M3k05M0O6p9o5M5r4N5
2708i4r4J75q1M12l16j45K53j77L2j02J09q0N1L05j99J96k26j61K57k4Q5J34l49
2731c9L44k06mj89R2j85K39k7r9J00q8N4o8J40j22j81K27j5j39L27l57J10J15
2754B9j13J56J82k31l5k7J54m3J04P8j49m3m1r7M2J09l0j87J4R9N3j28o8N89m88
$$ plain form
2779 -71 -149 52 50 -14 39 63 -23 104 -6 -55 102 65 252 -27 7 152 74 20 307 196 -85 -68 42 228 87
2804 87 132 19 -243 -269 216 96 136 70 -228 132 109 -74 41 74 132 128 -51 -126 54 389 77 18 171 -77
2828 -77 39 -188 -295 -24 232 -205 -48 97 51 192 -81 71 107 123 -52 -350 29 95 -161 216 69 -169
2850 -169 8 27 25 43 31 183 -21 -43 -128 -248 0 198 -22 117 172 -215 -144 10 -60 -162 -31 62 165 123
2874 123 -380 194 209 -92 46 -46 -59 156 -10 34 -173 -115 152 -94 -72 -155 145 65 -11 113 -240 5 1 -270
2898 -270 49 435 314 -43 27 -186 147 55 59 1 -66 32 -15 -32 36 273 -253 -98 -5 -10 28 81 -86 191 54
2923 54 246 -13 -98 -13 14 45 -212 -83 49 -44 -37 -236 62 116 -42 120 -63 -14 37 15 258 5 1 -30 -94
2948 -94 13 -224 188 -81 -233 17 -51 62 161 51 -332 -130 -158 135 -37 -405 72 -215 176 235 55 109
$$ packed form
2779g1p8K01ko4N3K4q6J27j10m9J57l7J87k79L4J45p8n4K87j11k81J7J10J86j41
2804H7M5j13k62k6M85j20M0o6k98L60k3j83J15L3N8mj79p5J80L35l12n9J53k48
2828g7J16k27j07K71K56m37J57J45m6J41k73J52L6J6j75k98L79O6k56L77j47k38
2850a69J77J9kJ8j2J52k04k2q5j20K48J98k20J39N5l87P1J54p0j02J31R3J03m2
2874A23n03N74J5l01J38r2j3K15j66M4k07N8K67k46K2q3L00q0p6J24l53K45mk71
2898b70L19L86j21l57P0k13L33r2Mn8o7R8m7j7O8K37n26J55R3nL8N3j67K77j37
2923E4J92k59q5Q5K7L1k57J29J32r3Pj99K98N4j58J62j83M9N1k2K43k53ml1o4
2948i4J07k37M12k69j52K50o8J13R9j10l83K02k8K93j72l68M77k87L91N9j80N4
$$ plain form
2970 109 27 -56 71 -108 171 83 94 44 -191 -37 -130 242 -276 92 -250 314 -148 -151 88 169 8 229 187
2993 187 224 -136 -68 70 -33 153 -138 257 141 161 -110 -179 6 -246 -46 138 189 -166 118 -126 68 -154
3015 -154 52 127 131 144 207 104 -268 91 57 48 183 -27 -54 -213 311 -96 -40 52 -52 -136 -76 56 -96 9
3039 9 174 -138 -39 140 -125 -111 -414 8 38 -13 -427 50 -48 55 135 197 -56 -63 106 -152 -249 -14 30 -61 -132
3064 -132 44 -85 196 201 -208 18 376 -119 -178 -155 126 -161 87 4 -53 -110 45 17 -150 -25 -83 -237 29
3087 29 202 -221 -192 79 19 -72 22 -31 -80 3 -37 26 -77 141 135 251 93 -29 14 214 49 71 141 46 -55
3112 -55 14 -169 12 -40 275 -63 -45 -251 227 171 -54 -97 35 92 -79 84 -2 121 200 -77 254 17 -211
3135 -211 66 15 11 275 182 -74 -140 191 44 107 136 -200 96 125 88 247 33 -55 -162 -58 232 -3 -43 -241
$$ packed form
2970A09q2q3J27j79K79q8J1n0k35J54r3L72n18L68l42N64m62lK39Q1j61K21m2
2993A87L7l60O8J38j03J86k91L95j16K0k71o9J85k52K00J84N1l55K84k44J94k22
3015a54K06P5MJ3O3j03l72L59l4rJ35k10k7j59N24m07N6R2j04q4O0J32j52J05
3039IJ65l12R9J79k65J4l03M22L0n1m14M77r8J03Q0O2k53pJ69k58r7K35M4r1p1
3064a32J76j29K81Nm09K26L58m95n9K3K81k87K48q3n7n7J55k8j67J25n8j54K66
3087B9J73m23K9K71o0r1R4n3m9Q3m0O3j03K18oJ16j58j22M3K00j65K2P0r5j01
3112e5O9j83J81n2L15l38J8k06M78n6k25m3J32N7j71J63q6J23P9k77L31k37k28
3135b11K77n1mK64r3k56o6L31j47O3K9l36K96K9l7J59k14q8j07J04K90k35m0j98
$$ plain form
3159 -241 -112 -366 -359 -34 42 8 -226 -24 131 23 122 -93 18 -80 121 189 -22 136 140 -17 -189 130 94
3182 94 167 1 47 127 -239 318 -18 185 74 387 -35 -14 92 -28 -96 -12 -153 51 23 -32 -41 -212 72 94
3206 94 -202 19 -242 -9 98 72 -189 -356 64 -224 95 -91 -385 -10 209 258 196 205 -24 -232 -142 -80 -70
3229 -70 -131 -288 359 94 7 260 -196 347 -307 -248 14 -172 70 -307 53 66 76 -76 78 -27 -78 -161 -280
3252 -280 -137 -106 118 209 337 -100 -89 76 17 -250 131 82 -89 21 0 11 177 185 35 17 -24 207 199 53
3276 53 -204 -50 -84 -44 38 -101 94 -76 -16 6 56 219 4 166 -64 45 146 -414 127 -57 172 -287
3298 -287 316 -146 84 -79 106 298 -152 -181 -269 -162 109 -196 -135 -32 -194 103 118 34 65 -69 34 235
3320 235 -263 104 -112 -106 -77 297 -76 155 -3 -192 -214 -54 -95 -106 12 92 -274 -200 1 209 31 17 275
$$ packed form
3159b41J29k54PL25P6l4k34K02J55j08R9k15J11r8K01O8k11J58Mj57j72L19l6
3182I4P3j66M6Q0l66N57l36K03j11L13m22K1J06j20o8Q4j41K04k8n5rj71K84K2
3206I4k96K21k61K33J07k6k61j67M20k88L19j86k94L75K19M9o2Rk29k08R0O2J0
3229g0o1j57O47k65q7K53m56N43o54N9K62j86K42l77L60J3J0j52J54j05n1q3j19
3252b80J43L1K24R1J28m37J1J65n9k67L81m9j71J10k1J1J66Qj50j8m1K31qj46
3276E3k57J54l4M0Q2j39J95j70O0K2N0J63k15J62k30J09J01n60N41j84K29m59
3298b87O03m62K30j63J85J92m50k9q8J07K71l05O1J03j62K97J5q4L1j34J03K01
3320B35m98L67k16OK9L74l73K31j58j89k2J60m1j1J18Q0l66P4K01K08j78j4K58
$$ plain form
3343 275 223 -38 239 32 335 117 246 -55 39 -159 -223 -129 -238 137 -133 33 -49 -292 78 -284 40 32
3365 32 -322 -40 -192 121 -262 194 186 58 423 -220 134 -100 -33 -122 -64 13 126 -19 107 -203 98 203
3387 203 101 41 57 -259 98 231 219 19 -139 -111 144 57 51 28 -46 208 -145 -306 152 96 -28 29 196 -151
3411 -151 -20 39 10 15 -52 180 201 166 18 83 -163 109 41 -104 203 99 -65 -71 76 119 -134 20 -173 -316
3435 -316 -304 177 190 177 178 -54 -16 -34 -200 104 -80 -244 11 -141 -192 -100 99 -51 -115 -71 -146 74 99 219
3459 219 -67 79 83 -20 261 44 274 101 44 -43 95 -142 -222 104 -52 -59 160 96 39 15 32 -69 -289 140
3483 140 182 52 2 -113 -182 164 221 -13 -204 13 -84 -69 5 163 21 -143 -213 152 191 12 27 -17 205 62
3507 62 -123 28 274 -74 -4 117 -57 -98 -36 -168 -282 -46 -37 340 -40 -13 46 -224 89 -190 72 69 200
$$ packed form
3343B75n2k61K77k07L03k18J29l01R4j98o4R4j09L75k70J66q2k43L70l62L24q
3365C2l54K82j52L13l83M56qj28L65o43L54k34O7q9N8P7J13j45J26l10L01J05
3387B03j02o0J6l16L57J33j2k00j58K8K55q7ok3p4K54l53j61M58n6j24N7J67l47
3411a51J31N9k9No7K32K1l5j48O5k46K72o8j45L07j04j64oJ47M3k53J54j93j43
3435c16J2M81J3j3Jk32L8j8j66L04j84j64K55j52n1R2J99j50o4M4p5K20K5J20
3459B19k86J46Mj03K81k17K30j73n7q7J38k37q0L26j56pK19o4n7k4J7j01k20M29
3483A40M2j30n0j15o9L46N7k34j91K17r7J5P4J58j42j64p0L65L9j79J5m4K22j43
3507F2j85J51K46l48P0J21j74m1O2j32j14K36RL77l80K7N9k70L13k79K62lJ31
$$ plain form
3530 200 -32 -26 -113 -49 -72 81 -31 144 268 55 4 -144 116 124 -82 -62 313 -30 108 185 -50 2 65 140
3554 140 16 125 -35 -18 -135 -308 35 92 -255 -265 -204 -170 41 133 125 -62 46 -23 160 -199 292 360 159
3577 159 20 12 180 91 46 123 -342 254 82 312 -82 -36 -52 -407 182 -201 -45 103 -81 -94 -105 -85 55
3600 55 -5 -34 -61 13 187 95 91 -163 4 364 107 -119 -155 -202 9 145 24 -52 -217 41 -56 15 101 106 271
3625 271 -20 -17 -66 -10 112 -52 44 227 -92 -9 130 115 -130 -2 12 -261 32 -162 48 -70 -78 140 -127
3648 -127 -56 174 -233 26 63 26 -104 -70 -106 59 137 -43 120 218 -216 -68 66 19 114 6 -62 -135 76 475
3672 475 138 -33 267 -161 194 -89 -252 56 -34 57 -27 17 92 -144 12 -82 -31 36 -238 -138 -95 -143 -25
3695 -25 66 53 -1 -162 -96 98 -81 41 48 153 118 117 1 -257 78 -27 -122 -166 5 -169 -233 244 -211 1
$$ packed form
3530B00k32Oq7O4k3J53j12J75J24k13n1j48K60Qk06K0L75l43J38P7k35N2O3P5
3554A40j24J09j60J7j17j73L43N7l47j0O1L4K11R2qj87J08o9J83l59M91O8k01
3577A59j39qJ68q9m5P7m65N96j72K30l94M6j6l55N89l83J56J48j84j3j1K0J40
3600E5o0k9k7P4J74r2mk54J67L60k57k26l6m7K11J36j21p6j65K58r7P1Q6NJ65
3625B71k91Lm9N6J22j64R6J83l19Q3J39j5k45J28J4k73K93j94K10j18qK18k67
3648a27P1K30m07K59L7l7j30L4l6J65P8j80J63R8m34J48J34m7R5j08o8p3K11L99
3672D75l37j71L00m28L55k83j63L08r0R1q4M4P5k36J56r4N1O7k74J00M3m8J18
3695b5R1j3n4j61O6J94j79J22PJ05l5jj16k58L35j05r5m4J71j74o4M77m55K12
$$ plain form
3719 1 -28 -219 -84 -46 -139 212 55 154 23 -246 -142 -209 -126 -51 -10 229 133 21 -115 149 -135 18 375 -127
3743 -127 128 115 -347 -525 42 71 -106 153 140 -252 -11 173 190 -253 95 125 161 49 45 29 -108 -87 -162 24
3767 24 -152 -216 -101 160 11 194 86 37 65 -86 55 77 182 -90 -320 155 -27 -77 58 28 -99 -104 -74
3790 -74 -2 152 -5 126 -79 -172 321 -132 181 256 149 -47 -100 -136 80 -136 -198 -28 -337 -110 -356 89
3812 89 -52 -135 -89 -143 52 -216 16 -254 150 265 8 176 -292 230 -22 -118 26 -170 334 224 44 167
3834 167 -299 49 -66 85 209 -61 63 37 263 -3 -55 -85 50 -42 63 -155 188 175 -147 -145 155 19
3856 19 -1 -122 149 81 127 -134 160 -132 -80 -303 9 -190 -45 -65 -125 -323 -267 44 29 74 -101 206 -238
3879 -238 37 -124 -103 7 -10 -111 -38 -11 -60 -194 15 64 131 -22 -303 287 -117 -168 88 146 85 -222 -45
$$ packed form
3719Ak9j91J35L8r3L51j57R9j31k69J04o7Q3P5M1K39r6j12j36K64k84J53L57n02
3743a27K55j3m62j78N67K9j77K59j3l92K41J84J7m43L48L0L6j12mj6j37K1p5J86
3767B4j76o4J15K61j49J83j08m9K8j51J41K2J05k72k30M75j82n0J35l0j27nL0
3790g4P2J54j57J31k05r3M93m53L13P5j07j96n3l6K16k16o2J70l09K27k46M45
3812H9j41q3M6n4J95k68K32k70M04J15k57J68m68N22k52r6J44j96N04j10j80J23
3834A67m66L48j15J51J24k70J24k6K26k66n2l0J35r2J05k18L43j3l22KL00j36
3856A9k0j21K71o8M6k61K94k92N2k23L12j99J45k0o0j98N6L11j5M5j75L07m44
3879b38K75j61K1J10j7j01P3K7m9j34K09M9O7j53k81N90m04n1K56N8o1l07J77
$$ plain form
3902 -45 -172 -245 -293 -169 -13 -192 65 232 -210 129 -42 -258 248 62 -124 -147 109 178 -188 -223 114 223
3924 223 -244 150 154 -54 -51 -130 45 35 220 59 -439 126 -75 -17 -40 -129 -57 134 -182 -211 180 -190 247 -107
3948 -107 -17 -54 91 61 -80 -55 116 319 -220 -309 56 -272 54 -131 159 -63 -86 336 150 181 178 -140 -231
3971 -231 26 -133 -109 -188 42 -59 -48 -163 61 22 -19 -44 3 203 26 -189 -143 7 -35 184 -113 134 34
3994 34 -127 -225 14 58 78 53 -81 4 161 -43 -172 -223 -286 -63 71 -40 246 53 287 27 -137 -34 -18
4017 -18 28 -301 33 -89 22 -92 99 -30 -144 9 -121 100 102 1 -51 -10 -135 -238 12 22 3 223 -202
4040 -202 -50 -274 363 55 154 223 182 219 -27 -70 -24 29 92 -52 37 130 45 252 199 1 152 -148 -96 -77 -12
4065 -12 224 -262 89 21 149 -75 77 -281 -24 -73 22 -54 85 172 44 33 58 -325 -80 139 50 -77 -36
$$ packed form
3902d5j27p3m8J24J56j79K57J67m42L39j71k16N06j86j86k3K56O9l66l5L37J09
3924B23m67L94Mk08Lp9J75j0J85j61m98N65k01N8k3q9P2J91l16k9L91l70M37l54
3948a07R0l7J45l0j41K5J71K03n39q9L65l28L26j85K90k22k3M22j86L1ll18r1
3971b31K57j59K4p9K30j01J1j15K24l9m1k5M7K00j77k15M6J50m2K19k97K47j00
3994C4j61r8K39M4K0k5j34Q5J57k04j29n1o3K23J34j11K86j93K34k60j64J03J6
4017a8M6l29L34j22J11j14J91j29j14J53j30K21Kj01n2M1j25j03K50J0j9K20m25
4040b02J52k24O37l08R9O9m1L7k46m3M6N3O3j44Q9R3q5K07n3j98J51l00N2J9O5
4065a2K36m86L51o8J28k24J52l58K57m9R5p6J39Q7j28j1K5l83K45K19q9j27M1
$$ plain form
4088 -36 -99 107 120 -107 -267 -188 113 86 205 -147 -3 -108 -7 80 -100 290 71 -166 5 86 1 -104 -43
4111 -43 42 64 42 201 -12 -90 -118 -14 330 105 -38 -41 -255 14 120 258 112 -225 189 -73 64 56 -214
4134 -214 95 -45 315 204 -110 -224 -50 -152 -215 6 -21 -117 197 -186 165 -127 -105 41 -81 -7 100 61
4156 61 -25 147 172 -108 185 278 108 23 -7 -108 110 81 -52 -112 42 116 -66 -95 -109 350 -75 20 -125 110
4180 110 -195 -243 -144 -154 -223 -147 246 67 136 -54 -11 85 113 198 -103 2 -27 79 10 181 15 -101 113 -212
4204 -212 -135 -303 32 -277 -10 -34 -187 82 -143 21 -57 38 199 203 60 -11 167 33 233 41 177 4
4226 4 51 56 56 -76 24 120 -282 48 74 -18 -236 -175 87 199 -59 126 -11 139 173 24 -15 -45 -169 224 -54
4251 -54 -105 -220 64 24 -424 -17 -43 -18 -63 -273 50 -16 -54 163 -10 104 -18 54 176 -56 12 116 -66
$$ packed form
4088c6o3K06J3k27j60P9L01k7J19l52J44j05J01Q7j80L90k19k37J71Q1q5j05O1
4111d3Q5K2k2J59k13p8k8J04L44k25j43lk14K69J06J38j46l37M14k62J37qk70
4134b14L09j40L60j11l14j14J74j02o3K21k7r6L14l83L51k92K2J46j22P4J07l9
4156F1q6J72K5k80K93R3j70q5l0j01K18k9j33o0J54P4j82k9j4M59m25R5j45K35
4180A10l05m8R9j0o9P6L93j79O9j90M3R6K8Q5l01J05k9J06o9J71j66j16K14l25
4204b12P7j68L35l09K67k4j53K69k25J64p8R5J61Mj43p1J78j34K00j92J36j73
4226DM7N%j32J00R6m02L30K6r2k18O1K62J12k58J85j37J50L4j49l9l0j24L93k78
4251e4n1j15K84m0m48M07k6K5m5k10L23o6l8K17j73J14j22P2J22k32O8J04j82
$$ plain form
4274 -66 -39 128 159 1 263 93 -41 -165 -332 -53 -302 208 12 -85 -125 19 187 -62 -197 -58 -146 -158
4296 -158 -115 -41 128 1 -142 -190 -32 195 72 14 -19 -47 5 123 -74 171 -70 -112 -14 157 244 92 -275
4319 -275 28 19 -89 228 -234 35 30 -76 -231 11 124 48 51 -128 -32 -52 2 -25 26 -84 79 -170 71 -76
4343 -76 -158 -90 -209 13 -77 -120 307 35 -12 -111 91 -200 -143 206 -2 -44 89 -72 -145 -110 117 59 -234 -82
4367 -82 77 192 67 31 -192 -146 -31 -100 -74 -85 -138 -169 199 -171 -262 -20 -28 64 -23 -111 -78 -119 94 171 135 71
4393 71 -31 -27 352 86 85 63 130 -64 -71 392 -11 214 -125 59 57 -54 -20 229 299 14 -45 120 -132 65 -2
4418 -2 21 183 3 114 30 301 127 98 181 154 -32 190 83 -1 22 268 -10 -253 -337 28 -300 110 41 -219
4442 -219 -175 73 102 -23 285 -59 -49 361 -142 19 -79 126 142 36 -204 34 -39 50 284 110 152 192 -73
$$ packed form
4274f6K7J67L1j58K62j70j34j24j67K79k49N10j96r7m0J44J68k49j35J39q8j2
4296a58M3P4J69j27j43m8J58K27j23n8l3k8N2J18j97K45k41m2R8J71Q7j52l67
4319b75L03rj08L17m62K69nj06j55K42J13p6Lj79R6k0N4k7N1j10J63k49K41j47
4343g6q2O8j19K22r0m3M27k72m7r9K02k91N7L49k08m2J33j61p3L5K27n8k93J52
4367h2J59J15j25l6k23M6J15o9K6j1n3l1L68l70r1K42qR2q7q8L3m1K13P7l6o4
4393G1j02ML79k66jk2O7j94pM63m03K25l39J84kj11L4K49P0k85n9J65k52J97o7
4418bK3J62j80J11q4K71j74k9Q3k7j86K22j07q4K3K46k78k43q4L65l28M10o9k60
4442b19M4K48K9j25L08l44J0M10n03J61r8K05J6j06k40K38p3Q9K34j74M2M0k65
$$ plain form
4465 -73 -211 182 66 -38 343 60 -256 335 8 -74 104 27 103 42 242 -47 -408 136 129 66 -40 -203 177
4488 177 -117 69 -137 -27 -183 5 -4 44 -32 47 -255 -112 -66 -93 -173 -188 151 65 -133 -41 -125 -160 59 -132
4512 -132 -249 -247 -121 92 48 -339 124 -85 -265 -55 -90 -73 -48 372 98 220 -38 223 -6 -93 -389 -168
4534 -168 40 -114 191 9 180 -281 161 129 102 -96 37 -147 209 -249 200 -121 134 -175 -123 -201 55
4555 55 303 146 7 302 38 -146 168 56 201 -92 -29 -7 83 210 149 -180 -65 -21 -16 -28 70 36 131 -83
4579 -83 208 19 -240 6 105 385 238 -106 -6 -268 228 135 -127 5 -91 490 -110 -99 -30 -123 59 -339
4601 -339 -21 -289 -241 -137 73 382 266 180 39 -4 107 -288 237 18 96 -106 22 53 -219 212 -97 187
4623 187 -242 155 281 -204 -196 17 -67 24 -29 -178 103 -143 57 -164 -50 48 -10 -182 -151 37 -58 -1 119
$$ packed form
4465g3j38L93j16j04L81k83l16N91l27q2J78p7P6o1K00k89l61N44po3j06j63L80
4488A77k94J86k06J10j56J88rM8p6P9l02J43M6k7q0j5L39q6j98R2q4l5K19j91
4512a32j17KJ26K13m4l87M63k09j80K10l5J7K5M20k74J22k58K61k29q7k96K21
4534a68K08j54L05j82J71m61M42l2k7j98J33j84L56m58M49l21K55l09N2p8K56
4555E5K48j57j39K95k64j84L14j12J45k93O3K2R0J27o1l29J15M4Nj2R8l4R5k14
4579h3K91j89k59K46R9K80j47l44J00k62M96r3k62J32r6N81o00J1O9r3J82l98
4601c39L18k68M8J04K10L09j16q6j41m3J11l95N25k19P8k02J28L1k72M31l09K84
4623A87m29L97J26m85QK13q4R1n3j49K81k46K00k21J14R8n8j72L1J88r5N7J20
$$ plain form
4646 119 -37 150 209 -123 -156 -184 -209 -14 22 -255 -19 99 89 -272 160 -27 -221 -170 -11 274 12 30 -99
4669 -99 137 -10 216 394 -62 101 170 -75 180 94 68 56 58 34 -111 -70 5 129 138 62 -60 -49 -79 185 27
4694 27 87 83 163 147 166 291 -120 194 293 -145 58 95 -5 98 -41 164 -37 -61 -104 78 -279 -46 55 -66
4718 -66 121 249 110 -9 418 -89 65 -27 69 -158 27 148 7 336 -146 182 -61 62 -89 209 261
4739 261 -37 26 -257 195 -110 236 -47 -21 -40 -44 -146 -13 137 89 269 -13 -266 -223 80 -139 -239 -159 120
4762 120 -123 12 181 72 143 57 -175 -46 -212 -59 -180 -137 -186 -125 -212 -41 46 -164 304 5 -357 -91
4784 -91 128 -253 54 -34 168 -110 -95 85 -8 172 -165 73 283 74 97 181 -151 139 -141 -39 -161 -46
4806 -46 175 332 59 257 145 -117 172 -16 171 49 248 -66 -16 141 43 86 -121 -53 -58 202 -67 -34 -87
$$ packed form
4646A19j56J87N9l32l3k8k5J95L6k77K36J18j0l61M32j87j94N1J59K85k62J8j29
4669i9K36j47K26J78m56J63O9k45K55q6k6j2Kk4j45M1P5J24Rp6j22J1l0K64j58
4694B7O0mQ0j6J9J25m11L14R9m38K03L7j00J03j39K05k01k4m3J82l57K33J01j21
4718f6J87J28j39j19M27n07J54r2R6k27J85J21j41L29m82L28k43J23j51K98N2
4739B61k98O3k83M52l05L46k83K6j9mj02J33J50m8J80k82k53M3L03k19j00Q0K79
4762A20k43J35J69j09P1q6k32J29j66J53j21M3m9O1q7J71Q7k10M68k99l62K66
4784i1K19l81L07q8K02k78J5J80r3J80l37K38K10k09K3Q4l32K90k80J02j22J15
4806d6K21J57k73J98j12k62K89j88J87j22J99l14N0J57r8M3k07O8nK60k69L3n3
$$ plain form
4829 -87 132 72 -169 363 -13 192 -162 22 -155 48 258 -65 104 -123 162 -61 165 21 -134 -296 30
4850 30 178 -104 24 8 -99 33 146 51 -113 -12 143 110 -79 24 -379 28 -143 244 -275 31 -207
4871 -207 -18 109 7 -43 231 -150 323 30 -148 -36 -196 16 -5 -145 -78 39 -42 -182 -89 -63 43 71
4893 71 -326 -51 -355 -127 -225 -56 -163 -61 -10 -85 118 -12 -35 308 7 -88 88 90 176 97 218 53 -7 -38
4917 -38 60 1 122 -360 -56 73 47 -226 62 335 51 45 -7 116 128 -160 -170 91 -257 -9 130 56 -85
4940 -85 -88 145 270 221 -100 -95 59 -5 -59 -159 -18 -81 -228 192 38 99 12 -111 -27 -76 119 319 44 215
4964 215 -20 187 8 20 58 -88 59 173 78 -24 -60 63 15 -398 -10 52 -238 263 -210 9 -120 148
4986 148 -34 -13 195 -153 6 30 273 -383 -230 -109 14 213 128 18 62 -102 -7 -47 360 -38 68 263
$$ packed form
4829h7K19o0k41N32l76K05l54J84j77K03K10l23J69k27K85k23K26j44j55j62L26
4850C0J48k82J28j6j07J32J13r5j64J01J55l3j89J03m03M07j71L87n19L06k38
4871b07J89J27j02n0K74l81M73k93j78J12j60K12k1j40O7J17q1j40R3K6J06K8
4893G1l97K75l04K28r8J69j07J02N1p5K03j30k3L43l01r5J76KQ6p9J21j65o0l1
4917c8R8n9J21m82L04J29k6k73K88K73k84on2J23J2k88j0K61l48K48J39p4j41
4940h5lK33J25m9l21NJ54o4n4j00J41o3j47M20j54O1q7j23Q4m9J95K00k75J71
4964B15k35K07j79J2L8j46J47J14r5j02l6J23m8m13L88O2k90N01m73K19j29K68
4986A48j82K1K08l48J59K4K43o56J53J21J23J99q5j10M4j64R5m0M07l98J06J95
$$ plain form
5008 263 -69 -334 -107 -364 -108 220 -82 -166 207 43 90 316 40 152 -8 -79 128 76 -95 3 185 -193
5030 -193 -28 -291 7 -147 -150 46 -120 -97 192 -104 -191 -52 194 -49 -29 -141 -62 217 -143 41 31 -79
5052 -79 -36 34 -97 -144 -84 -68 -110 -49 -5 76 -106 -97 79 101 -139 9 -48 -581 338 88 188 184 -132 115 -169
5077 -169 -104 -127 80 68 91 122 -159 77 -96 -77 -5 -219 -74 -202 87 -21 -81 95 -87 -62 40 -357 -143
5100 -143 219 27 78 -91 25 34 -4 -65 -203 49 -273 -49 -82 -137 -375 19 85 -231 -86 184 -198 -40 3
5123 3 -78 -95 37 -136 3 130 -22 283 -231 63 1 -165 -85 -182 19 170 -152 228 33 -312 37 344
5145 344 -101 -112 -9 -314 123 253 -361 239 219 -64 12 56 -133 -105 201 115 5 137 165 5 -15 215 81
5168 81 -14 -248 -178 28 50 -143 56 -339 -20 386 -313 -5 0 183 117 -45 -96 3 -148 40 187 -105 -119
$$ packed form
5008B63l32k65K27k57K56L28l02q4L73j64M7K26k76J12j60p1K07n2j71R8J82l78
5030a93J65k63K98j54lJ96j66K3K89k96q7J39K46k43K0j12P9K79l60J84j0j10
5052g9M3P0j31m7O0J6m2O1M4Q1j82RJ76K2k40J48n7n33R19k50J00ml16K47k84
5077a69O5k3K07j2K3L1k81K36j73J9P2k14J45j28K89j08o0J76j82K5J02l97K14
5100a43L62j92N1j69J16Rl8o1j38K52l22K24l3n5k38L94O6l16J45K70l82J58M3
5123Cq1j7J32j73J39J27j52L05n14K94o2j66Q0r7K01J51l22L80j95l45L49L07
5145C44m45j1J03l05M37J30o14O00k0k83P6M4j89K8L06q6j10J32K8j60k0K30j34
5168H1r5k34P0K06K2j93J99l95L19M06o99L08NJ83o6j62n1R9j51J88J47k92j4
$$ plain form
5191 -119 219 -112 -358 -116 -274 -20 27 41 -19 134 -261 -31 -282 184 -400 -47 -181 181 -191 22 150
5212 150 363 376 38 49 -219 7 -248 -53 196 -86 112 95 134 -147 20 -282 -307 294 -49 474 -328 -314
5234 -314 -6 91 -316 78 -79 113 -68 -232 -14 -45 -140 -255 10 -79 -83 -81 -168 -125 58 131 -109 -29 -342 -105
5258 -105 -253 27 17 240 -128 55 127 51 2 -99 -22 -214 -89 323 123 -64 -210 -202 22 -88 187 -30
5280 -30 170 86 173 -78 37 -20 -145 121 -149 48 -111 44 -65 364 65 -272 -69 6 -44 2 -14 -237 155
5303 155 34 -58 -61 -100 29 -210 80 177 28 -265 186 -234 -82 73 -45 242 -68 -50 -394 194 1 -21
5325 -21 173 152 -19 -221 126 -11 235 109 132 211 -152 158 -337 -201 -147 -11 -38 86 121 -69 144 -432
5347 -432 -93 17 48 156 -26 -146 16 199 180 -144 -84 -19 113 62 -112 47 34 -166 -123 107 -70 80
$$ packed form
5191a19L38l31k46K42j58K54M7J4o0J53l95K30k51M66n84L53j34L62l72K13J28
5212A50K13J3l38J1k68K26k55J95K49k82J98j7L9k81J67l02k5O01l43N23q02J4
5234c14L08R7m07L94j57J92j81j64K18l1r5j15K65q9mKq7M3J83P3k40Q0l13K37
5258a05j48K80j0K23l68J83P2p6m9j01P7j92J25M12k00j87j46QK24j10K75k17
5280c0K00q4Q7k51J15n7j25K66k70J97j59J55j09M29k99l37K03P5n0M6j6k23L92
5303A55j21r2ll9J29k39K90R7j49k93M51m20J52J55j18K87l10J8l44N88j93k2
5325b1J94k1j71k02L47j37K46j26K3P9l63L10m95J36N4J36k7J24L5j90K13n76
5347d32L39J10L1J08j82j20J62J83j9l24O0O5J32n1j74J59j3k00M3K30j77J50
$$ plain form
5369 80 128 -74 -15 123 195 27 12 27 122 2 147 -84 -93 -39 32 78 -168 -15 -9 66 36 39 -9 -240 -124 110
5395 110 -54 -13 91 -143 165 -178 283 74 50 -43 126 49 -59 139 -220 25 -181 128 -22 -107 31 108
5417 108 -224 -26 -203 -31 -127 -177 -39 232 -66 -221 169 -112 346 160 -91 -147 24 204 102 300 -69
5438 -69 -252 -102 -107 101 27 199 -131 79 -38 -247 -256 -315 75 -108 6 -28 159 -96 -62 199 45 90 6 -209
5462 -209 136 154 105 182 13 252 138 63 -11 -213 155 -193 150 -126 -3 -213 241 -206 -235 38 370 -112
5484 -112 131 129 92 348 -249 160 69 -23 10 4 223 -56 -44 121 -369 -21 47 9 -215 -159 207 -120 91 178
5508 178 -58 -224 -144 -79 -72 -49 -2 -168 172 -12 93 -48 -169 -9 -292 280 190 264 54 36 39 235 -242 -91
5532 -91 -167 119 -72 164 -41 48 -63 84 -176 -177 241 -297 233 101 -38 78 -154 -77 -151 219 59 -66
$$ packed form
5369H0M8k02N9J38P2j68j5J5R5j20J45k31rN4P1M6k46J53OP5l0Lm8k31J16K34
5395A10j64M1J04k34L08l43M61k09k4r3J69p7j08J98l59K45k06L09j50q5J38P7
5417A08l32J98j77J72r6n0J38K71k98j55L90k81M58j86k51n6J71J80j02J98l69
5438f9j83J50nK08p4J72l30K10j17k09rn9L90j83J14l4J87k55L4K61j54M5q4k15
5462b09L45J8m9P7j69K39j14p5p4k02L68l48L43k76J23k10M54m47k9K73L32m82
5484a12K43kl7K56n97M09r1r2L3oK19k79J2J65m90L48O8l8k24N6L66l27K11Q7
5508A78k36j66Q0O5PK3M7j66L40j84J05j41j21J60k83N72r0P4k10j8LJ96m77J51
5532i1p6K86j91K36k05Q9j11J47k60jM18n38N30j32j39J16k32P7p4L70j60j25
$$ plain form
5554 -66 248 -130 -200 -146 -18 -187 -43 -232 61 -122 -113 128 112 -48 -141 -76 145 314 -130 -22 -84 -34 96
5577 96 31 156 -120 281 -13 92 -150 -171 -83 100 -191 166 -54 -118 -88 -191 274 -162 -125 133 264 -272
5599 -272 150 70 117 79 23 26 135 -185 -161 9 92 -180 -25 168 -220 -234 -18 -258 331 -171 -299 127 8
5622 8 -121 179 26 111 -108 218 69 -260 -147 -273 330 -153 188 46 -216 -37 -162 -68 -44 25 -94 -188
5644 -188 -102 -102 -258 171 10 42 -1 53 -107 240 11 -172 -40 160 103 115 130 -184 -139 -247 -163 43 -84 -64
5668 -64 217 63 13 -302 -12 -99 -279 -89 20 -155 55 131 -12 -136 -115 120 -52 -81 -45 28 -38 -249 -43
5691 -43 -108 147 -66 -73 -110 -30 -120 -103 -105 -113 -7 -246 -301 10 78 165 68 97 38 104 352 -58 -179 210 87 -88
5717 -88 171 -49 220 272 60 35 -1 48 89 -2 -55 45 -386 -29 91 16 17 -201 44 189 45 23 -142 171
$$ packed form
5554f6L14l78p0N4J28j69J44j89K93j83RK41j6j60r3O5K21J69m44J08o2N0J30
5577I6o5J25k76M01k94J05k42k1Q8J83k91L57k20o4L0j03M65m36L7K58J31n36
5599b72M22q0M7l8n6LJ09l20K4J70Q3k72J55J93l88j4K16k40N89n02j28M26j19
5622Hj29L00j53Q5k19L26j49l29J13j26O03m83L41j42k62J79j25R4K4O9j19r4
5644a88Q6%j56M29j61L2m3N4j60L47k29j83J32K00n7J2J5l14M5j08Q4K06j27K0
5668f4K81j54n0l15K90q7j80J90J09j75K10P6j43j24K1K35j72k9L6P3o6k11K06
5691d3o5K55k13pl7Q0r0J7kqJ06k39n5L11O8Q7r7K9n9O6K48m10j21L89j23j75
5717h8K59k20K69N2k12k5l6M9M1r1n3J00m31L57J20p5Jk18K45J45j44k2j65L13
$$ plain form
5741 171 24 9 0 -163 31 -22 -56 -197 -47 27 -58 8 -157 -187 33 246 106 236 -80 -230 31 305 311 164
5765 164 114 141 -158 -180 55 29 140 -174 18 269 -213 200 -148 152 64 -164 -340 200 134 -10 101 -101
5787 -101 18 28 -47 -100 -232 -228 -282 -7 -9 -23 -246 287 -72 -22 -19 26 -158 53 126 -85 114 28 86 397 91
5812 91 -98 -179 -108 -120 -101 -208 -67 145 277 18 39 250 -145 -267 64 -363 39 -193 -159 -195 35 191 -159
5835 -159 25 -160 298 -52 97 -55 -88 -185 261 27 -68 83 252 -165 -248 125 36 59 223 -36 -7 116
5857 116 -3 170 249 230 34 130 -63 68 -118 62 -103 91 133 107 -103 10 -102 290 -82 34 239 -88
5879 -88 -53 172 -13 55 369 -28 31 -69 -282 -76 116 -113 39 -59 -94 -72 -103 192 -56 289 -126 86 137
5902 137 60 65 206 150 63 -13 154 -20 70 110 27 -121 98 84 85 276 -67 -118 -29 217 5 15 71 46 40 197
$$ packed form
5741A71j47j5rj63J94n3l4j41J50P4q5O6j65l0K20K13j40J30l16j50K61K74Oj47
5765A64n0K7k99k2K35k6J11l14J92K51m82M13l48L00q8k28j76N40o6j44J11k02
5787a01J19J0p5n3j32Mn4K75kj4k23N33l59N0LM5j84K11P3k11J99q6N8L11l06
5812I1j89q1P1j2J9j07J41K12J32k59K1K11l95j22L31m27M02k32L4l6K30J56l50
5835a59J84j85M58l50J49j52l3r7M46k34r5J51J69m17q3L73q9K3J64k59K9J23
5857A16j19J73P9j9j96R6j93J31j86J80j65J94M2k6k10J13j12L92l72J16K05l27
5879h8L5K25j85O8L14l97N9j00k13K06J92k29J52r8l5K2l1K95k48L45m15K12N1
5902A37p7NJ41n6q7p6J67j74R0M0q3j48K19j4JJ91l43n1Q9K46k12J0N6k5oJ57
$$ plain form
5928 197 32 -88 -265 -45 -262 -159 -2 103 238 -223 -102 81 24 5 -261 68 -138 116 323 -184 56
5949 56 -190 101 -231 106 -52 -78 -106 -45 -17 188 19 -347 -48 -210 170 305 -68 -127 -48 -88 -239 -20 190
5972 190 23 182 -101 37 61 -22 -5 -24 9 -90 4 -298 -122 105 -121 244 -48 -5 173 29 51 -176 -86
5995 -86 18 20 57 0 -376 -36 132 -10 156 -94 304 110 81 -133 78 212 -49 -64 -33 192 26 191 104
6018 104 -141 -261 21 39 -81 171 201 322 3 -17 -28 88 69 0 31 -114 -10 50 140 200 -51 -88 55 -40
6042 -40 223 138 -130 -232 -18 -87 106 145 -123 -208 -16 55 -91 138 -108 -33 -65 250 34 -170 107 161 -149
6065 -149 27 -142 -103 105 200 -199 -45 243 38 99 -313 156 95 4 -235 -369 -162 -203 127 -88 138 71
6087 71 -100 104 251 -24 139 -422 -188 -190 113 -129 154 7 119 47 -245 176 -296 -114 -16 -359 -369 -66
$$ packed form
5928A97j65j20j77K20k17J03J57J05J35m61J21J83n7j9k66L29k06K54K07n07K40
5949E6k46K91l32L37j58k6k8O1K8K05j69l66K99j62L80J35l73n9P9m0j51K19K10
5972A90j67J59k83J38K4q3J7j9L3r9R4l02J76K27k26L65k92M3J78j44K2k27R0
5995h6J04KL7n7l76L40J68j42J66k50L98j94k9k14K11J34k61j5L1K25j66J65q7
6018A04k45j20K82J8j20K52L0J21l19k0j1J16j9o9L1j45J04O0R0O0k51l7J43r5
6042d0K63q5k68j02K14o9J93L9k68q5J92P1j46K29k46P5l2L15k16k04K77N4l10
6065a49J76j69L9K08R5l99J54K88k05O1m12M69o1r1k39j34K07m1L30k15K26o7
6087G1j71K04J47k75J63n61K34kL03k42K83j47J12p2k92M21m72J82R8l43j0L03
$$ plain form
6109 -66 32 -227 -46 232 13 126 11 -108 58 12 29 -215 58 189 -5 119 -34 -105 87 140 59 316
6131 316 -84 -28 102 122 96 -105 243 -110 103 76 150 -65 -146 46 -124 267 183 266 -56 -155 19 226 36
6154 36 -64 222 -67 128 280 -259 -292 14 142 -17 38 -1 50 41 154 81 -25 39 -37 149 33 -443 -163
6177 -163 17 -109 -179 -69 -203 -229 142 -204 17 83 -26 -137 71 319 -169 123 -82 -149 250 174 87 -58
6199 -58 35 187 213 -22 60 44 3 98 -378 46 -111 36 89 -76 195 -3 131 0 -3 -117 11 146 -117
6222 -117 -57 66 -101 -24 172 -74 276 102 -192 -163 67 194 145 -61 163 -11 3 -199 9 130 -134 -9
6244 -9 -106 -11 -65 213 271 108 -137 27 -40 114 14 -440 -195 -44 74 35 -307 -88 -38 55 -12 30 -148 240
6268 240 -60 -3 108 19 3 -203 87 105 -52 -24 -14 46 102 43 -182 96 31 -211 -100 60 -112 -69 140 -143
$$ packed form
6109f6R8k59J81K78k19J13j15j19J66m6J7k44K73J31j94J24j53p1J92N3q1K57
6131C16m00N6J30K0k6k01L48l53K13k7P4k15q1J92j70L91q4Q3l22r9J74K07j90
6154C6j00K86k89J95J52n39l3L06J28j59N5l9N1rJ13p3j06O4p6J86j16m76K80
6177a63J80j26p0J10j34k6L71l46K21O6j09j11K08K48m88K92k05o7L99p6q7j45
6199e8R3J52K6k35Q2j6m1R5m76M24j57J47N3j65K71j98J34j31lj14J28J35k63
6222a17O0J23j67P7J96k46L50j74k94K9K30J27m9k06K24j74J4k02K08J21k64J25
6244ir7R5n4K78N8j63k45J64o7J54j00m54K45J51J18l9l42K19N0R3o7M2j78L88
6268B40l00N7J11q9j6k06K90J8j57K8J0O0N6n9k25K78o5k42J11J60j72M3K09k83
$$ plain form
6292 -143 91 -74 124 -18 71 38 45 -142 90 97 -153 -59 15 0 347 148 243 140 -78 -365 80 -66 -163 -43
6316 -43 -36 94 -30 -122 154 145 291 102 -1 -253 -235 -162 -175 274 -254 90 201 159 -99 -73 -51 2 -87 -271 -96
6341 -96 19 223 83 89 -186 129 -236 58 38 -26 -13 -72 -215 91 -374 230 -249 91 6 -101 -189 286 -117
6364 -117 190 -21 -124 208 47 247 -124 44 -78 33 176 -38 119 -99 -19 73 -18 65 0 -112 -113 -225
6386 -225 -217 -86 103 144 83 -254 87 -58 116 13 -180 85 -355 50 -135 -52 -72 -33 17 -24 217 -3 -83
6409 -83 -79 -47 70 67 26 210 206 121 -63 -23 172 -90 101 -217 43 150 231 245 -98 42 329 74 53 -120 -90
6434 -90 -17 -50 62 -240 192 224 92 -32 -411 -93 197 19 177 -122 -168 -9 51 -60 -24 -64 31 136 -262
6457 -262 -262 -190 80 -347 333 -82 64 115 117 175 -177 24 -25 -33 -91 95 35 14 21 80 3 27 -184 -95 353 47
$$ packed form
6292a43K34j65J98j42Q9l3Pj87K32Pk50R4P4j5L47j99R5j03k18k87M45j46r7J20
6316d3PJ30j24r2K76rJ46j89j03k52J8P3j3M49n28L44J11m2k58K6K2N3q9j84J75
6341i6J15K04j40Ok75L15l65K94k0o4J3n9j43L06m65O04m79L40q5j07q8M75m03
6364a17L07k11j03L32j61K00l71J68j22J11J43k14J57k18Q0R2r1Q3o5j12jj12
6386b25QJ31J89M1o1l37L41j45J74j03j93K65m40M05j85Q3k0L9N0m1K41k20q0
6409h3ML2J17lm1J84mq5j84M0J95k62J91l18K60J07Q1J4l43J40K87k55k1j73L0
6434i0P3l3J12l02M32L2j32j24l79L18K90j78J58k99m6J59O0j11L6m0R5J05l98
6457b62%P2K70m27O80m15J46N1KN8l52K01m9qn8J86o0k1PN9p7K4k11Q9M48l06
$$ plain form
6483 47 -211 -123 208 -273 339 125 -112 1 -213 -150 -312 39 -236 -170 -45 176 46 -121 -161 119 -102 203
6505 203 259 174 -44 -20 363 -40 -98 4 9 -151 157 -58 -92 -162 24 167 7 18 17 123 -109 -27 -37 -61 -112
6530 -112 189 100 361 12 -75 33 164 140 73 -240 -18 99 -35 -26 -174 -14 -208 -78 365 187 -191 -101
6552 -101 -55 -49 116 35 72 -155 -31 -161 103 20 121 209 54 -74 -17 34 123 -66 212 -55 300 157 -50
6575 -50 -151 -29 148 66 61 -238 -75 127 -91 19 182 -145 -21 203 244 -136 -202 -228 -286 9 -128 328 -211
6598 -211 74 2 -160 95 -190 7 128 9 -33 154 -126 -56 -127 47 299 130 186 67 -14 -25 -158 -31
6620 -31 -60 -438 -1 -67 25 -73 -130 85 -64 188 5 3 -260 56 79 56 112 96 -159 267 66 57 149 92 -32
6645 -32 -95 -180 9 -135 68 -321 28 -106 -43 13 -66 129 -6 -139 46 56 -92 -6 316 -12 -181 144 234
$$ packed form
6483D7k58Q8L31m81O12k14k37J13k14O3j62L51k75O6J25K21j30j67m0K80k21L05
6505B03N6q5k18K4L83m03n8J02Nj60L08k15l4p0J86J43j60J1jJ06k32Q2j0k4n1
6530a12L01q9K61l49q7J08J31k4o7l13K22J17j34Rj48J60j94J30M43j78l78R0
6552a01M6OJ65q1L7k27J24j30K64q3J01Q8j55j28N7N1Q9j89K78k67L55j43k07
6575e0j01J22J77q2nk99J63K02k18J10J63l27J24K24M1l80o6k6n8K95j37M56n39
6598b11K85p2j62K55k85J97J21j19m2J87k80P0p1J74K52j69N6j19q1j1j33J27
6620c1k9l78M37o6R2r8n7K15j49K52j83kk63L16K3k3N6j6k55M26k01rR2n7j24
6645c2o3q5J89j44K03l89L49j34O3N6p9J95j35j33J85J0j48Q6L22l28j69L25R0
$$ plain form
6668 234 -276 -32 -273 76 56 42 -5 24 8 34 232 -146 174 -183 -64 -68 -121 82 -206 -125 -119 -39 189 -80
6692 -80 -114 315 127 1 231 -314 197 147 145 -114 95 58 117 145 -136 211 212 16 -41 213 79 -108 158 -30
6716 -30 -4 142 -70 -205 135 -188 99 279 152 64 -78 62 28 17 -208 203 -230 -119 -42 116 -23 -150
6738 -150 -28 -23 12 -92 235 23 47 -88 165 -21 209 -80 -71 -156 -72 260 0 -45 384 9 -30 171 -115
6761 -115 35 -163 -54 104 190 -347 -64 -176 -53 316 -59 36 -139 255 -7 -165 -238 25 -74 -59 -95 -55
6783 -55 58 14 -100 36 -109 42 216 -34 263 88 -164 148 70 42 -191 -253 139 11 103 -39 18 244
6805 244 159 -84 -20 -128 46 41 211 -72 25 167 -269 -304 124 -53 226 181 138 98 9 -94 -95 11 -292 74
6829 74 377 -146 -116 66 -171 -101 150 120 214 -25 -19 -122 66 40 -119 43 113 -52 -139 237 48 -65 52
$$ packed form
6668B34n10K44k41L49k0j4m7K9j6K6J98l78L20l57J19mn3K03k88Q1OQ0K28k69
6692h0l4M29j88j26K30n45N11n0kk59K09l7N9K8k81L47Jj96n7K54j34j87K66j88
6716c0K6J46k12j35L40l23K87J80j27q8j42J40l4j1k25M11m33J11P7J58j39j27
6738a50J22NL5j04L27k12K4j35K53j86K30k89Rq5Q4L32k60m5M29l75l9K01k86
6761a15J50j98J09J58Q6n37K83j12J23L69l75R5j75L94k62j58p3K63r9J5l6M0
6783e5J13m4j14J36j45J51J74k50K97j75k52L12p8k8k33o2L92j28R2j42N7K26
6805B44q5k43O4j08J74nJ70k83R7J42m36l5M28j77K79m5m3m0q9j03jJ06l03L66
6829G4L03n23L0J82k37P0K51l0R4k39Oj03J88k6j59J62P0j65q7L76j89j13J17
$$ plain form
6852 52 -198 43 -326 3 7 133 -45 -44 18 208 -35 115 -69 -181 31 363 261 193 143 141 -75 -95 -20 4
6876 4 70 445 -197 99 214 52 100 -144 209 -128 29 -2 106 141 26 79 233 73 -4 12 1 133 37 -30
6900 -30 47 -22 -107 127 -156 0 0 -70 -200 -193 228 -55 -98 103 -110 -55 247 -46 -43 -314 204 86 62 -10 294
6925 294 100 -46 -220 -80 -201 -119 8 150 99 -21 348 -2 119 5 -221 -10 48 -263 87 -89 18
6946 18 -174 31 -209 63 74 -215 -56 -135 208 256 88 54 -74 34 -185 41 -216 32 -28 -217 67 -77
6968 -77 -169 -117 -60 -142 -150 -196 192 0 -94 20 -165 -54 66 -36 -62 -27 -152 283 -67 -27 -288 97 9 -165
6992 -165 286 -131 -104 -21 91 -115 -163 15 -82 118 122 73 144 114 8 -94 280 -128 281 99 -387 296 6
7015 6 302 -139 136 -125 -9 220 -72 -58 -32 -242 62 213 11 3 -155 -295 98 27 -113 23 -18 70 -124
$$ packed form
6852E2k50K41l69L29MJ26j78JO2J90k43J50j84j12K12L32j02o8n0kk16k0P5K4
6876DO6L75o42K96J15j62M8k44L53l37J57l1J08L5j15N3J54j60p7J6j1J32r6o7
6900c0P7o9q5K34k83J56%p0j30PM21k83m3K01k13N5L02k93Lk71N18j18k4p2L04
6925B94j94j46j74J40j21Q2J27J42n1j20L69l50J21j14k26K11N8l11L50j76J07
6946A8j92K05k40K72J1k89J59p9L43M8j68l4j28J08k19K26k57K48o0j89K84j44
6968g7r2N2N7q2qm6L88j92r4J14j85J11J20j02k6L5j25M35l50M0k61L85q8j74
6992a65M51m17K7Q3J12k06m8J78r7K00Mm9P1l0j06j02L74m08M09j82m86O83k90
7015FK96m41K75k61J16K29k92J4K6k10L04J51k02qj58j40L93p1j40J36m1Q8j94
$$ plain form
7038 -124 -27 -238 -36 -30 122 -152 -23 227 42 238 -28 -81 40 -111 -142 -33 12 131 -125 -74 -37 100 -151
7061 -151 -140 -101 28 -179 -7 107 15 -134 -89 -111 -281 -290 60 218 -48 255 -153 -139 102 -173 -428 233 150
7084 150 -139 -258 88 200 -62 -127 -86 -28 130 18 48 -197 -379 -302 29 154 -14 -274 51 29 -61 52
7106 52 309 -169 -381 -245 -159 102 -10 24 362 307 -76 42 -158 -169 124 -257 -2 133 109 100 -190 -4 -184
7129 -184 380 -250 88 303 -218 -13 56 30 107 105 -38 193 173 -69 83 -283 -120 290 38 -102 120 62
7151 62 19 -26 71 -6 -49 258 -129 -211 -32 -29 -56 41 -134 252 91 161 -60 121 9 173 301 -125 18 17 -8
7176 -8 -75 -171 -25 -44 -2 19 62 15 -68 -64 32 214 -154 78 -106 -81 4 241 -104 27 186 -140 -73 387 162
7201 162 369 63 -41 -154 -241 23 39 91 -236 294 17 88 53 137 83 44 358 -185 -176 -116 155 89 -134 32
$$ packed form
7038a24R7k11K02OJ52k74J29K50j85J96k66n3J21j51l1J09M5J19k56N1L7J37k51
7061a51J1L9J29k07J72J14r2j49M5k2j70rL50J58k66L03m08J4K41k75k55O61q3
7084A50k89j19L46J12k62o5M1N8J58j12L0k45j82P7L31J25j68k60L25k2r0J13
7106E2K57m78k12J36Q6K61j12L4L38n5l83J18k00j1K93l81K55J35k4rk90J86j80
7129a84N64o30L38K15n21K05O9k6P7kj43K31k0k42J52l66J63M10k52j40K22n8
7151F2m3m5R7p7m3L07l87q2J79Lk7R7j75L86j61P0k21J81j12J64J28m26J43jk5
7176ho7r6J46j9M2K1M3m7q3MR6J82l68K32j84K5Q5K37l45J31J59l26O7M60k25
7201A62K07l06j04j13q7K64J6N2l27N30k77P1l5Q4n4l9L14n43RO0K71o6k23J66
$$ plain form
7225 32 55 85 23 111 -357 83 -100 -62 -9 -35 167 57 226 -42 118 -236 50 314 38 -27 -32 0 25 -89
7249 -89 64 26 215 5 132 157 135 184 -211 236 42 82 -41 108 84 -71 62 -98 -11 148 -1 -190 254
7272 254 -274 -237 -121 55 164 -19 -173 59 -49 248 1 54 -222 -265 92 -129 -313 94 89 -288 75 -217
7294 -217 -216 -128 -166 223 15 -123 229 -53 -100 1 -135 -452 -14 -314 -17 76 90 -9 66 -240 -64 73 -194
7317 -194 -70 31 94 -22 -78 -44 -141 203 5 -81 102 55 -16 -40 -111 -52 157 93 -1 -229 -173 -49 196 147 -168
7342 -168 -125 154 -82 -13 47 113 -129 -69 65 -17 -118 -14 116 -89 -236 154 63 -2 39 -12 100 71 -35 -22
7366 -22 -24 -40 28 -118 -330 149 26 -4 146 -71 19 13 -108 106 46 188 -53 3 75 -64 38 216 63 -203
7390 -203 -127 -23 67 -47 174 107 -95 156 -40 59 -40 84 -194 40 182 155 -130 -332 -137 96 -91 -219
$$ packed form
7225C2K3L0o2Q8m68M40j83L8N3k6K02j10J69k68J60l54K86K64k76o5nL2K5j14
7249h9J53l8J89k10J27K5k2M9l95M47j94M0j23J49k4j55J33j60Q7J59j49j89M44
7272B54n28L7J16J76J09j83j54K32j08K97k47N3k76m3L57k21j84M07nl77L63k92
7294b17JQ8l8L89k08j38L52k82m7J01j36l17M38l00K97R3J4r9P5l06J76J37k67
7317a94J24J01O3j16n6L4r7L44j98q6J83m7p1k4p1N9K09o4r4k28N6J24K45m9l15
7342a68M3K79k36O9O0O6k42O0J34q2j01J04J30k05j47L90r1o5M1n1J12k9j06J3
7366b2kj6O8j46k12M79j23l0J50k17R0oj21K14o0J42k41N6P2j39J02J78j53k66
7390b03P6J04R0j14K21o7k02K51j96R9r9J24k78K34J42k7k85k02J95K33j87j28
$$ plain form
7412 -219 -323 -206 -147 -93 -32 160 204 -112 189 263 332 -149 -162 167 -150 44 -26 -14 2 -70 172 117 -103 22
7436 22 106 269 52 -25 -40 30 -69 -108 163 -46 198 112 -42 175 -186 99 -62 -53 -176 -84 125 91 -23 -352
7460 -352 -41 56 41 215 -28 -232 238 161 85 91 151 -227 282 157 -111 332 60 56 -107 52 -283 283 -126
7483 -126 16 -119 -203 55 252 132 -135 -271 -39 -115 -144 180 -39 -18 14 85 -201 220 -13 46 198 -179
7505 -179 47 -2 238 -172 190 150 -290 -58 -16 116 -54 -109 -7 -21 154 -160 197 148 -254 -68 -429 -45
7527 -45 135 190 259 118 -137 189 -79 -295 80 -256 152 132 -99 74 1 192 -59 -150 217 5 32 -115
7549 -115 134 -280 -72 172 -167 -100 59 125 -86 140 84 51 108 -9 52 51 -25 -286 -48 -25 -123 -226 -159 -36
7573 -36 115 47 196 41 155 -50 -28 -183 167 71 -220 -70 -71 -45 31 117 -60 63 -122 -167 132 -312 -146
$$ packed form
7412b19j04J17N9N4O1J92M4l16L01P4O9m81j3L29l17J94p0J2J6p2K42n5k20J25
7436B2Q4J63k17p7j5P0r9l9K71k09K44q6j54K17l61K85j61Rj23R2K09l4j14l29
7460c52L11R7j5J74k43k04M70p7p6OO0l78N09j25k68M43k72mj63J59l35N66m09
7483a26J42j35q4K58J97j20k67j36K32p6k9L24k19K1L2P1k86M21k33N9J52l77
7505a79K26m9K40m10L62m0m40K32M2J32j70n5J02j4J75l14L57m9m02J86l61L84
7527d5J80N5O9j41k55L26k68k16L75l36M08k0k31J73p3J91k51r1L67k12K7j47
7549a15K49m14K08K44l39O7J59O6k11K26n6l3N7j17O1jp6k61K38K3r8j03O7J23
7573c6J51o8J49j55J14k05K2j55L50r6k91J50jK6P6Q6j77J23j85m5K99m44J66
$$ plain form
7596 -146 -63 -159 -47 63 -206 -3 62 -249 91 29 85 125 161 -1 184 -77 -172 -165 -115 -41 120 48 -32 22 236
7621 236 -8 24 -96 -78 9 -74 99 -61 -331 93 -4 148 -77 -133 32 -83 75 -23 -225 -81 41 -175
7643 -175 -67 358 222 18 252 47 -151 196 124 -224 -41 -1 -2 -151 50 105 136 -117 27 -225 81 -263
7665 -263 81 -114 -241 206 15 -172 -101 -93 38 -113 30 -187 -138 -25 155 103 -92 319 -32 -27 -74 274 -164
7688 -164 -113 14 -349 -3 -122 57 -43 -367 -12 107 -209 117 133 151 450 -30 65 78 185 203 -62 199
7710 199 -240 -21 -230 106 -13 -169 264 93 160 -125 -161 -204 60 36 -216 55 -91 149 250 123 -275
7731 -275 160 10 88 -56 -108 -142 -54 -5 73 132 -148 4 -121 -127 136 -45 -126 336 -17 -80 -193 -307 -7 108
7755 108 81 16 -63 -113 -33 159 -225 -113 -37 8 338 -18 306 -133 82 -8 -91 88 167 172 45 99 -214 118
$$ packed form
7596a46Q3r6J12J10k69K03O5l11L40o2N6M0L6j62J85k61r5PN0P4J61p2q0N4K14
7621B36k44L2j20J8Q7q3J73j60k70M24r7J52k25n6J65j15J58r8k02J44J22k16
7643a75J08M25j36k04K34k05j98L47p2l48J83M0jj49K01N5L1k53J44k52L06l44
7665b63L44j95j27M47j91j87P1QJ31j51J43k17M9J13J80n2j95M11l51Nm7L48m38
7688a64N1J27l63L46j19J79j00l24L55J19l16L26J6J8K99m80R5J3J07J8k65K61
7710A99m39K19k09L36j19j56M33j71O7k85l6m3K64k4k52K71j46K40J01j27l98
7731b75M35j50P8j44n2l4Q8M9P8N9k80J52j25oK63j81q1M62l53o3j13j14L00J15
7755A08k7o5p9n0Q0J92l84J12P6M5L30l56L24m39K15r0q3J79P9Nj27N4l13L32
$$ plain form
7779 118 -103 -239 -194 -119 -4 127 61 272 100 -93 -69 86 77 90 224 -131 -24 -43 -122 -57 -80 27 -30 47
7803 47 -113 -61 -66 -247 -94 -114 -179 -82 127 -184 -28 0 -329 112 -102 -97 -77 -8 136 -47 130 -8 -7 -22 105
7828 105 77 92 190 -38 180 140 -43 -167 -78 -147 117 -71 36 -101 49 -61 162 -14 -219 324 114 -147
7850 -147 -103 149 -62 159 -180 117 187 -187 -42 242 -383 -32 104 20 133 190 -187 -389 -204 -71 -215
7871 -215 -220 -206 37 160 42 -76 41 84 25 -22 -31 98 -56 11 391 -297 -311 -5 117 19 -74 -32 43 210 18
7896 18 68 34 -74 182 119 -7 -52 -88 94 268 18 34 -167 62 -145 47 -49 67 120 -259 -81 118 118 176
7920 176 4 102 290 -284 -153 55 -4 -84 123 -76 229 -28 -88 14 116 -287 -109 180 -350 71 -198
7941 -198 60 17 34 -24 107 -108 -97 -62 -240 -59 85 -540 -157 194 102 34 -126 33 314 -186 -52 185
$$ packed form
7779A18k21j36M5P5J15J31o6K11j72j93K4J55rJ3J34l55J07j9p9O5k3J07n7P7
7803D7j60N2nj81J53k0o5R7K09l11J56K8l29M41k14NK0O9J44j83J77j38Jj5J27
7828A05k8J5R8k28K18m0j83j24Q9o9K64j88J07j37J50j10K23j76k05N43k10k61
7850a47M4K52k11K21l39K97P0l74J45K84o25L51J36q4J13N7l77k02J85J33j44
7871b15nJ4K43J23j18j18J17M3n9m7rJ29j54O7L80o88j4L06J22r8r3M2P5J67j92
7896A8N0l4j08K56o3j26m5l6J82J74k50J6k01K29k07J92r6J16N3l79J78J99%N8
7920A76j72R8J88n74J31K08n9q0K07j99L05k57o0J02J02m03J78K89n30M21k69
7941a98K58m3J7n8J31k15J1L5j78J81J44o25L83L51r2o8j60J59K81n00J34K37
$$ plain form
7963 185 221 306 244 60 33 14 -58 7 -41 -160 -49 -317 83 175 -30 -260 -329 25 174 90 -76 -96 -24 46 -345
7988 -345 121 -84 13 328 80 92 185 87 40 14 -87 49 -123 37 -102 -39 114 -91 -45 -153 -68 104 -74
8011 -74 55 302 84 51 267 243 -122 -149 211 -154 363 7 -55 -269 143 33 -4 -3 -144 -187 -189 -14 135 -22
8035 -22 157 207 -123 168 24 109 -68 29 -180 71 -158 -63 144 -216 167 56 215 -326 -153 138 31 -215
8057 -215 81 246 17 -205 -68 124 -16 -52 32 216 99 16 180 26 82 55 -193 58 24 -9 55 -55 110
8080 110 -51 -12 -115 -207 -67 -60 184 86 -76 -289 -129 -54 249 -70 408 -99 255 225 -23 239 10 -99
8102 -99 267 47 -178 -172 -5 -190 332 43 46 151 149 14 -166 0 -124 231 57 128 -75 73 -135 176 -172
8125 -172 -114 107 7 51 -75 -28 -201 -167 123 277 -17 129 -115 37 -198 -150 73 -7 140 -158 252 -65
$$ packed form
7963A85L6Q5o2j84k7j9p2O5m8j19J11k68M00R2k05k30o9L54J49q4j66k0P2P0l91
7988c45M66k05R7L15k48J2R3r8m7k6j01J36j72J60j39O3J53k05M6j08Q5J72j78
8011g4J29K47k18l3K16k4l65k7L60l65N17l56o2k14M12j10l7Jj41m3kJ75J49j57
8035b2J79N0l30K91j44Q5j77R7k09K51k29R5K07l60L83j11J59n41J73K91j07k46
8057b15K96J65k29k22J37J92j40l6Q4J84j17q3J64j54N6k7k48K51l4l3O4j10J65
8080A10j61L9j03r2J40PK44r8j62k13J60P5L03l19M78n07L54l0k48K62k29j09
8102i9L66k20k25OJ67j85N22k89LJ05kj35j80J66j24L55j74P1k03J48k08L11l48
8125a72N8K21j00M4j26M7j73L4K90J54k94J46k44J52k35M8K23q0J47k98M10l17
$$ plain form
8147 -65 32 -176 -147 308 -49 65 170 195 -148 152 -78 101 14 42 -45 64 118 387 -26 -36 -97 172 -100
8170 -100 -20 102 67 110 -30 151 46 -45 60 -16 115 -47 224 117 75 3 176 -152 -55 229 -205
$$ packed form
8147f5R7k08K9M55l57J14J05K5l43L00k30J79q7K8q7J09N4K69m13j0o1K69k72
8170a00Q0J22l5M3j40J81j05r1J05p6J31j62K71j07m2p2J73l28R7K84m34
8191b05
$$ Imaginary data points
##PAGE= N=2
##DATA TABLE= (X++(I..I)), XYDATA
$$ plain form
0 0 0 0 0 0 0 0 0 0 0 0 0 -8 8 -8 8 -13 16 -16 24 -24 32 -40 48 -56 64 -72 87 -97 112 -129 150 -169 193
33 193 -218 246 -278 311 -351 391 -438 486 -540 598 -664 733 -810 894 -986 1087 -1197 1319
51 1319 -1453 1601 -1768 1952 -2163 2399 -2675 2992 -3367 3815 -4370 5063 -5971 7211 -9019
66 -9019 11910 -17287 30802 -145288 -188568 -19107 -103401 -57713 15038 41727 38145 89770
78 89770 91281 83190 71690 49530 5336 35864 55279 7224 -5611 27210 -25606 -69140 -51020
91 -51020 -54010 -66126 -40477 -36325 -39364 -22653 11545 54377 86703 74183 37573 31736 64223
104 64223 50830 -1097 -12527 -19965 -59691 -73769 -65859 -50714 -27362 -33311 -39658 5479 40760
117 40760 30056 33673 65513 69186 25801 -3811 6562 8123 -1759 -8225 -28972 -39212 -29503
$$ packed form
0@%%%%%%%%%%%qJ6j6J6k1K9l2M0m8N6p2Q8j04J20j36J59j84K09k41K79l19L62
33A93m11M64n24N89o62P42q29R24j026J138j262J397j543J704j880K073k284K516
51A319k772L054l369L720m115M562n074N667o359P182q185R433j1034J3182j6230
66i019K0929k9197M8089j76090m3280J69461q4294M5688P2751K6689l582N1625
78H9770J511q091j1500k2160m4194L0528J9415m8055j2835L2821n2816m3534J8120
91e1020k990j2116K5649M152l039J6711L4198M2832L2326j2520l6610n837L2487
104F4223j3393n1927j1430p438l9726j4078P910J5145K3352n949o347M5137L5281
117D0760j0704L617L1840L673m3385k9612J0373J561r882o466k0747j0240R709
$$ plain form
130 -29503 -27162 -15327 -2537 -21201 -32564 -15765 -2028 6781 21683 36871 38427 27419 33001
143 33001 45513 32707 12055 -1498 -13164 -23322 -44556 -53523 -25529 -6603 -16879 -19923
155 -19923 -8278 10572 25202 20893 18526 19129 5960 -6499 -3316 9035 10687 -8701 -18539
168 -18539 -8118 -7418 -7743 -1223 -3713 -4549 -2054 -3447 3089 11526 13391 20564 19395 5655 -2163
183 -2163 2538 10606 1694 -18433 -20609 -15938 -22817 -19761 -6355 2648 3954 -4546 -181 22630
197 22630 28012 16143 11783 12666 9870 -280 -7625 -1969 -1225 -10303 -15481 -18169 -14091 -6052 -6516
212 -6516 -4169 321 -4470 -4065 6715 13325 15536 14693 11186 7675 3414 4713 8593 -1141 -13850
227 -13850 -16985 -15316 -10846 -10433 -11096 -288 6916 1848 1496 11375 18986 15908 4854 2514 4819
$$ packed form
130b9503K341J1835J2790j8664j1363J6799J3737Q809J4902J5188J556j1008N582
143C3001J2512j2806k0652j3553j1666j0158k1234q967K7994J8926j0276l044
155a9923J1645J8850J4630m309k367O03j3169j2459L183J2351J652j9388r838
168a8539J0421P00l25O520k490q36K495j393O536Q437J865P173j169j3740p818
183b163M701Q068q912k0127k176M671o879L056J3406R003J306q500M365K2811
197B2630N382j1869m360Q83k796j0150p345N656P44r078n178k688M078Q039m64
212f516K347M490m791M05J0780O610K211q43l507l511m261J299L880r734j2709
227a3850l135J669M470M13o63J0808P204n068l52R879P611l078j1054k340K305
$$ plain form
242 4819 -2507 -6836 -2887 -1410 -4503 -12058 -14164 -5168 -1356 -3291 -3254 -4240 -3428 1472 5135 9681
258 9681 11992 9073 10099 8861 4735 4172 3093 -1392 -7887 -15205 -14197 -8971 -9749 -7991 -2054 995
274 995 1849 1406 6221 14483 12505 3804 349 1086 2596 564 -3355 -964 -328 -5562 -6054 -1769 400
291 400 -201 -3856 -4545 -2104 -2897 -215 3793 4259 3762 4474 3844 4647 4145 3382 3043 -3291 -9167 -7880
309 -7880 -4119 -2690 -3955 -4697 377 3066 1025 3847 8081 7011 2199 -2412 -1278 1406 -1675
324 -1675 -3439 -2002 -1816 -1825 -2759 -1302 3339 3066 -1212 -1878 -988 -285 728 1026 1546 960 -679 1400
342 1400 2893 1965 1663 984 -1840 -3646 -4683 -2480 -22 -1901 -2814 -178 1948 2915 2398 3356 5631
359 5631 2276 -2783 -1895 254 -227 -2593 -4054 -2048 -1125 -2413 -208 2282 2302 1039 -343 -22 1907
$$ packed form
242D819p326m329L949J477l093p555k106Q996L812j935L7r86Q12M900L663M546
258I681K311k919J026j238m126n63j079m485o495p318J008N226p78J758N937L049
274I95Q54m43M815Q262j978q701l455P37J510k032l919K391O36n234m92M285K169
291D00o01l655o89K441p93K682M008M66m97P12o30Q03n02p63l39o334n876J287
309g880L761J429j265p42N074K689k041K822M234j070m812m611J134K684l081
324a675j764J437J86rr34J457M641k73m278o66Q90P03J013K98N20n86j639K079
342A400J493r28l02o79k824j806j037K203K458j879r13K636K126R67n17R58K275
359E631l355n059Q88K149m81k366j461K006R23j288K205K490K0j263j382L21J929
$$ plain form
376 1907 1404 699 911 -188 -754 -174 252 1011 288 -1337 -713 -1856 -3009 -764 366 -180 -973 -904
394 -904 1639 3076 1773 2325 3073 1669 -602 -2183 -900 960 -1746 -3978 -2260 -1404 -845 -993 69
411 69 1841 898 -625 551 1917 1970 1630 584 440 372 -63 68 645 -519 -1177 -1493 -2070 -1545 -1163
430 -1163 -354 547 -1113 -1071 1057 1853 1848 1241 1040 1798 276 -1452 -10 707 -164 -1667 -1978 -778 425
449 425 -513 -451 302 476 -564 -695 344 1848 823 -152 481 154 218 686 764 107 -642 -1333 -891 -872
469 -872 -894 -8 7 -347 -306 207 1535 1726 387 -175 456 -121 -746 -778 -149 298 -1071 -1665 111 631
489 631 104 -282 -71 -27 -364 -898 25 642 669 88 -268 97 886 706 478 597 -321 -814 -1007 -708 -125
510 -125 -300 -64 198 -229 -178 683 997 120 -360 -388 -49 -235 -1348 -181 -4 -393 -943 -270 1077 1125
$$ packed form
376A907n03p05K12j099n66N80M26P59p23j625O24j143j153K245J130n46p93O9
394i04K543J437j303N52P48j404k271j581J283J860k706k232J718Q56N59j48J062
411F9J772r43j523J176J366N3l40j046j44o8m35J31N77j164o58l16n77N25L82
430a163Q09R01j660M2K128P96no07k01P58j522j728J442P17q71j503l11J200J203
449D25r38O2P53J74j040j31J039J504j025r75O33l27O4M68P8o57p49o91M42J9
469h72k2Q86J5l54M1N13J328J91j339n62O31n77o25l2O29M47j369n94J776N20
489F31n27l86K11M4l37n34R23O17K7n81l56L65P89j80k28J19r18m93j93K99N83
510a25j75K36K62m27N1Q61L14q77m80k8L39j86j113J167J77l89n50O73J347M8
$$ plain form
530 1125 492 159 663 -9 -158 -417 -66 334 -645 -902 21 383 210 452 -104 -347 -228 -408 -68 140
550 140 -106 5 -13 -154 183 780 828 943 3 -548 -160 -167 -592 -524 -584 -425 -712 -437 419 880 480 2
572 2 -121 355 225 -250 -164 214 -377 -796 -298 -163 -105 337 3 -19 -76 -288 45 62 -131 -273 2 -25 139
595 139 329 623 550 4 58 -79 112 -163 -401 -154 -188 -578 -871 -163 512 359 15 2 786 448 36 -209
617 -209 35 -318 -258 4 200 310 196 193 -256 -206 184 -333 -163 52 -266 -185 -33 59 228 238 250 119 -121
640 -121 144 208 227 -178 -359 -269 -193 -622 -27 377 -12 63 -336 -108 383 147 -210 -70 335 -332 -44 167
662 167 117 114 -120 -292 -53 56 312 -154 -380 -107 -410 -170 234 -158 -174 158 90 -115 108 -53 381 -49
684 -49 -155 -85 85 -142 124 61 193 -116 -239 -203 -84 -155 -307 -351 -88 142 48 272 112 128 -67 -226 -113
$$ packed form
530A125o33l33N04o72j49k59L51M00r79k57R23L62j73K42n56k43J19j80L40K08
550A40k46J11j8j41L37N97M8J15r40n51L88pm25O8o0J59k87K75Q56M61m00m78
572Bj23M76j30m75Q6L78n91m19M98J35N8M42l34k2n7k12L33J7j93j42K75k7J64
595A39J90K94p3n46N4j37J91k75k38K47l4l90k93P08O75j53l44j3P84l38m12k45
617b09K44l53O0K62J96J10j14lm49N0L90n17J70K15l18Q1J52R2J69J0J2j31k40
640a21K65O4J9m05j81R0P6m29N95M04l89P5l99K28M91k36l57J40M05o67K88K11
662A67n0lk34j72K39J09K56m66k26K73l03K40M04l92j6L32o8k05K23j61M34m30
684d9j06P0J70k27K66o3J32l09j23L6J19p1j52m4K63K30r4K24j60J6j95j59J13
$$ plain form
707 -113 98 -216 -3 142 -87 6 25 -151 35 91 96 -91 -241 -151 169 184 -196 -34 -112 -60 55 228 321 -53
731 -53 125 -165 -76 59 57 24 -423 10 -2 72 -62 195 444 152 -201 -83 230 165 -10 -479 -208 -311 61
754 61 78 275 154 103 -188 -57 -176 219 -174 -20 -309 -270 87 -78 236 12 180 97 -55 -32 -95 56 -98
777 -98 -77 -259 106 290 207 123 -86 78 -577 80 -177 -18 97 -334 72 80 -326 -26 -116 154 231 250 136
800 136 136 102 72 25 37 -67 61 -35 -234 9 -65 -54 49 -269 -211 91 22 -172 -69 -242 104 -77 180 -105
824 -105 224 86 -127 -88 -119 -123 -389 -168 -280 163 102 -2 110 100 -52 7 82 211 54 -190 22 -77 -7 -186
848 -186 -5 -14 -229 161 -75 -155 -96 77 366 -176 -129 -56 -22 -227 0 51 272 -27 -203 -91 -145 -195 6 -41
872 -41 -287 69 -373 -178 -45 37 101 206 162 322 268 39 37 148 -97 564 328 -229 -80 -256 69 255 -315
$$ packed form
707a13K11l14K13J45k29R3J9j76J86N6Nj87j50R0L20J5l80J62p8N2J15J73R3l74
731e3J78k90Q9J35kl3m47M33j2P4j34K57K49k92l53J18L13o5j75m69K71j03L72
754F1J7J97j21n1k91J31j19L95l93J54k89L9L57j65L14k24J68q3j52K3o3J51j54
777i8K1j82L65J84q3q4k09J64o55O57k57J59J15m31M06Qm06L00r0K70P7J9j14
800A36%l4l0m7J2j04J28r6j99K43p4J1J03l18N8L02o9j94J03j73L46j81K57k85
824a05L29j38k13L9l1mk66K21j12M43o1j04J12j0j52N9P5J29j57k44K12r9P0j79
848a86J81rk15L90k36q0N9J73K89n42M7P3L4k05K27N1K21k99j76J12n4n0K01m7
872d1k46L56m42J95J33Q2O4J05m4J60n4k29kJ11k45O61k36n57J49j76L25J86n70
$$ plain form
895 -315 -211 164 -150 -267 -1 389 268 -114 -45 101 49 12 -107 -189 -7 321 -214 -76 -82 112 127 -26 29
918 29 96 341 24 91 118 -74 4 -97 -186 -130 99 -70 -107 -146 52 192 -160 -57 118 -129 -158 -21 75 247
942 247 118 23 219 -41 -37 -31 112 -8 -38 16 90 290 -255 77 -109 79 96 -48 138 -94 122 -19 -185
965 -185 -223 63 -198 -221 -124 -104 76 -34 21 298 51 -152 -257 -60 -171 -105 87 -41 -106 121 147 -128 -26
988 -26 -178 -191 160 -243 -160 272 246 136 -75 144 258 -125 -283 5 -288 180 98 86 73 132 -33 -215 -240
1011 -240 -124 -188 128 -173 8 -250 19 186 -154 316 298 -76 75 -175 197 125 -230 -119 -204 -184 105 -102
1033 -102 -72 172 42 -124 -287 247 191 94 -164 -74 -87 109 -159 19 66 -151 -221 -180 336 -29 -41 54 71 -159
1057 -159 -83 43 94 178 -116 249 -173 -94 -369 -68 0 -162 -139 -337 49 72 -176 54 44 -179 -151 310 137
$$ packed form
895c15J04L75l14j17K66L90j21l82O9J46n2l7j19q2J82L28n35J38oJ94J5j53N5
918B9O7K45l17O7K7j92P8j01q9N6K29j69l7l9J98J40l52J03J75k47k9J37R6J72
942B47j29r5J96k60MOJ43j20l0N4P4K00n45L32j86J88J7j44J86k32K16j41j66
965a85l8K86k61k3R7K0J80j10N5K77k47k03j05J97j11O6J92j28o5K27K6k75J02
988b6j52j3L51m03Q3M32k6j10k11K19J14l83j58K88k93M68q2j2j3N9j65j82k5
1011b40J16o4L16l01J81k58K69J67l40M70j8l74J51k50L72p2l55J11q5K0K89k07
1033a02L0K44j30j66j63N34n6r7k58R0j3J96k68J78M7k17p0M1N16l65j2R5J7k30
1057a59P6J26N1Q4k94L65m22P9k75L01O8j62K3j98L86K3k48K30j0k23K8M61j73
$$ plain form
1080 137 -98 158 -97 -2 -98 -124 -47 -236 -51 56 -263 -3 -28 114 -29 -21 -243 -27 -163 24 91 18 82
1103 82 210 -4 1 74 22 -33 -40 -95 113 -102 138 -374 70 167 137 -40 182 102 -273 170 -277 -97 0 -68 118
1128 118 419 61 132 71 105 -129 -28 115 91 -85 -77 -44 357 -199 73 -49 5 -142 -186 -32 -262 235 102
1151 102 218 151 251 -137 -63 -85 -59 -430 -215 164 -44 -148 -263 13 -71 93 47 -66 77 81 -200 -187 64
1174 64 -121 -10 -22 256 410 -146 -141 111 -227 -85 -18 -47 -79 -31 -155 -152 10 -55 108 193 126 204 -116 80 -186
1199 -186 -75 114 -111 42 120 -157 64 85 -27 -91 8 25 295 248 75 61 -49 234 108 242 -151 135
1221 135 -57 82 119 -185 138 -180 110 350 -57 355 78 112 -316 -15 28 72 117 -164 160 21 -156 255
1243 255 81 93 49 -93 -16 -375 -173 -143 360 -86 42 140 41 159 111 140 -103 69 42 79 -154 15 377
$$ packed form
1080A37k35K56k55R5r6k6P7j89J85J07l19K60k5J42j43Qk22K16j36J87O7p3O4
1103H2J28k14NP3n2n5pn5K08k15K40n12M44R7l0j77K22q0l75M43m47J80R7o8J86
1128A18L01l58P1o1L4k34J01J43k4j76QL3M01n56K72j22N4j47m4J54k30M97j33
1151A02J16o7J00l88P4k2K6l71K15L79k08j04j15K76q4J64m6j13J43Mk81J3K51
1174F4j85J11j2K78J54n56NK52l38J42O7k9l2M8j24LJ62o5J63Q5o7P8l20J96k66
1199a86J11J89k25J53P8k77K21K1j12o4R9J7K70m7j73j4j10K83j26J34l93K86
1221A35j92J39L7l04L23l18K90K40m07M12k77L4m28L01M3M4M5k81L24j39j77M11
1243B55j74J2m4j42P7l59K02L0N03m46J28R8r9J18m8K9k43J72k7L7k33J69L62
$$ plain form
1266 377 -82 69 105 -19 -114 57 -122 -130 58 -58 24 -63 -142 149 169 32 -42 -96 -71 95 17 -91 28 -228
1290 -228 166 -241 89 -63 168 57 121 72 -82 -83 -95 109 55 -170 -78 -119 10 89 -50 -119 -149 22 -350 -38
1314 -38 -5 -63 34 -93 9 -277 134 -256 57 -1 -42 -171 -192 -29 -170 263 55 -1 -28 -131 110 -130 221
1337 221 -67 -112 77 14 -202 77 -75 -65 -49 -49 134 -82 26 226 -255 1 176 151 -75 -175 70 -19 -114
1360 -114 75 190 -101 -86 249 -217 -27 -12 38 -104 161 -64 247 -10 -168 5 -286 -380 -42 -27 39 -76
1382 -76 185 157 -357 109 6 -183 29 190 -101 146 146 -80 243 -94 -10 -142 10 91 -75 104 -151 -40
1404 -40 262 23 -151 206 144 5 79 143 -105 33 -89 -109 -128 12 193 15 -195 99 -84 231 -35 31
1426 31 73 -212 188 -221 -147 236 157 -13 -22 130 361 -71 248 -40 53 -153 -381 -197 -309 100 -24 -275
$$ packed form
1266C77m59J51L6j24r5J71j79qJ88j16Q2q7p9K91K0j37p4n4K5J66p8j08J19k56
1290b28L94m07L30j52K31j11O4m9j54jj2K04n4k25R2m1J29P9j39o9l0J71l72L12
1314c8L3n8R7j27J02k86M11l90L13n8m1j29k1J63j41M33k08n6k7j03K41k40L51
1337B21k88m5J89o3k16K79j52J0J6%J83k16J08K00m81K56J75k5k26j00K45q9r5
1360a14J89J15k91J5L35m66J90J5N0j42K65k25L11k57j58J73k91r4L38J5O6j15
1382g6K61k8n14M66j03j89K12J61k91K47%k26L23l37Q4j32J52Q1j66J79k55J11
1404d0L02k39j74L57o2j39P4O4k48J38j22k0j9J40J81j78k10K94j83L15k66O6
1426C1M2k85M00m09P4L83p9j70rJ52K31m32L19k88R3k06k28J84j12M09j24k51
$$ plain form
1448 -275 23 -88 21 49 -253 -4 -194 -130 64 53 -195 74 -66 -46 98 132 130 93 -111 -90 -318 -183 -165
1471 -165 -18 144 103 -63 174 -123 -232 120 180 -40 -131 -188 -105 310 -84 -244 58 210 277 -118 -58 -123 -209
1494 -209 170 37 29 -115 -31 -212 71 -114 -26 -114 -119 45 55 314 -22 -7 -64 -135 -83 -43 -152 231 56 123 -48
1519 -48 -198 -96 -2 -17 158 10 -17 12 282 51 244 18 146 147 -294 -224 -235 163 101 121 -167 -238 84 48
1543 48 -35 25 -144 26 31 -37 -135 -187 -229 79 223 -250 241 81 201 78 -105 109 -14 3 159 66 -284 -21
1567 -21 246 -174 63 -78 155 -223 -185 95 66 -46 89 -205 140 -12 -62 125 180 21 65 -158 196 89
1589 89 336 -88 56 72 -64 69 -218 -222 -84 14 -105 24 -69 -312 -72 10 66 -116 179 -45 -211 -241 68
1612 68 43 -177 -183 57 64 -140 233 116 224 114 -241 165 -39 -116 310 -3 -158 154 -163 -24 -130 -136 -14
$$ packed form
1448b75K98j11J09K8l02K49j90O4J94j1k48K69j40K0J44L4kl7k04K1k28J35J8
1471a65J47J62m1j66K37k97j09L52O0k20r1n7Q3M15l94j60L02J52O7l95O0o5q6
1494b09L79j33qj44Q4j81K83j85Q8q8nJ64J0K59l36J5n7p1N2M0j09L83j75O7j71
1519d8j50J02R4j5J75j48k7K9K70k31J93k26J28Jm41P0j1L98o2K0k88p1L22l6
1543D8q3O0j69J70No8r8n2m2L08J44m73M91j60J20j23j83K14j23J7J56r3l50K63
1567b1K67m20K37j41K33l78L8K80k9j12J35k94L45j52n0J87N5j59M4k23L54j07
1589H9K47m24J44J6j36J33k87mJ38R8j19J29r3k43K40Q2N6j82K95k24j66l0L09
1612F8k5k20oK40Pk04L73j17J08j10l55M06k04p7M26l13j55L12l17J39j06oJ22
$$ plain form
1635 -14 -129 118 26 -87 -79 121 284 -145 -117 -54 250 -158 -160 13 204 -18 28 119 166 -148 -34 -25 39 121 81
1660 81 151 -36 -37 127 24 129 36 -6 -78 110 130 139 -71 -11 32 118 35 -167 -178 -271 85 -119 69 24 381 -143
1686 -143 -35 -420 134 -1 -66 -172 -214 77 200 14 249 50 -91 19 63 -87 -54 -67 15 17 -30 -83 43
1709 43 11 -79 127 -300 -181 4 -51 -291 344 97 32 166 -180 -136 -108 -325 -10 -10 -68 -230 -62 67 72 -57
1733 -57 -95 -135 -28 82 -12 -57 93 -267 -2 126 -65 38 4 -1 -5 -84 -83 143 -103 -86 -35 -70 -298 -65 -219
1758 -219 92 -73 20 1 -5 -85 -184 99 90 143 268 183 87 96 -77 296 -366 335 -79 40 -139 65 323 -39
1782 -39 58 -106 -285 82 -114 -91 115 -95 142 79 66 168 -93 -141 107 54 58 -25 -95 317 87 -161 135 309
1806 309 -88 -142 -153 -225 -227 34 -257 -110 -69 129 69 -82 153 46 -311 172 62 78 -259 212 -46 -69 1
$$ packed form
1635a4j15K47r2j13QK00J63m29K8O3L04m08kJ73J91k22M6R1M7l14J14RO4Q2m0
1660H1P0j87jJ64j03J05r3m2p2J88K0Rk10O0M3Q6q3k02j1r3L56k04J88m5L57n24
1686a43J08l85N54j35o5j06m2K91J23j86K35j99j41J10M4j50L3j3Q2Km7n3J26
1709D3l2r0K06m27J19J85n5k40O35k47o5J34l46M4K8k17L15%n8j62J68J29Nj29
1733e7l8m0J07J10r4m5J50l60K65J28j91J03l4nmp9JK26k46J7N1l5k28K33j54
1758b19L11j65R3j9oq0r9K83rN3J25q5r6Rj73L73o62P01m14J19j79K04K58l62
1782c9R7j64j79L67j96K3K06k10K37o3j3J02k61m8K48n3Mq3p0M12k30k48K96J74
1806C09l97n4j1p2kK61k91J47M1J98o0j51K35j07l57M83j10J6l37M71k58k3P0
$$ plain form
1829 1 -152 -250 24 -18 56 -206 -64 -20 -154 -100 37 83 -30 -44 149 344 -153 89 252 204 195 -147 45 89
1853 89 -436 32 257 154 11 3 55 -160 -36 127 -39 91 9 -39 -324 116 -104 -37 -61 -140 171 -135 -62
1876 -62 -23 58 -228 -32 247 124 -28 -47 -238 -433 -26 -99 -501 -89 -115 -211 -265 188 -264 -158 161 -4 -35
1899 -35 62 -113 -119 223 -175 -17 -67 -86 161 -39 -162 -95 -20 -56 155 -27 -55 -40 209 -190 -69 -10 80 124 -263
1924 -263 -60 -228 -127 -90 155 52 131 -226 -146 88 81 -47 -49 221 145 -291 -84 111 153 71 55 -101 140 270
1948 270 -15 -76 -29 22 -3 -10 -3 -130 -238 56 237 -5 -295 -82 212 -67 -106 -11 66 -39 128 178 117 151 -149
1973 -149 8 -195 -151 16 -92 -81 63 41 13 -123 177 -79 11 146 0 -91 -101 -20 6 -214 72 -67 -313
1996 -313 152 -242 0 -114 -159 76 0 -63 -39 -13 -169 79 129 408 59 38 26 45 -77 -9 -39 -5 68 109 191
$$ packed form
1829Aj53r8K74m2P4k62J42M4j34N4J37M6j13j4J93J95m97K42J63m8rl42J92M4
1853H9n25M68K25j03j43qN2k15J24J63j66J30q2m8k85M40k20O7k4p9L11l06P3
1876f2L9Q1k86J96K79j23j52j9j91j95M07p3m02M12k6r6n4M53m52J06L19j65l1
1899c5R7j75oL42l98J58n0j9K47k00j23O7P5l6K11j82k8J5K49l99J21N9R0M4l87
1924b63K03j68J01L7K45j03P9l57Q0K34pj28kK70p6m36K07J95M2q2j6j56K41J30
1948B70k85o1M7N1k5pPj27j08K94J81k42k90K13K94k79l9R5P7j05J67N0o1L4l00
1973a49J57k03M4J67j08J1J44k2k8j36L00k56R0J35j46r1j0Q1K6k20K86j39k46
1996c13M65l94K42j14m5K35p6o3K4K6j56K48N0K79l49k1j2J9j22O8l0L4P3M1Q2
$$ plain form
2021 191 239 187 -167 4 -43 67 -76 90 29 -137 286 39 25 150 -1 -122 -147 -32 -167 55 -110 -61
2043 -61 -253 -151 221 263 235 53 155 -207 -29 49 -275 270 -42 93 -201 24 -139 -14 -69 -342 162 39
2065 39 252 184 -49 176 68 89 128 277 355 242 121 37 200 -126 -93 -79 274 -35 307 -137 -40 -73 -164 129
2089 129 131 240 192 108 105 -42 -77 130 -3 83 -63 -40 163 75 -242 -29 84 15 88 -140 -82 -170 -172 46 -52 -89
2115 -89 163 146 28 -105 -227 212 -182 276 -260 20 22 36 -46 118 142 -338 -78 -256 152 222 222 -85 -232
2138 -232 264 -420 -14 -2 -88 3 -59 -22 187 -132 -39 -85 200 111 218 -75 16 14 119 -103 -47 45 -125 -140 -115
2163 -115 -138 102 -15 -33 -91 9 257 46 -118 -155 -220 173 174 -213 44 95 280 105 -74 -115 270 203 -203
2186 -203 23 99 -61 44 85 4 -11 -324 167 -193 71 69 3 -95 167 56 -214 -65 140 53 -85 -243 -27
$$ packed form
2021A91M8n2l54J71m7J10j43J66o1j66M23k47j4J25j51j21k5J15j35K22j65M9
2043f1j92J02L72M2k8j82J02l62J78P8l24N45l12J35k94K25j63J25n5k73N04j23
2065C9K13o8k33K25j08K1L9J49P8j13j21q4J63l26L3J4L53l09L42m44R7l3r1K93
2089A29KJ09m8q4lj47l5K07j33Q6j46K3K03q8l17K13J13o9P3k28N8q8kK18r8l7
2115h9K52j7j18j33j22M39l94M58n36K80KJ4q2J64K4m80K60j78M08P0%l07j47
2138b32M96o84M06J2q6R1o2L7K09l19R3m6K85q9J07k93R1kJ05k22N6R2j70j5K5
2163a15k3K40j17j8n8J00K48k11j64l7o5L93Jl87K57N1J85j75j79m1L85o7m06
2186b03K26P6j60J05M1q1j5l13M91l60K64ko6r8K62j11k70J49K05q7j38j58K16
$$ plain form
2209 -27 -78 -203 340 -286 -213 45 -116 70 -344 -183 171 -32 -41 248 -16 72 -192 35 -119 -160 -83 40 144
2232 144 33 46 11 -100 -127 -183 90 -41 -21 19 -197 -69 82 -65 -105 104 107 -23 -6 26 181 150 120 -234
2256 -234 -195 33 -195 0 -194 -236 128 -144 -33 218 52 -109 -36 70 28 277 114 63 -138 -25 8 -257
2278 -257 37 -157 168 -31 -124 154 328 -195 -121 153 -148 55 113 164 -11 8 96 -38 121 -44 122 -144
2300 -144 255 7 9 110 161 -218 18 3 152 -135 -297 -234 108 157 -2 34 222 -211 129 -196 -24 14 -225
2323 -225 204 74 -24 -26 202 -259 -167 -127 187 44 -30 -172 16 179 320 -157 99 79 -203 285 -163 -318
2345 -318 218 -28 97 -148 57 85 -162 53 -38 -6 99 39 -32 42 41 1 -174 -76 31 119 308 -71 -131 196
2369 196 -34 -188 -179 58 129 -59 -124 -18 233 -125 -185 50 34 -74 350 6 20 5 104 -17 30 36 -272 314
$$ packed form
2209b7n1j25N43o26P3K58j61J86m14J61L54k03rK89k64Q8k64K27j54m1P7J23J04
2232A44j11J3l5j11k7n6K73j31K0M0k16J28J51j47m0K09Lj30J7L2J55l1l0l54
2256b34L9K28k28J95j94m2L64k72J11K51j66j61P3J06m2K49j63n1k01J13L3k65
2278b57K94j94L25j99r3K78J74n23P4K74l01K03N8N1j75J9Q8j34J59j65J66k66
2300a44L99k48KJ01N1l79K36j5J49k87j62O3L42M9j59L6J88m33L40l25J72L8k39
2323b25M29j30r8kK28m61R2M0L14j43p4j42J88J63J41m77K56k0k82M88m48j55
2345c18N36k46J25k45K05K8k47K15r1L2J05o0p1P4jm0j75R8J07Q8J89l79o0L27
2369A96k30j54RK37P1j88o5J06K51l58o0K35j6j08M24l44J4j5R9j21M7Ol08N86
$$ plain form
2393 314 -67 -11 -118 96 36 119 275 -14 313 -58 68 -192 -298 156 -44 103 227 117 -23 63 10 7
2415 7 -372 -41 -60 143 -9 -39 133 -149 -179 249 303 -29 -19 -66 -164 -25 -23 -220 55 -235 -143 199 -84 -375
2439 -375 56 58 19 -76 -272 -115 313 -175 125 281 -107 -167 128 -46 -63 142 -184 -103 -71 45 59 0 -184
2462 -184 -197 71 -38 -75 -51 -141 101 -47 13 104 22 -159 -21 99 38 52 28 -54 -44 15 -186 -167 -79 -67 -232
2487 -232 45 33 85 163 -47 113 174 30 -52 122 39 -141 104 -77 -41 -59 -93 -70 260 -178 -69 104 169 -276
2511 -276 -44 104 249 -7 -249 -143 257 6 -39 -72 -150 161 -61 -9 -43 27 118 -154 -345 159 349 181
2533 181 66 174 194 17 109 147 189 25 -22 47 64 -45 70 -85 -267 163 -48 46 295 -17 183 -151 -34
2556 -34 104 309 -219 217 170 72 91 73 69 77 -47 133 130 159 227 68 25 -118 -251 2 -199 -254 320 -51 -11
$$ packed form
2393C14l81N6j07K14o0Q3J56k89L27l71J26k60j06M54k00J47J24j10j40Q6n3l
2415Gl79L31j9K03j52l0J72k82l0M28N4l32J0m7r8J39Kj97K75k90R2L42k83k91
2439c75M31Kl9r5j96J57M28m88L00J56l88o0K95j74j7K05l26Q1L2J16J4n9j84
2462a84j3K68j09l7K4r0K42j48O0R1q2j81J38J20o1J4k4q2J0N9k01J9Q8J2j65
2487b32K77j2N2P8k10J60O1j44q2J74q3j80K45j81L6j8l4K3L30m38J09J73O5m45
2511b76K32J48J45k56k42J06M00k51m5l3p8L11k22N2l4P0R1k72j91N04J90j68
2533A81j15J08K0j77R2L8M2j64m7O9J7j09J15j55j82M30k11R4K49l12K00l34J17
2556c4J38K05n28M36m7r8J9j8mQj24J80lK9O8j59m3j43j33K53k01n5N74l71M0
$$ plain form
2581 -11 1 35 -65 148 -157 -7 228 12 88 134 128 -211 -127 128 169 227 281 0 -58 -33 190 -178 -34 -19 -113
2606 -113 45 105 89 -111 -288 21 -241 315 -159 -42 -147 27 8 201 -44 166 226 59 25 -309 14 -117
2628 -117 172 -239 22 39 38 222 66 182 -108 -17 -32 -103 -81 -187 -155 313 131 -104 68 132 391 -210 135
2651 135 -72 -1 44 28 -120 -96 -250 -147 148 -9 110 67 -181 158 -116 -87 213 -449 47 -228 136 -215
2673 -215 39 243 -29 103 -183 -102 117 -147 -17 154 -70 -64 -211 16 233 84 -46 -70 21 -151 -161 -148
2695 -148 -89 40 -32 12 -59 15 50 -1 117 -67 -215 -111 -73 -78 0 42 60 185 -37 216 159 31 22 -101 -89 182
2721 182 -92 -210 39 304 -56 -62 -76 98 48 -147 43 24 193 83 106 45 -235 -169 50 189 -20 28 23 -110
2745 -110 134 94 171 -75 -146 14 -46 -133 31 149 201 12 -212 22 -156 110 -177 -22 -84 65 177 -100
$$ packed form
2581a1J2L4j00K13l05J50K35k16P6M6ol39Q4K55M1N8N4k81n8K5K23l68J44J5r4
2606a13J58O0j6k00j77L09k62N56m74J17j05J74j9J93k45K10O0j67l4l34L23j31
2628a17K89m11K61J7jJ84j56J16k90R1j5p1K2j06L2M68j82k35J72O4K59o01L45
2651A35k07P1M5j6j48K4j54J03K95j57J19m3k48L39k74K9L00o62M96k75L64l51
2673b15K54K04k72J32k86Q1K19k64J30J71k24Oj47K27K17j49j30k4R1j72j0J3
2695a48N9J29p2M4p1P4L5n1J18j84j48J04L8nP8M2J8J25k22K53n7j28rj23J2K71
2721A82k74j18K49K65l60oj4J74n0j95J90j9J69j10K3o1k80O6K19J39k09M8nj33
2745a10K44m0P7k46p1J60o0q7J64J18N2j89k24K34j78K66k87J55o2J49J12k77
$$ plain form
2767 -100 -171 -28 79 -133 234 105 80 -122 273 188 33 -65 303 41 3 -19 14 -124 -53 -26 -36 156 4
2790 4 103 -184 158 -9 140 -226 397 18 50 -400 54 139 -98 45 -133 -175 -256 233 56 -105 -357 -14
2812 -14 -149 123 143 -106 141 253 -327 -337 108 160 -88 -173 -112 72 105 2 -141 -22 -138 -268 -153 -149 -160
2835 -160 -275 -12 -195 -7 -6 96 257 -97 -50 -113 -7 9 -133 36 299 160 278 232 -10 -97 36 -65
2857 -65 95 -127 -64 -37 -47 -70 16 33 -1 85 -56 -162 154 -3 62 -141 -250 -38 -40 -3 -176 125 86 -80 116
2882 116 67 -25 -101 246 183 83 173 49 18 12 290 142 -200 68 -74 264 -13 10 303 141 92 -66 111
2905 111 -85 5 440 -191 -131 -17 154 104 0 199 -6 165 -174 112 -106 -167 -99 -33 -75 -173 -288 -47 94
2928 94 -262 95 -51 70 -60 347 137 -79 -312 179 3 49 -154 -22 270 303 -27 178 -16 68 -108
$$ packed form
2767a00p1J43J07k12L67j29k5k02L95q5j55r8L68k62l8k2L3j38P1K7j0J92j52
2790DR9k87L42j67J49l66O23l79L2m50M54Q5k37J43j78m2q1M89j77j61k52L43
2812a4j35K72K0k49K47J12n80j0M45N2k48q5O1J84L3j03j43J19j16j30J15Mj1
2835a60j15K63j83J88JJ02J61l54M7o3J06J6j42J69K63j39J18m6k42q7J33j01
2857f5J60k22O3K7j0k3Q6J7l4Q6j41j06L16j57O5k03j09K12kL7j73L01l9j66J96
2882A16m9r2p6L47o3j00R0j24l1oK78j48l42K68j42L38k77K3K93j62m9j58J77
2905A11j96R0M35o31O0J14J71n0j04J99k05J71l39K86k18o1O8O6m2r8j15K41J41
2928I4l56L57j46J21j30M07k10k16k33M91j76M6k03J32K92L3l30K05j94Q4j76
$$ plain form
2949 -108 -21 -58 -183 -114 -280 -182 64 386 -58 -53 -89 307 198 -101 25 -60 4 86 141 35 -178 7 11 -51 23
2974 23 91 118 -94 10 -52 90 149 -163 99 68 -100 -351 237 56 -137 155 100 84 -173 -12 85 29 -139
2997 -139 -139 80 -16 49 239 -64 246 374 82 125 -9 -171 -67 -113 33 473 1 1 -91 -165 -146 -162 -77 -187
3021 -187 -139 -58 55 -130 104 173 96 -177 108 -56 85 217 11 -19 70 -102 -177 -32 -60 12 237 -45 -30
3044 -30 92 -87 128 -52 145 -190 -110 87 -140 63 -77 13 136 -95 302 122 117 -40 17 -27 -40 15 123
3067 123 29 -217 46 67 -102 -142 -129 -148 3 -29 -189 56 160 -16 291 -285 147 69 -74 -176 139 114 78
3090 78 135 -49 -224 52 113 -235 86 -194 -196 -465 -23 -90 234 -296 28 -7 -61 19 -63 -8 -223 54 -236 -54
3114 -54 9 289 202 -209 -117 -18 -133 -45 43 33 85 -241 98 -161 32 21 167 -76 -137 -105 -290 192 -112 -114 -128
$$ packed form
2949a08Q7l7j25O9j66R8K46L22m44Nl6L96j09k99J26q5O4Q2N5j06k13J85Mo2P4
2974B3O8K7k12J04o2J42N9l12K62l1j68k51N88j81j93K92n5j6k57J61R7n6j68
2997a39%K19r6O5J90l03L10J28k92M3j34j62J04m6J46M40m72%r2p4J9j6Q5j10
3021a87M8Q1J13j85K34O9p7k73K85j64J41J32k06l0Q9j72p5J45k8P2K25k82J5
3044c0J22j79K15j80J97l35Q0J97k27K03j40R0J23k31L97j80nj57N7m4j3N5J08
3067A23r4k46K63K1j69m0J3j9J51l2j60K45J04j76L07n76M32p8j43j02L15k5l6
3090G8N7j84j75K76O1l48L21k80kk69M42o7L24n30L24l5n4Q0q2N5k15K77k90J82
3114e4O3K80q7m11R2R9j15Q8Q8j0N2l26L39k59J93j1J46k43o1L2j85M82l04kj4
$$ plain form
3139 -128 -245 138 114 5 82 1 -80 125 2 -139 54 211 -20 -48 139 -8 275 92 33 -310 -27 -188
3161 -188 -141 15 -243 103 16 223 -128 -190 37 250 294 -366 -72 -71 189 52 90 -96 301 47 105 299 -19
3184 -19 29 17 -58 18 363 125 126 186 -69 134 84 107 42 -274 0 -68 -254 -17 -157 44 160 -51 -58 -151 -311
3209 -311 -392 -117 -101 -125 171 -77 251 -8 48 -172 114 -20 -77 -56 -37 -194 75 -134 -103 246 -354 -114 55
3232 55 -20 79 200 203 -162 -37 -92 89 126 -120 259 -133 140 -30 -173 264 44 -178 -262 -225 25 88 185 115
3256 115 -14 -233 -182 -348 64 -271 50 102 161 92 30 239 105 -81 -25 -43 5 90 122 336 146 -185 128
3279 128 -101 30 3 -96 66 -109 59 -145 54 97 -31 133 -187 -132 199 -34 -110 51 17 144 232 -319
3301 -319 -118 -37 -70 -309 -265 18 23 10 -82 -241 199 -95 -19 -74 122 33 117 268 -48 28 23 -38 -11 -238 179
$$ packed form
3139a28j17L83k4j09P7q1q1K05j23j41J93J57k31k8J87j47K83j83n9l43K83j61
3161a88M7J56k58L46q7K07l51o2K27K13M4o60K94JK60j37L8j86L97k54N8J94l18
3184a9M8j2p5P6L45k38JO0k55K03n0K3o5l16K74o8j86K37j40K01J16k11pr3j60
3209c11q1K75J6k4K96k48L28k59N6k20K86j34n7K1J9j57K69k09L1L49o00K40J69
3232E5p5R9J21Ll65J25n5J81L7k46L79l92K73j70j43M37k20k22q4L7K50O3R7p0
3256A15j29k19N1j66M12l35L21N2N9o9o2K09j34j86N6j8M8Q5L2K14j90l31L13
3279A28k29J31k7r9J62j75J68k04J99M3j28J64l20N5L31k33p6J61l4J27Q8n51
3301c19K01Q1l3k39M4K83Nj3r2j59M40k94P6n5J96q9Q4J51l16P6no1K7k27M17
$$ plain form
3326 179 144 109 -171 -101 -157 15 34 -91 -185 -21 257 -87 -86 -112 164 18 107 -266 -151 -261 246 -62 -185
3349 -185 39 71 19 89 -73 54 358 12 61 177 -219 189 -110 -273 -271 18 -164 45 -3 -111 130 7
3371 7 -63 95 -48 -168 -177 -182 20 -156 -260 75 -18 335 -207 302 -151 -1 172 367 -120 67 -303 24 -29
3394 -29 28 96 -168 294 139 49 68 56 -308 -2 -353 -38 -49 19 -205 146 141 -235 135 87 287 -2 40 -120
3418 -120 -378 67 46 135 -41 -16 -135 -175 25 112 48 -104 -72 66 153 26 144 174 253 -114 9 99 -156 86
3442 86 -93 78 156 -20 342 -97 31 -207 -121 -141 -159 -108 -78 16 -214 50 -44 -134 -32 142 17 35 126 -147
3466 -147 -118 -261 -30 271 -50 -1 -378 29 -90 38 90 50 -84 82 56 -232 50 26 72 -189 9 -155
3488 -155 -179 -222 -227 46 115 214 -203 -83 180 -268 63 58 -181 28 102 -30 212 -58 33 -207 285 -142 93
$$ packed form
3326A79l5l5k80P0n6J72J9j25r4J64K78l44Jk6K76j46Q9l73J15j10N07l08j23
3349a85K24L2n2P0j62J27L04l46M9J16l96M08k99j63KK89j82K09m8j08K41j23
3371Gp0J58j43j20rnK02j76j04L35r3L53n42N09m53J50J73J95m87J87l70L27n3
3394b9N7O8k64M62j55r0J9j2l64L06l51L15j1O8k24L51nl76L70m8K00k89M2j60
3418a20k58M45k1Q9j76K5j19m0K00Q7o4j52L2J38Q7j27J18L0P9l67J23R0k55K42
3442H6j79J71P8j76L62m39J28k38Q6k0j8N1L0R4k30K64r4r0J02J74j25J8R1k73
3466a47K9j43K31L01l21M9l77M07j19J28N2m0j34J66k6k88K82k4M6k61J98j64
3488a55k4m3nK73O9R9m17J20K63m48L31nk39K09P4j32K42k70R1k40M92m27K35
$$ plain form
3511 93 -37 -51 -81 -22 -119 -88 34 -160 -46 189 31 77 253 117 -85 136 256 -28 -28 -284 154 36 -83
3534 -83 -155 80 -254 109 71 31 40 -183 272 -133 77 -94 -172 -59 167 37 11 12 -62 89 -24 -125 85 -104
3558 -104 -141 -148 54 127 -16 -247 257 -9 -91 -288 -296 59 -81 -164 158 110 88 -62 -319 -235 -232 115 226 -119
3582 -119 -91 -24 -242 -194 -64 120 105 29 -31 179 -153 27 221 225 -141 -95 42 -88 -133 75 -180 179 131 -98
3606 -98 33 34 92 64 -80 -349 307 421 -87 -55 235 -35 246 71 -276 187 79 165 -95 198 42 59 -157
3629 -157 20 51 20 -215 -347 28 176 -129 85 231 357 -42 -186 -168 -74 -287 1 -164 132 100 100 133 29
3652 29 -122 139 -181 109 112 42 61 -163 -92 -251 2 -126 -142 -117 -211 39 -114 19 -174 98 -39 229 201
3675 201 115 -258 -36 -28 -276 62 -212 -169 33 -119 -84 -174 353 212 -159 -165 241 50 22 54 66 -281 -20 127
$$ packed form
3511I3j30j4l0N9r7L1J22j94J14K35j58M6J76j36k02K21J20k84%k56M38j18j19
3534h3p2K35l34L63l8m0Rk23M55m05K10j71p8J13K26j30k6Jp4J51j13j01K10j89
3558a04l7pK02P3j43k31N04k66q2j97qL55j40q3L22m8k2j50k57Q4LL47J11l45
3582a19K8O7k18M8J30J84j5p6o0K10l32J80J94Ml66M6J37j30m5K08k55L59m8k29
3606i8J31JN8k8j44k69O56J14n08L2K90k70K81j75l47M63j08Q6k60K93j56J7k16
3629a57J77L1l1k35j32L75J48l05K14J46J26l99j44J8R4k13K88j65K96l2%L3j04
3652B9j51K61l20K90Lp0J9k24P1j59K53j28j6K5r4K50j53J33j93K72j37K68k8
3675B01q6l73K22Qk48L38k74M3K02j52L5r0N27j41l71oM06j91k8L2J2l47K61J47
$$ plain form
3699 127 -183 36 -1 201 -203 105 -54 86 -320 -88 -183 260 -110 73 16 342 147 -46 -99 -57 -38 91
3721 91 18 152 167 -127 -39 49 21 -225 -103 115 33 270 -5 -41 92 -144 -13 -76 20 245 125 -52 315
3744 315 279 126 87 -97 92 -55 -20 60 -217 -111 -128 219 130 85 -239 229 75 -117 41 -190 82 -15 -96
3767 -96 21 155 -34 105 181 140 -128 107 127 -14 109 296 65 -97 121 128 7 -62 121 -276 98 -55
3789 -55 39 29 -14 82 42 -154 77 36 -103 64 -12 -59 -61 43 25 -20 -156 20 172 -192 -126 45 -61 -111 -105 -197
3815 -197 -264 -45 -192 32 165 -63 -134 139 -335 97 545 -78 -260 -6 -11 35 3 133 19 -95 34 31 -461
3838 -461 354 -16 50 100 52 -230 -26 109 46 68 245 130 31 -255 -132 -30 -143 245 107 -212 -205 -97 125
3861 125 115 -131 -273 261 291 151 336 236 -190 13 -94 192 43 -23 -334 -247 115 -99 -18 -96 95 -112
$$ packed form
3699A27l10K19l7K02m04L08j59J40m06K32r5M43l70J83n7L26j95j93n3M2J9J29
3721I1p3J34J5k94Q8Q8k8k46J22K18q2K37k75l6J33k36J31o3R6K25j20j77L67
3744C15l6j53l9j84J89j47L5Q0k77J06j7L47q9m5l24M68j54j92J58k31K72r7q1
3767i6J17J34j89J39P6m1k68K35K0j41J23J87k31j62K18Pj21o9J83l97L74j53
3789e5R4j0m3R6m0j96K31m1j39J67p6m7kJ04j8m5j36J76J52l64O6J71j06n0Or2
3815a97o7K19j47K24J33k28p1K73m74M32M48o23j82K54nM6l2J30j14j14J29lm92
3838d61Q15l70O6N0m8k82K04J35o3K2J77j15r9k86J23J02j13L88j38l19PJ08K22
3861A25j0k46j42N34L0j40J85j00m26K03j07K86j49o6l11Q7L62k14Q1p8J91k07
$$ plain form
3883 -112 -45 -190 13 -288 -94 116 51 354 -227 -4 30 110 -108 6 99 -132 -12 184 -51 124 262 -245
3905 -245 182 -158 322 31 -198 -85 -8 248 -43 6 7 -100 275 -270 -224 -7 141 461 -104 -260 95 -36
3927 -36 -83 160 -116 192 113 -359 -6 -78 -12 -189 0 -57 -228 127 -43 6 233 80 -24 -98 127 -5 -97
3950 -97 162 324 194 -54 39 143 75 -3 -21 -48 -88 -282 63 36 -27 -30 -173 -50 64 111 -89 -201 -125 -346
3974 -346 -93 -143 75 -247 -77 76 -216 20 9 312 -80 -316 85 -99 -328 166 -23 -37 137 -53 66
3995 66 -176 -151 -220 -182 21 -166 122 -90 -148 10 25 -179 -120 24 -206 -70 173 15 -219 44 89 -181 287
4018 287 -9 73 75 145 -231 34 -46 95 25 238 10 116 9 -76 98 -134 -275 68 -223 -40 169 -155
4040 -155 29 36 -29 -204 -193 -67 149 128 61 -173 86 89 113 70 97 24 -28 53 80 -56 -24 120 -175 -29 188
$$ packed form
3883a12O7j45K03l01J94K10o5L03n81K23L4Q0k18J14R3k31J20J96k35J75J38n07
3905b45M27l40M80k91k29J13P7K56k91M9Jj07L75n45M6K17J48L20n65j56L55j31
3927c6m7K43k76L08p9m72L53p2O6j77J89n7j71L55j70M9K27j53j04p4K25j32r2
3950i7K59J62j30k48R3J04o8p8j8k7m0j94L45k7o3lj43J23J14M7k00j12P6k21
3974c46K53n0K18l22J70J53k92K36j1L03l92k36M01j84k29M94j89j4J74j90J19
3995F6k42K5o9L8K03j87K88k12n8J58J5k04N9J44k30J36K43j58k34K63M5k70M68
4018B87k96Q2KP0l76K65q0J41p0K13k28J06j07q5J74k32j41L43k91J83K09l24
4040a55J84Po5j75J1J26K16k1o7k34K59LK4m3K7p3n2Q1K7j36L2J44k95J46K17
$$ plain form
4065 188 48 -165 -237 105 -98 -108 61 -71 -20 -105 134 133 88 210 28 299 -56 -95 -123 -91 -11 -221 -73 -156
4089 -156 59 -108 159 20 37 116 136 216 -101 -41 -280 33 -166 125 11 -47 141 -234 141 39 -91 -124
4111 -124 -6 -147 -106 -38 -204 -36 -208 107 174 94 -230 -331 -62 94 -90 113 188 89 -217 133 -15 -221
4133 -221 11 65 -230 -54 -244 -42 68 5 247 17 -36 -56 -70 -100 127 -37 127 -247 46 -190 118 134
4155 134 -262 138 -143 213 -27 -241 -34 219 -199 -176 -2 85 30 70 -101 -169 42 174 -81 80 181 -29
4177 -29 -52 69 -285 142 364 -16 -136 -72 -206 276 -134 -28 -180 -74 97 6 -6 -147 41 -88 -10 28
4199 28 -162 95 -203 -296 133 136 -43 -139 -147 100 -78 89 -101 -218 -135 -218 -379 -146 99 -140 197 18 44
4222 44 54 -234 146 71 99 95 -60 -71 -224 -43 117 18 41 -111 -82 5 -390 88 -24 -15 66 -143 65 -47 -59
$$ packed form
4065A88j40k13p2L42k03j0J69j32N1q5K39jm5J22j82K71l55l9k8L2Q0k10J48q3
4089a56K15j67K67j39J7P9K0Q0l17O0k39L13j99K91j14n8J88l75L75j02j30l3
4111a24J18j41M1O8j66J68j72L15O7q0l24j01K69J56j84K03P5r9l06L50j48k06
4133b21K32N4k95J76j90K02J10o3K42k30n3k0j4l0K27j64J64l74K93k36L08J6
4155A34l96M00k81L56k40k14K07K53m18K3J74Q7n5M0j71o8K11J32k55J61J01k10
4177b9k3J21l54M27K22l80j20O4j34M82m10J06j52J06J71r1j2j41J88j29P8L8
4199B8j90K57k98r3M29Lj79r6qK47j78J67j90j17Q3q3j61K33K45k39L37j79K6
4222D4J0k88L80p5K8mj55j1j53J81J60r9K3j52K9Q7l95M78j12RQ1k09K08j12j2
$$ plain form
4247 -59 189 106 -138 45 -143 300 37 231 -109 147 63 236 74 -123 -175 285 6 83 -35 -69 -41 237
4269 237 -110 -143 44 146 10 246 -24 118 153 -211 258 -73 114 39 -58 -104 103 -79 127 13 100 145
4291 145 144 -51 130 -61 142 -126 -72 163 -122 -114 33 28 -218 350 -1 -124 193 71 66 -15 -100 -110 213 95
4315 95 42 104 -131 108 -73 -60 205 170 -319 -1 124 -104 -235 -96 142 195 69 -87 17 168 249 -10
$$ packed form
4247e9K48q3k44J83j88M43k63J94l40K56q4J73j62j97n2M60k79P7j18l4K8K78
4269B37l47l3J87J02j36K36k70J42L5l64M69l31J87p5r7m6K07j82K06j14Q7M5
4291A45jj95J81j91K03k68N4K35k85QJ47nk46N68l51j23L17j22nq1q5j0L23j18
4315I5n3O2k35K39j81J3K65l5m89L18J25k28j31J39K38N3j26j56J04J51Q1k59
$$ [...]
8191g5
##END NTUPLES=NMR FID
##END=
