##TITLE=1H_DE-87_5_k
 200.13MHz,CDCl3,
 8 sc
 
 24.6.2025
##JCAMPDX= 6.0         $$ Bruker NMR JCAMP-DX V2.0
##DATA TYPE= NMR FID
##DATA CLASS= NTUPLES
##ORIGIN= UXNMR, Bruker Analytische Messtechnik GmbH
##OWNER= pz
$$ XWIN-NMR		Version 3.5
$$ Tue Jun 24 13:51:53 2025 Russian Standard Time (UT+4h)  she@DPX200
##.OBSERVE FREQUENCY= 200.1313
##.OBSERVE NUCLEUS= ^1H
##.DELAY= (6, 6)
##.ACQUISITION MODE= SIMULTANEOUS
##.ACQUISITION SCHEME= undefined
##.AVERAGES= 8
##.DIGITISER RES= 18
##SPECTROMETER/DATA SYSTEM= spect
##.PULSE SEQUENCE= zg30
##.SOLVENT NAME= CDCl3
##.SHIFT REFERENCE= (INTERNAL, CDCl3, 0, 14.3821)
##AUDIT TRAIL= $$ (NUMBER, WHEN, WHO, WHERE, WHAT)
$$ ##TITLE= Audit trail, XWIN-NMR		Version 3.5
$$ ##JCAMPDX= 5.01
$$ ##ORIGIN= Bruker BioSpin GmbH
$$ ##OWNER= she
$$ F:/spectra/data/she/nmr/H-C/1/audita.txt
$$ ##AUDIT TRAIL=  $$ (NUMBER, WHEN, WHO, WHERE, WHAT)
(   1,<2025-06-24 13:50:44.56 +0400>,<she>,<DPX200>,
      <created by zg, POWCHK disabled, PULCHK disabled
       configuration hash MD5:
       00 E9 B6 7A A2 85 ED C7 34 08 36 98 17 FE 4E 26
       data hash MD5: 16K
       98 B9 6D 11 96 FA 48 8F 56 71 7A DA F1 21 CB 9B>)
$$ ##END=
$$ 
$$ hash MD5
$$ F1 FB 3C BC CB 0F 69 7F 0F A0 7E 42 19 8B 99 B9
##$RELAX= 
##$RELAX= 
##$RELAX= 
##$RELAX= 
##$RELAX= 
##$RELAX= 
$$ Bruker specific parameters
$$ --------------------------
##$DU= <F:/spectra>
##$EXPNO= 1
##$NAME= <H-C>
##$PROCNO= 1
##$TYPE= <nmr>
##$USER= <she>
##$AMP= (0..31)
100 100 100 100 100 100 100 100 100 100 100 100 100 100 100 100 100 100 
100 100 100 100 100 100 100 100 100 100 100 100 100 100 
##$AQSEQ= 0
##$AQ_mod= 1
##$AUNM= <au_zg>
##$AUTOPOS= <>
##$BF1= 200.13
##$BF2= 200.13
##$BF3= 200.13
##$BF4= 200.13
##$BF5= 200.13
##$BF6= 200.13
##$BF7= 200.13
##$BF8= 200.13
##$BYTORDA= 1
##$CFDGTYP= 0
##$CFRGTYP= 5
##$CHEMSTR= <none>
##$CNST= (0..31)
1 1 145 1 1 1 1 1 1 1 1 1 1 1 1 1 1 1 1 1 1 1 1 1 1 1 1 1 1 1 1 1 
##$CPDPRG= <>
##$CPDPRG1= <>
##$CPDPRG2= <>
##$CPDPRG3= <>
##$CPDPRG4= <mlev>
##$CPDPRG5= <mlev>
##$CPDPRG6= <mlev>
##$CPDPRG7= <mlev>
##$CPDPRG8= <mlev>
##$CPDPRGB= <>
##$CPDPRGT= <>
##$D= (0..31)
0 0.7 0 0 0 0 0 0 0 0 0 0.03 0 0 0 0 0 0 0 0 0 0 0 0 0 0 0 0 0 0 0 0 
##$DATE= 1750758643
##$DBL= (0..7)
120 120 120 120 120 120 120 120 
##$DBP= (0..7)
150 150 150 150 150 150 150 150 
##$DBP07= 0
##$DBPNAM0= <>
##$DBPNAM1= <>
##$DBPNAM2= <>
##$DBPNAM3= <>
##$DBPNAM4= <>
##$DBPNAM5= <>
##$DBPNAM6= <>
##$DBPNAM7= <>
##$DBPOAL= (0..7)
0.5 0.5 0.5 0.5 0.5 0.5 0.5 0.5 
##$DBPOFFS= (0..7)
0 0 0 0 0 0 0 0 
##$DE= 6
##$DECBNUC= <off>
##$DECIM= 32
##$DECNUC= <off>
##$DECSTAT= 4
##$DIGMOD= 1
##$DIGTYP= 9
##$DL= (0..7)
0 120 120 120 120 120 120 120 
##$DP= (0..7)
150 150 150 150 150 150 150 150 
##$DP07= 0
##$DPNAME0= <>
##$DPNAME1= <>
##$DPNAME2= <>
##$DPNAME3= <>
##$DPNAME4= <>
##$DPNAME5= <>
##$DPNAME6= <>
##$DPNAME7= <>
##$DPOAL= (0..7)
0.5 0.5 0.5 0.5 0.5 0.5 0.5 0.5 
##$DPOFFS= (0..7)
0 0 0 0 0 0 0 0 
##$DQDMODE= 0
##$DR= 18
##$DS= 0
##$DSLIST= <SSSSSSSSSSSSSSS>
$$ [...]
##$SUBNAM0= <"">
##$SUBNAM1= <"">
##$SUBNAM2= <"">
##$SUBNAM3= <"">
##$SUBNAM4= <"">
##$SUBNAM5= <"">
##$SUBNAM6= <"">
##$SUBNAM7= <"">
##$SUBNAM8= <"">
##$SUBNAM9= <"">
##$SW= 18.0517328524113
##$SWIBOX= (0..15)
0 0 2 0 0 0 0 0 0 0 0 0 0 0 0 0 
##$SW_h= 3612.71676300578
##$TD= 16384
##$TD0= 1
##$TE= 0
##$TE2= 300
##$TE3= 300
##$TEG= 300
##$TL= (0..7)
0 120 120 120 120 120 120 120 
##$TP= (0..7)
150 150 150 150 150 150 150 150 
##$TP07= 0
##$TPNAME0= <>
##$TPNAME1= <>
##$TPNAME2= <>
##$TPNAME3= <>
##$TPNAME4= <>
##$TPNAME5= <>
##$TPNAME6= <>
##$TPNAME7= <>
##$TPOAL= (0..7)
0.5 0.5 0.5 0.5 0.5 0.5 0.5 0.5 
##$TPOFFS= (0..7)
0 0 0 0 0 0 0 0 
##$TUNHIN= 0
##$TUNHOUT= 0
##$TUNXOUT= 0
##$USERA1= <user>
##$USERA2= <user>
##$USERA3= <user>
##$USERA4= <user>
##$USERA5= <user>
##$V9= 5
##$VALIST= <valist>
##$VCLIST= <CCCCCCCCCCCCCCC>
##$VD= 0
##$VDLIST= <DDDDDDDDDDDDDDD>
##$VPLIST= <PPPPPPPPPPPPPPP>
##$VTLIST= <TTTTTTTTTTTTTTT>
##$WBST= 1024
##$WBSW= 4
##$XGAIN= (0..3)
0 0 0 0 
##$XL= 0
##$YL= 0
##$YMAX_a= 102990
##$YMIN_a= -166031
##$ZGOPTNS= <>
##$ZL1= 120
##$ZL2= 120
##$ZL3= 120
##$ZL4= 120
##$ABSF1= 10
##$ABSF2= 0
##$ABSG= 5
##$ABSL= 3
##$ALPHA= 0
##$AQORDER= 0
##$ASSFAC= 0
##$ASSFACI= 0
##$ASSFACX= 0
##$ASSWID= 0
##$AUNMP= <proc_1d>
##$AZFE= 0.1
##$AZFW= 0.1
##$BCFW= 1
##$BC_mod= 2
##$BYTORDP= 1
##$COROFFS= 0
##$CY= -3
##$DATMOD= 1
##$DC= 2
##$DFILT= <>
##$DTYPP= 0
##$F1P= 0
##$F2P= 0
##$FCOR= 0.5
##$FTSIZE= 0
##$FT_mod= 4
##$GAMMA= 1
##$GB= 0.15
##$INTBC= 1
##$INTSCL= 1
##$ISEN= 128
##$LB= 0.25
##$LEV0= 0
##$LPBIN= 0
##$MAXI= 10000
##$MC2= 0
##$MEAN= 0
##$ME_mod= 0
##$MI= 1.114404
##$NCOEF= 0
##$NC_proc= 0
##$NLEV= 6
##$NOISF1= 3.799351
##$NOISF2= 2.8
##$NSP= 1
##$NTH_PI= 0
##$NZP= 0
##$OFFSET= 14.38212
##$PC= 1
##$PHC0= -1197.775
##$PHC1= 14.7922
##$PH_mod= 1
##$PKNL= yes
##$PPARMOD= 0
##$PSCAL= 0
##$PSIGN= 0
##$REVERSE= no
##$SF= 200.129724274929
##$SI= 16384
##$SIGF1= 3
##$SIGF2= 2
##$SINO= 400
##$SIOLD= 16384
##$SREGLST= <1H.CDCl3>
##$SSB= 0
##$STSI= 0
##$STSR= 0
##$SW_p= 3205.1282051282
##$SYMM= 0
##$S_DEV= 0
##$TDeff= 0
##$TDoff= 0
##$TI= <>
##$TILT= no
##$TM1= 0
##$TM2= 0
##$TOPLEV= 0
##$USERP1= <user>
##$USERP2= <user>
##$USERP3= <user>
##$USERP4= <user>
##$USERP5= <user>
##$WDW= 1
##$XDIM= 8192
##$YMAX_p= 0
##$YMIN_p= 0
$$ End of Bruker specific parameters
$$ ---------------------------------
##NTUPLES= NMR FID
##VAR_NAME=  TIME,          FID/REAL,        FID/IMAG
##SYMBOL=    X,             R,               I
##VAR_TYPE=  INDEPENDENT,   DEPENDENT,       DEPENDENT
##VAR_FORM=  AFFN,          ASDF,            ASDF
##VAR_DIM=   8192,          8192,            8192
##UNITS=     SECONDS,       ARBITRARY UNITS, ARBITRARY UNITS
##FACTOR=    0.0002768,     1,               1
##FIRST=     0,             0,               0
##LAST=      2.2672688,     0,               0
##MIN=       0,             -166031,         0
##MAX=       2.2672688,     102990,          0
$$ Real data points
##PAGE= N=1
##DATA TABLE= (X++(R..R)), XYDATA
$$ [...]
$$ plain form
1909 40 51 265 23 14 -104 15 -266 -173 291 -111 -82 -168 -333 -6 -156 290 -129 92 -3 -73 -37 66 -79
1932 -79 -88 248 -33 74 -82 50 24 68 -56 -179 -95 -48 -7 -28 -115 -85 310 -288 258 135 19 100 274 82
1956 82 243 -240 36 11 -60 -128 -190 -184 177 -18 121 3 -44 342 -54 -105 -76 109 -162 194 -39 -97 58 107
1980 107 8 -259 0 -78 77 206 -89 109 -5 6 -38 134 96 33 -36 69 -175 205 -4 -57 273 91 137
2003 137 223 -128 -321 -61 -73 187 -26 -204 59 22 -30 151 278 -46 230 273 -79 -38 -93 -183 237 -75 -70
2026 -70 -84 -215 6 19 -258 152 -43 -94 -22 156 -291 -87 -21 -50 -5 183 -5 81 -77 140 -131 36 150
2049 150 100 52 -53 80 21 184 -271 196 49 157 211 81 -73 -6 204 24 195 149 -86 288 190 132 86
2072 86 -132 305 99 -266 287 -43 -95 178 -285 181 211 -40 -121 263 226 0 213 10 15 -56 253 -179 -126
$$ packed form
1909D0J1K14k42rj18J19k81R3M64m02K9q6j65L27j50M46m19K21r5p0L6J03j45
1932g9rL36k81J07j56J32k6M4j24j23Q4M7M1k1q7L0L95n98N46j23j16Q1J74j92
1956H2J61m83K76k5p1o8o2OL61j95J39j18m7L86l96n1K9J85k71L56k33n8J55M9
1980A07r9k67K59p8J55J29k95J98j14J1m4J72l8o3o9J05k44L80k09n3L30j82M6
2003A37Q6l51j93K60j2K60k13j78K63l7n2J81J27l24K76M3l52M1n5r0M20l12N
2026g0j4j31K21J3k77M10j95n1P2J78m47K04O6k9M5J88j88Q6j58K17k71J67J14
2049A50n0m8j05J33n9J63m55M67j47J08N4j30j54O7K10j80J71m6k35L74r8n8m6
2072H6k18M37k06l65N53l30n2K73m63M66L0k51q1L84l7k26K13k03Np1L09m32N3
$$ plain form
2095 -126 200 175 -168 -153 132 -115 249 19 -13 67 96 85 39 1 132 57 -66 16 31 72 -186 113 -159 -104
2119 -104 -74 -390 -137 -32 130 -303 -217 209 67 -209 16 -241 -97 246 -23 117 -30 -128 -121 -27 -229 -123
2141 -123 -208 -275 59 -336 13 -122 -51 18 52 -23 143 95 52 233 127 7 179 49 147 202 115 55 236 61
2165 61 355 81 -304 -159 -37 -72 -86 -114 112 114 114 110 139 -36 103 189 267 -37 -256 -148 -64 11 -381 -178 -20
2190 -20 -148 -42 198 -161 -186 78 -252 -59 -28 155 -31 -123 93 -38 262 -26 -365 -178 48 -399 15
2211 15 -180 149 10 -242 5 3 114 -64 -105 -181 160 -19 193 141 42 23 67 37 -71 -25 -20 51 -72 17 -40
2236 -40 -11 -209 227 196 65 82 -131 1 35 -141 151 -21 96 -149 136 -17 288 8 -321 -16 101 -38
2258 -38 25 -194 -16 29 226 19 48 155 111 109 274 272 140 129 52 -121 173 82 -213 120 -120 -230 70 -8
$$ packed form
2095a26L26k5l43J5K85k47L64k30l2Q0K9j1m6l8J31p5j23Q2J5M1k58K99k72N5
2119a04L0l16K53J05J62m33Q6M26j42k76K25k57J44L43k69J40j47r8PR4k02J06
2141a23q5o7L34l95L49j35P1O9L4p5J66m8m3J81j06j20J72j30R8N5q7o0J81j75
2165F1K94k74l85J45J22l5j4k8K26K%mK9j75J39Q6P8l04k19J08Q4P5l92K03J58
2190b0j28J06K40l59k5K64l30J93L1J83j86r2K16j31L00k88l39J87K26m47M14
2211A5j95L29j39k52K47kJ11j78m1p6L41j79K12n2r9j9M4l0j08M6NP1j23Q9n7
2236d0K9j98M36l1j31J7k13J32L4j76K92j72J17k45K85j53L05k80l29L05J17j39
2258c8O3k19J78M5J97k07K9J07m4kJ65kj32j1p7j73K94r1k95L33k40j10L00p8
$$ plain form
2282 -8 153 104 101 -18 81 198 148 278 134 -61 -39 -21 -76 73 -323 -32 -5 -104 1 223 -185 -281 73 -128
2306 -128 104 25 154 -78 65 -109 32 72 -190 24 -48 -41 -119 56 52 -188 38 -40 -57 98 -124 -4 -18 -196
2330 -196 102 -142 28 99 16 178 162 -308 218 117 96 -22 51 -8 92 -164 84 53 -85 -46 97 -33 176
2353 176 80 18 16 -237 175 -118 369 -105 193 -32 -254 256 -50 -285 217 -45 133 195 -105 137 139 -62
2375 -62 -190 -134 -177 -46 108 192 78 80 -10 8 5 -104 335 -93 -22 -111 -92 259 85 -195 207 -144 -13 193
2399 193 76 160 59 -64 225 228 -194 196 77 -166 -315 -259 147 32 27 -131 8 -178 106 -163 -55 -115
2421 -115 -25 -5 152 77 28 351 -10 -53 172 75 212 124 20 -87 -109 5 -103 -76 -298 -35 -200 -334 189
2444 189 170 -184 -100 -20 -165 -42 137 -73 167 30 13 -33 -249 -72 -171 -142 103 -182 37 183 -163 -6
$$ packed form
2282hJ61m9lj19R9J17n0J30j44j95K2J8n5J49l96K91K7r9J05K22m08r6L54k01
2306a28K32p9J29k32J43j74J41M0k62K14p2Pp8J75mk40K26p8j7J55k22J20j4j78
2330a96K98k44J70P1q3J62j6m70N26j01k1j18P3n9J00k56K48l1j38L9J43j30K09
2353A76r6o2kk53M12k93M87m74K98k25k22N10l06k35N02k62J78O2l00K42Kk01
2375f2j28N6m3J31J54Q4j14Kr0J8lj09M39m28P1q9J9L51j74k80M02l51J31K06
2399A93j17Q4j01j23K89Lm22L90j19k43j49N6M06j15nj58J39j86K84k69J08o0
2421a15R0K0J57p5m9L23l61m3K25r7J37q8j04j07k2J14j08K7k22K63j65j34N23
2444A89j9l54Q4Q0j45J23J79k10K40j37j7m6k16J77r9K9K45k85K19J46l46J57
$$ plain form
2466 -6 -97 344 -184 40 51 -260 165 151 -101 -31 -17 -445 87 366 -95 -350 -177 62 29 216 -78 -193 -11
2489 -11 -200 354 240 -219 -57 -63 101 -120 -4 -142 -278 -275 71 64 -107 -86 -58 181 77 -12 97 -48 21 170
2513 170 140 -57 195 -200 -89 333 -95 -197 -216 112 -66 -41 -311 -4 128 -14 59 -48 -4 -99 167 79
2535 79 -177 227 64 12 -165 -30 -303 -175 422 -156 -328 -24 -92 -86 55 -36 -306 182 370 53 -118 -119 471
2558 471 -312 -255 39 183 180 -132 -54 -48 -100 -30 -24 14 -99 244 77 178 186 -53 11 -188 49 386 206 -184 -29
2583 -29 45 129 35 -27 -57 119 4 68 -7 -110 49 55 -106 43 -59 -12 -69 -181 23 196 -141 -120 16 -35 57
2608 57 -85 -100 -430 -251 -280 4 -392 -202 -231 -53 94 31 -85 18 5 -94 9 211 278 -158 29 69 -152
2631 -152 182 -164 58 -40 14 93 133 -293 28 168 -52 -32 -243 121 115 23 5 151 234 168 49 -36 37 -94
$$ packed form
2466fr1M41n28K24J1l11M25j4k52P0J4m28N32K79m61k55J73K39l3J87k94j15J82
2489a1j89N54j14m59J62oJ64k21J16j38j36LL46pj71K1K8K39j04q9J09j45O9J49
2513A70l0j97K52l95J11M22m28j02j9L28j78K5k70L07J32j42P3j07M4r5K66q8
2535G9k56M04j63n2j77J35k73J28N97n78j72L04o8OJ41r1k70M88J88l17j71jN90
2558D71p83N7K94J44ll12P8On2P0OL8j13L43j67J01Qk39O4j99K37L37j80l90J55
2583b9P4Q4r4o2l0J76j15O4p5j03J59Oj61J49j02M7n7j12K04J73l37K1J36n1R2
2608E7j42j5l30J79k9K84l96J90k9J78J47o3j16J03j3r9J03K02O7m36J87M0k21
2631a52L34l46K22r8N4P9M0m26L21J40k20K0k11L64or2j8J46Q3o6j19q5P3j31
$$ plain form
2655 -94 185 -132 -6 -99 113 -17 9 -89 58 -155 -125 183 -250 -97 -35 -83 -253 -153 -107 80 -106 -254 -118
2678 -118 -71 155 28 -69 -72 81 116 94 104 79 116 11 -52 113 -137 -5 99 153 451 -289 -55 84 -72 -102
2702 -102 185 102 37 77 -175 -106 132 -39 32 80 -160 -85 -69 -131 -62 130 -145 77 197 -147 -188 88 -91 -80
2726 -80 -261 39 -315 214 147 48 -10 -64 70 -93 98 -130 -54 -67 -52 302 -53 71 -132 59 -16 -256 -12
2749 -12 -350 67 -11 43 93 -214 7 -144 16 -255 -12 50 74 -100 -291 158 -198 -243 -263 27 105 -59 -159
2772 -159 -214 143 -52 -129 39 121 383 -180 199 -223 -111 109 75 -112 46 -200 90 165 133 98 14 -77 -415
2795 -415 188 20 178 40 -297 130 -215 166 44 43 58 6 186 30 -9 -6 -250 -135 80 37 -138 -44 29
2818 29 14 -30 -117 112 -94 -27 241 -22 97 -113 -85 -176 118 -31 -104 71 -57 -32 -94 -196 -330 -252 -285 -223
$$ packed form
2655i4K79l17J26r3K12j30K6r8J47k13L0L08m33J53O2m8j70J00M6J87j86j48J36
2678a18M7K26j27r7lJ53L5k2J0k5L7j05o3J65k50J32J04N4K98p40K34J39j56l0
2702a02K87q3o5M0k52O9K38j71P1M8k40P5J6o2O9J92k75K22J20l44m1K76j79J1
2726h0j81L00l54N29o7r9n8n4J34j63J91k28P6j3J5L54l55J24k03J91p5k40K44
2749a2l38M17p8N4N0l07K21j51J60k71K43O2K4j74j91M49l56m5k0K90P8j64j00
2772a59n5L57j95p7J68Q2K62n63L79m22J12K20l4j87J58k46K90P5l2l5q4r1l38
2795d15O03j68J58j38l37M27l45L81j22jJ5n2J80j56l9Lk44J15K15m3j75R4P3
2818B9j5m4q7K29k06O7K68k63J19k10K8r1K94j49p3J75j28K5o2j02j34P8l3O2
$$ plain form
2842 -223 98 -231 -190 68 57 126 101 -2 48 -158 -182 -4 -11 -77 203 16 -120 -7 148 -212 -107 4 50
2865 50 289 139 -45 19 37 31 -2 -92 51 265 -48 28 -119 181 -103 31 44 -35 -102 2 -194 258 28 -190
2889 -190 -18 54 -44 -92 32 4 -80 -170 -1 -22 315 138 44 -27 80 80 -151 -51 174 111 14 166 -207 -45
2913 -45 131 -10 101 84 168 -81 -9 266 -96 129 -256 -177 75 53 -303 27 -40 -159 -213 -71 192 184 333
2936 333 219 76 -290 -105 -18 184 -281 70 -101 72 -95 -153 325 174 -33 -59 243 44 -218 25 20 251
2958 251 -14 122 147 -117 319 -86 -51 5 -129 92 -313 285 139 -164 -156 -263 217 -69 -53 71 59 -174
2980 -174 81 -306 -76 212 3 -20 68 136 -145 375 -44 65 -362 45 -16 259 -255 38 12 -268 92 160
3002 160 -91 -121 -32 147 3 -74 195 -117 27 49 -72 -35 -97 -138 130 8 71 52 172 -84 -109 -99 40 -221
$$ packed form
2842b23L21l29M1K58j1O9k5j03N0k06k4J78po6K80j87j36J13J55l60J05J11M6
2865E0K39j50j84O4J8ol3r0J43K14l13P6j47L00k84J34J3p9o7J04j96M52k30k18
2889a90J72P2r8m8J24k8q4r0J69k1L37j77r4p1J07%k31J00K25o3r7J52l73J62
2913d5J76j41J11j7Q4k49P2K75l62K25l85P9K52k2l56L30o7j19n4J42K63qJ49
2936C33j14j43l66J85Q7K02m65L51j71J73j67n8M78j51k07k6L02j99k62K43nK31
2958B51k65J36K5k64M36m05L5N6j34K21m05N98j46l03Qj07M80k86J6J24j2k33
2980a74K55l87K30K88k09k3Q8O8k81N20m19J09m27M07o1K75n14K93k6k80L60O8
3002A60k51l0Q9J79j44p7K69l12J44K2j21L7o2m1K68j22O3j9J20k56k5J0J39k61
$$ plain form
3026 -221 42 -4 25 50 31 -190 -11 15 -66 164 -56 152 103 -15 -28 83 95 128 -299 66 12 130 -150 71
3050 71 196 17 -104 -100 60 -114 -22 202 -132 -143 -81 -102 110 135 -110 -102 209 438 -171 -135 -5 131 1 74
3074 74 -142 -62 162 4 -89 10 -160 -7 107 87 -204 -73 45 39 100 179 255 16 -267 30 331 82 -116
3097 -116 -69 -165 167 76 99 171 -93 -38 -3 -223 36 40 -32 270 -68 -156 -94 -44 -87 52 -54 -18 -91 -215 1
3122 1 -93 -57 43 281 -313 -280 -209 215 61 253 -83 -63 -171 188 -40 185 164 -36 -29 -240 41 -138 15
3145 15 -281 -48 -229 -167 -40 158 179 105 -152 -187 138 61 3 110 -40 27 88 13 12 26 -74 167 -63 -3 -193
3170 -193 78 149 246 -229 -154 152 24 160 286 75 122 -90 248 98 137 237 153 96 -40 117 -252 205
3192 205 -45 158 113 -158 -286 205 281 -155 234 78 -57 -151 79 -122 237 -93 127 235 171 74 -2 94
$$ packed form
3026b21K63m6K9K5j9k21J79K6q1K30k20K08m9j18j3J11J2L3m27L65n4J18k80K21
3050G1J25j79j21MJ60j74R2K24l34j1O2k1K12K5k45QL11K29o09L6J30J36j30P3
3074G4k16Q0K24j58r3R9j70J53J14k0k91J31J18oO1P9P6k39k83K97L01k49j98
3097a16M7r6L32r1K3P2k64N5L5k20K59Mp2L02l38q8O2N0m3J39j06L6p3j24K16
3122Ar4L6J00K38n94L3P1M24j54J92l36K0j08L59k28K25k1k00Pk11K81j79J53
3145A5k96K33j81O2J27J98K1p4k57l5L25p7n8J07j50O7O1p5jJ4j00K41k30O0j90
3170a93K71P1R7m75P5L06j28J36J26k11M7k12L38j50L9J00q4n7j36J57l69M57
3192B05k50K03m5k71j28M91P6m36L89j56j35r4K30k01L59l30K20J08o4r7p6R6
$$ plain form
3214 94 95 201 18 -208 -11 -36 -164 -45 24 262 52 -46 -237 22 53 117 -71 -3 -48 99 151 -96 -56 -51 31
3239 31 -99 36 -35 214 -172 73 142 1 -20 7 16 192 33 81 13 -32 -28 -49 -7 -39 71 -118 -140 -40 -238
3264 -238 263 195 -90 158 40 -93 -31 128 -178 57 73 141 -88 44 151 -73 58 -208 29 -260 125
3285 125 168 -17 122 -341 -111 369 57 11 -14 -36 -19 -107 -37 -140 -90 -106 -216 -92 151 160 113 -6 -168 -64
3309 -64 -163 -27 -103 8 -62 195 226 -168 66 2 191 167 -134 -110 -113 -177 217 14 -44 -9 -226 -23 162 156 -44
3334 -44 6 28 271 40 204 104 119 -162 44 -137 125 162 71 -285 -32 -158 132 166 -83 -168 -110 196 -73
3357 -73 199 -156 -3 -53 157 -57 7 -247 126 179 291 -102 200 -55 140 -170 111 275 -128 -37 143 -69
3379 -69 -123 -135 -92 204 58 -243 111 133 -240 44 -147 -265 -238 -253 -46 -85 -164 90 252 158 15 64 -126 350
$$ packed form
3214I4JJ06j83k26J97k5j28J19O9K38k10r8j91K59L1O4j88O8m5J47N2k47M0NQ2
3239C1j30J35p1K49l86K45O9j41k1K7RJ76j59M8o8m5Mk1M2l2J10j89k2J00j98
3264b38N01o8k85K48j18j33O2J59l06K35J6O8k29J32J07k24J31k66K37k89L85
3285A25M3j85J39m63K30M80l12m6k5k2J7q8P0j03N0j6j10J24K43Rm7j19j62J04
3309f4r9J36p6J11p0K57L1l94K34o4J89k4l01K4lo4L94k03n8L5k17K03J85ok00
3334d4N0K2K43k31J64j00J5k81K06j81K62L7r1l56K53j26K90L4k49q5N8L06k69
3357g3K72l55J53n0K10k14O4k54L73N3J12l93L02k55J95l10K81J64m03R1J80k12
3379f9n4j2M3K96j46l01L54K2l73K84j91j18K7j5K07l9p9K54J62r4j43M9j90M76
$$ plain form
3403 350 -178 -78 3 217 -177 252 -30 -8 209 85 285 22 136 -348 216 50 285 -21 64 -189 -246
3424 -246 45 261 -245 246 -295 69 -124 111 268 307 90 -97 34 -5 158 -29 183 -186 -39 -151 -182
3445 -182 -210 13 12 -166 68 3 111 256 -334 -162 -104 -340 -141 -30 -40 -30 -57 -164 -8 -43 -194 118 -51
3468 -51 301 -429 30 -73 11 143 10 6 148 -28 -138 -8 -139 229 -239 24 -63 -6 2 147 -56 184 -53
3491 -53 279 64 -151 -38 355 -23 54 96 -37 16 95 9 -4 -47 -35 -47 134 169 -113 150 71 -189 110 -260
3515 -260 66 275 -147 220 -129 -212 204 -90 64 -91 -264 188 34 -2 -129 138 -204 6 26 153 -66
3536 -66 45 -33 82 -74 -25 93 49 -53 -111 232 -59 160 328 150 -289 -146 4 -172 43 -118 -61 -175
3558 -175 -94 59 223 63 -210 -73 -33 -73 -13 -153 -264 334 68 204 -42 -37 -84 191 -141 234 154 -63 284
$$ packed form
3403C50n28J00Q1K14l94M29k82K2K17j24K00k63J14m84N64j66K35l06Q5k53n7
3424b46K91K16n06M91n41L64j93K35J57L9k17j87J31l9J63j87K12l69J47j12l1
3445a82k8K23jj78K34o5J08J45n90J72N8k36J99J11j0J0k7j07J56l5j51L12j69
3468e1L52p30M59j03Q4J32j33mJ42j76j10J30j31L68m68K63q7N7QJ45k03K40k37
3491e3L32k15k15J13L93l78P7M2j33N3P9q6j3m3J2j2J81L5k82K63p9k60K99l70
3515b60L26K09m22L67l49q3M16k94J54j55j73M52j54l6j27K67l42K10K0J27k19
3536f6J11p8J15j56M9J18m4j02n8L43k91K19J68j78m39J43J50j76K15j61N7j14
3558a75Q1J53J64j60k73J37M0m0O0j40j11N98k66J36k46Nm7K75l32L75q0k17L47
$$ plain form
3581 284 360 3 -87 -150 58 46 59 -142 -20 68 31 94 67 39 -37 -293 128 -325 -171 -259 142 33 134 -38
3605 -38 -6 105 -195 76 -238 -208 47 56 -52 152 -113 -200 -64 -110 -51 -91 -228 5 94 -49 295 -52 101
3628 101 115 -121 -138 -222 -72 -238 268 -38 332 -95 -76 14 58 134 -22 -105 -69 8 322 -307 -208 23 72 -143
3652 -143 24 86 -5 -80 74 -2 -197 -77 -185 91 22 -216 72 216 270 -32 -107 -53 -132 -359 115 -255 -412
3675 -412 139 -26 -98 -142 104 75 -126 91 318 83 -113 -52 -64 -53 -64 -144 147 -72 -55 -6 85 -122 184 -94
3699 -94 16 -48 295 125 -83 -122 86 -40 -226 -58 -5 141 -127 172 -122 -2 124 15 254 124 258
3720 258 78 -42 11 -123 52 -119 -15 -216 23 106 124 80 4 30 -327 102 80 -43 -290 -86 -208 -118 146
3743 146 -68 28 -47 -58 184 58 -59 156 -172 -206 154 42 -72 -45 -129 -188 2 -72 -70 216 147 -123 246 1
$$ packed form
3581B84P6l57r0o3K08j2J3k01J22Q8l7O3k7k8p6k56M21m53J54q8M01j09J01j72
3605c8L2J11l00K71l14L0K55Rj08K04k65q7J36m6N9m0j37K33Q9j43L44l47J53
3628A01J4k36j7q4J50j66N06l06L70m27J9R0M4P6j56q3L6P7L14o29R9K31M9k15
3652a43J67O2r1p5J54p6j95J20j08K76o9k38K88J44N4l02p5N4p9k27M74l70j57
3675d12N51j65p2m4K46k9k01K17K27k35j96O1j2J1j1q0K91k19J7M9R1k07L06k78
3699i4J10o4L43j70k08l9K08j26j86J68N3J46k68K99k94J20J26j09K39j30J34
3720B58j80j20N3j34J75j71J04k01K39Q3J8m4p6K6l57M29k2j23k47K04j22R0K64
3743A46k14R6p5j1K42j26j17K15l28l4L60j12j14K7q4n9J90p4KK86o9k70L69k45
$$ plain form
3767 1 -7 -129 -178 38 -300 -91 -57 31 -26 142 293 -105 -34 76 -68 176 190 201 349 -213 -55 -147 4 -257
3791 -257 -188 61 -46 -199 200 24 199 -149 -116 -116 14 -149 -127 99 -57 180 25 12 -108 176 22 -204
3813 -204 207 -237 -84 73 -150 -237 -82 158 8 -143 -40 -167 -234 99 218 70 -48 -12 -116 -51 -14 -102
3835 -102 -99 39 70 -376 -144 -6 -23 -60 -190 -391 -81 177 96 -168 -104 -158 77 -13 43 -107 -45 161 97 -29
3859 -29 -50 268 39 78 243 193 195 -160 9 -63 154 281 -65 25 -32 118 -101 62 -252 -241 -450 324 -126
3882 -126 110 -152 1 -37 158 -69 -65 216 90 -10 80 203 262 -114 -297 25 -171 -81 63 99 181 42 127
3905 127 311 -78 22 -135 4 -259 188 -303 -124 -22 54 -86 -118 16 187 -280 -259 -183 65 7 -48 166
3927 166 5 173 -56 -151 67 16 177 47 -172 197 249 226 -143 -181 222 -45 -29 7 -223 -59 356 33
$$ packed form
3767Aqj22m9K16l38K09L4Q8n7J68J51l98P1J10j44K44J4J1J48n62J58r2J51k61
3791b57O9K49j07j53L99j76J75l48L3%J30j63K2K26j56K37j55j3j20K84j54k26
3813b04M11m44J53J57k23q7J55K40j50j51J03j27o7L33J19j48j18L6j04O5L7q8
3835a02LJ38L1m46K32J38j7l7j30k01L10K58q1k64O4n4K35r0N6j50O2K06o4j26
3859b9k1L18k29L9J65n0Kl55J69p2K17J27l46R0n7J50k19J63l14J1k09P74m50
3882a26K36k62J53l8J95k27MK81j26j00R0J23N9l76j83L22j96R0J44L6Q2j39Q5
3905A27J84l89J00j57J39k63M47m91J79J02P6j40l2J34J71m67K1P6K48n8n5K14
3927A66j61J68k29r5K18n1J61j30k19L69N2k3l69l8M03k67J6L6k30J64M15l23
$$ plain form
3949 33 96 -16 -179 180 0 -235 -121 55 -32 17 -241 -201 -12 274 95 -67 12 -190 -33 26 60 -141 -64
3972 -64 -152 65 93 -158 -97 135 -243 123 176 -94 1 21 120 59 -13 49 118 28 -175 151 -102 43 -42 100 -16
3997 -16 210 19 209 188 -113 -37 -96 52 317 -40 88 -129 -311 14 -5 238 -18 -157 -137 -63 73 96 -129
4020 -129 199 -14 163 -158 -146 95 117 -126 -17 -297 100 193 -131 182 -113 -242 176 -45 -25 113 -106
4041 -106 -203 8 -61 -185 -124 -33 -111 -56 -125 -120 158 -187 102 -113 -208 89 37 -1 -127 173 -6 -28 101 -19
4065 -19 -37 25 -108 148 34 -140 -100 -71 -162 -279 26 40 60 -412 -31 -13 -33 -50 -62 347 92 100 -48 -226 15
4090 15 226 50 120 -72 -23 -213 -200 140 41 -76 88 -51 -27 292 65 34 9 131 -48 -61 -9 130 60 128
4114 128 -25 -6 -94 -115 -21 -290 28 246 -148 -116 156 99 210 -113 -104 94 175 7 -71 156 58 -210 83 59
$$ packed form
3949C3O3j12j63L59j80k35J14J76q7M9k58M0J89K86j79j62P9k02J57N9L4k01P7
3972f4q8K17K8k51O1K32l78L66N3k70R5K0R9o1p2O2O9r0k03L26k53J45q5J42j16
3997a6K26j91J90k1l01P6n9J48K65l57J28k17j82L25j9K43k56j39K0P4J36K3k25
4020a29L28k13J77l21J2K41K2k43J09k80L97R3l24L13k95j29M18k21K0J38k19
4041a06r7K11o9j24O1R1p8N5o9NK78l45K89k15r5K97n2l8j26L00j79k2J29j20
4065a9j8O2j33K56j14j74M0K9r1j17L05J4K0m72L81J8k0j7j2M09k55Qj48j78K41
4090A5K11j76P0j92M9j90J3L40r9j17J64j39K4L19k27l1k5J22j79j3N2J39p0O8
4114A28j53J9q8k1R4k69L18K18l94L2K72n7J11l23RJ98Q1j68p8K27r8k68K93k4
$$ plain form
4138 59 -60 52 14 -148 -98 125 -252 91 -210 -158 -19 -84 91 -79 -99 78 -45 127 217 25 -36 -20 54
4161 54 20 -47 -14 -108 -82 -153 -185 -239 30 58 176 134 138 -13 -5 298 -338 -47 -96 -68 68 -124 269 115 26 4
4187 4 -111 79 27 161 63 46 16 -198 -195 -326 -142 -78 17 268 -55 -22 -2 154 -273 124 -82 -85 70 251 155
4212 155 13 28 86 18 -125 86 0 -388 297 -38 -112 149 -14 -72 234 -168 -34 153 66 168 -148 -113 -74
4235 -74 135 21 71 32 16 -73 81 -158 99 227 171 98 -216 -84 93 -64 -130 226 34 5 -164 84 17
4258 17 -278 83 -43 65 28 118 3 -82 45 12 196 138 142 131 348 -113 261 31 167 3 -133 -164 99
4281 99 -269 118 233 133 157 41 -50 158 -97 96 48 -128 -35 92 6 2 44 -31 246 85 -93 40 230
4304 230 -12 -249 85 -133 97 -26 -77 -114 -121 -80 57 -606 270 54 55 74 74 154 49 84 77 193 -84 -82 90
$$ packed form
4138E9j19J12l8j62N0K23l77L43l01N2J39o5J75j70k0J77j23J72R0j92o1J6P4
4161E4l4o7L3r4K6p1l2n4K69K8J18m2Mj51QL03o36K91m9K8J36j92L93j54q9k2
4187Dj15J90n2J34r8j7l0k14Lj31J84O4R5K51l23L3K0J56m27L97k06lJ55J81r6
4212A55j42J5N8o8j43K11q6l88O85l35p4K61j63n8L06m02J34J87q7J02l16L5L9
4235g4K09j14N0l9j6q9J54k39K57J28n6p3l14J32J77j57o6L56j92k9j69K48o7
4258A7k95L61j26J08l7R0j15q5J27l3J84n8Mj1K17m61L74k30J36j64j36l1K63
4281I9l68L87J15j00K4j16r1K08k55J93m8j76R3J27q6mM2p5K77j61j78J33J90
4304B30k42k37L34k18K30j23n1l7pM1J37o63Q76k16JJ9%Q0j05L5pJ16k77KJ72
$$ plain form
4329 90 14 172 -148 147 50 57 199 -182 -126 142 -205 54 -4 232 164 29 8 226 -16 -130 -404 119 361
4352 361 154 -60 -10 28 87 -118 280 40 185 156 63 186 93 -61 52 244 3 121 -166 114 213 -113
4374 -113 -374 68 -24 -119 -13 -152 57 44 185 -186 -31 -148 72 -73 -207 -37 -105 52 -21 99 9 -49
4396 -49 -87 148 129 34 5 -77 96 99 -233 -186 -288 -134 -29 -5 65 98 -303 176 21 -47 98 -66 -85 -135 -170
4421 -170 25 -66 208 -107 -32 76 344 196 -83 -317 237 103 -34 266 -7 -57 30 -16 43 -132 -514 100
4443 100 189 188 -60 117 -97 -278 -11 -22 28 -21 179 246 15 2 338 -82 54 -71 -74 6 35 -296 171 -7
4467 -7 214 92 110 -72 -219 -7 162 81 83 -205 -99 102 118 132 -178 213 -118 62 366 -64 -167 -373 -66
4490 -66 95 -119 277 309 -191 78 229 56 -148 -261 -189 83 209 296 -31 74 -265 -241 149 191 199 89 152
$$ packed form
4329I0p6J58l20K95r7PJ42l81N6K68l47K59n8K36o8j35k1K18k42j14k74N23K42
4352C61k07k14N0L8N9k05L98k40J45k9r3J23r3j54J13J92k41J18k87K80R9l26
4374a13k61M42r2r5J06j39K09j3J41l71J55j17K20j45j34J70o8J57p3J20r0n8
4396d9l8K35j9r5k9q2J73Ll32M7j02J54J05K4P0L3m01M79j55o8J45j64j9n0l5
4421a70J95r1K74l15P5J08K68j48k79k34N54j34j37L00k73n0Q7m6N9j75l82O14
4443A00Q9jk48J77k14j81K67j1N0m9K00O7k31j3L36m20J36j25lQ0K9l31M67j78
4467gK21j22J8j82j47K12J69q1Kk88J06K01J6J4l10L91l31J80L04m30j03k06L07
4490f6J61k14L96L2n00K69J51j73k04j13P2K72J26Q7l27J05l39K4L90M2Qj10O3
$$ plain form
4513 152 236 -10 -103 -10 -210 -175 -136 -27 -106 -99 -235 155 132 114 96 -144 146 -77 -124 -70 297 -62 -223 113
4537 113 -282 3 99 197 15 9 66 -65 -27 47 38 59 81 113 101 15 -50 -123 -86 -119 100 -20 249 56 -30 -225
4563 -225 -70 10 -13 -140 221 126 276 -47 -157 29 71 46 111 -65 33 301 -140 60 206 174 96 -141 -244
4586 -244 154 167 -178 145 198 -48 158 6 45 8 224 155 19 -121 216 108 210 109 172 100 138 -249 -150
4609 -150 13 173 -106 -295 80 -43 252 28 8 -254 126 291 -11 -32 -77 -78 96 324 165 -36 -84 -287
4631 -287 339 141 74 -17 -300 205 187 12 -170 -26 -74 94 -24 -8 22 -167 134 -170 -196 -43 -154 47
4653 47 -198 -113 133 28 -27 61 116 136 -139 -123 -121 -231 -11 -260 33 -2 102 255 -173 340 -100 -148 -34 216
4677 216 95 223 -221 -157 6 -286 8 51 345 105 -173 231 95 135 51 75 -65 167 132 -155 -71 285
$$ packed form
4513A52Q4k46r3R3k00L5L9J09p9Pj36L90k3j8j8k40K90k23m7N4L67l59j61L36
4537A13l95K85R6R8j82oN7j31L8P4rK1K2L2j2q6o5p3L7l3K19j20K69j93q6j95
4563b25J55Q0k3j27L61r5J50l23j10J86M2k5O5j76R8K68m41K00J46l2p8k37j03
4586b44L98J3l45L23N3k46K06j52L9l7K16o9j36j40L37j08J02j01O3p2L8l87R9
4609a50J63J60k79j89L75j23K95k24k0k62L80J65l02k1m5jJ74K28j59k01m8k03
4631b87O26j98o7r1k83N05j8j75j82J44m8J68j18J6L0j89L01l04k6J53j11K01
4653D7k45Q5K46j05n5Q8N5K0k75J6Kj10K20k49K93l5J04J53m28N13m40m8J14K50
4677B16j21J28m44O4J63k92K94M3K94k40k78M04j36M0q4K4j40K32l5k87Q4L56
$$ plain form
4699 285 -94 -137 257 153 -151 -256 -209 -135 -120 30 -346 38 22 -10 -177 -15 -292 -7 -45 -24 -65 -44 -71 -115
4723 -115 92 -60 -44 40 85 137 -114 -41 -121 -103 385 -135 -50 -76 108 -73 -28 175 -236 105 -151 276 59
4746 59 -125 -133 -398 119 71 39 -3 27 184 92 217 -257 -90 -228 3 164 189 21 31 -88 -95 -74 -71 -147 -54 25
4772 25 89 -2 87 273 150 250 -27 -87 -231 -179 151 -112 -47 110 -293 376 -287 -187 -83 -87 -7 219 90
4795 90 -80 -53 87 233 -5 19 257 101 19 159 -161 -65 -50 -75 151 -367 44 153 -70 213 78 21 -59
4818 -59 -202 -140 41 66 133 -201 106 339 -41 -112 204 -32 -113 -98 17 22 -53 -120 -357 -37 312 101 -213 140
4842 140 105 51 42 98 -26 213 152 134 -110 -37 -91 77 -170 108 140 -208 90 309 398 47 -19 172 -24 -121
4866 -121 140 64 -187 -164 52 172 -9 55 23 -266 348 81 -65 124 -167 -130 9 -7 -15 -79 -183 -57 180
$$ packed form
4699B85l79m3L94j04l04j05M7P4J5J50l76L84j6l2j67J62k77K85l8K1m1K1k7m4
4723a15K07j52J6Q4M5N2k51P3q0J8M88n20Q5k6J84j81M5K03m11L41k56M27k17
4746E9j84qk65N17m8l2m2L0J57r2J25m74J67j38K31J61K5j68J0j19pK1Lp6R3P9
4772B5O4r1Q9J86j23J00k77o0j44N2L30k63O5J57m03O69o63J00J04mQ0K26j29
4795I0j70K7J40J46k38K4K38j56q2J40l20R6J5k5K26n18M11J09k23K83j35n7q0
4818e9j43O2J81K5O7l34L07K33l80p1L16k36q1J5J15Np5o7k37L20L49k11l14L53
4842A40l5n4rN6j24K39o1j8k44P3n4J68k47K78L2l48K98K19Q9l51o6J91j96r7
4866a21K61p6k51K3K16J20j81O4l2k89O14k67j46J89k91L7J39j6qo4j04J26K37
$$ plain form
4889 180 -28 -94 -183 136 -247 -206 200 -50 -36 -61 111 161 -49 73 169 -69 80 158 -21 -79 69 78 223 -131
4913 -131 121 168 -53 62 -55 -86 -112 -316 -34 64 -150 95 272 -173 -181 -188 143 -105 56 215 20 212 -16
4936 -16 -10 332 26 -63 -10 45 -194 10 -86 140 59 -266 -174 245 -240 103 -67 83 83 119 227 -93 119 79
4960 79 205 60 36 -49 -105 -61 -84 29 235 207 -38 -168 22 114 82 -93 154 -21 -55 37 153 -117 16 -30
4984 -30 -173 74 53 224 70 -149 -62 -88 392 -25 -18 -224 -98 18 -179 9 -59 80 144 -66 -153 -93 -277
5007 -277 -155 -226 -3 -122 -126 4 -95 -20 -39 84 23 -116 -54 45 -174 170 38 117 56 110 -243 91 6 -41 -210
5032 -210 -12 -197 -140 21 -16 -183 18 -381 -72 -208 -231 65 16 224 39 195 -53 -69 -11 29 -323 161
5054 161 -68 108 -10 401 -124 132 343 387 40 -96 -178 -68 33 -200 266 256 -142 -74 66 76 -420 -38
$$ packed form
4889A80k08o6q9L19l83M1M06k50J4k5J72N0k10J22R6k38J49P8j79n8J48RJ45l54
4913a31K52M7k21J15j17l1k6k04K82R8k14K45J77m45qpL31k48J61J59j95J92k28
4936a6OL42l06q9N3N5k39K04r6K26q1l25R2M19m85L43j70J50%L6J08l20K12m0
4960G9J26j45k4q5n6M4k3J13K06k8k45j30J90R2l2j75K47j75l4R2J16k70J33m6
4984c0j43K47k1J71j54k19Q7k6M80m17Pk06J26J16j97J88o8J39O4k10q7O0j84
5007b77J22p1K23j19mJ30r9P5j9J23o1j39O2R9k19L44j32P9o1N4l53L34q5m7j69
5032b10J98j85N7J61l7j67K01l99L09j36k3K96m9K08j85J56k48j6N8M0l52M84
5054A61k29J76j18M11n25K56K11M4l47j36q2J10J01k33M66j0l98O8J40J0m96L82
$$ plain form
5076 -38 25 -177 30 153 25 82 190 109 91 -74 234 82 -238 41 -27 -255 -33 147 96 -22 -64 -6 241
5099 241 53 97 78 46 44 -92 165 -163 51 270 -157 -105 42 -15 72 -137 249 24 -46 207 178 -173 73
5122 73 130 -175 159 -176 72 -262 -50 -137 -243 -83 12 23 -3 166 -12 -31 108 204 209 97 226 226 -45 84
5146 84 -24 -141 -94 -98 -131 -219 30 -142 205 160 167 60 -14 236 -335 194 85 -17 170 -253 -16 -130 -25
5169 -25 107 74 141 -187 246 -211 -128 145 -133 380 91 -384 213 -16 -131 37 35 28 -99 170 71 -243 152
5192 152 -44 -78 -47 38 -45 31 108 234 -279 -121 113 37 -238 135 -295 -83 -55 76 250 9 148 -132 17
5215 17 83 255 -141 -8 37 93 -84 188 48 187 -211 -96 289 98 118 -60 20 -5 10 -108 19 -20 215
5238 215 99 -137 19 168 -112 -96 -203 16 134 273 0 -325 66 -47 14 77 38 241 -67 -153 -103 -13
$$ packed form
5076c8O3k02K07J23j28N7J08q1j8j65L08j52l20K79o8k28K22J80n1j18m2N8K47
5099B41j88M4j9l2kj36K57l28K14K19m27N2J47n7Q7k09L86k25p0K53k9l51K46
5122G3N7l05L34l35K48l34K12q7j06J60R5J1k6J69j78j9J39R6Nj12J29%k71J29
5146H4j08j17M7ml3q8K49j72L47m5Pj07p4K50n71N29j09j02J87m23K37j14J05
5169b5J32l3O7l28M33m57Q3K73k78N13k89m75N97k29j15J68kpj27K69r9l14L95
5192A52j96l4L1Q5q3P6P7J26n13J58K34p6k75L73m30K12K8J31J74k41J39k80J49
5215A7O6J72l96J33M5N6j77K72j40J39l98J15L85j91K0j78Q0k5J5j18J27l9K35
5238B15j16k36J56J49k80J6j07K19J18J39k73l25L91j13O1O3l9K03l08q6N0R0
$$ plain form
5260 -13 -82 151 -161 192 -67 206 254 -40 130 0 -267 -75 -256 139 -25 -12 108 137 133 178 -20 -26 2 248
5284 248 178 -225 -173 110 173 -18 -180 138 374 143 213 129 75 -5 117 -175 85 -21 183 -53 -189 16
5306 16 131 -196 116 -137 -2 108 -48 -2 352 -32 -232 55 -240 155 235 64 -152 -206 -2 -89 104 -33
5328 -33 12 -2 -167 124 243 -110 -49 6 -168 -273 -50 -163 -71 -90 -170 257 82 130 57 456 132 205 -257 -75
5352 -75 299 -131 -172 68 -104 -115 -90 -96 4 58 -136 87 -226 -128 -266 61 -262 -211 45 -148 -138 -226 -113 107
5376 107 -39 60 -57 -141 -29 129 -180 42 -59 -39 16 -72 51 173 84 266 353 -13 74 -71 -93 -189 -25
5399 -25 -48 -19 -151 4 -107 -86 115 267 31 15 42 6 -80 -131 -38 -288 184 -8 -202 -107 -19 -110 15 -144
5423 -144 -301 -16 85 -53 189 264 -217 44 64 97 304 -103 -92 -14 157 -91 -269 -3 108 123 -89 317
$$ packed form
5260a3o9K33l12L53k59K73M8k94J70j30k67J92j81L95j64J3J20K9mM5j98oK8K46
5284B48p0m03N2K83O3j91j62L18K36k31P0q4n4q0J22k92K60j06K04k36j36K05
5306A6J15l27L12k53J35J10j56M6L54l84k00K87k95L95Q0j71k16n4K04q7J93j37
5328c3M5j4j65K91J19l53O1N5j74j05K23j13R2j9q0M27j75M8p3L99l24P3m62J82
5352g5L74m30m1K40j72j1K5oJ00N4j94K23l13R8j38L27l23N1K56j93J0q8J13K20
5376A07j46R9j17q4J12J58l09K22j01K0N5q8J23J22q9J82Q7l66Q7j45k2r6J64
5399b5k3K9j32J55j11K1K01J52k36j6K7l6q6n1R3k50M72j92j94R5Q8r1J25j59
5423a44j57K85J01j38K42P5m81K61K0L3K07m07J1P8J71k48j78K66J11J5k12M06
$$ plain form
5445 317 -111 -122 -101 202 119 -125 163 13 123 47 -162 60 20 -127 99 81 10 -47 124 12 -8 -76 95
5468 95 -115 -8 -287 188 142 83 -146 373 -101 208 -133 -136 -27 177 -127 18 391 -350 147 -181 -171 107
5490 107 -134 359 8 -219 48 113 -16 -66 -14 -221 -100 -166 -133 -74 -294 -145 81 -14 21 240 -11 -137 -96
5513 -96 -6 115 30 -43 -126 -80 -33 13 30 74 -101 -21 93 -148 -120 157 -176 -184 180 -143 23 -218 90 131 -39
5538 -39 -187 183 127 -152 25 196 123 241 -31 68 27 63 -22 154 171 -29 122 322 -60 -14 -13 20 -111 -195
5562 -195 -57 -141 175 25 6 -152 -110 118 -90 47 -193 -77 114 -226 47 141 23 103 95 71 -40 358 -188
5585 -188 217 59 -104 36 -30 207 -8 -21 -96 -80 93 191 59 -97 76 -85 61 244 -5 -140 -269 -18
5607 -18 -130 172 200 235 -60 36 79 87 50 64 23 -129 -194 -64 48 -111 31 -211 -268 -23 70 -216 -260 -202 27
$$ packed form
5445C17m28j1K1L03q3k44K88j50J10p6k09K22m0j47K26j8p1n7J71j12k0o8J71
5468I5k10J07k79M75m6n9k29N19m74L09l41lJ09K04l04J45L73p41M97l28J0K78
5490A07k41M93l51k27K67O5j29n0N2k07J21o6L3N9k20J49K26r5L5K19k51j26M1
5513i6R0J21q5p3q3M6M7M6J7M4j75Q0J14k41K8K77l33qL64l23J66k41L08M1j70
5538c9j48L70n6k79J77J71p3J18k72R9m1L6q5J76J7k00J51K00l82M6JL3j31q4
5562a95J38q4L16j50j9j58M2K28k08J37k40J16J91l40K73R4j18Q0qk4j11L98n46
5585a88M05j58j63J40o6K37k15j3p5J6J73R8j32j56J73j61J46J83k49j35j29K51
5607a8j12L02K8L5k95R6M3Ql7J4m1j52o5J30J12j59J42k42n7K45R3k86m4N8K29
$$ plain form
5632 27 244 50 -198 11 22 133 16 -149 67 -29 -148 -174 -177 343 188 -129 -137 161 -267 9 204 179 256
5655 256 -58 -81 -107 -76 132 -271 47 -30 -218 14 43 56 -249 -32 -201 -9 -91 385 229 -98 53 -39 -92
5678 -92 58 -163 294 215 89 202 74 -59 232 323 53 -85 -190 169 -239 56 -333 29 -118 -60 -40 214
5700 214 -244 -21 32 159 263 -151 -187 29 -12 -295 -5 -199 29 42 -26 -55 2 235 -112 -14 125 28 47
5723 47 19 150 -143 -176 161 98 133 -113 -158 94 -39 -129 16 141 -142 24 211 152 141 89 27 227 -11 -124
5747 -124 -59 -59 -42 21 -217 2 -297 32 -19 -109 -205 264 105 -1 -314 161 84 99 286 1 136 191 0 16
5771 16 229 -271 125 213 -215 49 333 103 89 216 154 218 -56 -9 21 119 -84 262 35 -110 -84 -50 -187
5794 -187 60 196 128 211 7 -39 164 -166 -101 10 -115 -68 -163 -194 -184 176 -133 -73 -65 -111 125 184 -148 -109 -133
$$ packed form
5632B7K17j94k48K09J1J11j17j65K16r6j19k6lN20j55l17qK98m28K76J95k5P7
5655B56l14k3k6L1K08m03L18p7j88K32K9J3l05K17j69J92q2M76j56l27J51r2n3
5678i2J50k21M57p9j26J13j28j33K91R1k70j38j05L59m08K95l89L62j47N8K0K54
5700B14m58K23N3J27J04m14l6K16m1k83K90j94K28J3o8k9N7K33l47R8J39r7J9
5723D7k8J31k93l3L37o3L5k46m5K52j33r0J45J25k83J66J87n9j1n2o2K00k38j13
5747a24O5%J7O3k38K19k99L29n1r0r6M69j59j06l13M75p7J5J87k85J35N5j91J6
5771A6K13n00L96Q8m28K64K84k30j4J27o2O4k74M7L0R8k03L46k27j45K6L4j37
5794a87K47J36o8Q3k04m6K03l30O5J11j25M7r5l1J0L60l09O0Qm6K36N9l32L9k4
$$ plain form
5819 -133 -69 190 -21 -8 137 -5 83 -194 -24 -147 360 269 115 54 -10 121 90 180 -33 -147 176 47 181
5842 181 2 -109 87 -119 56 -43 151 256 56 -183 106 -117 -270 150 -136 -149 -352 59 96 -70 -247
5863 -247 84 126 -259 -10 198 113 181 193 -76 148 83 31 6 -157 -33 -20 87 -49 -156 -13 40 26 -114
5886 -114 55 -34 -174 -64 -161 126 43 244 -90 51 37 29 -117 2 162 111 -170 171 65 138 -209 24 248
5909 248 223 119 -156 35 -116 -79 -3 -4 -194 -71 17 -72 196 109 11 -25 -61 86 154 -328 -136 -43 -85 -247 -436
5934 -436 312 209 26 -23 -109 33 -198 -88 75 64 -46 164 -93 90 -41 -215 105 234 -70 -176 108
5955 108 -104 5 40 77 34 194 -12 45 -36 258 0 -51 -106 -111 51 33 -105 -67 32 -321 163 -125 -23 -188
5979 -188 -266 157 -148 -125 193 170 -235 227 97 -275 103 41 -121 109 -6 -17 94 146 -2 103 56 -216
$$ packed form
5819a33O4K59k11J3J45j42Q8k77J70j23N07r1j54o1o4J31l1R0k13j14L23j29J34
5842A81j79j11J96k06J75r9J94J05k00k39K89k23j53M20k86j3k03M11L7j66j77
5863b47L31M2l85K49K08q5O8J2k69K24o5n2k5j63J24J3J07j36j07J43N3j4j40
5886a14J69q9j40J10r7K87q3K01l34J41j4qj46J19J60n1k81L41j06P3l47K33K24
5909B48k5j04k75J91j51L7P6jj90J23Q8q9K68q7r8l6l6J47O8m82J92R3m2j62j89
5934d36P48j03j83m9q6J42k31J10J63j1j10K10k57J83j31j74L20J29l04j06K84
5955A08k12J09L5L7m3J60k06N7q1K94k58n1n5nJ62j8j38L8R9l53M84k88J02j65
5979a88p8M23l05K3L18k3m05M62j30l72L78o2j62K30j15j1J11N2j48J05m7k72
$$ plain form
6001 -216 38 -246 62 20 -25 31 101 40 55 -50 121 69 -95 -22 -51 76 97 73 95 -136 -146 -140 118 52 110 76
6027 76 16 90 200 154 95 154 -166 127 -115 -172 87 -240 107 241 170 -191 -79 262 156 140 10 -77 4 -4
6051 -4 -222 -137 87 171 -8 -59 45 -81 75 270 86 -4 134 31 40 -1 240 -2 69 -211 -202 -252 -135 80
6075 80 -108 98 219 -74 137 105 73 152 263 -31 66 107 -80 -189 217 192 -57 -289 -132 8 86 -219 213
6098 213 181 -35 189 -34 127 -139 35 -79 -262 -331 -36 91 -249 112 73 187 -60 -3 -47 108 48 107
6120 107 -85 176 128 32 90 74 95 -71 -114 -17 187 -12 -244 -311 164 -158 108 -53 194 132 -169 -86 -90 -60
6144 -60 72 227 106 -144 -129 73 48 -39 140 -118 -286 257 -60 -150 187 -35 207 -133 -117 -59 -100 247 -80
6167 -80 73 -97 -76 -54 158 133 -49 -5 -151 249 209 -56 -150 128 216 180 177 -49 -54 157 260 -146 -164 -185 -81
$$ packed form
6001b16K54k84L08m2m5N6P0o1J5j05J71n2j64P3k9J27K1k4K2k31j0OK58o6N8l4
6027G6o0P4J10m6n9N9l20K93k42n7K59l27L47J34p1l61J12L41j06j6j30q7Q1q
6051dk18Q5K24Q4j79n1J04j26J56J95j84r0J38j03Rm1K41k42P1k80Rn0J17K15
6075H0j88K06J21k93K11l2l2P9J11k94R7M1j87j09M06k5k49k32J57J40P8l05M32
6098B13l2k16K24k23J61k66J74j14j83o9K95J27l40L61l9J14k47N7m4J55o0N9
6120A07j92K61m8r6N8j6K1j66m3R7K04j99k32o7M75l22K66j61K47o2l01Q3mL0
6144f0J32J55j21k50J5K02k5q7J79k58j68N43l17r0L37k22K42l40J6N8m1L47l27
6167h0J53j70K1K2K12k5j82M4j46M00m0k65r4K78Q8l6lk26nK11J03m06j8k1J04
$$ plain form
6192 -81 -45 138 147 64 52 -143 83 3 -77 -182 -118 -275 38 -42 107 -73 -189 18 290 -212 103 -5 -9 149
6216 149 316 106 -61 88 -114 -65 29 -4 -72 103 9 -28 9 61 -35 94 30 135 58 212 124 105 213 14
6240 14 81 134 -184 224 56 -214 59 -44 105 -91 182 4 -159 76 11 -110 151 -1 81 -27 119 52
6262 52 -4 23 18 279 211 108 73 -31 -166 -41 -70 355 1 3 78 116 -124 136 -72 -15 251 151 206 32 98
6287 98 111 -49 100 91 4 48 -280 -113 99 61 -33 106 49 -142 -58 114 -30 -48 7 73 -319 55 -205 -221 211
6312 211 -199 -45 230 -212 188 154 149 -264 216 -113 78 74 -96 167 -84 136 -19 351 -275 174 139 43
6334 43 -254 -53 279 -17 -134 -28 17 15 -150 336 15 -51 -228 14 26 -87 -144 -44 142 -36 9 172 -55
6357 -55 -66 -78 -228 -59 -66 -207 -73 156 -18 -167 -76 -67 61 21 -216 -204 -284 28 -77 -158 80 70 42 160 112
$$ packed form
6192h1L6J83Rq3j2j95K26q0q0j05O4j57L13q0J49j80j16K07K72n02L15j08mJ58
6216A49J67k10j67J49k02M9R4l3o8J75r4l7L7N2r6J29o4J05p7J54q8j9J08j99
6240A4O7N3l18M08j68k70K73j03J49j96K73j78j63K35o5j21K61j52Q2j08J46o7
6262E2n6K7nK61o8j03l5j04j35J25k9M25l54KP5L8k40K60k08N7K66j00N5j74O6
6287I8J3j60J49rq7M4l28J67K12l8r4J39n7j91Q4J72j44j8N5O6l92L74k60j6M32
6312B11m10J54K75m42M00l4nm13M80l29J91mj70K63k51K20j55L70o26M49l5r6
6334D3k97K01L32k96j17J06M5kj65M86l21o6j77K42J2j13n7J00J86j78M5J63k27
6357e5j1j2j50J69pj41J34K29j74j49R1RJ28m0k37J2q0L12j05q1K38j0k8J18m8
$$ plain form
6382 112 -6 -89 172 67 35 -25 -141 106 24 20 -30 128 -78 35 -120 84 -16 -244 201 19 -220 -175 54
6405 54 14 -111 -111 10 275 228 68 46 -34 90 104 181 -58 122 113 54 -61 196 -126 -202 18 -97 41 155
6429 155 -75 -305 -23 240 169 94 -233 -162 -13 -83 166 226 266 -168 -70 210 -184 -58 12 -167 51 -37 62
6452 62 186 -233 1 -71 -29 -223 -184 -68 103 -63 29 -138 187 123 -18 300 36 320 -108 185 -158 -203
6474 -203 12 -81 -396 -33 -134 -92 -47 162 157 112 -436 26 119 24 -24 56 -193 0 72 268 -15 -61 -56 -215 191
6499 191 152 260 183 107 -105 -59 -46 -77 6 92 -53 72 77 -213 271 62 -127 -132 172 -91 -124 40 -3 96 -104
6524 -104 -3 -70 -11 -51 2 66 96 134 58 -140 92 -5 43 16 -86 -164 -62 -24 -156 212 -102 53 -269 -40
6548 -40 -260 106 40 34 157 150 45 56 -78 -179 17 -192 188 161 -96 -59 -26 116 256 44 -52 -11 -103 67
$$ packed form
6382A12j18q3K61j05l2o0j16K47q2mn0J58k06J13j55K04j00k28M45j82k39M5K29
6405E4m0j25%J21K65m7j60k2q0J24J4P7k39J80rn9j15K57l22p6K20j15J38J14
6429A55k30k30K82K63p1p5l27P1J49p0K49O0M0m34R8K80l94J26P0j79K18q8R9
6452F2J24m19K34p2M2j94L9J16J71j66R2j67L25o4j41L18k64K84m28K93l43m5
6474b03K15r3l15L63j01M2M5K09nm5n48M62R3r5m8Q0k49J93P2J96k83m6Nj59M06
6499A91l9J08p7p6k12M6J3l1Q3Q6j45J25Nk90M84k09j89nL04k63l3J64m3R9k00
6524a04J01o7N9m0N3O4L0L8p6j98K32r7M8k7j02p8J02L8j32L68l14J55l22K29
6548d0k20L66o6oJ23pj05J1j34j01J96k09L80k7k57L7L3J42J40k12r6M1r2J70
$$ plain form
6572 67 -77 -71 233 55 -184 -208 13 184 -37 -5 -147 -108 -112 -52 -78 161 81 98 27 148 100 -111 217 -9 -157
6597 -157 8 -62 -4 53 -26 -46 383 40 48 67 84 -133 7 -57 70 -38 117 -9 -236 94 165 -312 -59 5
6621 5 144 279 -85 147 36 -405 103 130 -26 -33 -230 -64 99 -43 79 92 -229 120 217 -77 -66 -11 -21
6644 -21 -44 -29 -35 -49 -59 -140 -47 143 132 -45 63 117 -61 -35 258 -96 -25 -14 148 -133 106 -107 203 -93 -108
6669 -108 127 221 -72 55 -180 -67 54 -220 93 -316 22 136 61 112 154 182 10 10 -2 -70 -83 95 -182
6692 -182 -267 63 21 -31 315 133 34 131 -11 -280 -13 105 -275 -1 90 118 226 -45 -74 -164 134 50 -24 -164
6716 -164 -226 44 -222 108 55 -163 -130 223 -192 25 -210 110 174 -139 23 -239 -177 -79 -123 39 -164 -60
6738 -60 158 -169 -21 257 156 93 -47 -13 -26 -141 47 -21 -49 58 -71 -113 -160 -3 -250 -285 86 -1 84 -78
$$ packed form
6572F7j44OL04j78k39k4K21J71k21L2j42L9mO0k6K39q0J7p1J21m8k11L28k26j48
6597a57J65p0N8N7p9k0M29l43QJ9J7k17J40o4J27j08J55j26k27L30P1m77K53O4
6621EJ39J35l64K32j11m41N08K7j56pj97J66J63j42J22J3l21L49R7k94J1N5j0
6644b1k3J5oj4j0q1R3J90j1j77J08N4j78K6K93l54P1J1J62k81K39k13L10k96j5
6669a08K35R4k93J27k35J13J21k74L13m09L38J14p5N1M2K8j72%j2o8j3J78k77
6692a82q5L30m2n2L46j82r9R7j42k69K67J18l80K74R1K8J08k71k9r0K98q4p4j40
6716a64o2K70k66L30n3k18L3L53m15K17k35L20O4l13J62k62O2R8m4J62k03J04
6738f0K18l27J48K78j01o3j40L4j3j15J88o8k8J07j29m2m7J57k47l5L71q7Q5j62
$$ plain form
6762 -78 8 -4 68 7 -443 -139 80 -80 91 109 173 165 -171 -203 -77 -75 72 -214 -139 37 174 -343 -21 34 5
6787 5 -6 202 -150 14 -75 -251 -50 -69 6 146 -15 61 237 -128 -362 64 184 -3 232 -189 170 29
6809 29 -197 -109 -281 -27 -45 -101 121 -231 61 -62 -55 174 -18 12 -106 -6 -108 31 -58 238 -174 -4 -68
6832 -68 136 -88 92 19 -195 -34 -263 6 156 -44 -110 -48 -30 -149 -126 63 -169 -138 -259 17 -47 109 -79
6855 -79 -11 108 -100 29 -129 -129 76 77 170 -37 -25 -99 -73 78 -321 -142 -36 -259 -16 157 -19 178 42
6878 42 -167 -259 -200 57 161 -137 127 47 36 91 -99 8 -76 -23 -116 -3 6 -33 168 -20 331 128 335 6
6902 6 -68 -86 -113 -38 -221 168 71 -1 54 335 77 301 93 -96 -195 -7 -96 53 240 82 -147 285 -241 243
6926 243 36 147 41 -461 -49 -90 35 -12 71 266 153 -188 197 -105 -38 17 85 -12 219 69 129 -159 64
$$ packed form
6762g8Q6j2P2o1m50L04K19j60J71J8O4ql36l2J26KJ47k86P5J76J37n17L22N5k9
6787Ej1K08l52J64q9j76K01j9P5J40j61P6J76l65k34M26J20j87K35m21L59j41
6809B9k26Q8j72K54j8n6K22l52K92j23PK29j92L0j18J00j02J39q9K96m12J70o4
6832f8K04k24J80p3k14J61k29K69J50k00o6O2J8j19K3J89k32L1j21K76o4J56j88
6855g9O8J19k08J29j58%K05JR3k07J2p4K6J51l99J79J06k23K43J73j76J97j36
6878D2k09r2N9K57J04k98K64q0j1N5j90J07q4N3r3J13Rl9K01j88L51k03K07l29
6902Fp4j8k7P5j83L89r7p2N5K81k58K24k08j89r9J88q9J49J87j58k29M32n26M84
6926B43k07J11j06n02M12m1J25m7Q3J95j13l41L85l02O7N5O8r7K31j50O0k88K23
$$ plain form
6949 64 -100 87 -92 -76 0 42 43 -223 76 11 241 152 -246 108 204 323 156 -63 -180 66 160 98 117 118 -64
6974 -64 177 -107 -207 -161 3 7 -31 -168 25 -149 109 -83 -80 5 -211 6 134 -261 -45 -51 205 66 -114
6997 -114 131 69 101 -50 107 85 -126 -78 98 177 -94 168 86 50 -174 237 265 11 56 118 -165 11 -30 -31
7021 -31 104 -130 -158 63 -117 -139 -9 30 153 -1 -19 -23 222 -34 -189 -266 -103 7 -4 30 39 80 -45 -468
7045 -468 62 25 109 -101 -64 136 -86 -20 -103 221 193 95 23 85 -21 34 86 -56 74 78 -166 254 -123 110
7069 110 -129 209 34 107 235 -49 146 26 372 36 -79 -16 -153 20 155 3 186 221 101 104 225 87
7091 87 206 240 106 -87 247 17 -44 49 12 -157 383 11 -46 115 199 100 58 30 196 -41 142 72 113 140
7115 140 -249 71 -93 86 108 -340 117 -230 385 320 357 -137 7 35 59 342 49 13 -283 98 223 112
$$ packed form
6949F4j64J87j79J6P6M2Jk66K99o5K30q9l98L54R6J19j67k19j17K46R4o2J9Jj82
6974f4K41k84j00M6J64Ml8j37J93j74K58j92LQ5k16K17J28l95K16oK56j39j80
6997a14K45o2L2j51J57k2k11M8J76P9k71K62q2l6k24M11K8k54M5O2k83J76m1j
7021c1J35k34k8K21j80k2J30L9J23j54j8mK45k56j55p7J63J10j1L4RM1j25m23
7045d68N30l7Q4k10L7K00k22O6q3L24k8r8p2O2j06N5N2j42J30Mk44M20l77K33
7069A10k39L38j75P3J28k84J95j20L46l36j15O3j37J73J35j52J83L5j20LJ21j38
7091H7J19L4j34j93L34k30o1R3l7j69N40l72n7J61Q4r9m2k8J66k37J83p0M1K7
7115A40l89L20j64J79K2m48M57l47O15o5L7m94J44K8K4K83k93l6k96L81J25j11
$$ plain form
7137 112 16 125 109 -144 30 -143 181 142 123 -74 -205 171 -93 -143 131 154 -158 49 -81 -62 217 56
7159 56 28 -129 -30 -78 -34 -149 -77 220 31 307 41 208 -246 86 42 -170 107 210 233 25 40 128 -64
7182 -64 -26 64 91 -83 -254 -366 -60 8 156 186 18 78 179 -184 331 89 140 36 -93 -191 -97 -15 -16 145
7206 145 191 -71 173 -21 229 -98 209 58 -225 13 -22 139 -14 -50 428 12 27 204 -62 -68 -230 415
7228 415 17 -192 -236 -223 279 -43 154 202 54 -203 -232 37 -30 -73 -135 215 -46 32 83 105 12 -45 -132 -108 -95
7253 -95 -136 -8 -46 35 -55 154 28 71 164 -102 288 61 15 161 -144 -130 288 -226 129 -88 -36 -82 105 -366
7277 -366 -68 46 -116 -116 -127 214 -114 -214 21 30 -151 -87 -119 -44 -46 -182 -152 280 72 33 57 -48 79 -55
7301 -55 156 40 -163 23 147 -17 -298 -34 -40 -88 -270 -95 -67 -100 235 -265 46 343 -111 -167 53 255
$$ packed form
7137A12r6J09j6k53J74j73L24l9j9j97j31L76k64n0K74K3l12K07j30J9K79j61
7159E6k8j57R9m8M4j15P2K97j89K76k66J67m54L32m4k12K77J03K3k08J5Q8j92
7182f4L8R0K7j74j71j12L06O8J48L0j68O0J01l63N15k42N1j04j29r8R4Q2jJ61
7206A45M6k62K44j94K50l27L07j51k83K38l5J61j53l6M78m16J5J77k66oj62O45
7228D15l98k09m4J3N02l22J97M8j48k57k9K69o7m3o2L50k61P8N1K2r3n7q7K4J3
7253i5m1J28l8Q1r0K09j26M3R3k66L90k27m6J46l05J4M18n14L55k17N2m6J87m71
7277c66K98J14j62%j1L41l28j00K35Rj81O4l2P5kj36L0M32k08l9K4j05J27j34
7301e5K11j16k03J86J24j64k81K64om8j82J75K8l3L35n00L11K97m54n6K20K02
$$ plain form
7323 255 -357 162 -11 118 74 -39 -57 60 23 -9 -220 268 26 247 -182 -133 118 284 91 84 36 -51 7
7346 7 -42 -323 51 226 -23 89 -80 -5 89 30 -62 250 201 -70 47 2 -31 187 -98 77 -57 9 143 -74
7370 -74 -117 100 -141 -253 116 140 -79 -140 244 125 46 -57 -168 -211 -49 -179 -126 20 -77 -45 11 -213 -180 4
7394 4 -82 147 140 7 -71 -43 92 146 291 -222 27 -69 112 118 -45 -138 -152 -144 -12 -13 -145 -197 -354 -21 -19 -219 -39
7421 -39 -165 59 -203 -31 44 -2 -188 208 84 4 -123 -281 318 -245 98 291 -33 227 -105 -95 90 5
7443 5 208 -178 -187 -75 0 80 -137 -162 64 -13 190 -276 30 160 54 -112 7 139 -104 23 123 -70 -15
7466 -15 -3 19 -30 -21 63 527 100 -91 -142 191 -61 96 2 -237 42 -368 46 102 -171 79 173 -282 118 -91
7490 -91 62 -68 180 -7 -110 -45 32 167 -62 18 -34 -15 34 -103 229 -26 -26 71 197 58 64 35 -247 10
$$ packed form
7323B55o12N19j73J29m4j13j8J17l7l2k11M88k42K21m29M9K51J66j93pm8q7N8
7346Gm9k81L74J75k49J12j69P5R4n9r2L12m9k71J17m5l3K18k85J75j34O6J34k17
7370g4m3K17k41j12L69K4k19o1L84j19p9j03j11m3J62j30N3J46r7L2N6k24L3J84
7394Dq6K29pj33p8K8J35N4J45n13K49r6J81Oj63r3j4QJ32jj32n2j57L33Kk00J80
7421c9j26K24k62J72P5m6j86L96j24q0j27j58N99n63L43J93l24K60l32J0J85q5
7443EK03l86rJ12P5Q0k17k5K26p7K03m66L06J30j06j66J19J32k43J27J00j93N5
7466a5J2K2m9RQ4M64m27j91n1L33k52J57r4k39K79m10M14N6k73K50R4m55M00k09
7490i1J53j30K48j87j03O5P7J35k29Q0n2J9M9j37L32k55%R7J26j39Ok9k82K57
$$ plain form
7514 10 -35 59 -12 115 -88 -139 36 -322 -121 -189 -41 -54 81 85 -168 13 70 -10 -440 140 81 226 -24 2
7538 2 -27 -136 84 118 197 -261 2 164 126 -108 -94 177 -50 -129 57 -191 184 -66 -7 -4 -1 213 -53 72
7562 72 4 -22 43 161 120 99 -141 216 70 -106 125 -143 54 -16 -85 -119 119 -129 -298 -243 47 71 -35 -122
7586 -122 177 -107 -87 104 -138 74 -81 13 -36 -105 -50 115 66 94 -262 -26 -40 190 121 -70 4 -3 161 -424
7610 -424 -81 105 -131 161 96 85 42 -120 78 -58 -124 30 62 46 197 136 174 -33 -120 421 -55 -52 -236 -10
7634 -10 -212 -72 -72 92 -7 25 -162 1 81 -134 -151 -190 209 -150 177 105 -101 -69 139 -161 -326 -141 218
7657 218 -3 178 126 107 -65 129 139 51 84 -53 234 51 -54 238 136 -56 -35 -88 -270 5 274 -279
7679 -279 -23 163 74 99 -169 99 6 59 300 92 176 71 40 61 252 46 227 -144 -215 6 -170 150 -89
$$ packed form
7514A0m5R4p1J27k03n1J75l58K01o8J48j3J35Mk53J81N7q0m30N80n9J45k50K6
7538Bk9j09K20L4P9m58K63J62l8k34J4K71k27p9J86k48L75k50N9LLK14k66J25
7562G2o8k6O5J18m1k1k40L57j46j76K31k68J97p0o9l4K38k48j69N5K90K4j06q7
7586a22K99k84K0J91k42K12j55R4m9o9N5J65m9K8l56K36j4K30o9j91P4pJ64n85
7610d24L43J86k36K92o5j1m3j62J98j36o6J54L2j6J51o1L8k07q7N41m76Lj84K26
7634a0k02J40%J64r9L2j87J63Q0k15j7l9L99l59L27p2k06L2K08l00j65J85L59
7657B18k21J81n2j9j72J94J0q8L3j37K87j83j05K92j02j92K1n3j82K75K69n53
7679b79K56J86q9K5k68K68r3N3K41k08Q4j05l1K1J91k06J81l71p1K21j76L20k39
$$ plain form
7702 -89 193 168 -143 92 38 -1 115 -36 -46 110 4 -142 158 12 104 27 21 24 267 -342 27 120 -114 -48
7726 -48 -25 47 327 16 7 92 -115 71 133 -8 326 205 -150 -179 -182 -89 61 161 61 -91 17 170 106 158
7750 158 357 142 -33 50 -199 -75 -82 198 203 21 -16 -67 -24 13 -232 -189 139 129 89 -45 209 -261 -145 -4
7774 -4 -1 68 281 -117 -42 64 77 105 -92 -51 -283 -152 -91 -127 -220 173 54 -151 122 64 46 -109 198 192 -23
7799 -23 -34 -1 -256 5 62 -28 -233 292 19 -149 79 -90 -83 80 72 -22 -191 -38 95 -67 8 -58 204 171
7823 171 122 45 174 80 -258 111 -45 0 265 -196 -46 175 167 -50 183 -31 -132 103 199 -68 181 -174
7845 -174 -157 82 -203 -124 -167 278 -1 -134 131 41 -129 1 208 107 -134 -12 326 143 -183 -133 193 15
7867 15 -173 -155 -243 -140 -43 -13 89 -151 2 134 -69 -66 -49 -83 -96 160 -339 91 -213 139 -109 -4 -191
$$ packed form
7702h9K82k5l11K35n4l9J16j51j0J56j06j46L00j46R2p7oLK43o09L69R3k34O6
7726d8K3P2K80l11rQ5k07J86O2j41L34j21l55k9lR3J50J00j00j52J08J53o4N2
7750A58J99k15j75Q3k49J24pK80Nj82l7n1M3L7k45M3L28j0m0j34K54m70J16J41
7774dLO9K13l98P5J06J3K8j97M1k32J31O1l6r3L93j19k05K73n8j8j55L07ok15
7799b3j1L3k55K61N7r0k05N25k73j68K28j69PJ63qr4j69J53J33j62P5o6K62l3
7823A71m9p7J29r4l38L69j56M5K65m61J50K21qk17K33k14j01K35R6k67K49l55
7845a74J7K39k85P9m3M45k79j33K65r0j70J30K07j01k41J22L38j83l26N0L26j78
7867A5j88J8q8J03R7L0J02k40J53J32k03LJ7l4j3K56m99M30l04L52k48J05j87
$$ plain form
7890 -191 113 71 58 -123 42 -173 85 -291 -164 -55 74 152 52 -202 -164 -45 -40 -8 18 157 4 -192 312
7913 312 264 -32 47 40 -348 83 291 -80 -90 6 73 159 69 -219 -86 70 -180 -228 73 -255 -41 -231 69
7936 69 -5 -237 292 -162 326 -75 -81 -224 -203 103 -72 179 235 -63 269 295 -215 117 164 91 54 -184 39
7959 39 -92 -239 -138 -44 -45 228 197 -46 -199 -116 -211 247 -427 49 80 168 71 2 150 -37 75 130 301 383
7983 383 20 -245 -56 148 233 -149 -24 16 -215 34 311 -122 -153 -227 -182 269 108 -46 -231 -160 32 -220
8005 -220 -148 46 -187 9 81 224 -58 65 146 55 -302 233 -111 184 -62 153 145 -137 219 -230 65 -135
8027 -135 -27 -148 -10 -8 -41 7 -24 86 119 199 -27 36 383 158 117 -43 152 81 -34 -131 -337 51 -239 127
8051 127 184 46 -47 54 -59 144 -134 -200 -19 -140 -111 -102 2 157 -227 -187 -149 304 -192 1 -242 71 140
$$ packed form
7890a91L04m2j3j81J65k15K58l76J27J09J29P8j00k54L8J19NL2K6J39j53j96N04
7913C12m8k96P9pl88M31K08l71j0R6O7Q6r0k88J33J56k50m8L01l28K14j90L00
7936F9p4k32N29m54M88m01oj43K1L06j75K51N6k98L32K6n10L32M7p3l7k38K23
7959C9j31j47J01R4jK73l1k43j53Q3r5M58o74M76L1Q8r7o9J48j87J12N5J71Q2
7983C83l63k65J89K04Q5l82J25M0k31K49K77m33l1p4M5M51j61j54j85P1J92k52
8005b20P2J94k33J96P2J43k82J23Q1r1l57N35l44K95k46K15qk82L56m49K95k00
8027a35J08j21J38Kl3M8l1J10L3Q0k26O3L47k25m1j60J95p1j15r7k06L88k90L66
8051A27N7j38r3J01j13K03k78o6J81j21K9RJ04J55l84M0L8M53m96J93k43L13O9
$$ plain form
8074 140 -97 -54 76 -76 -219 90 -168 -176 -300 -87 348 289 -218 93 111 12 -81 12 -62 -31 -306 109 147 72
8098 72 78 56 205 -29 -106 131 104 -101 -135 -192 15 122 -100 -213 27 204 -237 49 -77 -163 204 71 -114
8121 -114 64 1 34 316 227 188 98 191 -78 -27 100 -75 144 -11 100 -49 -196 74 -110 214 -78 199
8143 199 -183 -184 -45 51 229 -48 -102 188 -323 -41 132 -80 37 -86 70 -192 -195 -311 -80 -185 -179 -121 81
8166 81 166 109 -1 -230 9 281 -41 -42 -300 244 38 -131 -250 191 81 131 -36 -10 135 131 234 274 19
8189 19 -71 263
$$ packed form
8074A40k37M3J30j52j43L09k58qj24K13M35n9n07L11J8r9r3R3p4L1k75M15L8p5
8098G2Ok2J49k34p7K37k7k05l4n7K07J07k22j13K40J77m41K86j26q6L67j33j85
8121a14J78o3L3K82q9l9r0R3k69N1J27j75K19j55J11j49j47K70j84L24k92K77
8143A99l82jJ39R6J78k77n4K90n11K82J73k12J17j23J56k62lj16K31j05ON8K02
8166H1Q5n7j10k29K39K72l22jk58N44k06j69j19M41j10N0j67K6J45mJ03M0k55
8189A9r0L34
8191B63
$$ Imaginary data points
##PAGE= N=2
##DATA TABLE= (X++(I..I)), XYDATA
$$ plain form
0 0 0 0 0 0 0 0 0 0 0 0 0 0 8 -8 8 -8 16 -16 16 -24 26 -32 40 -48 56 -64 73 -88 100 -114 130 -150 170 -193
34 -193 218 -244 274 -308 344 -384 429 -476 527 -583 646 -716 789 -869 959 -1055 1163 -1281
52 -1281 1412 -1558 1721 -1905 2113 -2355 2633 -2962 3357 -3839 4446 -5236 6313 -7873 10351
67 10351 -14913 26148 -119128 -104434 34132 -99674 -52301 17383 -16718 -22607 62859 38233
79 38233 26929 77701 58141 -2549 62881 82456 7952 20836 62783 -27953 -65771 -9196
91 -9196 -26866 -70691 -34977 -32711 -62147 -37007 1513 11623 37951 36349 -7347 14382 85901
104 85901 59301 -3384 7422 9460 -24015 -14802 -12299 -36773 -22024 -13706 -43307 -28788 15203
117 15203 10267 -4522 15948 13972 -15820 1280 37951 27944 19196 27702 6784 -5609 14214
$$ packed form
0@%%%%%%%%%%%%Qj6J6j6K4l2L2m0N0n8P2q8J04j20J37j61J88k14K44k80L20l63
34a93M11m62N18n82O52p28Q13r05J003j110J229j362J505j658J828k014K218k444
52a281K693k970L279l626M018m468M988n595O319p196Q285r682J1549j4186J8224
67A0351k5264M1061j45276J4694J38566j33806M7373O9684l4101n889Q5466k4626
79C8233j1304N0772j9560o0690O5430J9575p4504J2884M1947r0736l7818N6575
91i196j7670m3825L5714K266k9436K5140L8520J0110K6328j602m3696K1729P1519
104H5901k6600o2685J0806K038l3475R213K503k4474J4749Q318k9601J4519M3991
117A5203m936j4789K0470j976k9792J7100L6671j0007q748Q506k0918j2393J9823
$$ plain form
130 14214 11744 -7940 -21418 -44103 -50736 -23483 -2275 -8551 -12304 4790 16867 14128 23382
143 23382 35258 26790 15117 5003 -5816 -2798 4757 4418 -3565 -19910 -27410 -20316 -16913 -7387
157 -7387 1881 -11301 -21196 -10290 2430 14481 25192 21600 8341 5424 16654 19791 13220
170 13220 13684 4472 -16464 -15735 -9576 -16971 -9891 -2231 -14457 -17168 -3268 5765 11796 16943 10464
185 10464 -4944 -7430 3420 3460 647 3143 -9029 -17754 -2494 4727 1923 6744 401 -10873
199 -10873 -4071 5630 7052 10033 14133 8038 -318 5249 12087 6127 3827 -215 -19445 -23969 -12736
214 -12736 -11809 -9467 -4029 -11970 -15065 -1189 11988 16287 15846 14613 7815 4240 12830 15918 6603
229 6603 4090 -2552 -14491 -11158 -4389 -7370 -7274 -8808 -15280 -15610 -8184 1653 6679 5823 5257 3868
$$ packed form
130A4214k470j9684j3478k2685o633K7253K1208o276l753J7094J2077k739R254
143B3382J1876q468j1673j0114j0819L018P555l39p983j6345p500P094L403R526
157g387R268j3182r895J0906J2720J2051J0711l592j3259k917J1230L137o571
170A3220M64r212k0936P29O159p395P080P660j2226k711J3900R033O031N147o479
185A0464j5408k486J0850M0k813K496j2172q725J5260P221k804M821o343j1274
199a0873O802R701J422K981M100o095q356N567O838n960k300m042j9230m524J1233
214a2736R27K342N438p941l095J3876J3177M299m41j233o798l575Q590L088r315
229F603k513o642j1939L333O769k981R6j534o472l30P426R837N026q56n66j389
$$ plain form
245 3868 6316 17457 20562 14931 9237 -1902 -8041 -3659 -3693 -6708 -10524 -16835 -16426 -10309 -3990
260 -3990 3979 5841 3119 2635 2293 7077 13720 12820 8879 4228 -2807 -2011 1975 1512 -174 -7865
276 -7865 -15619 -14613 -10694 -4673 -132 -2560 -3906 -983 3164 11704 17494 14487 10394 5262 1765
291 1765 3666 2513 98 -4207 -12338 -15067 -12302 -9102 -3347 -1427 -5677 -5469 -2331 1992 9655
306 9655 11595 10386 6895 2474 5331 9620 8349 6408 -445 -9414 -9498 -8347 -6641 -4597 -7521 -10978
322 -10978 -10035 -6077 2237 7915 7697 7733 5463 3775 7958 9693 7636 4716 -1797 -6635 -5662 -4432
338 -4432 -2531 -3006 -7602 -8242 -7893 -4761 1913 4186 1776 1110 542 3384 8452 9031 7883 4364 -1566
355 -1566 -1432 -483 -662 570 -3946 -9334 -9108 -7117 -3084 1995 1525 342 -936 -617 4757 8166 7584
$$ packed form
245C868K448J1141L105n631n694j1139o139M382l4l015l816o311M09O117O319
260c990P969J862k722m84l42M784O643r00l941m651p035P96L986m63j686p691
276g865p754J006L919O021M541k428j346K923M147Q540N790l007m093n132l497
291A765J901j153k415m305q131k729K765L200N755J920m250K08L138M323P663
306I655J940j209l491m421K857M289j271j941o853q969q4J151J706K044k924l457
322a0978R43L958Q314N678k18L6k270j688M183J735k057k920o513m838R73J230
338d432J901m75m596o40L49L132O674K273k410o66n68K842N068N79j148l519n930
355a566J34R49j79J232m516n388K26J991M033N079m70j183j278L19N374L409n82
$$ plain form
372 7584 6018 1328 -2316 -1178 535 1261 296 -4430 -6880 -6195 -4483 218 1210 -438 -637 -2141
388 -2141 -911 4691 6391 5753 4035 -370 -614 2465 2794 2543 -477 -5279 -6449 -5896 -3285 -112
404 -112 -1838 -3231 -2891 -2804 2177 6591 6206 5880 3164 -103 1693 3445 3055 2061 -1780 -5219 -6234
421 -6234 -4702 -502 -307 -2880 -3170 -4658 -3557 2607 4251 2461 2856 1505 726 3665 5709 4979
437 4979 2468 -632 -2053 -3847 -2232 381 -2925 -4971 -3983 -5814 -3061 3185 2761 1316 1632 103
453 103 844 4332 5888 3615 -579 -1666 -1822 -2291 1603 1936 -2947 -3349 -3080 -4781 -619 2676 469
470 469 -268 -220 -599 1105 4643 5897 2341 -222 -217 -1671 -1048 2429 -504 -5058 -3527 -4201 -3845 1326
488 1326 1877 -970 -776 253 558 2796 5362 3959 556 586 1047 -741 1425 3327 -1429 -3764 -2460
$$ packed form
372G584j566m690l644J138J713P26r65m726k450O85J712M701R92j648j99j504
388b141J230N602J700o38j718m405k44L079L29k51l020m802j170N53K611L173
404a12j726j393L40Q7M981M414l85l26k716l267J796J752l90r94l841l439j015
421f234J532M200J95k573k90j488J101O164J644j790L95j351p79K939K044p30
437D979k511l100j421j794J615K613l306k046R88j831K753O246m24j445L16j529
453A03P41L488J556k273m194j087j56m69L894L33m883m02K69j701M162L295k207
470D69p37M8l79J704L538J254l556k563Nj454O23L477k933m554J531o74L56N171
488A326N51k847J94J029L05K238K566j403l403L0M61j788K166J902m756k335J304
$$ plain form
505 -2460 -4245 -2235 1350 -332 -2881 -3216 -2121 -94 2755 4189 2605 -28 768 2114 1911 3784
521 3784 2176 -1817 -1602 -2375 -2317 483 395 -1431 -1911 -2164 -1907 380 1893 2069 42 -1092 -441 393
539 393 2630 4090 798 -1658 -1395 -1489 550 1865 -1001 -1924 -2131 -2269 278 1789 1467 1471 112 -774
557 -774 300 1270 2686 1859 -52 -1270 -2639 -1634 1866 456 -1438 -796 -3051 -2304 2211 2700 470
574 470 -62 -620 -703 1239 2964 2489 -405 -150 1 -1530 553 2126 -1269 -2028 -1562 -3510 -1820 1645
592 1645 1246 399 171 -616 -154 1998 3916 1518 -916 -648 -1548 -1284 2140 1435 -1650 -1534 -1767 -2067
610 -2067 1038 1566 -282 -432 -604 -508 514 2486 2706 502 -207 41 -968 659 2340 -641 -2201
627 -2201 -1600 -3263 -1959 914 463 -1154 -670 -536 216 1997 3680 2387 109 593 420 -889 1539
$$ packed form
505b460j785K010L585j682k549l35J095K027K849J434j584k633P96J346k03J873
521C784j608l993K15p73N8K800q8j826m80k53K57K287J513J76k027j134O51Q34
539C93K237J460l292k456K63r4K039J315k866r23k07j38K547J511l22Mj359q86
557g74J074R70J416q27j911j218j369J005L500j410j894O42k255P47M515M89k230
574D70n32n58q3J942J725m75k894K55J51j531K083J573l395p59M66j948J690L465
592A645l99q47k28p87M62K152J918k398k434K68r00K64L424p05l085J16k33l00
610b067L105N28j848j50j72R6J022J972K20k204p09K48j009J627J681k981j560
627b201O01j663J304K873m51j617M84J34P52J781J683j293k278M84j73j309K428
$$ plain form
644 1539 1476 -1342 -1660 -1308 -2246 -749 572 -511 -1896 -2227 -1378 -346 1319 2842 1610 -46 1348
661 1348 1598 1818 3267 1448 -530 -1380 -1881 -1219 -81 -984 -1671 -2318 -2774 -1109 329 795 1551 262
679 262 -279 451 1148 2599 2711 878 314 -337 -528 579 801 -649 -1444 -2710 -2483 -756 -431 31
697 31 -386 -1219 -558 875 1462 2878 1742 269 446 86 422 1477 368 -671 -1258 -2360 -1258 -181
715 -181 -268 -128 -1016 -1917 -1031 352 1277 1547 614 343 359 441 1891 2174 541 30 -1403 -1547 -304 -51
735 -51 -310 -542 -2055 -1450 -1004 179 1368 687 -28 -256 -190 610 2049 1468 193 -230 -1039 -394 681
754 681 395 169 -711 -1787 -863 -356 283 527 -725 -1185 -617 -248 842 1677 533 326 -587 -419 212
773 212 806 440 76 -874 -1314 -113 -59 766 706 -673 -752 -395 115 1209 498 -240 -9 -932 62 828
$$ packed form
644A539o3k818l18L52r38J497J321j083j385l31Q49J032J665J523j232j656J394
661A348K50K20J449j819j978q50n01O62J138r03o87o47m56J665J438M66P56j289
679B62n41P30O97J451J12j833n64o51j91J107K22j450p95j266K27J727L25M62
697C1m17q33O61J433N87J416j136j473J77l60L36J055j109j039n87j102J102J077
715a81q7J40q88r01Q86J383R25K70r33k71J6Q2J450K83j633n11j433j44J243K53
735e1k59k32j513O05M46J183J189o81p15k28O6Q00J439n81j275m23q09O45J075
754F81k86k26q80j076R24N07O39K44j252m60N68L69J090Q35j144k07r13J68O31
773B12N94l66l64r50m40J201N4Q25o0j379p9L57N10J094p11p38K31r23R94P66
$$ plain form
793 828 664 333 24 -1042 -331 156 451 1167 21 -838 -304 -423 521 1165 363 -335 -744 -701 131 641
813 641 309 290 -1173 -991 139 514 753 726 -363 -445 97 115 1220 498 168 -564 -1070 -524 489 306
833 306 -67 -262 -1292 -584 75 468 647 85 -601 -311 279 1185 1592 409 177 -125 -370 519 950 222
853 222 -367 -1164 -1772 -485 -246 225 206 -621 -411 175 196 1356 1198 237 291 -56 164 1011 923 145 -76
874 -76 -1314 -731 245 -285 -261 -643 -1427 -982 -326 421 946 593 137 218 437 753 1496 642 323 -754 -805
895 -805 -169 -186 -360 -289 -999 -1404 -385 -423 533 645 -284 45 40 188 1207 1224 684 162 -507 -169 557 49
917 49 286 -221 -1456 -957 -688 -514 162 -292 -390 -448 -283 603 1460 775 685 537 -187 535 568 293 219 -540
939 -540 -994 -538 -400 -140 -242 -922 -808 -476 -279 697 749 73 286 410 279 858 1137 1041 465 -775 -575
$$ packed form
793H28j64l31l09j066P11M87K95P16j146q59N34j19R44O44q02o98m09M3Q32N10
813F41l32j9j463J82J130L75K39k7j089q2N42J8J105p22l30p32n06N46J013j83
833C06l73j95j030P08O59L93J79n62o86K90N90R06M07j183k32l02k45Q89M31p28
853B22n89p97o08J287K39M71j9q27K10N86K1J160j58r61N4l47K20Q47q8p78k21
874g6j238N83R76n30K4l82p84M45O56P47N25l53m56Q1K19L16P43q54l19j077n1
895h05O36j7j74P1p10m05J019l8R56J12r29L29nJ48J019J7n40n22o69L38P26n08
917D9K37n07j235M99K69J74O76m54r8n8J65Q86Q57o85r0j48p24P22L3k75p4p59
939e40m54M56J38K60j02o80J14L32J97R76N2o76K13J24j31N79K79r6n76j240K00
$$ plain form
960 -575 -203 -338 220 -498 -1244 -630 -660 -456 728 209 -62 55 -39 675 933 739 854 15 -529 75 182
981 182 -68 537 -548 -658 -780 -539 -157 211 -66 -315 -433 -355 991 875 568 686 -145 -176 487 443 705
1002 705 -47 -799 -718 -526 -291 465 191 -452 -420 -436 -158 447 417 407 -111 -185 123 447 179 948 12 -565
1024 -565 -121 -153 15 457 -146 -560 -689 -518 499 167 95 589 -335 -531 587 257 524 794 -342 -554
1044 -554 242 258 341 487 2 -228 -503 -316 600 -130 75 -207 -586 -157 -25 339 393 143 -600 -191 -20
1065 -20 170 620 -231 -429 -63 -135 398 532 153 -130 -848 -675 329 -261 78 231 -581 -373 -189 -123 584
1086 584 149 -72 -38 -209 142 565 198 398 27 -532 31 480 -119 146 -109 -661 -371 159 207 439 -206
1107 -206 -409 -242 -356 468 673 249 369 -188 -123 201 253 399 256 -682 -471 -193 -546 148 -76 -463 -191
$$ packed form
960e75L72j35N58p18p46O14l0K04J184n19k71J17r4P14K58j94J15q39n44O04J07
981A82k50O05j085j10j22K41L82L68k77k49j18P8J346j16l07J18q31l1O63m4K62
1002G05p52p52Q1J92K35P56k74o43L2j6K78O05l0j0n18p4L08L24k68P69r36n77
1024e65M44l2J68M42o03m14j29J71J017l32p2M94r24j96J118l30K67K70j136k12
1044e54P96J6Q3J46m85k30k75J87R16p30K05k82l79M29J32L64N4k50p43M09J71
1065b0J90M50q51j98L66p2N33J34l79k83p18J73J004n90L39J53q12K08J84O6P07
1086E84m35k21L4j71L51M23l67K00l71n59N63M49n99K65k55n52K90N30M8K32o45
1107b06k03J67j14Q24K05m24J20n57O5L24N2J46j43r38K11K78l53O94k24l87K72
$$ plain form
1128 -191 -65 -147 425 458 176 65 -15 288 324 411 695 162 -475 -295 64 -297 261 -240 -879 -269 -106 -58
1150 -58 154 -75 23 -275 -104 677 779 370 641 -162 32 148 6 296 -22 -388 -482 -646 -388 424 123
1171 123 -292 -110 -322 -70 626 553 118 402 -229 -21 425 187 308 213 -366 -279 -351 -60 11 -416 -264 -402
1193 -402 -388 30 215 129 412 262 -73 352 283 553 538 -253 -229 -428 -246 194 54 -535 -276 -693 -224 414
1215 414 35 241 43 -220 249 439 487 490 627 102 -53 -74 -62 123 -139 -346 -291 -509 -108 -176 -142 14 10
1238 10 -408 521 58 356 467 -273 200 281 -79 184 466 -334 -282 -248 -146 -108 99 -89 -375 -324 -189 499
1260 499 43 507 305 -339 -86 250 126 309 166 -134 -226 -102 -146 358 -67 -190 -223 -575 117 -10 -236
1281 -236 249 38 -118 -56 49 294 279 -434 42 -17 85 622 -113 -21 -34 -429 -234 67 -18 94 99 -210 -350
$$ packed form
1128a91J26q2N72L3k82j11q0L03L6Q7K84n33o37J80L59l61N58n01o39O10J63M8
1150e8K12k29R8k98J71P81J02m09K71q03J94J16j42K90l18l66r4j64K58Q12l01
1171A23m15J82k12K52O96p3m35K84o31K08M46k38J21r5n79Q7p2K91P1m27J52j38
1193d02J4M18J85q6K83j50l35M25o9K70j5p91K4j99J82M40j40n89K59m17M69O38
1215D14l79K06j98k63M69J90M8LJ37n25j55k1J2J85k62k07N5k18M01o8L4J56m
1238A0m18R29m63K98J11p40M73Q1l60K63K82q00N2L4J02L8K07j88k86N1J35O88
1260D99m56M64k02o44K53L36j24J83j43l00r2J24m4N04m25j23l3l52O92j27k26
1281b36M85k11j56O2J05K45j5p13M76n9J02N37p35R2j3l95J95L01q5J12Nl09j40
$$ plain form
1304 -350 80 -178 309 -34 31 181 59 137 437 -78 121 -7 -131 -87 287 135 70 -88 -567 -18 -155
1325 -155 153 249 -25 106 -11 152 458 396 -205 164 -229 -291 87 214 62 -103 -108 -237 -88 -114 47 245
1347 245 -138 -77 123 99 114 143 -121 100 -264 24 44 244 25 -24 -65 131 63 112 57 96 -286 -98 -305 -44
1371 -44 421 -134 -50 -127 -183 604 362 20 42 -27 -308 -97 -250 44 -85 -358 -144 -276 -424 118 14 -107
1393 -107 -140 -155 -205 284 321 410 194 -341 53 185 206 279 172 -405 -88 -374 -209 170 0 -340 -122 -300
1415 -300 243 216 216 -29 -120 -12 113 82 251 401 -147 66 -61 97 181 1 -230 -23 -394 -285 304 111
1437 111 119 -114 -83 130 162 -213 460 166 18 104 61 184 299 -150 132 54 -20 -74 296 -58 2 -172 -25
1460 -25 -125 -256 32 146 95 -323 20 -98 416 85 -216 22 -262 -350 -303 3 11 -241 -577 -27 -93 -143 68
$$ packed form
1304c50M30k58M87l43O5J50j22P8L00n15J99j28j24M4L74j52o5j58m79N49j37
1325a55L08R6k74J31j17J63L06o2o01L69l93o2L78J27j52j65nj29J49k6J61J98
1347B45l83O1K00k4J5K9k64K21l64K88K0K00k19m9m1J96o8M9n5L9l82J88k07K61
1371d4M65n55Q4p7n6P87k42l42K2o9k81K11j53K94j29k73K14j32j48N42j04j21
1393a07l3j5n0M89L7Q9k16n35L94J32K1P3j07n77L17k86J65L79j70l40K18j78
1415c00N43k7%k45r1J08J25l1J69J50n48K13j27J58Q4j80k31K07l71J09N89j93
1437A11Qk33L1K13L2l75O73k94j48Q6m3J23J15m49K82p8p4n4L70l54O0j74J47
1460b5j00j31K88J14n1m18L43j18N14l31l01K38k84q8M7L06Qk52l36N50o6n0K11
$$ plain form
1483 68 -205 -245 130 143 328 403 -37 -175 147 61 -51 193 -117 -167 -215 -344 -182 -154 -230 190 -24 -110 43
1506 43 220 180 58 19 241 60 -131 525 179 -92 -110 -31 -298 -114 118 -189 128 -285 -311 -23 -71 231
1528 231 109 -125 93 -441 65 310 267 261 -115 -302 188 68 -114 73 -164 -403 214 -73 125 -64 -344
1549 -344 41 -148 328 166 39 129 99 -45 26 296 181 65 -244 159 -178 -98 -275 151 146 -524 66 -131
1571 -131 174 272 -270 190 -72 152 -55 409 -172 -186 -165 -148 406 -216 -66 189 -110 -292 267 -143 -112 -286
1593 -286 -283 -65 -191 -113 154 360 102 448 -4 -189 46 -147 317 65 -137 -21 -198 -63 63 -256 -43
1614 -43 95 -161 41 182 69 422 310 35 118 250 128 437 105 -136 91 21 -197 137 -163 0 -150
1635 -150 -341 -233 7 -9 30 -48 -255 -48 -21 127 175 -24 139 -69 -159 95 11 -50 -55 -34 -83 -141 -151 44 -83
$$ packed form
1483F8k73m0L75J3J85P5m40j38L22q6j12K44l10n0m8j29J62K8p6M20k14q6J53
1506D3J77m0j22l9K22j81j91O56l46k71j8P9k67J84K32l07L17m13k6K88m8L02
1528B31j22k34K18n34N06K45m3ol76j87M90j20j82J87k37k39O17k87J98j89k80
1549c44L85j89M76j62j27R0l0j44P1K70j15j16l09M03l37Q0j77M26no70N90j97
1571a31L05R8n42M60k62K24k07M64n81j4K1J7N54o22J50K55k99j82N59m10L1j74
1593b86LK18j26P8K67K06k58L46m52j85K35j93M64k52k02J16j77J35J26l19K13
1614d3J38k56K02J41j13L53j12k75Q3J32j22L09l32k41K27p0k18L34l00J63j50
1635a50j91J08K40j6L9p8k07K07K7J48M8j99J63k08r0K54q4o1nK1m9n8j0J95j27
$$ plain form
1660 -83 -160 161 -131 -87 260 157 -144 79 83 186 346 79 -112 -225 -183 158 62 -64 124 -30 -272 289
1682 289 77 -96 221 -194 19 61 182 350 202 9 -46 124 -152 282 57 -62 -30 -167 -105 -238 458
1703 458 199 -111 -48 -275 -24 111 82 100 -139 -95 -151 125 327 183 118 64 56 68 -50 -191 7 -200 191
1726 191 172 -102 9 158 -199 -69 208 139 84 -204 120 270 75 45 122 20 114 -39 12 -88 17 340
1748 340 122 20 -196 121 -205 -189 187 -177 168 77 37 231 -158 -174 -53 -57 -200 284 86 -193 87 -456
1770 -456 -49 175 -226 75 292 -59 210 87 3 66 -63 175 176 -216 5 134 229 20 -221 39 -231 94
1792 94 133 146 118 84 -75 -44 -59 156 -51 171 267 -426 -110 -83 -88 100 -28 -76 -58 -110 -234 6 -176 -4 -93
1817 -93 4 195 44 48 235 -60 -201 101 -203 44 57 230 328 213 244 294 -108 -64 -34 -78 -171 -239 -26 200
$$ packed form
1660h3p7L21k92M4L47j03l01K23MJ03J60k67j91j13M2L41r6j26J88j54k42N61
1682B89k12j73L17m15K13M2J21J68j48j93n5J70k76M34k25j19L2j37O2j33O96
1703D58k59l10O3k27K51J35k9J8k39M4n6K76K02j44o5n4qJ2j18j41J98k07L91
1726A91j9k74J11J49l57J30K77o9n5k88L24J50j95l0P7j02R4j53N1j00J05L23
1748C40k18j02k16L17l26J6L76l64L45r1m0J94l89j6J21mj43M84j98k79K80n43
1770d56M07K24m01L01K17l51K69j23q4O3j29K38Jl92K21J29R5k09k41K60k70L25
1792I4L9J3k8l4j59L1j5K15k07K22R6o93L16K7nJ88j28m8J8n2j24K40j82J72q9
1817i3R7J91j51MJ87k95j41L02l04K47J3J73R8j15L1N0m02M4L0m4r3o8K13K26
$$ plain form
1841 200 45 199 165 -95 -145 -61 109 -151 191 -106 271 -75 -201 -37 -81 -39 46 -37 -349 116 -44 -256
1863 -256 63 -193 161 -40 -78 6 149 -143 68 140 -361 41 -129 84 -44 19 125 -296 -424 -158 -389
1884 -389 -32 136 -86 -47 215 57 -8 283 189 -120 160 -117 237 45 -29 77 13 -51 -83 23 126 -260
1906 -260 81 132 -44 23 -48 153 97 9 -62 -147 382 343 50 -26 -191 -154 -200 -65 -63 42 -337 6 12 -164 60
1931 60 19 140 -83 -38 443 -78 -240 87 -6 -224 -60 -65 -121 -155 -241 -126 61 -225 93 -198 -205 63 -180 80
1955 80 335 207 115 66 -78 228 -51 -272 60 -60 -41 200 -121 -13 80 -134 73 153 -79 111 176 185 -181
1978 -181 -83 -170 -214 199 -4 265 -248 99 -12 -44 -22 -83 -61 41 -55 65 -21 126 -28 221 -330 55 -77
2001 -77 99 208 69 -100 29 -15 -139 -215 -188 -92 -84 212 -139 -101 35 73 -99 145 -153 -57 158 13 170
$$ packed form
1841B00j55J54l4k60n0Q4J70k60L42k97L77l46j26J64m4M2Q5q3l12M65j60k12
1863b56L19k56L54k01l8Q4J43k92K11P2n01M02j70K13j28O3J06m21j28K66k31
1884c89L57J68k22L9K62j58o5K91r4l09K80k77L54j92p4J06o4o4l2J06J03l86
1906b60L41N1j76O7p1K01n6q8p1q5N29l9k93p6j65L7m6J35KJ05l79L43Oj76K24
1931F0m1J21k23M5M81n21j62L27r3k18J64nn6l4q6J15J87k86L18k91pK68k43K60
1955H0K55j28r2m9j44L06k79k21L32j20J9K41l21J08R3k14K07Q0k32J90O5Rl66
1978a81R8q7m4M13k03K69n13L47j11l2K2o1K2J02r6J20q6J47j54K49n51L85j32
2001g7J76J09j39j69J29m4j24p6K7R6QK96l51L8J36L8j72K44k98R6K15j45J57
$$ plain form
2024 170 -81 -24 -89 -5 92 47 153 -135 -237 130 111 52 91 -334 -209 189 -93 -25 112 -225 -207 -78 54
2047 54 -118 119 28 -224 -189 292 -94 -60 88 -266 -66 329 92 111 71 -119 -121 227 -81 411 392 -164 97
2070 97 121 -67 111 93 -163 131 37 -44 -127 -10 -103 72 -80 226 -221 -3 -4 101 80 39 -115 -175 284 103
2094 103 128 136 21 -262 228 -3 28 -183 48 -17 -64 78 -78 32 23 51 101 -100 -31 121 -65 -247 -104 110
2118 110 -202 101 55 144 275 17 15 -258 112 -148 -90 -43 55 36 263 35 231 218 14 160 80 417 171
2141 171 -43 -116 209 -59 220 -137 -91 -73 -106 -111 112 40 2 -50 -192 -10 -66 40 67 -42 142 180 50 -109
2165 -109 -102 -304 -337 86 -165 -135 -28 -40 56 -11 -220 -73 -109 -308 -3 40 65 227 120 40 -143 -41 13 -105
2189 -105 -158 -129 -165 14 -35 42 -224 65 -209 -49 -10 -93 239 179 -11 331 126 -128 173 4 217 57 126
$$ packed form
2024A70k51N7o5Q4R7m5J06k88j02L67j9n9L9m25J25L98k82O8J37l37J8J29J32
2047E4j72K37r1k52L5M81l86L4J48l54K00L95k37J9m0j90kL48l08M92j9n56K61
2070I7K4j88J78j8k56K94r4q1q3J17r3J75j52L06m47K18jJ05k1m1j54o0M59j81
2094A03K5Qj15k83M90k31L1k11K31o5m7J42j56J10rK8N0k01O9J52j86j82J43K14
2118A10l12L03m6Q9J31k58kk73L70k60N8M7R8j9K27k28J96j3k04J46q0L37k46
2141A71k14p3L25k68K79l57M6J8l3nK23p2l8n2j42J82n6J06K7j09J84L8j30j59
2165a09Pk02l3M23k51L0J07j2R6o7k09J47l6j99L05M3K5J62j07q0j83J02N4j18
2189a05n3K9l6J79m9P7k66K89k74J60L9q3L32o0j90L42k05k54L01j69K13j60O9
$$ plain form
2212 126 -235 -233 96 73 -109 -119 162 -206 161 117 125 -197 151 -135 181 205 -129 144 -97 -60 -72 -34 29 -94
2236 -94 -230 262 -149 -104 224 -184 18 -35 179 -204 212 176 102 -41 163 90 314 -31 -124 -360 -276 18 -123
2259 -123 -320 -112 -23 18 -22 -241 118 -1 104 163 -45 15 69 370 -60 -31 -171 26 -191 33 -185 -126 -118
2282 -118 -224 55 8 12 -254 77 -66 50 95 81 -23 -35 37 -86 102 124 189 -59 56 12 -50 16 74 -12 82
2307 82 83 48 -165 221 -316 -261 203 -158 -3 145 -137 -187 60 84 123 -218 72 -68 -46 38 179 -208 -33
2330 -33 -40 -164 126 143 -166 -78 491 -103 261 -35 91 368 204 -61 -21 -246 14 96 -117 97 -41 -20 108
2353 108 -165 -83 92 89 257 126 65 -132 171 -183 46 32 -22 -112 -20 -79 123 -199 -25 215 -167 -106 216
2376 216 100 -147 76 -3 -146 -54 315 -10 111 -137 -125 -55 190 -174 -291 149 -118 -68 -73 79 70 -116 -172
$$ packed form
2212A26l61KL29k3j82j0K81l68L67m4Ql22L48k86L16K4l34K73k41L7j2L8O3j23
2236i4j36M92m11M5L28m08K02n3K14l83M16l6p4j43K04p3K24l45r3k36Q4K94j41
2259a23j97K08Q9M1m0k19L59j19J05N9k08O0N4L01m30K9j40J97k17K24k18N9Q
2282a18j06K79m7Mk66L31j43J16M5j4j04j2P2j23J88K2O5k48J15m4o2O6N8q6R4
2307H2Jl5k13L86n37N5M64l61J55J48k82n0K47K4L9l41K90j40K2Q4J41l87J75
2330c3pj24K90J7l09Q8N69n94L64k96J26K77j64k65M0k25K60Q2k13K14j38K1J28
2353A08k73Q2J75lJ68j31o1j97L03l54K29j4n4r0R2n9K02l22J74K40l82O1L22
2376B16j16k47K23p9j43R2L69l25J21k48J2P0K45l64j17M40k67N0nJ52rj86n6
$$ plain form
2399 -172 -10 32 169 -14 -131 100 -4 216 150 131 95 103 21 328 -95 251 -265 -30 84 21 -26 135 -65
2422 -65 257 -33 -207 111 -62 -42 56 -139 -128 126 -117 -109 161 -50 -286 -501 96 166 -296 -74 147 -256
2444 -256 76 148 129 -19 34 -91 -56 -148 11 -18 -80 300 -60 -186 -253 -28 164 2 -22 102 -148 18 -339
2467 -339 251 -110 51 -24 73 29 -32 -66 185 248 -18 -38 83 24 158 -255 -153 117 -338 2 -201 111 43
2490 43 103 -22 15 -62 -117 246 116 -130 124 182 88 -49 -282 -177 -100 89 82 20 -116 -187 -113 7 84 -128 -32
2515 -32 -58 160 -114 -17 -215 -196 -138 188 372 51 -106 152 -92 -220 -83 223 50 -74 -219 87 -59 -115
2537 -115 112 26 169 -73 49 -32 -58 -94 -23 22 -42 -42 -200 37 276 74 10 41 -63 -29 -17 -88 -92 -114 57 1
2563 1 76 304 -174 -213 150 -183 -227 384 -151 -218 78 192 80 23 217 -149 189 -13 222 235 -143 -108 43
$$ packed form
2399a72J62M2J37j83j17K31j04K20o6j9l6Qq2L07m23L46n16K35J14o3m7J61k00
2422f5L22k90j74L18j73K0R8j95J1K54k43QK70k11k36k15N97P0m62K22K21m03
2444b56L32P2j9j48N3j25L5r2J59k9o2L80l60j26o7K25J92j62k4J24k50J66l57
2467c39N90l61J61p5R7m4o1l4K51O3k66k0J21n9J34m13J02K70m55L40k03L12o8
2490D3O0j25L7p7n5L63j30k46K54N8r4j37k33J05P7J89po2j36p1P4J20P7k12R6
2515c2k6K18k74R7j98J9N8L26J84l21j57K58k44j28J37L06j73j24j45L06j46n6
2537a15K27q6J43k42J22q1k6l6P1M5o4%j58K37K39k02o4L1j04L4J2p1mk2J71n6
2563AP5K28m78l9L63l33m4O11n35o7K96J14j12n7J94l66L38k02K35J3l78L5J51
$$ plain form
2586 43 -218 143 84 -86 -40 83 -51 181 221 -136 -141 -79 79 -5 -233 -246 -59 -87 78 66 215 49 114 316
2610 316 344 39 -143 41 10 92 109 243 -31 -327 -22 117 -38 -226 -30 -157 106 -199 10 117 -355
2631 -355 50 13 -288 -165 120 147 44 -28 9 -197 133 155 67 101 -131 132 251 20 -174 17 93 -128 178
2654 178 143 -91 81 -47 -325 -67 2 -319 -153 -217 1 360 180 203 33 -48 -46 97 116 56 268 91 -48
2677 -48 -91 -139 64 73 329 186 83 -271 -52 -147 16 -133 -285 289 -114 -297 -62 237 -179 14 277 51
2699 51 -144 -49 234 9 276 -46 -78 74 16 38 -58 -201 -201 57 -56 -225 -51 62 302 229 15 185 172
2722 172 129 -210 -231 184 -187 186 281 81 -103 79 -99 155 4 238 -7 -43 141 203 115 352 -209 73
2744 73 -33 64 92 165 138 -23 38 -267 237 -278 -73 -13 91 16 103 51 -32 -44 -13 251 111 198 58 193 210
$$ packed form
2586D3k61L61n9j70M6J23j34K32M0l57nO2J58q4k28j3J87k8J65j2J49j66O5K02
2610C16K8l05j82J84l1Q2J7J34k74k96L05J39j55j88J96j27K63l05K09J07m72
2631c55M05l7l01J23K85K7j03p2L7k06L30K2q8L4k32K63J19k31j94J91P6k21L06
2654A78l5k34J72j28k78K58O9l21J66o4K18L59j80K3j70q1KJ43J9o0K12j77j39
2677d8m3m8K03RK56j43j03l54K19r5J63j49j52N74m03j83K35K99m16J93K63k26
2699E1j95R5K83k25K67l22l2J52n8K2r6j43%K58j13j69J74J13K40p3k14J70j3
2722A72m3l39k1M15l71L73R5k00j84J82j78K54j51K34k45l6J84O2q8K37n61K82
2744G3j06R7K8P3k7j61O1l05N04n15K05O0J04p5Q7n2q3j2L1K64j40Q7j40J35J7
$$ plain form
2769 210 -14 -211 4 120 -274 -69 -84 26 -43 7 33 -244 33 -80 74 43 200 -12 -83 -255 -7 305
2791 305 -23 -128 -58 -14 -142 64 -45 79 -287 -69 133 93 119 160 102 -151 -197 129 -11 -82 55 35 83
2814 83 121 -47 -158 96 -269 -212 175 56 23 2 -171 -143 198 -47 -298 16 154 -110 19 285 101 124
2836 124 188 -64 17 269 -174 37 145 271 -149 -86 -273 -82 -206 171 -127 116 110 230 50 145 34 -23
2858 -23 256 57 -116 -192 -32 -179 58 58 -21 36 -14 73 31 163 28 179 29 -37 -1 264 10 -34 139 -74
2882 -74 107 364 -15 -201 -51 -188 170 137 -44 -101 9 -39 -23 -173 -322 0 161 321 150 2 -190 -5
2904 -5 -521 -318 73 130 -304 -135 174 -210 141 -97 -19 14 17 217 169 165 -47 -80 -69 229 -39 114 6 -3 -131
2929 -131 -83 31 -53 198 138 -32 -16 163 -59 12 20 79 -114 171 32 217 -2 191 138 237 67 -173 -8
$$ packed form
2769B10k24j97K15J16l94K05j5J10o9N0K6k77K77j13J54l1J57k12p1j72K48L12
2791C05l28j05P0M4j28K06j09J24l66K18K02m0K6M1n8k53m6L26j40p1J37k0M8
2814H3L8j68j11K54l65N7L87j19l3k1j73K8L41k45k51L14J38k64J29K66j84K3
2836A24O4k52Q1K52m43K11J08J26m20O3j87J91j24L77k98K43oJ20j80R5j11n7
2858b3K79j99j73p6J60j47K37%p9N7n0Q7m2J32j35J51j50o6L6K65k54m4J73k13
2882g4J81K57l79j86J50j37L58l3j81n7J10m8J6j50j49L22J61J60j71j48j92J85
2904en16K03L91N7m34J69L09l84L51k38P8L3LK00m8mk12l3J1K98k68J53j08rj28
2929a31M8J14q4K51o0j70J6J79k22P1QN9j93K85j39J85k19J93n3R9j70k40J65
$$ plain form
2952 -8 -105 -153 -48 -117 -152 -100 -41 98 -320 -26 -42 166 51 143 -109 46 -94 -132 -194 -62 -18 -187 144 -158
2976 -158 -115 74 11 -19 -50 -118 158 -215 -36 127 131 -128 -88 3 -65 -214 32 -117 -84 242 -74 -355 184 -128
3000 -128 252 -95 -96 141 79 -64 -51 45 4 -42 -42 20 -185 -38 -111 163 46 4 338 -52 83 -216 104 -51
3024 -51 149 41 -229 56 50 14 -2 0 -102 -251 146 35 130 6 181 -175 109 -188 133 275 -127 -181 -17
3047 -17 -142 36 57 -187 -78 -139 -5 -69 9 197 -116 62 -67 -179 -211 -95 189 -159 -75 13 -51 53 -144
3070 -144 -133 -104 30 -114 -169 46 145 144 -70 133 -104 27 -254 -241 -11 -56 70 -76 -112 -15 98 -101 -103 201
3094 201 -200 -183 -121 184 -15 -18 165 -17 13 -20 46 -78 174 15 72 -363 -211 51 -37 -98 -119 176 -53 -185
3118 -185 -5 18 165 34 -145 -59 -131 -276 -79 -78 -298 258 -148 156 -144 -201 367 47 -247 98 94 174 35
$$ packed form
2952hr7m8J05o9l5N2N9J39m18K94j6K08j15R2k52J55j40l8o2J32M4j69L31l02
2976a58M3J89o3l0l1o8K76l73J79J63Mk59M0R1o8j49K46j49L3L26l16k81N39l12
3000a28L80l47jK37o2j43J3R6m1m6%O2k05J47p3K74j17m2L34l90J35k99L20j55
3024e1K00j08k70K85ol6j6Kj02j49L97j11R5j24J75l56K84k97L21J42m02n4J64
3047a7j25J78K1k44J09o1J34o4P8J88l13J78j29j12l2J16K84l48Q4Q8o4J04j97
3070a44J1K9J34j44n5K15R9jk14K03k37J31k81J3K30m5J26j46l6R7J13j99kL04
3094B01m01J7O2L05j99lJ83j82L0l3O6j24K52j59N7m35J52K62q8o1k1K95k29j32
3118a85J80K3J47j31j79Q6p2j45J97Jk20N56m06L04l00n7N68l20k94L45mQ0j39
$$ plain form
3141 35 7 -85 82 66 -107 66 138 131 296 -153 -189 32 -119 -53 -38 -182 0 -181 -261 -225 -328 -139 112 -56
3165 -56 164 168 213 -60 13 137 123 -83 35 -115 39 262 -3 -169 -254 227 -74 -8 77 -33 -129 -144 -24 207
3189 207 36 -74 90 20 -176 -18 31 -3 101 -26 22 -12 -34 -270 16 38 19 -32 151 94 168 -108 -364 104
3213 104 312 -287 -176 -253 -380 54 -267 -65 78 230 166 -42 -51 -337 -31 27 115 94 -22 15 -76 142 -178
3236 -178 125 78 -18 28 56 -135 -82 104 -78 75 263 90 71 17 -96 -261 75 74 80 -74 -44 142 -215 213
3260 213 87 50 -20 -79 -216 -394 -451 107 463 -87 -48 92 156 -210 -193 -216 -43 142 -46 -154 -56 -51 214 30
3284 30 -170 -150 -142 67 -33 -245 55 -73 -25 -52 -13 -105 14 -184 -85 102 -328 -246 63 178 294 -135 316
3307 316 -225 68 -123 -76 -103 20 89 -15 237 -119 81 312 177 87 -21 -50 -206 345 6 72 217 -218
$$ packed form
3141C5k8r2J67j6j73J73P2pJ65m49l6K21j51O6J5j44J82j81q0L6j03J89K51j68
3165e6K20MM5k73P3J24j4k06J18j50J54K23k65j66q5M81l01O6Q5j10r6j5J20K31
3189B07j71j10J64p0j96J58M9l4J04j27M8l4k2k36K86K2j9n1J83n7P4k76k56M68
3213A04K08n99J11p7j27M34l21K02J43J52o4k08rk86L06N8Q8k1j16L7r1K18l20
3236a78L03m7r6M6K8j91N3J86j82J53J88j73j9n4j13j65L36jOj54L0J86l57M28
3260B13j26l7p0n9j37j78n7N58L56n50L9J40O4l66J7k3J73J85j88j08R8NK65j84
3284C0k00K0QK09j00k12L00j28M8k7L9r2J19j98R9J87m30Q2L09J15J16m29M51
3307C16n41K93j91M7k7J23O9j04K52l56K00K31j35r0j08k9j56N51l39O6J45m35
$$ plain form
3329 -218 -80 246 -50 -24 145 -89 127 -157 271 37 212 116 313 -42 217 92 252 5 -489 21 -13
3350 -13 164 -28 -215 64 -92 -130 -84 -319 84 -57 -64 255 -41 108 -93 -109 -61 -35 -119 -145 -25 -58 56 49
3374 49 -147 -40 97 140 14 8 24 142 -130 194 271 194 -97 89 -81 181 -220 39 -52 -88 -88 214 -198 -132
3398 -132 34 110 -103 57 289 -332 -110 -140 225 21 46 118 -39 -35 10 12 -58 69 -132 -225 -15 1 121 -73
3422 -73 5 -70 -279 86 -19 211 122 -13 10 155 0 -17 -126 -18 36 14 -77 193 199 -187 3 -180 -202 37
3446 37 -129 -237 225 117 -130 74 -298 226 34 113 61 -99 -34 14 -89 -58 -164 42 -91 43 288 -181
3468 -181 12 -55 -24 365 38 56 24 -94 36 -132 -93 4 -113 126 -20 -40 -204 80 187 191 120 -194 -96 57
3492 57 -20 28 203 313 125 185 112 -210 -177 107 -262 -9 -85 -15 -103 -101 -68 -6 -39 -224 -184 2 -35 38 -41 -90
$$ packed form
3329b18J38L26k96K6J69k34K16k84M28k34J75r6J97l55K59j25J60k47m94N10l4
3350a3J77j92j87K79j56l8M6k35M03j41pL19k96J49k01j6M8K6q4k6J20l3J14p
3374D9j96J07J37M3j26oJ6J18k72L24P7p7k91J86j70K62m01K59r1l6%L02m12O6
3398a32J66P6k13J60K32o21K22l0L65k04K5P2j57MM5Kp0J27k01r3K10J6J20j94
3422g3P8p5k09L65j05K30q9j35K3J45j55j7j09J08N4k2r1K70Ol86J90j83k2K39
3446C7j66j08M62j08k47K04l72N24j92P9n2j60O5M8j03L1j06K06j33J34K45m69
3468a81J93o7L1L89l27J8l2j18J30j68L9R7j17K39j46k0j64K84J07Mp1l14R8J53
3492E7p7M8J75J10j88O0p3l22L3K84l69K53p6P0q8KL3O2l3j85M0J86l7P3p9m9
$$ plain form
3518 -90 -26 -253 59 -178 75 81 69 -55 221 -119 -4 204 85 4 -14 -118 -121 -104 -184 112 -359 149 -83 -14
3542 -14 -11 -38 -115 -427 113 -6 251 -37 -19 334 31 -35 81 -4 -295 72 66 85 -13 -72 275 -182 157 55
3566 55 -32 0 463 158 302 -303 200 -120 -87 101 -216 -141 -166 -50 -259 -215 -80 50 136 64 244 447 -263
3589 -263 98 308 -105 -178 -17 -174 -133 41 -36 164 -94 145 199 -377 235 14 211 -77 235 -15 -60 -60
3611 -60 98 -158 56 292 -215 80 115 -47 96 130 -485 -15 126 -43 57 -99 297 -10 93 -112 -301
3632 -301 8 -125 -207 -225 -208 114 -215 52 -126 133 -72 163 -5 -256 98 35 5 109 161 33 -82 6
3654 6 -26 21 -211 -58 1 63 38 40 43 -35 276 142 -52 -47 265 -241 -68 -59 198 -158 22 197 231 -277 -267 -17
3680 -17 42 -128 -134 34 139 -174 130 56 38 45 -4 145 -211 -115 -30 108 31 59 -8 -13 111 -118 -105 -137 -329 195
$$ packed form
3518i0O4k27L12k37K53Oj2j24K76l40J15K08j19q1j8j04lJ7q0K96m71N08k32O9
3542a4Lk7p7l12N40j19K57k88J8L53l03o6J16q5k91L67oJ9r8n9L47m57L39j02
3566E5q7L2M63l05J44o05N03l20L3J88l17P5k5J16k09M4J35J30Q6p2J80K03p10
3589b63L61K10m13p3J61j57M1J74p7K00k58K39N4n76O12k21J97k88L12k50m5%
3611f0J58k56K14K36n07K95L5j62J43L4o15M70J41j69J00j56L96l07J03k05j89
3632c01L09j33q2j8J7L22l29K67j78K59k05K35j68k51L54o3l0J04N2j28j15Q8
3654Fl2M7k32J53N9O2k5KLp8L11j34j94NL12n06J73RK57l56J80J75L4n08J0K50
3680a7N9j70oJ68J05l13L04p4j8Pm9J49l56R6Q5J38p7K8o7nJ24k29J3l2j92N24
$$ plain form
3706 195 -249 -199 -166 -216 41 -18 199 9 23 197 -205 229 202 -123 37 50 -35 -9 -31 200 144 23 -207 129
3730 129 -34 -67 319 -91 207 234 -154 59 -145 68 17 -172 9 -79 102 -216 13 -174 26 -157 209
3751 209 -266 -211 10 -115 -143 -51 -123 -303 187 174 12 85 -43 220 -97 154 -82 -49 -48 179 87 -55 -36 249
3775 249 -153 -29 -54 -108 -13 15 91 156 194 24 52 -42 30 88 -12 -123 45 157 -148 -164 -347 142 137 -47 -324
3800 -324 -268 -58 -63 -179 10 -181 -78 -47 -148 -81 -135 136 163 -99 -31 75 -166 16 108 -287 -340 57 -19 -212
3824 -212 -150 -162 17 3 91 -221 58 -24 21 117 -146 175 104 48 146 -221 -245 -256 27 172 -101 5 90 -143
3848 -143 -278 59 -132 -21 28 83 -10 -135 105 -6 -36 22 212 -15 -50 46 -67 -35 -206 -27 -266 84 -249
3871 -249 77 73 165 68 50 120 41 -48 266 71 135 -7 107 -75 35 -245 -46 -218 -160 -6 -317 -8 -286
$$ packed form
3706A95m44N0L3n0K57n9K17j90J4J74m02M34k7l25J60J3q5K6k2K31n6j21k30L36
3730A29j63l3L86m10K98K7l88K13k04K13n1j89J81q8J81l18K29j87K00j83L66
3751B09m75N5K21j25k8R2p2j80M90j3j62P3j28K63l17K51k36L3JK27r2j42J9K85
3775B49m02J24k5n4R5K8P6O5L8j70K8r4P2N8j00j11J68J12l05j6j83M89nj84k77
3800c24N6K10nj16J89j91J03L1j01O7n4K71K7k62O8J06k41J82R2l95n3L97p6j93
3824b12O2j2J79j4Q8l12K79q2M5R6k63L21p1n6R8l67k4j1K83J45k73J06Q5k33
3848a43j35L37j91J11M9N5r3j25K40j11l0N8J90k27l5R6j13L2j71J79k39L50l33
3871b49L26mR2r7j8P0p9q9L14j95O4j42J14j82J10k80J99j72N8J54l11L09k78
$$ plain form
3894 -286 264 84 -104 -96 -170 -14 -108 34 -62 -3 55 -256 37 123 -234 -22 -165 87 19 65 -91 206 -95
3917 -95 -153 -133 -164 -180 -75 150 154 206 25 29 8 -224 -14 9 215 141 -45 -85 11 45 17 5 -6 224 117 53 -29
3944 -29 79 2 -209 224 -28 233 95 251 174 139 -198 -58 -129 8 30 114 -65 268 -173 -67 -42 -31 -236
3967 -236 140 -1 -77 -202 156 76 186 198 -192 209 -94 84 -409 155 -68 -137 102 -216 132 -17 88
3988 88 11 117 34 90 197 -312 110 -69 109 10 -21 -226 57 99 -164 102 -168 -50 -206 -133 137 -147 191
4011 191 -67 -151 3 206 9 -129 47 204 -133 -102 -195 -248 -47 194 -69 -77 -96 -9 125 -89 159 178 41
4034 41 -37 -20 -259 63 19 28 109 159 46 26 -393 32 -76 69 -42 -50 184 -112 142 149 168 82 -3 -146 -161 57
4060 57 -85 -56 404 63 -198 16 -65 -5 -29 -176 84 134 213 -183 -78 120 123 -8 185 151 203 121 189 -71
$$ packed form
3894b86N50j80j88Qp4J56r4J42r6N9N8l11K93Q6l57K12j43K52o8M6j56K97l01
3917i5n8K0l1j6J05K25MN2j81Mk1k32K10K3K06p4j86m0R6L4k8j2j1K30j07o4q2
3944b9J08p7k11M33k52K61j38J56p7l5l37J40p1J37K2Q4j79L33m41J06K5J1k05
3967b36L76j41p6j25L58q0J10J2l90M01l03J78m93N64k23o9K39l18L48j49J05
3988H8p7J06q3N6J07n09M22j79J78r9l1k05K83M2k63K66k70J18j56P3K70k84L38
4011A91k58q4J54K03j97j38J76J57l37L1r3n3K01K41k63qj9Q7J34k14K48J9j37
4034D1p8J7k39L22m4RQ1N0j13k0m19M25j08J45j11qK34k96K54PJ9q6q5j43j5K18
4060E7j42K9M60l41k61K14q1O0k4j47K60N0P9l96J05J98Lj31J93l4N2q2O8k60
$$ plain form
4084 -71 162 34 46 30 -286 9 -299 130 -66 210 95 351 63 282 274 73 -68 76 291 -154 126 -13
4106 -13 40 -13 -6 -241 -60 61 99 53 -74 -61 67 217 1 42 -34 -189 52 84 -153 -110 298 -58 -215 -73
4130 -73 -310 -39 -91 -201 78 -131 -73 -111 12 -330 -11 -92 -224 106 -56 -22 179 26 196 200 -179 -55 -139
4153 -139 -198 -179 -63 -168 26 -71 -21 45 179 -417 -86 -39 153 46 177 -110 -165 -268 -28 57 25 -184 198
4176 198 -54 181 -74 -348 14 -26 72 -77 156 -81 -41 159 231 -68 -64 147 -6 -98 5 201 12 223
4198 223 80 -276 -17 -215 316 42 14 20 -168 28 -16 -126 170 -212 209 126 8 -113 -121 32 7 -31 -70
4221 -70 -106 28 -54 18 -51 -3 -82 -85 107 37 -93 112 -35 -15 -78 117 -126 12 -70 22 181 -220 57 153 34
4246 34 185 -8 -38 -35 62 147 -79 -47 284 37 96 104 27 -105 -165 -39 -36 55 58 -87 -106 57 158 138 32 -114
$$ packed form
4084g1K33j28J2j6l16K95l08M29j96K76j15K56k88K19qk01j41J44K15m45K80j39
4106a3N3n3Pk35J81J21L8m6j27J3J28J50k16M1p6j55K41L2k37M3M08l56j57J42
4130g3k37K71n2j10K79k09N8l8J23l42L19q1j32L30j62L4K01j53J70Ml79J24q4
4153a39n9J9J16j05J94r7N0O6J34n96L31M7J92j07J31k87n5j03K40Q5l2k09L82
4176A98k52K35k55k74L62m0R8j49K33k37M0K00P2k99MK11j53r2J03J96j89K11
4198B23j43l56K59j98N31k74k8Oj88J96m4j10K96l82M21q3j18j21qJ53k5l8l9
4221g0l6J34q2P2o9M8p9lJ92p0j30K05j47K0o3J95k43J38q2R2J59m01K77R6j19
4246C4J51j93l0LR7Q5k26L2L31k47N9Qp7j32o0J26LR1Lj45j9J63J01k0j06j46
$$ plain form
4272 -114 -54 -43 219 -127 92 -87 80 112 -42 226 -89 -9 -216 26 146 85 -29 158 39 68 26 -82
4294 -82 118 164 -81 161 -38 -63 10 -8 42 234 229 16 -86 106 -274 19 236 115 -1 -12 -150 12 -176
4317 -176 -132 -90 -137 -51 193 -168 -97 -49 -120 19 11 -124 32 -58 -68 151 46 146 43 319 73 -241 -362 217
4341 217 -94 46 234 -86 2 -207 167 139 -80 22 114 50 190 245 -32 314 109 -213 -219 263 -42 95
4363 95 1 152 63 125 -139 58 -84 -170 164 -77 99 95 -59 0 81 -189 249 -138 -183 -21 -77 -94 44 -113
4387 -113 -59 61 114 224 59 -31 160 -134 -218 -268 -372 34 95 96 96 -12 -39 -107 -188 -38 -40 9 -231 -44 -200
4412 -200 20 160 -134 -17 -123 -111 98 132 171 107 65 138 54 -57 77 -170 2 -170 -240 51 179 130 -241
4435 -241 64 53 -140 -92 218 248 98 35 210 -81 -39 293 20 120 25 81 3 -75 -161 14 -168 32 -31 126
$$ packed form
4272a14O0J1K62l46K19j79J67L2j54K68l15Q0k07K42J20o1j14J87j19K9m2j08
4294h2K00M6k45K42j99k5P3j8N0J92nk13j02J92l80K93K17j21j16j1j38J62j88
4317a76M4M2m7Q6K44l61P1M8p1J39qj35J56r0j0K19j05J00j03K76k46l14j21N79
4341B17l11J40J88l20Q8k09L74k8k19J02R2o4J40N5k77L46k05l22oM82l05J37
4363I5r4J51q9O2k64J97j42q6L34k41J76mj54N9Q1k70M38l87m5J62n6j7J38j57
4387a13N4J20N3J10j65r0J91k94q4n0j04M06O1J%j08k7o8q1J50kM9k40J87j56
4412b00K20J40k94J17j06J2K09L4L9o4m2P3q4j11J34k47J72j72p0K91J28m9l71
4435b41L05j1j93M8L10L0j50o3J75k91M2L32k73J00r5N6p8p8q6J75j82K00o3J57
$$ plain form
4459 126 125 2 244 172 -15 309 -121 -195 -137 -123 123 -28 -195 98 103 -63 -39 -310 -111 -1 -2 -300 166 -79
4483 -79 94 37 44 6 -170 146 -192 143 6 -87 -48 -127 -50 -184 -38 -111 0 -156 157 298 0 -268 -170 -26
4507 -26 -200 66 -197 -18 -115 -74 -236 -150 -329 -259 13 151 47 -380 -84 -46 -270 66 -127 257 148 263
4529 263 -62 141 114 -23 -175 -28 47 56 39 -40 -83 50 -137 0 -165 60 -88 82 -88 42 215 -74
4551 -74 -34 21 -172 79 261 -170 202 -169 -22 25 42 102 -170 115 112 50 -36 37 21 -113 20 -342 36 174
4575 174 -33 120 85 52 -123 546 6 -232 -67 184 -135 -278 59 -141 -113 270 240 -151 -218 254 142 -74
4597 -74 -156 -36 -211 375 -75 7 85 -91 139 -168 -173 -41 61 -33 69 154 -30 230 -118 -308 221 -67 230
4620 230 -114 188 -45 90 13 -47 250 38 -13 -135 12 135 87 144 -335 83 -28 247 -82 -83 23 310
$$ packed form
4459A26jj23K42p2j87L24m30p4N8J4K46j51j67K93Nj66K4k71J99J10jk98M66k45
4483g9J73n7Pl8j76L16l38L35j37r3L9p9P7j34J46p3J11j56L13J41k98k68R8J44
4507b6j74K66k63J79r7M1j62Q6j79P0K72J38j04m27K96L8k24L36j93L84j09J15
4529B63l25K03k7j37j52J47P5Rj7p9m3J33j87J37j65K25j48J70j70J30J73k89
4551g4M0N5j93K51J82m31L72l71J47M7J7O0k72K85lo2q6P3j6j34J33l62L78J38
4575A74k07J53l5l3j75O69n40k38J65K51l19j43L37k00K8L83l0l91o7M72j12k16
4597g4q2J20j75N86m50Q2P8j76K30l07nJ32J02r4J02Q5j84K60l48j90N29k88K97
4620B30l44L02k33J35p7o0K97k12n1j22J47J23m8N7m79M18j11K75l29jJ06K87
$$ plain form
4642 310 -96 -66 -84 -22 175 153 173 290 137 94 200 -126 139 -64 -115 85 25 22 128 -9 -319 -136 203
4665 203 -252 -2 154 10 -121 -85 -185 101 -74 -132 -189 -229 56 23 6 123 -43 -33 -175 -82 20 -155 106
4688 106 77 35 -209 96 237 49 78 -122 -76 -13 -39 -189 -56 -118 -18 164 128 -150 373 275 50 346 21
4711 21 129 7 80 -350 -150 -31 63 64 -54 52 219 134 47 -207 74 -12 88 -69 -92 -157 -107 162 -225 61
4735 61 48 -221 22 -252 -34 -2 22 68 21 150 4 -136 -123 258 -76 28 34 67 -134 -73 1 253 -104 -239
4759 -239 -86 118 -38 96 -123 120 -188 233 214 -312 197 -283 73 119 179 -219 10 -68 -95 69 97 187
4781 187 68 78 83 -124 -6 143 -168 39 117 306 -100 -29 52 249 -149 -68 50 -73 154 15 367 38
4803 38 -146 -242 58 -303 -134 158 132 3 139 150 3 236 174 131 192 -96 -60 -138 -163 21 -114 -96 167 16
$$ packed form
4642C10m06L0j8O2J97k2K0J17j53m3J06l26K65k03n1K00o0lJ06j37l10J83L39
4665B03m55K50J56j44j31L6j00K86j75n8n7m0K85l3j7J17j66J0j42R3J02j75K61
4688A06k9m2k44L05J41j88K9k00M6O3k6j50J33o2J00J82l6k78N23r8k25K96l25
4711B1J08j22P3m30K00J19R4Jj18J06J67q5q7k54K81q6J00j57k3o5N0K69l87K86
4735F1j3k69K43k74K18L2K4M6m7J29j46j40J3L81l34J04OL3k01O1P4K52l57j35
4759b39J53K04j56J34k19K43l08M21j9n26N09m80L56M6O0l98K29p8k7J64K8R0
4781A87j19J0Nk07J18J49l11K07P8J89m06P1Q1J97l98Q1J18j23K27j39L52l29
4803C8j84r6L00l61J69K92k6j29J36J1j47K33o2m3O1k88L6p8k5J84j35J8K63j51
$$ plain form
4827 16 -174 29 140 188 -120 136 -116 -22 113 -86 -310 178 -231 179 64 117 -252 -90 -113 19 93 -115
4849 -115 -17 -4 112 -81 -33 -45 17 -116 -83 -161 -48 -43 189 15 59 2 -76 109 194 -12 212 106 334 -298
4873 -298 -132 -237 199 -2 -28 -41 121 -103 25 -46 -274 -49 -335 72 -25 -35 127 -44 30 -168 -138 133
4895 133 -148 34 -11 236 -73 70 62 -78 41 -1 -262 -63 -154 49 353 7 89 -134 243 24 -130 -117
4917 -117 73 18 273 -111 -58 -135 -120 -215 -26 -184 -227 312 112 -63 -208 79 128 16 -73 15 -293 34 -299
4940 -299 -197 25 -68 7 -106 292 -80 -25 -74 241 -134 -248 103 31 -113 -19 132 96 122 -32 196 -347 -156
4963 -156 -115 -3 270 -231 165 122 -75 173 -6 -26 5 193 -13 262 340 -194 -79 51 151 -27 68 50
4985 50 -53 -118 225 -301 106 -29 68 -175 -138 -37 -113 -95 138 -98 -354 44 -282 -167 -74 288 -164 89
$$ packed form
4827A6j90K03J11M8l08K56k52R4J35j99k24M88m09M10j15N3l69J62k3J32P4k08
4849a15R8J3J16j93M8j2O2j33L3p8J13NK32j74M4n7p8J85Q5k06K24j06K28o32
4873b98J66j05M36k01k6j3J62k24J28p1k28K25k86M07r7j0J62j71P4j98L0K71
4895A33k81J82m5K47l09J43qj40J19m2k61J99r1K03L04l46Q2k23L77k19j54J3
4917a17J90n5K55l84N3p7J5r5J89j58m3N39k00j75j45K87M9j12q9Q8l08L27l33
4940b99J02K22r3P5j13L98l72N5m9L15l75j14L51p2j44R4J51l6K6j54K28n43J91
4963a56M1J12K73n01L96m3j97K48j79k0L1J88k06K75P8n34J15J30J00j78R5j8
4985E0j03o5L43n26M07j35R7k43L7J01p6J8K33k36k56L98l26J15R3L62m52K53
$$ plain form
5007 89 -195 -285 313 116 13 155 61 44 -14 -44 -105 20 -78 -226 -90 -60 229 62 4 -125 117 121 13 114
5031 114 -247 -166 7 -211 77 -89 22 49 -329 -122 -193 181 -27 16 53 128 -160 -48 47 -26 -126 199 203
5054 203 -112 -157 -126 -79 136 98 68 -11 -48 -62 -79 65 -90 113 72 -51 -93 -63 -81 243 -12 102 50 93 -132
5079 -132 23 10 95 -211 28 -253 -108 68 198 -20 105 100 -369 165 68 -41 23 -10 17 -47 8 126 28 27
5103 27 50 143 -130 31 -21 44 44 -31 -30 42 57 13 -72 44 -49 206 68 -196 -66 -159 110 14 -184 -64 180 -336
5129 -336 142 89 -2 32 40 -130 86 67 119 -107 -156 -202 -143 -87 -84 -117 16 -21 -135 121 106 -102 131 203 -220 -237
5155 -237 299 82 -158 213 -67 -305 -103 126 -133 179 -11 -266 64 -144 -137 6 -58 -24 49 181 128 235
5177 235 86 153 -368 44 96 -14 40 -334 -169 82 13 103 201 -170 75 -138 323 -65 71 -205 309 240
$$ packed form
5007H9k84r0N98j97j03J42r4j7n8l0o1J25r8j48J36L0K89j67n8j29K42Mj08J01
5031A14l61Q1J73k18K88j66J11K7l78K07p1L74k08M3L7P5k88J12R5p3j00L25M
5054B03l15m5L1M7K15l8l0p9l7j4j7J44j55K03m1j23m2L0j8L24k55J14n2M3k25
5079a32J55j3Q5l06K39k81J45J76J30k18J25nm69N34r7j09O4l3K7o4N5J18r8j
5103B7K3R3k73J61n2O5%p5JP2J5m4q5J16r3K55j38k64J30r3K69r6j98J20K44n16
5129c36M78n3r1L4Qj70K16j9N2k26m9m6N9N6Ll3J33l7j14K56j5k08K33P2m23j7
5155b37N36k17k40L71k80k38K02K29k59L12j90k55L30k08PJ43o4L4P3J32n3J07
5177B35j49O7n21M12N2j10N4l74J65K51o9R0R8l71K45k13M61l88J36k76N14o9
$$ plain form
5199 240 16 -53 63 -118 97 64 254 -38 126 -264 -9 379 -81 84 233 21 -88 44 99 -102 302
5220 302 10 147 -51 -8 11 93 -208 81 221 -38 -41 -16 24 -129 212 150 142 86 286 -98 65 -130 -288 47
5244 47 42 -75 190 275 46 17 207 183 -14 77 -279 185 -56 84 232 -87 -8 -136 -168 90 13 -37 -63 -40
5268 -40 -209 7 182 4 49 -180 113 43 70 191 -64 -102 112 -31 3 358 -203 -166 -215 94 9 -3 147
5291 147 -107 -118 -33 -10 15 -61 80 -237 -205 67 389 -142 147 458 17 -70 224 216 95 133 19 133 -26
5314 -26 -95 -107 49 -172 -92 5 149 -164 -51 64 52 -51 24 -165 -202 277 94 -201 120 40 109 143 -85 -142
5338 -142 -201 -137 225 -127 -73 0 -71 11 -58 -111 -102 -82 -188 36 60 -59 -251 108 -134 52 -43 124 -43 216
5362 216 69 47 -209 171 31 -158 229 -42 151 136 -190 17 -244 -44 -80 125 159 -12 217 122 -182 -120
$$ packed form
5199B40k24o9J16j81K15l3J90k92J64l90K55L88m60J65J49k12j09J32N5k01M04
5220C02k92J37j98M3J9Q2l01K89J40k59lK5M0j53L41o2qn6K00l84J63j95j58L35
5244D7nj17K65Q5k29k9J90k4j97R1l56M64k41J40J48l19P9j28l2K58p7n0k6K3
5268d0j69K16J75j78M5k29K93p0K7J21k55l8K14j43L4L55n61L7m9L09q5j2J50
5291A47k54j1Q5K3K5p6J41l17L2K72L22n31K89L11m41q7K94qj21L8j14J14j59
5314b6o9j2J56k21Q0R7J44l13J13J15j2j03P5j89l7M79j83k95L21q0O9L4k28n7
5338a42n9O4L62l52N4P3p1Q2o9n3RK0j06K24K4j19j92L59k42J86r5J67j67K59
5362B16j47k2k56L80j40j89L87k71J93j5l26K07k61K00l6K05L4j71K29r5l04O2
$$ plain form
5384 -120 -135 34 52 166 121 -124 -103 -117 66 -44 58 -185 126 -64 171 -64 -225 69 6 54 109 -238 59
5407 59 -59 -79 -247 31 17 -392 11 53 -21 81 -252 26 246 56 -71 -111 89 -171 -29 -91 -79 189 17
5430 17 -38 146 81 -138 -255 47 69 33 178 -39 -93 90 -52 -55 125 -119 292 62 -117 261 17 -54 -335
5453 -335 -20 -123 82 68 52 -38 -248 -99 169 -106 -141 -49 324 101 -182 14 -81 2 179 45 31 185 220
5476 220 149 145 -149 -16 6 -301 -254 52 100 17 184 230 -123 49 100 -163 98 123 112 -69 174 100 110 -22
5500 -22 68 135 193 74 108 -111 -104 106 -185 64 -233 106 192 45 288 161 -198 -130 25 -84 37 -83 233
5523 233 60 -64 147 48 80 170 -139 -376 -134 26 -15 -141 -177 -23 -177 -57 87 203 82 -116 -184 -114
5545 -114 -266 -405 169 27 223 190 -119 140 104 183 138 -134 18 21 53 -82 -43 180 31 185 -38 -91 -8
$$ packed form
5384a20j5J69J8J14m5k45K1j4J83j10J02k43L11j90K35k35j61K94o3M8N5l47K97
5407E9j18k0j68K78j4m09M03M2p4J02l33K78K20j90j27m0K00k60J42o2J2K68j72
5430A7n5J84o5k19j17L02K2l6J45k17n4J83j42lJ80k44M11k30j79L78k44p1k81
5453c35L15j03K05j4j6r0k10J49K68k75l5R2L73k23k83J96r5Q3J77j34j4J54L5
5476B20p1mk94J33K2l07M7L06M8q3J67M6l53J72N1k63K61K5j1j81K43p4J0j32
5500b2R0O7N8j19L4k19PK10k91K49k97L39Q6j47K43j27l59O8J55j09J21j20L16
5523B33j73j24K11r9L2R0l09k37K42J60m1j26l6J54j54J20J44J16j21j98o8P0
5545a14j52j39N74j42J96l3l09K59l6P9m5k72J52LL2j35L9K23j49J54k23n3Q3
$$ plain form
5568 -8 9 -12 75 -60 -40 -161 -206 -32 111 -16 13 211 59 61 226 8 -30 -206 165 184 120 26 189 -16 251
5593 251 -151 113 40 206 77 -11 -169 84 -52 -66 298 73 109 183 -26 -15 33 -76 -82 356 -209 -159 -65 -89
5617 -89 17 -210 208 113 260 -107 -31 -25 -178 16 -173 45 30 53 -97 163 13 59 165 13 33 -178 197
5640 197 155 205 357 31 113 141 13 -92 -54 -99 -222 -76 -91 79 -48 123 89 22 78 -97 -50 11 151 -172
5664 -172 -80 96 80 199 21 43 -14 -1 -101 -40 -45 140 54 -304 -123 -92 60 -91 -27 16 139 -215 -217 86 163
5689 163 -184 -173 -301 -14 61 -82 232 -38 189 -232 -155 240 96 -222 -269 9 -51 -24 30 43 -206 -6 -145
5712 -145 -106 -204 -135 14 49 -373 64 -155 78 52 379 79 -139 97 -36 -111 -82 -47 131 -173 119 199 -39
5735 -39 -4 205 219 -294 -240 119 82 252 55 -153 126 151 -16 -218 105 -188 29 -71 -81 -38 33 -261 94
$$ packed form
5568hJ7k1Q7j35K0j21m5J74J43j27K9J98j52KJ65k18l8j76L71J9o4r4J63k05K67
5593B51m02K64p3J66j29q8j58K53j36j4L64k25L6P4k09J1M8j09oM38n65N0R4k4
5617h9J06k27M18r5J47l67P6Oj53J94j89K18j5K3j50K60j50M6J06j52K0k11L75
5640A97m2N0J52l26Q2K8j28j05L8m5j23J46j5J70j27J71l4o7N6j75M7O1J40l23
5664a72R2J76j6J19j78K2n7J3j00O1nJ85q6l58J81L1J52j51O4M3J23l54kL03P7
5689A63l47J1j28K87P5j43L14k70K27m21P7L95j44l18m7K78o0K7N4J3k49K00j39
5712a45L9r8O9J49L5m22M37k19K33k6L27l00k18K36j33p5K9L5J78l04K92Q0k38
5735c9L5K09J4n13N4L59l7J70j97k08K79K5j67k02L23k93K17j00j0M3P1k94L55
$$ plain form
5758 94 -149 -70 -52 -19 13 23 -114 217 8 93 -3 -110 -24 -80 121 -68 -248 -85 -24 87 208 -173 119 37
5782 37 176 109 -22 -80 78 -93 132 271 82 19 -61 59 -183 -125 -102 -70 -74 13 80 167 100 31 15 17 152 -87
5808 -87 -31 39 -280 98 -98 -73 -102 -2 188 -74 31 -3 16 -57 -34 38 89 -137 -229 135 -53 -38 126 75 -326
5833 -326 63 -180 56 64 173 -6 -93 16 180 205 -113 -87 -231 103 -144 123 -172 417 -93 -86 -329 -31
5855 -31 -13 -276 -51 16 173 -110 10 -66 -16 -66 16 -205 31 -343 -66 -230 175 -53 149 -115 62 240
5877 240 230 255 96 158 -154 -142 -88 -100 30 -189 44 -175 -66 129 102 84 63 -209 -136 -221 60 214 -90 188
5901 188 -254 151 -181 289 -65 69 413 -46 -147 -14 36 34 457 -175 -78 -185 -70 88 333 -215 13
5922 13 -33 408 15 82 -98 195 75 6 55 -234 24 112 110 14 -26 68 63 99 -25 -123 108 -75 -93 21 25 70
$$ packed form
5758I4k43P9J8L3L2J0j37L31k09Q5r6j07Q6n6K01j89j80J63O1J11J21l81K92q2
5782C7J39o7j31n8J58j71K25J39j89o3q0J20k42N8K3L2mQ7O7Q7o7o9j6KJ35k39
5808h7N6P0l19L78j96K5k9J00J90k62J05l4J9p3K3P2N1k26r2L64j88J5J64n1m01
5833c26L89k43K36QJ09j79q7J09J64K5l18K6j44L34k47K67k95N89n10Pk43K98
5855c1J8k63K25O7J57k83J20p6N0n0Q2k21K36l74K77j64M05k28K02k64J77J78
5877B40j0K5j59O2l12J2N4j2J30k19K33k19J09J95k7j8k1k72P3q5K81J54l04K78
5901A88m42M05l32M70l54J34L44m59j01J33N0kM23o32R7j07J15J58K45n48K28
5922A3m6M41l93O7j80K93j20o9M9k89K58Q8kr6m0R4nL6j24r8K31j83j8J14MM5
$$ plain form
5948 70 60 102 -138 73 -6 48 -211 230 -103 -117 81 -136 82 -29 151 36 -32 47 -104 136 266 -86 154
5971 154 104 264 -249 128 -249 -226 -193 107 -83 -74 15 32 -71 19 -116 135 4 91 118 248 -3 -89 -129 -277
5995 -277 -271 -90 -112 119 9 -82 42 41 28 104 112 54 147 48 -10 -9 101 -252 171 -236 154 -1 81 -150 -15 -150
6021 -150 -172 -89 149 -309 -2 121 -164 219 -69 118 275 -64 141 69 -240 63 87 -265 -180 175 -166 -86
6043 -86 -241 228 240 194 -154 180 -66 -133 -59 -180 148 181 -143 -75 -60 -130 -6 29 161 -19 -64 -87 78 110
6067 110 -36 -78 -17 53 33 -233 -9 -223 -102 -168 -266 -54 72 70 -45 31 -345 -79 13 -47 49 7 20 -240 6
6092 6 222 -32 -133 71 -112 -106 -77 -21 -210 47 223 -67 56 60 -17 -87 -68 34 -12 -85 -38 -72 -56 -89 389 -77
6118 -77 63 -198 -196 -276 -22 -396 -88 67 4 79 -71 47 146 -26 -109 57 103 -90 -10 -56 246 118 -149 27
$$ packed form
5948G0j0M2k40K11p9N4k59M41l33j4J98k17K18j11J80j15o8P9j51K40J30l52K40
5971A54n0J60n13L77l77K3L3L00j90RQ9J7j03R0j35K51j31Q7K7J30k51q6m0j48
5995b77OJ81k2K31j10r1J24jj3P6Qn8R3r9n8JJ10l53M23m07L90j55Q2k31J35j35
6021a50k2Q3K38m58L07J23k85L83k88J87J57l39K05p2l09L03K4l52Q5L55l41Q0
6043h6j55M69J2m6l48L34k46o7P4j21L28L3l24O8J5p0J24L5J32j80m5k3J65L2
6067A10j46m2O1P0k0k66K24k14J21o6r8K12J26kj15P6l76K66R2o0R6m2J3k60K46
6092FK16k54j01K04j83OK9N6j89K57J76k90J23Mp7p0J9J02m6p3M7l4J6l3M78m66
6118g7J40k61Kq0K54l74L08J55o3P5j50J18R9j72q3J66M6j93Q0m6L02j28k67J76
$$ plain form
6142 27 7 164 -146 -187 -21 -42 -198 -112 59 -27 -21 103 -9 50 131 81 87 222 216 -167 -38 -79 -296 -154 96
6167 96 -46 -211 -23 40 281 -191 241 85 -6 -38 -35 -187 51 -139 120 71 -18 151 -273 85 11 97 74 105
6191 105 333 54 -37 106 -179 -32 62 -172 138 90 74 -144 73 -157 -468 -24 -23 135 -177 258 -91 162
6213 162 1 -26 208 -140 190 32 -119 -4 -47 153 -201 -60 -22 -8 -152 -164 47 99 43 -61 -40 -105 -107 113
6237 113 -255 52 37 27 -29 48 234 -9 6 -38 207 -393 -429 -74 -352 -15 23 -110 -31 -10 81 85 91 46 -205
6262 -205 -278 231 122 146 -32 -80 215 239 66 32 -28 -46 48 -178 35 129 -22 -115 119 134 30 -188 270 21
6286 21 -83 -42 -43 -155 -51 147 -50 207 -45 28 104 25 -236 -183 -1 184 205 81 -111 -259 11 -44 -85 7
6310 7 -41 -62 8 -97 -125 11 20 -111 -74 -28 169 345 -5 82 149 -125 -44 -43 -171 -24 -315 -147 24 213 274
$$ packed form
6142B7k0J57l10m1J66k1j56Q6J71q6OJ24j12N9Q1n0OJ35ol83J29m1k17J42K50
6167I6j42j65J88O3K41m72M32j56r1l2Lj52K38j90K59m9q9J69m24L58p4Q6k3L1
6191A05K28k79r1J43k85J47R4k34L10m8j6k18K17k30l11M44JJ58l12M35l49K53
6213A62j61k7K34l48L30j58j51J15m3K00l54J41L8J4j44j2K11N2n6j04K1o5kK20
6237A13l68L07j5j0n6P7J86k43J5m4K45o00l6L55k78L37L8j33P9K1R1MOm5k51
6262b05p3N09j09K4j78m8K95K4j73l4o0j8R4k26K13R4j51r3K34J5j04k18M58k49
6286B1j04M1jj12J04J98j97K57k52P3P6p9k61N3J82J85K1j24j92j48K70n5m1R2
6310Gm8k1P0j05k8J36Rj31L7M6J97J76l50Q7O7k74Q1Jj28J47k91J68J71J89O1
$$ [...]
8191C31
##END NTUPLES=NMR FID
##END=
