##TITLE=1H_DE-87_4k
 200.13MHz, CDCl3,
 8 sc
 
 24.4.2025
##JCAMPDX= 6.0         $$ Bruker NMR JCAMP-DX V2.0
##DATA TYPE= NMR FID
##DATA CLASS= NTUPLES
##ORIGIN= UXNMR, Bruker Analytische Messtechnik GmbH
##OWNER= pz
$$ XWIN-NMR		Version 3.5
$$ Thu Apr 24 15:23:37 2025 Russian Standard Time (UT+4h)  she@DPX200
##.OBSERVE FREQUENCY= 200.1313
##.OBSERVE NUCLEUS= ^1H
##.DELAY= (6, 6)
##.ACQUISITION MODE= SIMULTANEOUS
##.ACQUISITION SCHEME= undefined
##.AVERAGES= 8
##.DIGITISER RES= 18
##SPECTROMETER/DATA SYSTEM= spect
##.PULSE SEQUENCE= zg30
##.SOLVENT NAME= CDCl3
##.SHIFT REFERENCE= (INTERNAL, CDCl3, 0, 14.3821)
##AUDIT TRAIL= $$ (NUMBER, WHEN, WHO, WHERE, WHAT)
$$ ##TITLE= Audit trail, XWIN-NMR		Version 3.5
$$ ##JCAMPDX= 5.01
$$ ##ORIGIN= Bruker BioSpin GmbH
$$ ##OWNER= she
$$ F:/spectra/data/she/nmr/H-C/1/audita.txt
$$ ##AUDIT TRAIL=  $$ (NUMBER, WHEN, WHO, WHERE, WHAT)
(   1,<2025-04-24 15:22:04.95 +0400>,<she>,<DPX200>,
      <created by zg, POWCHK disabled, PULCHK disabled
       configuration hash MD5:
       00 E9 B6 7A A2 85 ED C7 34 08 36 98 17 FE 4E 26
       data hash MD5: 16K
       F0 42 83 BD 1D 6C E9 88 B6 5F CC 20 34 A2 82 9B>)
$$ ##END=
$$ 
$$ hash MD5
$$ FE 6E 5C 06 F2 7E 8E 39 8B 4F 43 48 ED E2 AC 0A
##$RELAX= 
##$RELAX= 
##$RELAX= 
##$RELAX= 
##$RELAX= 
##$RELAX= 
$$ Bruker specific parameters
$$ --------------------------
##$DU= <F:/spectra>
##$EXPNO= 1
##$NAME= <H-C>
##$PROCNO= 1
##$TYPE= <nmr>
##$USER= <she>
##$AMP= (0..31)
100 100 100 100 100 100 100 100 100 100 100 100 100 100 100 100 100 100 
100 100 100 100 100 100 100 100 100 100 100 100 100 100 
##$AQSEQ= 0
##$AQ_mod= 1
##$AUNM= <au_zg>
##$AUTOPOS= <>
##$BF1= 200.13
##$BF2= 200.13
##$BF3= 200.13
##$BF4= 200.13
##$BF5= 200.13
##$BF6= 200.13
##$BF7= 200.13
##$BF8= 200.13
##$BYTORDA= 1
##$CFDGTYP= 0
##$CFRGTYP= 5
##$CHEMSTR= <none>
##$CNST= (0..31)
1 1 145 1 1 1 1 1 1 1 1 1 1 1 1 1 1 1 1 1 1 1 1 1 1 1 1 1 1 1 1 1 
##$CPDPRG= <>
##$CPDPRG1= <>
##$CPDPRG2= <>
##$CPDPRG3= <>
##$CPDPRG4= <mlev>
##$CPDPRG5= <mlev>
##$CPDPRG6= <mlev>
##$CPDPRG7= <mlev>
##$CPDPRG8= <mlev>
##$CPDPRGB= <>
##$CPDPRGT= <>
##$D= (0..31)
0 0.7 0 0 0 0 0 0 0 0 0 0.03 0 0 0 0 0 0 0 0 0 0 0 0 0 0 0 0 0 0 0 0 
##$DATE= 1745493724
##$DBL= (0..7)
120 120 120 120 120 120 120 120 
##$DBP= (0..7)
150 150 150 150 150 150 150 150 
##$DBP07= 0
##$DBPNAM0= <>
##$DBPNAM1= <>
##$DBPNAM2= <>
##$DBPNAM3= <>
##$DBPNAM4= <>
##$DBPNAM5= <>
##$DBPNAM6= <>
##$DBPNAM7= <>
##$DBPOAL= (0..7)
0.5 0.5 0.5 0.5 0.5 0.5 0.5 0.5 
##$DBPOFFS= (0..7)
0 0 0 0 0 0 0 0 
##$DE= 6
##$DECBNUC= <off>
##$DECIM= 32
##$DECNUC= <off>
##$DECSTAT= 4
##$DIGMOD= 1
##$DIGTYP= 9
##$DL= (0..7)
0 120 120 120 120 120 120 120 
##$DP= (0..7)
150 150 150 150 150 150 150 150 
##$DP07= 0
##$DPNAME0= <>
##$DPNAME1= <>
##$DPNAME2= <>
##$DPNAME3= <>
##$DPNAME4= <>
##$DPNAME5= <>
##$DPNAME6= <>
##$DPNAME7= <>
##$DPOAL= (0..7)
0.5 0.5 0.5 0.5 0.5 0.5 0.5 0.5 
##$DPOFFS= (0..7)
0 0 0 0 0 0 0 0 
##$DQDMODE= 0
##$DR= 18
##$DS= 0
##$DSLIST= <SSSSSSSSSSSSSSS>
$$ [...]
##$SUBNAM0= <"">
##$SUBNAM1= <"">
##$SUBNAM2= <"">
##$SUBNAM3= <"">
##$SUBNAM4= <"">
##$SUBNAM5= <"">
##$SUBNAM6= <"">
##$SUBNAM7= <"">
##$SUBNAM8= <"">
##$SUBNAM9= <"">
##$SW= 18.0517328524113
##$SWIBOX= (0..15)
0 0 2 0 0 0 0 0 0 0 0 0 0 0 0 0 
##$SW_h= 3612.71676300578
##$TD= 16384
##$TD0= 1
##$TE= 0
##$TE2= 300
##$TE3= 300
##$TEG= 300
##$TL= (0..7)
0 120 120 120 120 120 120 120 
##$TP= (0..7)
150 150 150 150 150 150 150 150 
##$TP07= 0
##$TPNAME0= <>
##$TPNAME1= <>
##$TPNAME2= <>
##$TPNAME3= <>
##$TPNAME4= <>
##$TPNAME5= <>
##$TPNAME6= <>
##$TPNAME7= <>
##$TPOAL= (0..7)
0.5 0.5 0.5 0.5 0.5 0.5 0.5 0.5 
##$TPOFFS= (0..7)
0 0 0 0 0 0 0 0 
##$TUNHIN= 0
##$TUNHOUT= 0
##$TUNXOUT= 0
##$USERA1= <user>
##$USERA2= <user>
##$USERA3= <user>
##$USERA4= <user>
##$USERA5= <user>
##$V9= 5
##$VALIST= <valist>
##$VCLIST= <CCCCCCCCCCCCCCC>
##$VD= 0
##$VDLIST= <DDDDDDDDDDDDDDD>
##$VPLIST= <PPPPPPPPPPPPPPP>
##$VTLIST= <TTTTTTTTTTTTTTT>
##$WBST= 1024
##$WBSW= 4
##$XGAIN= (0..3)
0 0 0 0 
##$XL= 0
##$YL= 0
##$YMAX_a= 126318
##$YMIN_a= -169619
##$ZGOPTNS= <>
##$ZL1= 120
##$ZL2= 120
##$ZL3= 120
##$ZL4= 120
##$ABSF1= 10
##$ABSF2= 0
##$ABSG= 5
##$ABSL= 3
##$ALPHA= 0
##$AQORDER= 0
##$ASSFAC= 0
##$ASSFACI= 0
##$ASSFACX= 0
##$ASSWID= 0
##$AUNMP= <proc_1d>
##$AZFE= 0.1
##$AZFW= 0.1
##$BCFW= 1
##$BC_mod= 2
##$BYTORDP= 1
##$COROFFS= 0
##$CY= -3
##$DATMOD= 1
##$DC= 2
##$DFILT= <>
##$DTYPP= 0
##$F1P= 0
##$F2P= 0
##$FCOR= 0.5
##$FTSIZE= 0
##$FT_mod= 4
##$GAMMA= 1
##$GB= 0.15
##$INTBC= 1
##$INTSCL= 1
##$ISEN= 128
##$LB= 0.25
##$LEV0= 0
##$LPBIN= 0
##$MAXI= 10000
##$MC2= 0
##$MEAN= 0
##$ME_mod= 0
##$MI= 1.114404
##$NCOEF= 0
##$NC_proc= 0
##$NLEV= 6
##$NOISF1= 3.799351
##$NOISF2= 2.8
##$NSP= 1
##$NTH_PI= 0
##$NZP= 0
##$OFFSET= 14.38212
##$PC= 1
##$PHC0= -830.8537
##$PHC1= 8.9922
##$PH_mod= 1
##$PKNL= yes
##$PPARMOD= 0
##$PSCAL= 0
##$PSIGN= 0
##$REVERSE= no
##$SF= 200.129724274929
##$SI= 16384
##$SIGF1= 3
##$SIGF2= 2
##$SINO= 400
##$SIOLD= 16384
##$SREGLST= <1H.CDCl3>
##$SSB= 0
##$STSI= 0
##$STSR= 0
##$SW_p= 3205.1282051282
##$SYMM= 0
##$S_DEV= 0
##$TDeff= 0
##$TDoff= 0
##$TI= <>
##$TILT= no
##$TM1= 0
##$TM2= 0
##$TOPLEV= 0
##$USERP1= <user>
##$USERP2= <user>
##$USERP3= <user>
##$USERP4= <user>
##$USERP5= <user>
##$WDW= 1
##$XDIM= 8192
##$YMAX_p= 0
##$YMIN_p= 0
$$ End of Bruker specific parameters
$$ ---------------------------------
##NTUPLES= NMR FID
##VAR_NAME=  TIME,          FID/REAL,        FID/IMAG
##SYMBOL=    X,             R,               I
##VAR_TYPE=  INDEPENDENT,   DEPENDENT,       DEPENDENT
##VAR_FORM=  AFFN,          ASDF,            ASDF
##VAR_DIM=   8192,          8192,            8192
##UNITS=     SECONDS,       ARBITRARY UNITS, ARBITRARY UNITS
##FACTOR=    0.0002768,     1,               1
##FIRST=     0,             0,               0
##LAST=      2.2672688,     0,               0
##MIN=       0,             -169619,         0
##MAX=       2.2672688,     126318,          0
$$ Real data points
##PAGE= N=1
##DATA TABLE= (X++(R..R)), XYDATA
0@%%%%%%%%%%%%%%%%%qJ6j6J6j6J9k7L2l2L9m7N1n9O7p5Q7r9J11j26J41j57J75
39I2j95K17k40K66k95L26l59L96m37M82n30N83o43P10p82Q64r59J065j191J337
59G07j509J717j975K310k752L365m277N773q623J5845o7653j12547J91819P6903
73I9103o6960N0182M3993p0654K566M0470m5047k8153K9112p2061q3649N4684
85d6414J2381p3598O1468O4771p7847p063P4831j3116k495N4514o442l7488Q234
98A1736J5763J2557L0693k0755q8283k071P7218k5933n9531K5896p261l5586K9343
111c6214J2247o574M1079J1089l0829J8779M5509J015j1833J9816j4748o7114
123a7778j3218K5037j8385k484J2038l4896q682M0151K5987J8271P94l0338r786
$$ y = [0, 0, 0, 0, 0, 0, 0, 0, 0, 0, 0, 0, 0, 0, 0, 0, 0, 0, -8, 8, -8, 8, -8, 11, -16, 16, -16, 23, -24, 27, -32, 35, -40, 47, -52, 59, -67, 74, -83, 92, -103, 114, -126, 140, -155, 171, -188, 208, -229, 253, -277, 306, -337, 373, -409, 455, -504, 561, -630, 707, -802, 915, -1060, 1250, -1502, 1863, -2414, 3359, -5264, 10581, -57072, -169619, 22200, 99103, 32143, 82325, 126318, 55664, 58230, 98700, 53653, 25500, 54612, -17449, -101098, -46414, -34033, -107631, -46163, 18608, -59239, -66302, 8529, -4587, -7082, 47432, 40990, 3502, 11736, 27499, 40056, 70749, 49994, -38289, -40360, 36858, 10925, -48606, -22710, -29971, -65557, -36214, -23967, -30541, 10538, 21627, -9202, 9577, 55086, 56101, 44268, 64084, 49336, -17778, -30996, -5959, -24344, -26828, -14790, -49686, -58368, -18217, 7770, 26041, 26835, -3503, -13289]
136a3289K1867J9272m710j0912J0371k393k4968O454J3243j1466q671j9240k5095
149d9537K644J0990J4974J7188m956k122Q790P276K8722K1935j5670j6712j2729
162A0793p212J4239P094j2593j9744j8833K371O174R97J7125q35j9170N030J887
176a2677k144K3523O534j6213m308j427L302J5820J0254l013j9766j4369O664
189g820J287O370J1285j8726j0597J7780M652J0793J7442j2743j6703j972m248
202c200q26K071K69r001j6572L889J1783J757J6614N899k1984j323J1382J971
216B729J6102Q171j5985r812J101P838P088k530n615j6826j6156P279L098k857
230a6375Q698p119j2715J2400J1227R214J5836N99o621m041k174Q426L718o332
$$ y = [-13289, 8578, 27850, 23140, 12228, 22599, 20206, -4762, 1692, 14935, 3469, -5202, -24442, -49537, -46893, -35903, -20929, -3741, -8697, -10819, -2029, 5247, 33969, 55904, 40234, 23522, 10793, 3581, 17820, 24914, 12321, -7423, -26256, -23885, -17711, -16714, 411, -424, -19594, -14564, -12677, -14821, 8702, 15236, -977, -5285, -6712, -3410, 12410, 22664, 19651, -115, -14484, -7820, -6533, -163, 11122, -7604, -18201, -421, 4231, 15024, 32466, 19723, 3020, 1048, -3200, -4026, -1955, -1686, -10687, -27259, -23370, -11587, -9830, 6784, 12683, -9301, -10624, 758, 2729, 18831, 27002, 11017, 1205, 2306, 10144, 17232, 14702, 9087, -7739, -23895, -16616, -13518, -16375, -7677, -14796, -27511, -15111, -3884, 5330, 21166, 21765, 15144, 11103, 8929, 17355, 21073, 14741]
244A4741q371j8064p331J1016L500K307j4j5847l951J0002N328R979K408p755
258b052K70K439O930J3961J180n173p684j3749j9M019m033J09r172j2667M045
273b1596P808J0290J3083l119n734J634J319J0474P094o585n444r763n973Q486
287A974L379k251k963j2681n460M667J808P272J770q928P98M385O800J5431M452
302B0453l721l111p632M48O088l107l561j0657j4321Q90M443M962Q290m747p442
317a2725K623L753R858R518l121l562m449k707R745N390j307j785j1148p683L200
332d400j91J717J80j0083l774J511M610J2731M553j796M50l804K800J0256k29
347A4531l903o539j0150O6L826N72L296m985p999J054J712O617Q262n014m235
$$ y = [14741, 6370, -11694, -19025, -8009, -4509, -2202, -2216, -18063, -22014, -12012, -6684, 3295, 5703, -2052, -1782, 657, 7587, 21548, 22728, 17555, 9871, -3878, -3897, 122, -3911, -3802, -12974, -25641, -21596, -13788, -3498, 9585, 6466, 732, 2366, 3685, 14159, 21253, 14668, 9224, -539, -6512, 1974, 5353, 3102, 139, -12542, -18002, -13335, -11527, -4255, -2485, -11413, -10615, -6230, 570, 16001, 20453, 16732, 13621, 5989, 6437, 12525, 9418, 5857, -4800, -19121, -18231, -13788, -8826, -536, -5283, -12725, -10102, -6349, 3509, 13027, 9906, 6344, 1895, -812, 8933, 14323, 13016, 11231, 83, -7600, -4400, -4591, -2874, -2694, -12777, -16551, -15040, -10430, 2301, 6854, 5058, 5508, 1704, 4504, 14760, 14531, 10628, 4089, -6061, -5995, -2169, -1597, 1699, -3286, -11285, -10231, -8519, -1902, 6360, 1346, -2889]
362b889q74j551Q457P551K83j184q226n034N379J935J447r89j1223n851J893K021
378h855Q810L397m687m97j340K840Q942J563q88l268r978m1N176L59K175m123
394d15q954N58L140L887N101k583m217j739p25Q754O194j927K63m601m975O566
410D327K605j525J79q435p628K62K445M886K046l286k111k961N071J1874J089
425H838j433L38p844m20Q157k67j632j263p801l575K318L438J331l834j876k044
441g569l532Q320O768l458L151l67p272O100Q791j734k190l593o442k320M458
456h89M318l843o069P10l329R41J2403L04n099M118l569l586Q725L068l476j233
472C494l017m404J13N977K832n981l201r85n595N801R614n310j823L415m676L883
$$ y = [-2889, -3763, -5314, 3143, 10694, 10977, 9793, 1567, -3467, 1912, 3847, 5294, 4305, -6918, -12769, -10876, -8855, -45, 3352, -1335, -1832, -3172, -332, 8610, 10173, 9285, 6017, -3961, -4002, 1174, 1533, 3708, -415, -9369, -8811, -5671, -1784, 3317, 734, -3483, -5222, -5947, 2807, 9001, 7074, 7337, 2736, -2239, 4327, 6932, 5407, 5586, -2849, -10477, -10215, -7770, -2884, -838, -4124, -6235, -9196, -4125, 7749, 8838, 7405, 7743, -101, -521, 7636, 7369, 5737, 4474, -3327, -6902, -4584, -1146, 185, -3649, -5525, -7569, -11101, -2781, 3987, 529, 3680, 3313, -3959, 2141, 10932, 9198, 7008, 3415, -3027, -5347, -889, 3429, -414, -6483, -5773, -9102, -8161, 4242, 4546, -553, 3565, -4, -3590, 5135, 8203, 4727, 3494, 477, -3927, -3814, 2163, 4995, -986, -4187, -5172, -10767, -4966, 4648, -662, -2485, 930, -3746, 137]
488A37R887k88m354j822k428k081J065M453l444o817K143k440m101R052L771o463
504c730J456n02l526P088P538j561l548k563o8J086L714L525o303n854J010k259
520d497J375N695m744l957J889k459K042N960R79M67l02j932K64J338L517R06
536F541n767l084j449k07O343K928o550j524p78j014N338K138k764r13k261P33
552b290M502J484R19j795l350p68j028O43L439j326j704j088l908L559O021o41
568B669m1j621n194K856N971P69k020l253k443LJ354K500o44l088L56k042r19
585d787O774M82k861J998k160l379M475K750j06O76k517l100KL758K851m751k567
602b462r07l896M262O800l335j728K200l060J017N024r1j843p84j935j631J188
$$ y = [137, 10024, 9736, 5382, 3560, 1132, -949, 116, 4569, 1125, -5692, -3549, -5989, -10090, -1038, 2733, -3730, -2274, -2776, -6302, 786, 8324, 6763, 3215, 652, 584, 1670, 5384, 8909, 2606, -3248, -2238, -4497, -3122, 2573, -2171, -6128, -4239, -6698, -4656, 1304, 2283, 2750, 2448, 516, 780, 2118, 5635, 6541, 774, -2310, -3759, -3966, 2377, 5305, -1245, -2769, -3547, -4561, 777, 2915, 151, -762, -3023, -2290, 2212, 3696, 4615, 2820, -530, -1298, -2326, -1683, 1756, 430, -1274, -2362, -6270, -2711, 3310, 2669, 2628, 1007, -4187, -1331, 4640, 5409, 3389, 136, -2307, -2304, -950, 1550, 906, -2182, -1826, -3868, -4787, 1987, 2469, -392, 1606, -554, -3933, 542, 3292, 3186, 3862, 1345, -1755, -1753, 2005, 4856, 105, -2462, -3369, -7265, -3003, 3797, 462, -1266, 934, -2126, -1109, 3915, 3824, 1981, 1197, -738, -2369, -1181]
618a181L899k75m081O97j575k982N605K622l631R51j069k902M832L840q48j514
634B388k099q51P0K436K147l587l130R71k608J80M911j261k317J054j679J590
650a785M461J570p13j464j619J67L60K337J069l877k157l46j183L547J298l385
666a720j184j502j018L769K849J65N8j802M55J904J534K086j626l619m66j129
682a246J53K971j419k625m75j654P19L174P22L07j421j808K047J829J315J863
698D452k421j916J80o05K106J718l120j268j802j272K616J163m46j32j936j23
714b806K786J260J898P6k420p73P7J46K814q31k403j034j384O61K787n10o82o17
732i55k346J089K340O90J172j476j818J344L07J834J737k267j511j067j375K443
$$ y = [-1181, 2718, 2443, -1638, -941, -2516, -5498, 107, 2729, -902, 49, -1020, -3922, 910, 4750, 3902, 2388, 289, -562, -492, 1944, 4091, 504, -2626, -1655, -4263, -4083, 828, -433, -2750, -1696, -3375, -1785, 2676, 4246, 3533, 2069, 450, 617, 977, 3314, 4383, 506, -1651, -1997, -3180, 367, 1665, -1720, -2904, -4406, -5424, -1655, 1194, 1359, 1417, -385, 70, 1974, 3508, 5594, 3968, 349, -117, -1246, -1093, 1878, 459, -2166, -2641, -4295, -3576, -402, 320, 627, -794, -2602, -555, 1274, 2589, 4452, 2031, 115, 295, -310, 1796, 3514, 394, -874, -2676, -3948, -1332, -169, -615, -747, -2683, -2806, -20, 1240, 3138, 3214, 794, 21, 98, 244, 3058, 2227, -176, -1210, -2594, -1933, 854, 344, -338, -955, -3301, -2212, 128, 818, 1990, 514, -1304, 40, 347, 2181, 3918, 1651, 140, -927, -2302, 141]
748A41J253j252n91j795r22K302J039J484j29k771k63J206N46K277m27j985o80
765e67r44O61K385l46o89o32k145Q58J457L33R47j307j741P23M87J583J660j475
783A248j818n87o59K021J401j164n57j704p68K781M96L63L08j983o56J412K83
800D17J306J23k009l21p43J96K083l39o09o53j656O20J806M73N15o91k111Q05
818g88J220O29J812j399j963q1l84J333J111j389r29j090o35K012R29k03J083
835A268j661q28J304L20J241O57j730q41j79k68K339k76j327n66j453K08J951
852A59L2L7o88j795J110J433M00J552q27j473M93l72Q55J204j258j057r31j068
870b194J464P35l59N66k019n98J690P20Q02P55j588m32O01L11J626M77j890p01
$$ y = [141, 1394, 142, -449, -2244, -3166, -864, 175, 1659, 1530, -1241, -1504, -298, 248, 2525, 2098, 113, -567, -1511, -850, 1535, 1189, 500, -132, -2277, -1419, 38, 371, 1318, 11, -1730, -1007, -520, 1063, 2723, 1248, -570, -1157, -1816, 205, 1606, 442, -115, -1819, -2587, 194, 690, 1053, 1361, -622, -1278, 134, 417, 1723, 1846, -163, -484, -1227, -1031, 1052, 713, 104, -549, -2205, -1585, 221, 694, 1209, 518, -1593, -788, 432, 1061, 2873, 1474, -489, -570, -954, 379, 1490, 101, -828, -1918, -2553, -541, 388, 185, 1268, -393, -1221, 83, 403, 1644, 2301, 571, -270, -449, -717, 1622, 1346, 19, -547, -2000, -1792, 159, 191, 228, -460, -2255, -1145, 288, 688, 2240, 1413, -60, 433, 61, 916, 2120, 862, -195, -1126, -2194, -730, 5, -354, 212, -1807, -2405, -715, 5, 807, 1562, -26, -458, 143, 454, 2080, 2557, 667, -34]
888c4r01k7J941o45l59k85k121O93J134M88R42m75j225N18J89J111J411r50j075
907C30p84n34J200J080r16j11j302j111J225J90P52Q39j680l33P63j84J600P34
925A758j248k23o65J35J870p25k88k27k061M64J087j60P20m25j509L68N21Q33
943B25J350k60j271j40o00J004J040n30l38r10j055R45P51P2L81j611r07R89L62
962e03Q80R81j725Q1k25j7J294R99q42n38j050m6J503m12L28j46j914L53N15O
982d78J470j01j617L85k81O84J034j00o80m91r08R71P00K2L10j216j010Q31R1
1001c84P41Q97j312q02K98k48J365N27m05n50j057N6J319m6N18m49j546L47J242
1020E11p71J451j31j761K12R5K79Q19J96o39o94m37P74L93l1P03j268j220J311
$$ y = [-34, -935, -962, 979, 334, -25, -310, -2431, -1738, -604, -116, 826, 351, -874, -356, -167, 944, 2355, 1405, 330, -454, -988, 212, 1292, 376, 265, -1037, -2148, -923, -733, 19, 858, -822, -1155, -392, -576, 1024, 1758, 510, 287, -378, -243, 1627, 902, 614, 387, -1674, -1210, -123, -283, 437, 12, -1497, -1129, -608, 225, 1575, 1315, 44, -96, -696, 308, 1348, 818, 480, -430, -1485, -540, 211, 283, 664, -947, -1854, -865, -503, 377, 1358, -367, -286, -511, -528, 766, 1765, 923, 385, -665, -711, 792, 380, 708, 562, -1352, -999, -484, -478, 992, 891, -726, -341, -622, 62, 1096, 996, 316, -175, -1083, -112, 588, 610, 920, -296, -1306, -475, -384, 357, 1254, -58, -860, -562, -810, 555, 1082, 677, 127, -930, -874, 445, 399, 917, 468, -1078, -731, 511, -260, 1191, 1060, -701, -489, -394, -115, 704, 900, 261, -433, -870, -96, 297, 266, 969, -299, -1519, -208]
1039b08N45k86J152r44r17O08J38J48P54o50l33p65j35J352l01J29K54j535j2
1058a006R02J48O05L93j420l40M55L06J024j65p93m96n17P11M72K4K59p69j422
1077a629J125K23K35Q85q56q15L43M38N17O08k81m04m87l61P62M55n81R6j244
1096i71k97J120K2M66P1j253k39O16K49O27P74r61J76q90P03O13j39j37n43q24
1116h17N08M70m29M81l75m80j33L13J41J022m99k20j01j99Q28M67m04J21p71n12
1136e89Q85m8k5K94j192k70K43k06R42N35j104m7K05M79P48k38P1k85r52O13M69
1157E28j67Q7k30j017J23L94j41J069o85p85J57P4L36R35k75J00p74k73R76K13
1177F45j58j44o62j91K93j34M80K38j038q1M35j66J091j21l26q5l94J25P41j32
$$ y = [-208, 337, 51, 1203, 259, -658, -50, 88, 236, 990, 340, 7, -758, -893, 459, 158, 287, 541, -994, -1006, -104, 44, 649, 1042, -378, -718, -263, 43, 1067, 902, 109, -387, -904, -193, 279, 303, 562, -207, -1629, -504, -281, -46, 839, -17, -832, -489, -51, 466, 1074, 793, 389, -98, -459, 303, 758, 177, 273, -971, -1268, -148, -126, 340, 411, -842, -1081, -465, -216, 411, 1185, 224, 400, -490, 213, 826, 687, 550, 7, -817, -309, 161, -268, 213, -162, -642, -775, -462, -321, 701, 202, -18, -119, -318, 510, 977, 573, 694, -77, -589, 296, 248, 223, 517, -675, -945, -702, -908, 34, 569, -535, -582, -377, 102, 850, 612, 683, 398, -554, 59, 528, 361, 448, 218, -799, -676, -282, -423, 646, -39, -824, -667, -593, -257, 678, 403, 503, -271, -544, 432, 645, 487, 343, -319, -510, -217, -351, 129, 367, -671, -752, -317, -483, 608, 487, 161, 76, -318, -193, 548, 416]
1197D16K42l95r12L70L30J93L08l80r18L22k9L81M79k37l07j34l86P58K37j6j28
1218A94l39n49Q25j21L3M97q11r6l7j14Q85J84o64P0l19O2Q18m00K4K83j192M21
1240c46J26J09P63l17o84K80m84M65O91k40n01j68j80L67M74J56q9p89k08N25
1260e0K02K98m5q41J0L51m36Q23L92n79j32n87O19L89j03K32q0r90J33N03M5J57
1282C11j12o52L71q7j18R51n32k86R8n26M63O81k30j16k90l73M45L15k50K78m74
1303a33k21k03J93K76Q37m41l49j25mN22K92k91J5n71pK80l2M81p5o04k91L24
1325a27J60N98k93o73M39n43L59K83M2N4j70o02L22K72n4J67n42n32P09j54M51
1346A66M20p58R8k00p1O45M2l5j32k69k75N71j5n3J51j009L34J19L62K78j57n70
$$ y = [416, 658, 263, -649, -279, 51, 244, 552, 172, -746, -424, -453, -72, 407, 170, -137, -271, -657, 101, 338, 322, 194, -145, -694, 131, 10, 43, 540, -271, -367, -404, -518, 367, 551, -113, -43, -362, -300, 518, 118, 142, 425, -767, -346, -220, -111, 652, 335, -349, -69, -553, -88, 603, 363, -138, -306, -486, -119, 355, 511, 422, -367, -575, -50, 152, 450, 405, -436, -426, -75, -511, 312, 704, 125, -7, -594, 25, 414, 311, 543, 463, -527, -394, 109, 154, 311, 199, -453, -82, -169, -287, 664, 132, -154, -56, -582, -119, 562, 332, 216, -74, -447, -2, 313, 63, 341, -133, -354, -557, -364, -88, 749, 308, -41, -166, -170, 352, 644, 353, 368, -203, -210, 70, 38, 519, 444, -160, -451, -127, 33, 631, 338, -335, 104, -439, -80, 203, 245, 299, 129, -473, -151, 121, 67, 234, -308, -840, -131, -285, 166, 586, -172, -74, -274, -345, 300, 342, 307, 175, -94, -369, 202, 187, 134, 285, -724, -390, -271, 91, 369, 212, -358]
1368c58L93m86K93M02K42l39n3l20m3N56j15J78m10k97j77L22L09K80l50k70n5
1389b98J23N04K82n26K18l21j78M25M5J06j96l96r8n3K47K40J5o03RK52j45O29
1411B81J07k20k75n3J18M88k17K80k18n59J70L34j10J39j91p15K99j66O43J78
1431C13n37M76n90k25Q58L6M3J35m16j74K56l6K20N2m13j44j87J89M22j62j97
1452h1k82j40J16P76j60L7K34n27N8J93j88L78k07k78j91r1K74N62l22r9l85r3
1474d16M36K88l18K77m60J14M90l85J71K32n01j94K79M8K51R9p06J38k89Q6O17
1495B57j60k52K21o15L27M76l67M59r4l30P0n6L64M37o86k73jk00N99Q3m54J88
1517gl50j51K81N86J5o8m15k84L15J56M12j50l85J62j91j7L32O2j74J20l98j16
$$ y = [-358, 35, -451, -158, 244, 486, 147, 94, -226, -269, 287, 172, 350, -60, -357, -534, -212, 97, 377, 27, -243, -298, -175, 329, 611, 85, 303, -18, -196, 229, 274, 380, 184, -212, -310, -363, -116, 124, 139, -464, -455, -203, -348, 281, 388, 168, -107, -160, -42, 446, 229, 509, 291, -268, -98, 236, 126, 265, 74, -641, -342, -508, 135, 313, -224, 252, -338, -563, 295, 331, 374, 509, 93, -81, 175, 139, 359, 411, -2, -146, -333, -144, 278, 116, -81, -363, -503, -387, 389, 229, 266, 500, -27, 31, 224, 36, 414, 207, -71, -262, -353, -79, 483, 161, 62, -323, -416, 20, 308, -10, 267, -193, -79, 411, 26, 197, 429, -72, -266, 13, 61, 312, 411, -295, -157, -446, -360, 257, 97, -155, 66, -549, -222, 254, -113, 346, 252, -78, -8, -64, 300, 737, 51, -222, -223, -423, 176, 259, -195, -7, -357, -508, -227, 359, 374, 306, -109, -393, -78, 78, 490, 340, -45, 117, -74, -91, 241, 303, 129, 249, -149, -265]
1539b65J09J23K09k67k99J41N11lL95k27k76L8l28Q7K84j03Q9j74l86M45j50k5
1561g2J71l59l90K28M4L70L56o00K40j14J94J89J37k20j50j04J02K24k19K01j01
1582A27l19P5k47L30K38l12j53K32j09J92J12j05q4l21Q9L65R1N8P5l68j87K13
1604hR3j80L54n02rn2KM00J07k29K29l36j31N76l51L01N8j36k47K42N6m8j26o9
1628fj96J82J8m8j09K12j41m75M04L89m4K52j10m71L61j83J37L36l99n54L85k62
1650c22K44k9j82L8j2n1N65L9m24M74n00j7L90j2R2k24k63O4L33m3J57l8n73K26
1674f8l17K66km2J83q0l38J83L85R4L3l03L9n1k9K61L13m51l82P8j76L78O7J2
1698E3k1k42m6L55J03j17k17K10l9K08k98O06o24j07Q2l13J90O18l75n3k6j63
$$ y = [-265, -156, -33, 176, -91, -390, -249, 262, 259, 654, 427, 151, 189, -139, -52, 232, 129, 218, 44, -342, 103, -47, -72, 99, -260, -650, -422, -378, -8, 348, -252, -12, -126, 68, 257, 394, 174, 24, -80, 22, 246, 27, 228, 127, -192, -117, -364, -34, 204, -108, -261, -29, -138, 54, 166, 61, -23, -344, -255, 110, 201, 259, 334, -34, -221, -8, 85, -95, 259, -243, -252, -304, -302, 98, 205, -24, 205, -131, -262, 314, -37, 264, 322, 186, -61, 181, 237, 189, 63, -6, -202, -20, -2, -50, -159, 53, -88, -563, -159, 230, 186, 438, 328, -143, 218, 35, 172, 508, 109, -445, -60, -322, -78, -107, -289, -251, -263, -314, 251, 290, -134, 340, -160, -177, 213, 201, 293, 69, -194, -130, 203, 160, 317, 279, -294, -68, -385, -119, -121, -163, 20, -60, -398, -215, 170, 264, 297, -6, 33, -18, -47, 214, 527, 76, -306, -228, -404, -26, 41, 53, 32, -210, -256, 99, 202, 85, -132, 78, 39, 247, -51, 555, -69, -176, -94, -407, -217, 401, 26, -27, -53, -216]
1720b16NL73j5m7K71m42Q9r7l0L98J5j41j60k13M86m6m22L83l62NK90k26n8M65
1744C05p18J89J53J07K19j76k66L93l64J24M95n00k09L46m79O6O82m26J89m8n26
1765d44M28p5P7L39j55k42J82j65j7L78k68r4J89n96N49l6K41j17j62l38J76K17
1787F7J77p0o8j91jo7J01J19ml1r9p0j8K57pn8k62L35k43J13K38K9l26J28m31
1812c82M88L4k79P6j78M0J59M67k90m1j10j33K82k56K69J72j52l98K51J02J9o8
1834G2o9j69j85J14MK15N7N1n8J73k6K65J07k43m79J57r3J23L78l42j41k16K45
1857f0K88j53l00M57m04p5J22j9J16m1L19j05m1j29pK95j19m03J81k4K58J33m29
1880a40P1k29j12J88J66K19k67P3L23m07K96J18o1j83J1o2k40M59l63N8R8m57
$$ y = [-216, -211, 162, 147, 100, 371, -71, 18, -79, -109, 289, 304, 163, 3, -210, 276, 230, -192, 191, -171, -166, 124, -102, -160, 305, -413, -224, -71, 36, 255, 79, -187, 206, -158, -34, 461, -39, -248, 98, -381, -315, 367, -59, 130, 82, -444, -16, -91, -14, 325, 170, -72, 110, -55, -72, 306, 38, -56, 133, -463, 86, 50, 291, 174, 12, -326, -150, 67, 244, 174, 106, -85, -86, -153, -52, 67, 63, 32, -67, -137, -155, 102, 95, 37, -225, 110, -133, -20, 218, 247, -79, 49, -382, 106, 140, -139, -63, -241, -201, -42, 425, 135, 94, -16, -149, 133, -123, 146, 318, 166, -232, 19, 121, 140, 72, 3, -166, -351, -237, -233, -18, 39, 90, 32, 205, 179, 444, 551, 308, -171, -14, -107, 16, 394, 52, -89, -305, -60, 228, 75, -225, 232, -172, -247, -125, -144, -28, -69, 250, 145, 104, -25, -32, 263, 144, -259, -78, -102, 156, 289, -140, -69, -298, -410, -222, -56, 163, -104, -31, 292, -115, 181, 299, 238, 55, 66, 4, -236, 223, -140, -82, 16, -441]
1902d41N86l49M30j75j54J50n3m0J13K10k48J09k81j7K98j23j96J59k02l7J1M05
1924A55l29J91k56L36Ok53L09QO0l42R4j8L96k43o2j85o3l1O1K08q4j39Q9j33
1948b25J70K92K34l78j75L2k08L9K89J29k21J1j77L34k69J18j26o1K44k69K31
1969A4L5L11l91P9K6j11L20k31J5j28J2r1L26l30J64k53N3N6P5k29M44r8k48M85
1993C05m86K71P7k9l8l1J16k9j2m73M60m00k27P19k85N1N1k10K95l48K89J60k06
2016B0O1J06p4l4j42k06L41k27j0J59j68R5K43k4j27J17k30M4J58r3Q3m4j38K19
2040A29r0k62K40j15j27K52j04M5k9j25M4R8K78k05j00Q1J64k00J8j28L73l06
2062f9l6O2lK82l67K80k29J7j2K6j5J45k06J31K8j48K83k33O3N9j69L21l42j31
$$ y = [-441, 145, -204, 226, 51, -103, 47, -6, -46, 67, 277, 29, 138, -143, -160, 138, 15, -181, -22, -224, -261, -250, 155, -174, 17, -239, 97, 103, -150, 159, 167, 227, -115, -21, -39, 357, 114, 52, -133, -196, -227, -166, 42, -42, -181, -92, -225, -55, 237, 471, 93, -82, -50, -258, -219, 70, 199, -22, -11, -188, 146, -123, -5, -131, -192, 52, -217, 14, 49, 360, -31, 48, 74, -37, 283, 52, 67, -61, -49, -140, 186, -144, 20, -233, -180, -124, -49, -278, 166, 68, -180, 305, -181, 90, 167, 138, 100, 69, 185, 156, 144, -329, 131, -269, -496, 223, -62, -11, 40, -170, 125, -223, 66, 226, 20, 81, 187, 113, 79, -63, -269, 72, -155, -165, -6, -174, -79, 164, 140, 13, 130, -100, -56, 102, 9, 92, 48, -90, 129, 39, -223, 17, -98, -225, 27, -77, -32, -61, -186, -142, -44, 234, 29, -71, 10, 174, -26, -8, -136, 237, -69, -105, -43, -46, 236, -131, 149, -80, -63, -75, -49, -64, 81, -125, 6, 34, -114, 169, -64, -1, 58, -111, 210, -132, -263]
2086b63M60l52K8o2m7J15K45R3m17K09m3J3J06j15j42Q3j5J25j2L8O7j52nP9l5
2111Aq2j21J44j41L14j15J79j63J14j41o8J77j90Q0J48j10k02k1R6K37k47K55
2133A44m22L06K99m33J94k5N0j92J35L0J33k12L70l48m1p5J05M6J48l99L83j79
2155A7n5M15j69k12O6J52k03K2q0L7m7n1P4J01k26J82l5j17NK44j59J43n5j42
2179i3K01j77J16J69j03j35L1j63j6J82O9k24J99k7j98K32Lj79K82J14l03o4J21
2202C7K6O9j78r3p5k6j5j01Q14m90J23k70M0N31l25j63J66m78O44o08M58j59R0
2225A7rn8n8K21j1j77L52j97j54j6O2P4N5K9j23j36K55l36M88m10J00J19j49r9
2249a61J52j95J93j42J7qM9J81j16o2P9J10l89K02L4J12M1o0M1j30J5N7k39J10
$$ y = [-263, 197, -155, -127, -189, -236, -121, 124, 217, -200, 9, -34, -21, 85, -30, -172, -89, -104, 21, 9, 47, 114, -38, -43, 36, 1, -81, -202, -58, -199, 115, 0, 179, 16, 130, -11, -79, 98, -92, -12, 136, 26, -176, -197, -101, 136, -111, 144, -278, 28, 327, -106, 88, 63, 113, -79, 56, 86, 219, 7, 377, 29, -12, -87, 18, 64, 212, -187, 196, 17, -38, 377, 208, -4, 62, 214, 11, 33, -47, -10, -57, -108, -34, 67, -159, 23, -12, -129, -124, 120, -39, 104, 49, -93, 108, -69, 47, 216, 113, -22, 9, -154, -170, 12, 81, -143, 56, 29, -169, 63, 66, -113, 169, 283, -20, -84, 37, 63, 132, -46, -139, -214, -240, -255, -356, 458, -32, 91, -179, -139, 392, 67, -96, 70, -408, 236, -372, 86, -73, 17, 8, -50, -108, 113, 102, -75, 277, 80, -74, -90, -28, 46, 101, 130, 7, -129, 126, -210, 278, -132, -32, 87, -62, -161, -9, -204, -11, -153, -136, -144, -95, 86, -30, -92, -13, 97, -292, -90, -56, 56, 97, 37, 78, -52, -37, 20, -219, -109]
2273a09K26j0j06P6r7J02J9k09J08N4p8k02L35j49J43J81j5m2j60k82L99j55j18
2296h9J06j88J47j27J98nR0j55l9j21K47j41J32j77J78M8j70P1j81oK19k20L0
2319a53N6J62j22O0r3N8K50j58j17J65l10R1M25m06L91k50p0J29j93L05o0q9q5
2342a4j2Kj71N3J10P2j04qK74n30M13J5k48K48j47Q8O5k65M69O2k93J10j90Lm0
2367c8J42k08M24j69r9j7j22K1J42q3jj71J20k8k7lJ55l2J08j43NJ56j31P0j16
2392d5K35l03J82P8m59K27O3R6p7o1O5n9Q2J70k49J82j32j5l22N72j72k57J48
2415e1O1J05J49k56O0J19l12M25m28L04k36J76j24m6O2l6J70k60J49j87K34j97
2437a19L86l39k97M86j26j39L08l36L26J50n21N14m64K26m4p2j43PK3J74k14O6
$$ y = [-109, 117, 107, 1, 77, -20, 82, 101, -108, 0, 54, -24, -226, 109, -40, 103, 284, 269, 227, 67, -215, 184, 29, -89, 17, -171, -24, -151, 47, 42, 132, -23, -62, -183, 64, -77, 55, -122, 56, 104, -66, 5, -176, -182, 37, -183, -153, -97, 65, -57, 3, -90, -32, 218, 60, -57, 108, -202, -111, 314, -92, 299, 49, -21, 108, -85, 220, 160, 71, -14, -26, -24, -195, -142, -32, 40, -64, -72, 202, -328, 85, 100, -148, 100, -47, 41, 106, -159, 310, 372, 79, 189, -1, 2, -38, 104, -104, 320, 151, 52, 35, -87, -66, 76, -7, -8, -179, -59, -87, -114, -117, 38, 6, 114, -29, -24, 132, 1, 71, -45, 190, -113, 69, 147, -312, -85, -22, 74, -3, -64, 1, -58, 24, 194, -55, 127, -5, -20, -342, 230, 58, -199, -51, 10, 115, 264, 8, 68, 187, -125, 300, -128, 176, -60, 116, -8, -54, 8, -28, 142, -118, 31, -156, 78, -119, 267, -72, -369, 117, -9, -148, 160, -176, 150, 300, -221, 293, -171, 55, 11, -61, -204, -197, -174, 0, -214, -148]
2459a48K05j98J36J44k66R1l5J8J65j64j01K62j87L8K27m21L68j42j43n6P8L3
2481i6K03o6L2k05j40J34L04p3j47J80Pj5k16P2K53j32P5l01N3K46j80l23L19
2504a6K92l86J50k74K69O0J52m19K80l09K86J04j00o3k33K38Q3k1j1j5j38j49
2526b20J7L60j88J26l28R7R9n0K13j69J61n6J6Lj23J48k34P6j17J17R8k42K87
2549I1j24k65L46l03M04n14L10P4j88L38R5k22j2L2j58J86k55P6R8p3j60o6J47
2572a43K71Q4j48JL64n45K36k72M4M05l62o2L01j76K31k22l2o2K66l06P2k0O8
2595gj44K26k18J30n1J62L1k70K01k1L1J61j12k47k6M0J93j73J00k48M23j47l0
2618DL3k80K55J08q2j16O5J56n2n4j37J60l44J10K57j97K4J93j7j70J14K35k72
$$ y = [-148, 57, -141, -5, 139, -127, -36, -71, -53, 112, -52, -153, 109, -78, -40, 187, -234, 134, -8, -151, -207, -129, -96, 107, 41, 73, -132, -272, -138, 166, 93, -54, 126, 133, 118, -98, -26, 227, 95, 170, -131, -78, 168, -12, -335, -16, 276, -110, 40, -234, 35, 95, 247, -172, 108, -201, 85, 189, 89, 26, -207, 31, 114, 93, 82, 67, -71, -220, -203, 157, -31, 95, -233, -136, -37, -87, 126, -43, 118, 62, 78, 81, -42, 106, -128, -52, -169, -52, 46, -196, 91, -33, -298, 48, -255, 149, -365, -55, 19, -169, 169, 264, 42, 30, 62, -96, 90, -165, -89, 9, -64, -224, -290, -143, 128, 212, 64, 65, 429, -116, 120, -152, -108, 297, -65, -127, 174, -2, 229, 7, -25, -87, 179, -127, -55, -75, -7, -151, 75, -143, -13, -64, 98, 129, -141, 60, 39, 70, 231, 119, -128, -154, -114, 79, -94, 6, -242, 181, 34, 4, 37, -243, 12, 120, 38, -78, -13, 143, 91, 37, -100, 60, -284, -174, 83, -114, -90, 103, 86, -84, 30, 265, -7]
2641gk79K70K11o1L9O7k77M6Qp8K50j80n6J48k01N7N3J2J81k71K3k1nM6kJ52k01
2668g6K69k44kK00l45R4K91l88K78p0r6N9K21l76J28J06L8j84M0k77J13J73J30
2691H2j86J83K81k87j72L46j67N0k13r9J35O8j6r6J1j74M41k69K17j28o4j20L61
2714A84j37l0J34j80J02r6M7R0K42m05R4p6M6p1J1j11L98l06Jj48L75j95R2l2
2738B9J6k3N2M5o9j59p7J73nkj16J05Q2k48OM04k12l3J35k0j56L40k50k5j80K14
2764B6J0N6J4n3qj71lj98L62k24J33M8j03J30P2r8j79K56l0L4j01K94l4l12J48
2789F9L3r9J64j89J8K65l23O0J95k66J95r0j14L4kJ14k3O4j75J83p1K06n2N8N
2814B59l02j17k3P2N7J99l7p6l1r4J36L27m89P9K20l56J90K70j52k00K27l51J11
$$ y = [-7, -286, -16, 195, 134, 173, 240, -37, 9, 17, -61, 189, 9, -47, 101, -100, -43, 10, 22, 203, -68, -45, -66, -71, -25, -27, 125, -76, 193, -51, -53, 147, -198, -104, 187, -201, 77, 7, -89, -30, 191, -185, -57, 49, 87, -97, -57, -334, -221, -48, 82, -104, 79, 360, 73, -99, 247, 80, 130, -83, -182, -47, 21, 5, -91, -80, -254, 187, -82, 135, 7, -57, -177, 184, 47, 17, 151, -29, 73, -23, 24, 114, 356, -49, 45, -31, 15, -56, -45, -156, 242, -64, -63, -211, 164, -31, 61, 29, 45, 22, 74, 119, 50, -109, -186, -13, -18, -20, -136, -31, 51, -197, -191, 213, 1, -32, 103, 83, -73, 267, 17, -8, -188, 26, 36, 92, 106, 53, 45, -126, -129, -327, 35, -189, -56, -8, -111, 19, 91, -7, -186, 70, 40, 74, -27, 267, 233, -79, 69, 102, 3, 167, -22, -4, 261, -62, -2, 193, -73, 122, 32, -82, -48, -50, 64, 41, 105, -70, 113, 42, 248, 196, 254, 259, -43, -160, -183, -111, -54, 145, 108, 32, 1, -93, 43, 370, -119, -40, 180, -176, 14, 284, 132, -68, 159, -192, -81]
2837h1K5K02k59k7j35M29k19J84k10k1J09K17k52M00j22k62L62l46J46NRq5k09
2860a40O9K37j71j69J63P8J77j09j27n0K47k92J06O2j47J35L4o0j34Q8j33M33
2882B97o95M07J90M9k59K13l55J32R7O2j7p9j01P9J39K04l01k76M85l61L12o8
2904A54j14n9J77lk22j19qj2J21j08M3K07j47L41l15O4j75L8J14O5j39K3j26L13
2928A13o5j71J1l5K9k13L97K63n24J43J01o3Pk58M54N5j01k58L45n6J51l53j09
2951a37J86j71R7j50N5L37l95J03j5L9k33N79l84M3P9o5j1k8j48L96j12l23L65
2974A07m0K8j62k2q7J25l2J33j09R9K96l84j35L22k68R3J74m09Q6J63K14M2k3
2997B11k44J28r0Qr3K2k80M23J41o8K7k85J68J37k02r6k07J19J83j8O3J41n14
$$ y = [-81, -56, 146, -113, -140, -275, 154, -65, 119, -91, -112, -3, 214, -38, 362, 240, -22, 340, -6, 140, 145, 154, 69, -140, -71, 166, -5, -174, -11, 67, 244, 135, 8, -42, 205, -87, 19, 81, -66, 69, 103, 43, -91, -3, -136, 297, -398, 9, 199, 248, -11, 202, -153, -21, 76, 138, 121, 42, -59, 20, 159, 363, 62, -214, 271, -90, 222, 154, 40, -19, 158, 155, -67, -186, -194, -206, -85, -193, -150, 57, -90, 251, -64, 0, -175, -137, -23, 42, -97, -74, -200, 113, 48, -123, -112, -147, -118, -331, 66, 329, -195, -52, 49, -14, -7, -265, 189, 244, 143, -115, 230, 174, 325, -28, -137, 49, -122, -25, -175, -120, 217, -178, -75, -90, -51, -284, 295, -89, -46, 33, -32, -43, -71, -219, 177, 65, -258, 107, 67, 95, -67, -89, -176, -51, -83, 50, -59, 40, 336, -48, -183, 139, -129, -36, 138, -271, -185, -22, 192, 234, 211, -33, 95, 5, 13, -80, -58, -338, 85, 226, 158, 185, -100, 68, 205, 3, -93, -300, -181, 2, -16, 47, 188, -326]
3020c26O20k09l39J36K48J73l71L47j61J9n3R9j01j84L0J24k47J22L61l29j6l31
3042c88L13j59K44Jp2j11K54j64N7l3k19M92j93P8k15j40K93P2j87J75j83J03
3064A8J26k48nK12Q2j57o1j09L91l21J36l9K03n23N29q3J34m10n2O4k00L27P0
3087H4j16K20j87j89K37j37K20m1r9L20k49j41j03J95j52j14R0R0M35m26j0j2
3109h5J18M2j41M0p1L80j94j69K91l9j3l31K44L6j51K47l82M7L38l98L73n57K69
3132a06R6J11j58N8K54n13M69l07O2J31l3l88N54k55j43L04j28J26l81L83J5m12
3154b61L66j69K2K22j75L48l49J15k24K0K01k24K29K4l49L87k03K4k11L03k38
3175a42K40m3o4N9j96M67j34r7j85K36M5o4j66K29j46J47k71l16L59J02l51N36
$$ y = [-326, 294, 85, -254, -118, 130, 303, -68, 279, 118, 137, 84, 183, 82, -102, -72, 52, -195, -73, 288, -41, -57, -388, -75, -234, 10, 11, -61, -172, 82, -82, -25, -58, -277, 215, 22, 100, -115, -255, 38, 110, -77, 98, -85, 18, 144, -104, -109, 103, 185, 28, -33, -142, 249, -72, 64, 25, 228, -295, 234, 151, 285, -125, -177, -113, -313, 14, 84, -32, 188, 1, -188, 49, -88, 132, 91, -8, 312, 63, -78, -181, 14, -138, -252, -162, -72, 363, -63, -73, -85, 33, 75, -66, -26, -97, 283, 89, -80, 211, 172, 159, -172, 72, 108, -43, 204, -178, -131, 207, -191, 182, -375, -106, -10, 101, -57, 1, 255, -258, 211, -96, -34, 97, 64, -324, 230, -25, -168, 136, 8, 134, -247, 136, 151, -261, 105, -64, -42, 180, 5, 353, 4, 119, -105, -85, 116, -108, 121, 145, -204, 183, -20, 4, -207, 96, -142, 98, 55, -9, 50, -146, 321, 187, 90, -95, 141, 186, 122, -44, 185, 39, 186, -85, -401, -42, 60, -291, 245]
3197B45o2n28k2N30j46rk56J76L4R5N9P1j81j04R5k57K88K0M0r3QR0O5q8J50k31
3223a1L60n72L72r0j58J63k45K99p6l18N15j27p0k1j1O2j09J12L4j85J63J09q2
3246A14m4j66K47l25j01J45J08K30l56K70m9k21L54k31l0j14J35j4o5rj47L21
3268E2j10j85N20l45j80K87j14Qm4k70M75j91J61k3j69J03O5j89J85N1k13j16
3290b42K13L02k10j7n8J30j41J18j70K75k11j91O6J81Lk5l7q1N1p9L9L35n62K52
3314e9R8l0N7j75K60J10k33P4j28M4O3J24j72j82M77N9k39m8p7j91L35l89J71
3337e1o1j33p5K40l4R8K14k57K63k26J94j46k07L48l83K58j07k12J59J21J15j94
3359g6R9j70M18l05K37k99M57m51K45O4o15N01O2j5j74j10j98K64K08m7j33p4
$$ y = [245, 183, -345, -367, 163, 17, 8, -248, -72, -38, 57, 116, 187, 6, -98, -3, -260, 28, 48, 88, -5, 3, 93, 158, 70, 220, -11, 349, -223, 149, 59, -99, 64, -181, 118, 42, -276, 239, 112, 42, 21, 10, 72, -37, 75, 109, -76, 87, 196, 114, 70, -96, 151, -174, -275, -130, -22, 208, -148, 122, 73, -148, 206, -25, -55, -169, -34, -48, -113, -122, -269, 52, -58, -243, 277, -68, -248, 39, -75, -67, -111, -381, 94, -97, 64, 41, -128, -25, 40, -149, 36, 87, -126, -242, -29, 273, 63, 46, -12, 118, -23, 95, -75, 200, -11, -202, -136, 45, 48, 23, -14, -95, -44, -123, -84, 251, -311, -59, 39, 9, 66, -109, 151, 261, 28, 102, -26, 18, 81, 205, 33, -149, 328, 387, 148, 100, 23, -168, 167, -222, -51, -112, -245, -320, -80, -114, -16, 198, -59, 204, -22, 172, 26, -181, 167, -216, 42, -65, -277, -118, 3, 118, -76, 23, -147, 271, -34, 203, -96, 361, -90, 155, 219, -396, 105, 167, 152, -22, -132, -330, -66, 142, 95, -38, -112]
3381a12N2J43O6j13k02M15l18j28L14k63J41M8K55m31j0J64O5Mj30k06R2J00N2
3404bk21P1K81m20K50J55j14R0j38j94L77J31l58J9J38k5P9j78J58j41J65J16
3426B39k67q9J36r6k91M01P7l22L01r2j96K43o1j54P9O8j59O0M1n9J41q4j58J68
3450g4K9O4J2j20N8J6k58L04K1P4J41k90J21R7j38k31K40R5j61j7N7l01J74K77
3474A90j59j62K08P6k61P1J65K26n38K07qr1N3Q0J07j23J84j5k90j12p1O6J80
3497a7m7R9k0k51J17L27o1l2l05P7j21J70J98mn23N07J28j77n9j38j28K22J74
3520A36KJ03m80L93m55L71O7n2j57L44k19K1J6q2Mj31K28nL4n1o9j01j73K39K35
3545B18m09J64L1J29k31K88j95j86J38J9J99k17J84j97K33k02q6J31L72l54%k66
$$ y = [-112, -60, 83, 149, 36, -166, 249, -69, -197, 117, -146, -5, 43, 298, -133, -143, 21, 86, 90, -40, -246, -154, -54, -2, -223, -152, 129, -291, -41, 114, 0, 90, -48, -242, 135, 266, -92, -73, 65, 40, 119, -59, 99, -42, 123, 239, -28, -117, 19, -77, -368, 33, 110, -212, 89, -3, -199, 44, -17, -171, -92, -24, -183, -123, -82, -141, 0, -84, -242, -74, -45, 19, 31, -89, -31, -15, -273, 31, 52, 126, 267, -23, 98, 195, 57, -174, 66, 161, 0, -17, 40, -261, -87, 190, 31, -131, 77, 153, -108, -37, 128, 354, -184, 23, 15, -76, -23, 57, 164, 41, 225, 210, -80, -192, -263, -197, -17, -64, 35, 15, -236, -119, 208, 147, 115, -190, -113, -234, -64, 134, 130, -393, 114, 242, 65, 6, -132, -260, -38, 136, 138, 241, -239, 154, -301, 70, 137, 85, -72, 272, 53, 74, 90, 8, 12, -119, 109, 104, 138, 87, 18, -83, -256, -17, 218, -191, -27, 4, 133, -98, 190, -5, -191, -53, -34, 165, -52, 132, -65, 168, -34, -120, 11, 383, 29, 29, -237]
3567b37J31J08L56m25m0PJ51j14K3P6nJ0p6j01J9O0MM5K39l94J26N7J08l49J42
3592g9K25j34Q2r7J93k12J44k2j90r2K59L9j43K62o1j00k40L60L6o4j05P8j11
3615B8j5l2k89M85k41K04j56J70j41l1l7K03l24M51l89K26p1p6P7j50J85P2m05
3638b56M09k96j5K08R8Q1l92K9K61k75K2J58l7J74j22J14k8k89k3K21p9L45m80
3661a72K88k85K45P7j01k53J10O7k3QL8n3k6j5p0J42K7j64N14k65J16j83J66m64
3685b76L52r4Rj4P4n1n5J99k59p7K59j03K04j78p9M5Kj26K23j7k21J75pl2o4K54
3711A43j66o2R6j6JJ81jm86N1L83J14j99k43L06N0j53R7l8n6o9j36P5K84p8j70
3736i2J2J99k69K8L09k56J3q9O7QL04j06j90Q3L2j68K34j29L47n28L8L35m14L03
$$ y = [-237, -106, 2, 358, -67, -107, -100, 51, -63, -40, 36, 31, 41, -35, -136, -117, -57, -53, -8, 231, -163, -37, 20, 128, -221, -79, 146, 12, 94, -3, 190, -22, 122, 100, -90, -182, 77, 116, -27, 235, 174, 74, -166, 194, 230, 166, 61, 139, 28, 13, -19, -308, 177, -64, 140, -16, 154, 13, -18, -55, 148, -176, 275, -114, 112, 41, -35, 42, -108, 77, 149, -256, 153, -143, -158, 50, 148, 229, -163, -134, 127, -148, -126, 32, -5, 169, 47, 161, 133, -156, -179, 42, -37, 308, -172, 116, -169, 76, 153, 52, -201, -91, -24, -47, -39, -1, -54, -80, -95, -165, -23, 4, -160, 354, 89, 205, 22, 188, -276, 76, -18, -9, -23, 51, 0, -55, 144, -115, -192, 67, -36, 168, -10, -89, -44, -42, -168, 55, 38, -183, -8, -15, -47, -111, 143, -23, -85, 11, -5, -4, 177, 176, -310, -259, 124, 238, 39, -204, 102, 152, -1, 96, 58, 2, -67, -203, -128, 156, 78, -92, -80, 119, -150, -122, 187, -69, -56, -145, -78, -70, 234, 128, -62, 21, 53, -115, 119, -10, 337, -191, -153, 182, -232, 71]
3760G1K7j52jKj24P1k1J11M5J21k05P1J21q6N3J09l20K42j03k57K80J08k57Q9
3784eJ23k43M10k71N1K6l40L11k36P1K07q6Rm1J34n5O0k11N6p3m9L33m17j57K54
3809a39K8L38k98J41l8K8k9j26j57N1K83j48Q0k2o3J39L5o8k3K39j64J17k06J82
3833A80Oq5k81K35j86J13J09l8R5j3k84J5J13J33q2k0k44M10o8J0J56l93L44j39
3857H6j24o3J8j46R8L38r9k19k1K62J2Qo4m0rj62M92l41o5o5j25K57j88m0j4K07
3883gK78m42n2K52Oj1j5k82M09j92K09K17k29j64R5qJ07l89J74J15j2m24K15L45
3907A95k65k4K03k18M2o7K09l53K30K48l17J17l43N25j08j90O6j99L49P3j44p5
3929d6J64ko9k50J7N68m44Qm8j9M0L87m04M3l2K55k92J90J24j06k02N2K27k08
$$ y = [71, 98, -54, -55, -53, -177, -106, -127, -16, 29, 150, -55, 16, 137, 51, 104, 213, -107, 135, 32, -225, 55, 163, -94, -5, 118, -125, 285, 14, 65, 91, -249, 62, -174, -103, 104, 18, 27, -14, 120, 65, 125, -86, -30, -103, -152, 181, -236, -393, -139, -111, 227, -71, 70, 32, 60, 31, -95, -252, -201, 82, -66, 14, -8, -71, 68, 103, 35, 12, 251, 87, 204, -2, 180, 186, 101, -180, 55, -131, -18, 91, 53, 148, 135, -149, -134, -21, 112, 30, 10, -234, 176, 108, 118, 274, -119, 225, 86, -38, -101, -83, -229, -131, 207, 108, -111, -132, 130, 142, 150, 86, 46, 37, -125, 367, 26, -39, -104, -229, 28, -160, -200, -214, -7, 271, -171, -223, 29, 35, 24, 9, -273, 136, -56, 153, 370, 141, -23, 72, 64, 171, -218, -44, 71, 59, -365, -150, 195, -70, -94, 109, -109, -67, -134, 75, -278, -48, 200, -117, 0, -343, 182, 74, -116, -50, -249, 100, 173, 29, -46, 118, 116, 47, -203, -186, 382, -62, -54, -102, -121, -81, 306, -98, -55, -87, 168, -124, 66, 190, 84, -118, -66, 161, -47]
3953d7K63p3O0qm68M10J7j08j18L4K04L8J36m41K28j49k9M7J19l30K65o2j09j12
3977b33L40J34k20l32P2K28j01K36j83N6J59n6L3m0n0j14J87j60j16J84O5m34
3999c45K99n8J49M1r4J59j00j27m4j14K25j34L66j09k78J83k88N02l92J54J22
4020A17k57nQ0J32l29R2L44k93K52Lj66J8O7k62P5Q6J33k53K16K90l14k6o1o0
4044a21j36J30j12J87j78K33P9l19K59J35j59q0K73l71M63l22n2m1O2j01j97K45
4066a23P4J53m09M19j61j40J98j3k25N89l77N8j49J30L2k4J04k37p6Q4J76%K3
4089A06P3k22J35J62k76o8L5J14p3n1K03q8l59L66j11J29j65L34k83l9M7pJ17
4112G9l21p8L71M56m77j60K88j75l17M40j37O3kk76L66p4P4k00K07k59n7M28L5
$$ y = [-47, 216, 143, 203, 195, -273, 137, 154, 46, -72, -38, 166, 204, 340, -101, 127, -22, -51, -4, 115, -215, 50, -12, -121, -233, 107, 241, 21, -311, -239, -11, -112, 124, -59, -3, 156, 100, 133, 93, 43, -71, 116, -44, -160, 24, 89, -345, -46, -104, 45, 86, -8, 151, 51, -76, -120, -234, -9, -143, 223, 114, -164, 19, -269, 233, -159, -5, 117, -140, -145, -65, 67, -262, -170, 174, -119, 133, 136, -30, -12, 55, -207, -132, -46, 87, -166, 50, 340, 26, 0, -61, -121, -257, -127, -239, -52, -230, 3, 82, -237, 22, 157, -2, -82, 191, -180, 283, -39, -91, -132, -70, -171, -368, -123, -49, 104, -305, 114, -47, -187, 11, -2, -227, 362, -15, 43, -106, 24, 56, 32, 136, -101, -177, -93, 83, 83, 106, 179, -43, 92, 254, -22, -90, -55, 59, -14, -65, 138, 50, -309, 57, -54, 75, -90, 244, -39, -78, -31, -38, 79, -242, -320, 51, 507, 30, -130, 158, -17, -334, 106, -31, 32, 30, -246, 120, 46, 120, -80, 127, -132, -189, 239, 274]
4135B74k9j07j46j57N3M09k81K35k25kJ11l44J40L6N3l3K65qk43l8O4k46K09J78
4159A68k91L41j41K0l5k66K96K99j96j30P2N8j62j66O7J06p5J27q2J17j45J3J54
4182A49j30j35K0M26j02k07r8j11O5K19j25K95l48MK59l37J63j14M21n40L0L54
4204A58l30J96j55p7K80j76QL5m4K75k57K46K5j71J6R9L5k23O5p3q5L62K34p03
4228b60L40J48mk52O3j62K28m53L78j25J5P2J81o4m7k44J53J82j3lj52K3j06L96
4252B94n06J18K07l64J78o5K01j44Rr8K45q8q2l2K46l74M14j96j15P7M5J90k71
4275a11J44k05L32l22K29j8m46K55j09L26k17j64L13K02k13Q3Q0l20K07l49K19
4296h4n4K68m53K64L6j93K70l53M30l75L90j36J36k85J66j58R2L74l14o0Q9j21
$$ y = [274, 245, 138, -8, -165, -112, 297, 16, 251, 26, 24, 135, -209, -69, -33, 20, -13, 252, 244, 1, -37, 27, -219, -10, 168, -123, 218, 77, 97, 62, -204, 92, 391, 195, 65, 137, 195, 33, -133, -66, 40, -35, 92, 10, 127, -18, -5, 149, 19, -116, -96, 330, 228, 21, -77, -188, -123, 96, -29, 266, -82, -78, 181, -156, 7, -107, 314, -226, -196, 158, -172, 24, -131, -208, 72, -104, -96, -61, -105, 170, -87, 159, 184, 13, 29, 128, 163, -60, 5, -68, -153, 209, 443, -260, 80, 228, 224, -28, 35, -127, 101, -352, 26, -99, -84, -12, 169, 105, 58, -186, -33, 149, 136, 133, -19, 4, -102, 294, -212, -94, 113, -251, -73, -138, 63, -81, -72, -170, 75, -13, -95, -127, 119, -255, 159, -37, -152, -75, -30, 160, -111, 33, -172, 160, -162, 67, 49, -397, -142, -251, 75, -142, -306, 7, 209, -4, 79, 159, -161, 46, -303, -84, -138, 130, -323, -59, -23, -216, 54, -299, 131, -244, 146, 10, 146, -139, 27, -131, -39, 335, 21, -39, 50, -71]
4318g1J92k34L02j83J61k69R8J60k21L3J94j05Q8n8o7K01l69O5NN9o4o9L77j62
4342F3k22M81m95M37m62K28j51K53k24J89k20J34L0l38J91o9L84n14J32q6J40
4363a19J19k6n4n1J14L14k57j75J13R9l60L11K3k48K89Nk05K20o5j99K41m07L47
4386B9M1k85J06K28R1m68J24j55M68j49K46n54K14J38J32l27J33p3J12N8J21k77
4408d7M2K01l24J74k95J54J14q6P3J95l39j32O95n23O9J27Mp9J51P4l96L02J18
4431B72m08L38l6l26j5kJ73Q7k32L6K68m97L83jk92P7K00j16J16M9R9Q5l76M50
4455C32m34K21j95J0N8l99Q93l14k63J03J50j81J59k40J51J9P8l27K13qo7P1q6
4478e6pJ98p4O2k49kK32K30l89j06K13J38j63j20l4J2J40lj46K20Q6k08P4J46
$$ y = [-71, 121, -113, 189, 6, 167, -102, -4, 156, -65, -32, 162, 57, 145, 87, 20, 221, -148, -83, -78, -19, -83, -152, 225, 63, -159, 322, -173, 264, -198, 30, -121, 132, -92, 97, -123, 11, 41, -297, -106, -175, 209, -305, -173, -259, -119, 0, -26, -80, -131, -17, 297, 40, -135, -22, 77, -283, 28, 51, -197, 92, 97, -108, 112, 47, -152, 89, -318, 29, 70, -215, -109, 119, 210, -258, -134, -289, 179, 30, 276, -278, -64, 74, 206, -121, 12, -61, 51, 109, 230, -47, -5, 196, -128, 46, -249, -95, 19, -67, 6, 201, -138, -270, 425, -98, -29, 98, 102, 23, 174, 248, -148, 154, 272, -136, 202, 166, -160, -175, -177, -4, 83, -149, -113, 155, -342, 41, 40, -252, -175, 25, -91, 25, 74, 173, 258, -118, 332, -102, 119, -76, -66, -8, -407, 486, 172, -91, 12, 162, -19, 140, -100, 51, 70, 148, -179, 34, 26, -41, 30, -56, -63, 135, 61, 123, -126, -128, 104, 334, -55, -161, 52, 190, 27, -93, -127, -115, 25, 22, -124, 96, 182, -26, 48, 194]
4502A94j89l3n0L52m42L08j29L12j10q6m7m3j64J17j74N06k94j94K40q2P8j13
4524d3L2P5r1J58n6j88J4R3j23K21k51L03j01k52R4J71j19J28Rj39J45J47j29
4547I8l11Q5M0J46j34K01k27m3J55k00J83l31K43K80j76j25j07L30n2L91l18k34
4569a06J42l06K41K04k83L1J82j56M9n0J24j01r4p7l7l0K80R6K40p2k16k76L06
4592I1m3%J11k13K25k14p9L03N8j59l7m0j48k9K91j99K6O5J9l07M46k09n0j18
4616b10K68l07L19l5j21J15oP8j06J57k33P5J81j40L0K6p0j06k03M56j12J46m74
4639b72M89k70L74l04J39j01j23J03j44J19K3L19m68K24j21L4j03J38n2l4J55
4660A25j80l1Kj44O1L98j57j40K28k78L56q7k17l3Q8j9J92r2k68Q9J81j06o4L5
$$ y = [194, 5, -28, -78, 274, -168, 140, 11, 323, 213, 127, 80, 37, -127, -10, -184, 322, 28, -166, 74, -8, 70, -43, -11, 64, -27, 131, 75, -113, -99, -6, -129, 92, -159, 144, 43, -209, -115, 56, -63, 65, 74, -65, 80, 227, 98, -213, -128, -88, 58, -76, 125, -102, -145, 10, -190, -7, -338, -95, 185, 9, -116, -223, 107, 55, 446, 128, -106, 36, -270, -29, 175, -108, -77, 105, -51, -2, -52, 72, -29, -123, -200, -237, -267, 13, 109, 349, 277, 61, -215, 91, 48, 48, 159, -54, 171, -43, -122, 181, 239, 80, 43, 3, -145, -174, 117, -82, -56, 9, 28, -279, 167, -42, -92, -210, 58, -249, 70, 35, -86, 29, 23, 101, -5, 152, -81, -6, 175, 35, 65, 91, 21, -85, -288, 168, 56, 202, -272, 217, -53, 321, 17, 156, 55, -68, 35, -109, 10, 33, 352, -116, 108, -13, 21, -82, 56, 4, -30, 125, -55, -86, -84, -228, -167, 231, 74, -66, 162, -116, 240, 153, -64, -97, -9, -28, 164, 72, -196, -107, 74, -32, -96, -61]
4684f1J34r1j65J91q9oJ3p0J73j48K54j38J00q1K8q0P5j35K65l83J41l8K66K9
4708A84l36M11m12R4J95l39K03J3J10p4k49M2K68O2k13Q8l08L51k16J25K6r9j16
4731a90J93J98l9o0J40j31J2r3J99l99K19R4k40j89L77j92K71l65l3N46m17K14
4753A15j96k06J77J79k80J94N1k08R5P9R5J68j91o1P5L4j33l8j5N3NM9m9j7L2
4778Gr9L01l60J00j42K99m7k47L41j82J1k6o7K6j7K13m2k67K54LJ88j22pk33J1
4803a04K20j45j80J96j15K27j63K4K88k55J86j89j39K39j0J79j20m72J39J95l0
4824b9P2k45K10L8M1j45k3n3k17L31p9rJ07j34J39j21L19l04K01K50q59K44O45
4847C79k47j6k40P4j96M36l58L30k14q7K36L0p7p7k91L39j56J47L3k13J43n7n7
$$ y = [-61, 73, -18, -183, 8, -81, -87, -74, -144, 29, -119, 135, -3, 97, 16, 44, -36, 39, -96, 169, -214, -73, -111, 155, 184, -152, 259, -153, -59, 136, -203, 0, 13, 123, 49, -200, -158, 110, 172, -41, 47, -261, 90, -126, -1, 25, -74, -190, 3, 201, 162, 102, 242, 111, 123, 30, 229, -170, 49, 143, -97, -286, 91, -101, 170, -195, -228, 318, -99, 115, -81, -287, -110, 69, -211, -17, 34, -174, -79, 0, 95, 263, 72, 11, 86, 120, -13, -51, -66, -13, -8, 41, -8, -25, 7, -92, 209, -151, -51, -193, 106, 59, -188, 153, -29, -18, -44, -111, -85, -102, 111, 69, -198, 56, 59, 247, 125, 118, -115, -104, 116, -29, -209, -13, -128, 99, -64, -40, 248, -7, 179, -10, -149, 90, 80, 259, 139, -333, -194, 1, -29, 43, -202, 8, 46, 87, -58, -81, -134, -351, -20, -99, -108, -1, -135, 4, -117, 202, -102, 99, 349, -510, -266, 379, 132, 116, -124, -50, -246, 190, -168, 162, -52, -139, 97, 127, 50, -27, -318, 21, -135, 12, 45, -168, -25, -82, -139]
4870a39J73j40L3R8J98k99j51J24J65n0Q6j39J02J87k58n02P56j92n7j6Q7k25
4892a59J78Q3k05J66L9l1l58L92M3q9j73L75m0l67K49o8l7mlj03qk0K65l07J15
4917f7L46J64k68l36J77J86k9l57j08M13j4j64K49k65l4O5K17j47k5K06K7k71
4939c5M94n60p1K41j06K83O4l26J34j44J16r3j45R8o6K54j57J9J51m49J92j36
4961b42J98M9P6K5n7j09K4K9M4j93K09Mj99J19L5q5O9J76K7k63l8K60m6j17j7
4986b2p8R9J19o0M4j95J05o5K04j50Q6o5J17L0j28l67M32q3l4J03M2J38j87J3
5010I8o7j61J33k50K57j77M9J74j38p4K32l57K69K34k35j10Q2p2J50k10n9M8K14
5033C0M4j06L62l01J2l33K0K02J71p2PK5Q1l77K08J6O4o9l0J63m41L38p8L9k32
$$ y = [-139, 34, -106, -73, 25, 223, -76, -227, -103, 62, 12, 98, -41, 61, 248, -10, -512, 244, 52, -5, -21, 66, -159, 19, 102, -103, 63, 102, 71, -287, 105, 148, 59, -114, 261, 221, -146, 103, 35, -2, -6, -9, -112, -120, -140, 125, -182, -67, 279, 443, 175, -161, 16, 202, 173, -184, -292, 121, 107, -57, 192, -73, -107, -42, 175, 28, 3, 209, 236, -35, 459, -101, -172, 69, -37, 246, 310, -16, 118, -26, 90, -3, -148, -50, -116, 138, -19, 0, 151, -298, -106, -242, -44, 5, 81, 106, 49, -60, -36, -7, 37, -156, 53, 57, -142, -23, 12, -73, -4, 172, 199, -64, -102, 158, 112, -5, -22, -100, -1, 118, 58, 102, -93, 12, -53, 151, 1, 87, 22, 139, 169, 41, -326, 106, 23, -11, 92, 134, 272, 85, 98, 31, -130, 3, -247, 10, -167, -118, 56, -82, -156, 76, -281, -12, 222, -13, -123, -41, -113, 37, -173, -232, -184, 30, 74, -32, 330, 29, 41, -292, -272, -70, 101, 29, 36, 61, 142, -235, -27, -11, 53, -16, -46, 117, -324, 14, -64, -25, -257]
5058b57J48O8J17q8p0j40K81o5K37l25q9J13j2J22M9R6k68K64j59j51p9L36n82
5081d54M10K6J53N4k29J65j43K55j12j20O7j50J25R5j36P8J09R6l88k06L01m24
5103d28O01k44K83j54k11J48l69L62K8J05k2L1j45J40j89l79N16K73l4l48k16
5124b52N37n96L21J0l2J0l04K82k70M80j10j04k97K49K53n3l85L01k03O2K32k12
5146h1mP2k39L72l06K58%l3K47k18L4q2P1j11k87M96j86k78L09m0k70K00O5M4
5170C3j48J03L8K54k68J50j97K94k56l7J22j15k0n2K17j94K59l00J86j32j89K80
5192B8j87K96k12J79k7j76K31k16j66K92k8k8P4j36N4N7n4J15r9j18k4J92P8J05
5216B30j80k05L96l42m3K16j57J09n2J47k71M27k84L58rn46K57O2R2k5l74K36
$$ y = [-257, -109, -41, 76, -12, -82, -222, 59, -6, 231, -94, -183, -70, -82, 40, 89, 185, -83, 181, 22, -129, -208, 128, -454, -44, -18, 135, 189, -40, 125, -18, 237, 125, 5, 72, -78, 47, 142, 6, 84, 193, 289, -99, -305, -4, -428, 173, -71, 212, 58, -153, -5, -374, -12, 16, 121, 99, 130, -15, 125, -64, -443, 73, 346, 312, -36, -252, 285, -311, 10, 20, -12, -2, -306, -24, -294, 186, 76, -28, -325, -76, 177, 124, -261, 40, -163, -101, 131, -81, -85, -13, -252, 120, -186, 72, 72, 39, 286, 68, 102, 20, 91, -20, -307, 189, 3, -275, 34, -6, -276, -76, -11, 33, -115, -12, 26, 280, 12, 162, -35, 259, 3, -34, 88, -27, -47, -99, 118, -76, 183, -117, 69, -63, -252, 28, -159, 137, -75, 104, 77, -99, 132, -84, -250, 42, 14, -14, 60, -76, -22, 35, -19, 96, -3, -121, -145, 47, 125, 230, 50, -155, 241, -101, -144, 72, -85, 24, -28, 119, -152, 275, -9, 349, 340, -206, 51, 113, 205, 180, -194, 42]
5238D2j00J91J4k72P1J7l3j62K70O0J71j48j09m1J51Q2J46k24M3k04P1J42k33
5261e5J20j09L26k44J61k36L5k09M5Q6lL07l14K0j97L50k90K78k29K25M3j59M8
5284aj29l2J16K53j35j49J25p5J48j88J62J1k0o3%Kl17J45J37J08J45j13k6j56
5308e2k3p7M0m9L21q2k47n1K91j80O0K55l41L27l43l8J71o7J63L5j09K07k50M6
5332Gj26K09k83K00L33k57J56j33L3j80r9K5l2L58k63J00O9L7K01k03k65J61J20
5355A68j01n4qj38K37j00l25L19J19p8O8m49L85jk84J50r4M8K09j01j58K80j58
5378f6kJ02j13j02L07p7Lr2L6J13k56K77j03l5k46L23R6j19j09L01m53J77J25
5401H7j07Q8p7J81j15k36J91O4j11J48J1j20k07J04L41j77j20J75n6k18K09j82
$$ y = [42, -58, 133, 147, -125, -54, -37, -70, -232, 38, 98, 269, 121, 12, -29, 122, 204, 350, 126, 169, -35, 36, 178, -55, 65, -44, 282, 38, 199, -37, -2, -211, -166, -80, -83, 224, -90, -70, -267, 83, -207, 71, -158, 67, 110, -49, -1, -130, -162, -46, 207, 72, -77, 48, -27, 121, -67, 95, 106, 86, 23, 23, 25, -292, -147, -10, 98, 243, 130, 104, -52, -75, -152, -112, -161, 160, 78, -169, -220, 71, -109, -49, 206, -135, 192, -151, -189, -18, -85, 78, 113, 4, 211, -39, 7, -119, 90, -193, 7, 340, 83, 239, 106, 139, -41, -140, -115, -147, 211, -52, 48, 117, 154, 355, 152, -113, 48, 168, 67, 13, 5, -133, 104, 4, -321, -2, 117, 39, 107, -342, 43, 42, -242, -92, -186, -138, 71, -30, -188, 92, -66, -68, 34, -79, -181, 126, 49, 52, -40, -4, 109, -147, 130, 27, -8, -254, 69, 165, 46, -63, 238, -215, -38, 87, -20, 68, -9, 172, 57, -179, 12, 76, -35, 113, 124, 4, -203, -99, 242, 65, -55, 120, 64, -154, 55, -127]
5423a27K92k14R8j41P7okK3Q1j92K71k80J72j30p4J69j95M13j35j49oJ39R7p6
5447A05P5l10J95n8nj5j13K24o0k20L3J18Q7J21q8m8o4j36K7L08j85L1l00M12
5471A34q3l43J60K52o9P0j2p8mK18J5n65M95k07Q6R9j48o8K47j87K50l18m5J16
5495A5J5J94l13q0K43J9J64l07Q9j66L56j10k01J50J7K52l49O7oq7p0K40j20j
5519A1o2P0K5J91q3k30j73p8L33K30k68k70J44K26N6m0j54l5L57k60R1o9l0Rj07
5544a16N9J19j10mK2K5K06n9N3k34j34J54K27j36K58m18Q3K55m84J57K88Ll6m0
5568A38j03o6%oj7J69J67k3o14J95K52j52K04l26M04j22j87L18j15k59J14j30
5590a59K12K65k21l26QM6J02J93l79K89m9n5J15K7q3k3j70L61l9j41J57j66L01
$$ y = [-127, 165, -49, 49, -92, -15, -21, -23, 0, 81, -111, 160, -120, 52, -78, -152, 17, -178, 235, 100, -49, -55, 84, 181, 105, 180, -130, 65, 7, 2, -13, -126, 98, 38, -182, -149, -31, 56, 177, 89, 41, -23, -159, -132, 176, -9, 22, -278, 134, 51, -292, -132, 120, 51, 121, 109, 31, 27, 245, 260, -305, 190, -17, 69, 168, 20, -48, 199, 12, 262, -56, -101, 15, 30, 224, -89, -169, 74, 93, 257, -50, 39, -127, 229, 119, -82, 68, 85, 337, -12, 55, 49, -38, -108, 132, 12, 11, -51, 19, 44, 235, 152, -78, -251, -329, 4, 234, -34, -304, -160, 66, 122, 82, -72, -107, 250, -10, 81, 12, -18, -9, -116, -57, 62, -48, -52, -30, -5, 201, 142, 195, -39, -173, -19, 208, 72, 330, -88, -5, 250, -234, -77, 211, 214, 178, 138, 35, -31, -31, -37, -54, 115, 282, 259, -355, -160, 92, -60, 144, -182, 222, 100, -87, 231, 116, -143, -29, -159, 53, 318, 97, -229, -221, -175, -73, 120, -259, 30, -19, -74, 41, 68, -15, -38, -208, 153, 114, -27, 130, -36, 265]
5613B65k68q6J40n6n8J53p5o0J34r6J94k60m8J07j77K00l0K2j71J81K14l35O0
5636e0p1J3k9QQ2N3m6l09M27r1K52k30j24j18K98k5p9j2l2J85Q1l02J12J38r3
5661C8J71n04n0L39J62k29J97j47k5O6m5J75k1j64P4J3r1n0P0l6J13k25L18k53
5685a04m2R9mN6L1K10m33O8J47R5K7o7q6K24k93J08j92L66k53k51L06j08P2j05
5709a29J34j21j68K72O0J06R0l22K89l71j82L74Q0j04j27M78m72Q3L5K05l19J92
5731H3L7o1NJ01j72Q7J44M0l21j3J86l26K51l12K44j0J16j20M2L5J27j13O3m3
5755G0J77q7l45J09J35j15M9j50N9j49J97R4P3k67j0K05q3q8JL63j35O1o4k82
5779a82K75j18R1J4k08M70k17l66L28L5q4l01L51l69R0M0L1K81jk20O5j8o4jR0
$$ y = [265, -3, -89, 51, -5, -63, 90, 15, -45, 89, -7, 187, -73, -121, -14, -191, 9, -21, 1, -170, 11, 225, -110, -50, -121, -108, -137, -129, -47, 6, -40, -349, 78, -13, 239, 9, -115, -233, 65, 40, -39, -51, -83, 102, 183, -119, -7, 131, 38, 209, -295, -345, -6, 156, -73, 124, -23, -48, 18, -27, 148, 127, -37, 37, 50, -41, -91, -21, -57, 56, -169, 149, -104, -146, -47, -51, 5, 36, 246, -187, -119, 28, 123, 150, 83, -3, 221, -72, 36, -156, 210, -43, -294, 12, -96, -24, -129, 5, -116, -284, -12, 48, 154, 244, -78, 211, -160, -342, 32, 112, 8, -119, 359, -113, -30, 5, 210, -109, 83, 120, 59, 64, 165, -7, 80, 224, 264, -57, -70, 116, -210, 41, -271, -27, -37, 79, -41, 1, 36, 163, 50, 113, 70, 247, 160, -185, -76, 59, -56, -7, -157, -98, -247, -50, 44, 117, -150, -160, 45, -38, -126, -125, 238, 103, 164, 100, -182, 93, -25, 66, 80, -128, 342, 125, -241, 87, 122, 38, -263, 88, -281, -191, -151, -120, 161, 160, -60, 5, -13, -77, -78, 12]
5804A2K8M2j63O6q6k6K96k89J19K1j03R0J8J13j71j72K41r4J46k77K75j40M40
5827C86m57j09J2M46m53J73P0J0J53k47k1M84l40M0Po5k68L56j50p1K0l20M90
5850A46l29N4K99j91q2K94l44P9jj10K54k46j70O33k84R2o6j31J39j68K85k35
5872h2n2J76k27L1J17j27M14qq0j31p6j18l7M89k78Q8k88R9J33J11j13j2j6L90
5896D03p88M46%K86m92l8L7q9L59J5P6q1j59J1Q0J42j86j91J36R2J54k68R1j19
5920h3J95m13j4L28J03J33l55K42j10j53M60j28k19p7K78k58J35p1J40L3K30l94
5942Bj45J26j97K22j73J12KM1j00M5M7Q8R6k88J53k0L7P3K9m5l6J45l45K2K94
5967A85n3m82qL83n8J32m44N98j82j99J15P4k48L96j40m3P8j30K71j23Oj94o4
$$ y = [12, 40, 82, -81, -15, -101, -127, 169, -120, -1, 20, -83, 7, 25, 138, -33, -205, 36, -58, 88, -189, 86, -54, 386, -71, -180, -168, 278, -175, -2, 68, 78, 231, -16, -37, 447, 107, 147, 154, 89, -179, 177, 27, -44, -24, -344, 146, -183, -129, 170, -21, -103, 191, -153, -74, -75, -185, 69, -177, -347, 286, 2, 94, 28, -103, 36, -132, 153, -82, -134, 42, -185, -154, -37, -164, 250, 242, 162, 31, -45, -163, -200, 289, 11, 99, -189, -90, 43, 154, 41, 29, 13, 403, -385, 61, 61, 347, -145, -183, -146, -235, 124, 139, 215, 134, -25, -14, 66, 208, 22, -169, -33, 59, 213, -55, 36, -83, 112, -301, -315, 13, 116, 249, -106, 136, 26, -127, 333, 205, -14, -91, 187, -71, 64, -7, 133, 166, 396, 2, -143, -17, -214, 8, -165, -53, -51, -10, -110, -65, -18, 70, 166, -122, 31, 11, 48, 121, 150, 105, 69, 214, -131, -109, 185, 132, -350, -358, 25, -33, 99, -345, 253, 71, -128, -13, 61, -187, 209, 69, 26, 104, -26, 245, 122, 128, -66, -130]
5990a30K42j75J08M9k28J55J8j00J43l9j31j06L15m42J76J78q7j15N4O1K41l27
6012a40J67Q8j16l8P7J00j5n15Q8K20J62k08J22k01J00J90j35L5J29j57P7l4j19
6035a23Q1p6K85J28m94M40J47n58P8J73l3J49j85j78J31k12K87J06l8r4J5J37
6057A66m7n0j60J55j81n2J08j05j93L01L22k66K40m89L32q7j48J74N7j66J2J59
6079H2j70J98q8k2K23p5P3l75j5J52M1j95Q6K34j6q3P9j31J21j97R1l9L10k51
6103C3K20k52J83n68M01O4p7j22J13j58K46l9n4J96j95P3k73L12l76K09j12J54
6125b2l38M42l10M07J1j60j21O6J34j41k5j12K68k21M46j20n2k9l04K16J09m89
6147c45L55L6kR3l00J63l4J63k16J03j48K04p5P1M6o1j7l9l09L98m5mr4j9K26
$$ y = [-130, 112, -63, 45, 94, -134, 21, 39, -61, 82, 43, -88, -194, 121, -321, -145, 33, -54, -169, -115, -54, 187, -140, 27, 115, -1, -39, 38, 138, 123, -392, -304, -84, 78, -130, -8, -209, -109, 81, -54, -19, 110, -47, 30, -4, -123, -42, -118, 167, 295, -199, 241, 388, -170, -92, 81, 48, 197, 12, -166, -35, -247, 40, 146, 108, 14, 29, 166, 119, 69, -91, 64, -117, -169, -61, -166, -359, -58, 264, -2, 238, -251, 81, -6, -154, 20, 77, -89, -77, 82, -88, 110, 22, 0, 223, 148, 221, -154, -169, -17, 24, -171, -85, 149, 133, 50, 129, -2, 119, -78, 13, -26, 284, 33, 253, 1, 184, -384, 17, 81, 4, -118, -5, -163, 83, 44, -10, 186, -9, 64, -209, 103, -273, -64, -176, -22, -360, 82, -228, 179, 190, 30, -91, -25, 109, -32, -57, -169, 99, -122, 324, 204, 152, 123, -181, 35, 144, -345, 10, 46, 44, 137, -163, 0, -34, 129, -87, 16, -132, 72, -3, 68, 114, 53, 36, -3, -312, 86, 41, 37, -57, -76, 150]
6172A50p8J17q3k93J15O9j52O1J55j0O9J06Lj91j6Q8J42j39j63J62Q8k4j11j10
6196d5j47Q5L9j75K13j00M7P7j89K08k12L33l03K83P0j08k55K51J20j51L8n6k63
6219b40K22j00l2M1J41m26L75J14k12K28j48k15K36L9K3l17L20J78k50m3K25q8
6241G1k11L49l23K11j90p1m6J12J57r3J40j74j63K99j13j13L32j62P0r6J46p9
6263E3J76n31J62O6r5K66j84L24M2j72l44M90k11l02L22k0p6k30M63k84Nj83J29
6286a34K59k86J95j24K00J43j29k22O9P8R4j00j5j22j8L38j92q5j79J33Q6L36
6308C25k91p5O5J94J26o77L69j13J04rKj13k9J82j44j69M4J97mn4N4k03L42k15
6332i2j06K1J12R1o2l0J44l16L2M69l05j94L36k02j11M12n47O66k51j23K17j31
$$ y = [150, 72, 189, 106, -187, -72, -3, -155, -94, 61, 51, 120, 226, 229, 38, 22, 110, 252, 113, -50, 112, 200, 176, 65, -45, -192, -107, -68, -243, -30, -130, -83, -6, -195, 13, -199, 134, -169, 114, 184, 76, -179, 72, 192, 41, 79, 23, -240, -18, -118, -150, -109, 32, -394, -19, 95, -117, 111, -37, -252, -16, 23, 46, -271, 49, 227, -23, -66, 159, 71, -140, 209, -114, 97, -93, -164, -210, -98, 59, -34, 106, -68, -231, 68, -45, -158, 174, 12, 82, -14, 132, 53, 229, -302, -140, -74, -169, 97, -87, 237, 279, 107, -237, 253, 42, -260, 62, 42, -34, -264, 199, -85, -80, -263, -134, 125, -161, 34, -90, 110, 253, 124, -98, -29, 49, 143, 43, 28, -94, -112, 226, 34, -51, -230, -97, -11, 325, 34, -41, 24, 218, 344, -333, 36, -77, 27, 18, 20, -93, -122, 60, -84, -253, -209, -12, -16, -70, -16, -219, 123, -92, -198, -177, -65, 26, -36, -66, 78, -238, -206, 263, -42, -236, 100, -102, -213, 199, -348, 318, 67, -56, 161, 30]
6354C0j1Q5k16J88j94q9j19J80j25M83k18j14J33J3P6k09N9k10K16K05j78N7K04
6377B46l03j67K56l03K78K02m09Q1J48j8j17J52J54k74k5k35K44Q9j42M6j12J50
6399e9j67R0l7J8O1l1j7J51j68L15Nm81M33q2m7j55L85l01Q2K53l86q7K77J2n4
6424A0J9Rl36J13R6K6K78k15J70k69N8P3j02k42K68o2K17k43o6R9J16P5l5O7k43
6449a19K28j00n1L2L4P2j3l33K27J18j95J46j9J80k75O9k1M3j22J52K3j66J59
6472F9p2k1j01K83k72JQ4J09J16k02L0L0L7j18K39q5l97J66J37k36L81pl24j26
6496b79L63j03r0N8k58K37L56k94j21K30j5k33O3M6J18J7q2l97N39m26L48K29
6518C06k62O0j34J37j0J25k98j87M42j30q4Q2l35K58L70k52J6K7p2j4j59M43m95
$$ y = [30, 19, 104, -112, 76, -118, -207, -326, -146, -271, 212, -6, -120, 13, 26, 102, -107, -48, -258, -42, 163, -15, 42, 246, -57, -224, 32, -271, 7, 209, -200, -119, 29, 11, -106, 46, 200, -74, -99, -334, -90, -1, -143, -97, -209, -59, -226, -136, -173, -155, -94, -125, -142, 9, -159, 156, 161, -320, 113, 31, -16, -171, 214, -87, -5, 248, -138, -225, 52, 64, 10, 29, 38, -298, -185, -89, -63, 215, 0, 170, -99, -41, 32, -70, -312, -44, -106, 111, -132, -198, -99, 17, 92, 57, 124, -119, 109, 9, -42, -10, 24, 96, 83, -250, -23, 95, -100, 46, 27, 207, -68, 1, -20, 23, -99, 53, 76, -90, 69, -3, -24, -125, 158, -114, -113, -29, 80, 196, -6, 24, 54, 91, -27, 212, 127, -270, -104, 33, -203, 178, 171, -153, -279, 84, -19, -109, -51, -309, -72, 284, -10, -131, 99, 84, -149, -86, -40, 78, 95, 13, -384, 155, -271, 77, 306, 44, 104, -30, 107, 97, 222, -76, -263, 179, 49, -35, 47, -288, -30, 340, 88, 104, 131, 59, 45, -114, 329, -166]
6541a66L79l42J56k21K40Qk69P1J65J17m75N76k30J25k86N00j78m0Q9l18J10k02
6563a91K14n2Q8l1j10J06K26k69J5k04J12j6L15j61j86J68M6k41L6M9K6J42K51
6586C33n00RR9j92L21O6k64N80o35j05K81K19k77J20N8k19L4J51j70j20L21K53
6608C63k24k6m42J63K43nj53L26l08j80L81k7r2j1K62o9j80j3M3k93K35R4j26
6631c9k59J10r3J42K93m9o9m6j10K62k09K48k28J19j44o2Q9P7k50K90K50j95m72
6654c45J91J43k24J39L11j59l25L40k4O2j56r6LL34k03J12l90J16L16n6R3j54
6676B8J7j89P1O3j5L59l70j35J80j52J78l7J49J60k14p0P%J88k04o3O6n5K19j09
6701G2j11J81k87L27lj59M3pL0O0k29J12j17m2J97J3j70K1Nj1M1J84K2k43K2o7
$$ y = [-166, 213, -129, 27, -194, 46, 54, -215, -144, 21, 138, -337, 239, 9, 134, -152, 348, 170, 130, 219, -99, 11, -191, 23, -29, 59, 28, -82, 24, 250, -19, -4, -208, -96, -112, 203, 42, -144, 24, 70, -171, -135, -86, -60, 82, 333, -167, -158, -59, -251, 70, 136, -128, 452, -183, -288, -7, 212, -65, 55, 113, -106, -72, 79, -91, -211, 110, 363, 139, 113, -329, -166, 77, 72, -81, 245, -63, -243, 138, 111, 19, 8, 270, 201, 21, 8, 51, -242, -7, 87, -39, -298, -188, -281, -139, 154, 105, 36, -10, -120, 142, -67, 181, -47, 72, -72, -134, -45, 32, -218, 72, 322, 127, -345, -154, -11, -235, -96, 215, 56, -269, 71, 47, 109, -47, -143, -140, 194, -9, 103, -287, -171, 145, 89, 182, 28, 45, -144, -73, -10, -25, 334, -36, -171, 9, -143, 35, -2, 147, 307, 93, 23, 30, 30, 218, 14, -49, 17, -38, 181, 72, -39, 142, -145, 182, 179, 20, 63, 56, 86, 146, -83, 29, -88, -130, 67, 80, -90, -69, -64, -75, -34, 150, 172, -71, -49, -116]
6727a16K82m45M30j44j01R7l7l0L94l20j6K6j66J54L7j18m9J52K52j85o7j40M0
6750g0j93J92N7J16j70M2n1j06L57j45l7n5L8j59M14j06K63l01O7k77J07J65k25
6773g7J07K01j7m11L21q2q0n4J67n4L08r2k60l9m7O3K04j92J95r9l82L26Lk23
6797b14L19J01l5j25j76R5K23j52K22l15J80l92L74j15k6j53L1J97q7K68J44j92
6819A72Q8l49k14J10K51l47L13J41j84k8k03K3J63J19q7j04J64k02N20n29L10
6840A27p4j63j20O03l53O7l7j00J12q1L75l17j52r6L13K9l84M2L2J04K6O1j23
6863a09m3J89J30k11k17K01k0J56j41J44L0n7P2j97K18m48M52k83K26n2J77k82
6885f5K11k96O7J34j55j02K69m8j87J79l8K14l43m8J21l0J44k76K73R1l7K2l49
$$ y = [-116, 166, -279, 151, 7, -94, 3, -34, -64, 330, 10, -6, 20, -146, 8, 45, -73, -122, 30, 282, 97, 30, -110, -70, -263, -71, -14, 102, -68, -26, -77, -183, 174, 29, -8, -63, -25, -184, 230, 124, 387, 86, 153, -124, -17, 148, -77, 30, 231, 214, -197, 124, 42, -38, -92, 75, 21, 329, 237, -23, -62, -109, -46, 158, -34, 161, 62, -320, 6, 9, -214, 105, 206, 171, 46, -130, -35, 188, 36, 258, -57, 123, -269, 105, -10, -36, -189, -158, 39, -48, 220, 364, 172, 260, -89, -303, -193, 58, -289, 24, 165, -19, -47, -250, -227, -64, 55, -32, -136, 28, -174, 346, -183, 127, 53, -110, -230, 373, 20, 87, 50, -50, 62, -19, 356, 39, -113, -209, 104, 133, -251, -209, -177, -73, -47, 14, -109, -152, 37, 167, -44, -261, -60, -80, 76, -65, 79, 109, 52, 124, -73, 145, -303, 149, -134, 92, 40, 217, -65, 146, -150, -83, 51, -104, -206, 63, 15, -172, 7, -31, 183, -160, -208, -87, -117, 27, -249, 24, 115, 78, 100, -249]
6908b49K79j70J90q4J61J28J63n51p0L25j59j6K6Q0k50J81r4K45j69lj56J06K37
6931A50J51l57N5J32k71l2o4M15k06m6J4J37j06k94L83j48P8n9L6J11j23K5p1
6954i0j01K87m5J01j84J4M38n73R5K52k5j33j96J96K15k47k54K67o2L7p5L10j34
6977I3j10N0J6J45O5k55n24M95J82j28rk03J91o6J40m6k28L08j61k68Q7J12L80
7000B66l94K38l72M94j74k60K87j21Nq5r3J4K41L8jj72j82K89k35J45O0J27j98
7023h3J14J29k06K41j63J00j51r6O8o4j62O2J85k67r8O31j83J4j69Q9k59K69J25
7046A26J5j09j4J52r1K8K69k31j70J40j02L2k79L32M6P8j49K51l77N5k76L16L30
7069C72m32K4J66lm70M20n8M22l69j45n5K31j17jO3m0J15j4O7k41J4K64o0j5k14
$$ y = [-249, 30, -140, 50, -34, 127, 255, 418, -133, -203, 122, -37, -53, -27, 53, -197, -16, -110, 135, -34, -37, -193, -87, 150, 301, -56, -1, 131, -140, -172, -236, 179, -27, -73, -59, 78, -28, -322, 61, -87, -9, -68, -32, 79, -44, -19, -90, -191, 96, 51, 152, -32, -18, 420, -153, -58, 194, 169, 36, -160, 36, 251, 4, -250, 17, -45, -8, -83, 227, 93, -17, 33, 49, 194, 259, 4, -520, -25, 157, 29, 20, -183, 8, -58, 82, 36, -192, 116, -45, -313, -226, -114, 266, -128, 110, -262, 232, 58, -202, 85, -36, -31, -116, -209, -195, 46, 84, 83, -89, -271, 18, -217, -72, -12, 115, -83, 31, 160, -46, 195, 32, 132, -19, -115, -47, -111, -273, -211, -26, -293, -391, 240, 57, 71, -98, -9, -268, 1, 126, 141, 32, 18, 170, 79, 107, 376, 145, -25, 115, 13, 45, -234, 98, 144, 222, 73, 324, -53, 2, -274, 42, 372, -60, -36, 130, 127, -343, 77, 19, 441, 72, -73, -128, 103, -14, -15, 48, 8, 123, 109, 176, -65, -51, 213, 153, 138, -76]
7094g6J17J98l6ok03j40RL0n2J73j67J20l3r8R7P0j21R7r8K9NJ02P2N8l10J39
7120b4K75k34O1J02j66P3r2k27%J42K33l29N9J65L7k20Q8j03r0O6K82q4J20r3
7144D1j21j03J4J27J35k95L93m41L28j5j24K48k24K80l83L80l87M48k34n48P92
7165C11k61p9K0j0j10J81O6k06K69k59J5p9p5O52m67J13M9j86K08l90J88M1j51
7188a60n7K05L3R5K2j52j1q5m4LJ19J2j23J13K19l66P7r0l7M28r4l7O4j26J40
7213A48j92J98n11N51L5k37J56l07k30P2J39J85J38J11k57P9j49J22K08j88k03
7234a32M38k46J06J34n86J70jM3l7J28N7p1R8k97k4R6k5K49j21Nj74Q9J2N4J51
7259A16l04M4N0K92J57m75L1J90k96N38K5l70Q4j26o2K8lL93l12J78j39J7k38
$$ y = [-76, 41, 239, 203, 197, -6, -146, -137, -107, -159, 14, -153, -33, -66, -164, -67, 3, -118, -21, -119, -90, -85, 17, 89, 147, -163, -24, 251, 17, 78, 180, 14, 87, -5, -232, -232, -90, 143, -186, -127, 38, 75, -145, -57, -160, -250, -184, 98, 14, 134, 41, -80, -183, -169, -42, 93, -202, 191, -250, 78, 63, -61, 187, -37, 243, -140, 240, -147, 301, 67, -481, 311, 50, -29, -9, -19, -129, 52, 118, -88, 181, -78, -63, -142, -217, 435, -32, 81, 130, -56, 152, -238, -50, -9, -160, -217, -12, 21, 116, 138, -14, -25, -110, -154, -151, -32, -20, -143, -30, 189, -177, -100, -190, -227, 201, 107, 70, 134, 8, 148, -44, 154, -357, 194, 229, -8, 148, -159, -389, -317, -178, 7, 145, 256, -1, 78, -71, 51, 259, 71, -132, 306, 60, 166, 300, -286, -116, -117, -74, -111, 17, 74, 3, 101, -196, -220, -124, -149, 100, -21, -16, -190, -101, -89, -35, 116, -188, -144, -94, 198, 355, -120, -89, 101, -195, 343, 368, -2, 82, -44, -106, -78, -81, 312, 0, 178, 39, 56, -182]
7282a82L77pk14Q9o5L8j77k00M63m6j79L16m64O1K41j49J46kn7nN4l6J2k5K56
7307B45j38j28L1j20N6L05k53M0J38q1j98J29J71k39K65o8J50l40j41J09J33O4
7329A30j15P7j28K10m59O07k05m9l1L8j22L1l57M31Ol0p9P3k27N1J92j56jR1o6
7354h8J37p7k59K38R8j98J64k3J96j20j29Q2j42J02k43K43k43O7P1K63j31J32
7376A40q4Q5P2k77o0K04O0l84K21L90k18ooj26k4K5j2J40pQ8j2o22M85j63J78
7401H7k18J40k66M49k33j75J34J49k50K51j20O9R5j60J16p8o3p0L28l23O4O7J65
7424A58k09O3R9JJ72j85k27K22j21Q5J92l36M07l58KJ0j09Q9J7l21K96K00P6l68
7448a45R2l7J13K6o1o9J60m1Kq6Q1m3M5j25mK19Lj01j04L10j99J49j25J0l16P6
$$ y = [-182, 195, 188, -26, 63, -2, 36, -141, -341, 122, 76, -103, 213, -251, -190, 51, -98, 48, 46, -11, -16, 38, 2, 14, -11, 245, 107, -21, 10, -110, -54, 251, -2, 38, 176, 95, -103, 26, 197, -42, 223, 155, 305, -35, -176, -67, 66, 130, 15, 92, -36, 174, -285, 322, 117, 68, 37, 75, -47, -16, -373, 58, 64, 34, -45, 28, -199, -148, 44, -112, -113, -22, -88, 49, -28, -287, -49, 49, -149, 15, -8, 188, 68, -61, 21, -121, -19, -262, -19, -262, -195, -124, 139, 8, 140, 56, 141, 213, -64, -124, 80, 140, -244, -23, 367, 149, 143, 137, 11, -13, 12, 0, 140, 133, 221, 209, -413, 72, -91, 87, -131, 9, -257, 192, -41, -216, -82, 67, -183, 68, -52, 17, 112, -48, 68, -10, -73, -143, 185, -138, -74, -7, 158, -51, 12, 111, 112, 284, 99, -128, 94, -27, 58, 250, -86, 321, -37, -35, -25, -134, -45, -28, -349, -53, 147, 223, -145, -53, -90, 23, 49, -12, -81, 79, 38, 40, -46, 35, -8, 37, -88, -92, 127, 130, 29, -75, 235, 36, 185, 60, 70, -246, -170]
7474a70j01Q9K54L2j8j8k25K39p6K04k98K43j34j28k1J96o1p9L89l19j42K52j14
7497fOK0k28J28J78k6k30K33k48J92l37L61m66L33k6J81l06K44J46j42J32L5k20
7520d6n6nK78l89J97J94p3r7Q5j35Q8Mk25J55L7r9K53o0k84J67j64L81l54Q0L14
7545B46j71k58M12J37N5l99N12q9o04J09k1M4L31Ll04j03J33k38j7M97l45K64
7567A94p7k00K88k55p0J17P8k8L0l8J99l34Q5j3M1p8L03R4k82j99NJ97m8L2k6
7592A5J78l44K07K1j26N5j43J82j2q0J32k77J80J11k69M57o09P8O1J22J33M9L
7615A24j89J26k28J48j49K10j83O1j76L95p1J6p2J22j89j85L20J33k06P3j09K64
7637B35l72o9K70J79m85K88j88J94j73LM06l8j61m6k68J69L12p0n3l39m7J1K16
$$ y = [-170, -271, -182, 72, 104, 86, 68, -157, 82, 6, 210, -88, 155, 21, -107, -128, 68, 7, -72, 317, -2, -144, 108, -6, 0, 20, -208, -80, 98, 72, -158, 75, -173, 19, -318, 43, -423, -90, -116, 65, -241, 3, 149, 7, 139, 174, -46, -102, -107, 171, -218, -21, 173, 100, 3, 88, -47, 41, 45, -180, -25, 12, -87, 166, 106, -178, -11, -175, 206, -148, -68, 246, 75, -183, 229, 366, 421, 22, 534, 445, -159, -50, -71, -27, 304, 307, 3, -100, 33, -205, -222, 275, -70, 194, 117, -83, 205, -50, -120, -3, 75, 47, 77, 39, 238, -96, -11, -24, 17, -61, 242, 336, 54, -145, -140, 57, 9, 41, 15, 193, -151, 56, 77, -49, 6, -137, 45, 33, -47, 85, -192, -12, 99, -170, 287, -322, -244, -183, -61, 72, 121, 124, -65, 61, -167, -19, -168, 42, -141, -80, -256, 139, 68, 84, 12, 134, -55, -240, 80, 213, 7, 80, -29, 235, -137, -206, 64, 243, -242, 46, -142, 52, -121, -118, 288, 250, 89, 43, -225, -56, 256, 186, 133, -206, -253, -242, -26]
7660b6j39K34j76J26o6j09K93k50j1K99k03M15o35O00j6m10J13p3MJ79k60J25
7682A4n7J44j49J72j38Q8Oj51J06Q8j6ok18J09j3m1J59J58j95j81M01l17l77L45
7706f9O1Mk55K59J29j2nj29Q9m54L27J3k8O7j36L4q4M66k59J42j39O6j2j16K03
7731A62k32n6L08l14Q9j09M0J05J57l07n0j4L81P7k69PK81k04M8j77J6p0M85l42
7755A2J29j97nK77o7R2j28k45J13k24K67K74k59jJ66l8k79K57j02j78K63R0k37
7778b0K04j51J04K05n19j63N73k23j37K28J97k84L1P8o7Q1k06m7k7k7Q7j35Q1
7801a37L85l12M9k5Q5J26j60K02k31r9m3J13J44j93K7Q5J21p1M6j26k0j3O4k17
7825b00Q5L7J70k35K42j05j68K09j8k95K49j87L58l36K33k38R6L03l02N0j0P4
$$ y = [-26, -165, 69, -107, 19, -47, -156, 137, -113, -124, 175, -28, 387, -248, 352, 336, -74, 39, -34, -30, 149, -111, 14, -43, 101, -48, 124, -14, 74, 80, -71, 35, 123, 107, 101, -117, -8, -21, -62, 97, 255, 60, -121, 280, -37, -414, -69, -8, -4, -259, 0, 129, 117, 112, -17, 72, -382, -55, -42, -70, -3, -139, -105, -189, 277, 18, 160, 21, 87, 75, -41, 162, -70, -126, 182, -132, -43, -152, -112, -7, 150, -157, -207, -221, 160, 237, -32, -25, 256, 52, 100, -77, -61, -131, 354, 12, 141, -56, -61, 216, 149, 241, 113, -132, -19, -243, 24, 298, 39, 38, 204, 166, -113, 144, 42, -136, 127, 217, -20, 184, 33, 137, 342, -177, -340, 233, 10, -127, 101, 298, 14, 45, 123, 56, 137, -69, -116, -143, -170, -83, -218, -137, 248, -64, -15, -40, 45, 171, 11, 213, -18, -117, -160, -47, 97, -96, -69, 16, 137, 66, 112, -14, -34, -47, 17, -200, -115, -78, 92, -143, 99, -6, -174, 35, 17, -278, -29, -216, 142, -194, 39, -199, -103, 200, -102, -52, -62, 12]
7847A2oJ18j43m1J45J34k32J83k71L5j90J67J7K19j67K9l4N2O2q8O3J16l02k9
7871a51K4J79j05J53J27q7k65K67j38j69l2K24J28N4r4k47K16j10J20K0J70k21
7893F3j52o5j2J86k25N5L96j82j58J15j11K07m9M9o7q0M0K54k6k65m6k35K33J41
7917F6j18J06j50M5M4J15j48K03j56L4O6m0J78l72K66J06k62j42K28j13j07L47
7939A96l17j82M03J55m54N3L67n5l24N26j80m09J78q8n2K85K42n19K49j19L35
7960B90l68k4K3K23K6m05K7L27j67p1Q6L3Mk6j48K84J2k17n9J98L5j84J19J1N6
7985H5O0o9k00K22R0K01k18j64j23L48j65l01J92j81J68L02l37L6K01k61J60J7
8007F3J07j46j62K01l15M82j06k08L28k88k6k3l0P0J69k88n5J76K89j51m47M15
$$ y = [12, 6, 124, -19, -60, 85, 219, -13, 170, -101, -66, -256, -89, -72, 147, -20, 9, -25, 27, 89, 1, 64, 180, -122, -151, -127, 52, -53, 100, 227, 140, -125, 142, 4, -165, -197, 27, 155, 209, 115, -132, 84, -26, 94, 114, 284, 63, -89, -154, -166, 20, -205, -150, 246, 64, -94, 21, -90, 117, 68, 117, 50, -30, 10, 264, 238, -27, -73, -308, -75, 66, -52, 54, -96, -51, -7, 108, -40, 163, 7, 41, 107, 67, 245, -127, 139, 245, -17, -159, 69, -44, -151, 196, -121, -303, 100, 255, -199, -146, 221, 166, -158, 368, 188, -221, -43, -131, -183, 102, 344, -175, 74, -45, 290, -78, -102, -79, 144, 170, -235, -208, 119, -48, -119, -33, 0, 4, -22, -170, 114, 126, -91, -150, 48, 83, -101, 18, 29, 85, 145, 76, -124, 98, 188, 389, 171, 7, -116, 232, 67, -234, -42, -223, -55, 247, -90, -54, 147, -114, 46, 63, 170, 24, -138, 63, -252, 230, 124, -84, 244, -44, -70, -93, -123, -53, 116, -172, -227, -51, 238, 87, -360, 55]
8029E5l88K16j8J29j8J71o6j52l3j02L70j89j88J92N6K27k44Q2j15Q6j27J8O6
8052B8k71O16l47k43L65k32k2j76N9K74k02j02J84J46J28k5l22j28L15j19lL59
8074B82l24j8P8L16j74l82J59%J77j56R3L1n9r6n9K67k60K50J74m69J69o1j82
8097b44J51l4q1L28J32J02k53p0J75l35J91j84K2N6K25r5k33J14J30l69J12N0
8119a10Q5m1K05l4J25k30j21J92J02j51oM9r2N2k35Q1l4lL35k43J1k64K64j22
8143a85o3M72k09%mJ10p5J91k83K0K87j27l36J93K3k49J31K17j40J4O1j16J84
8166A16j62N7J16k79J70RN8J75l97J70q3N6lJ12m5k35K48m7k9r9K52j17j66J44
8190B1j14
$$ y = [55, -333, -117, -135, -6, -24, 147, 81, -71, -104, -206, 164, -25, -213, -21, 35, 262, 18, 100, -15, 71, -56, -38, 28, -243, 373, 26, -217, 148, -84, -106, -282, -223, 51, -151, -253, -69, 77, 205, 180, -142, -270, 45, -74, -77, 282, -42, -60, 18, 334, 160, -222, -63, -63, 114, -42, 51, 82, 23, -73, -132, 135, -125, 125, 299, -170, -1, -62, -244, -93, -127, -208, 120, 252, 354, 101, 31, 206, -129, 62, -122, -100, -44, 181, 86, -147, -33, 97, -272, -160, -110, -25, -66, 139, 105, 230, 0, -121, 71, 173, 22, 16, 65, -27, 25, -210, -129, -163, -166, 169, -74, -63, -327, -63, -185, -248, 224, 15, 15, 11, 121, 46, 237, -46, -26, 261, 134, -202, -9, 14, -235, -104, 113, -27, -13, 48, -68, 116, -46, 11, 127, -152, 18, 27, 85, 260, -137, 33, -50, 6, 3, 115, 70, -165, 83, 36, 7, -92, 160, 43, -123, 21, -93]
8191i3
$$ Imaginary data points
##PAGE= N=2
##DATA TABLE= (X++(I..I)), XYDATA
0@%%%%%%%%%%%qJ6j6J6j6K4l2M0m8N6p2Q8j04J20j36J56j80K08k40K74l14L60
33A92m08M60n18N82o54P32q16R08j011J123j244J377j522J680j853K044k253K482
51A301k733L010l320L666m055M496m999N582o265P075q057R282j0854J2958j5938
66h851K0510k8510M6577j66264k658J67295j33723M4432P3708j9914L378R5846
78I1826j5480k0319L1779k4000p6493N8072L5230p8976N224N7360r6431n0371
90h2579O9011j0057m3530M0057j956l7334K3565M7183J9242K3816n895n0943J3784
103D364Q9740j5739q2825J1143Q600n1675P619J4113k9389J1936J0101l2421J6586
116c7847N3729N696j6449J7396M723m0461M040N1745l653k0003Q916k8691k0579
$$ y = [0, 0, 0, 0, 0, 0, 0, 0, 0, 0, 0, 0, -8, 8, -8, 8, -8, 16, -16, 24, -24, 32, -40, 48, -56, 64, -72, 84, -96, 112, -128, 146, -168, 192, -216, 244, -274, 308, -346, 386, -430, 478, -533, 590, -654, 723, -799, 881, -972, 1072, -1181, 1301, -1432, 1578, -1742, 1924, -2131, 2365, -2634, 2948, -3317, 3758, -4299, 4983, -5871, 7087, -8851, 11659, -16851, 29726, -136538, -139196, 28099, -105624, -61192, 12516, -7398, -4020, 91826, 76346, 56027, 87806, 63806, -12687, 45385, 80615, 1639, 6863, 64223, -32208, -82579, -13568, -23625, -67155, -27098, -29054, -66388, -42823, 4360, 23602, 47418, 41523, -9420, 4364, 94104, 78365, -4460, 6683, 15283, -36392, -28773, -14660, -44049, -32113, -22012, -54433, -37847, 15882, 21578, 5129, 22525, 27248, -13213, -9173, 42572, 38919, 18916, 27832, -859, -21438]
129b1438L3513P794k1482k0714l2304m616L4307K4340k88l991J6661J4901j0591
142A6092J0232K2290j4112j8766j2698j9038M531J2017j325l056j8130j6277P625
155c0615O693J4772J3955j9436j3615J1210J4008K5361J5724j1573j3214n105
167H165R034J1369n845k067r058k9084l049Q066n526J2660O035k0118j216J2417
181h217R521J4824M670j0750j7909r914J2930P079k473M212j5058j2855K1987
194a953J0801j423R438j2627j7223Q641Q891M393N826L27o874j0906L400J2846
208A3557n274m319l781k6988p678J8227K661O581Q014j3563k591J6475J6033J0125
222B7479k580p252q660q793R716O930j1402l078r087j7765P583J0628k759L445
$$ y = [-21438, 12075, 19869, -1613, -22327, -54631, -59247, -24940, -600, -888, -4879, 11782, 26683, 16092, 26324, 48614, 34502, 15736, 3038, -16000, -11469, 548, -777, -3833, -21963, -38240, -30615, -23922, -9150, 4805, -14631, -28246, -17036, -3028, 22333, 38057, 26484, 13270, 8165, 17199, 28568, 22723, 20656, 11598, -17486, -20535, -12469, -17995, -5335, 700, -19418, -20634, -8217, 1304, 16128, 20798, 10048, -7861, -17775, -4845, 2234, -239, 3973, -11085, -23940, -1953, 8848, 7425, 16863, 4236, -12987, -4346, 4545, 8938, 14764, 15091, 8217, -2689, 711, 13557, 8283, 3964, 183, -26805, -34483, -16256, -13595, -7014, 1000, -12563, -15154, 1321, 17354, 27479, 24899, 17647, 8987, 194, 9910, 16840, 5438, 2360, -6727, -24492, -16909, -6281, -9040, -5595]
236e595m580j0333K411P442J3776J0080l493k177k875K331J7545M780r723p429
250A2160j7110r710R203m70k720l096j1618Q62J0191R050J2686J915p140j153
264C050k445O424J1259l704m703n704j1602L333Q074r61m81j1106j3505K804M993
279a4274Q251P586m870k082L968M437J4670Q511o148m876r860o498N608j280l899
294g56m596j3801k775P397M487Q665J942p726M63K061O289J2432P60m145l379
309G318o394N235Q737j443j984j0853j4587P45L012J719L633o783n815L114M944
324i402J3338J0055k751r69m215l262Q044K616l495l315j1383n689M343J883M811
339F09r94r147j847L65L361J0789J212m934m85j841O008J0490n4j061n445r398
$$ y = [-5595, -10175, -20508, -18097, -10655, 3121, 13201, 9708, 7531, 4656, 6987, 24532, 29312, 19589, 12160, -4950, -14660, -5457, -5927, -8647, -11743, -23361, -22499, -12308, -3258, 9428, 11343, 4203, 3050, 605, 7029, 18288, 14584, 9881, 4177, -7425, -4092, 3982, 3021, 2540, -8566, -22071, -19267, -14274, -6023, 1563, -3307, -5389, -1421, 3016, 17686, 26197, 20049, 15173, 5313, -1185, 4423, 3143, -756, -5352, -19153, -21928, -14531, -10044, -1379, 563, -7163, -6700, -4639, 1650, 14082, 14842, 10697, 7318, 924, 6159, 14896, 13453, 11469, 616, -13971, -13226, -10214, -8495, -4862, -11645, -17460, -14346, -9402, 3936, 13991, 11240, 10271, 6056, 2794, 10838, 13454, 9959, 6644, -4739, -10428, -6085, -4202, 609, -385, -9532, -11379, -11014, -7653, 3136, 4348, -586, -1071, -2912, 3096, 13586, 13532, 12471, 7026, -2372]
355b372J049K009K25J030r017q539K290K736P548Q366k849k139k105q04R492N162
371A2082k428k608q972m461O016K528K311j007r372k898J367J903P177L30m332
386b364n01l233M139J0737J506j603k889p585J542M843p06m53o539q126n75K374
402i433O010N731m406j552Q47l14Q732O302l827r75m572n682M070M395N82j973
418C935p367m737r50K972P949k006o998O49k293K127J2444J989l380J194k962
433B566p37N452K786k274o069m769j069k980M174N236p351k215K424m822O187
448c461J0769l257l907K89k262K667O173K817n080o821M71Q6j170P598j403j0938
464g429J527Q27l604P969N301n224o04J145k9L362N987J324p379n271J245k798
$$ y = [-2372, -1323, 686, 911, 1941, -7076, -15615, -13325, -10589, -3041, 5325, 2476, 337, -1768, -2572, 6920, 12082, 9654, 7046, -1926, -6387, -371, 2157, 4468, 3461, -5911, -8809, -7442, -5539, 1638, 1968, -2364, -2865, -6098, -1959, 8778, 10284, 8681, 5792, -1793, -251, 4592, 3886, 3433, -3106, -11232, -11807, -9433, -3423, 2308, -2098, -3650, -2803, -3117, 5615, 11917, 8090, 7115, 2543, -3139, 931, 5326, 5908, 3935, -3432, -8169, -9119, -6147, 1802, -204, -7202, -6553, -8846, -6719, 5725, 7714, 4334, 5528, 2566, 1829, 7281, 10067, 7793, 1724, -3045, -4114, -7094, -2920, 2316, -5035, -7250, -4826, -9648, -3461, 7308, 4051, 144, 433, -1829, 838, 7011, 9828, 4748, -2073, -1602, -1516, -2686, 4912, 3509, -7429, -5902, -5075, -8679, -710, 4591, -633, -1237, -92, -121, 3241, 9228, 10552, 3173, -2098, -853, -3651]
480c651K084P518q161p133M198j470J553R272j453o835O23K356J980L729M163
495H773j761o464J698J859m692N042K411j1079l165K295l392M677O239m609m482
510f650L61L501M608L790K367m465n100M150J934l81L318m928p163K258j91j006
526c597M950r67l462q00j143J173L476K350Q78m415j540L301J953M856J544q401
542A56l645J946j68K924J137n142j066l16J521M837J130j299j069k530O62J705
558G83M88K903j949l651j81j713J790N973k862m249l49k803L286O909n61l582
574B32k114q7K726K170J658q40m217m4J17j512M360R8o347P15J97l064M829L765
592B642j469m87j265j149K203L900J503m801m035J745p44K425N272m851m846K843
$$ y = [-3651, -1567, 5951, -2210, -9343, -5145, -6615, -5062, 4210, 2757, -4078, -3455, -1099, 881, 4610, 8773, 7012, 548, 2246, 4105, -587, 4455, 6866, -4213, -7378, -5083, -8475, -3798, 2441, -2168, -6650, -6289, -2788, 1820, 5610, 7977, 3512, -1588, 2562, 4496, 4115, 7433, 2505, -4658, -2400, -2591, -3597, 1353, 386, -3076, -3876, -5019, -3846, -370, 1980, 2858, -1557, -3097, 204, 2157, 7013, 8557, 156, -3489, -1543, -1711, 1213, 2350, -2792, -3858, -4174, -2653, 2184, 3314, 2015, 946, -1584, -922, 783, 1271, 4174, 2225, -1426, -1607, -3320, -1530, 4443, 1581, -2668, -3017, -5820, -2534, 4375, 3814, 232, -1882, -1969, 757, 2927, 4585, 3745, -472, -516, -399, -1911, 2449, 2547, -3800, -3085, -2888, -5952, -1123, 2642, 1173, 686, -579, -1728, 475, 4375, 5878, 1077, -2958, -1213, -1957, 468, 5740, 889, -3957, -1114]
608a114j503j90M583n09l202JK5J416K299L110o21m684l14J234k393L150K505
625C793o019j377Q49k086M241L788l188k184k3J331K366K196J827l188l393K024
641I57J8j012L783j759n121K63k21J76L357j11l068j120OK088K439K225J341k975
659A266j178K317K94J473J172m811l058N06j121K412J842k828j341r20O73K683
675f19J450J135j100k719J481J878R40K469j080l572O4m07k84K288r07k471j894
692c348j546J884K705J0Q80j870j581K455J831J523J656k978j853N74m17J916
708A841R38k861j121j333n08K484P99n94j68k341m0K331R48K094j72k322R7O53
726G25J137J916j076k847r06j732J341J882k61n12j662j324K275J338P15J113
$$ y = [-1114, -2617, -2807, 1776, 1267, -1935, -1934, -1909, -493, 1806, 4916, 4295, -389, -703, 531, -1862, 1288, 3793, -2226, -3603, -2754, -4840, -599, 3189, 1, -2183, -2206, -875, 1491, 3687, 5514, 2326, -1067, 957, 975, -37, 3746, 1987, -3134, -2871, -3092, -2916, 441, 330, -2738, -3858, -3852, -1764, 675, 2900, 4241, 1266, 88, 2405, 2699, 4172, 5344, 533, -2525, -2019, -3140, -728, 1114, -1714, -3055, -3975, -3302, -619, 831, 1966, 866, -1853, -372, 1506, 2446, 4915, 3835, 263, 327, -80, -364, 1924, 1017, -1454, -3348, -4894, -3010, -305, -295, 585, -1285, -2866, -411, 1420, 2943, 4599, 1621, -232, 342, -75, 1841, 2779, -82, -1203, -2536, -3044, -560, 239, -355, -523, -2864, -2904, -573, 375, 2469, 2297, -25, 72, 725, 1862, 3778, 2702, -145, -1051, -2783, -1442, 440, 179, -333, -1995, -3319, -1044, 294, 1009, 2122]
742B122j756j710R41J42J690J795k196j036j007p17K552J050j369j85l016o7K358
759d09N48R25J72k634M08M67R21K409q13j843o81q98P12J927k91l69j295j933
777b677J835J270O48O72j373k066P08O00J479J489k302r16n21l55K254P67j407
794A05j72j537m83K118P44j33K82k001M30O34K51J927k07k325k36q51N56K148
812A250p83r12m62j619J176J933N16M17j342j768J083R51J011R20j991q01J78
829b43m23J618O30j577l71r52r31J571O28L93K79j883k87J642N85J558J75k159
847B53p23j55N82J749l25j582r02j355J095J814n60K07p45j384J099J197M30J468
865B163j669o62L90K6R02J219j252j002j086p53J197N99n85M31j586o24J815J78
$$ y = [2122, 366, -1344, -403, -261, 1429, 3224, 1028, -8, -1015, -1732, 820, 1870, 501, 316, -2700, -2767, -409, 139, 1064, 1236, -1398, -990, -523, 398, 2807, 1994, 151, -530, -1428, -716, 1211, 920, 551, -744, -2677, -842, 428, 1076, 1748, 375, -1691, -983, -383, 1096, 2585, 283, -633, -1154, -1509, 745, 1512, 105, -67, -1604, -2087, 31, 775, 642, 924, -1077, -647, -13, 238, 2165, 1958, -367, -603, -1454, -898, 1250, 467, -445, -907, -2526, -1350, 583, 1099, 1516, 174, -1594, -511, 440, 1451, 2371, 380, -421, -243, -666, 952, 1582, 5, -366, -1318, -2249, -678, -50, 343, 622, -1261, -1548, 94, 679, 2237, 2412, 253, -470, -625, -43, 1706, 1381, -201, -1103, -2458, -1363, 451, -109, 98, -647, -2031, -932, 265, 695, 2163, 494, -168, 222, 248, 1150, 2369, 1117, 115, -971, -1724, -527, 72, -513, -82, -1668, -2292, -477, -299]
883b99J335L56j739J92L41L10J469j58j287k93j274N20J609n82k99o08j739L90
901a756J450K02J007r57r88M56L77J277R86r19o97l75j046J642O02q74k36j661
919a510o30J441M99K83M45j353k94O22N94J353J60j044o42m98L53J301m9q5j076
938a30j640N19J268J84M25q63j225O57K75N90J494p42r60l03P3J225O32q22q6
957E71r72r78J232N21j34J80j485o76J141Q7Q98P13q19p30k63L69J601j37q11
976C08Q8j341L20J294l92P48r31j614N10Q00k90J442l94j104k72r5J213J122o42
995G70k54q38q60Q87R61l74N72j382o77Q57L94J66R29j282l95o41N51J316j59
1014E41Q9m51j492N74J677l32k59N74j996J53J022q3Q32pj254l41p1J016Q68n69
$$ y = [-299, 1036, 1392, -347, -155, 186, 496, 1965, 1807, 520, 227, -1047, -527, 1082, 500, 201, -407, -2146, -1756, -306, -104, 903, -54, -1042, -586, -209, 1068, 2054, 1135, 438, 63, -983, 659, 1261, 387, 151, -1510, -2140, -699, -200, 83, 528, -825, -1119, -497, 97, 1450, 1610, 566, -76, -574, -221, 1080, 1031, 946, -130, -1770, -1251, 17, 201, 626, -237, -1462, -805, -530, 60, 1554, 812, -148, -451, -378, 847, 1479, 657, 571, -401, -1379, -147, 374, 240, 420, -1065, -1741, -600, -513, 385, 1098, 279, -451, -714, -345, 1256, 1119, 308, 396, -945, -625, 669, 277, 1025, 94, -1520, -1010, -210, -500, 942, 548, -556, -828, -923, 290, 1412, 770, 516, -322, -1182, -295, 666, 292, 864, -518, -1195, -338, 56, 222, 1151, -131, -526, -1167, -616, 700, 541, 630, 179, -1313, -739, 938, 606, 347, 921, -1075, -922, 100, 17, 849, 842, -412, -753, -824, 192, 1060, 491]
1034D91j22m39j412J543P16p68N85r13j317J165N45K45P82j204m62Q5J40J227
1052H87J04q87J21j222J46J531j06m36L52j510K3Q68p7Q89k53q51k25M77N17Q65
1072A213m51l96l12r30R98R20o84n9l42j188L89N98J47N92p16l94L20q8J113N71
1092A301r13J38m65o61J314q0l20Q2j101p02J323k07N76j01j022PJ57K91J075
1111F92j83n10K24m80K90Q02l16n3o68o72P55L96l63M80r99l18K06L71K68P44
1131F66p23O1N3m47R08O25o16Q2j062p7R74k05j51p8m68l31K05L51P08l07m45
1152b77M4j61K19Q28k27N3K79j310K78O63j54M85r59n59K83K5K55O37o84k08p8
1173e68j28J202K83q6l92l16k22P79J04j05J27r66j94L24J39M43Rp85j25j04J26
$$ y = [491, 369, -70, -1482, 61, 777, 9, 594, -319, -1636, -471, 74, 319, 1101, -103, -565, -480, -340, 887, 991, 104, 225, -997, -851, 680, 574, 138, 490, -1020, -997, -129, -206, 683, 430, -421, -646, -169, 348, 1213, 762, 366, 54, -876, 122, 1042, 358, 299, -43, -1231, -842, -244, -97, 495, -221, -615, -295, -383, 730, 1301, 388, 526, 61, -600, 714, 634, 314, 396, -705, -1407, -84, -291, 285, 184, -838, -831, -674, -383, 692, 509, -1, 223, -257, 33, 835, 519, 466, -202, -874, -119, 277, -86, 394, -605, -923, -717, -346, -78, 666, -57, 4, 57, -390, 518, 1143, 527, 609, -453, -530, 444, 239, 88, 10, -458, -789, -584, -233, 475, 168, -277, -233, -394, -175, 653, 426, 479, 758, -552, -274, 389, 235, 720, -239, -798, -515, -490, -235, 402, -282, -490, -568, -696, 506, 789, 703, 311, -5, -227, 552, 656, 551, 678, -288, -482, -158, -19, 424, 433, -352, -477, -581, -455]
1194d55Q30O2k84k33o41K48J173l61q2j11r22P10R9M8N16p25m86J62kN59L91m88
1216HQ3m25j96O22L15j83J75q70j91N22K27K79J6q22L4O1J73O09q6o79L51n10
1238d87N3Q28K50l96k20m41L04K91j6L40o24m12J40j76O21N98k80j68m16l47Q13
1259B55K66j84L5o55l02O53J88k0O01j244m4L73l67R69o6p67M64m63o9O44k3M4
1281B88j02n94K05K84l48O73m17n77K41k2M85P13p17l04K10o52P32o8J91j3l76
1302a68n31L69K84M99J50r43j70L27j78Q56p4m87N6k15l65J116l3k88O4m86O9
1323a48M94l42K58l5q96K67K59L43M62k82o50K99m43K72N14j48ll58n50M31M19
1344A63J63O2m84n43J91M21J29M43l25m39jj18O28K75n56J97l90N1N74k92j59
$$ y = [-455, 375, 437, 153, -80, -721, -473, 700, 339, 257, 146, -776, -66, 33, 81, 597, -128, -614, -452, -454, 105, 496, 8, 91, -334, -530, 92, 407, 224, 399, -471, -662, -140, 87, 366, 382, -440, -406, -345, -172, 437, 351, -328, 23, -487, -434, 394, 644, 248, 28, -413, -109, 182, 166, 506, -118, -530, -390, -566, 55, 653, 373, 205, -211, -558, 255, 521, 337, 372, -283, -585, 68, 256, 236, 837, -407, -451, -78, -445, 524, 458, -309, 155, -308, -377, 267, 244, 288, 186, -408, -203, 81, -267, 406, -11, -588, -347, -369, 116, 829, 112, -192, 18, -634, 98, 30, 221, 208, -168, -699, -330, -46, 453, 603, -340, -510, -183, -361, 495, 421, -66, -10, -225, -590, 526, 493, 205, 269, -217, -148, 346, 4, 262, 227, -669, -402, -143, 200, 662, 380, -270, 29, -414, -142, 372, 224, 221, -137, -687, -256, 163, 326, 388, -96, -639, -448, -27, 102, 545, 220, -219, -220, -338, 290, 565, 9, 206, -184, -133, 441, 149, -10]
1365a0L30r04P7O8J50M81K24o19J44l62P7P51K10l96k14m01K64L85J59o1l72n13
1387e32K29K0L21Q6p23L89J02k32M44M35m18Kk55P8J68K18j4J16q13J17K62k27
1409b27L79K15r05J53k06K24J159n91j4q3n34L25N19J48j46l91j2j1R1m6L92l28
1431A11q02M37j83J31N43k25N5l45j21O61K44k20J3l31k49L18K98m0q3l99m3j17
1453c47MN47p4l91J28k70J60M02j38J90L5o17L94J96m0M83o69m41L72kl4N17m38
1476c3j24j04k08N20K29j48K98m30j67K85L82k3l6l63m48N44m39M30P8n64K38
1497h3l59R7O89m13j86K37m78K22L01n5P18m45p86O68j46J39K45m63L6o4J1L75
1519B60j54l02K3k86K26O5J62L85j98m38K96j36K11j49L72n11K74l83J08N19m08
$$ y = [-10, 320, -584, -507, -439, -289, 192, 416, -203, -59, -421, -344, 407, 617, 221, 7, -394, -130, 255, 414, 353, -19, -532, -303, -283, 38, 124, -599, -210, -108, -340, 104, 539, 121, 123, -132, -54, 114, 332, 318, 434, -379, -262, 0, -227, 152, 367, -538, -385, -591, -367, 792, 201, 187, 104, -430, -105, 414, 562, 416, 25, 13, 2, 93, 47, 439, 111, -691, -254, -437, -306, 237, 12, 67, -278, -399, 262, 506, 286, 299, -32, -281, 37, 335, 295, 212, -187, -230, -347, -343, 204, 130, -261, -133, -403, -243, 159, 21, 211, 246, -371, 23, 219, 179, 662, -7, -448, -76, -78, -112, 405, -33, -157, -261, -469, 51, 280, 132, 430, 0, -167, 118, 500, 477, 441, 78, -370, 174, -265, 165, 243, -321, -83, -442, -345, 344, -69, -255, -18, -496, -274, 27, -28, 690, 245, -541, 127, -19, 120, 365, -98, -62, -126, -115, 260, 106, -196, -173, -459, -233, -168, -6, 379, 181, -257, 39, -97, 114, -35, 337, -174, 100, -283, -175, 344, -64]
1540f4J04M4l47n9O21k04J70m14l64K51J48J16M99n76K47k52kJ74L02k85j61J40
1562H8o15L72L94k32N7j2o26L63J75J50J15n30L96k68M9M90J2m75K74n95L89J70
1584A41J13K3k24l28k32M05j04N41o00Q7j94O5J87N30k32l1pl23J44j01N72k21
1606B11j83n13N04j70O13k52l85j75J46k5L76J06l10J41n33J24N22J58k30J87
1626C12n07J95L12k37N38m87n79M4J76K76K21l18k25L34n95N83K30l34K94l91
1646a58K41j51J47M7M89p27K11k3op9K73n59J16o0j19K83j7J81k2Ql3K9N3K82
1670D06n0m03J26k67K11K61j40m59J84l24J54M25m91L25k52j17L76k94M25L60
1690D56m85l00N05l37K84j0k12J87l87J37M40k37j19J95l59j10M10l25N37J14
$$ y = [-64, 40, 84, -263, -322, 299, 95, 265, -149, -513, -262, -114, 2, 501, -75, 172, -80, -82, 92, 394, 109, -52, 88, -527, -155, 239, 7, 64, 52, -574, -211, -36, 114, 229, -301, 95, -173, -124, 366, 378, -97, 177, -418, -29, 141, 254, 277, 53, -275, -507, -102, -206, 335, -265, -178, -372, -307, -120, 410, 178, 147, 140, -183, -39, -140, 432, 211, 28, -485, 19, -151, 462, 210, -175, -350, -204, -229, 147, 253, -57, 84, -449, -325, 197, 355, 125, 312, -195, 0, 312, 75, 613, 126, -453, -409, -233, 43, 264, -54, -279, 55, -540, 43, 273, -61, 233, -158, 83, -68, 79, 126, 615, -112, 99, 76, 70, -9, 264, -295, -179, -239, -358, -75, -92, 89, 67, 75, 42, 71, 124, 406, 356, -47, 79, -188, 23, 284, 144, -315, -131, -455, -301, 124, -367, -42, -294, -411, -35, -329, 96, 456, -29, -329, 176, -161, 123, 113, -99, 88, -299, -162, 278, 41, -78, 117, -242, -352, 58, -267, 270, 384]
1710C84m65p9r4L50L3J03j25k21oJ37K22k30J49k19k35J28L24k8Kj73k50M19j63
1733c7K65Rj01j8k04l53O79K70n89K59k42j22N03l71J38j90P1j94L46l14M78k07
1755G6k36J11p9o0M67k30J08k37j60K30J31J64P9j15l76K61k49J00K70k44k29
1776b18rJ11k9L91k45J58k23l9PK36R1J8j38n27N02k18n9K06P6%o5r7K07L1k96
1801a29N0j15J69K84Q6j12j51j74K94j70J92j85l2k46M4j16J22K48K0j38k31J18
1823a72N4L81l30r6J38l7K17p5O3K21m72j5k08L75J94j93l9l77L89j57K62l15
1845a92K75m2j60M2J18q6K53k28L5k6N7P9Q7l28K04rn42L68K18k03N4O8jL74m21
1870fn3L14m59J09K2L15J96l26J5j74l74M22Q8Q2q6k04k26L35n2J04K08l6k75
$$ y = [384, -81, -160, -254, 96, 129, 232, 107, -114, -120, 17, 239, 9, 158, -61, -296, -168, 156, 128, 130, -43, -293, 126, -37, 228, 237, 136, 118, -86, -439, 240, 510, -79, 180, -62, -184, 319, -52, 86, -104, -33, -227, 119, -195, 283, 76, -160, -49, -128, -188, 279, 49, 157, -80, -240, -10, 121, 285, 364, 249, -127, 134, -115, -15, 255, 11, -218, -227, -116, -145, 246, 1, 159, -64, -103, -96, 140, 231, 249, 111, -416, 86, -132, -191, 15, 91, 91, 26, -71, 136, 167, -129, -79, -194, -25, 259, 345, 233, 82, -92, 202, 32, 224, 39, 7, -239, -195, -311, -189, 59, 79, -59, -290, -172, -118, 263, -67, -163, -25, -62, 155, 80, 143, 364, -108, -123, -331, 44, 238, 45, 6, -371, 18, -139, 123, -192, 83, 41, -119, -77, 41, -45, 208, -20, 15, -11, 46, 125, 212, -116, 88, 79, -463, -95, 123, -80, -26, 42, 41, 415, -6, -59, 255, -204, -95, -73, 242, 438, 112, 127, -47, -421, 1, 89, 171, 85, -119, -345, -10, -62, 42, 250, 214, -61]
1893f1M5o6j2J36N7K3O9m62J23M24o5l54j24O6J08J8j61N60l83N9M1j5Q2K59j84
1918A83O5k47K8J59k00M1j9%l85O01k99J00J0r6K28k12Q7L15m12Q9k45J27L23
1941B41q0o9Q0J67k14j25M2K0J0j3k78J52p4K31j60j7j29L27n0K06j07Nl2l15
1965a82p0L20j9q5r2k97M78O8n8K43j26m10M2J15p9L56l28L28j67k32j05K42J52
1988I4K4j34J8O4k60L86j46lqL1j32K87n8Ro5q3j11J90p5J84o6o86K07L14K80
2013B61J01k68m19M10k27J89n5K40j14L31n25J44M6J75l65R2n47M57P0R1J10n31
2035c34K74P9n5J62K74m85qJ9k28K99Kr5j9O9k22L10p1r1L51l28M5j41K63J62
2059B32m9l24J13n0K44k16K11kj82j2K59j97jp1j52K27j26m5J41j36K2M5K08k30
$$ y = [-61, -16, -82, -94, 42, 99, 122, 191, -271, -148, 276, 211, -143, -267, -201, -93, -75, -236, 324, -59, 0, 41, 26, 108, 367, 183, 248, 1, 29, 188, -12, 29, 10, 10, -375, 226, -73, 27, 37, -59, 169, -43, 44, 359, -53, 36, -209, -82, 241, 161, 92, 172, 339, 125, 0, 42, 62, 72, 59, -219, -67, -141, 90, -70, -87, -216, 111, 61, 267, 160, 165, 133, -182, -252, 68, 49, -36, -128, -425, 53, 121, 63, 306, 180, -230, -188, -73, -152, 204, -124, 204, 37, -195, -300, -58, 94, 118, -16, 2, 66, -194, 192, 46, 43, 35, 66, -66, 221, 163, 172, 107, 24, -87, 103, 28, 212, 146, -540, -333, -19, 261, 362, 94, -325, 85, -142, 47, -8, 232, 118, 449, -76, 68, 114, 289, -76, 16, -531, -74, -4, 87, 197, -334, -60, 19, -36, 126, 400, -85, -93, -74, -302, -3, -1, -96, -115, -46, -268, 42, -29, -120, 231, -97, -52, -193, 70, 232, 183, -141, -28, -78, 166, -50, 161, 159, -23, -35, 224, 27, 26, -45, -197, 30, -96, -141, 0, -136, -114, -69, 139, -91]
2083i1K63O4j44j50l60K03K32J51j29L4l31l3J85m8J88M41m80j74L74j34Q6lk95
2106a51Q8j2r3L43m68L15m0L4j27n0M1L28J1j44J57l79L94m96J98j0j1M0J06J37
2130B11l9N1j06j14K27l47J57j01NK34k01K44J6K6l36L30l29J93J98k71L5k75
2152a92r5O2K40q5K50m8j15k2M2K5kk16l1K02p3M13m24k0J16L5k37J52l5o7Q4
2177d1k84K11k95N68R8l58p7J55j29N9nK1J56k57J27pO5pR3m39M00k29J07K93
2201B25j56J29k19l8j16K34N5j94J12l4j11K54J2j39M5k34j39L37q4K28r9l3k01
2224a66K61l19M07M2j68o9j79M91k11J26j02j91n8J36j78M9N7M2J96j44j92J86
2246A6K05k47J93K0l00J66k55M20p0j96J50k32j20L9L11l64K74J36m36L38K36
$$ y = [-91, 172, 236, 92, -58, -418, -215, 17, 168, 39, 73, -258, -291, -106, -154, 34, 475, -5, -179, 195, 61, 147, 144, -151, -63, -75, -168, 175, -293, 22, -18, 16, -111, -161, -120, 208, 219, 75, 232, -147, 247, -249, -51, -61, -72, -32, 74, 211, 172, 223, 117, 3, 230, -117, 40, -61, -56, 178, -23, 221, 237, 263, -73, 257, -72, 121, 319, 48, 83, -192, -287, -225, 15, -70, 180, 132, 17, -5, 37, 62, 60, -156, -187, 15, -58, 355, -69, -89, 27, 62, -175, -23, -58, -125, -41, -325, -114, -409, 159, 257, -101, -178, -23, -152, -93, -98, -77, 79, -178, -51, -58, 7, 0, 93, -346, 54, -175, -68, 225, 69, 198, -21, -59, -175, 59, 114, -80, 32, -2, -113, 141, 153, 14, 59, -175, -314, 23, -61, 167, 68, 35, -166, 95, -224, 183, 225, 57, -12, -191, 300, 89, 215, 113, -78, -136, 0, -178, -129, -72, -30, 166, 22, -170, 16, 221, -26, 167, 187, -113, 53, -202, 218, 148, -48, 102, -130, -250, -211, 100, -264, 10, 146, -290, 48, 284]
2267B84r6q5o4l72N39k39J92J05j36m1q9J38p0k25L08l36j23J10Q2j05M23p2o8
2290F0q9q8K20Q6j86k26L63J02l76R1P3J9p0k73K10Q5J7O6K7l99M35n9J66%k67
2315a3L01k08j22L38k24j8K09n83N13l16J79j78j37J83o9O4J40Nj21j72J90N4
2337A5J5Q4k31K11J42m55K24PJ34l9k92K03o9K51l35L47l02j4J83j42J89j30n2
2360e6O3K11j5j91L55k23r7J7J81k91J05l52J48M3J9R1j5K06l81N3J31k07L73
2383A68k32mR5m4J60J08n07J45J83k39J81J23l46K99l43K13o0m4J44o4M37k12
2405A61N8l5j69J14o0J02o1j81J32p2J87j40j39L19l71L90j44j43j2R8j0k7j06
2428a09K67k0l77K41J38o8j28J47k51J77l7j6r7J64oo9J61m43K88p1J59j29Q5
$$ y = [284, 188, 103, 39, -333, 206, -33, 159, 264, 128, 87, -2, 136, 66, -159, 149, -187, -310, -200, -118, -223, 200, 128, 60, -29, -117, 103, 189, 3, -223, 140, 242, -134, -43, 30, 49, -21, -294, -84, 1, 18, 84, 111, -288, 147, 88, 254, 254, -13, 288, 80, -42, 296, 72, 54, 263, -320, 193, -123, 56, -122, -259, -76, -145, -81, 59, 64, -57, -229, -39, 15, 30, 114, -117, 94, 236, -219, 5, 12, 146, 107, -185, 18, -51, 200, -135, 212, -90, -104, 79, -63, 126, -4, -56, 7, 218, 203, 12, 367, 144, 47, 64, 245, -46, 59, -293, -145, -102, -83, 8, -7, 199, -182, -129, 2, -205, 168, -64, -68, 27, -17, 143, 251, -256, -111, 72, -167, 14, 137, -209, 90, -253, -40, -100, -144, 0, -64, 373, 161, 219, 184, 15, 129, 69, 171, 110, -71, 61, -11, 176, 36, -103, 216, -155, 235, 91, -52, -64, 34, 24, -3, -109, 158, 138, -239, 2, 140, 72, -56, 91, -160, 17, -20, -36, -133, 31, 25, -44, 117, -326, -38, -109, 50, -79, 6]
2451FJ32l11L65q0R4n48J58M15k76k86L52J04k5k55n9M3L64o9k23K0k8K70j53
2474A0p5r6K37j89K23Q9j72J43N2J5j14r6p8n1J75J89j21k59J39K91l77Q8Q1k2
2498H2K3O2k16K0%J31m69L62o8j60K38Q4j53J20j38J42O5j80K6%J00j96J96j65
2522i4m4J17k60K90P4j86P5l50M35r7L0j05J9q8K14M8l9O1L13o91K10J11m1n6
2546e4m4J06k85q3K27J60j36J53j69j3j7K22j28M75m32J79k10Q5J48j56J20j61
2568a3J04p3l4k08K95l6M3J95j30p0J83m55L03m52K47J83j23j23K44J56%j60q5
2591iK8j03l37J9M14j08K21r6j55j75J12L17k00k8l4K67L7j34J80l55M58k04j82
2614f7K05ol04J56J23j66L58l35J26R1l08j05K03j84L44J49j79j50r8lL91k18
$$ y = [6, 138, -173, 192, 112, 206, -342, -184, 231, -45, -331, 21, 125, 100, -155, -214, -171, 193, 124, -99, -79, -107, 163, 10, -65, -161, 76, -113, 110, 199, 27, 170, 222, 237, 123, 27, -51, -102, 73, 262, 141, -118, 21, 312, -65, 23, 104, 82, 105, 167, -49, -29, -29, 102, -367, -5, -73, -233, 5, 89, -64, 56, -82, 60, 125, -55, -29, -29, 71, -125, 71, -94, -138, -21, -281, 9, 83, -103, -28, -378, 57, -40, -10, -115, -96, -184, 30, 78, 39, 100, 413, -278, -68, 43, 2, -54, -98, 8, -277, -360, -133, 27, -109, 44, -125, -138, -155, 67, -61, 414, -18, 161, -49, 36, 184, 28, 148, -13, 91, 18, -16, -224, 71, 35, 78, 273, 143, 73, 256, -199, 104, -348, -101, 82, -41, -164, 80, 236, 236, 76, -9, 19, -84, -421, -402, 12, -96, 125, 29, -126, -301, -189, 128, -72, -100, -134, 133, 170, 36, 216, -139, 319, 115, -67, 138, 132, -172, -16, 107, -59, 299, -36, 90, 181, -127, -232, -29, -213, 131, 280, 101, -49, -147, -150, 241, 23]
2636B3N0P3n9J17l45o1L94j04q1K19k04j73N90o10j1K05p1J74J8o8N4l30K33K70
2660C03n58J16K58O8k70K22O0j62j92Q9j72RM19j56J4M6lj36J18j0j71R0k76K00
2684i4q4J87Ol1N8j78J50M6Qp5m94M22m1L2K16k2m24N03k23j2j4J95k56L64m7
2709A92j10l84K37N3j87J69r5K81l24J66J30J69m00KJ54o8j3k8P4pP9m8o4k05
2733b27M61J28k47q2O2l9l6J43j84O4k5j7k1J94k38N3k15R3Q5p7P9Oj43J90om0
2759c9k59K67J92l65M18j96J38j8m7j3ll9J52j59r5R6k58j29M58l24L65o8J66
2782B40m03K68o0m5J4j55L29j63p1L48n96M30k72Q6L20m41J41KJ81j57j6j7k8
2805f5J86m2P6P1k54k40J33J65J14k93K72K13k85j07K7J18m17K56J40j24J65K9
$$ y = [23, 73, 146, 87, 204, -141, -202, 192, 88, 7, 226, 22, -151, 439, -171, -182, 23, -48, 126, 144, 76, 130, -200, 33, 303, -255, -139, 119, 187, -83, 139, 199, 37, -155, -66, -238, -229, 190, 34, 48, 94, 91, -45, 73, 63, -108, -18, -294, -94, -178, 9, 15, -16, 42, -136, 14, 60, 68, -7, -501, -79, -120, -88, 128, 106, -318, 185, -38, -50, -64, 131, -125, 239, 192, 82, -302, -65, -12, -199, -30, -125, 156, -168, -2, 128, 297, -103, -101, 53, -15, -28, -56, 18, 11, 90, 42, -22, -227, 234, 362, 115, 33, 95, 56, 20, 163, -21, 43, 18, 1, -20, 174, -64, -11, -226, -133, -48, -125, -46, -40, -183, 7, 1, -39, -298, -31, 161, -204, 214, 18, 156, 138, 91, 78, 75, 36, 188, 29, -66, 30, -228, -357, 101, -223, 142, 74, 240, -163, 105, 45, 0, 14, -141, 188, 25, -46, 302, -294, 136, -136, -50, 270, -171, -30, -28, 153, -4, -20, -37, -65, 121, 79, 155, 226, -28, -268, -135, 30, 144, -149, 123, 336, 51, -56, -29, 89, -328, -72, 68, -56, 109, 138]
2827A38Q1m5j86K22j80K08j34q7J71o7n6p9J7L31m73K03P5j25n1m3J77j89L11
2850B19j43l7kp3j91n7K06P9N4l44K43k20K04R6qj07J9L4P1o7r6J19M2r8K80l8
2876A85q0k8j31r1o7J85J75Q3k16on5r2P7k0j85L63k08j10J4J99j32K75l50J14
2900a01K70k17N3K68j66j92J93l15L55j86J2j20J9K61j87kQ0j29j5K19j30R6j53
2923h7q8M5J6j9K15r1L7K10l22K51r3j99P3J06j25k0K70m32r4N28k72p4O6NK83
2948A89K6j53J10l53J07J35n2Qj20K73l07K12J67j23k87K56j77j4J98Jk29J06
2970b7j99K35m2m1K11j54L12l74K98j99O9r8j34K60j29j11J60j41K80J9q5l07
2992a97K20K4L08n09M53k00R0l23n0N5K13j57P6k22N4J78k65L11k9j6L7j94K04
$$ y = [138, 219, 174, -12, 210, 30, 238, 104, 17, 188, 121, 65, -14, 3, 334, -139, 64, 139, 14, -37, -80, 97, -92, 219, 76, 39, 37, -36, -227, -284, -78, 1, 55, -289, -46, -266, -62, 34, 26, -81, -62, -28, 43, -24, -120, -1, 41, -57, 223, 185, 105, 77, -54, -145, -212, -27, 148, 231, 15, 9, -46, -138, -61, -81, -266, 97, -111, -221, -207, -8, -140, 135, -215, -101, 169, -48, 5, 273, 107, -85, 108, -207, 148, -38, -26, -146, -127, 134, -53, -55, 25, -104, -119, 100, -30, 66, -87, -175, -130, -114, -133, 82, -9, 28, 238, -84, 167, 74, -125, -52, 54, -71, -91, 179, -253, -347, 181, -91, -165, -99, -94, 189, 215, 62, 172, -181, -74, 61, 9, 17, -103, 170, -137, 75, 242, 119, -168, 88, -89, -103, 95, 96, -133, -27, -226, 9, -33, -74, 137, -17, 295, -79, 219, 20, 89, -9, -143, 117, -12, -123, 37, -104, 176, 195, 110, -197, 23, 47, 355, -154, 299, 99, 189, -134, -184, -129, 84, -73, 3, -219, -165, 13, -252, 59, 30, 14, 51, -143, 61]
3015F1j02J50r6J1J94j55l80L62j23P2o8K61n4K9k4N3j94J9p7P4P2k92K39J91
3039B23q8r2l19K44k81M22j16k55K57K26m9j48j41J42J16k08K13l71N26l77o0
3060a36K15K04k19K9K3J14k70n2J73M5m8J09M9l41j46O3K52K8J04j30R9j79L5
3083B1J78k33M9j14N0K27m83M98r3k36R4k7K29j75j62J15J47q6P9n4j63J95j62
3106a06K19Mj11K01j54r6l2L4j8j68J15K10O9l68L2J29l2R0q8J05K10R0k55r3
3130a3J85k24k1j84J73J54j30K7M5k22P1K89k22K88l54M5K7K65l38J43m2j1R9
3153E0k46L46p4p9J14k57p4K65k21K21L3J66j81k0m5J56l31J17K21l18J85K1N6
3176A05L1q4J3n7L35n48K32k10K18r6L3nk3k0n5K73J90j69k5j8J1l21O2K30m00
$$ y = [61, -41, 109, 13, 24, 218, 63, -317, 45, -78, -6, -74, 187, 133, 162, 138, 191, -3, 16, -61, 13, 85, -207, 32, 223, 135, 43, -276, -32, -313, 109, -7, -262, -5, 221, 172, 24, -117, 25, 141, -67, 146, -225, 301, -76, -136, 79, 283, 64, 93, 116, 230, -40, -92, 81, 126, 78, 187, 236, -105, -251, -188, 64, 92, 196, 66, 165, -14, 21, 199, -34, 15, -99, -49, 178, -305, 193, 100, -136, -42, -69, 160, -15, -177, -62, 85, -1, 78, 24, -139, 56, -106, 113, 117, 6, 207, 53, -43, -75, -41, -59, -227, -112, 98, 167, -201, -169, -40, -72, 18, -70, 35, 245, 335, 80, -13, 172, -52, -73, -257, -84, 70, -60, -33, 12, -210, -139, 150, -72, 216, -138, -93, -66, 199, -139, 4, -38, -49, 50, -196, 150, 76, -3, 111, -146, -220, 45, -176, 45, 78, 244, 63, 43, -2, 154, -177, -60, 161, -157, 28, 49, 105, 136, 52, 65, 8, 343, -205, 27, -183, 35, -61, -28, -33, -56, -76, -131, 142, 332, 163, 138, 120, 131, -190, -128, 102, -298]
3201b98J00J66m2K14lj24k34M39j04j66q3k2J09r2J77j48j23L98p7j09o7K33j89
3224d5M09j58r4o4N8J10l85j35J04K99l56J0J41P2O9J07o5n8j8Q7r1k5P6l3j16
3249a01R3o1K99J1k51O9RJ4j16Q1K02k78j05L93k15j06J18p0N8j24L6j36J07O6
3273gq3J12O0j27P5m6p5L1L8J60j72L02k51l8j49O3J37k51Q3R7J92k40J54j32
3297f7K09k41K52j89r6J81r8j78L16j35n3J32J6J91j15l30L32N8m34M98k99k1
3319g1L3J01j17p8P7R9r5N6k0P0j1P9k65j35K94L0j54L04p8o1l5K83j56j56j41
3344a47J68J29j03j62q0J27R3j66K22k63K02J94n31K46J32j29r8K04k7j15K68
3365A64k69R3n3J44j57O5J08j49L26j99j45jL7j10M61j65j36j04j22L50j11m8
$$ y = [-298, -198, -32, -74, 140, 137, 13, -221, 218, 114, -52, -135, -157, -48, -140, 37, -111, -234, 164, 87, -22, -89, 144, -45, 364, 206, 112, 48, 106, 216, -169, -304, -200, 99, -257, -247, -106, -34, 35, 142, 77, 19, 1, 88, -3, -28, 48, 15, -101, -8, -69, 230, 241, -10, 59, 68, 82, -34, 47, 249, -29, -134, 259, 44, -62, 56, -14, 44, -80, -44, -180, -73, -7, -90, 22, 82, -45, 30, -16, -91, -60, -22, 138, -34, 268, 17, -21, -170, -107, 30, -221, -138, -41, 151, -89, 65, -67, 142, -99, 153, -36, -132, 49, -49, -227, 89, -46, -99, 33, 49, 240, 125, -205, 127, 185, -249, 249, -50, -71, -38, 63, -54, -132, -55, 44, -51, 5, -15, 55, 44, 123, -142, -277, 17, 47, -107, 197, 119, 58, 23, 306, 150, -6, -147, 21, 150, 47, -115, -195, -68, 25, -141, 81, -182, 20, 214, -317, -71, 61, -68, -166, 38, 11, -104, 164, -105, -12, -65, 79, -78, -13, 95, -54, 272, 73, -72, -73, -36, -146, 315, 150, 14, -90, -212, 138, 27, -21]
3387b1k67M84k16P2k91K41L7j98J27l8M67m75J50j61O7J3l55L79m7o8l1J06J03
3410G8O0k05J13J5M5l5R5m7k03K09j22m5K79n8K4j68J05l22M3J99K2J92l57L75
3434B92m50K31j25q4J21L71r3k43r9j10k4K06j68R5j41K20k3j11L41o5N4j90O5
3457G0n4J8K7p6k8K41n45M44k52J56J40n34K34L21N7j9m9k81K02M6j74J07J09
3480A60m06K98k38L56j70q7N9L2n1K98k43J03o8J27j91p8K27j20j71K6K37k00
3502a00j2J42q1J28K26k84J42k16L16l33K17j89J74J23j95k07j15L52J56k53j40
3523a49L87r2P6k44K7j70L13q2K93q2k87O5j50r0L26k79N5J55k08L44j75r7Nr7
3547a56jK66l22J14K64k96M8K67j7m4q6rn6P9l4n3j60L03k50L86k84J81L6k91
$$ y = [-21, -288, 196, -20, 52, -239, 2, 39, -159, -32, -70, 397, -78, 72, -89, -22, -9, -364, 15, -32, -100, -131, -25, 78, 138, -67, 46, 61, 106, 71, 166, 119, -84, 125, 3, -42, 237, 179, 203, 35, 140, -182, -139, 60, 82, 274, -83, 292, -158, 73, -52, -136, -15, 356, 263, 20, -79, -189, -213, -7, -175, -80, -221, -1, -24, -135, 206, 141, 195, 5, 70, 16, 34, 61, -15, -43, 198, -347, 97, -155, 1, 141, -393, -159, 162, 219, 200, 151, -130, 72, 118, -56, 51, 160, -246, 52, -186, 170, 0, -87, -28, 4, -47, 251, 8, 111, 43, 170, -21, -99, 128, 8, -163, -137, 100, -100, -112, 30, -51, 77, 303, 19, 161, -55, 261, -72, 145, -44, 130, 253, 58, -149, -264, 88, 244, -9, -149, 238, 146, 222, -22, 5, -165, 148, 66, 359, 277, -10, 55, -95, -185, 141, -138, -83, 72, -136, 208, 33, -64, -59, -156, -157, 109, -213, -99, 165, -131, -83, 184, 167, 123, 37, 28, -28, 51, 17, -36, -196, 107, -143, 243, -41, 140, 176, -115]
3571a15O8j8L45j17j90j64K10j64K92n2j10j7r9K72j62k26J90OJ39J02j45J32
3593A77l02J44kk26L57OK61j19m44K95o4j22j8J98l96K21J8q6N4J01P5l95L41
3616G4J6O0J15k43k0j3j32L3K53k1k72j58N18k16l60K60L36l61L61n8m05J67K04
3639A38j44J53n2k05J41j91J54K8l2j35R3n3j38K64m2j61K7J41J91j41k02L28
3661A62k43j50J20J32K3M0J79k33m7L2k74K79O8j63J41Nk00K07o5K23r5k60J29
3684A0k85N67j20j00j73O4J85k97J65j76K05j42M9j17m4M5O0J89l96M00J61k86
3706c6J13j0j24p9J40J17m3j54K61l30P5K09j59j9K30l34J92N1j62k6m4L23j01
3729I0J6R6k54J33j61J71k7J07k61L15r7k53J34J27k66K2L08m10L43n81O86m34
$$ y = [-115, -47, -65, 280, 163, -27, -191, 19, -145, 147, 95, -15, -32, -131, 141, -21, -247, -57, -51, 88, 190, 45, 177, -125, 19, 17, -209, 148, 154, 415, 296, -148, 147, 83, -39, -57, 141, -255, -34, -16, -102, -48, 53, 128, -267, 74, 90, 150, 265, 22, 2, -11, -143, -110, 143, 122, -150, -308, 210, -6, -366, -106, 230, -131, 230, 172, -233, -66, 138, -6, 147, 95, -110, 31, -160, -6, 22, -10, -145, -52, -105, -243, 21, -21, -182, -155, -14, 177, 36, -166, 162, -81, -231, -111, 21, 44, 84, 263, 30, -17, 15, -259, 20, 88, -75, 66, 71, -129, 78, 13, 236, 141, -119, 10, -275, 292, 172, 72, -101, -37, 148, -149, 16, -160, 45, -97, -48, -165, -209, -164, -104, 85, -311, 89, 250, -36, 77, 67, -57, -136, 4, 121, 78, -76, 185, -145, -70, 139, -20, -39, 191, -143, 49, 100, -62, -88, -132, 191, 90, 106, 202, -52, 81, -80, 91, 64, 171, -90, 225, 128, -125, 9, 136, -130, -108, 200, -210, 133, -448, 238, -196]
3751a96J90J26Kj37l9J02o2J93k32P3r3L19j69j46N2j3J02j92K73J95m78m9K83
3774A04Q3q6r4k7k42J86k0L47m69K74N4j86J99j06r4k32K50L8j3OK31k29P4k03
3798a55K95k45R4K4J97l35k6K24j04N3L17n59L36Q7k91l3O0K17J26K6l96o5K3
3821a30J21j29J64q8K5JQ1Q0j96L02j50J05k4k75k3L29j62Jo4K52k73j87J93m7
$$ y = [-196, -6, 120, 122, -15, -54, 48, -14, 179, -53, 20, -73, 246, 77, -69, -17, -30, 72, -120, 153, 348, -130, -179, 104, 187, 101, 7, -20, -262, -76, -96, 251, -218, 56, 110, -76, 123, 17, -77, -309, -59, -21, -34, -28, 203, -26, 48, -155, 140, -105, -11, 13, 210, -125, -151, 73, -31, 22, 339, -220, 116, 203, -88, -121, -61, 156, 282, 308, -88, -153, -130, -9, -138, 26, -62, -37, -36, 45, 125, -71, 231, 81, 186, 162, -113, -136, 193, 31, 32, -32, 220, -53, -240, -47, -94]
$$ [...]
8191a69
##END NTUPLES=NMR FID
##END=
