##TITLE=1H_DE-86K
 200.13MHz, D2O,
 8 sc
 
 27.3.2025
##JCAMPDX= 6.0         $$ Bruker NMR JCAMP-DX V2.0
##DATA TYPE= NMR FID
##DATA CLASS= NTUPLES
##ORIGIN= UXNMR, Bruker Analytische Messtechnik GmbH
##OWNER= pz
$$ XWIN-NMR		Version 3.5
$$ Thu Mar 27 14:41:24 2025 Russian Standard Time (UT+4h)  she@DPX200
##.OBSERVE FREQUENCY= 200.1313
##.OBSERVE NUCLEUS= ^1H
##.DELAY= (6, 6)
##.ACQUISITION MODE= SIMULTANEOUS
##.ACQUISITION SCHEME= undefined
##.AVERAGES= 8
##.DIGITISER RES= 18
##SPECTROMETER/DATA SYSTEM= spect
##.PULSE SEQUENCE= zg30
##.SOLVENT NAME= DMSO
##.SHIFT REFERENCE= (INTERNAL, DMSO, 0, 14.3821)
##AUDIT TRAIL= $$ (NUMBER, WHEN, WHO, WHERE, WHAT)
$$ ##TITLE= Audit trail, XWIN-NMR		Version 3.5
$$ ##JCAMPDX= 5.01
$$ ##ORIGIN= Bruker BioSpin GmbH
$$ ##OWNER= she
$$ F:/spectra/data/she/nmr/H-C/1/audita.txt
$$ ##AUDIT TRAIL=  $$ (NUMBER, WHEN, WHO, WHERE, WHAT)
(   1,<2025-03-27 14:40:34.54 +0400>,<she>,<DPX200>,
      <created by zg, POWCHK disabled, PULCHK disabled
       configuration hash MD5:
       00 E9 B6 7A A2 85 ED C7 34 08 36 98 17 FE 4E 26
       data hash MD5: 16K
       9F 67 9C A4 C8 A0 48 9B C8 3D 6D 89 90 82 DC 52>)
$$ ##END=
$$ 
$$ hash MD5
$$ 30 91 CF 13 44 4E EB 67 EB C9 53 34 12 94 DB 5C
##$RELAX= 
##$RELAX= 
##$RELAX= 
##$RELAX= 
##$RELAX= 
##$RELAX= 
$$ Bruker specific parameters
$$ --------------------------
##$DU= <F:/spectra>
##$EXPNO= 1
##$NAME= <H-C>
##$PROCNO= 1
##$TYPE= <nmr>
##$USER= <she>
##$AMP= (0..31)
100 100 100 100 100 100 100 100 100 100 100 100 100 100 100 100 100 100 
100 100 100 100 100 100 100 100 100 100 100 100 100 100 
##$AQSEQ= 0
##$AQ_mod= 1
##$AUNM= <au_zg>
##$AUTOPOS= <>
##$BF1= 200.13
##$BF2= 200.13
##$BF3= 200.13
##$BF4= 200.13
##$BF5= 200.13
##$BF6= 200.13
##$BF7= 200.13
##$BF8= 200.13
##$BYTORDA= 1
##$CFDGTYP= 0
##$CFRGTYP= 5
##$CHEMSTR= <none>
##$CNST= (0..31)
1 1 145 1 1 1 1 1 1 1 1 1 1 1 1 1 1 1 1 1 1 1 1 1 1 1 1 1 1 1 1 1 
##$CPDPRG= <>
##$CPDPRG1= <>
##$CPDPRG2= <>
##$CPDPRG3= <>
##$CPDPRG4= <mlev>
##$CPDPRG5= <mlev>
##$CPDPRG6= <mlev>
##$CPDPRG7= <mlev>
##$CPDPRG8= <mlev>
##$CPDPRGB= <>
##$CPDPRGT= <>
##$D= (0..31)
0 0.7 0 0 0 0 0 0 0 0 0 0.03 0 0 0 0 0 0 0 0 0 0 0 0 0 0 0 0 0 0 0 0 
##$DATE= 1743072034
##$DBL= (0..7)
120 120 120 120 120 120 120 120 
##$DBP= (0..7)
150 150 150 150 150 150 150 150 
##$DBP07= 0
##$DBPNAM0= <>
##$DBPNAM1= <>
##$DBPNAM2= <>
##$DBPNAM3= <>
##$DBPNAM4= <>
##$DBPNAM5= <>
##$DBPNAM6= <>
##$DBPNAM7= <>
##$DBPOAL= (0..7)
0.5 0.5 0.5 0.5 0.5 0.5 0.5 0.5 
##$DBPOFFS= (0..7)
0 0 0 0 0 0 0 0 
##$DE= 6
##$DECBNUC= <off>
##$DECIM= 32
##$DECNUC= <off>
##$DECSTAT= 4
##$DIGMOD= 1
##$DIGTYP= 9
##$DL= (0..7)
0 120 120 120 120 120 120 120 
##$DP= (0..7)
150 150 150 150 150 150 150 150 
##$DP07= 0
##$DPNAME0= <>
##$DPNAME1= <>
##$DPNAME2= <>
##$DPNAME3= <>
##$DPNAME4= <>
##$DPNAME5= <>
##$DPNAME6= <>
##$DPNAME7= <>
##$DPOAL= (0..7)
0.5 0.5 0.5 0.5 0.5 0.5 0.5 0.5 
##$DPOFFS= (0..7)
0 0 0 0 0 0 0 0 
##$DQDMODE= 0
##$DR= 18
##$DS= 0
##$DSLIST= <SSSSSSSSSSSSSSS>
##$DSPFIRM= 0
$$ [...]
##$SUBNAM0= <"">
##$SUBNAM1= <"">
##$SUBNAM2= <"">
##$SUBNAM3= <"">
##$SUBNAM4= <"">
##$SUBNAM5= <"">
##$SUBNAM6= <"">
##$SUBNAM7= <"">
##$SUBNAM8= <"">
##$SUBNAM9= <"">
##$SW= 18.0517328524113
##$SWIBOX= (0..15)
0 0 2 0 0 0 0 0 0 0 0 0 0 0 0 0 
##$SW_h= 3612.71676300578
##$TD= 16384
##$TD0= 1
##$TE= 0
##$TE2= 300
##$TE3= 300
##$TEG= 300
##$TL= (0..7)
0 120 120 120 120 120 120 120 
##$TP= (0..7)
150 150 150 150 150 150 150 150 
##$TP07= 0
##$TPNAME0= <>
##$TPNAME1= <>
##$TPNAME2= <>
##$TPNAME3= <>
##$TPNAME4= <>
##$TPNAME5= <>
##$TPNAME6= <>
##$TPNAME7= <>
##$TPOAL= (0..7)
0.5 0.5 0.5 0.5 0.5 0.5 0.5 0.5 
##$TPOFFS= (0..7)
0 0 0 0 0 0 0 0 
##$TUNHIN= 0
##$TUNHOUT= 0
##$TUNXOUT= 0
##$USERA1= <user>
##$USERA2= <user>
##$USERA3= <user>
##$USERA4= <user>
##$USERA5= <user>
##$V9= 5
##$VALIST= <valist>
##$VCLIST= <CCCCCCCCCCCCCCC>
##$VD= 0
##$VDLIST= <DDDDDDDDDDDDDDD>
##$VPLIST= <PPPPPPPPPPPPPPP>
##$VTLIST= <TTTTTTTTTTTTTTT>
##$WBST= 1024
##$WBSW= 4
##$XGAIN= (0..3)
0 0 0 0 
##$XL= 0
##$YL= 0
##$YMAX_a= 113662
##$YMIN_a= -132831
##$ZGOPTNS= <>
##$ZL1= 120
##$ZL2= 120
##$ZL3= 120
##$ZL4= 120
##$ABSF1= 10
##$ABSF2= 0
##$ABSG= 5
##$ABSL= 3
##$ALPHA= 0
##$AQORDER= 0
##$ASSFAC= 0
##$ASSFACI= 0
##$ASSFACX= 0
##$ASSWID= 0
##$AUNMP= <proc_1d>
##$AZFE= 0.1
##$AZFW= 0.1
##$BCFW= 1
##$BC_mod= 2
##$BYTORDP= 1
##$COROFFS= 0
##$CY= -3
##$DATMOD= 1
##$DC= 2
##$DFILT= <>
##$DTYPP= 0
##$F1P= 0
##$F2P= 0
##$FCOR= 0.5
##$FTSIZE= 0
##$FT_mod= 4
##$GAMMA= 1
##$GB= 0.15
##$INTBC= 1
##$INTSCL= 1
##$ISEN= 128
##$LB= 0.25
##$LEV0= 0
##$LPBIN= 0
##$MAXI= 10000
##$MC2= 0
##$MEAN= 0
##$ME_mod= 0
##$MI= 1.114404
##$NCOEF= 0
##$NC_proc= 0
##$NLEV= 6
##$NOISF1= 3.799351
##$NOISF2= 2.8
##$NSP= 1
##$NTH_PI= 0
##$NZP= 0
##$OFFSET= 14.38212
##$PC= 1
##$PHC0= -471.9553
##$PHC1= 12.19221
##$PH_mod= 1
##$PKNL= yes
##$PPARMOD= 0
##$PSCAL= 0
##$PSIGN= 0
##$REVERSE= no
##$SF= 200.129724274929
##$SI= 16384
##$SIGF1= 3
##$SIGF2= 2
##$SINO= 400
##$SIOLD= 16384
##$SREGLST= <1H.CDCl3>
##$SSB= 0
##$STSI= 0
##$STSR= 0
##$SW_p= 3205.1282051282
##$SYMM= 0
##$S_DEV= 0
##$TDeff= 0
##$TDoff= 0
##$TI= <>
##$TILT= no
##$TM1= 0
##$TM2= 0
##$TOPLEV= 0
##$USERP1= <user>
##$USERP2= <user>
##$USERP3= <user>
##$USERP4= <user>
##$USERP5= <user>
##$WDW= 1
##$XDIM= 8192
##$YMAX_p= 0
##$YMIN_p= 0
$$ End of Bruker specific parameters
$$ ---------------------------------
##NTUPLES= NMR FID
##VAR_NAME=  TIME,          FID/REAL,        FID/IMAG
##SYMBOL=    X,             R,               I
##VAR_TYPE=  INDEPENDENT,   DEPENDENT,       DEPENDENT
##VAR_FORM=  AFFN,          ASDF,            ASDF
##VAR_DIM=   8192,          8192,            8192
##UNITS=     SECONDS,       ARBITRARY UNITS, ARBITRARY UNITS
##FACTOR=    0.0002768,     1,               1
##FIRST=     0,             0,               0
##LAST=      2.2672688,     0,               0
##MIN=       0,             -132831,         0
##MAX=       2.2672688,     113662,          0
$$ Real data points
##PAGE= N=1
##DATA TABLE= (X++(R..R)), XYDATA
$$ [...]
$$ plain form
2047 -431 -458 -478 -230 406 658 506 519 149 -194 -825 -525 -321 -130 24 232 378 485 302 53 -742 -726
2068 -726 -572 -47 688 524 660 606 240 -235 -241 -321 -581 -461 23 231 780 572 287 -127 -630 -756 -425
2089 -425 -130 159 321 35 242 394 67 -324 -158 -687 -507 -101 380 820 676 524 -115 -222 -325 -344
2109 -344 -99 -160 334 182 224 304 360 -59 -616 -580 -466 -170 387 676 633 422 -104 -176 -248 -451 -476 -193 -71
2132 -71 120 766 715 404 14 -523 -1072 -599 -172 544 531 538 602 100 -291 -208 -480 -735 -543 5 251 770
2154 770 567 80 -65 -694 -768 -526 -272 117 433 305 317 44 7 -405 -396 -639 -300 -231 473 685 690 326 -24
2177 -24 -348 -489 -228 -235 148 -74 82 719 355 377 -32 -555 -617 -369 -157 488 592 608 242 46 -237 -383
2199 -383 -516 -238 -231 308 224 464 436 82 -114 -802 -1022 -612 -1 362 585 531 477 -28 -15 -447 -506 -680 -498
$$ packed form
2047d31k7k0K48O36K52j52J3l70l43o31L00K04J91J54K08J46J07j83k49p95J6
2068g26J54N25P35j64J36n4l66m75oq0k60J20M84K08N49k08k85m14n03j26L31
2089d25K95K89J62k86K07J52l27l91J66n29J80M06M81M40j44j52o39j07j03j9
2109c44K45o1M94j52M2Q0N6m19n57L6J14K96N57K89m3k11n26p2p2k03k5K83J22
2132g1J91O46n1l11l90n37n49M73M27P16j3PO4n02l91Q3k72k55J92N48K46N19
2154G70k03m87j45o29p4K42K54L89L16j28J2k73l7m12Rk43L39O9P04K12Nl64l50
2177b4l24j41K61pL83k22J56O37l64K2m09n23o2K48K12O45J04J6l66j96k83j46
2199c83j33K78PN39q4K40k8l54j96o88k20M10O11L63K23n4n4n05J3m32n9j74J82
$$ plain form
2222 -498 154 448 826 613 304 -281 -412 -471 -367 -74 1 780 343 352 233 56 -298 -473 -489 -765 9 300
2244 300 742 699 296 -107 -496 -440 -328 -113 -288 392 697 434 622 -7 -431 -523 -876 -550 -37 397 726
2265 726 456 299 -86 -526 -563 -647 -422 -4 253 532 428 635 277 -354 -466 -747 -469 63 382 602 459
2286 459 432 142 -138 -184 -401 -356 -353 -125 291 636 584 505 -259 -671 -650 -351 -17 326 447 451 579 221 325
2309 325 -32 -636 -494 -543 -365 520 696 488 153 -239 -449 -707 -378 -212 -58 284 311 780 569 367 -277
2330 -277 -519 -774 -593 157 356 884 428 102 -88 -145 -493 -335 -506 -45 6 249 615 426 321 -309 -714
2351 -714 -574 -663 -226 344 883 689 144 89 108 -319 -508 -411 -236 39 502 763 689 23 -225 -734 -588 -268
2373 -268 -121 95 402 354 320 199 -294 -151 -737 -764 -438 -73 471 601 662 407 -305 -261 -529 -450 -21 94
$$ packed form
2222d98O52K94L78k13l09n85j31n9J04K93P5P79m37Rj19j77l54j75j6k76P74K91
2244C00M42m3m03m03l89N6J12K15j75O80L05k63J88o29m24r2l53L26N13M34L29
2265G26k70j57l85m40l7q4K25M18K57K79j04K07l58o31j12k81K78N32L19K20j43
2286D59k7k90k80m6k17M5LK28M16L45n2p9p64m12K1K99L34L43J21MJ28l58J04
2309C25l57o04J42m9J78Q85J76k08l35l92k10k58L29J66J54L42K7M69k11k02o44
2330b77k42k55J81P50J99N28m56l26j90n7l48J58j71M61N1K43L66j89j05o30m05
2351g14J40q9M37N70N39j94n45n5J9m27j89R7J75K75M63K61p4o66k48n09J46L20
2373b68J47K16L07m8l4j21m93J43n86k7L26L65N44J30O1k55p12M4k68P9M29J15
$$ plain form
2395 94 503 411 562 447 45 -306 -514 -665 -451 -378 325 455 678 245 -39 -167 -737 -356 -696 -81 147
2416 147 740 746 445 232 -378 -734 -655 -371 336 401 682 853 335 52 -207 -380 -407 -272 -32 256 571 819
2438 819 398 349 -62 -621 -738 -293 0 140 473 447 566 104 -35 -302 -638 -622 -463 -66 261 576 815
2459 815 12 -452 -452 -607 -475 -220 292 275 228 401 559 351 -374 -456 -523 -380 236 458 797 550 -91 -266
2481 -266 -253 -364 -233 -269 -174 37 247 607 665 238 -130 -545 -684 -403 10 270 621 503 50 60 -221 -592
2503 -592 -232 -610 -187 221 615 609 598 136 -357 -707 -376 117 351 119 414 265 -40 70 -36 -46 -534
2524 -534 -760 -51 80 407 702 626 430 -301 -471 -709 -346 4 87 173 287 524 245 7 -267 -698 -691 -342
2546 -342 355 533 751 586 143 -460 -443 -350 -400 120 -47 156 356 422 677 418 -386 -638 -564 -619 203 414
$$ packed form
2395I4M09r2J51j15m02l51k08j51K14P3P03J30K23m33k84j28n70L81l40O15K28
2416A47N93Ol01k13o10l56P9K84P07O5K81J71n18k83k59j73k7J35K40K88L15K48
2438H19m21m9m11n59j17M45K93J40L33k6J19m62j39k67l36J6J59L97L27L15K39
2459H15q03m64%j55J32K55N12j7m7J73J58k08p25q2o7J43O16K22L39k47o41j75
2481b66J3j11J31l6R5K11K10L60N8m27l68m15j39K81M13K60L51j18m53J0k81l71
2503e92L60l78M23M08L94oj1m62m93l50L31M93K34k32K95j49l05J10j06j0m88
2524e34k26P09J31L27K95p6j96p31j70k38L63L50Q3Q6J14K37k79k38k74m31PL49
2546c42O97J78K18j65m43o03J7R3n0N20j67K03K00O6K55k59q04k52P4n5Q22K11
$$ plain form
2568 414 490 362 68 271 -599 -212 -407 -105 -38 -34 338 748 786 -45 -364 -1003 -530 -47 -18 479 124 93
2590 93 374 362 -83 -208 -578 -386 -98 127 469 795 581 36 -392 -553 -421 -380 -186 456 314 501 217
2611 217 537 224 -341 -522 -677 -389 -39 524 669 518 -19 -317 -145 -226 -145 -185 -236 235 396 874 459
2632 459 136 -579 -655 -659 -337 103 313 606 130 -12 -259 -131 121 -419 -531 -196 142 535 497 364 101
2653 101 -175 -567 -427 -152 148 263 80 537 267 220 104 -383 -681 -364 -138 163 587 621 365 -113 -289
2674 -289 -270 -278 -332 -193 121 72 148 455 73 22 -375 -693 -661 -142 201 644 753 263 -56 -720 -178 -271 -59
2697 -59 -296 -46 213 525 638 510 -56 -326 -787 -570 -192 244 435 389 -107 179 -191 -150 3 -510 -208
2718 -208 26 284 608 776 725 124 -478 -552 -395 112 185 246 55 327 -5 217 -228 -372 -512 -567 -252 104
$$ packed form
2568D14P6j28k94K03q70L87j95L02O7ML72M10L8q31l19o39M73M83K9M97l55l1
2590I3K81j2m45j25l70J92K88K25L42L26k14n45m28j61J32M1J94O42j42J87k84
2611B17L20l13n65j81j55K88L50N63J45j51n37k98J72q1Q1m0n1M71J61M78m15
2632D59l23p15p6mL22M40K10K93m76j42k47J28K52n40j12L35L38L93l8j33k63
2653A01k76l92J40K75L00J15j83M57k70m7j16m87k98L17K26L01M24L4k56m78j76
2674b89J9qn4J39L14m9P6L07l82n1l97l18L2N19L43M43J09m90l19o64N42r3K12
2697e9k37K50K59L12J13j28n66k70m61K17L78M36J91m6m96K86l70M1J53n13L02
2718b08K34K58L24J68n1o01o02p4J57N07P3O1j91K72l32K22m45j44j40n5L15L56
$$ plain form
2740 104 606 631 573 -55 -261 -397 -453 -140 117 44 171 190 76 254 30 -353 -480 -570 -317 496 395 282
2762 282 149 105 -354 70 -261 -117 1 -328 218 551 574 391 -31 -371 -658 -639 -192 61 346 170 115
2783 115 -318 22 12 -83 -308 -198 -200 84 575 360 356 61 -606 -353 -316 66 114 274 51 -134 340 -4 -55
2806 -55 -325 -450 -532 -228 236 483 323 -8 -512 -252 -442 -159 -262 20 503 30 340 436 53 -16 -429
2827 -429 -254 -540 -439 -243 435 461 223 -209 27 -221 -279 -88 -163 -51 287 409 323 92 7 -347 -438 -299
2849 -299 17 426 403 -79 336 163 -124 -121 -245 -425 -236 -108 259 496 456 195 -6 -207 -317 -296 8 53
2871 53 112 376 90 228 -128 -57 -284 -302 -384 -58 291 799 244 352 -63 -71 -142 -82 -103 36 18 327 84 85
2895 85 305 -107 -533 -543 -316 -269 372 548 236 30 0 -408 -228 -160 -12 45 268 61 450 421 328 -276 -354
$$ packed form
2740A04N02K5n8o28k06j36n6L13K57p3J27J9j14J78k24l83j27r0K53Q13j01j13
2762B82j33m4m59M24l31J44J18l29N46L33K3j83m22l40k87J9M47K53K85j76n5
2783A15m33L40j0r5k25J10kK84M91k15mk95o67K53L7L82M8J60k23j85M74l44n1
2806e5k70j25q2L04M64K47j60l31n04K60j90K83j03K82M83m73L10R6l83o9m13
2827d29J75k86J01J96O78K6k38m32K36k48n8J91p5J12L38J22q6k31q5l54r1J39
2849b99L16M09k3m82M15j73k87Lj24j80J89J28L67K37m0k61k01k01j10K1L04M5
2871E3N9K64k86J38l56P1k27j8q2L26L49N08n55J08m15qp1O0k1J39j8L09k43J
2895H5K20m12m26j0K27M7O41J76l12k06l0m08J80O8J48N7K23k07L89k9r3o04p8
$$ plain form
2918 -354 -621 -400 113 395 527 270 -105 109 35 -319 -176 -86 -330 -107 466 534 504 208 -177 -575 -454
2939 -454 -398 134 370 94 322 325 -68 163 -27 -398 -634 -482 33 431 474 349 161 -286 -232 -338 -20 -171
2961 -171 0 -2 158 329 164 187 -175 -386 -616 -133 92 -11 378 404 156 -418 -183 -146 -343 84 -154 369
2983 369 378 503 592 90 -520 -535 -574 -173 36 153 599 429 88 -90 -29 -358 -337 -322 -22 45 236 525 440
3006 440 264 -395 -388 -493 -59 297 52 75 59 249 347 354 -107 -386 -423 -286 225 338 377 58 -47 -210 -164
3029 -164 -267 71 118 113 97 211 433 338 263 -235 -399 -418 -95 -55 115 599 141 -189 -306 -277 -300 -134 -152 -354
3053 -354 50 440 399 558 -87 -497 -339 -362 -188 178 364 231 372 279 60 -99 -423 -191 -455 -213 336
3074 336 533 552 186 179 -240 -422 -428 -380 -209 75 330 29 105 205 57 -115 42 -791 -226 79 370 836
$$ packed form
2918c54k67K21N13K82J32k57l75K14p4l54J43R0k44K23N73O8l0k96l85l98J21
2939d54N6N32K36k76K28Ll93K31j90l71k36J52N15L98M3j25j88m47N4j06L18j51
2961a71J71kJ60J71j65K3l62k11k30M83K25j03L89K6k48n74K35L7j97M27k38N23
2983C69RJ25Q9n02o10j5l9M01K09J17M46j70l41j78O1l29K1J5L00O7J91K89q5
3006D40j76o59Pj05M34L56k45K3j6J90R8Pm61k79l7J37N11J13L9l19j05j63M6
3029a64j03L38M7nj6J14K22r5p5m98j64j9L23M0J70M84m58l30j17K9k3J66j8k02
3053c54M04L90m1J59o45m10J58k3J74L66J86j33J41r3k19j59l24K32k64K42N49
3074C36J97J9l66pm19j82oM8J71K84K55l01P6J00j48j72J57q33N65L05K91M66
$$ plain form
3096 836 313 -157 1 -545 -194 -252 -56 232 261 285 376 157 53 -256 -406 -553 -283 -282 352 332 424 -66 76
3119 76 64 -79 -119 -66 -86 138 250 569 189 -29 -179 -478 -269 -72 148 115 265 -187 35 -121 -12 -457
3141 -457 -335 -241 -48 239 355 521 319 -113 -98 -520 89 -188 85 224 439 468 404 148 -70 -463 -238
3162 -238 -279 -296 4 483 171 402 -223 -327 -301 -187 -118 -142 15 80 202 308 77 -159 -163 -653 -403 301 88
3185 88 103 277 53 180 -221 -233 -471 -128 -232 1 121 272 286 422 60 15 -354 -361 34 330 370 14 138
3208 138 234 -34 -220 -272 -122 -275 -118 398 389 483 17 20 -318 -503 -144 -187 23 79 370 -99 58 115 192 -369
3232 -369 -275 -360 -79 64 531 406 161 163 -381 83 -162 139 -101 -110 98 261 267 455 -37 -266 -315 -520 -303
3255 -303 240 632 3 169 -24 -420 -102 -1 -373 2 35 168 347 365 295 157 -412 -361 -258 3 107
$$ packed form
3096H36n23m70J58n46L51n8J96K88K9K4R1k19j04l09j50j47K70JO34k0R2m90J42
3119G6j2j43m0N3k0K24J12L19l80k18j50k99K09J97K20l3J50m52K22j56J09m45
3141d57J22R4J93K87J16J66k02m32J5m22O09k77K73J39K15K9o4k56k18l93K25
3162b38m1j7L00M79l12K31o25j04K6J14O9k4J57O5J22J06k31k36mm90K50P04k13
3185H8J5J74k24J27m01j2k38L43j04K33J20J51J4J36l62m5l69pL95K96M0l56J24
3208A38R6k68j86n2J50j53J57N16rR4m66Ll38j85L59m3K10N6K91m69J57N7P7n61
3232c69R4q5K81J43M67j25k45Kn44M64k45L01k40rK08J63OJ88m92k29m9k05K17
3255c03N43L92o29J66j93l96L18J01l72L75L3J33J79J8p0j38n69N1J03K61J04
$$ plain form
3276 107 222 71 28 -178 182 -158 -211 -246 -275 29 85 357 552 296 -174 -220 -236 -233 -110 173 146 542 166
3299 166 71 359 -201 -487 -293 -644 -181 175 253 354 301 122 -420 -238 247 -352 -328 82 3 189 145 226
3321 226 -8 -384 -412 -411 -225 30 347 394 -92 -235 -348 -44 -335 -219 -402 -201 90 274 502 289 -232
3342 -232 -226 -322 -269 107 100 213 128 298 -22 123 -78 -40 -95 -260 -95 94 299 258 238 -35 -194 -467 -196 -165
3366 -165 253 432 100 202 383 122 -112 -363 -816 -628 120 180 400 135 217 -119 -153 -199 -182 -265 194 -144
3388 -144 205 264 146 338 -252 -491 -538 -217 -161 553 148 -13 36 -62 -58 -205 -152 45 81 -43 24 184 264 301
3412 301 9 -457 -143 78 -108 -81 103 339 207 -45 -137 -293 -216 -92 -327 -172 359 429 377 17 -177 -454
3434 -454 -41 155 129 259 -43 379 276 338 -36 100 -501 -367 -256 -55 290 376 322 -242 36 -146 -220 179
$$ packed form
3276A07J15j51m3k06L60l40n3l5k9L04N6K72J95k56m70m6j6LJ23K83k7L96l76
3299A66r5K88n60k86J94l51M63L56P8J01n3j79n42J82M85n99K4M10p9J86m4Q1
3321B26k34l76k8JJ86K55L17M7m86j43j13L04k91J16j83K01K91J84K28k13n21
3342b32Or6N3L76pJ13q5J70l20J45k01L8n5j65J65J89K05m1k0k73j59k73K71L1
3366a65M18J79l32J02J81k61k34k51m53J88P48O0K20k65Q2l36l4m6J7q3M59l38
3388a44L49N9j18J92n90k39m7L21N6P14m05j61M9r8Mj47N3J97L6j24O7J60Q0L7
3412C01k92m66L14K21j86K7J84K36j32k52r2j56P7J24k35J55N31P0n2l60j94k77
3434d54M13J96k6J30l02M22j03O2l74J36o01J34J11K01L45Q6n4n64K78j82p4L99
$$ plain form
3456 179 220 -178 143 339 433 57 -42 68 -379 -504 9 261 180 502 -104 264 -67 -200 -83 -25 43 -321
3478 -321 402 275 706 211 144 53 -244 -115 -57 281 73 23 253 80 154 -43 -327 -124 -175 -243 271 147
3500 147 574 227 -95 42 -314 19 -268 64 268 119 132 123 259 158 84 -470 -383 -46 -57 -42 490 366
3522 366 36 -370 -302 -179 -133 13 134 193 53 210 292 20 -229 -180 -21 -300 80 453 211 -30 101 -39
3544 -39 -45 -179 113 -264 2 155 548 261 165 -46 -204 -447 -256 -127 22 474 -23 171 -1 -36 165 -85
3566 -85 -210 -316 -343 -2 274 439 295 -279 -465 -177 -152 91 189 86 -39 136 121 238 98 33 -144 -323
3588 -323 -153 26 229 202 125 -219 -253 -240 -197 -63 285 360 76 213 198 341 71 -237 -110 -194 -85 272 276
3611 276 -3 319 -15 16 -387 -136 -239 -191 -23 -182 576 134 318 -305 -263 -262 -421 238 -78 346 -76 129
$$ packed form
3456A79M1l98L21J96R4l76r9J10m47j25N13K52q1L22o06L68l31j33J17N8O8l64
3478c21P23j27M31m95o7r1k97J29N8L38k08n0K30j73P4j97k84K03n1o8N14j24
3500A47M27l47l22J37l56L33k87L32K04j49J3rJ36j01p4n54Q7L37j1J5N32j24
3522C66l30m06O8J23M6J46J21N9j40J57Q2k72k49M9J59k79L80L73k42k41J31j40
3544c9oj34K92l77K66J53L93k87r6k11j58k43J91J29J49M52m97J94j72l5K01k50
3566h5j25j06k7L41K76J65j44n74j86K88K5K43R8j03j25J75j5J17j40o5j77j79
3588c23J70J79K03k7p7l44l4J3M3J34L48P5k84J37j5J43k70l08J27q4J09L57M
3611B76k79L22l34L1m03K51j03M8J68j59P58m42J84o23M2Jj59O59l16M24m22K05
$$ plain form
3633 129 -116 77 -47 -318 -246 -415 -140 262 165 417 258 -68 -216 -510 -52 215 26 -202 164 70 211
3654 211 -250 -336 -53 -287 -283 -33 538 319 334 242 -96 -380 -285 -239 -76 -15 -101 159 144 92 155 -135 -122 -109 -187
3679 -187 -125 204 186 246 3 -276 -150 -252 -260 -401 -244 29 522 369 542 -35 -20 -374 -253 -154 132 145 223
3702 223 148 79 59 204 -42 -22 189 -134 -166 44 248 264 9 131 -98 -290 -85 211 -124 99 128 197 84
3725 84 157 -305 -74 -456 -151 129 217 392 210 -53 -14 -51 73 29 -29 -358 37 158 423 53 231 117
3747 117 7 -217 -244 -64 414 390 367 121 -43 56 52 223 -79 -207 209 155 387 495 267 -249 -355 -274 -162
3770 -162 -157 92 169 -8 107 -10 54 -118 50 -336 -358 -111 14 347 289 40 -318 -318 -475 3 154 118 226
3793 226 137 324 301 351 -198 -376 -577 -159 119 16 103 161 247 -147 -343 35 41 -115 -144 153 -112 192 626
$$ packed form
3633A29k45J93j24k71P2j69K75M02r7K52j59l26j48k94M58K67j89k28L66r4J41
3654B11m61q6K83k34MK50N71k19J5r2l38k84R5M6J63O1q6K60j5n2O3k90J3J3p8
3679a87O2L29j8O0k43k79J26j02qj41J57K73M93j53J73n77J5l54J21R9K86J3P8
3702B23p5o9k0J45k46K0K11l23l2K10K04J6k55J22k29j92K05K96l35K23K9O9j13
3725H4P3m62K31l82L05K80Q8J75j82k63L9l7J24m4n8l29L95J21K65l70J78j14
3747A17j10k24k7J80M78k4k3k46j64R9mJ71l02j28M16n4K32J08k28n16j06Q1J12
3770a62NK49P7j77J15j17O4j72J68l86k2K47J25L33n8k49l58%j57M78J51l6J08
3793B26q9J87k3N0n49j78k01M18K78j03Q7N8Q6l94j96L78Oj56k9K97k65L04M34
$$ plain form
3816 626 174 -84 -241 -241 -263 218 125 328 120 -299 -150 -123 125 -195 -138 48 -124 -167 234 470 -79 -271
3838 -271 -70 -258 -343 1 146 111 26 145 -177 102 56 -448 107 -266 -93 89 186 99 98 -263 -135 -174 -66
3861 -66 92 -113 230 120 182 191 -214 73 -182 -319 -289 -16 269 231 -96 33 136 -191 -212 96 -17 -111 -85
3884 -85 224 79 145 282 -127 -127 -139 -216 85 120 241 72 97 114 -230 -154 -213 -174 -280 -170 34 393 231 -96
3908 -96 37 -253 -243 -49 40 33 89 258 267 235 269 -177 -179 -298 -49 -70 62 458 409 -13 -173 -166 -89 55 -182 -45
3934 -45 28 262 105 51 -16 -241 -261 -365 105 112 -50 154 102 23 -140 -242 -135 5 82 208 214 72 178 397
3958 397 80 -187 -307 -137 -253 248 404 34 -145 30 103 -252 -32 -129 -414 -139 -139 156 466 36 13 -388
3980 -388 -214 -174 119 50 187 31 -39 17 -226 123 -40 -368 -14 -216 -68 456 286 289 98 -429 -175 -202
$$ packed form
3816F26m52k58j57%k2M81r3K03k08m19J49K7K48l20N7J86j72m3M01K36n49j92
3838b71K01j88q5L44J45l5q5J19l22K79m6n04N55l73J73J82R7q7jl61J28l9J08
3861f6J58k05L43j10O2Rm05K87k55j37L0K73K85l8l27J29J03l27k1L08j13r4K6
3884h5L09j45O6J37m09%j2p7L01L5J21j69K5J7l44P6n9L9j06J10K04L59j62l27
3908i6J33k90J0J94Q9pN6J69Rl2L4m46kj19K49k1J32L96m9m22j60PP7J44k37J37
3934d5P3K34j57n4o7k25k0j04M70Pj62K04n2p9j63j02J07J40P7J26Oj42J06K19
3958C97l17k67j20J70j16N01J56l70j79J75P3l55K20r7k85K75%K95L10m30k3m01
3980c88J74M0K93o9J37j56p0N6k43L49j63l28L54k02J48N24j70Lj91n27K54k7
$$ plain form
4002 -202 148 123 121 -105 -32 389 99 -159 -38 -127 -108 118 47 13 17 219 -214 134 120 311 -129 -212 -306 133
4026 133 119 27 -98 15 -9 60 -109 45 203 89 274 319 -78 -5 25 -6 -206 -123 54 189 94 123 126 83 -269
4051 -269 -406 -400 -310 40 59 124 374 440 -74 137 -187 -82 71 -51 77 212 188 136 -97 -64 -306 124 -99
4074 -99 81 35 25 244 265 170 178 -118 -371 -38 -182 166 280 416 -121 235 21 51 -22 61 -263 45 -75
4097 -75 344 301 340 12 -114 284 -89 -58 345 159 173 -123 -97 -113 -66 -91 -202 -287 -41 224 277 91 139 -19
4121 -19 -273 -305 -7 23 -69 159 -276 189 5 -59 43 -33 -143 -172 -154 88 314 116 86 -12 -66 -145 -108 105
4145 105 -13 -27 101 61 -54 -47 -70 -182 24 -122 238 -232 273 228 -242 141 -431 97 -1 133 111 -101 116
4168 116 -5 -29 94 -244 -33 -284 -92 458 235 171 -78 49 27 -130 -75 -206 -53 196 -24 213 499
$$ packed form
4002b02L50k5kk26P3M21k90k58J21q9J9K26p1l4MK02m33L48j4J91m40q3r4M39
4026A33j4r2j25J13k4O9j69J54J58j14J85M5l97P3L0l1k00Q3J77J35r5K9Lm3l52
4051b69j37OR0L50J9O5K50O6n14K11l24J05J53j22J28J35k4n2k33L3k42M30k23
4074i9J80m6j0K19K1r5Qk96k53L33j44L48J14J36n37L56k14L0p3Q3l24L08j20
4097g5M19m3L9l28j26L98l73L1M03j86J4k96K6j6M7k5j11q5K46K65N3j86M8j58
4121a9k54l2K98L0r2K28m35M65j84o4J02p6j10k9J8K42K26j98l0r8n4p9L7K13
4145A05j18j4J28m0j15Pk3j12K06j46L60m70N05m5m70L83n72N28r8J34k2k12K17
4168A16j21k4J23l38K11k51J92N50k23o4k49J27k2j57N5j31J53K49k20K37K86
$$ plain form
4189 499 212 142 2 -327 -206 -37 -85 35 -85 -76 115 -92 -94 -108 -231 -544 -145 136 99 450 211 120 29
4212 29 -302 -384 0 -133 44 -89 -18 128 167 34 147 -220 -357 -60 136 107 326 -23 -149 191 -145 1
4234 1 -27 -39 56 -360 -13 21 81 79 -113 -202 -190 -15 -89 290 57 -165 -219 69 155 38 109 89 -72 76 -71
4259 -71 261 -225 260 -289 12 -184 135 -89 36 -95 123 28 52 269 -218 -208 -320 -96 102 179 357 262
4281 262 -22 -129 -108 63 12 134 -109 -98 -217 1 -152 41 -283 -74 0 -273 74 126 330 216 -134 40
4303 40 102 -150 33 198 20 65 90 10 -1 -20 -7 -424 -252 392 -167 254 138 119 43 -198 99 43 193 34
4327 34 -44 200 -51 225 12 307 40 -395 -305 -159 11 -258 129 -137 208 253 -45 -180 -273 -343 27 -1
4349 -1 101 102 -3 -106 -164 -163 -176 162 85 -89 -20 -122 165 219 -4 -99 -208 -34 -188 162 141 193 75 -61 89
$$ packed form
4189D99k87p0j40l29J21J69m8J20j20RJ91k07kj4j23l13L99K81l7L51k39r1r1
4212B9l31q2L84j33J77j33P1J46L9j33J13l67j37K97J96k9K19l49j26L40l36J46
4234Ak8j2R5m16L47L4O0kj92q9J2J75p4L79k33k22n4K88Q6j17P1k0j61J48j47
4259g1L32m86M85n49L01j96L19k24J25j31K18r5K4K17m87J0j12K24J98P7J78r5
4281B62k84j07K1J71n1J22k43J1j19K18j53J93l24K09P4k73L47N2K04j14l50J74
4303D0O2k52J83J65j78M5K5q0j1j9J3m17J72O44n59M21j16j9p6k41K97n6J50j59
4327C4p8K44k51K76k13K95k67m35R0J46J70k69L87k66L45M5k98j35r3p0L70k8
4349aJ02Jj05j03n8Jj3L38p7j74O9j02K87N4k23r5j09J74j54L50k1N2j18j36J50
$$ plain form
4374 89 0 -66 -46 -30 77 -260 -39 218 313 6 79 -47 1 182 -37 -245 204 67 35 -21 9 -95 -101 231
4398 231 130 -19 179 190 42 -253 -135 -11 -21 -12 229 61 56 145 -301 -188 48 -21 -48 -99 -211 224 409
4421 409 148 352 -147 -261 75 -166 177 101 77 275 70 -52 241 104 -147 60 -208 -38 182 24 119
4442 119 -37 -110 68 -6 -87 52 87 179 -252 87 -50 111 -99 -176 -85 115 -96 -186 136 -67 -249 97 -168
4465 -168 -152 -116 22 -173 216 167 -184 113 203 84 -107 126 -63 -203 50 139 218 108 136 18 17 -255 31
4488 31 -128 -190 238 350 31 -204 197 -166 37 -167 142 87 198 -20 177 113 -238 18 -52 -387 -219 -101
4510 -101 54 273 56 -288 101 150 400 -7 102 38 -20 27 -371 343 -21 80 -114 67 -129 -298 73
4531 73 -10 91 -144 -46 -65 173 177 153 -317 -28 -162 35 338 127 -193 -278 -83 11 -115 -172 523 186 162 -40
$$ packed form
4374H9q9o6K0J6J07l37K21K57R5l07P3j26M8J81k19k08M49j37l2n6L0j04oL32
4398B31j01j49J98J1j48k95J18J24j0RK41j68nQ9m46J13K36o9k7n1j12M35J85
4421D09k61K04m99j14L36k41L43p6k4J98k05j22K93j37k51K07k68J70K20j58R5
4442A19j56p3J78p4q1J39L5R2m31L39j37J61k10p7R1K00k11r0L22k03j82L46k65
4465a68J6L6J38j95L89m9l51K97R0j19j91K33j89j40K53Q9P9j10K8j18jk72K86
4488C1j59o2M28J12l19k35M01l63K03k04L09n5J11k18J97o4l51K56p0l35J68J18
4510a01J55K19k17l44L89M9K50m07J09o4n8M7l98P14l64J01j94J81j96j69L71
4531G3q3J01k35R8j9K38Mk4m70K89j34J97L03k11l20q5J95R4j26n7O95l37k4k02
$$ plain form
4555 -40 88 -144 -31 -302 -219 -131 -71 -113 215 342 -135 -59 -220 94 82 101 24 -82 -129 3 -245 -12 -155
4578 -155 -52 -83 -68 0 7 87 -5 -118 86 54 -216 147 -216 70 -313 88 89 33 -206 39 -85 119 -353 352
4602 352 -38 67 -105 30 -96 114 152 -102 29 78 60 137 279 81 -191 -89 -77 296 -227 -183 -165 -130 163
4625 163 295 -18 257 294 -134 185 -128 -24 76 65 27 -59 -156 189 -175 -149 -89 246 184 -115 280 82 70
4648 70 -8 -236 -37 -90 -41 164 -154 148 133 -47 235 280 39 -222 42 -56 -83 187 188 -80 185 -52 -70 238
4672 238 107 -122 102 16 299 -46 144 279 -240 -8 240 -81 21 -16 -91 -85 -9 77 -75 24 -62 141 -186
4695 -186 -182 256 -148 31 -151 -232 -75 118 39 -66 -109 -30 64 -130 -212 55 20 72 323 34 80 115 -135 1
4719 1 7 -80 26 194 66 127 109 -234 72 0 160 -22 -145 -9 -300 -461 -121 75 -44 82 -29 -5 -198
$$ packed form
4555d0J28k32J13k71Q3Q8O0m2L28J27m77P6j61L14j2J9p7j06m7J32k48K33j43
4578a55J03l1J5O8PQ0r2j13K04l2k70L63l63K86l83M01Jn6k39K45j24K04m72P05
4602C52l90J05j72J35j26K10L8k54J31M9j8P7J42j98k72J02J2L73n23M4J8L5K93
4625A63J32l13K75L7m28L19l13J04J00j1l8q6r7L45l64K6O0L35o2k99L95j98j2
4648G0p8k28J99n3M9K05l18L02j5j80K82M5k41k61K64r8k7K70Jk68K65k37j8L08
4672B38j31k29K24q6K83l45J90J35n19K32K48l21J02l7p5OP6Q6j52R9q6K03l27
4695a86MM38m04J79j82q1J57J93p9j05m3P9R4j94q2K67l5N2K51k89M6L5k50J36
4719AOq7J06J68j28O1j8l43L06p2J60j82j23J36k91j61L40J96j19J26j11K4j93
$$ plain form
4742 -198 206 102 273 -184 -66 170 -129 -2 -21 -185 -186 111 -44 202 79 261 34 -120 -202 119 50 -31
4764 -31 136 -78 100 113 88 -120 -241 -46 123 196 -74 -24 -240 -306 140 42 -321 -131 -98 227 -84 -7 1 192
4788 192 55 -141 -277 -84 -47 -122 118 -36 -82 -226 102 97 -13 -55 -151 -292 -29 -83 74 225 -21 -90 164
4811 164 -2 -73 21 165 106 298 -112 -65 1 37 -145 60 -38 13 -274 -4 184 47 42 158 79 -192 39 -192
4835 -192 -187 23 21 163 246 270 -92 -30 176 140 317 149 -155 123 135 -2 268 -15 143 -97 -29 -141 101
4858 101 -192 -208 36 -146 221 -20 59 32 -99 28 -167 -190 -240 -7 13 -84 -234 99 124 119 2 70 -285 170
4882 170 1 218 410 87 318 -268 122 237 75 236 -78 195 -78 -163 -13 -63 283 221 -123 -94 -87 217
4904 217 -34 39 189 -69 31 105 -27 -288 66 55 -70 -77 -105 66 -11 138 79 67 -41 20 -90 99 195 183
$$ packed form
4742a98M04j04J71m57J18K36k99J27j9j64jK97j55K46j23J82k27j54q2L21o9q1
4764c1J67k14J78J3k5k08j21J95J69P3k70N0k16o6M46r8l63J90L3L25l11P7QJ91
4788A92j37j96j36J93L7p5K40j54m6j44L28nj10m2r6j41K63n4J57J51k46o9K54
4811A64j66p1R4J44n9J92m10M7O6L6j82K05r8N1k87K70J88j37nJ16p9k71K31k31
4835a92NK10kJ42Q3K4l62O2K06l6J77j68l04K78J2j37K70k83J58k40O8j12K42
4858A01k93j6K44j82L67k41P9k7j31J27j95k3n0K33K0r7j50L33K5nj17O8l55M55
4882A70j69K17J92l23K31n86L90J15j62J61l14K73k73q5J50n0L46o2l44K9PL04
4904B17k51P3J50k58J00P4j32k61L54j1j25pk8J71p7J49n9j2j08O1j10J89R6j2
$$ plain form
4928 183 -73 -115 -246 129 128 -163 4 -92 92 164 -30 -141 177 -35 -51 -28 -111 67 240 267 134 -35 -11
4951 -11 157 41 -163 47 -60 -142 273 104 101 163 163 -55 -175 267 -130 39 201 393 -47 -172 -131 -34 65
4974 65 55 18 -16 185 113 -280 97 -235 179 -169 60 -75 76 88 -22 -36 138 81 93 24 194 163 -95 93
4998 93 253 -37 60 115 62 54 -161 45 -127 -164 -46 66 104 239 118 -51 173 21 -99 -193 -179 46 117 24
5022 24 -15 -310 60 -205 -57 -261 86 2 -87 287 -4 -11 -168 -114 -122 177 -52 116 26 15 35 10 150 -91
5046 -91 -44 29 -100 220 -69 -256 -113 -115 -146 7 408 207 50 -141 8 -157 -152 71 192 115 -63 55 -62
5069 -62 87 340 119 122 195 -90 -20 286 64 104 -21 93 -45 339 82 48 -194 -14 -212 86 126 -140 150
5092 150 154 -78 -37 27 -100 -326 -223 -22 -83 328 -15 51 -88 160 -25 -2 129 127 0 2 194 337 -239 166
$$ packed form
4928A83k56m2j31L75jk91J67r6J84P2j94j11L18k12j6K3q3J78J73K7j33j69K4
4951a1J68j16k04K10j07q2M15j69lO2%k18j20M42l97J69J62J92m40j25M1R7R9
4974F5j0l7l4K01p2l93L77l32M14l48K29j35J51J2j10j4J74n7J2o9J70l1k58J88
4998I3J60k90R7N5n3qk15K06j72l7J18J12L8J35j21j69K24j52j20r4J4K25P1r3
5022B4l9k95L70k65J48k04L47q4q9L74k91pj57N4qK99k29J68r0j1K0k5J40k41
5046i1M7P3j29L20k89j87J43kl1J53M01k01j57j91J49j65NK23J21p7j78J18j17
5069f2J49K53k21LP3k85P0L06k22M0j25J14j38L84k57l4k42J80j98K98M0k66K90
5092A50Mk32M1O4j27k26J03K01o1M11l43O6j39K48j85K3J31kj27KJ92J43n76M05
$$ plain form
5116 166 -104 -217 269 -60 -17 -63 27 260 -138 -149 56 -37 87 -41 172 -121 105 26 77 110 70 -163 -156 48
5140 48 -238 -323 55 107 181 -46 386 -208 -15 -21 -294 -38 212 33 -171 95 -298 -84 -56 -204 -85 -24 398
5163 398 -153 -80 -2 -26 209 76 -42 -118 45 158 348 -157 21 15 -53 87 -111 80 141 -77 65 38 -126
5186 -126 -192 40 -54 -65 107 82 431 -70 43 163 66 -164 -132 106 -87 2 39 185 34 -203 -167 13 -100
5209 -100 -97 129 167 63 -139 61 127 -123 -90 -185 -144 27 256 336 59 -4 83 -113 -34 33 -151 252 -50 -28
5233 -28 -42 15 -65 72 -141 -150 -81 -82 177 -60 93 255 -94 -121 248 -10 122 76 -199 225 -79 -96 180 24
5257 24 -240 -107 -9 -50 175 -141 182 -46 284 -186 -209 -59 41 -117 122 365 12 -110 64 -4 125 -149
5279 -149 -145 -62 -138 90 67 -3 11 -1 225 182 -28 162 -81 260 142 384 155 -82 51 37 55 -38 -72 -164 -112
$$ packed form
5116A66k70j13M86l29M3m6R0K33l98j1K05r3J24j28K13k93K26p9N1L3m0k33PK04
5140D8k86q5L78N2P4k27M32n94J93ok73K56K50j79k04K66l93K14K8j48J19O1M22
5163C98n51P3P8k4K35j33j18p6J63J13J90n05J78oo8J40j98J91O1k18J42k7j64
5186a26o6K32r4j1J72k5L49n01J13J20r7k30L2K38j93Q9L7J46j51k37L6J80j13
5209a00LK26L8j04k02K00O6k50L3r5M1J71K29Q0k77o3Q7j96P9O7j84M03l02K2
5233b8j4N7q0J37k13rO9jK59k37J53J62l49k7L69k58J32m6k75M24l04j7K76j56
5257B4k64J33R8m1K25l16L23k28L30m70k3J50J00j58K39K43l53j22J74o8J29k74
5279a49MQ3p6K28k3p0J4j2K26m3k10J90k43L41j18K42k29k37J33j4J8r3l4r2N2
$$ plain form
5304 -112 84 -92 254 240 23 -149 -41 -220 155 291 129 143 159 -179 -93 46 -158 278 -95 -129 68 52
5326 52 116 69 200 28 -44 67 -17 50 -37 -218 -58 49 186 -219 -207 68 32 -155 -89 112 66 -193 -174 -18
5350 -18 17 17 129 22 128 -214 -87 56 -32 -113 -37 -90 -108 35 49 262 -64 -98 413 -247 224 59 -198 32
5374 32 25 35 131 64 105 -109 -140 -295 133 103 189 191 119 -22 341 53 -16 59 -136 67 -21 125 -139 323 88
5399 88 21 108 -124 114 54 -145 52 -112 60 87 188 155 -137 -10 96 -72 29 290 135 302 -231 -188
5421 -188 61 -31 17 -101 231 238 81 103 -58 255 -109 -12 318 -287 66 83 -97 -106 57 90 -21 -181 -43
5444 -43 -169 -238 53 29 147 -52 165 -328 -49 33 23 412 140 -61 -34 7 23 -106 -220 109 282 131 51
5467 51 -75 -165 40 184 340 -111 271 178 124 136 -114 228 141 76 -117 -41 2 -71 -37 198 -4 17 168 -44
$$ packed form
5304a12J96j76L46j4k17j72J08j79L75J36j62J4J6l38Q6J39k04M36l73l4J97j6
5326E2O4m7J31j72p2J11q4O7q7j81J60J07J37m05J2K75l6j87O6K01m6k59J9J56
5350a8L5%J12j07J06l42J27J43q8q1P6n3j8J43J4K13l26l4N11o60M71j65k57K30
5374C2pJ0R6o7M1k14l1j55M28l0Q6Kp2j41L63k88o9P5j95K03q8J46k64M62k35
5399H8o7Q7k32K38o0j99J97j64J72K7J01l3k92J27J06j68J01K61j55J67n33M3
5421a88K49r2M8j18L32Pj57K2j61L13l64R7L30o05L53J7j80rJ63L3j11j60J38
5444d3j26o9K91k4J18j99K17m93K79Q2j0L89k72k01K7M1J6j29j14L29J73j51q0
5467E1j26r0K05J44J56m51L82r3n4J2k50L42q7o5j93P6M3p3L4K35k02K1J51k12
$$ plain form
5491 -44 -92 75 101 105 -383 -14 20 -84 1 121 28 -102 114 -25 -76 187 48 -60 -255 -54 150 4 -92
5514 -92 63 -142 157 179 -64 382 -55 -27 4 -51 -91 -147 332 351 231 190 -15 -165 115 -16 -233 157 184
5537 184 -90 80 -180 -40 72 175 121 66 -148 328 14 123 -20 125 -176 166 -254 76 402 226 180
5558 180 243 9 -177 -292 -170 52 -152 28 286 -168 63 15 319 9 155 -92 51 -107 109 116 -47
5579 -47 -90 -18 119 -34 64 129 151 25 114 -88 -1 -168 32 88 -259 -118 11 4 -103 138 -57 -178 158 -94
5603 -94 152 -74 -58 -57 -122 81 10 267 1 -119 -145 136 123 176 319 -293 222 163 -327 311 -136 17 -11 -63
5627 -63 -64 69 24 -227 -86 -122 -304 -286 -208 235 31 241 106 -107 35 -62 73 -168 43 2 135 -83 45
5650 45 -20 34 -261 228 -115 -122 -137 156 52 67 135 98 -146 -166 -74 262 -187 -25 88 409 -310 -234 -22 69
$$ packed form
5491d4m8J67K6Mm88L69L4j04Q5J20r3j30K16j39n1K63j39j08j95K01K04j46r6
5514i2J55k05K99K2k43M46m37K8L1n5m0n6M79J9j20m1k05j50K80j31k17L90K7
5537A84k74J70k60J40J12J03n4n5k14M76l14J09j43J45l01L42m20L30L26j76m6
5558A80O3k34j86j15J22K22k04J80K58m54K31m8L04l10J46k47J43j58K16Pj63
5579d7m3P2J37j53R8O5K2j26Q9k02Q7j67K00N6l47J41J29pj07K41j95j21L36k52
5603i4K46k26J6Jo5K03p1K57k66j20k6K81j3N3J43o12N15n9m90O38m47J53k8n2
5627f3jJ33m5k51J41l6j82J8P8M43k04K10j35k13J42r7J35k41K11m1J33k18J28
5650D5o5N4k95M89l43pj5K93j04J5O8l7k44k0R2L36m49J62J13L21p19P6K12R1
$$ plain form
5674 69 293 -190 -33 140 66 94 22 -20 -41 -256 -226 -374 -282 -208 -31 -43 -89 53 -70 216 65 12 4 -69 44
5699 44 -26 326 181 -121 94 12 105 -54 -7 48 153 129 49 131 -77 31 -90 -291 295 -71 134 -191 377
5722 377 150 -11 -68 -307 -124 -310 218 114 -195 -78 -13 107 1 3 -27 134 64 -30 -47 104 140 189 31
5745 31 26 -214 -9 130 -127 166 -74 255 82 89 1 -193 161 -40 -49 77 6 4 -30 84 -134 -256 -350 -86
5769 -86 -18 -2 144 104 -231 -44 -61 -292 -185 -258 -278 -8 86 92 21 90 -286 -123 -68 -284 -160 -9 121 101 153
5794 153 -43 144 -87 33 -60 -240 70 59 249 -221 -82 -12 -133 -80 111 262 104 229 220 -302 -95 135
5816 135 -75 -10 -168 98 -55 62 -103 -138 53 -59 -31 -67 -43 51 105 -54 279 -81 -235 -85 -194 -116 272
5839 272 127 -57 -141 225 42 -159 -187 138 -163 -134 27 24 -86 -34 -78 -73 215 -103 -70 -140 -137 61 -12 61 45
$$ packed form
5674F9K24m83J57J73p4K8p2m2k1k15L0j48R2P4J77j2m6J42j23K86j51n3qp3J13
5699D4p0L52j45l02K15q2R3j59M7N5J05k4q0Q2k08J08j21k01N86l66K05l25N68
5722C77k27j61n7k39J83j86N28j04l09J17O5J20j06Kl0J61p0r4j7J51L6M9j58
5745C1nk40K05J39k57K93k40L29j73Pq8j94L54k01rJ26p1kl4J14k18j22r4K64
5769h6O8J6J46m0l35J87j7k31J07p3k0K70R4Op1O9l76J63N5k16J24J51J30k0N2
5794A53j96J87k31J20r3j80L10j1J90m70J39P0j21N3J91J51j58J25rn22K07K30
5816A35k10O5j58K66j53J17j65l5J91j12K8l6K4R4N4j59L33l60j54J50j09P8L88
5839B72j45j84q4L66j83k01k8L25l01K9J61lj10N2m4NK88l18L3p0LJ98p3P3j6
$$ plain form
5864 45 -246 143 228 -7 110 35 0 -98 357 -108 6 78 -14 -332 -274 -93 -81 304 -57 -110 146 -125 -156 -49
5888 -49 -190 -161 -90 36 124 -157 -154 -266 -55 -171 23 90 127 36 87 384 -44 -72 -192 -87 -212 -284 -61 55
5912 55 -49 -304 117 117 95 156 112 -113 -186 131 372 -51 237 -21 -140 -54 -307 -133 -81 177 250 -9 2 -228
5936 -228 -129 -36 -106 -28 269 -123 -133 -41 235 -27 243 -102 -306 -155 123 83 -37 347 68 -23 148 7 200
5959 200 -97 -5 -4 228 60 -84 178 -173 -47 -252 -122 -39 62 118 86 128 -113 237 56 17 158 -62 27
5982 27 296 86 97 -147 -97 241 7 -127 -130 36 128 143 -127 -80 -44 3 187 223 45 82 93 86 -196 -137 -37
6007 -37 177 -101 90 -226 98 40 316 -194 -58 -218 -309 -190 -100 83 -31 192 14 47 -350 129 -294 1
6029 1 -20 -122 -161 185 -11 76 9 -244 188 -99 -196 97 -23 -132 -88 257 -114 126 -15 -81 111 93 175 249
$$ packed form
5864D5k91L89Q5k35J17p5l5r8M55m65J14P2r2l18N8J81J2L85l61n3K56k71l1J07
5888d9j41K9P1J26Q8k81Lj12K11j16J94O7L7r1N1K97m28k8j20J05j25p2K23J16
5912E5j04k55M21%k2O1m4k25p3L17K41m23K88k58j19Q6k53J74N2K58P3k59J1k30
5936b28R9R3p0P8K97l92j0R2K76k62K70l45k04J51K78m0j20L84k79r1J71j41J93
5959B00k97R2JK32j68j44K62l51J26k05J30Q3J01N6l2M2k41L50j81l9J41k20Q9
5982B7K69k10J1k44N0L38k34j34lJ66R2J5k70M7L6M7J84L6j78L7J1pk82N9J00
6007c7K14k78J91l16L24n8K76n10J36j60r1J19R0J83j14K23j78L3l97M79m23K95
6029Ak1j02l9L46j96Q7o7k53M32k87r7K93j20j09M4L45l71K40j41o6J92j8Q2P4
$$ plain form
6053 249 -187 130 -14 -50 -175 -44 -85 215 51 -298 134 91 163 -172 88 -273 -88 29 -21 -117 -73 -29 117
6076 117 57 -224 -145 -111 -105 -315 139 -44 210 166 65 -162 -67 -152 -26 8 34 -374 5 -117 -91 18 98 -268
6100 -268 -267 141 51 -155 187 252 3 -220 -88 7 24 -2 65 112 162 147 38 251 306 -66 -35 -77 -23 26 18 267
6126 267 96 -17 -125 29 -80 -207 -29 85 177 -10 156 217 33 148 -414 228 -48 -141 -102 41 98 25
6148 25 287 90 -169 -79 -133 -183 -24 40 142 -77 -98 -283 -92 -32 89 199 -140 -34 286 -79 7 -101 -359
6171 -359 -213 110 149 34 202 8 -12 -224 -356 101 291 1 -222 0 109 271 -57 -61 -194 -147 69 95
6193 95 166 -102 246 29 -228 -62 -262 -76 83 9 100 163 100 -109 69 49 -247 -104 59 -35 32 -56 115
6216 115 -28 -16 -46 81 -233 -205 -77 95 57 162 197 -81 -135 81 46 -255 -302 -62 209 73 54 -160 -104
$$ packed form
6053B49m36L17j44l6j25J31m1L00j64l49M32m3P2l35K60l61J85J17n0r6M4M4J46
6076A17o0k81P9L4Ok10M54j83K54m4j01k27R5q5J26L4K6m08L79j22K6J09Q0l66
6100b68JM08r0k06L42O5k49k23J32R5J7k6O7M7N0j5j09K13N5l72L1m2N4M9qK49
6126B67j71j13j08J54j09j27J78J14R2j87J66O1j84J15n62O42k76r3L9J43N7p3
6148B5K62j97k59R0n4n0J59O4J02k19k1j85J91O0J21J10l39J06L20l65Q6j08k58
6171c59J46L23L9j15J68j94k0k12j32M57J90k90k23K22J09J62l28mj33M7K16K6
6193I5P1k68L48k17k57J66k00J86J59p4R1O3o3k09J78k0k96J43J63r4O7q8J71
6216A15j43J2l0J27l14K8J28J72l8J05L5k78n4K16l5l01m7K40K71j36j9k14N6
$$ plain form
6239 -104 16 257 -168 84 214 -184 56 292 -135 -157 315 -39 -22 -58 -120 -66 -37 -34 -12 197 298 86 -111
6262 -111 -286 -73 89 247 125 187 -143 307 -21 -128 -58 244 23 131 -78 247 69 20 30 -109 -68 -17
6284 -17 172 -143 221 172 -160 39 172 -203 -242 -116 34 -98 166 109 68 -343 -150 113 123 46 55 -206 121
6307 121 177 121 -95 73 -137 -240 -269 -31 151 -48 32 -166 -8 -141 -85 -68 -308 -27 222 342 237 27
6329 27 221 240 7 -88 39 214 -47 -36 -51 52 26 -140 253 -106 -179 15 -261 125 264 -62 32 86 58
6352 58 -164 -528 -111 -12 130 135 81 -10 94 59 47 -78 22 23 -150 341 20 -206 -79 -110 -7 10 -45 98
6376 98 -109 -126 -124 105 43 -176 -34 -94 173 -111 247 12 79 197 -44 -142 68 -36 4 160 -7 -63 194
6399 194 -124 311 -155 -179 -82 94 -322 -273 106 235 17 -77 -6 -21 -137 145 156 -235 394 -98 -56 -267 -67
$$ packed form
6239a04J20K41m25K52J30l98K40K36m27k2M72l54J7l6o2N4K9LK2K09J01k12j97
6262a11j75K13J62J58j22O2l30M50l28j07P0L02k21J08k09L25j78m9J0j39M1N1
6284a7J89l15L64m9l32J99J33l75l9J26J50j32K64n7m1m11J93K63J0p7Rk61L27
6307A21N6n6k16J68k10j03k9K38J82j99Q0j98J58j33N6J7k40K81K49J20j05k10
6329B7J94J9k33r5J27J75k61J1j5J03k6j66L93l59p3J94k76L86J39l26R4N4k8
6352E8k22l64M17R9J42Nn4r1J04l5j2j25J00Jj73M91l21k26J27l1J03J7n5J43
6376I8k07j7KK29o2k19J42o0K67k84L58k35O7J18k41r8K10j04M0J56j67n6K57
6399A94l18M35m66k4R7J76m16M9L79J29k18r4P1j5j16K82J1l91O29m92M2k11K00
$$ plain form
6422 -67 -72 -59 123 96 64 336 158 81 134 -1 290 -303 -67 -2 123 81 110 287 -128 -189 -126 -107 -231 -84 -87
6447 -87 91 -79 109 380 191 72 -114 -34 86 -51 -320 2 -68 185 -85 -15 18 -4 14 61 43 231 -22
6470 -22 124 -24 -94 -184 -246 131 327 55 132 -329 -16 78 -358 -24 -123 12 52 319 235 27 33 -168 188 -149
6494 -149 33 -56 -110 83 242 87 36 -121 -97 -178 -62 166 7 60 154 -142 9 216 -1 -81 185 -153 -71
6517 -71 -33 5 46 -28 15 -82 156 -60 49 -350 139 -44 168 109 -14 114 -106 21 -70 -20 -7 -109 159 -21
6541 -21 294 18 -90 -256 -364 -199 102 -210 -12 -104 -33 99 58 -133 54 15 -347 183 282 226 -54 180
6563 180 -74 -48 -18 -28 -303 -126 252 -108 -66 267 179 -77 -225 -170 19 90 -86 89 96 -120 -41 35 43 -20 83
6588 83 -147 203 -58 105 258 302 -324 51 -77 -125 12 117 53 -160 236 -150 -50 -116 -76 151 169 72 -109
$$ packed form
6422f7nJ3J82k7l2K72j78p7N3j35K91n93K36O5J25m2K9J77m15o1O3J9j24J47l
6447h7J78j70J88K71j89j19j86Q0J20j37k69L22p0K53k70P0L3k2J8M7j8J88k53
6470b2J46j48p0r0o2L77J96k72P7m61L13R4m36L34r9J35M0K67q4k08Ok01L56l37
6494a49J82q9n4J93J59j55n1j57K4q1J16K28j59N3R4k96J51K07k17q0K66l38Q2
6517g1L8L8M1p4M3r7K38k16J09l99M89j83K12n9j23J28k20J27r1N0J3j02K68j80
6541b1L15k76j08j66j08J65L01l12J98r2P1J32m1j91J87l9l62N30R9n6k80K34
6563A80k54K6L0j0k75J77L78l60M2L33q8k56j48N5J89P1j76J75Pk16P9P6Qo3J03
6588H3k30L50k61J63J53M4o26L75j28m8J37J05o4k13L96l86J00o6M0K27J8r7j81
$$ plain form
6611 -109 20 -167 -199 112 -33 -9 117 -86 -2 -207 -199 119 46 -211 121 -40 -199 181 100 349 123 -30
6633 -30 -22 -133 -86 -65 -26 20 165 96 -93 256 168 -69 -140 -208 68 -287 63 397 62 -65 -69 47 -164 19
6657 19 159 42 -105 -87 -10 140 271 121 103 95 -349 -126 98 -91 3 150 -25 -94 -135 -48 -4 -197 -149 160
6681 160 272 106 7 193 -16 -26 10 46 -198 126 -39 -123 -118 -238 156 39 -179 -172 226 7 237 99 142
6704 142 196 -67 -183 -254 -17 3 -38 92 34 -18 -58 -229 -279 -50 64 20 131 104 153 46 -36 -160 33 -459
6728 -459 96 267 110 162 192 289 -130 548 160 26 -71 -95 -110 -237 -20 44 113 -192 -137 148 -115 -125 9
6751 9 -164 81 145 92 -68 -63 173 -6 249 273 23 107 1 87 -12 -81 16 9 10 70 23 50 -173 201 -205 -183 74
6778 74 106 -187 58 253 -67 -60 -1 -64 -49 -185 -15 -115 -340 -49 -69 -238 -123 -143 -76 115 -106 -58 189 62
$$ packed form
6611a09J29j87l2L11j45K4J26k03Q4k05QL18p3k57L32j61j59L80q1K49k26j53
6633c0Qj11M7K1L9M6J45o9j89L49q8k37p1o8K76l55L50L34l35j27mJ16k11J83
6657A9J40j17j47J8P7J50J31j50j8qm44K23K24j89R4J47j75o9m1Q7M4j93M8L09
6681A60J12j66r9J86k09j0L6L6k44L24j65q4Nj20L94j17k18PL98k19K30j38M3
6704A42N4k63j16p1K37K0m1J30n8n2m0j71n0K29J14m4J11k7M9j07q2j24J93m92
6728d59N55J71j57N2L0R7m19O78l88j34r7k4j5j27K17O4O9l05N5K85k63j0J34
6751Ij73K45O4n3j60NK36j79K55K4k50Q4j06Q6r9o9R7pJO0m7K7k23L74m06K2K57
6778G4L2k93K45J95l20PN9o3J5j36J70j00k25K91k0j69J15k0O7J91k21M8K47j27
$$ plain form
6802 62 219 -136 19 -362 120 112 -18 284 260 29 149 -106 42 167 -53 149 -81 19 -40 -7 -159 -2
6824 -2 35 31 -121 41 -200 294 41 19 186 128 125 -195 -65 -102 -88 -153 85 -39 -23 80 131 65 92 -85 -194
6849 -194 -86 -1 -90 163 183 -45 232 190 -114 -270 -42 -161 82 -1 16 -289 26 187 -33 94 -32 -25 332
6872 332 57 263 -23 35 83 -64 -215 -21 170 -65 185 55 150 87 -88 35 -75 -67 -185 124 131 85 -79
6895 -79 -213 -85 -9 20 127 -236 -209 -25 111 -23 129 -100 142 53 131 84 -61 -54 161 53 34 113 45 -3
6919 -3 -83 15 98 54 -110 118 5 24 6 2 -135 85 42 46 121 110 -20 -128 106 93 108 -6 140 21 176 231
6945 231 322 205 230 138 -63 140 36 -1 -89 -45 129 223 -158 123 -59 -182 -54 -73 153 137 -231 202 49
6968 49 -139 30 -93 55 -347 -301 159 20 -90 216 191 -151 175 -106 -74 52 181 159 -22 -10 -35 137
$$ packed form
6802F2J57l55J55l81M82qj30L02k4k31J20k55J48J25k20K02k30J00n9L3j52J57
6824bL7mj52J62k41M94k53k2J67n8ll20J30l7J4o5K38j24J6J03N1o6K7j77j09
6849a94J08Q5q9K53K0k28K77m2l04j56K28j19K43q3J7l05L15J61k20J27j26PL57
6872C32k75K06k86N8M8j47j51J94J91k35K50j30R5o3j75J23j10Qj18L09Pm6j64
6895g9j34J28P6K9J07l63K7J84J36j34J52k29K42q9P8m7j45PK15j08j9P9o8m8
6919cq0R8Q3m4j64K28j13J9j8mj37K20m3MP5j1j30j08K34j3J5j14J46j19J55N5
6945B31R1j17K5r2k01K03j04l7q8M4J74R4l81K81j82j23J28j9K26j6l68M33j53
6968D9j88J69j23J48m02M6M60j39j10L06k5l42L26k81L2J26J29k2j81J2k5J72
$$ plain form
6990 137 82 156 28 83 123 122 136 124 171 -80 -330 -91 59 -130 338 -169 76 64 -52 68 10 -82 197 -173
7014 -173 64 101 -4 -20 -136 40 -17 16 -151 47 52 80 20 -106 -105 -32 17 -57 228 -47 -21 167 14 104 -232
7039 -232 -23 -132 117 -75 25 -114 81 183 189 71 37 -26 -238 -63 -36 -145 -280 67 -178 96 -101 54
7061 54 119 -52 80 -247 79 294 125 39 251 -202 70 -91 -14 -85 -125 -77 -36 -6 98 -62 -55 109 152 -162
7085 -162 136 186 -57 161 -55 -259 173 105 -28 -53 113 -59 -1 248 196 97 44 -55 -110 34 248 -52 -71
7108 -71 -79 -7 138 -138 -180 -359 -91 42 92 151 -44 -263 -26 124 394 -79 113 289 -175 217 146 123 -48
7131 -48 -246 154 85 -142 104 -30 -109 24 -135 -5 211 142 -271 -44 130 19 -284 209 -185 216 -98
7152 -98 14 204 110 268 70 360 -193 -83 42 -166 238 -118 71 -11 174 -203 -46 -131 258 96 -52
$$ packed form
6990A37n5P4j28N5M0jJ4j2M7k51k50K39J50j89M68n07K45j2j16J20n8r2K79l70
7014a73K37L7j05j6j16J76n7L3j67J98NK8o0j26JP3M9p4K85k75K6J88j53R0l36
7039b32K09j09K49j92J00j39J95J02Oj18l4o3k12J75K7j09j35L47k45K74j97J55
7061E4O5j71J32l27L26K15j69q6K12m53K72j61P7p1m0M8M1L0J04j60PJ64M3l14
7085a62K98N0k43K18k16k04M32o8j33k5J66j72N8K49n2r9n3r9n5J44K14l00j9
7108g1qP2J45k76m2j79K68J33N0N9j95k19K37J50K70m73J92J76m64L92p1k3j71
7131d8j98M00o9k27K46j34p9J33j59J30K16o9m13K27J74j11l03M93l94M01l14
7152i8J12J90r4J58j98K90n53J10J25k08M04l56J89q2J85l77J57q5L89j62j48
$$ plain form
7173 -52 69 -318 -227 -18 1 -91 29 -39 -39 266 128 97 -169 -58 -211 7 -89 -158 78 -85 124 -181 34
7196 34 60 76 186 -34 -4 -177 352 -172 124 71 141 187 99 -53 61 138 -244 53 -29 222 -30 141 156 18
7220 18 -45 -204 218 -18 188 -39 -63 159 217 103 -52 165 -192 -271 -256 -204 -46 238 177 232 -96 -33 -132 -72
7244 -72 -5 -28 372 -151 -56 19 176 -153 -234 114 -145 -116 -287 -42 -57 25 111 -218 30 -73 40 -59 -35 -53
7268 -53 84 160 87 137 -163 -50 0 130 144 82 252 157 41 -27 79 -151 79 206 -150 117 264 94 72
7291 72 -210 -77 -178 83 144 -74 -64 -108 -41 287 137 90 82 -13 -193 105 -213 -84 -61 -156 65 183 -283 146
7315 146 -204 160 8 180 283 242 170 108 -32 -15 132 203 177 73 9 139 416 103 91 238 -97 -112 37
7338 37 111 -38 -69 133 20 -129 14 -214 -280 64 108 111 -60 -54 8 135 -31 -32 161 -199 -233 11 76 138 -66
$$ packed form
7173e2J21l87R1K09J9r2J20o8%L05j38l1k66J11j53K18r6o9K36j63K09l05K15
7196C4K6J6J10k20L0j73N29n24K96n3P0M6q8j52J14P7l82K97q2K51k52J71J5j38
7220A8o3j59M22k36K06k27k4K22N8j14j55K17l57p9J5N2J58K84o1N5l28O3r9O0
7244g2O7k3M00n23R5P5J57l29q1L48k59K9j71K45j5Q2Q6l29K48j03J13r9K4j8
7268e3J37P6p3N0l00J13N0J30J4o2J70r5j16o8J06k30K30J27l56K67J47j70k2
7291G2k82J33j01K61O1k18J0m4O7L28j50m7qr5j80K98l18J29K3r5K21J18m66M29
7315A46l50L64j52J72J03m1p2o2j40J7J47P1k6j04o4J30K77l13j2J47l35j5J49
7338C7P4j49l1K02j13j49J43k28o6L44M4Lj71OO2J27j66jJ93l60l4K44O5O2k04
$$ plain form
7363 -66 -80 -320 -50 38 209 152 69 26 -67 -24 422 -283 -68 52 84 -125 146 76 159 -172 -159 169 -205 -33
7387 -33 -145 -32 -311 232 -62 -21 262 -67 -169 273 -122 49 227 -21 -6 185 -10 -184 140 20 182
7408 182 143 -1 31 -5 -296 -172 559 -52 -67 114 197 139 -41 253 284 251 274 105 23 233 81 -163 50
7431 50 -57 67 10 67 -135 -185 -82 104 88 -222 197 55 73 -209 103 156 13 83 266 108 -31 -31 -67 136
7455 136 -52 -42 -43 -7 -107 -171 94 289 -219 108 49 27 -28 -41 74 90 372 -238 -13 -22 -7 -113 -214 -147 -36
7480 -36 -39 -96 249 139 6 71 101 -14 -86 -92 74 184 -202 -25 13 171 267 59 90 179 154 124 22 267 -23
7505 -23 -38 67 261 292 -126 9 -29 -85 57 -189 -175 2 -88 167 22 -72 183 -104 -164 17 -64 116 2
7528 2 -61 -262 92 -13 -301 -256 -118 159 121 173 -104 105 -226 44 -194 -110 -39 56 -65 -30 16 110 83 10 -23
$$ packed form
7363f6j4k40K70Q8J71n7q3m3r3M3M46p05K15J20L2k09K71p0Q3l31J3L28l74J72
7387c3j12J13k79N43k94M1K83l29j02M42l95J71J78k48J5J91j95j74L24j20J62
7408A82l9j44L2l6k91J24P31o11j5J81Q3n8j80K94L1l3K3j69q2K10j52k44K13
7431E0j07J24n7N7k02n0J03J86j6l10M19j42J8k82L12N3j43P0J83j58j39%l6K03
7455A36j88J0jL6j00o4K65J95n08L27n9k2n5j3J15J6K82o10K25rJ5j06j01O7J11
7480c6ln7L45j10j33O5L0j15p2oJ66J10l86J77L8J58R6k08L1Q9k5l0j02K45k90
7505b3j5J05J94L1m18J35l8n6J42k46J4J77r0K55j45r4K55k87o0J81q1J80j14
7528Bo3k01L54j05k88M5J38K77l8N2k77K09l31K70k38Q4P1R5j21L5M6R4k7p3l3
$$ plain form
7553 -23 44 7 73 40 83 -126 84 51 -101 141 116 -58 181 73 -96 77 261 -53 11 -59 329 -244 231
7576 231 75 141 -130 -287 107 -70 249 -89 98 150 137 -4 86 49 -33 121 69 254 62 -320 25 152
7598 152 13 70 8 -110 -137 207 -64 2 -121 159 149 144 163 -117 54 91 31 -236 34 210 -120 51 -119
7621 -119 33 181 -13 -157 35 114 15 -118 337 90 -122 -88 -63 6 49 13 -155 151 33 -15 157 93 1
7644 1 -4 43 -20 145 -387 -164 78 -116 -194 96 13 250 18 -94 -37 123 -86 -241 6 -104 -301 175 265
7667 265 37 159 19 -87 -15 -143 -202 197 118 -22 3 -234 -30 26 113 64 38 -128 -86 200 174 305 -92
7690 -92 169 -99 -319 -39 271 241 220 122 -173 -67 1 -51 197 248 -13 34 213 -196 37 14 -154 -195 94
7713 94 61 128 36 139 -56 -52 -7 169 124 26 -54 57 260 -67 135 -188 82 43 133 140 -276 -149 -216 -274 -73
$$ packed form
7553b3O7l7O6l3M3k09K10l3j52K42k5j74K39j08j69J73J84l14O4p0L88n73M75
7576B31j56O6k71j57L94j77L19l38J87N2j3j41R0l7q2J54n2J85j92l82L45J27
7598A52j39N7o2j18k7L44k71O6j23K80j0nJ9k80J71L7o0k67K70J76l30J71j70
7621a19J52J48j94j44J92P9r9j33M55k47k12L4K5O9M3l6j68L06j18m8J72o4r2
7644AnM7o3J65n32K23K42j94p8K90q3K37k32j12N7J60k09j55K47j10j97M76R0
7667B65k28J22j40j06P2j28n9L99p9j40K5k37K04N6Q7m9k6j66M2K86k6J31l97
7690i2K61k68k20K80L10l0k1r8k95J06O8n2K48N1k61M7J79m09K33k3j68m1K89
7713I4l3O7r2J03j95MM5J76m5r8q0J11K03l27K02l23K70l9R0Pm16J27o7n8K01
$$ plain form
7738 -73 -55 -57 -150 -73 -13 222 -81 -139 74 66 113 270 15 -188 116 109 84 -167 -170 -175 -129 -15 -45 -136 -4 227 28
7765 28 204 164 -97 -24 1 55 -36 187 26 102 109 10 140 116 -66 -149 -198 -142 83 -2 -166 194 11 -3 110
7790 110 115 -202 -63 -38 -202 197 -70 13 -64 149 133 231 -10 -195 -60 12 105 -202 295 -75 -159 -21 -104 63
7814 63 37 192 258 -205 33 121 -6 184 -19 -145 96 103 -61 352 -167 336 68 202 26 -88 -59 -103 -45
7837 -45 -82 26 -365 -16 -117 137 -82 -138 -118 164 28 11 -30 -141 -174 43 -81 133 -95 384 18 -12 320
7860 320 -216 -1 128 -167 51 -211 296 92 -85 50 169 100 86 75 -5 24 19 292 -213 -24 78 -66
7882 -66 -91 -193 114 243 -121 -216 -131 158 -375 88 225 43 294 -195 -65 12 -154 -32 220 -170 197 24
7904 24 -325 220 -61 -84 7 198 -170 -228 101 -6 -96 -4 39 18 160 152 -46 87 -216 -9 89 -67 102 -111
$$ packed form
7738g3J8kr3P7O0K35l03n8K13qM7J57k55k03L04pk5k51lnM6J14l0r1J32K31j99
7765B8J76m0k61P3K5N4r1K23j61P6Pr9J30k4j82q3m9N6K25q5j64L60j83j4J13
7790A10Nl17J39K5j64L99k67Q3p7K13j6R8k41j85J35P2R3l07M97l70q4J38q3J67
7814F3k6J55O6m63K38Q8j27J90k03j26K41Pj64M13n19N03k68J34j76j14K9m4N8
7837d5l7J08l91L49j01K54k19n6K0K82j36j7m1j11l3K17j24K14k28M79l66l0L32
7860C20n36K15J29k95K18k62N07k04j77J35J19o9j4j1q0K9nK73n05J89J02j44
7882f6k5j02L07J29l64r5Q5K89n33M63J37j82K51m89J30P7j66J22K52l90L67j73
7904B4l49N45k81k3R1J91l68n8L29j07r0R2M3k1J42qj98J33l03K07R8j56J69k13
$$ plain form
7928 -111 227 -137 66 138 242 92 255 28 234 -49 168 9 -47 0 -234 -164 -206 215 126 -221 -89 154
7950 154 11 152 -29 -57 -129 -21 -170 -79 129 78 -19 209 142 -226 13 -123 -288 -96 -17 152 244 4 -34
7973 -34 -118 113 19 16 -111 -115 -3 154 160 83 108 34 4 10 -95 326 -6 -413 -2 -68 -75 -20 -33 178 -266 124 213
8000 213 80 116 217 20 -280 220 -82 11 -39 -147 73 31 -70 -79 42 -125 -101 4 -256 167 140 -69 120
8023 120 117 80 254 108 -95 -2 19 165 135 313 5 39 -136 -53 76 134 -285 -90 71 -168 -208 308 -142
8046 -142 -146 -32 -71 121 130 92 -43 271 -11 31 -116 -3 41 166 -199 10 -243 -50 -150 54 13 -20 -33 50
8070 50 -44 309 -157 -70 42 -60 174 -138 -143 4 110 -85 -113 -81 -115 -239 95 44 75 35 57 -95 -92 277 -203
8095 -203 -409 -138 -36 -161 51 53 114 107 -229 20 39 111 91 93 -84 -68 -146 -8 -33 -52 -28 -371 8 -165 24
$$ packed form
7928a11L38l64K03P2J04j50J63k27K06k83K17j59n6M7k34P0m2M21q9l47J32K43
7950A54j43J41j81k8p2J08j49R1K08n1r7K28o7l68K39j36j65J92P9J69R2k40l8
7973c4q4K31r4lj27mJ12J57Op7K5p4l0Oj05M21l32m07M11o6pN5j3K11m44L90Q9
8000B13j33L6J01j97l00N00l02R3n0j08K20m2j01rJ21j67K4J05k60M23k7k09J89
8023A20ll7J74j46k03R3K1J46l0J78l08L4j75Q3J29N8m19J95J61k39m0N16m50
8046a42mJ14l9J92Rl8j35L14k82M2j47J13M4J25l65K09k53J93j00K04m1l3j3Q3
8070E0r4L53m66Q7J12j02K34l12nJ47J06j95k8L2l4j24L34n1L1m0K2j52LL69m80
8095b03k06K71J02j25K12KO1pl36K49J9P2k0Kj77J6p8J38k5j9K4l43L79j73J89
$$ plain form
8120 24 115 -39 51 -13 106 -16 -228 198 -134 236 47 209 138 -19 -167 182 -58 129 185 -120 22 69
8142 69 180 -101 135 -43 -42 -266 -64 11 -60 41 191 245 -86 -195 97 187 -270 134 8 288 -130 -164 -8
8165 -8 -247 -20 -159 320 -11 13 68 -136 21 -34 -57 -102 -81 82 15 54 95 125 151 -28 -86 47 -129 89 -472
8190 -472 -96
$$ packed form
8120B4R1j54R0o4J19j22k12M26l32L70j89J62p1j57j48L49k40J87N6l05J42M7
8142F9J11k81K36j78Jk24K02P5p1J01J50N4l31j09K92R0m57M04j26K80m18l4J56
8165hk39K27j39M79l31K4N5k04J57n5k3m5K1J63o7L9M1L0K6j79n8J33j76K18n61
8190d72L76
8191i6
$$ Imaginary data points
##PAGE= N=2
##DATA TABLE= (X++(I..I)), XYDATA
$$ plain form
0 0 0 0 0 0 0 0 0 0 0 0 0 0 0 -2 8 -8 8 -8 9 -16 16 -24 24 -29 32 -40 48 -51 59 -70 80 -90 105 -115 131 -147
36 -147 166 -186 208 -233 258 -286 318 -351 389 -430 476 -524 577 -636 700 -772 851 -939
54 -939 1038 -1151 1277 -1421 1592 -1792 2032 -2326 2698 -3186 3856 -4834 6411 -9384 17023
69 17023 -85465 -132831 -9553 33630 43588 -47 -16415 -16965 2953 -1995 -10803 -12074 21712
82 21712 65047 100228 100443 78050 38222 -2360 -42711 -62477 -54595 -20640 9947 14364 -10312
95 -10312 -34588 -38109 -23498 -22071 -45775 -75216 -68225 -10166 68846 113662 97934 39299 -13181
108 -13181 -30946 -16420 3808 14687 18580 26173 36028 37012 18561 -16326 -54353 -78988 -77930
121 -77930 -50518 -5229 38612 57691 41568 2472 -31351 -37620 -17574 6115 13988 8196 7371
$$ packed form
0@%%%%%%%%%%%%%kJ0j6J6j6J7k5L2m0M8n3O1p2Q8r9J10j29J50j70J95k20K46k78
36a47L13l52L94m41M91n44O04o69P40q19R06j000J101j213J336j472J623j790
54i39J977k189K428k698L013l384L824m358N024n884P042q690J1245j5795K6407
69A7023j02488m7366J23278M3183R958m3635j6368n50J9918m948q808j271L3786
82B1712M3335L5181K15k2393l9828m0582m0351j9766P882L3955L0587M417k4676
95a0312k4276l521J4611J427k3704k9441O991N8059P9012M4816j5728n8635n2480
108a3181j7765J4526K0228J0879L893P593R855R84j8451l4887l8027k4635J058
121g7930K7412M5289M3841J9079j6123l9096l3823o269K0046K3689P873n792q25
$$ plain form
134 7371 24846 49306 54218 25072 -25636 -65622 -68748 -36091 7974 36532 39400 24473 7256
147 7256 -3184 -10070 -18061 -27407 -30546 -17628 12447 46891 64463 50316 7722 -42186 -70488
160 -70488 -62676 -27122 11502 31083 27216 12451 2434 1261 442 -9109 -24663 -30730 -14310
173 -14310 21595 56788 68598 47758 7656 -27605 -41316 -32374 -15646 -5375 -3800 -3136 3172
186 3172 12566 13460 -2276 -30979 -55683 -56662 -27430 18597 56834 66999 47940 15261 -9543
199 -9543 -16015 -8768 -399 2836 3929 10923 23677 32151 22311 -9111 -47299 -69887 -62057 -29348
213 -29348 8258 28820 26491 10730 -2926 -5780 -2228 -1420 -5906 -8988 -546 21645 47671 58629
227 58629 43952 8941 -28570 -47733 -41666 -18776 3549 13350 9909 1074 -4053 -6406 -12138
$$ packed form
134G371J7475K4460M912k9146n0708l9986l126L2657M4065K8558K868j4927j7217
147G256j0440o886p991r346l139J2918L0075L4444J7572j4147m2594m9908k8302
160g0488P812L5554L8624J9581l867j4765j0017j173q19r551j5554o067J6420
173a4310L5905L5193J1810k0840m0102l5261j3711Q942J6728J0271J575O64O308
186C172R394Q94j5736k8703k4704r79K9232M6027L8237J0165j9059l2679k4804
199i543o472P247Q369L235J093O994J2754Q474r840l1422l8188k2588P830L2709
213b9348L7606K0562k329j5761j3656k854L552Q08m486l082Q442K2191K6026J0958
227E8629j4677l5011l7511j9163O067K2890K2325R801l441q835n127k353n732
$$ plain form
240 -12138 -24190 -36544 -36662 -16061 19128 50673 58443 38387 4429 -21831 -26437 -12442 4771
253 4771 12737 12113 10199 12678 16461 11481 -7200 -32808 -49331 -45305 -20207 11570 32577 33859
267 33859 17545 -3675 -17267 -17923 -9797 -1652 2453 5569 13687 27358 36483 29063 3171 -29150
281 -29150 -47220 -38891 -10993 17372 28707 20153 3542 -7408 -10560 -10301 -14053 -19346 -18315 -5485
295 -5485 16464 36184 40294 24946 -1710 -25674 -33527 -23372 -2620 14723 20642 14729 6538
308 6538 1749 -28 -5593 -17263 -28811 -29610 -12110 15782 37279 38482 18748 -8623 -25288
321 -25288 -24627 -11732 1777 8136 8569 9811 14214 17851 11576 -4654 -24837 -36332 -29601 -7298
335 -7298 18045 31469 26647 9322 -8397 -16824 -15101 -9508 -5108 -2470 2147 11877 22897 26808
$$ packed form
240a2138j2052j2354j18K0601L5189L1545P770k0056l3958k6260m606J3995J7213
253D771P966o24j914K479L783m980j8681k5608j6523M026K5098L1777K1007J282
267C3859j6314k1220j3592o56Q126Q145M105L116Q118J3671R125p420k5892l2321
281b9150j8070Q329K7898K8365J1335q554j6611j0950l152K59l752n293J031J2830
295e485K1949J9720M110j5348k6656k3964p853J0155K0752J7343N919n913q191
308F538m789j777n565j1670j1548p99J7500K7892K1497J203j9734k7371j6665
321b5288O61J2895J3509O359M33J242M403L637o275j6230k0183j1495O731K2303
335g298K5343J3424m822j7325j7719q427J723N593M400K638M617R730J1020L911
$$ plain form
349 26808 16731 -4653 -26577 -35411 -25453 -2339 18322 25556 17665 2958 -6468 -8558 -7673 -9682
363 -9682 -14899 -15142 -4229 14614 30912 31402 14239 -9486 -26637 -27245 -14549 1929 12804 14554
377 14554 11277 7345 4054 278 -7001 -16389 -22597 -18977 -3952 16537 30953 28563 10909 -10713
391 -10713 -23181 -20267 -7890 3223 6664 5838 6481 11489 14598 8715 -7211 -24250 -30384 -20242
405 -20242 650 19722 26423 19529 4795 -7860 -13172 -11110 -6590 -3512 -726 3748 11688 19646
419 19646 20252 9967 -8849 -25925 -30220 -17871 2338 17543 19073 9949 -872 -6398 -6273 -5628
433 -5628 -8650 -12112 -9613 1819 17519 27619 24705 9306 -9268 -20845 -19743 -9051 3641
446 3641 10824 11319 6911 3130 515 -2858 -9464 -18112 -22710 -17250 -868 17733 27588 22044 4785
$$ packed form
349B6808j0077k1384k1924q834R958K3114K0661P234p891j4707r426k090Q85k009
363i682n217k43J0913J8843J6298M90j7163k3725j7151o08J2696J6478J0875J750
377A4554l277l932l291l776p279r388o208L620J5025K0489J4416k390j7654k1622
391a0713j2468K914J2377J1113L441q26O43N008L109n883j5926j7039o134J0142
405b0242K0892J9072O701o894j4734j2655n312K062M520L078K786M474P940P958
419A9646O06j0285j8816j7076m295J2349K0209J5205J530r124j0821n526J25O45
433e628l022l462K499J1432J5700J0100k914j5399j8574j1577J102J0692J2692
446C641P183M95m408l781k615l373o606q648m598N460J6382J8601R855n544j7259
$$ plain form
461 4785 -11742 -18031 -12015 -393 7260 9248 8418 9633 12305 11987 3312 -10400 -22038 -24192 -14706
476 -14706 1375 13757 16695 9468 -2487 -11022 -12869 -9394 -4775 -2168 -255 4560 13087 21180
490 21180 21362 10366 -7661 -21251 -21158 -8818 7555 16711 15138 6378 -2620 -7398 -9524 -11140
504 -11140 -13274 -13456 -7759 2890 14726 20726 16526 2524 -11496 -18276 -13349 -581 10857 14551
518 14551 10961 5232 2792 3509 1307 -6012 -15581 -18944 -11976 2619 15140 17940 10847 -1259
532 -1259 -11186 -14541 -11620 -5255 1610 6564 9367 10468 10550 8846 2759 -8001 -18427 -20116 -9598
547 -9598 7990 20903 20021 6866 -7261 -13455 -9721 -4310 -2082 -3601 -1911 4436 12983 16166
561 16166 9923 -1905 -12109 -15757 -12373 -4954 3917 10734 11553 7069 -117 -5628 -6985 -5877 -6260
$$ packed form
461D785j6527o289O016J1622P653J988q30J215K672l18q675j3712j1638k154R486
476a4706J6081J2382K938p227j1955q535j847L475M619K607J913M815Q527Q093
490B1180J82j0996j8027j3590R3J2340J6373R156j573q760q998m778k126j616
504a1140k134j82N697J0649J1836O000m200j4002j4020o780M927J2768J1438L694
518A4551l590n729k440P17k202p319r569l363O968J4595J2521K800p093j2106
532a259r927l355K921O365O865M954K803J101Q2j704o087j0760j0426j689J0518
547i598J7588J2913q82j3155j4127o194L734N411K228j519J690O347Q547L183
561A6166o243j1828j0204l648L384P419Q871O817Q19m484p186n511j357J108l83
$$ plain form
576 -6260 -7610 -6654 2103 15265 23530 17581 460 -16113 -20383 -11194 1660 9299 8647 4708 3369
591 3369 3443 1408 -5454 -13320 -16322 -11744 -1656 8170 13767 13966 8490 -449 -8642 -10826 -6271 1900
607 1900 7485 7615 4423 3979 6876 8401 2487 -9657 -19820 -19525 -7558 7328 15039 11572 2149
622 2149 -5587 -8094 -6775 -5304 -4899 -2730 3020 10076 15445 15085 8334 -1788 -11026 -15060 -11301
637 -11301 -1318 8652 12364 8356 46 -6792 -7920 -6131 -5031 -6917 -8079 -4405 5016 14126 16290
652 16290 9167 -2273 -10795 -11267 -4703 2854 6791 7144 5508 4498 3806 928 -4481 -10784 -14275
667 -14275 -12093 -3826 6993 13977 13252 5258 -5327 -11788 -11015 -4326 2744 6401 6526 5768 6672 7428
683 7428 5084 -2220 -10838 -14670 -10551 -502 8714 11576 7043 -469 -5897 -7186 -5409 -3369 -3074
$$ packed form
576f260j350R56Q757J3162Q265n949j7121j6573m270R189J2854P639o52l939j339
591C369P4k035o862p866l002M578J0088R826N597J99n476q939q193k184M555Q171
607A900N585J30l192m44K897J525n914j2144j0163K95J1967J4886P711l467r423
622B149p736k507J319J471M05K169N750P056N369l60o751j0122r238m034L759
637a1301R983R970L712m008q310o838j128J789J100j886j162L674R421R110K164
652A6290p123j1440q522m72O564P557L937L53j636j010o92k878n409o303l491
667a4275K182Q267J0819O984p25p994j0585o461P73O689P070L657J25p58R04P56
683G428k344p304q618l832M119J0049R216K862m533p512n428j289J777K040K95
$$ plain form
698 -3074 -1927 1300 6690 11286 12113 7061 -2411 -10839 -13704 -8564 488 8602 10557 6747 536
713 536 -4014 -5369 -5128 -5889 -7469 -6803 -874 7765 14006 12527 4477 -5518 -11267 -9557 -2486 4091
729 4091 6770 5733 4033 2651 1528 -180 -3920 -8571 -10812 -8216 -990 7094 11794 9580 2291
744 2291 -5478 -9623 -7700 -2764 2407 4199 4163 4500 6373 7128 4232 -3230 -10752 -13066 -7884 2003
760 2003 9499 10592 5744 -1325 -5775 -6138 -4604 -3385 -2827 -1395 1869 6573 9542 8407 2853 -4671
776 -4671 -10039 -10090 -5010 2723 8181 8541 4935 -188 -3057 -3733 -3128 -3983 -5612 -5351 -129 7216 11845
793 11845 9800 1599 -6936 -10907 -8015 -1506 3901 4966 4106 2805 2826 2224 -282 -3966 -8057 -8553
809 -8553 -4817 1669 7935 9914 7270 710 -5621 -8114 -6066 -1442 1693 3054 3034 3460 4849 4938
$$ packed form
698c074J147L227N390M596Q27n052r472q428k865N140R052Q114J955l810o211
713E36m550j355K41p61j580O66N929Q639O241j479q050r995n749J710P071O577
729D091K679j037j700j382j123j708l740m651k241K596P226Q084M700k214p289
744B291p769m145J923M936N171J792l6L37J873P55k896p462p522k314N182R887
760B003P496J093m848p069m450l63J534J219N58J432L264M704K969j135n554p524
776d671n368n1N080P733N458L60l606n123k869o76O05q55j629K61N222P345M629
793A1845k045q201q535l971K892O509N407J065q60j301K1o02k506l684m091m96
809h553L736O486O266J979k644o560o331k493K048M624L135J361k0M26J389Q9
$$ plain form
825 4938 1598 -4621 -9950 -10388 -4841 3661 9003 8932 4047 -2022 -4946 -4459 -3004 -2038 -1660 -585 2124
842 2124 5983 8438 6788 1011 -5359 -9408 -8154 -2946 3427 7026 6032 2696 -198 -2149 -2431 -2991
858 -2991 -4661 -5252 -3624 1526 7105 9340 7237 206 -6669 -8804 -6377 -416 4257 5745 4108
873 4108 2182 1571 1645 -287 -3691 -6836 -7441 -3366 3003 7638 7780 3448 -2375 -6018 -6239 -3844 -979
890 -979 1130 2099 2533 3712 4683 4203 1484 -3769 -7693 -7213 -2298 4043 8065 7462 3071 -2667 -5161
907 -5161 -4739 -3004 -2435 -2567 -1657 1388 5199 6515 4500 -699 -6105 -7455 -5038 82 4896 6627
923 6627 4971 2277 -271 -1505 -1414 -2332 -3675 -4094 -2557 1292 5403 6717 3942 -2016 -6987 -7893
939 -7893 -4646 270 3501 3813 3172 2237 2422 2245 195 -3024 -5565 -5115 -1172 3920 7388 6415 1901
$$ packed form
825D938l340o219n329m38N547Q502N342p1m885o069k924M87J455R66L78J075K709
842B124L859K455j650n777o370m049J254N208O373L599r94l336k894j951k82n60
858b991j670n91J628N150N579K235k103p031o875k135K427N961M673J488j637
873D108j926o11P4j932l404l145o05M075O369M635J42m332n823l643k21K395K865
890i79K109R69M34J179R71m80k719n253l924M80M915O341M022o03m391n738k494
907e161M22J735N69j32R10L045L811J316k015n199n406j350K417N120M814J731
923F627j656k694k548j234R1r18j343m19J537L849M111J314k775n958m971r06
939g893L247M916L231L12o41r35J85j77k050l219k541M50L943N092L468r73m514
$$ plain form
956 1901 -3041 -5710 -5588 -3511 -841 946 1171 1588 2571 3444 2737 63 -3877 -6268 -5140 -310 5184
973 5184 7224 5828 1345 -2475 -3620 -2381 -1653 -1915 -2270 -1069 1835 4616 5164 2511 -2115 -5853
989 -5853 -6356 -3686 443 4175 5410 4069 1506 -434 -1306 -1344 -1934 -2508 -2993 -1421 2380 5538 6267
1006 6267 2513 -2948 -6640 -5681 -2643 1315 2804 2528 1820 1768 1744 1245 -1031 -3526 -4768 -3583 -135
1023 -135 3877 5617 4683 1337 -2543 -4985 -4174 -1852 415 1510 752 853 2154 3456 2332 -487
1039 -487 -4296 -5745 -3623 605 4525 5053 3275 -120 -2262 -2723 -2509 -1962 -1675 -1330 342 2435 3670
1056 3670 3741 2318 -1314 -4601 -5155 -2538 1667 4905 4655 2189 -290 -1312 -815 -920 -2101 -3391
1072 -3391 -3114 -778 2992 4600 3708 258 -2854 -4473 -3512 -1514 979 2535 2829 2110 1422 1271 828
$$ packed form
956A901m942k669J22K077K670J787K25M17R83Q73p07k674l940k391J128M830N494
973E184K040j396m483l820j145J239P28k62l55J201K904K781N48k653m626l738
989e853n03K670M129L732J235j341k563j940q72l8n90n74m85J572L801L158P29
1006F267l754n461l692R59L038L958J489k76p08n2k4m99k276k495j242J185L448
1023a35M012J740r34l346l880k442Q11K322K267J095p58J01J301J302j124k819
1039d87l809j449K122M228L920N28j778l395k142m61K14N47K87L45J672K093J235
1056C670P1j423l632l287n54K617M205L238k50k466k479j022M97j05j181j290
1072c391K77K336L770J608q92l450l112j619R61J998K493J556K94p19o88j51m43
$$ plain form
1089 828 -477 -2321 -4069 -3598 -300 3535 5285 3223 -287 -3593 -4459 -2993 -800 138 301 719
1105 719 1551 3144 3206 1109 -1296 -3296 -3259 -1686 1757 3817 4466 2645 -269 -2433 -2906 -2067 -975
1122 -975 -879 -1300 -712 1118 2924 3287 1272 -2083 -4705 -3834 -913 2528 3773 3104 1871 465 -119
1139 -119 -382 -886 -2070 -2526 -1912 353 2640 3777 2619 -127 -3227 -4535 -3344 -844 1276 2469
1155 2469 1802 962 847 915 753 -349 -2190 -2760 -1523 1275 3590 3926 2249 -779 -2901 -2908 -1797 -559
1173 -559 111 247 496 1165 1777 1828 674 -1831 -3456 -3432 -1268 1498 3522 3475 1497 -415 -1803 -1834
1191 -1834 -1146 -285 -601 -673 213 1822 2870 2210 154 -2455 -3869 -3023 -560 1691 2590 2061 393
1208 393 -366 -539 -657 -917 -1471 -1812 -966 710 2577 3288 2490 -228 -2303 -2975 -2288 46 1554 1640
$$ packed form
1089H28j305j844j748M71L298L835J750k062l510l306q66J466K193R38J63M18
1105G19Q32J593O2k097k405k000L7J573L443K060O49j821k914k164m73Q39J092
1122i75R6m21N88J830J806L63k015l355k622Q71K921L441J245o69j233j406n84
1139a19k63n04j184m56O14K265K287J137j158k746l100j308J191K500K120J193
1155B469o67q40j15O8j62j102j841n70J237K798K315L36j677l028k122pJ111J238
1173e59O70J36K49O69O12N1j154k505j625K4K164K766K024m7j978j912j388l1
1191a834O88Q61l16p2Q86J609J048o60k056k609j414Q46K463K251Q99n29j668
1208C93p59j73j18k60n54l41Q46J676J867P11p98k718k075o72O87K334J508Q6
$$ plain form
1226 1640 1251 506 457 812 79 -1166 -2451 -3001 -1411 1243 2977 3110 1539 -1277 -2360 -2059 -979
1243 -979 33 178 585 598 1442 1896 1498 292 -1383 -2799 -2596 -753 1435 2755 2090 664 -1140
1260 -1140 -1777 -1369 -745 -585 -585 -550 487 1724 2659 2010 -30 -2347 -2999 -1795 580 1854 1842 1414 416
1279 416 -127 -369 -533 -989 -1922 -1364 -1026 703 2075 2395 1302 -418 -2100 -2511 -1259 312 1204 1204
1297 1204 1181 602 433 712 337 -977 -1876 -2092 -731 1282 2909 2186 568 -1175 -2190 -1699 -550
1314 -550 58 -193 -39 246 1350 1415 905 -150 -1457 -2354 -1956 -320 1442 2561 1911 550 -546 -1151
1332 -1151 -900 -704 -228 -796 -620 290 1497 1932 1086 -724 -2077 -2713 -1469 309 1490 1536 1085 254
1350 254 93 215 -18 -433 -794 -1131 -532 791 1914 1847 849 -687 -1690 -1800 -1044 142 373 628 328
$$ packed form
1226A640l89p45m9L55p33j245j285n50J590K654J734J33j571k816j083L01J080
1243i79J012J45M07J3Q44M54l98j206j675j416K03J843K188J320o65j426j804
1260a140o37M08O24J60%L5J037J237R35o49k040k317o52J204K375J274j2m28r98
1279D16n43k42j64m56r33N58L38J729J372L20j093j720j682m11J252J571Q92%
1297A204k3n79j69K79l75j314q99k16J361K013J627p23j618j743j015M91J149
1314e50O08k51J54K85J104O5n10j055j307q97L98J636J762J119o50j361j096o05
1332a151K51J96M76n68J76R10J207M35q46j810j353o36J244J778J181M6m51q31
1350B54j61J22k33m15l61l37N99J323J123o7r98j536j003j10P56J186K31K55l00
$$ plain form
1369 328 515 418 877 40 -1030 -1678 -1459 -114 1426 2383 2129 803 -1008 -1450 -1275 -402 41 63 109
1388 109 51 724 921 839 -508 -1662 -1958 -1330 39 1419 1862 1168 141 -601 -500 -402 -421 -11 -203 -350
1408 -350 367 1427 1497 985 -223 -1404 -1946 -1429 261 1103 1248 807 159 -156 139 -42 -608 -1268 -1197
1427 -1197 -257 1125 2018 1795 674 -610 -1708 -1421 -379 382 951 611 282 54 331 614 -105 -692
1445 -692 -1711 -1342 -470 858 1419 1151 355 -772 -1109 -720 -283 -202 135 -43 378 686 1347 603 149
1464 149 -1186 -2001 -1078 236 1140 1646 1009 235 -424 -682 -414 -597 -552 -636 -477 105 713 1229 623 -86
1484 -86 -1406 -1259 -747 513 1230 849 723 162 219 656 219 -403 -717 -720 -547 427 1221 978 418 -620
1504 -620 -884 -910 -594 -6 372 458 531 401 585 585 -55 -488 -864 -880 86 934 1406 1189 332 -653 -1008 -322
$$ packed form
1369C28J87r7M59q37j070o48K19J345J540R57k54j326j811m42J75Q73M43K2M6
1388A09n8O73J97q2j347j154k96O28J369J380M43o94j027p42J01R8j9M10j92j47
1408c50P17J060P0n12j208j181n42N17J690Q42J45m41o48l15K95j81n66o60P1
1427a197R40J382Q93k23j121j284j098K87J042P61N69l40l29k28K77K83p19n87
1445f92j019L69Q72J328N61k68p96j127l37L89M37Q1L37j78M21L08O61p44m54
1464A49j335q15R23J314R04N06o37p74o59k58K68j83M5q4J59N82O08N16o06p09
1484h6j320J47N12J260P17l81j26n61N7M37m37o22l14lJ73R74P94k43n60j038
1504f20k64k6L16N88L78Q6P3j30J84%o40m33l76j6R66Q48M72k17q57r85l55O86
$$ plain form
1526 -322 -166 -153 -623 -598 222 472 879 435 -413 -916 -1128 -742 137 702 952 682 403 -57 24 -113 -218
1547 -218 -289 -691 -221 250 780 1148 551 -556 -1010 -1201 -745 233 315 317 155 48 219 319 126 -472 -850
1568 -850 -579 -7 354 918 1117 727 -119 -650 -676 -515 162 384 58 220 171 664 474 -124 -869 -1000 -747
1589 -747 -246 644 737 486 222 -415 -383 -286 -58 34 -170 -284 228 603 1087 590 -42 -477 -952 -870 -150 434
1611 434 585 697 -152 -119 -16 90 -148 -638 -579 -297 264 644 876 735 112 -478 -529 -342 137 547 297
1632 297 138 316 217 247 107 -434 -1036 -1157 -469 -68 674 944 508 280 -617 -67 -166 -128 309 -27 -25 471
1654 471 673 637 -7 -159 -1061 -856 -79 299 537 260 260 -275 -296 -149 139 -231 -631 -405 -181 321 829
1675 829 650 140 -330 -931 -531 -238 369 538 303 397 67 125 108 -115 -411 -708 -345 112 449 768 548
$$ packed form
1526c22J56J3m70K5Q20K50M07m44q48n03k12L86Q79N65K50k70k79m60Q1j37j05
1547b18p1m02M70M71N30L68n97j107m54j91M56R78Q2Kj62j07J71J00j93n98l78
1568h50K71N72L61N64J99l90q46n31k6J61O77K22l26J62m9M93j90n98p45j31K53
1589g47N01Q90R3k51k64o37L2R7K28R2k04j14N12L75M84m97o32m35m75Q2P20N84
1611D34J51J12q49L3J03J06k38m90N9K82N61L80K32j41o23n90n1J87M79M10k50
1632B97j59J78r9L0j40n41o02j21O88M01P42K70m36k28q97N50r9L8M37l36KM96
1654D71K02l6o44j52r02K05P77L78K38k77%n35k1J47K88l70m00K26K24N02N08
1675H29j79n10m70o01M00K93O07J69k35R4l30N8j7k23k96k97L63M57L37L19k20
$$ plain form
1696 548 -120 -649 -743 -423 -279 -280 -103 -44 235 84 584 181 -250 -727 -850 -506 -208 817 659 446 39
1717 39 -436 -441 -155 -24 9 -152 -67 285 593 837 326 -255 -939 -718 -371 147 575 221 8 129 295 -222
1739 -222 -58 -110 -228 -412 -174 454 662 937 88 -176 -712 -719 -537 72 268 295 108 209 189 312 180 -438
1761 -438 -439 -408 -16 179 764 423 14 -320 -572 -353 -123 -176 349 -46 184 370 565 310 -371 -376 -450 -288
1783 -288 -288 220 799 645 46 -279 -227 -216 -270 -288 -304 -15 163 686 554 353 -347 -937 -750 -544 -293 438
1805 438 556 212 76 138 -101 -233 -308 -356 -392 -268 351 652 878 -11 -242 -281 -662 -315 115 155 127 133 447
1828 447 70 154 82 -315 -824 -410 74 269 723 245 104 -108 -356 -264 -494 -157 -103 -97 146 456 160 278
1850 278 -104 -650 -868 -596 -17 372 719 400 240 -63 -427 -394 -372 -290 -423 103 366 627 412 393 -308
$$ packed form
1696E48o68n29r4L20J44jJ77N9K79j51N00m03m31m77j23L44K98J025j58k13m07
1717C9m75nK86J31L3j61Q5L52L08K44n11n81o84K21L47N18M28l54k13J21J66n17
1739b22J64n2j18j84K38O28K08K75q49k64n36pJ82O09J96K7j87J01k0J23j32o18
1761d38jL1L92J95N85l41m09l34k52K19K30n3N25l95K30J86J95k55o81np4J62
1783b88%N08N79j54n99l25N2J1n4j8j6K89J78N23j32k01p00n90J87K06K51P31
1805D38J18l44j36O2k39j32p5m8l6J24O19L01K26q89k31l9l81L47M30M0k8OL14
1828D47l77Q4p2l97n09M14M84J95M54m78j41k12k48R2k30L37N4OK43L10k96J18
1850B78l82n46k18K72N79L89L47l19j60l03l64L3K2Q2j33N26K63K61k15j9p01
$$ plain form
1871 -308 -468 -719 -441 -44 25 422 162 278 94 308 -205 -396 -237 -156 -69 180 812 755 546 -275 -471
1892 -471 -552 -609 -12 -9 339 279 313 71 84 0 -504 -620 -650 60 202 568 632 334 -22 -221 -537 -92 -132 103
1916 103 88 212 509 400 261 -172 -523 -550 -366 -206 351 361 535 455 57 -374 -472 -496 -421 -323 -169 181 503
1939 503 440 311 16 -391 -587 -278 30 477 726 487 361 5 -44 -128 -255 -436 -262 58 253 355 579
1960 579 201 -166 -386 -718 -444 -109 261 267 201 557 96 33 -4 -356 -855 -503 -334 359 946 695 254 -188
1982 -188 -458 -766 -580 -254 -101 44 37 443 481 299 -292 -432 -918 -268 166 559 933 691 229 -178 -145
2003 -145 -425 -339 -400 -302 -65 376 510 588 302 -54 -253 -603 -525 -98 207 638 439 318 80 -152 -223 -659
2025 -659 -483 -336 -111 596 855 756 447 -640 -379 -721 -153 -112 288 410 264 470 58 118 -204 -380 -725
$$ packed form
1871c08j60k51K78L97O9L97k60J16j84K14n13j91J59Q1Q7K49O32n7k09q21j96
1892d71q1n7N97LL48o0L4k42J3q4n04j16l0P10J42L66O4k98l56j99l16M45m0K35
1916A03j5J24K97j09j39m33l51k7J84J60N57J0J74q0l98m31r8k4P5R8J54L50L22
1939E03o3j29k95m07j96L09L08M47K49k39j26l56m9q4j27j81J74L20J95J02K24
1960E79l78l67k20l32K74L35L70Oo6L56m61o3l7l52m99L52J69O93N87k51m41m42
1982a88k70l08J86L26J53J45pM06L8j82n91j40m86O50M34L93L74k42m62m07L3
2003a45k80Q6o1R8K37M41J34P8k86l56j99l50P8M27L05M31j99j21k38k32p1m36
2025f59J76J47K25P07K59r9l09j087K61l42N68M1M00J22j46K06m12O0l22j76l45
$$ plain form
2046 -725 -327 -377 561 579 812 177 -128 -381 -401 6 -233 174 124 179 503 627 -156 -171 -546 -695 -566 -170
2068 -170 355 690 508 111 -72 -257 -612 -379 49 -116 93 348 840 491 -59 -54 -623 -675 -399 173 388
2089 388 275 568 436 35 -21 -270 -513 -428 -273 -142 322 784 645 319 37 -609 -404 -348 -191 417 396
2110 396 378 226 263 134 -166 -666 -616 -497 -61 541 643 690 243 -94 -692 -704 -482 -484 127 100 135 300 573
2133 573 192 31 -545 -363 -511 88 238 692 566 280 65 -397 -623 -421 -253 -220 326 656 612 664 226
2154 226 -115 -568 -570 -176 -121 536 802 280 121 28 -76 -245 -345 -378 -385 225 132 516 426 -4 -310 -710 -476
2177 -476 -391 37 420 540 328 237 81 -179 -451 -619 -846 -520 109 616 646 531 322 -362 -676 -445 -329
2198 -329 -173 235 304 600 619 576 249 -349 -438 -759 -445 350 554 631 749 235 -207 -202 -508 -340 -135 -192 231
$$ packed form
2046g25L98n0R38J8K33o35l05k53k0M07k39M07n0N5L24J24p83j5l75j49J29L96
2068a70N25L35j82l97j83j85l55K33M28j65K09K55M92l49n50Nn69n2K76N72K15
2089C88j13K93j32m01n6k49k43Q5J55J31M64M62j39l26k82o46K05N6J57O08k1
2110C96j8j52L7j29l00n00N0J19M36O02J02M7m47l37n98j2K22kO11k7L5J65K73
2133E73l81j61n76J82j48N99J50M54j26k86k15m62k26K02J68L3N46L30m4N2m38
2154B26l41m53kL94N5O57K66n22j59r3j04j69j00l3pO10r3L84r0m30l06m00K34
2177d76Q5M28L83J20k12r1j56k60k72j68k27L26O29N07L0j15k09o84l14K31J16
2198c29J56M08O9K96J9m3l27n98q9l21L14P95K04P7J18n14m42Nl06J68K05n7M23
$$ plain form
2221 231 216 369 292 112 -291 -893 -789 -645 10 102 617 589 -12 -12 -153 -447 -439 -221 -242 51 578 949 492
2244 492 256 -62 -658 -746 -400 89 101 459 528 229 253 120 -386 -185 -487 -294 286 626 668 594 83 -254
2266 -254 -683 -531 -393 -75 98 341 373 542 412 61 -199 -943 -742 -291 384 341 618 509 415 -182 -402
2287 -402 -572 -598 65 -38 482 615 677 735 59 -388 -789 -834 -361 50 553 667 589 51 76 -276 -506 -491
2309 -491 -738 -171 253 383 461 620 197 -694 -661 -634 -229 99 228 449 518 474 411 -27 -159 -682 -489 -279
2331 -279 -8 861 716 630 125 -258 -607 -662 -281 -69 122 49 381 453 221 133 -362 -464 -741 -241 265 466
2353 466 724 440 -176 -56 -405 -243 -309 -357 -129 358 640 435 541 160 -728 -710 -767 -133 410 711 683 323
2375 323 276 -178 -24 -241 -528 -533 -158 406 403 543 629 263 -457 -725 -541 -430 47 465 348 518 319 199
$$ packed form
2221B31j5J53p7j80m03o02J04J44O55R2N15k8o01%j41k94QK18k1K93N27L71m57
2244D92k36l18n96q8L46M89J2L58O9k99K4j33n06K01l02J93N80L40M2p4n11l37
2266b54m29J52J38L18J73K43L2J69j30l51k60p44K01M51O75m3K77j09r4n97k20
2287d02j70k6O63j03N20J33O2N8o76m47m01m5M73M11N03J14p8n38K5l52k30J5
2309d91k47N67M24J30P8J59m23q91L3K7M05L28J29K21O9m4o3m38j32n23J93K10
2331b79K71Q69j45q6n05l83l49n5L81K12J91p3L32P2k32q8m95j02k77N00N06K01
2353D66K58k84o16J20l49J62o6m8K28M87K82k05J06l81q88J8n7O34N43L01k8l60
2375C23m7m54J54k17k87nL75N64lJ40Q6l66p20k68J84J11M77M18j17J70j99j20
$$ plain form
2397 199 -77 -428 -516 -800 -459 -41 819 744 565 123 -294 -525 -471 -393 -132 -22 397 185 682 591 29 -382
2419 -382 -862 -886 -324 25 831 659 437 188 -322 -310 -450 -433 -147 -260 171 678 582 428 0 -359 -573
2440 -573 -599 -307 18 572 560 259 343 -48 -185 -112 -466 -533 -44 64 548 779 555 244 -425 -737 -499 -347
2462 -347 90 465 595 478 296 159 -160 -164 -754 -702 44 179 483 941 587 -268 -203 -506 -463 -7 96 71
2484 71 165 353 331 346 199 -454 -702 -567 -348 283 515 581 400 189 -328 -439 -343 -498 -225 -421 365 648
2506 648 461 450 -32 -353 -849 -545 -222 312 295 607 358 230 -1 142 -183 -314 -425 -204 158 322 793
2527 793 310 -32 -560 -849 -531 228 296 545 398 583 468 161 106 -490 -489 -606 -319 265 810 806 503 20
2549 20 -585 -406 -282 22 -25 -14 77 339 249 332 188 -345 -697 -530 -187 389 600 544 290 -135 -184 -492 -289
$$ packed form
2397A99k76l51q8k84L41M18Q60p5j79m42m17k31N4P8K61J10M19k12M97r1n62m11
2419c82m80k4N62L49Q06j72k22k49n10J2j40J7K86j13M31N07r6j54m28l59k14
2440e73k6K92L25N54j2l01Q4l91j37P3l54o7M89J08M84K31k24l11o69l12K38J52
2462c47M37L75J30j17j82j37l19mn90N2P46J35L04M58l54q55O5l03M3M56J03k5
2484G1R4J88k2J5j47o53k48J35K19O31K32O6j81k11n17j11R6j55K73j96P86K83
2506F48j87j1m82l21m96L04L23N34j7L12k49j28k31J43l25j31j11K21L62J64M71
2527G93m83l42n28k89L18P59O8K49j47J85j15l07n5n96Jj17K87N84N45ml03m83
2549B0o05J79J24L04m7J1R1K62r0Q3j44n33l52J67L43N76K11n6k54m25m9l08K03
$$ plain form
2572 -289 -242 -213 -82 149 380 674 234 134 -382 -596 -732 -1 392 743 622 72 84 -185 -308 -276 -624
2593 -624 -776 -461 121 673 578 616 288 -406 -875 -375 -146 121 484 300 119 186 177 45 -250 -551 -836 -239
2615 -239 393 273 478 485 -138 -480 -341 -280 -151 -69 208 419 216 320 132 -188 -238 -590 -583 -217 408 686
2637 686 712 263 -216 -368 -384 -322 -227 -236 -182 96 519 459 415 -10 -303 -833 -287 -44 179 234 315 454 258 45
2661 45 4 -258 -340 -331 -253 131 387 817 298 -28 -636 -485 -272 -166 -18 491 446 -64 121 528 101 -373
2683 -373 -684 -339 -24 241 428 792 73 117 -463 -596 -171 -111 153 -47 210 502 620 457 -33 -344 -457
2704 -457 -523 -59 212 530 672 251 -12 -322 -251 -203 -569 -51 318 266 263 727 80 189 -437 -440 -375 -194 376
2727 376 528 310 192 90 347 -99 -259 -376 -366 -343 407 304 390 275 -124 -536 -274 -242 -44 249 246 380
$$ packed form
2572b89M7K9J31K31K31K94m40j00n16k14j36P31L93L51j21n50J2k69j23L2l48
2593f24j52L15N82N52r5L8l28o94m69N00K29K67L63j84j81O7rj32k95l01k85N97
2615b39O32j20K05Po23l42J39O1J29Q2K77K11k03J04j88l20n0l52PL66O25K78
2637F86K6m49m79j52j6O2R5rN4K78M23o0m4m25k93n30N46K43K23N5Q1J39j96k13
2661D5m1k62q2RP8L84K56M30n19l26o08J51K13J06J48N09m5n10J85M07m27m74
2683c73l11L45L15K65J87L64p19M4n80j33M25O0K64k00K57K92J18j63m90l11j13
2704d57o6M64K71L18J42m21k63l10P1M8l66N18L69n2lM64o47J09o26lO5J81N70
2727C76J52k18j18j02K57m46j60j17J0K3P50j03Q6j15l99m12K62L2J98K93lJ34
$$ plain form
2749 380 319 205 434 127 -520 -414 -339 -96 202 670 721 184 -199 -377 -358 -397 -60 21 -246 162 216 540
2771 540 177 -81 -154 -449 -166 -99 330 511 429 -50 47 81 -344 -246 -11 -204 175 109 482 528 431 -462 -407
2794 -407 -406 -563 178 376 317 566 386 -96 25 -332 -266 -266 -394 83 -35 614 503 -14 -147 -491 -541 -41
2816 -41 -17 172 166 189 390 378 268 -458 -468 -372 -289 -107 426 649 582 -3 -320 -537 -549 -303 -324 79 112 -40
2840 -40 376 493 202 -61 -492 -458 -428 -407 539 582 209 153 52 -234 -124 -88 -134 -340 -36 287 429 253 343
2863 343 -123 -694 -279 196 66 57 459 597 253 80 90 -28 -142 -619 -116 -236 411 276 472 -236 -346
2884 -346 -415 -268 -251 -178 219 326 231 54 242 126 -173 -393 -404 -236 79 302 512 183 67 -294 -554 -410
2906 -410 -118 -269 60 162 289 327 339 314 -80 -348 -610 -389 -221 553 255 344 261 -114 -46 -189 -305 -42
$$ packed form
2749C80o1j14K29l07o47J06P5K43K98M68N1n37l83j78J9l9L37Q1k67M08N4L24
2771E40l63k58p3k95K83O7M29J81q2m79R7L4m25R8K35j93L79o6L73M6r7q93N5
2794d07Jj57P41J98n9K49j80m82J21l57O6%j28M77j18O49j11n17j33l44n0N00
2816d1K4J89oK3K01j2j10p26j0R6Q3J82N33K23o7n85l17k17j2K46k1M03L3j52
2840d0M16J17k91k63m31L4L0K1R46M3l73n6j01k86J10L6m6k06L04L23J42j76R0
2863C43m66n71M15M75j30rM02J38l44j73J0j18j14m77N03j20O47j35J96p08j10
2884c46o9J47J7P3L97J07r5j77J88j16k99k20j1J68L15K23K10l29j16l61k60J44
2906d10K92j51L29J02J27L8J2k5l94k68k62K21J68P74k98Q9q3l75O8j43j16K63
$$ plain form
2928 -42 -370 -88 266 165 257 169 -86 -571 -455 -169 308 626 399 313 141 70 -28 -286 -119 -240 -360 26
2950 26 415 716 499 -189 -306 -647 -267 49 235 193 109 192 428 479 326 -281 -216 -313 -91 107 583 464
2972 464 620 -4 -198 -498 -136 -132 -256 -63 77 224 426 293 -73 -195 -321 -131 -254 -55 419 380 229
2993 229 163 -471 -154 -403 -349 -345 -196 193 -91 303 463 5 -172 -531 -627 -81 183 355 282 332 116 231
3015 231 156 -215 -202 -198 -209 286 327 508 334 -52 -539 -557 -580 -99 126 -28 281 80 74 370 65 -363 -482
3038 -482 -439 -74 149 490 539 205 -162 -379 -175 -130 -116 -30 77 13 310 117 401 35 -16 -582 -487 17 315
3061 315 435 303 197 -87 -174 -227 -247 -180 -190 -19 189 432 201 239 -200 -204 -744 -294 49 437 276 242 126
3084 126 -79 -157 -205 -138 -160 -373 157 311 373 440 198 104 -659 -410 -293 -45 156 232 460 232 320 85 -83
$$ packed form
2928d2l28K82L54j01R2q8k55m85J16K86M77L18k27q6j72p1r8k58J67j21j20L86
2950B6L89L01k17o88j17l41L80L16J86m2q4Q3K36N1j53o07O5r7K22J98M76j19
2972D64J56o24j94l00L62Mj24J93J40J47K02j33l66j22j26J90j23J99M74l9j51
2993B29o6o34L17k49N4MJ49L89k84L94J60m58j77l59r6N46K64J72p3N0k16J15
3015B31p5l71J3Mj1M95M1J81j74l86m87j8k3M81K25j54L09k01oK96l05m28j19
3038d82M3L65K23L41M9l34l67k17K04M5J4Q6J07o4K97j93K84l66n1n66R5N04K98
3061C15J20j32j06k84q7n3k0O7j0J71K08K43k31L8m39mn40M50L43L88j61l4j16
3084A26k05p8m8O7k2k13N30J54O2O7k42r4p63K49J17K48K01P6K28k28Q8k35j68
$$ plain form
3107 -83 -112 -494 -517 -287 112 274 320 142 -182 -199 -363 -313 -62 136 -10 313 161 223 336 -147 -152 -643 -514
3130 -514 33 515 400 442 87 -150 -40 -73 -250 -382 -13 205 127 353 309 231 146 -459 -461 -261 -76 102 338
3153 338 236 285 278 -70 -77 53 -362 -313 -208 -101 266 -33 165 -159 -185 -405 -124 27 -90 140 184 287 233
3176 233 -20 12 -204 -525 -222 -246 122 546 389 70 -173 -94 -234 -266 138 -13 -133 279 244 294 188 -80
3198 -80 -433 -89 -457 18 222 255 362 275 -151 -116 -90 74 -231 -85 -12 -62 10 372 227 14 -321 -246 -74
3221 -74 -57 259 407 180 377 90 -70 27 -138 -324 -145 -345 37 627 386 283 11 -240 -134 -207 -85
3242 -85 149 174 240 225 229 258 -132 -441 -214 -118 41 237 343 267 68 -136 -170 -221 -86 -64 -30 -25 287 10 441
3267 441 191 -255 -380 -607 -213 76 418 401 484 50 -79 23 -12 -97 -148 -15 98 71 338 304 7 -254
$$ packed form
3107h3k9l82k3K30L99J62M6j78l24j7j64N0K51J98j46L23j52O2J13m83nm91J29
3130e14N47M82j15M2l55k37J10l3j77j32L69K18p8K26m4p8q5o05kK00J85J78K36
3153C38j02M9pl48pJ30m15M9J05J07L67k99J98l24k6k20K81J51j17K30M4J03n4
3176B33k53L2k16l21L03k4L68M24j57l19k43P9j40l2M04j51j20M12l5N0j06k68
3198h0l53L44l68M75K04L3J07q7m26L5K6J64l05J46P3n0P2L62j45k13l35P5J72
3221g4J7L16J48k27J97k87j60R7j65j86J79k00L82N90k41j03k72k51J06p3J22
3242h5K34K5O6j5MK9l90l09K27R6J59J96J06p6j99k04l4n1J35K2L4NL12k77M31
3267D41k50m46j25k27L94K89L42j7Q3m34j29J02l5q5n1J33J13k7K67l4k97k61
$$ plain form
3289 -254 -415 -268 -476 50 -147 220 96 13 235 138 235 -422 -6 -106 -107 499 305 464 80 -130 -367 -277
3311 -277 -15 85 139 -33 -109 314 200 114 -44 -436 -123 -388 87 176 190 362 73 59 -382 -271 -235 -331 -259
3334 -259 78 245 360 272 147 32 -522 -564 -211 0 245 245 153 -67 -74 144 -70 -116 -531 36 61 303 263
3357 263 157 223 -49 -321 -381 -353 2 107 78 177 124 0 -72 -25 4 -237 -224 418 575 206 47 25 -453 -376
3381 -376 -204 -364 -34 -55 135 142 271 301 49 -250 -412 -332 -28 -64 173 418 -31 168 -195 -63 -391 68
3403 68 49 57 269 -149 179 37 100 -59 -149 -422 -129 -96 257 324 261 -28 -26 -181 -231 261 -220 -148 104 404
3427 404 255 308 -78 -163 -227 -388 132 286 4 97 91 380 157 -141 -159 -227 50 -372 -105 54 234 273 -233
3450 -233 -276 -153 -286 -218 212 -241 -172 65 -7 22 64 -3 -313 -330 -200 133 523 208 423 -199 -75 -162 -239
$$ packed form
3289b54j61J47k08N26j97L67j24q3K22r7R7o57M16j00jO06j94J59l84k10k37R0
3311b77K62J00N4j72p6M23j14q6j58l92L13k65M75Q9J4J72k89j4m41J11L6r6P2
3334b59L37J67J15q8j25j15n54m2L53K11K45%r2k20pK18k14m6m15N67K5K42m0
3357B63j06O6k72k72o0K8L55J05k9R9n3j24p2M7K9k41J3O42J57l69j59k2m78P7
3381c76J72j60L30k1J90PJ29L0k52k99j62Q0L04l6K37K45m49J99l63J32l28M59
3403F8j9QK12m18L28j42O3j59r0k73K93L3L53O7o3k89Kj55n0M92m81P2K52L00
3427D04j49N3l86q5o4j61N20J54k82R3oK89k23k98j8o8K77m22K67J59J80L9n06
3450b33m3J23j33O8M30m53O9K37p2K9M2o7l10j7J30L33L90l15K15o22J24q7p7
$$ plain form
3473 -239 -79 -153 -208 61 146 346 141 -85 -290 -320 -515 -21 395 277 325 189 68 -159 -228 137 -110 -160
3495 -160 -99 -155 193 400 389 -178 -216 -175 -73 -26 -59 103 17 63 15 -34 -41 -317 -208 -181 -242 219 353 382 82
3520 82 -187 -491 -355 0 -70 66 111 296 116 115 293 -100 232 -213 -285 105 303 397 137 184 -122 -251 -301
3543 -301 24 -207 -34 -80 285 57 137 7 -180 -359 -328 -315 -67 199 563 247 442 59 -183 -299 -92
3564 -92 -136 -124 -13 164 375 216 178 -82 -162 -263 -397 -276 161 12 258 78 104 239 -189 -295 -140 -200
3586 -200 209 328 389 500 132 -83 -158 -502 -260 48 197 266 -253 373 -38 62 179 -515 -38 -470 72
3607 72 196 417 279 120 -154 -481 74 -42 -252 158 85 271 249 110 24 -68 -305 15 -86 139 425 84
3629 84 275 -199 -22 104 -49 -154 -114 6 -113 -143 -21 341 415 -128 -414 -260 -180 -143 -20 229 193 309
$$ packed form
3473b39J60p4n5K69Q5K00k05k26k05l0j95M94M16j18M8j36j21k27o9L65k47n0
3495a60O1n6L48K07j1n67l8M1J02M7l3J62q6M6m8m9pk76J09K7o1M61J34K9l00
3520H2k69l04J36L55p0J36M5J85j80jJ78l93L32m45p2L90J98R4k60M7l06j29n0
3543c01L25k31J73m6L65k28Q0j30j87j79L1J3K48K66L64l16J95l83k42j16K07
3564i2m4J2J11J77K11j59l8k60q0j01j34J21M37j49K46j80K6J35m28j06J55o0
3586b00M09J19O1J11l68k15p5l44K42L08J49O9n19O26m11J00J17o94M77m32N42
3607G2J24K21j38j59k74l27N55j16k10M10p3J86k2j39q6r2k37L20j01K25K86l41
3629H4J91m74J77J26j53j05M0J20j19l0J22L62P4n43k86J54Q0L7J23K49l6J16
$$ plain form
3651 309 53 242 -55 -228 -326 51 184 -145 171 111 88 -238 -286 -90 -182 22 -14 66 30 78 183 18 -283
3674 -283 -334 -123 -46 -127 160 728 106 -49 -91 -141 -234 44 -185 6 66 221 375 115 -194 -18 -173 -120 177
3697 177 -80 239 372 338 -56 -254 -229 13 -211 -50 -171 41 354 316 307 -45 -468 -746 -423 -333 138 309
3719 309 93 130 -26 59 50 51 -101 -206 61 32 458 239 358 190 -193 -304 -277 -108 243 110 -35 53 94
3742 94 -93 61 75 -263 -337 -97 -84 230 470 101 -42 -285 -202 -188 -256 -77 51 283 -16 -156 94 246
3764 246 -214 -293 -418 -72 193 63 438 82 145 -49 184 127 -152 21 -62 -126 111 384 298 233 -144 -312
3786 -312 -155 65 -242 282 111 189 -211 68 109 -151 -282 -301 36 85 310 230 269 183 126 -567 -137 105 67
3809 67 250 209 187 -13 179 13 -232 -211 -462 -54 48 48 -49 261 -76 -236 -168 -259 -107 -233 180 -9 128
$$ packed form
3651C09k56J89k97j73r8L77J33l29L16o0k3l26m8J96r2K04l6Q0l6M8J05j65l01
3674b83n1K11P7q1K87N68o22j55m2n0r3K78k29J91O0J55J54k60l09J76j55N3K97
3697A77k57L19J33l4l94j98K5K42k24J61j21K12L13l8rl52m23k78L23R0M71J71
3719C09k16L7j56Q5rJj52j05K67k9M26k19J19j68l83j11K7J69L51j33j45Q8M1
3742I4j87J54J4l38p4K40J3L14K40l69j43k43Q3J4o8J79J28K32k99j40K50J52
3764B46m60p9j25L46K65j30L75l56O3j94K33n7k79J73q3o4K37K73q6o5l77j68
3786c12J57K20l07N24j71P8m00K79M1k60j31j9L37M9K25q0L9q6n7o93M30K42l8
3809F7J83m1k2k00J92j66k45K1k51M08J02%r7L10l37j60O8r1J52j26M13j89J37
$$ plain form
3832 128 63 59 29 -159 -628 176 -116 10 29 212 177 94 -20 -131 -69 -3 -170 -317 65 320 30 272 -303
3855 -303 -165 77 -229 -93 -62 78 171 292 347 66 68 -25 -525 -43 -53 250 182 311 109 29 -85 -311 -99
3878 -99 -207 -24 110 -151 22 159 247 -36 -52 -153 -369 -250 106 -11 308 211 -104 -55 96 -77 -206 62
3900 62 85 264 167 91 97 295 -301 -254 -154 -128 37 172 368 -104 -114 -278 -254 -24 -102 -78 227 11 74 525
3924 525 128 46 -163 -53 -366 -44 28 218 123 34 -115 -100 104 -156 98 -234 -197 -76 180 298 284 22
3946 22 279 82 -100 -69 -31 -72 88 240 89 -34 61 -126 -159 -343 -22 163 168 555 191 159 -118 -24 -82 -226
3970 -226 -28 -215 207 89 88 563 -21 -276 -240 -63 250 -42 36 -35 -144 57 67 -136 -268 -192 -230 -139 23
3993 23 374 161 114 -67 -421 -25 -172 97 350 75 191 229 65 64 80 -400 -329 -42 -59 111 362 331 9
$$ packed form
3832A28o5ml0j88m69Q04k92J26J9J83l5q3j14j11O2O6j67j47L82K55k90K42n75
3855c03J38K42l06J36L1J40R3J21N5k81Kr3n00M82j0L03o8J29k02q0j14k26K12
3878i9j08J83J34k61J73J37Q8k83j6j01k16J19L56j17L19r7l15M9J51j73j29K68
3900F2K3J79r7p6OJ98n96M7J00K6J65J35J96m72j0j64K4K30p8K4L05k16O3M51
3924E25l97q2k09J10l13L22P2J90r5q9j49J5K04k60K54l32L7J21K56J18j4k62
3946B2K57j97j82L1L8m1J60J52j51j23R5j87l3j84L21J85NL87l64l2k77R4n8j44
3970b26J98j87M22j18jM75n84k55L6J77L13k92P8p1j09K01J0k03j32P6l8R1J62
3993B3L51k13m7j81l54L96j47K69K53k75J16L8j64jJ6m80P1K87j7J70K51l1l22
$$ plain form
4016 9 37 70 -261 -443 -95 -168 -96 -127 -71 11 96 456 -206 -329 -50 276 69 183 313 228 -179 -249 148 -10
4040 -10 -140 -110 -15 59 28 233 -162 165 -56 -277 76 -232 190 21 247 116 -268 25 -102 -78 -31 162
4062 162 189 -217 -125 291 -23 56 -322 -68 -140 -104 73 -233 -119 41 213 214 271 -361 -180 -252 109 232 308
4085 308 147 20 -208 -321 -153 -237 -51 -21 92 -223 60 229 324 247 59 -445 -66 -72 283 53 -54 250
4107 250 -363 -106 80 200 -219 -21 -30 142 313 189 36 -130 -166 -434 -9 38 370 115 158 13 71 -33
4129 -33 -158 -101 -17 -319 -234 -21 45 270 164 -142 -134 -62 180 130 -62 -91 206 134 -24 120 -33 -503 -30 -246
4153 -246 311 166 -11 153 65 -166 -304 -121 7 -147 -78 282 125 111 106 66 -178 -57 -221 135 -20 -44
4175 -44 67 154 -98 -130 -205 34 -274 57 252 -169 -43 -8 140 -78 -197 -133 -99 -189 113 351 267 418 -168
$$ packed form
4016IK8L3l31j82L48p3P2l1N6Q2Q5L60o62j23K79L26k07J14J30q5m07p0L97j58
4040a0j30L0R5P4l1K05l95L27k21k21L53l08M22j69K26j31l84K93j27K4M7J93
4062A62K7m06R2M16l14P9l78K54p2L6J77l06J14J60J72JN7o32J81p2L61J23P6
4085C08j61j27k28j13J68q4J86L0J13l15K83J69R5p7j88n04L79oL55k30j07L04
4107B50o13K57J86J20m19J98rJ72J71j24j53j66l6k68M25M7L32k55M3j45N8j04
4129c3j25N7Q4l02Q5K13O6K25j06l06QP2K42n0j92k9K97p2j58J44j53m70M73k16
4153b46N57j45j77J64q8k31j38J83J28j54O9L60j57j4nm0k44J21j64L56j55k4
4175d4J11Q7k52l2p5K39l08L31J95m21J26L5J48k18j19O4L4r0L02K38q4J51n86
$$ plain form
4198 -168 -135 42 -281 -77 -83 -32 178 388 137 359 28 85 -125 84 99 26 42 17 -87 -265 277 55 27
4221 27 -189 -132 -163 -54 -73 436 -333 -6 -28 2 -193 -123 131 -88 45 -157 -199 197 -139 -414 -87 27 -396
4244 -396 -138 366 110 119 -134 -100 -63 44 -70 -10 -84 255 185 184 179 -56 -243 -252 -212 209 -22 -81 423 107 145
4269 145 45 286 -79 -164 -95 82 16 164 216 211 76 -294 -10 233 344 266 258 -64 251 -99 38 -251 -154
4292 -154 -177 -83 -386 104 239 145 168 -16 -329 -131 -289 258 -80 55 83 158 272 172 30 -82 -171 -294
4314 -294 27 115 303 -75 41 -289 -14 -59 8 238 207 -98 -10 24 120 15 15 77 -57 -20 35 161 304 92
4338 92 -177 -37 21 -73 39 -138 -153 -96 60 319 155 -170 -87 -406 -107 -12 -5 177 177 193 100 38 -99 -10 -87
4363 -87 -26 -181 -115 -67 151 499 -164 9 -363 89 -15 155 36 -255 -68 226 306 -88 146 -407 -139 40
$$ packed form
4198a68L3J77l23K04oN1K10K10k51K22l31N7k10K09J5p3J6k5j04j78N42k22k8
4221B7k16N7l1J09j9N09p69L27k2L0j95P0K54k19J33k02m2L96l36k75L27J14m23
4244c96K58N04k56Rk53L4L7J07j14O0p4L39p0jnk35j87rM0M21k31n9N04l16L8
4269A45j00K41l65q5O9J77o6J48N2nj35l70K84K43J11p8ql22L15l50J37k89R7
4292a54k3R4l03M90J35r4K3j84l13J98j58N47l38J35K8P5J14j00j42j12q9j23
4314b94L21Q8J88l78J16l30K75m5O7K30l1l05Q8L4R6j05%O2j34L7N5J26J43k12
4338I2k69J40N8r4J12j77j5N7J56K59j64l25Q3l19K99R5PJ82%J6r3o2j37Q9p7
4363h7O1j55O6M8K18L48o63J73l72M52j04J70j19k91J87K94Q0l94K34n53K68J79
$$ plain form
4385 40 -99 157 307 321 -75 -13 -259 165 -133 262 100 -15 -110 95 -21 109 -89 76 -165 43 -207
4406 -207 -34 133 -70 -75 39 -19 -183 -106 -23 -88 -178 1 180 27 -6 2 -431 -54 10 242 -104 70 176 170
4430 170 -6 12 -208 -52 -88 -129 125 156 230 -84 19 124 -110 10 -126 118 -1 -230 199 214 -192 23
4452 23 -90 -41 93 -39 -74 98 146 -207 117 -165 -342 -238 125 278 -174 91 283 -8 70 -81 17 -16
4474 -16 -281 -195 -4 29 202 -150 56 -150 -51 -28 151 -165 -15 6 163 326 321 -216 -150 -125 -96 -131 126 231
4498 231 150 -119 -64 -8 224 281 -140 -128 -256 178 -45 247 102 -104 -52 251 -68 -143 198 -57 174 -153
4520 -153 -2 -141 -106 -216 147 -385 -25 155 392 193 66 -36 129 -350 -246 -161 12 204 -154 33 -54
4541 -54 -37 168 -84 -81 -61 -30 156 -103 28 114 90 62 -231 211 78 -298 -35 161 -109 -86 147 -119 -25 195
$$ packed form
4385D0j39K56J50J4l96O2k46M24k98L95j62j15r5K05j16J30j98J65k41K08k50
4406b07J73J67k03nJ14n8j64P7Q3o5r0J79J79j53l3Qm33L77O4K32l46J74J06o
4430A70j76J8k20J56l6m1K54L1P4l14J03J05k34J20j36K44j19k29M29J5m06K15
4452B3j13M9J34j32l5J72M8l53L24k82j77J04L63J53m52K65J92k91P8j51R8l3
4474a6k65Q6J91L3J73l52K06k06R9K3J79l16J50K1J57J63nn37O6K5K9l5K57J05
4498B31q1k69N5N6K32N7m21J2j28M34k23K92j45k06N2L03l19p5L41k55K31l27
4520a53J51j39L5j10L63n32L60J80K37j99j27j02J65m79J04Q5J73J92l58J87q7
4541e4J7K05k52LK0L1J86k59J31Q6k4k8k93M42j33l76K63J96k70K3K33k66R4K20
$$ plain form
4565 195 -18 133 -58 -73 183 -14 -13 39 -107 100 -115 -228 -99 222 -171 -160 -14 375 -300 89 -20 -170
4587 -170 85 -56 40 -158 40 -129 108 161 29 -126 232 -177 -107 -2 192 197 -134 -19 122 -137 134 238
4609 238 -11 -38 103 31 -78 -57 293 -303 -24 -48 -137 -103 -31 -218 -96 104 -178 -34 -152 149 -5 361
4631 361 330 213 -18 -215 -165 -45 68 16 7 4 -67 17 15 70 -110 -421 75 192 49 -49 140 109 98 121 -237
4656 -237 46 -42 -85 -90 110 89 78 155 -24 125 -158 218 -196 85 123 107 26 -83 55 -235 -139 -5 -36 -95
4680 -95 11 297 -71 200 142 195 -103 -92 -37 271 -151 91 87 72 0 77 62 -279 -169 44 -30 -153 -1 -89
4704 -89 -108 -114 -122 -179 213 -11 -221 -117 -49 -46 -121 103 -254 51 153 -95 -133 -83 11 -93 195 -134 -227 -59 109
4729 109 -111 4 103 -273 -162 -42 -185 88 -2 -116 -37 135 271 37 205 -40 -132 -26 43 77 -162 155
$$ packed form
4565A95k13J51j91j5K56j97JN2j46K07k15j13J29L21l93J1J46L89o75L89j09j50
4587a70K55j41R6j98J98j69K37N3j32j55L58m09P0J05J94Nl31J15J41k59K71J04
4609B38k49k7J41p2j09K1L50n96K79k4q9L4P2j87J22K00k82J44j18L01j54L66
4631C61l1j17k31j97N0J20J13n2rlp1Q4kN5j80l11M96J17j43r8J89l1j1K3l58
4656b37K83q8m3nK00k1j1P7j79J49k83L76m14K81L8j6q1j09J38k90R6J34l1n9
4680i5J06K86l68K71n8N3k98J1N5L08m22K42mj5p2P7j5l41J10K13p4j23J52q8
4704h9j9oqn7L92k24k10J04O8Lp5K24l57L05J02k48l8N0R4j04K88l29r3J68J68
4729A09k20J15R9l76J11J20j43K73r0j14P9J72J36k34J68k45r2J06O9L4k39L17
$$ plain form
4751 155 118 147 114 98 59 -125 52 -463 -281 120 -53 -189 29 216 -78 -20 105 234 -58 203 -77 32
4773 32 -57 -167 -52 9 -6 96 46 -260 -139 88 -145 118 91 -239 19 -114 93 14 -277 242 -197 -230 109
4796 109 -236 16 154 99 161 -340 16 -201 -8 107 -11 -219 193 171 64 286 -77 24 282 96 -44
4817 -44 -19 321 -6 155 24 -20 198 175 217 23 135 -86 182 -28 84 -68 65 24 103 214 -145 -92 116
4840 116 -23 -109 76 48 18 -132 -7 374 -160 10 330 -230 -120 123 -230 -101 213 82 71 -170 -29
4861 -29 -17 111 -21 295 -43 113 -290 71 126 -160 -8 -247 -19 -168 162 -94 1 126 48 114 66 -118
4883 -118 -56 61 109 -192 54 137 101 121 58 125 -143 -5 29 -118 226 -116 -197 -119 86 118 30 69 -23 205 -63
4908 -63 -58 -181 214 83 -49 5 263 -114 -112 -40 71 102 -137 75 56 95 -100 146 220 185 73 -258 82 159
$$ packed form
4751A55l7K9l3j6l9j84J77n15J82M01j73j36K18J87k94N8J25J29k92K61k80J09
4773C2q9j10J15O1j5J02n0l06J21K27k33K63k7l30K58j33K07p9k91N19m39l3L39
4796A09l45K52J38n5O2n01L56k17J93J15j18k08M12k2j07K22l63J01K58j86j40
4817d4K5L40l27J61j31m4K18k3M2j94J12k21K68k10J12j52J33m1P9J11l59N3K08
4840A16j39q6J85k8l0j50J25L81n34J70L20n60J10K43l53J29L14j31j1k41J41
4861b9J2J28j32L16l38J56m03L61N5k86J52k39K28j49L30k56R5J25p8O6m8j84
4883a18O2J17M8l01K46Q3l6K0o3O7k68J38L4j47L44l42q1P8K05L2q8L9r2K28k68
4908f3Nj23L95j31j32N4K58l77KP2J11L1k39K12j9L9j95K46P4l5j12l31L40P7
$$ plain form
4932 159 -243 -21 162 138 -178 -121 91 20 -451 -158 41 -59 152 -53 -170 121 79 110 -207 -9 -32 8
4954 8 67 -59 147 -111 -13 -188 -146 -67 46 7 171 42 1 -69 38 -44 -224 -111 34 -58 96 -85 -210 -25
4978 -25 13 179 124 0 -370 41 -137 -107 58 68 168 257 40 64 -257 53 86 -94 -259 332 -34 146 -93
5001 -93 -204 -6 19 7 71 -34 -41 -66 -229 70 -165 -90 200 38 -123 -8 144 -45 -137 -28 -22 -71 -200 221
5025 221 -116 -31 118 124 84 164 -10 -134 -16 -204 -52 137 111 -298 356 139 -184 123 341 -4 150 -21
5047 -21 245 38 -5 -41 -155 -135 -70 -30 -123 161 -88 -126 -39 -81 201 78 -496 27 -146 64 309 193 275 -169
5071 -169 -66 110 -22 59 113 63 148 176 -26 251 188 284 -213 41 371 -195 169 188 64 -37 116 63 -71
5094 -71 -12 139 23 9 -163 -20 241 -231 -64 -99 64 -365 -226 -133 149 -162 53 12 23 332 60 38 -306
$$ packed form
4932A59m02K22J83k4l16N7K12p1m71K93J99j00K11k05j17K91m2L1l17J98k3M0
4954HN9j26K06k58R8j75M2P9J13l9J64j29m1p0J07q2j80J13J45r2J54j81j25J85
4978b5L8J66n5j24l70M11j78L0J65J0J00Q9k17K4l21L10L3j80j65N91l66J80k39
5001i3j11J98K5j2O4j05pk5j63K99k35P5K90j62j61J15J52j89r2J09Om9j29M21
5025B21l37Q5J49Om0Q0j74j24J18j88J52J89k6m09O54k17l23L07K18l45J54j71
5047b1K66k07m3l6j14K0O5M0r3K84k49l8Q7m2K82j23n74N23j73K10K45j16Q2m44
5071a69J03J76j32Q1N4n0Q5K8k02K77o3R6m97K54L30n66L64J9j24j01J53n3j34
5094g1N9J51j16j4j72J43K61m72J67l5J63m29J39R3K82l11K15m1J1L09k72k2l44
$$ plain form
5117 -306 -42 -95 193 84 431 -54 -131 -34 -53 -132 -150 -68 -156 122 -302 185 215 -42 111 8 -105 -79 -229
5140 -229 80 69 -186 -3 -136 146 -159 -83 -12 -110 23 -124 101 -125 -134 -86 36 -38 -186 86 224 -233 -32
5163 -32 -16 241 -271 73 30 13 -309 -81 79 25 -142 -22 159 -207 62 -36 39 5 147 -99 211 143 173
5186 173 40 54 -100 -73 -152 -222 -196 -81 -71 -203 65 -268 51 107 -274 13 -209 142 255 93 -118 -67 -23
5209 -23 -7 -92 -12 -87 -211 106 -51 -115 36 252 -98 -92 -138 230 70 61 -47 -144 -91 11 111 212 147 -8 151
5234 151 -103 -213 103 32 -221 -119 -55 72 -26 -207 -38 -59 -192 -217 90 85 -16 136 -9 269 -120 -250
5256 -250 118 5 150 55 140 178 165 189 75 -242 134 57 -107 68 -52 313 120 240 125 100 -169 72
5278 72 25 -54 295 -61 -115 -148 -10 -299 1 -18 -251 -196 -39 -449 133 101 32 -230 -205 -348 -75 -33 -94 269
$$ packed form
5117c06K64n3K88j09L47m85p7R7j9p9j8Q2q8K78m24M87L0k57J53j03j13K6j50
5140b29L09j1k55J83j33K82l05P6P1r8J33j47K25k26rM8J22p4j48K72J38m57K01
5163c2J6K57n12L44m3j7l22K28J60n4j67J20J81l66K69r8P5l4J42k46L10o8L0
5186A73j33J4j54K7p9p0K6J15J0j32K68l33L19N6l81K87k22L51J13j62k11N1M4
5209b3J6q5Q0p5j24L17j57o4J51K16l50Om6L68j60rj08r7N3J02J00J01o5j55J59
5234A51k54j10L16p1k53J02O4J27r8j81J69k1j33k5L07nj01J52j45K78l89j30
5256b50L68j13J45r5Q5L8j3K4j14l17L76p7j64J75j20L65j93J20j15k5k69K41
5278G2m7p9L49l56n4l3J38k89L00j9k33N5J57m10N82l2o9k62K5j43K73M2o1L63
$$ plain form
5302 269 271 76 -223 284 -118 14 45 -23 33 -170 35 122 -107 289 83 190 -131 -42 159 69 -117 34 14
5325 14 -11 -187 -95 -178 198 -65 232 76 -65 -66 -63 -121 43 40 -92 199 -18 175 -118 -208 -150 -30 16 -392 86
5350 86 184 89 39 133 40 35 174 -88 -204 -228 -190 -186 146 -98 -122 184 -58 92 -53 7 -133 107 -23 84 63
5375 63 306 159 -169 -7 -224 -75 28 -13 227 -77 84 -14 31 -61 63 -104 132 -95 107 289 17 21
5397 21 -228 81 -86 45 -43 -4 -16 -232 -9 43 -156 20 -117 -122 -220 -13 -65 -96 -22 4 178 35 200 141
5421 141 -130 202 244 152 139 -303 37 -89 -327 -71 42 52 31 -99 79 181 64 33 115 49 -34 220 -57
5444 -57 120 231 -9 16 -132 -88 -151 190 -92 150 213 85 -100 -271 43 -54 270 110 24 47 -141 150 91
5467 91 -58 -206 20 142 176 -70 357 111 -86 115 56 -222 -146 -1 -187 65 -106 85 -80 2 60 27
$$ packed form
5302B69Kj95k99N07m02J32L1o8N6k03K05Q7k29L96k06J07l21Q9K01r0j86J51k0
5325A4k5j76R2q3L76k63K97j56j41jLn8J64lj32K91k17J93k93r0N8J20M6m08M78
5350H6R8r5n0R4r3nJ39k62j16k4L8ML32k44k4L06k42J50j45O0j40K40j30J07k1
5375F3K43j47l28J62k17J49J03m1K40l04J61r8M5r2J24j67K36k27K02J82k72M
5397B1k49L09j67J31q8L9j2k16K23N2j99J76j37nr8K07n2l1P4K6J74j43J65n9
5421A41k71L32M2r2j3m42L40j26k38K56J13J0k1j30J78J02j17l1Q2o6q3K54k77
5444e7J77J11k40K5j48M4o3L41k82K42O3j28j85j71L14r7L24j60q6K3j88K91n9
5467I1j49j48K26J22L4k46M27k46j97K01n9k78P6J45j86K52j71J91j65Q2N8l3
$$ plain form
5489 27 -221 34 -56 -63 77 84 -115 -123 -56 -50 18 -39 12 -338 -185 4 212 180 17 -58 -174 -262 -92 -110 -88 49
5515 49 -99 -2 54 -276 -112 -117 -16 -105 163 -97 -12 97 385 71 87 194 -115 92 83 -203 141 -93 172
5538 172 -61 -361 33 38 235 1 -86 151 17 24 -79 -133 -246 -145 -111 197 369 101 258 316 3 140 9
5561 9 -185 -34 254 155 -228 101 48 -18 10 14 -372 114 -121 -197 -67 -222 307 122 144 172 -94 -57 29 -65 -54
5586 -54 -15 -104 31 -235 59 86 -127 -32 152 266 134 -202 248 44 -15 51 -34 -200 28 183 211 162 -57
5609 -57 -83 82 -154 183 27 78 -190 -195 -28 -280 103 14 19 -234 136 -7 90 156 27 53 -195 21 134 -103
5633 -103 215 55 211 489 -258 -77 -127 -109 48 -95 -23 151 -138 91 -121 190 -336 -92 147 -10 17
5654 17 -112 137 371 -153 187 -193 -55 -128 -81 -202 -9 -37 -143 281 9 -217 -4 -231 -293 25 -109 -116
$$ packed form
5489B7k48K55r0pJ40Pj99qO7OO8n7N1l50J53J89K08l2j63p5j16q8J70j8K2J37
5515D9j48R7N6l30J64nJ01q9K68k60Q5J09K88l14J6J07l09K07rk86L44k34K65
5538A72k33l00L94NJ97k34q7K37j34Pj03n4j13J01L4L08J72k68J57N8l13J37j31
5561Ij94J51K88r9l83L29n3o6K8Ml86M86k35p6J30j55N29j85K2K8k66L7Q6r4J1
5586e4L9q9J35k66K94K7k13R5J84J14j32l36M50k04n9O6q5j66K28J55K8m9k19
5609e7k6J65k36L37j56N1k68nJ67k52L83q9Nk53L70j43R7O6j29K6k48K16J13k37
5633a03L18j60J56K78p47J81n0J8J57j43P2J74k89K29k12L11n26K44K39j57K7
5654A7j29K49K34n24L40l80J38p3M7j21J93k8j06M24k72k26K13k27o2L18j34p
$$ plain form
5676 -116 238 267 282 -153 -94 -44 53 168 44 -34 206 216 138 298 85 150 -245 171 86 7 -110 -62 -65 67 38
5701 38 158 157 -140 58 19 -47 -152 105 -7 84 33 141 -90 65 319 -61 208 -16 128 -241 -250 -1 -78
5724 -78 -296 34 -49 146 -107 -87 -307 84 -101 -27 -132 -84 81 21 74 98 55 -256 97 -1 -109 44 104 69
5748 69 -161 112 83 -202 -25 -30 115 111 44 215 -82 -136 47 251 -34 174 -20 -22 43 238 97 140 45 -137
5772 -137 38 -274 -142 -177 -228 114 -163 282 317 18 -50 10 -10 10 -152 -79 258 121 34 -35 -343 79 6 -199
5796 -199 -53 -117 205 97 -142 -294 -45 155 128 -278 -238 -217 46 281 -180 -241 -277 -212 -217 47 -42 45 107 9
5820 9 -130 -26 45 -67 -195 263 289 164 83 -107 25 205 -58 -41 -43 -19 4 -57 -32 62 -68 266 115 144 -43
$$ packed form
5676a16L54K9J5m35N9N0R7J15j24p8K40J0p8J60k13O5l95M16q5p9j17M8lJ32k9
5701C8J20jk97J98l9o6j05K57j12R1n1J08k31J55K54l80K69k24J44l69rK49p7
5724g8k18L30q3J95k53K0k20L91j85P4j05M8J65o0N3K4m3l11L53r8j08J53O0l5
5748F9k30K73k9k85J77nJ45mo7J71k97n4J83K04k85K08j94kO5J95j41M3r5j82
5772a37J75l12J32l5n1L42k77M45L5k99o8O0k0K0j62P3L37j37q7o9l08M22p3k05
5796a99J46o4L22j08k39j52K49K00k7m06M0K1K63K35m61o1l6O5nK64q9Q7O2r8
5820Ij39J04P1j12j28M58K6j25q1j90J32J80k63J7kK4K3o1K5R4j30L34j51K9j87
$$ [...]
8191H0
##END NTUPLES=NMR FID
##END=
