##TITLE=1H_DE-85_oil2
 200.13MHz, CDCl3,
 8 sc
 
 24.3.2025
##JCAMPDX= 6.0         $$ Bruker NMR JCAMP-DX V2.0
##DATA TYPE= NMR FID
##DATA CLASS= NTUPLES
##ORIGIN= UXNMR, Bruker Analytische Messtechnik GmbH
##OWNER= pz
$$ XWIN-NMR		Version 3.5
$$ Mon Mar 24 14:16:34 2025 Russian Standard Time (UT+4h)  she@DPX200
##.OBSERVE FREQUENCY= 200.1313
##.OBSERVE NUCLEUS= ^1H
##.DELAY= (6, 6)
##.ACQUISITION MODE= SIMULTANEOUS
##.ACQUISITION SCHEME= undefined
##.AVERAGES= 8
##.DIGITISER RES= 18
##SPECTROMETER/DATA SYSTEM= spect
##.PULSE SEQUENCE= zg30
##.SOLVENT NAME= CDCl3
##.SHIFT REFERENCE= (INTERNAL, CDCl3, 0, 14.3821)
##AUDIT TRAIL= $$ (NUMBER, WHEN, WHO, WHERE, WHAT)
$$ ##TITLE= Audit trail, XWIN-NMR		Version 3.5
$$ ##JCAMPDX= 5.01
$$ ##ORIGIN= Bruker BioSpin GmbH
$$ ##OWNER= she
$$ F:/spectra/data/she/nmr/H-C/1/audita.txt
$$ ##AUDIT TRAIL=  $$ (NUMBER, WHEN, WHO, WHERE, WHAT)
(   1,<2025-03-24 14:15:19.32 +0400>,<she>,<DPX200>,
      <created by zg, POWCHK disabled, PULCHK disabled
       configuration hash MD5:
       00 E9 B6 7A A2 85 ED C7 34 08 36 98 17 FE 4E 26
       data hash MD5: 16K
       87 BF B9 62 6C 1C 06 0B B3 28 B0 3D CC 6A F7 13>)
$$ ##END=
$$ 
$$ hash MD5
$$ D1 6E 10 01 AE 39 D9 D1 B6 34 14 B1 76 A2 3D 59
##$RELAX= 
##$RELAX= 
##$RELAX= 
##$RELAX= 
##$RELAX= 
##$RELAX= 
$$ Bruker specific parameters
$$ --------------------------
##$DU= <F:/spectra>
##$EXPNO= 1
##$NAME= <H-C>
##$PROCNO= 1
##$TYPE= <nmr>
##$USER= <she>
##$AMP= (0..31)
100 100 100 100 100 100 100 100 100 100 100 100 100 100 100 100 100 100 
100 100 100 100 100 100 100 100 100 100 100 100 100 100 
##$AQSEQ= 0
##$AQ_mod= 1
##$AUNM= <au_zg>
##$AUTOPOS= <>
##$BF1= 200.13
##$BF2= 200.13
##$BF3= 200.13
##$BF4= 200.13
##$BF5= 200.13
##$BF6= 200.13
##$BF7= 200.13
##$BF8= 200.13
##$BYTORDA= 1
##$CFDGTYP= 0
##$CFRGTYP= 5
##$CHEMSTR= <none>
##$CNST= (0..31)
1 1 145 1 1 1 1 1 1 1 1 1 1 1 1 1 1 1 1 1 1 1 1 1 1 1 1 1 1 1 1 1 
##$CPDPRG= <>
##$CPDPRG1= <>
##$CPDPRG2= <>
##$CPDPRG3= <>
##$CPDPRG4= <mlev>
##$CPDPRG5= <mlev>
##$CPDPRG6= <mlev>
##$CPDPRG7= <mlev>
##$CPDPRG8= <mlev>
##$CPDPRGB= <>
##$CPDPRGT= <>
##$D= (0..31)
0 0.7 0 0 0 0 0 0 0 0 0 0.03 0 0 0 0 0 0 0 0 0 0 0 0 0 0 0 0 0 0 0 0 
##$DATE= 1742811318
##$DBL= (0..7)
120 120 120 120 120 120 120 120 
##$DBP= (0..7)
150 150 150 150 150 150 150 150 
##$DBP07= 0
##$DBPNAM0= <>
##$DBPNAM1= <>
##$DBPNAM2= <>
##$DBPNAM3= <>
##$DBPNAM4= <>
##$DBPNAM5= <>
##$DBPNAM6= <>
##$DBPNAM7= <>
##$DBPOAL= (0..7)
0.5 0.5 0.5 0.5 0.5 0.5 0.5 0.5 
##$DBPOFFS= (0..7)
0 0 0 0 0 0 0 0 
##$DE= 6
##$DECBNUC= <off>
##$DECIM= 32
##$DECNUC= <off>
##$DECSTAT= 4
##$DIGMOD= 1
##$DIGTYP= 9
##$DL= (0..7)
0 120 120 120 120 120 120 120 
##$DP= (0..7)
150 150 150 150 150 150 150 150 
##$DP07= 0
##$DPNAME0= <>
##$DPNAME1= <>
##$DPNAME2= <>
##$DPNAME3= <>
##$DPNAME4= <>
##$DPNAME5= <>
##$DPNAME6= <>
##$DPNAME7= <>
##$DPOAL= (0..7)
0.5 0.5 0.5 0.5 0.5 0.5 0.5 0.5 
##$DPOFFS= (0..7)
0 0 0 0 0 0 0 0 
##$DQDMODE= 0
##$DR= 18
##$DS= 0
##$DSLIST= <SSSSSSSSSSSSSSS>
$$ [...]
##$SUBNAM0= <"">
##$SUBNAM1= <"">
##$SUBNAM2= <"">
##$SUBNAM3= <"">
##$SUBNAM4= <"">
##$SUBNAM5= <"">
##$SUBNAM6= <"">
##$SUBNAM7= <"">
##$SUBNAM8= <"">
##$SUBNAM9= <"">
##$SW= 18.0517328524113
##$SWIBOX= (0..15)
0 0 2 0 0 0 0 0 0 0 0 0 0 0 0 0 
##$SW_h= 3612.71676300578
##$TD= 16384
##$TD0= 1
##$TE= 0
##$TE2= 300
##$TE3= 300
##$TEG= 300
##$TL= (0..7)
0 120 120 120 120 120 120 120 
##$TP= (0..7)
150 150 150 150 150 150 150 150 
##$TP07= 0
##$TPNAME0= <>
##$TPNAME1= <>
##$TPNAME2= <>
##$TPNAME3= <>
##$TPNAME4= <>
##$TPNAME5= <>
##$TPNAME6= <>
##$TPNAME7= <>
##$TPOAL= (0..7)
0.5 0.5 0.5 0.5 0.5 0.5 0.5 0.5 
##$TPOFFS= (0..7)
0 0 0 0 0 0 0 0 
##$TUNHIN= 0
##$TUNHOUT= 0
##$TUNXOUT= 0
##$USERA1= <user>
##$USERA2= <user>
##$USERA3= <user>
##$USERA4= <user>
##$USERA5= <user>
##$V9= 5
##$VALIST= <valist>
##$VCLIST= <CCCCCCCCCCCCCCC>
##$VD= 0
##$VDLIST= <DDDDDDDDDDDDDDD>
##$VPLIST= <PPPPPPPPPPPPPPP>
##$VTLIST= <TTTTTTTTTTTTTTT>
##$WBST= 1024
##$WBSW= 4
##$XGAIN= (0..3)
0 0 0 0 
##$XL= 0
##$YL= 0
##$YMAX_a= 323136
##$YMIN_a= -402690
##$ZGOPTNS= <>
##$ZL1= 120
##$ZL2= 120
##$ZL3= 120
##$ZL4= 120
##$ABSF1= 10
##$ABSF2= 0
##$ABSG= 5
##$ABSL= 3
##$ALPHA= 0
##$AQORDER= 0
##$ASSFAC= 0
##$ASSFACI= 0
##$ASSFACX= 0
##$ASSWID= 0
##$AUNMP= <proc_1d>
##$AZFE= 0.1
##$AZFW= 0.1
##$BCFW= 1
##$BC_mod= 2
##$BYTORDP= 1
##$COROFFS= 0
##$CY= -3
##$DATMOD= 1
##$DC= 2
##$DFILT= <>
##$DTYPP= 0
##$F1P= 0
##$F2P= 0
##$FCOR= 0.5
##$FTSIZE= 0
##$FT_mod= 4
##$GAMMA= 1
##$GB= 0.15
##$INTBC= 1
##$INTSCL= 1
##$ISEN= 128
##$LB= 0.25
##$LEV0= 0
##$LPBIN= 0
##$MAXI= 10000
##$MC2= 0
##$MEAN= 0
##$ME_mod= 0
##$MI= 1.114404
##$NCOEF= 0
##$NC_proc= 0
##$NLEV= 6
##$NOISF1= 3.799351
##$NOISF2= 2.8
##$NSP= 1
##$NTH_PI= 0
##$NZP= 0
##$OFFSET= 14.38212
##$PC= 1
##$PHC0= -467.4437
##$PHC1= 12.99221
##$PH_mod= 1
##$PKNL= yes
##$PPARMOD= 0
##$PSCAL= 0
##$PSIGN= 0
##$REVERSE= no
##$SF= 200.129724274929
##$SI= 16384
##$SIGF1= 3
##$SIGF2= 2
##$SINO= 400
##$SIOLD= 16384
##$SREGLST= <1H.CDCl3>
##$SSB= 0
##$STSI= 0
##$STSR= 0
##$SW_p= 3205.1282051282
##$SYMM= 0
##$S_DEV= 0
##$TDeff= 0
##$TDoff= 0
##$TI= <>
##$TILT= no
##$TM1= 0
##$TM2= 0
##$TOPLEV= 0
##$USERP1= <user>
##$USERP2= <user>
##$USERP3= <user>
##$USERP4= <user>
##$USERP5= <user>
##$WDW= 1
##$XDIM= 8192
##$YMAX_p= 0
##$YMIN_p= 0
$$ End of Bruker specific parameters
$$ ---------------------------------
##NTUPLES= NMR FID
##VAR_NAME=  TIME,          FID/REAL,        FID/IMAG
##SYMBOL=    X,             R,               I
##VAR_TYPE=  INDEPENDENT,   DEPENDENT,       DEPENDENT
##VAR_FORM=  AFFN,          ASDF,            ASDF
##VAR_DIM=   8192,          8192,            8192
##UNITS=     SECONDS,       ARBITRARY UNITS, ARBITRARY UNITS
##FACTOR=    0.0002768,     1,               1
##FIRST=     0,             0,               0
##LAST=      2.2672688,     0,               0
##MIN=       0,             -402690,         0
##MAX=       2.2672688,     323136,          0
$$ Real data points
##PAGE= N=1
##DATA TABLE= (X++(R..R)), XYDATA
0@%%%%%%%%%%%%%%%qJ6j6J6j6J9k6L1l2L7m5N2o0O8p6Q5r7J12j28J43j58J74j94
38a03K17k40K66k95L25l59L97m36M80n29N81o41P07p77Q57r50J054j171J307j466
58g76J656j888K174k535L010l662M604o063Q565j3591K7096j22916k98364M92848
72I0158J46030l79378J80429K85897l12597j15045K69300r5515j76648J92924
82H5555q703k66814N0835J17979j43004L0735K06422n0607j00023J08921N3865
93H5161l7579M6115J6648o8388k5658n100k0892K749j3907k5156J2382j6575k3612
106g3812O4007K6657p8344J5360P6040n8304j3419J39506r885j26869P0227Q5459
118A16623j00873r864R7971p8231j12534M7450M710o8362N4822O1825p2724j8552
$$ plain form
0 0 0 0 0 0 0 0 0 0 0 0 0 0 0 0 0 -8 8 -8 8 -8 11 -15 16 -16 21 -24 28 -32 36 -40 45 -52 60 -68 75 -83 91 -103
38 -103 114 -126 140 -155 170 -189 208 -228 252 -277 304 -337 370 -407 450 -500 554 -617 690 -776
58 -776 880 -1008 1166 -1369 1641 -2021 2583 -3480 5085 -8506 18590 -104326 -402690 90158
72 90158 236188 -143190 37239 323136 10539 -104506 164794 69279 -107369 85555
82 85555 76852 -189962 -139127 -21148 -164152 -133417 73005 22398 -77625 31296 85161
93 85161 47582 93697 110345 41957 16299 11199 -9693 -6944 -20851 -46007 -33625 -50200 -73812
106 -73812 -9805 16852 -61492 -46132 29908 -28396 -41815 97691 87806 -39063 31164 116623
118 116623 15750 5886 103857 25626 -86908 -39458 -34748 -103110 -48288 13537 -59187 -77739
130g7739Q6110J1961j1515P3136J8926p8247j7051L5701j9820k4274K1526m035
142A4679n2722k2181L1930J3895j6674J9179K2850m2178k5585N5761K9609k0985
154G578K2929K3030m5862q864N9689p308n1055J7279j036p0603l408M9257k5340
167c3714k3293M3404J77k6660M6348L9452k6494K421K8112k6242k2180K8884j058
180B9157l7446m224K619k2044O278K6936q562k0564L692P117L768J2742J5812
193A5281Q057q540j4653R529K1492o56o123K20k1811k9695N122J0305j1767K944
207b0295J2358k2139j2689L7106K4702r318J1239J2317k2460q274K1051L47j5372
220H573J944j0565k4682N614J8452r457p702J0725q051j2992K0769K0336r564
$$ plain form
130 -77739 8371 20332 8817 81953 100879 22632 5581 41282 21462 -2812 18714 14679
142 14679 -38043 -60224 -28294 -14399 -31073 -11894 10956 -31222 -56807 -1046 28563 7578
154 7578 30507 53537 7675 -1189 58500 51192 137 17416 16380 -54223 -57631 -8374 -33714
167 -33714 -57007 -13603 -13426 -40086 6262 45714 19220 21641 49753 23511 1331 30215 29157
180 29157 -8289 -12513 -9894 -31938 -25660 1276 -7286 -27850 -24158 -17041 -13273 -531 15281
193 15281 23338 14798 145 9674 31166 30510 24387 24607 2796 -26899 -21777 -11472 -23239 -20295
207 -20295 -7937 -30076 -42765 -5659 19043 9725 20964 33281 10821 2547 23598 23945 8573
220 8573 10517 -48 -24730 -19116 -664 -10121 -17823 -7098 -15149 -28141 -7372 12964 3400
233C400j230J3839o831p953K0046J3140j6888j4923j157r727q829J0716L362j6453
247a9488o143P459k63N218K3379J2203j4112q258J0667M739l398N597J774j5597
261C777j4165J42L019L089N215n652j4603j908J0399M553L882J0436N72j1854
275c098O60J4620O040j126K255q331j6369k485P392k172n561O42n851r353P276
290a5461J4912K929Q65N553m721o805R540J1512n504q004J107m964q468M592Q157
305E240n272p921j187l026r96J0389O656p100k199P129K47r78J1436P675j1242
320H851r030K806j074l393M338p56j1160m406N502L2J775J0617K112j0038r66
335d790Q839J365m84N305j783r262r94M470r94j092L144m831q847J737N928j573
$$ plain form
233 3400 2170 16009 9178 1225 21271 34411 17523 2600 1443 -8284 -17113 -6397 -3035 -19488
247 -19488 -25631 -18172 -18435 -13217 10162 22365 8253 -5 10662 15401 12003 17600 19374 3777
261 3777 -10388 -10246 -7227 -4138 1077 -4575 -19178 -21086 -10687 -6134 -2252 8184 8756 -3098
275 -3098 -2438 12182 18222 17096 19351 11020 -5349 -7834 -442 -2614 -8175 -7533 -13384 -22737 -15461
290 -15461 -549 2380 3245 8798 4077 -2728 6812 18324 12820 4816 5923 959 -7509 -2917 5240
305 5240 -32 -7953 -9140 -12166 -13162 -2773 3883 -3217 -5416 1713 1960 982 12418 20093 8851
320 8851 -179 2627 1553 -1840 2498 1742 -9418 -13824 -8322 -8290 -6515 4102 6214 -3824 -4790
335 -4790 4049 5414 4930 10235 8452 -810 -1804 2666 1672 580 3724 -1107 -9954 -8217 -2289 -3862
351c862L13L741k667l798O288O506k281R16L379n450o207N518L921o594l110J824
367a563m229k979P174L782n774K47N061l524k636R265L973p383k774M219j211
382A648k017L868N12n211k154N32j568J025M894j120o156K226M180l85M63M479
398E216j027m879P59K391j165K74J464l995l910K388K681j777K19K797k969l810
414e343M554L995k215J37K308k652l429M366L984l639l252J541j776l550L878
429a093K885l139j157J571j820l87O902J827n850o66L630k813k189N503J194n707
445a309j215K267k333J193M629k220n095J978J958k808K359N074k763l961K619
460C73J794j108K074P18l832k574J289M5j74J157q5k455m88J620J770J738R46
$$ plain form
351 -3862 -3549 192 -2475 -6273 15 6521 4240 5156 8535 3085 -3122 2396 6317 -277 -3387 -1563
367 -1563 -5792 -8771 -1597 2185 -3589 -3342 1719 -1805 -4441 4824 8797 1414 -1360 2859 1648
382 1648 -369 3499 4011 -1200 -3354 -2822 -4390 -3365 1529 409 -5747 -3521 659 274 737 5216
398 5216 4189 -690 69 2460 1295 1569 3033 -962 -4872 -2484 197 -1580 -1361 1436 -1533 -5343
414 -5343 -789 3206 991 1128 3436 784 -2645 1721 5705 2066 -1186 355 -1421 -4971 -1093
429 -1093 1792 -1347 -2504 -933 -2753 -3140 3762 5589 -261 -927 2703 -110 -2299 3204 4398 -1309
445 -1309 -2524 -257 -2590 -1397 3232 1012 -4083 -2105 -147 -2955 -596 4478 1715 -2246 373
460 373 2167 1059 3133 3851 19 -2555 -1266 -1221 -1395 -238 -323 -2778 -3266 -1646 124 1862 2808
477B808j399k149k75J645J699n96j110L76j285k633K256L280j348k745L68j299
493b407j836L179K793k615m10K595j963j087N003K483m384j493J306k269q09L204
509A290p56k766L67L80j490K049L294j398j685N14k27o1J667J108j372j49k63
526E02n80K24K082k85k265j156l97J09P9P77N54n20p76N60J631R32N18O98p50
545A937k201O79J205j036q44N2m09j122O81P50m55M25K82j532K24K122L44j323
563b21L85R18l22k40Q98M34n45j078o76j41k17Q6k07p30j26J042j37j25J708P17
583A423r23j60J379r53n79J209l18j926P13J037k191K44J660j202j313J741K13
600E4j421J099J132j845L94K529p46j397J432J49j928M83J069j498j34N78j378
$$ plain form
477 2808 1409 -740 -1015 630 2329 1733 623 999 -286 -2919 -663 2617 1269 -1476 -1108 -2407
493 -2407 -4243 -1064 1729 -886 -1296 1299 -664 -1751 3252 5735 1351 -142 1164 -1105 -1914 1290
509 1290 534 -2232 -1865 -1485 -2975 -926 2368 970 -715 -201 -428 -489 1178 2286 914 765 502
526 502 -78 146 2228 1943 -322 -1478 -1875 -1766 -1687 -910 -356 -876 -1652 -1092 539 1471 1989 2687 1937
545 1937 -264 415 1620 584 -260 -208 -617 -1739 -1058 -308 -763 -338 -56 -1588 -1364 758 1102 -221
563 -221 164 1082 760 520 1418 1852 1307 229 -447 -588 -805 -719 -926 -1656 -1782 -740 -877 -1002 706 1423
583 1423 500 340 1719 766 187 1396 1078 -848 -135 902 -1289 -1045 615 -587 -1900 -159 54
600 54 -1367 -268 864 -981 -587 1942 1196 -201 1231 1380 -548 -65 1004 -494 -628 -50 -1428
617a428m53J564M84l37j90N78j93J57L31L30N98p90r67J52Q23o99q1N95j123l88
637a037J016l72n30J228M18j614K13J841m66n46R95o84j185J067P7j300J152O23
655H96k165l96J881J66o60P92O03j663j86J751o92l60O64O5j244L0J011O6q97
674c38J15J69r46O3Q10K50r50P16P04p98M5J741l50j133L79q3o41k71O86j83j051
695a066N83O2n70J057J120q19p42J018k71o33Q07L72o87j38K25m41q1L82J72n47
715a97n25L34j08n59Q28M01k94k53O38K16n3P48j05p17l72M41l51q91K4P30q39
736i04m26J029K67n69O94N80q23k19J291m13r86R04J96o81j01O70p2o00L68n22
756c17p79O29K8m68n0P62K09l49M96M77k4l3O37k61q17J35k79o23J0N63l88m79
$$ plain form
617 -1428 -1881 -317 167 -170 -360 218 25 182 513 843 1441 651 -316 -164 659 -40 -121 474 -649 -1037
637 -1037 -21 -393 -923 305 723 -891 -678 1163 697 151 1146 462 -723 344 421 -879 273 896
655 896 -1269 -1665 216 382 -278 514 1117 -546 -732 1019 327 -33 631 696 -548 -518 493 559 -338
674 -338 -223 -54 -1000 -937 -127 123 -827 -111 593 -205 -160 1581 1231 98 477 394 -247 -518 168 -15 -1066
695 -1066 -483 -421 -991 66 1186 367 -375 643 372 -261 546 918 231 93 318 -123 -204 178 350 -197
715 -197 -722 -388 -496 -1055 -227 174 -120 -373 265 481 428 1176 1071 354 -18 423 72 -819 -795 -65 -904
736 -904 -1330 -301 -34 -603 91 671 -152 -371 920 507 -479 425 621 -60 -161 509 437 -163 205 -317
756 -317 -1096 -467 -439 -907 -957 -195 14 -335 161 638 614 581 1218 957 140 275 -4 -627 -617 -54 -442 -921
778i21L31M62ql02R57l2p23L33J32l55J29R77m26q05J054k63q40J07M57p30o32
799a098P01j13j7L63L25m70K83Q19p0k08O9J15k01j024N07k1j24l4K99n10j56
820e65L42K90j31P9L42n50j70M43M4N0L19j91n52%O16On78M60k82o07K48N99k18
843fj51J59j07J44K01M08m18m23J23j26n10N39O52m42m60N28j84J70j4O09o29
864F3j21l26K65q8K81L70l96j83R2m1l42N79J27k96k21n1J20q3M57J67k17j86
886c0K71K14m18L72l23k65j31J65M9q5N56k93p5L7M04j61j28L46k32m34L5J72
908D6K97k54K66m14j92L85L66k63l27l2r1l38K55M28k03oJ95K67l20M66l0m07
930I4n79O55j89l14J39K57l78J38J7J70J87O4No57M26L42l62K70k3j54j06k6J34
$$ plain form
778 -921 -590 -128 -136 -438 519 487 -236 97 229 -126 3 980 554 -251 803 540 -300 -193 264 -466 -1098
799 -1098 -397 -510 -527 -164 161 -309 -26 793 723 515 584 699 498 -526 -19 -40 -164 -198 101 -409 -565
820 -565 -223 67 -64 15 357 -193 -363 80 124 174 493 302 -250 -250 366 372 -206 254 -28 -635 -387 212 -6
843 -6 -157 2 -105 39 240 648 230 -193 -70 -196 -706 -167 485 43 -417 111 -73 97 83 692 63
864 63 -58 -384 -119 -207 74 444 48 -135 -43 -84 -426 153 280 -16 -237 -288 -168 -251 206 373 156 -30
886 -30 241 455 37 409 86 -179 -310 -145 -96 -181 375 82 7 44 448 287 159 505 273 -161 -126 46
908 46 343 89 355 -59 -251 134 500 237 -90 -122 -213 -551 -296 132 -71 -77 118 385 65 531 501 94
930 94 -485 170 -19 -333 -194 63 -315 -177 -160 10 197 261 266 -391 35 377 15 285 262 108 2 -24 110
953A10K15k24P0k59j45J1J32q1j63K91P6K0j05N22j91k99L93ko82p7O32l02l59
976d17L55J2M8j50O56m46j03j4L13l50J91R5o07K26K57R5l46Q32k40n44k9K90
998A24k78j3J12Qo5k27K87l17L87J29j69m20L53j81K50J97k07q3J03r5K66l48
1020a87K51J45j94l88K59K46j00j56k5R6k63L03K48j14j44K26k31l38O05J55m54
1041f0j79L22m09j65N84J71k81o5K34n74K33L27K55n12P6%L4K78k39J84o1l73
1063b20K50j8j23L06R1l33k08K12j9J30m5K90n45Q8P4N4j98M04J07n81m1M42j44
1086b7L16M1l01l77L56O4r7J34j95n8j05L20N5o3r4K98m6j06J45k40K37j42k94
1109a79K8J43J54p1K6l9j6k0k12K09J93j94j28J09J96j76q6K22l62RM5MK6K44
$$ plain form
953 110 325 101 171 -88 -233 -222 -90 -171 -334 -43 33 53 -52 470 279 -20 373 371 -311 -388 244 -58 -417
976 -417 -62 -50 -2 -152 504 58 -45 -59 254 -96 95 190 -417 -191 66 161 -185 647 407 -137 -166 124
998 124 -154 -167 -55 -47 -112 -339 -52 -369 18 147 -22 -442 -89 -270 -20 177 -30 -113 -10 -105 161 -187
1020 -187 64 209 15 -373 -114 132 32 -124 -149 -53 -316 -13 235 121 -23 203 -28 -366 239 394 -60
1041 -60 -239 83 -326 -491 93 264 -17 -82 152 -422 -189 138 393 -119 -43 -43 -9 269 30 214 153 -220
1063 -220 30 12 -111 195 286 -47 -255 -43 -62 68 23 313 -232 -144 -70 -16 -214 190 297 -284 -325 117 -27
1086 -27 289 330 29 -348 8 72 -25 109 -86 -144 -249 71 126 63 -31 267 221 115 260 20 257 115 -179
1109 -179 -151 -8 146 75 101 62 46 26 -186 23 216 22 -106 3 199 23 -63 159 -203 -194 -149 -145 -119 125
1133A25j78L6j60J98k60K33L87m26J3r4K97j00P7K65n32J60J6j18q4r3M78l92
1155a52m6R8P4j89L84m01l3L90j02L16l65K32j85j38n7K9o9K63q7k72L33j47L07
1178A83k54l2M2q3J31j42J48j73p1L60r5k59M64k76J30j51R9M0l7j83kK66m7j36
1202g8K23j94M0J23l4k59O9P9k49K33j19K2K24k53K17N8j44M27m43M9K34k80J91
1225A36l55K44J1l15J83j5L85m49J09j89K57oo0l4k1Q3J04lQ3Q1k18j10l48O31
1249A84m09L53j61L6q5j45L62k59K34n1Nk6K08m50Q7J57J7k66J35j31J54K7J20
1272I6Pk17J91J28k93j60K09N2Q3J50k01lJ78P3n58J56J72Q6k77K43k32k83L71
1295b9j98k8K3L05J15p1q0K87k63j3q9K11j32k69J23K00k49N2L12k83J31K09J36
$$ plain form
1133 125 -53 -17 -177 21 -239 -6 381 -45 -32 -126 171 71 148 413 -119 41 57 -61 -145 -238 240 -152
1155 -152 -198 -100 -26 -215 169 -232 -265 125 23 339 -26 206 21 -117 -174 -145 -214 49 -38 -310 23 -124 183
1178 183 -71 -103 -61 -144 -13 -155 -7 -180 -251 109 14 -245 219 -57 73 -78 21 61 24 -159 -161 105 58 -78
1202 -78 145 -49 -9 114 80 -179 -110 -31 -280 -47 -166 -144 80 -173 44 102 -42 385 -58 -9 225 -55 136
1225 136 -219 25 36 -279 -96 -111 274 -175 -66 -255 2 -4 -64 -98 -119 -36 68 65 148 229 11 -99 -447 184
1249 184 -225 128 -33 3 -82 -227 135 -124 110 59 64 38 246 -204 -117 40 57 -209 -74 -205 -51 -24 96
1272 96 103 -114 77 205 -88 -248 -39 13 96 246 45 42 220 293 -265 -109 63 149 -128 115 -117 -400 -29
1295 -29 -227 -255 -232 73 188 117 37 324 61 48 -41 170 38 -231 -108 92 -157 -105 207 -76 55 264 400
1318D00n55j63M09j34J34l03K28L1K5k11J61j64J21k44j9K17J9L35k16j58J85
1339I8m8O6n6j0j13J70k25j23L04O6j65j51J38j30L18J57l42J51k78QQ9J87j78
1362f7J79j5o6Q4Q7l24K65P4J08m91j40K83J10j19O9P3j52L10l11o7J25q9j29
1385b03K02n30N07r2J58k41J29J25O3l11L77j89J08m25L05K67k77J96k43o7J17
1406b4K25l64K8J73N7J3m44J52L44K45m21j30R8K5m3J33j19K67k75k16L28l1n0
1429b9P7mp0j86K79k09K74k79K64j15K4nl2j13O0J02j0k3L84m10m4k2L75j98j04
1454a4L6k9o2j12L96k14L4J70q8m47M29r0m9j14R8J01N5j78J84mK00k10N5r6J74
1479B25j35j01J16l35J46J24O0J93k13j69K89l58K77J19k6k68R7M2%m3l05O50
$$ plain form
1318 400 -155 -318 91 -43 91 -212 16 47 72 -139 22 -142 -21 -265 -284 -67 -48 287 71 -87 98
1339 98 50 116 60 50 -63 107 -118 -241 63 129 -36 -187 -49 -179 139 296 -46 105 -173 -165 -76 111 -67
1362 -67 112 97 31 115 202 -122 143 217 325 -166 -306 -23 87 -32 37 110 -42 268 -43 -110 15 -74 -203
1385 -203 -1 -531 -24 -116 42 -199 -70 55 118 -193 184 -5 103 -322 -17 250 -27 169 -74 -141 -24
1406 -24 201 -163 -135 38 95 108 -336 -184 160 405 -16 -146 -48 -23 -66 67 -52 215 -60 -276 52 21 -29
1429 -29 48 44 -26 -212 67 -142 132 -147 117 2 26 21 -11 -124 -64 38 28 5 389 -21 -65 -87 288 90 -14
1454 -14 22 -7 -69 -181 215 1 35 205 117 -330 99 9 -40 -154 -56 45 100 -78 106 102 302 92 147 51 225
1479 225 90 -11 105 -230 -84 40 100 293 80 -89 200 -158 119 238 212 -56 41 83 83 40 -265 385
1501C85n10L38l97L0l7R3J66mr9N1l2K8j13l5K18J42J36k96q5LM8L03m29J02p4
1526f8J59j46L03k39K8m5o5J21P7j89J01n4J1M16o86K73k11J35K7K68n6k63K56
1549A53j63j97J48L38n15N9K16Q1M1l63M4J19k2K5J42m3j91J48j42Q1k1K96q1
1572A53J5j83K16j74n2P2Mq8o3L09k05j74J5K74O3k53n1K57j2l17J13j15K18o5
1596d3K4l0k14J39L11k09J24L6k05J6J1l07K14L11l14K03jO4r1O9k21K91qj28
1620D2J92j10j07p3O1M6j50K44k11K0K19n5j03N7O0j12j43M2N5n9Q1j49j17J99
1644g1j13L78k82J79j15j61K76l6k30K27lJ55m06K09j82J83j99K17OK1P9l55K32
1667IO4j0jl0K72o0k20k7K29l70L63m00M35j33P2r4j64q3Qk63L66j01K77j17K7
$$ plain form
1501 385 -125 213 -184 -154 -191 -98 68 64 -35 16 -16 12 -101 -136 82 224 360 64 -21 -18 30 333 -96 6 -68
1526 -68 91 -55 248 9 37 -8 -73 48 125 -64 37 -17 -6 410 -276 -3 -214 -79 -52 216 160 -103 153
1549 153 -10 -207 -59 279 -236 -177 39 120 161 -202 -158 -39 -61 -36 106 63 -128 20 -122 -41 -62 234 153
1572 153 168 -15 201 27 -25 47 51 -37 -100 209 4 -170 -155 119 182 -71 -122 135 123 -194 -81 -196 22 -43
1596 -43 -19 -49 -263 -124 187 -22 102 138 -67 -51 -40 -347 -133 178 -136 67 66 130 39 108 -113 178 170 42
1620 42 234 124 17 -56 5 51 -99 145 -66 -46 173 118 15 72 132 20 -123 -81 -26 -85 -4 -153 -270 -71
1644 -71 -184 194 -88 91 -24 -185 91 55 -175 52 49 204 -202 7 -175 8 -191 26 32 53 132 -223 9
1667 9 73 63 62 32 304 244 24 -3 226 -144 219 -181 254 121 193 99 -65 -148 -140 -403 -37 -138 139 22 49
1692D9j7L5lr3q3J74Q1j53p1R3j22J72n5J52k97N6K42m46K28O7l47M76m5j07N4
1717D0j01L5k3j27K65j31O7J29N5k77OJ14P9j52%j44J43J4J8kj23J20J67j20K40
1742B92l98kJ59k17Q1q7M56l28P0q1J06J38j11j61p3oj64N64j84l84J55K18m84
1765d41L25o2K39O3k21j96K41j3l3P5J21m1j85n3L56l4j21R1P3j24j37L20l61
1788a18K53J33j79J13J0l46K34k03J39J22o6L6r8k50J49L8q4Q8K74k57j03J09
1810fK20k30K29j65M8j4k88K66ll36J89N0R4k56R6M2N4N0q2l5l00K79L43l46k9
1835a30J85k78J43P7k2m34L33K11J23m11J16J29j45j16N1K29O4j30j34l1K08l24
1857b86J89J80j71oQ5J27Q4l68K20j16K0J6O0j10J9M8j04J12N3J41l0l2k97J09
$$ plain form
1692 49 32 67 64 -29 -112 62 143 -10 -81 12 -110 62 7 159 -138 -82 160 -286 -58 9 -338 138 93 -14 40
1717 40 -61 -26 -49 -176 89 -42 25 154 209 -68 -62 52 131 -21 -21 -165 -22 -8 10 8 -115 5 172 52 292
1742 292 -106 -108 51 -166 -85 -172 284 -44 26 -55 51 189 78 -83 -156 -162 -326 238 54 -330 -175 43 -441
1765 -441 -116 -178 61 124 -97 -293 -52 -65 -98 -23 98 57 -128 -181 175 141 20 111 184 60 -77 243 -118
1788 -118 135 268 89 202 212 -134 100 -103 36 158 92 128 30 -220 -71 -33 -117 -29 245 -12 -115 -6
1810 -6 214 -16 213 48 96 82 -206 60 57 -279 -90 -40 54 -202 -106 -64 -10 40 -42 -77 -377 -98 245 -101 -130
1835 -130 55 -223 -80 -3 -25 -459 -126 85 208 -203 -87 42 -103 -219 -168 61 125 -5 -139 -170 38 -286
1857 -286 -97 83 -88 -94 -9 118 202 -166 54 -62 -42 -26 34 -76 -57 -9 -113 -1 52 193 163 131 -166 -57
1881e7J11J15l55J54j6M5L3j02L10m16K14J78k64J68m05P7L84j79Q1j55M13m96
1903a62j56J69K62J63p68N85l03J53J78j38%K6j4j2K19k38j27j5K00kl5j4R4k46
1927a81J76K14n2R4m25J09J83K0j79J11J9Q3j85o7J52k25L49l07J70j02j90K24
1949iJ6j57N4K56J38l16k73K87J43k8j19o3K20k62K14o8K0J43m65K05K70k27K6
1972Ej25q9N6O4Q8J82Kj47J43k13o3K12l18K73J47k00L5j30qJ71L4k54K15j54
1996g4O4Pj37j03K69l6O8L7l26P2J34O4J2j17L46l04m0m9J29K7L38l51M2j41o5
2021a34M6J15N4j95J5J27m6J53k83P1J13J2J11m1m06L02J59j97K0j19K49o8j51
2044i3Q7j75P5K26m1J18o30O39P0m09L4J22K10k74r0K06R8O8k68n7r4p4K0M7J81
$$ plain form
1881 -57 54 169 -186 -32 -48 -3 30 -72 238 -178 36 214 -50 118 -287 -210 174 -5 76 -79 334 -162
1903 -162 -318 -149 113 276 -492 93 -210 -57 121 -17 -17 9 -5 -17 202 -36 -163 -178 22 20 -15 -29 65 -181
1927 -181 -5 209 157 251 -174 -65 118 138 -41 70 89 172 -13 -80 72 -153 196 -111 59 -43 -233 -9
1949 -9 7 -150 -96 160 298 -18 -291 -4 139 111 -8 -71 149 -113 101 33 53 196 -269 -64 206 -21 5
1972 5 -120 -209 -153 -89 -1 181 183 36 179 -34 -97 115 -203 70 217 17 52 -78 -86 85 119 -135 80 -74
1996 -74 -10 -3 -140 -243 26 -10 58 95 -231 -159 -25 39 51 -66 280 -24 -64 -113 16 43 381 30 72 -69 -134
2021 -134 -88 27 81 -114 -99 28 -18 135 -148 -77 36 48 159 118 -288 14 173 -24 -4 -123 126 58 -93
2044 -93 -6 -181 -106 120 79 197 -433 206 276 -133 -99 23 233 -41 -131 75 173 241 -27 -84 -178 -252 -232 -185 -4
2069dM3J05l19L83m51K91R3K39l82r6N3J11j73J14p9K10k64K84j73J20j28N5n5
2092b3k05L62j85J92j00r3N4j19k6J70k14J27j06J19j00R8q3m3K86k71J5N8M05
2115C18l3k84l0j98K34l2O7r6J91J3J67m12K15K1Ok12j37L25k09L17n25M05N2
2138A63m02K47k55OJ73j70L59k38k31L30o5K51l35L71j13o0M7l7j58J27J78k54
2160f6J30o2N8Oj11k3O9J82J02p4n34j3L01K4q6J62J63l64L68k63n3K07j82K69
2184B10q8lk5k44L08l18L09j43r5K52nk61j61K93j26l6j0J62Rj85N6K51k08l3
2208i1K00j11J21k3j6m7Lj4Kj83j7K33j53J44J48l55n3L91j04K9kQ2k42j51K73
2233F4o7j64K43m4K04j24k80K88k82J26K4J54L13m08M7n8L4j04k5Q4K33l05J7
$$ plain form
2069 -4 39 144 -175 208 -243 48 141 380 -2 -98 -45 66 -107 7 -72 138 -126 158 -15 105 -23 32 -23
2092 -23 -228 134 -51 141 41 -52 2 -117 -143 27 -187 -60 -166 -47 -147 -49 -132 -175 111 -160 -145 -87 318
2115 318 285 1 -29 -227 7 -25 42 -54 137 150 317 -95 120 141 147 -65 -202 123 -86 231 -294 111 163
2138 163 -239 8 -247 -241 -68 -238 121 -117 -348 -18 -83 168 -167 204 91 31 78 41 -117 10 188 -66
2160 -66 64 2 60 66 -45 -68 1 183 285 211 -323 -336 -35 -11 -97 65 228 -136 232 -31 -84 123 -59 210
2184 210 122 119 94 -150 158 -160 149 6 -89 163 158 -103 -264 29 -97 -133 -143 19 28 -157 -101 150 -58 -91
2208 -91 109 -2 119 96 80 33 36 22 24 -159 -176 57 -96 48 196 -159 -212 179 75 104 102 184 -58 -209 64
2233 64 -3 -167 76 32 236 112 -168 120 -162 -36 -12 142 455 47 94 36 70 -34 -59 25 258 -47 -30
2256c0k4J31k13M33k41r7P5M3j70R4K0M6K12k58Q6l2Pk30K49j37r9R9k17M32k02
2281b3J50j01M4O9j05k45L97j02R2j11R5K6k84J38M2j45l1J64Q4r3J44j95o2J1
2305d1O7k2O2J86j93j84J1j9L02j02k17M09l19Q3k85J47N7K19j87j34K49L0n05
2328c86M45K0j12K4l3l26M99q8J93j28k8O0n1K78j85N5l40J25K17j88p3l33L62
2351Gn0J8j72P6J03Q6k75J80j85N5N23n32L4j17J17J86k27M4J26J96j92J20n7
2374F4K2j09l08L07J6M3K9J15l3J01m21K89j01J40j29P3m0r5j1oJ65k87M6K12
2398H2l39L78l35K33n4P6J45k85K19j08J78l82J83K52k78Q2j99K47q8r5P3k7m9
2421i1J03J60k62K64j64K16k44N0M7J37m86q6M16j28P1Q8O2J7J45l41j59P7K83
$$ plain form
2256 -30 -54 77 -136 297 56 -41 34 77 -93 1 21 67 279 21 107 75 82 -148 101 -36 -135 -36 -253 179 -23
2281 -23 127 26 70 139 34 -211 186 84 176 65 160 186 -98 40 82 -63 -94 70 154 61 205 10 -52 -41
2305 -41 26 4 66 252 59 -125 -114 -133 169 67 -150 259 -60 23 -262 -115 -58 161 -26 -160 89 119 -386
2328 -386 59 79 -33 -9 -42 -368 131 43 236 108 80 140 89 367 182 237 -103 22 239 51 -22 -355 7
2351 7 -43 -25 -197 -121 -18 68 -207 -27 -212 -157 366 -166 -132 -249 -132 54 -173 -129 -3 193 1 121 64
2374 64 86 -23 -331 -24 -8 35 64 179 146 247 -174 115 14 154 25 98 58 -37 -48 -54 111 -176 -130 82
2398 82 -257 121 -214 19 -35 41 186 -99 120 12 190 -192 -9 243 -35 47 -152 95 7 -88 -15 -42 -91
2421 -91 12 172 -90 174 10 226 -18 32 79 216 -270 -356 60 -68 3 91 153 170 315 -26 -185 -108 175
2444A75k07J3j71J54j28j00M14j78J99j90K0j30J07L5K6K45l87J32J90l12Q0O3
2466E0P3k55K34l5m8MJ10l06J96mj50L43l57K86l08M66k34K0j67j1Q0Q7K7l7j58
2491i4k0J7K70k21J23jj06J57j24J17j06K19j17Rk89J38q5J10J04k02l8L06q0
2514H7m08K44j61O3L2K46J36m10J72k92J43Q1p4NJ3J65K1N0k05k3J13j21j12J76
2538e9J95K8k44L2P3K1QRJ38j29k44K69k37L99k72J19RL7m2k25K75m08K57J17
2562A26n0r0J42l05K11r5J45l81J15K92p0J11k14j97L55k8j46J16k28L15j06j8
2584@j71J59M1j91J74l1J59j26l1J01j80K13k60P8J08J18j65n8J03k3n6l1L6J87
2608A54k84K35k64k33M72r5j84K89j86J95j18J53l26K50j8J69k00r4J09k6l9K3
$$ plain form
2444 175 -32 -19 -190 -36 -164 -264 150 -28 171 -19 1 -129 -22 13 39 284 -103 29 219 -93 -13 50
2466 50 123 -132 102 67 19 23 133 -173 23 19 -131 212 -145 141 -167 299 65 85 -82 -93 -13 74 101 64 -94
2491 -94 -114 -97 173 -48 75 74 -32 125 1 118 12 231 114 123 -166 -28 -113 -3 101 -101 -139 167 87
2514 87 -321 -77 -238 -175 -143 103 239 -171 1 -291 -148 -67 -141 -136 -123 42 63 113 -92 -115 -2 -123 -235 -59
2538 -59 136 164 -80 -48 25 46 54 63 201 72 -172 97 -140 259 -13 106 115 152 110 -115 160 -248 9 126
2562 126 76 -14 128 -177 34 -61 84 -297 -182 110 40 151 -63 -260 95 67 -79 37 -191 124 18 0
2584 0 -171 -12 29 -162 12 -19 140 14 -17 84 -96 117 -143 -65 43 161 -4 -62 41 18 -38 -69 -33 154
2608 154 -130 105 -159 -392 80 -15 -199 90 -96 99 -19 134 -192 58 40 209 9 -85 24 -2 -41 -18
2630a8P2p5r8j29J99K88k42j21L83m06K03j76R0J29k25R8N1j32mJ21P4l23L88
2653A47j03Q4r5mP6k4l62JL77Pl36M28J25l06k38L82j63J3n5J8J89l44J43R2m9
2678CQ8k13J93l12J33O7N6m8l7J49j64j55M16j41J4J41m1l11k43K29L66j34m8
2701HOL7p1OL3k28J61k45L64R2o9j86L3L9j47K34oJ38l78M59m58K62k73oM40k44
2727Aj51L76k46j56J17K48j21J93P7l14L9k37J40j02M7J6R3K7J44l68oL07k82
2750a58M4L48l00K5J91j8k83J66r4n8J87n2J47j10o9j09L12j23K55m97K39r2K15
2773A66q9j05MK98l29j26K68k85L32r5l6Q0k12n3J29j78L04r8k73L01J3J05o3
2796E8N1k26N6J57j81J01j89R3K24q6P6j55O6J24p3r3j65J16J18j22J30p1k14
$$ plain form
2630 -18 54 -21 -119 -248 -49 239 -3 -124 259 -147 56 -120 -30 99 -126 -28 23 -109 -113 8 82 -241 147
2653 147 44 128 33 29 105 81 -281 -280 97 104 -232 196 321 15 -223 159 -4 9 -46 -28 161 -183 -40 52 3
2678 3 91 -122 71 -241 -108 -41 15 -33 -70 79 -85 -240 176 35 49 190 149 -162 -405 -176 190 56 8
2701 8 14 51 -20 -14 19 -209 -48 -293 71 163 94 -92 -59 -20 -167 67 61 199 -179 280 -178 84 -189 -195 245 1
2727 1 -150 226 -20 -176 -59 189 68 261 338 24 63 -174 -34 -136 -89 -73 20 47 191 -177 -183 124 -158
2750 -158 -114 234 -66 -41 150 132 -151 15 -79 -137 50 -2 145 35 -34 -143 169 46 301 -196 43 -49 166
2773 166 77 -28 -24 274 -55 -181 87 -198 134 39 3 83 -129 -182 -53 -231 73 -25 -298 3 16 121 58
2796 58 109 -117 -61 96 -85 16 -173 -80 144 58 134 -21 45 169 96 3 -162 -46 72 -50 80 9 -205
2819b05L29L1l06J38L0l45L99j63J53j71pJ13P3K0l63O8LK91j96L38l48K16l4
2842F4k82R6J27J03J87k14k63K04M8r6P1n8k77N60m58o4Q6n9J31k7M2K82m43J62
2866g8J8J82k28K49q6j41k38P4O1L25j60K01J37m68J82n7J9K37k02o7p4L33l05
2889h6P2J72N4k76j08J81J6p4K95k27j58o9J48KK6M8j15K42p6R6m9N9m34J39k19
2914c41K89l9j64N29l49P5n7R2j98L13j19l1J24Q0j01j52k7J11l7J75m08N8J82
2937Ej45J70l9k0j95k8O9M0K65m22K72L72k58j23j02j56J96k26K26M66l03j91
2959a27K35NJ29j86q1r9J40J19m01J95j04J72k21O0J20j26L10j51N9P3k97J07
2981f9r3K04r4L27k03k29K06j05l8j36L04O9m6l82K94M3k63K05J96k0j56K9k08
$$ plain form
2819 -205 124 155 -151 -13 17 -328 71 -92 61 -110 -117 -4 69 89 -274 -206 -203 88 -108 230 -118 98 64
2842 64 -218 -122 5 108 295 81 -182 22 70 -26 45 -13 -290 270 -188 -252 -166 -225 -94 -121 -79 203 -240 -78
2866 -78 -60 122 -106 143 57 -84 -322 -248 -187 138 -22 179 316 -152 30 -27 -8 229 27 -40 -114 219 -86
2889 -86 -14 158 212 -64 -172 9 25 -49 246 19 -139 -208 -60 -58 -32 16 -99 143 67 163 114 173 -261 -122 -341
2914 -341 -52 -91 -255 274 -75 0 -57 35 -163 150 31 0 124 204 103 -49 -76 35 -2 173 -235 -177 5
2937 5 -140 30 -9 -29 -224 -252 -183 -143 122 -300 -28 344 86 -37 -139 -295 -99 -325 -99 367 64 -127
2959 -127 108 113 242 56 -25 -124 16 135 -266 -71 -175 -3 -224 -164 -44 -170 140 -11 48 121 -176 -69
2981 -69 -162 42 -52 275 72 -157 49 -56 -94 -230 74 143 97 -285 9 52 -211 -6 190 170 14 43 -165
3004a65J22J31m1q9LK11l4k45M3K54j12J4j60J23J57k5m27L79j74M0N2m8j27M63
3028C45j78m5j07J37k00N9k89J88L41j97j99L5n9J27j68L19j28p0L3J65P5j2m3
3051A29j97J1j69K19j77K09j89K22o3On3pN5K02k38J76j15k4L5J41l40K70j33
3074c0K3K00k38K3j1kp5L39l87K21j2j9J08N3j50j62M44k52o6O1j2K54k52j73
3098a15K10k03R3RJ45K1k94L08j59n0J28J55j86j1j19J42l07M20q8K9j14k33L08
3121H9l03L19j22J46n5J44j06l12K3L50l61K05k33K57m3J33j47k13J98Q7n6j37
3143a37J76Rl6K70j97j83L1j99L42Qk77J55J42J12k17j48M4O7n9K34l9J07r2o6
3167D7k5J72l27Q9L00o9L7m75k3J12K68r6j88J21K39n5j52m0l56P67m52L12j14
$$ plain form
3004 -165 -43 88 47 -42 -39 172 138 -107 -64 190 78 92 -68 55 212 187 -240 139 -35 5 57 9 -118 345
3028 345 167 122 15 152 -48 11 -278 -90 251 54 -145 -110 -169 -42 -210 109 -19 -89 -56 109 184 172 129
3051 129 -68 -57 -226 -7 -184 25 -164 58 -5 1 -52 -59 -4 198 -40 136 21 -3 32 173 -167 103 -30
3074 -30 -7 193 -45 -22 -33 -35 -110 229 -158 63 51 32 140 193 43 -119 325 73 7 68 56 310 58 -115
3098 -115 95 -108 -15 -6 139 160 -134 174 15 -35 93 248 62 51 -68 74 -233 187 99 128 14 -219 89
3121 89 -214 105 -17 129 74 218 112 -200 -177 173 -188 17 -216 41 -2 131 -16 -229 -31 56 0 -137
3143 -137 39 48 12 282 85 -98 -67 -266 76 84 -193 -38 104 216 -1 -149 -105 -38 -97 137 98 205 113 47
3167 47 22 194 -133 -44 256 187 224 -251 -274 -162 106 10 -178 -57 182 127 -25 -65 -421 346 -106 206 92
3190I2J02j55K01k4o5R3l58j33K07J49j66q6J32j4m8j24K57l3j38K59L65n31J26
3213A08k79K32J9k0J84j71r6J49k53K72k30J98k04n0J24J52j10l37J39N5J35k20
3235b03j16L74l90L28J73m7k58l12P61j55l12J06K77j34j70j15M12j49J50m25
3255b05n5J95j75L68j70J12n7j17j17M6L40J32l47O7J3j46J69j07K7p6QK62l60
3278a93K95Q8j69j60n8L37l6o2k97K26K4J15j10j94J51p7J82k98N05k16m3R5j27
3301b2L6J1o9J01oj99m1K0M15l24oLm7J64J83l27R3R4m0Nk15p9J78n1n9M0J23
3328a9j24J94mo9l4Q7R3k3K19k75R0nj74J40J68n05K15K7J22m69L04J47k39l3
3352a67L7R5J9J41Pk52k0K02j30j37J19J56q0N9J10J88n33j1O5o1K52R2k58J87
$$ plain form
3190 92 194 39 240 216 151 244 -114 -247 -40 109 -57 -143 -11 -25 -73 -197 60 27 -111 148 513 -18 108
3213 108 -171 61 80 60 244 73 -23 126 -127 145 -85 113 -91 -141 -17 135 25 -312 -173 -118 17 -203
3235 -203 -319 55 -335 -7 166 119 -139 -451 310 155 -157 -51 226 92 -78 -193 219 70 220 -205
3255 -205 -260 -65 -240 128 -42 70 13 -104 -221 -175 165 297 -50 17 30 -116 53 -54 -27 -103 -95 167 -193
3278 -193 102 190 21 -139 -197 140 104 42 -255 -29 -5 110 0 -194 -43 -120 62 -236 269 53 10 105 -22
3301 -22 14 25 -44 57 51 -148 -189 -169 246 -78 -84 -81 -128 36 219 -108 -15 79 39 44 -171 -250 -72 -123 -182 -142 -19
3328 -19 -143 51 47 -22 -56 31 124 101 320 45 135 130 -44 96 264 -241 -26 1 123 -346 -42 105 -134 -167
3352 -167 -130 -35 -16 125 132 -120 -140 62 -68 -205 -86 70 -10 49 159 347 -186 -197 -132 -193 59 151 -107 80
3376H0q9q6j7K08l92O48m85M09o8k30j09J42O9j8K7k9K08j61j22R7r9j79M04m3
3400A65j45lk40M77l17k18K99N2J37j49k13L24j73j1J16r0J6o4j32l1K31K4k55
3423b00J85k15K27J94k60K02k60K49q7j59K23p3n4K42l21p7M48l88J63J10k01
3444e2m1j45K89J72j65l09K30r0J18Q5m0K39k11k09J45J18q5p6J04j23r8J75R6
3467A27L1j07j55l39N67j04j6R9O3p4l06K83l37j24J78L60l19L5J28K47j52N9
3489A44k66J65j37P5p8k2J1j50M10q4Q0k45K13K06l53k81r7M64J06j38j83K69
3511A09k7o3K6K48n16O01l58j13L92n21J22J60j05MM3J10j31L41j64q3j74J66
3533F7q8k06L04k88j57R8L62l70J24M1k57K53l4P3P3j39J49O7Q9k14J98J28n8
$$ plain form
3376 80 -9 -95 -112 96 -296 352 -133 276 208 -22 -131 11 80 62 89 60 268 107 -15 82 -17 -196 208 165
3400 165 20 17 -223 254 -63 -281 18 70 207 58 -155 169 -4 -15 101 11 27 -37 -169 -200 31 55 -200
3423 -200 -15 -230 -3 191 -69 133 -127 122 35 -124 99 26 -28 214 -107 -184 264 -124 39 149 -52
3444 -52 -93 -238 51 223 58 -251 -21 -111 7 92 52 291 80 -129 16 134 49 -27 77 -46 -144 31 127
3467 127 158 51 -104 -443 124 20 4 103 166 92 -214 69 -268 -392 -214 146 -173 -138 -10 237 85 144
3489 144 -122 43 -94 -19 -97 -119 -108 -258 152 68 148 -97 116 322 -31 -312 -409 55 161 23 -160 109
3511 109 82 19 45 293 -223 378 20 -93 299 -222 -100 60 -45 -41 2 112 -19 322 158 75 -99 67
3533 67 -21 -227 77 -211 -368 -270 92 -278 -154 -113 -370 -117 -151 -78 -5 -144 5 72 161 -53 145 273 215
3556B15k89J53j69K77j62j48p1J14n3J27O7n2k60K38K05M8l67J21j41O8Rn9L82
3579B53l16K94l62M04n78K40J08k04K86K24l29Nm13K42K97j84k0K14k0k85L15
3600A71j45K37j92qK2Q6k88J04n3j8Q8J19j65k17K29p5J03N1j1J18r2Q5j94J63
3624A18P8j49m0Q2r8J12kj8m0j55K47l17P9%M9K65k05J59p1j89m1K59j96K8n5
3649a00J99j44j15L33n2k99j63L77j03J22R9o7j42q1J45K18p7j75K3Q0k17l7J91
3672A5j7m0n6j08J68m7L26j13r7J7r6l6J4O3L8l97M01l67O58j98n5Q7L5m54L26
3697F7j12K31l65K32o3K17m05M20k02J53o6M7r8n7P6l13M55L3j85N4j26l51L32
3720b6qJ75j38N0j2k54L24j17rL3ql0L5q1K34j25k66J19m0P8L23m21J65M5j26
$$ plain form
3556 215 -74 79 -90 187 25 -123 -194 -80 -133 -6 61 9 -251 -13 192 240 -127 -6 -147 -79 -70 -129 253
3579 253 -63 231 -131 273 -305 -65 43 -161 125 349 20 25 -388 -146 151 -33 -53 161 141 -144 171
3600 171 26 263 71 63 85 171 -117 -13 -66 -84 4 123 -42 -259 -30 -105 -2 49 38 156 64 149 -45 118
3624 118 196 47 7 89 -9 103 101 83 43 -112 135 -182 -103 -103 -54 211 6 165 94 -95 -136 123 -73 -45 -100
3649 -100 99 -45 -160 173 121 -178 -341 36 -67 55 154 87 -55 -136 9 227 150 -25 -2 78 -139 -176 15
3672 15 -2 -42 -98 -206 -38 -85 241 128 31 48 -48 -84 -70 -7 31 -366 35 -332 326 128 73 160 195 -259 67
3697 67 -45 186 -179 53 -10 207 -198 222 20 173 107 154 56 -1 75 -238 217 250 65 119 -7 -358 -26
3720 -26 -34 141 3 53 41 -213 111 -6 -15 18 10 -20 15 -66 168 43 -223 -104 -144 -66 257 -164 1 46 -80
3745h0K50j23j41J27j3j27o2J43J43j04J31m02M06l03M07j76k56J66O0l1l9l8
3767f2Q6O1j42J61j31L5l27K91J48k79K74Ql18J5K11r4q9J16J61K7p7J53j35n6
3791C7L4j43P5l41M78J04j80R9j26l4j44j34K36J2N5P4k99K12p9n5L29j97j23
3814a10O7J04j3M4j35j0J22k9k8j61J16L6J54j24N4L6q1j0K66k59J26l05J97R
3838F6j41J43m5J11k2qk93J64J90j86j82j7M81l24J42K52l46j68M77k63j64n2
3860a85J93j54K88O1l85J70j09J51%O8o7K4k08QR6K8J07k48K90j34m4p5j55L96
3884A16m96M15K13j49J99k04k96j37L95M8k00O8l0J57j26J0j71L26k0j00j55J1
3906a26M0J71j05k39K36j14K94l87J03K80k18J4k35J53k4L90j55k08J0L7M4J2
$$ plain form
3745 -80 170 47 -94 33 20 -107 -169 -26 117 13 144 -258 148 -155 252 76 -180 -14 46 15 -24 -62
3767 -62 24 85 -57 104 -27 8 -319 -28 120 -159 115 123 -195 -180 31 -63 -152 -36 125 152 75 228 93 37
3791 37 71 -72 3 -338 140 244 64 163 37 3 -141 -275 -39 -27 28 102 -197 15 -64 -119 210 13 -110
3814 -110 -43 61 48 92 -43 -53 69 40 12 -149 -33 3 157 33 87 123 42 32 298 39 165 -140 57 66
3838 66 -75 68 23 134 112 104 -189 -25 165 -21 -203 -220 261 -63 79 331 -15 -183 294 31 -133 -185
3860 -185 8 -146 142 203 -182 -12 -121 30 30 98 31 55 -153 -145 -49 -21 86 -162 128 -6 -50 -125 -280 116
3884 116 -380 35 248 99 298 94 -202 -339 56 104 -96 -28 -58 99 -27 -17 -188 138 118 18 -137 -126
3906 -126 -86 85 -20 -259 -23 -137 157 -230 -127 153 -65 -51 -286 -133 -157 233 78 -130 -120 -83 -39 -27
3928b7J94k82K22j95P8J35J39J8l82l12L00J74o2J64k07N8J7K0j9L2K0j32J17
3951G0P2j8m1j4j04K83j57k49J33JJ62j96o4J66J9J04k20p2KJ44k32L98k15k33
3975b61M87M0n05J91K38m00K11K17k64M6k1L8Q7j75J17L1k09L31l43M26l42j12
3997a72oR4K65j76NJ5P0k43J14J84N2j21m7P4j63J72l37m4K68j58K96j14J7k04
4021a59K09m9O1l04M76l34J74j00j70K11O8j05n6K92j52j37L43o9K0k10K3j08
4043g6K35P2l17R7Q2m4P1m18K36R5Ln9L1K5r9J80k93J27q7J78o4n1n4J39L3j58
4069a16K34r4k65M75m06K29l66L62j38o9L29Jj62J83l44K1K2K00l51rL46l19l3
4092b70J72K68j98R5l27J13Q6Q2k13J59R6n2j55J86k09J42N5l10J89L01n4k75
$$ plain form
3928 -27 167 -115 107 -88 -10 125 264 282 -100 -412 -112 62 0 164 -43 15 32 52 33 65 85 -47 70
3951 70 142 124 83 69 -35 248 91 -158 -25 -24 138 -58 -122 44 63 167 -53 -125 -123 21 -211 187 -28 -261
3975 -261 226 266 -239 -48 190 -210 1 218 -46 0 -21 17 104 -71 46 77 -132 199 -144 282 -60 -172
3997 -172 -178 -84 181 5 10 25 95 -148 -34 150 202 81 34 108 -55 117 -220 -264 4 -154 142 28 45 -159
4021 -159 50 1 62 -242 234 -100 74 -26 -196 15 83 -22 -78 214 62 -75 268 199 219 9 32 -76
4043 -76 159 231 -86 11 93 49 120 -298 -62 33 36 -23 8 33 -66 114 -179 -52 -139 39 -25 -76 -130 9 42 -116
4069 -116 118 24 -241 234 -172 57 -309 53 -85 -154 175 176 14 197 -147 -126 -104 96 -255 -264 82 -237 -270
4092 -270 -98 170 -28 67 -260 -147 -61 21 -192 -33 63 11 -144 42 -167 -25 30 -280 -91 210 156 -119
4114a19M6QM1l5j0P1K51l41K16ro3Pk39J40J85j53J28p4Qk03K57j24N6K07l29
4139g8J12k13j6K80j58L34q0l29K95m9j57L41O8j88k17r6K45M8J29m46J51rJ39
4162A06j41J34jJ74l24k98M71k40m6M14m50J34K03o5r6J39J25l13p5Q5j59J73
4184e0q4M2R0pJ29l99M18m75K81k4J06j76J4K96l14K12m9mk1J38R3m34L47j26
4208CP5r0L50k65j65J95l21n9J76J69n8j2J00M1j03j1l47Q4M11k98L18j14k34
4231a55M20l23K30j19n50J01K34J44Pp3J55o6J6M6j09J34K04k67l5j45K89j00
4253C8j58J12p4m0J65M1qq1j5K19k29k48K66K64l41p9L36k71M8N4j25J74L3p1
4277A0k54L92j65J76j80k56K03q7O7O7j9J91j27k7K18n0j73J47j5j25j51J55j33
$$ plain form
4114 -119 -73 -65 -24 -59 -69 2 253 -88 128 119 56 63 -176 -36 149 -4 124 50 58 -145 112 -12 44 251 -78
4139 -78 34 -179 -195 85 -73 261 181 -148 147 98 -59 282 350 162 -55 -151 94 142 271 -175 -24 -33 106
4162 106 -35 99 98 272 -52 -350 121 -119 -165 249 -201 -67 136 71 -25 114 239 -74 -149 -64 -223 -50
4184 -50 -134 -92 -2 -9 120 -279 139 -336 -55 -79 27 -149 -135 161 -153 59 10 6 -15 123 216 -218 129 3
4208 3 78 -12 338 73 -92 103 -218 -277 -101 68 10 -2 98 139 36 25 -322 -238 173 -125 193 79 -155
4231 -155 265 -58 172 53 -497 -396 -162 -18 -11 -84 71 5 21 67 -42 92 296 29 -6 -151 138 38
4253 38 -120 -8 -82 -122 43 84 76 -5 -20 199 -30 -278 -12 252 -89 -168 168 -103 -55 -1 -126 48 81 10
4277 10 -244 148 -17 159 -21 -277 -74 -161 -94 -27 -46 145 18 -9 209 159 -14 133 118 -7 -158 -3 -136
4300a36Q6l8m6M36l16P5n5j62K25j75L2j52M39k01J52j20k8J65j80J27l5j17O7
4323D3J00P6j30J16l38K00J49k48k2J30K41l93L5O9J3r4q1J78j1j36J89o0M9P8
4347A53r4J57pl93K95j93K9J57qj22j29L8J52r8J5Q4ko0O4o9K74m64K11j01j10
4372b21L40R2j91r1J05K74j66l17L32n3k73O8O1J11Q8k50J61j7r1O8l32N16l04
4395i0K39l86jK9J71Q3O3j57N2J31k61K22M9n6k93J98L3j45K66l58M23j99p4k0
4419h1L6K56j05j16l9m7k05J85N51l27Rj97j3K33k92k65L92J53k45J26N7m6l24
4442c04K49O5k39J21k39L05J55j38k9K27k76k12N63k74j69J83J59J50j47j22r7
4463f9K42M2n07N02M0k86J31j85rJ55j12Q0j3k08P7k4K17l66L83j63J84j22q6
$$ plain form
4300 -136 -50 -88 -134 302 -14 61 6 -156 69 -106 -74 -226 213 12 164 44 16 181 1 128 93 -24 43
4323 43 143 219 89 205 -133 67 216 -32 -54 76 317 -76 -41 28 41 -53 -134 44 33 -103 86 26 75 153
4347 153 59 216 209 -184 111 -82 -53 104 96 -26 -155 -117 35 -63 -48 36 34 -26 38 -31 243 -221 -10 -111 -221
4372 -221 119 211 20 -71 34 308 142 -175 157 104 -169 -101 -40 71 159 -91 70 53 -38 30 -302 214 -90
4395 -90 149 -237 -238 -209 -38 45 108 -49 3 134 -127 95 144 88 -205 -7 26 -119 147 -211 212 13 -61 -81
4419 -81 -45 211 106 -10 -49 -96 -301 -116 435 108 117 -80 -93 140 -152 -417 -25 128 -117 9 66 20 -304
4442 -304 -55 10 -229 -108 -347 -42 113 -25 -54 173 -103 -315 248 -26 -195 -12 147 297 150 28 -69
4463 -69 173 215 -292 210 250 -36 95 -90 -99 56 -56 24 11 -197 -120 -144 73 -293 90 -73 111 -11 -97
4486i7k22L48L7j44J54j24M46k60m59K02k8J57o7J8J76l19Q8l0K21j30j16Q5Q
4509e6K1m7J44j01J04J70k01j30q1J29j51J06n2K90l47J68Q4j63Q2L8K93k87N0
4532F3K6j03J7m3P3J09j02Q8Q3r4j84r4J12j20K42j46J95M8l2k27j8J67p8j39
4556a57J91m9K28k23M6N5k00J13rj82L28k12j10K54k9n6j12J24R6j49J90k16q
4579h7J52j06K5QK42l22L7J33j40J06J26j92n1M9J29l90K33ok1K3K9J7P8l38L47
4604H1j86L0J26J0l7jJ2k07M3Q0J48J99o18J58K14n2o2J18m9R1m9J5j6K8j15J94
4630A55k70j6J68J09p3k91L4L77k82K8K54m8k18K18l30R0K1K35j38J08J20k28
4652B3k8N7p7Q3q8p1j61L25K3R8N3l08J36l63K66J19J40j84k83K27J24n5Q5j95
$$ plain form
4486 -97 -319 29 66 -78 76 -48 398 138 -321 -119 -147 10 -57 -39 137 -182 -94 -124 97 -33 -149 -64 -56
4509 -56 -35 -82 62 -39 65 235 34 -96 -177 -48 -199 -93 -145 145 -202 -34 50 -113 -31 7 300 13 63
4532 63 89 -14 3 -40 33 142 40 128 211 117 -67 -161 -49 -169 73 -73 122 170 138 -89 -107 60 -18 -157
4556 -157 34 -15 213 -10 36 91 -109 4 -5 -187 141 -71 -181 73 44 -12 -124 0 96 -53 137 -79 -87
4579 -87 65 -41 -16 -8 234 -88 -51 82 -58 48 174 -18 -69 -20 109 -281 -48 -54 -75 -52 -23 -6 72 -266 81
4604 81 -105 -75 51 61 24 23 35 -172 -129 -49 99 298 -320 -162 52 0 -62 56 7 98 49 64 48 76 -39 155
4630 155 -115 -131 37 146 73 -218 -184 193 -89 -61 193 145 -73 145 -185 -95 -74 161 23 131 251 23
4652 23 -5 52 -25 58 -30 -101 -262 63 86 184 237 -71 65 -298 -32 87 227 43 -240 -13 111 56 141 -54
4676e4kJ71k63J88l5R7j95L7L12m27J13J0J09j54J12J2L6j02j14J18q3N3k29J14
4700a76N8J72j76J19qk8J6j15K98k27L24m12M16l36J27j40j24J12J0j03K55L1
4722I3mK86m43P2j55L33m44M55j46l33O37m05J74o6m58L57J47J34l57J76k11j1
4744a69P7L42j21j8j17J17j21J65l98L78om03L18k9J90j49j49J76J32k56nK19
4766A73l21o4K46Q5O9j3o0k25J69k48J27k9J28O6j26O0r7l5R7k69K79Q7m7l29
4790b77L13M2j12m0K16k0J32k54J23l16J95j21P7J05J35k49mJ00j42n6N00o7j57
4813A23r0J2rJ68k65J22k58K19lm4Nk34k6J46L71j28p0mj45k42N14k70L62l5j10
4838A09k54j45M22j59L6J22p3k4j75j1J29J84j91j56M2M6m4P8kR5Pj03K97m50
$$ plain form
4676 -54 -56 115 -148 40 5 102 -93 -56 256 -171 -58 -48 61 -93 19 31 67 -35 -149 -31 -114 -61 -290 -176
4700 -176 -118 54 -122 -3 -11 -39 -23 -138 160 -67 257 -155 261 -75 52 -88 -212 -100 -90 -193 62 93
4722 93 89 375 -68 4 -151 182 -262 193 47 -286 351 -54 120 54 -404 -47 100 234 -123 53 -158 -169
4744 -169 -92 250 129 111 -6 111 -10 155 -243 135 129 -274 44 15 205 56 -93 83 215 -41 -46 173
4766 173 -148 -212 34 119 188 175 115 -110 59 -189 -62 -91 37 103 -23 37 -60 -95 2 -267 12 99 52 -277
4790 -277 36 78 -34 -74 142 122 254 0 123 -193 2 -119 -42 63 198 -51 -55 45 -97 -153 347 280 123
4813 123 33 45 36 204 -61 61 -197 22 19 -25 -20 -254 -280 -134 237 109 39 35 -110 -352 162 -108 254 219 109
4838 109 -145 -290 132 -27 9 131 58 34 -141 -152 -23 161 -30 -186 -144 -98 -142 -64 -66 29 36 -67 230 -220
4862b20N28k05q2j7j50K11q1k24L43R9j40K6p7J27j94k8O7k1M4R2k5k10K34q1
4886A6k8J72J46l89j3L91k67j58N4K27pK7j95K18m04N33k40j14Q2p9m8L02j72
4909E4J27r0j09K13n11N04k91L65k90J4p7J59N8m25M53l64R2J20L0k40J88R3j83
4932a10m3J54J89m03L7L75L7n0k44J12j75N2J06L2m7k0M9K96k09n9M3r1M61n87
4956i5J07m1J28q4r4L43k03L2o4K99k97l7r9J85j00j16J51j57j77M86L1k58P9
4979A9J80O7l99k2J07j52L04J04m48L60q0j3J42q8J07k99K42j48J38m03J76K84
5001A78l94J91N5M1k0M3J68n81L92k03Nj30K33k6l52K98J20J2n13N73j47J45k00
5024a12J37r7K97l28K10k93l23N00L78l22j04L3j68K57M0J35l78K25k67J02K61
$$ plain form
4862 -220 308 103 21 4 -146 65 -16 -240 103 202 62 88 11 138 -56 -84 -17 -38 6 98 73 -137 97 16
4886 16 -12 160 306 -83 -96 295 28 -130 -76 151 144 171 -24 194 -210 323 83 -31 51 -28 -76 226 54
4909 54 181 91 -18 195 -316 188 -103 262 -28 -14 -91 68 126 -299 154 -210 -118 2 32 -208 -20 73 -110
4932 -110 -153 1 190 -213 -176 199 236 186 -58 54 -121 -69 37 69 22 2 51 347 138 79 122 31 492 -95
4956 -95 12 -29 99 15 -79 264 61 93 29 328 31 -6 -105 80 -20 -136 15 -142 -319 167 198 -60 19
4979 19 199 266 -133 -155 -48 -200 104 208 -240 120 40 27 169 81 188 -111 131 -17 121 -282 -106 178
5001 178 -216 -25 30 71 51 94 262 -319 73 -130 -125 -255 -22 -48 -400 -102 18 30 -483 90 -57 88 -112
5024 -112 25 -72 225 -103 107 -186 -509 -9 369 47 -57 -24 -192 65 105 240 -138 87 -180 -78 183
5045A83j37j94L0K36k5j1j76M7J08j08J32j61j36N4Q3K4M16m12J04K68l09RK01
5068B26k59j18j9K84k86n9K70J3r7J77J07l41j2n9L13o8P3n7l61k9M90l40K65
5091A13j04J26k30K91p4k01K3J02m4r6L7K61j29q4o9J32j04k8j5K14J26m19K16
5114D4k41M20j82J62j10r7P3m4j54M08l06J32j2j29kq6LK76m18K31jL35m38P3
5138f3K83j48j97RR5M5j5m9j3o1L0j40J23K4L16o50M71lo6j49J37L9j37j81J15
5163a85K98j39R5m04L14K09J40k25l82K34K33r7j44J95J04k16Ko7J06l19L2L94
5185A78k96Q9l1j03O2M21j47k66Lk31J13K83k12J19QJ49k53J23j73Q9n8J04l7
5208f6m5J47rm25J93L33j23K6j38K36j80j03K71Q9l41O2J2J11rj58O6j03J29J70
$$ plain form
5045 183 46 -148 -118 118 93 82 -94 -47 61 -47 85 -76 -212 -158 -75 -51 365 -47 57 325 16 25 226
5068 226 -33 -151 -170 114 -172 -231 39 52 -45 132 239 -102 -114 -173 140 72 145 88 -273 -302 188 -152 113
5091 113 9 135 -95 196 122 -79 -56 46 2 -94 -57 204 75 -9 -78 54 -50 -78 -93 121 247 -172 44
5114 44 -197 223 41 203 93 -4 69 25 -129 279 -27 105 93 -36 -38 -124 -121 155 -263 -32 -33 302 -136 -63
5138 -63 220 72 -125 -116 -21 24 9 -40 -53 -114 -84 -224 -101 -77 239 -411 60 57 -9 -158 -21 18 -119 -300 -185
5163 -185 113 -26 69 -335 -21 188 328 103 -279 -45 188 91 -53 142 246 30 32 -35 71 -248 -216 178
5185 178 -118 -29 -60 -163 -101 320 173 -93 -90 -321 -208 75 -137 -18 -10 139 -114 9 -164 -75 -133 -29 -66
5208 -66 -111 36 27 -398 -205 128 5 31 -107 129 -51 -154 117 206 -135 -73 -61 50 41 -117 -51 -154 -25 145
5232A45J06l77L21j85J16N3l08K63j9n3J50k06J51m9RJ26n78M21m18M04Q3N1m2
5255A64j55L4j43K13r0J3L1l08J54j68J25n0M33j72k45o7J63K79p5K4k3j15J67
5278A89j59K01k16M4l03J77J01j24J87j03N5l26L37j73n4L42m37K92L0j37J89
5299A12K7l24L53p1j3N9j19K32j49j53k96K41K36m0Ol83r3K98n9M3q1L29k02n
5323e2J11r5l9j95K05p3Q3R3j8J97k55r4J57J2K66n95J92J10j25M08k10r1J41
5346A33j92j5L23m63L49j40O5k6j36k0K26K7k20K29k41r5N02k49l0j74J31m63
5368d79N26j08P9J32j09j21K05j75nK5J40q2l49K69J7j57J89R9k31L11l10P1r
5391g2k6Q7l77K61P7J67k18J19Q2n6j69K23K12k22q3Pk32K36k09L28k30Nn1J19
$$ plain form
5232 145 251 -126 195 10 126 179 -129 134 115 62 212 6 157 108 117 243 -335 86 -332 72 155 206 164
5255 164 9 43 -100 113 23 36 67 -241 -87 -255 -130 -180 253 81 -164 -231 -68 211 136 160 137 22 189
5278 189 30 231 15 59 -244 -67 34 -90 97 -6 49 -277 60 -113 -167 175 -262 30 60 -77 112
5299 112 139 -185 168 97 84 143 24 256 107 -46 -342 -101 135 95 101 -282 -375 -77 -136 -93 -174 155 -47 -52
5323 -52 59 -36 -75 -270 -65 -138 -55 38 20 217 -38 -132 25 37 303 -292 -100 10 -115 293 83 -8 133
5346 133 -59 -74 249 -214 135 -5 60 34 -102 -122 104 131 -89 140 -101 -196 306 57 27 -147 -16 -479
5368 -479 47 -61 18 150 41 -80 125 -50 -55 -30 110 28 -321 -52 -35 -192 -3 96 -135 176 -134 -63 -72
5391 -72 -98 -11 -388 -127 -50 117 -101 18 100 44 -125 98 310 88 5 12 -220 16 -193 135 -95 -90 -141 -22
5415b2Q6j23l5lK52m6J9k59o5K11k23J83J70j25L8p2K23k93R2M0p9j1j00j9J67
5440FN1r9J55q4j01N9J07k82J40J48Jj26J53M2k08R3j64N1j89K29N5j9j8j55L33
5465A78j87J10l29K15m07O01k32J3K27k28J46k45K49k43L42k88K28p4J51k67%
5486d0L3k7J65j89L8mj5K43l34J17K53j84K82l30L0KO1j54K28k53M8j34K59M5
5510A40p3n6J5M3M5p7r2Q1J77j81J54l63K13M3p7n1j56P3L26j68P3j76K80k61
5534f8j65J82J00j09o5L84k03J29q9J6n4j73j02J32K58k97K48j10J54k60O7j77
5556b02J63Q6N7J01l78K39J70J75m49J67Q6q0j68O8j76J52O2l6M9K13j40k22j74
5579b37pK74Q0J00m55K29L5k0q5J46k27K48J78l84K75k99L25l94M25l86J14J12
$$ plain form
5415 -22 64 -59 -94 -97 155 109 128 -131 -196 15 -208 -25 145 20 58 -14 209 -84 8 48 -31 -42 -142 -161 6
5440 6 57 -42 113 29 -72 -13 94 -188 -48 100 101 -25 128 170 -38 55 -109 -58 -247 -18 37 18 0 -155 178
5465 178 -9 101 -228 -13 -420 181 -51 -38 189 -39 107 -138 111 -132 210 -78 150 76 227 -40 -40
5486 -40 -7 -34 131 -58 -20 -24 -39 204 -130 -13 240 56 338 8 38 40 101 -53 175 -78 -30 -164 95 140
5510 140 67 11 26 69 114 37 -55 26 203 22 176 -187 26 69 -8 -59 -215 -142 184 16 89 -87 193 -68
5534 -68 -233 -51 49 -60 -125 259 56 185 96 112 58 -115 -217 -85 173 -124 124 14 168 -92 -25 -202
5556 -202 -39 47 104 205 -173 66 236 411 -38 129 215 135 -33 35 -141 11 73 37 86 299 159 -63 -237
5579 -237 -244 30 110 210 -245 -16 19 -1 -86 60 -167 81 259 -125 150 -149 176 -218 207 -179 -65 47
5601D7r6J53K0l93M8K10j9K15j76R5m0j9OJ20k05Q0j51n2R6j63K9K2J73k37J73
5626f4J02k29L11j58J67k52K64l4J4M7q1k41J88l95M92p6LJ68k30j94K54q7j42
5649a73j86K62R8k8J30k14L51l61M3J03q8J08j75J35J6nKK14l10K07j66L4q6j80
5673b69J56J62R9l83L28n4j70PJ97j85K55o5j16K74k56J88r5N7R2J04l04l5K32
5696B19k23P8J05l25K34p9j53K61l9r2j73J37K04j32Nk9r2J34j63K02j91J16K2
5719B6M4p9j60M1K65k65K40j4j4k26k50O56j88j89j18K78J21l9n1j35J51k02M10
5742C02k41K96l35l51L20l5l2OJ9L2R8m11M30k38o1O28l24k7N8l66L48J03l52
5765a33K09J4j22K55P8j10k2j78R2l69L31l44L39k84L79J37k24n5o4J43J52k14
$$ plain form
5601 47 -49 104 124 -269 -221 -11 -30 185 9 104 64 45 51 171 -34 46 -105 -157 -61 -224 -195 -173 0 -237 -64
5626 -64 38 -191 120 -38 129 -123 141 107 121 168 87 -154 34 -361 131 55 58 226 -4 -198 56 -31 -173
5649 -173 -359 -97 1 -27 103 -111 240 -121 -78 25 -63 45 -130 5 21 16 18 232 -78 129 -37 -3 -89 -269
5673 -269 -113 49 148 -235 93 39 -131 -124 73 -112 143 78 -38 236 -20 168 73 130 222 326 22 -13 219
5696 219 -4 74 179 -146 88 9 -144 117 78 -14 -187 -50 154 22 27 -2 -94 40 -123 79 -112 4 26
5719 26 70 -9 -169 -128 137 -128 112 98 84 -142 -392 264 76 -113 -231 47 168 129 78 -57 94 -108 302
5742 302 61 357 22 -329 -9 -44 -76 -70 -51 -19 79 -332 98 -140 -201 427 103 76 134 -232 116 219 -133
5765 -133 76 90 -32 223 301 191 169 -9 83 -286 45 -299 40 -244 135 272 48 -7 -71 72 224 10
5787A0r8J86k1j20K05l38L18l4m1l17J21j4L39j18K39j43j47L19k62J59n90K98
5809d9K79j4j26J2k37L1m3L00r6m82K57K62r9J69l32j26P2K43r0o0L53j74j7j27
5833i4K62k13K17j00K13l15J78R4j02j23k87J09K49k98L79l65K78j34q8j29L10
5854D1p6J98N8j78j15J09k04Q7m6N1J71l37L07J4m5n3p8J79p1L7K7l5j89M7L30
5879B29l32R0q6N4k00K26J8J14l37J99j15J31J65k77n5J46R6N5l8O5k79L5K75
5902A79m70J65J30l9K82j28n9k8j38P4p0P2J78j15l46L60j04Q4j88j36L57J52
5924B12k18r1K57k02J12R1j27K46k24k54L38n1j28N6q6k0r3J46j07J26o0K52j24
5947E1p5O2O9k21M1J18p7J12j84J07K48Lj08j43j11J84j81K05K26l22j71J48j03
$$ plain form
5787 10 -88 98 77 -43 162 -176 142 108 67 -250 -129 -143 196 78 317 174 27 346 84 243 -347 -49
5809 -49 230 216 90 102 -135 -104 -147 153 57 -425 -168 94 -5 164 -168 -294 -222 21 -69 -129 224 50 33 -94
5833 -94 168 -45 172 72 285 -30 148 242 140 17 -270 -161 88 -210 169 -196 82 -52 -140 -269 41
5854 41 -35 163 221 43 -72 37 -167 -80 -126 -75 96 -241 66 80 35 -18 -96 83 12 49 76 41 -148 -101 229
5879 229 -103 -13 -99 -45 -245 -19 -1 113 -224 -25 -140 -9 156 -121 -176 -30 66 121 83 148 -131 -96 179
5902 179 -291 -126 4 -35 247 119 60 32 -106 -32 -102 -30 148 33 -313 47 -57 27 -161 -297 60 212
5924 212 -6 -97 160 -42 70 161 34 280 56 -198 140 89 -39 17 -69 -89 -182 -36 -143 -17 -77 175 51
5947 51 -24 38 107 -114 -73 45 -32 80 -104 3 251 254 146 3 -108 76 -105 100 326 4 -167 -19 -122
5970a22J99m3l26J41M2M10l67K72J54l73K6Q6r3m6K3N9o4k47K24K08k28J50k14
5993a29O8r7R0JJ44r6J42K3l16J1J58k5j86K67j28M5J79q2N3J53p65M32K4R6K33
6018B95m47K15P3M2L8j72k8J72l68L81j81o6J39l36K54Oj04Q5K01K8l0k10K8o1
6042d6Q1J33j34ol9J8j13LK12Nj19L2N2j2l09M38k40L0J44l2Q2q2P5l19j15L73
6068A12k9k72K67j62K0r9K93j97p3K67k15q4J18J99l7k28J91ll39J51l4m3O8P4
6092e5K85j21l5J56l66J27J04k67K28K07k66J90l25K03K32l15k62J81J17J42j98
6113c8jn7J91k71J64j76O2J87L4r9k72M1L37K0l06J22k05K41k1J07J09J30j55
6136A44k24M59m20M7j40K58j98j06P3J4o3M3M6J85J08m48K43J67j69q3j66J83
$$ plain form
5970 -122 77 34 -292 -151 -109 301 -66 206 360 -13 13 99 6 -40 -17 42 -22 -269 -45 163 -65 85 -129
5993 -129 -61 -158 -68 -67 77 -19 123 146 -170 -159 -1 -26 -212 55 -73 -28 151 69 122 275 -490 -58 -34 62 295
6018 295 -152 63 136 178 216 44 16 188 -180 201 20 -46 93 -243 11 17 -87 -2 199 227 197 -13 15 -46
6042 -46 35 168 34 28 -11 7 -106 -103 109 114 -5 27 79 67 -242 196 -44 -14 130 98 180 98 173 -146 -261 112
6068 112 83 -189 78 -84 -64 -163 130 -67 -140 127 -88 -172 -54 145 108 -120 71 68 -271 -120 -154 -197 -129 -55
6092 -55 230 109 74 230 -136 -9 95 -172 56 263 -3 187 -138 65 297 -18 -280 -99 18 160 -38
6113 -38 -39 -96 95 -176 -12 -188 -126 61 95 -4 -276 -235 102 122 -184 -62 -267 -26 -47 60 169 299 144
6136 144 -80 379 -41 6 -134 124 -74 -180 -107 -93 -156 -113 -67 118 226 -222 21 188 19 -64 -230 -47
6158d7O7k1k26L93r1l1j37K17k5j0l1j19q7J03qQ4j23J03K8Pj53L6R6k4l5P0q1
6185d5o8K1Q7o4J88Q4l14j6K45q7k21L85q9J05j21M3M3j22N5Q9l18J20R1q0J31
6210A42J15l44l2L22k67K49l41L83j74j58J58l38N03m90O5L95k81K30j28J62k47
6231g6R9l5K1J11K47m36n8k3O1J46j57j20L08J68j97j03J79k56K41l06P9q2J38
6254e1N7r0Q5J51k6p2l04M5J49n7J46Ln7k55L33j51K0J22j48k31K48J84J61k32
6278C0L2J6K24k24j2j22%lO5N4j80j43K37k2N8o4l2Q1j04m6j68L52J88l78K22
6303F1J3j43L5q3k5L39O5j75n6k31L84r7J20l28J81j45r8K09j08Q8j03Q0%L0o9
6328e6M01m11N1J09q0K06J07l77j65L03p9m5j47L19m71L0M70n1l52M29j55j80
$$ plain form
6158 -47 20 -1 -227 166 75 44 -93 124 99 89 58 -61 -148 -45 -53 31 -92 11 39 46 -107 -71 25 1 -34 36 -45
6185 -45 -113 -92 -5 -69 119 203 -111 -127 118 31 -190 195 106 211 90 133 176 54 109 198 -120 0 91 11 142
6210 142 257 -87 -119 203 -64 185 -156 227 53 -105 53 -285 218 -272 -207 188 -93 137 9 171 -76
6231 -76 23 -12 9 120 367 -69 -127 -150 -89 57 -100 -220 88 256 59 -44 135 -121 120 -186 -107 -189 -51
6254 -51 6 -84 1 152 126 54 -250 -205 -56 -113 33 36 -21 -276 57 -94 -74 48 -100 -331 -83 101 262 30
6278 30 62 78 302 78 66 -56 -56 -59 6 60 -120 -263 -26 -48 10 -54 -86 -5 -109 -155 -323 29 217 -161 61
6303 61 74 -69 -34 -117 -142 197 262 87 31 -200 184 87 207 -121 60 -85 -183 26 -82 6 -97 -17 -17 13 -56
6328 -56 345 -66 -15 94 14 220 327 -50 -215 88 9 -36 -183 136 -335 -305 165 114 -238 191 36 -144
6350a44K56j10q8P2J89l30L25l71L31l5o5o8j45L27l90L5M27m34k3K37k68M67
6372A95k53j78K15N4L34j92m16J42J55M2J9j95K65P9j95m01L53J38l3j96O0k09
6394b17J89J40q6r9l2J22N1J4l2m4k66J67O6J54j7k69Q1L4n9oJ43k05J07J65k80
6419a79M02L0k17m27Q10m98Q1ln4N7q4J79l3j14J18L9j14p0j02K37P5J08l96K25
6443G0N1j29k74M21qk99J59K75k85P7q8J63n7l22N00q4Ln3n8J13P1m38R7K43l20
6468a72J73r9K27m8j59P6k61K28Q3M3k48k52M80p7Q9l67J69K57j69Pk80M24j14
6491A0Q3k60k10L23J97l1r8j31J34j36J03lL1K23j88q1M5R2k34j04J24J20R6R
6515A14o4k27K79m52K16J46Q0k25K54k66J52n2P7o8R5r0m2l5Q3n6j03J21K39K6
$$ plain form
6350 -144 112 2 -86 -14 175 -155 170 -201 130 95 30 -38 -183 144 -246 -211 216 -218 -241 -4 -272 195
6372 195 -58 -236 -21 33 367 175 -241 -99 56 98 117 -78 187 266 71 -330 23 161 128 -68 -8 -217
6394 -217 -28 112 26 -73 -105 17 68 82 50 6 -260 -93 -27 127 110 -159 -78 -44 -103 -109 34 -171 -64 101 -179
6419 -179 223 253 36 -391 419 -79 2 -1 -55 2 -82 97 64 -50 68 107 -7 -77 -179 58 133 241 -155 70
6443 70 121 -8 -282 139 131 -168 -9 266 -19 58 -30 133 76 -246 254 170 173 120 62 175 246 -192 -95 148 -172
6468 -172 1 -98 129 81 -78 -2 -263 -35 48 91 -157 -409 71 -6 83 -284 -115 142 -27 -20 -300 124 10
6491 10 93 -167 -377 -54 143 112 14 -117 17 -119 -16 -19 12 235 47 -34 11 103 -131 -235 -111 9 105 114
6515 114 50 -177 102 -350 -134 12 92 -133 121 -145 7 -45 32 -36 59 -31 -73 -108 -25 -81 -184 -63 176 202
6539B02l93R9O2J46r1K87l70K50r5l50N01k54M3pk66K53J92l12J21kk5m3k14K2
6563b44L48j77P5J15j54r9L61n2j57K51l76R6NQ3j2j5j00J10m7k1K2J35l6J6p1
6588E6j32M0j03K20k2j26k5j63M14k14K24k46J10k46j13K40LL11j91k03j4L35
6610A55Qj84M9L9j57K75j91m3P4qj31P9r1l47L19L08l8k97K34l34J42L01l36K35
6634F1k23J09L8R8k10J85j33q7J95k22J05J6J10J02R2k84m7O4J61p8n3j55L76
6657B20j10j13J88m34k9N51m54k6K67j35K23m09L03%q4J36k59L34l71j14O47j31
6679B00k76J81r4Q8k53m2Q0R1j33K38k33K00J0K10k7k52K28m17J71Pj12Q0l3J73
6703H5Q0l58N4J95J2j42O5q4J05O9q9L01j36l63K94j73M1N8n6j72K7J87P9q0R1
$$ plain form
6539 202 -191 -92 -30 116 25 312 -58 192 97 -253 248 -6 37 30 -236 17 209 -103 18 16 -9 -52 -266 -244
6563 -244 104 -73 2 117 -37 -136 225 173 16 267 -109 -13 -8 75 63 48 -52 58 11 -10 12 147 111 127 56
6588 56 -76 -36 -139 81 59 -67 -92 -255 159 -55 169 -77 33 -213 -326 -86 -83 228 37 -166 -180 155
6610 155 163 -21 28 67 -90 185 -6 -49 25 17 -114 -35 -126 -473 -154 154 116 -181 53 -281 -139 162 -174 61
6634 61 -162 -53 -15 83 -127 58 -75 -162 33 -189 -84 -68 42 144 236 -48 -95 -31 130 52 -1 -156 220
6657 220 110 -3 185 -249 -278 273 -181 -207 60 -75 148 -261 42 42 -42 94 -165 169 -202 -316 331 200
6679 200 -76 105 11 99 -154 -196 -116 -25 -158 80 -153 47 57 267 240 -12 216 -201 -30 -23 -135 -55 -88 85
6703 85 165 -193 -139 56 68 -74 -9 -93 12 81 -8 293 157 -206 88 -85 -44 14 -42 -214 -187 0 79 -1 90
6728I0l3k0n0r3P2k32J2M65p4k15o7J12k7J44r1p1K48k24J28o4r9j41J52o3K99
6753A58j11P9J8n6L3K6l02lJ35Q0j05j25J79j77K9J66J35j90j48J50p8J43R9p4
6777F1n2m1P4m3j19K67j19jK53n64Q3M0J37J06n9J22k02J80k46J48j15p1J28l1
6801f4K99k88R3Qk09K30o5M2Q9r1k38K21m6j08J30p0L1K62j62%j80Q2K2m4q0J63
6827B7m1R5J62m15K25N8j44K48l92p2M78l72J89n5J3M2k7k15K56k82M1L57m4r5
6851C7q7j06j7M8l06M54M7j40J83k22K31p3J42j40j34J83m6m40M15M5n4J07j59
6874c2K16j66K74o11RR8M96j25j61j55K50J44k36O3J8r2j96J26N1J81j05n6j8
6897b7J46p0R1J2P5k81J33q2k31L93l39k7jK20J72Q3m69J83J69k3j09m3J1J47
$$ plain form
6728 90 57 37 -13 -106 -34 -266 -254 211 137 -78 -145 -33 -60 84 -7 -78 170 -54 74 10 -89 -230 -78 -141 158
6753 158 47 126 144 88 121 147 -155 -158 -23 57 -48 -173 6 -171 -142 24 159 -31 -179 -29 -107 36 135 61
6777 61 9 -32 42 -1 -120 147 28 27 280 -284 -201 -161 -24 82 23 145 -57 123 -123 25 -90 -161 -33 -64
6801 -64 235 -53 40 48 -161 69 4 46 135 44 -194 27 -19 -127 3 -67 -36 226 64 64 -116 -34 -12 -56 -136 27
6827 27 -14 81 243 -172 53 111 -33 215 -177 -249 229 -143 46 -9 4 46 19 -196 60 -222 -181 176 132 37
6851 37 -50 -156 -173 -125 -431 23 70 -70 113 -109 122 49 191 51 -83 100 54 -386 29 74 20 127 -32
6874 -32 184 18 292 -319 -310 -212 284 159 -2 -157 93 237 1 64 82 -10 -206 -80 -29 152 47 -9 -27
6897 -27 119 49 140 152 227 -54 79 -3 -234 159 -180 -207 -208 12 184 267 -202 -19 150 127 18 -25 -14 133
6921A33n57M47j03J35N7L4O3o7J70m64J86Q0j36K54l04j16K14J66k48n1K6J37
6943E6m6K6q1m1J33j24J78j44L39l84N4L04n61PL91j41L5J24k18r0J49P2j3J91
6967B16m3j27k38O8J58pJ72j48j1K4j16q6Qj9L59o2k06j7K95k36M4M2j40m1K70
6992A59k82L10n02L08Jm29J39J83j36J27L69l92K61o1J39k09J79l35M7p5J67K52
7014B20l24J0l3K17k11j80K9M17j71qM3o7m2K08J99j71l79K94Mr4j2l1J61k4j78
7039a23JN5J83k5O1n8q1j42m0L60k42J50p6j14K62j86J04n4mP8Q7M2j75k0k39
7064a96L16l50P1K57j63k6j55K27K62l7m55M62q6p2l95K90O1m4jn1Q4j31p9Q2
7088a29L98k20J17l43J45q9M9J83q4J93m28J70J96m08K09n1O8l76K57N15m27K23
$$ plain form
6921 133 -424 23 -80 55 112 146 209 142 312 -152 34 114 -22 232 -72 -188 26 192 -56 -107 -81 56
6943 56 10 36 -45 -86 47 -77 101 -43 296 -88 -34 270 -291 -284 107 -34 1 125 -93 -183 -34 38 25 216
6967 216 173 46 -192 -124 34 27 199 51 40 64 -52 -138 -130 -149 210 148 -58 -75 220 -16 28 70 -70 -111 159
6992 159 -123 187 -315 -7 -6 -435 -296 -113 -249 -122 247 -145 116 55 194 -15 164 -171 -124 -199 -32 220
7014 220 -104 -94 -127 90 -121 -301 -272 145 -26 -34 9 -58 -100 108 307 136 -243 51 55 -39 -51 -82 79 55 -123
7039 -123 -122 -67 116 91 152 94 13 -129 -169 191 -51 99 23 -91 171 -15 89 35 31 109 196 238 63 43 -196
7064 -196 120 -230 -159 98 -65 -91 -246 -19 243 206 -249 213 127 55 -340 -50 11 -33 -34 -85 -1 -132 -211 -129
7088 -129 269 49 166 -177 -32 -121 -72 111 27 220 -208 -38 158 -250 -41 -92 -24 -400 -143 372 -55 168
7110A68k15J22J91l22J6J09J24j09j79n2lK90k92K09j2m42L66k3K72m39J70j9
7132g0KQ1J02Mj28j4J49k06q2J75J98k30O9j27K0k16J02J8LN6K45j43j13q4Q4
7157a05J47k8k%k17N13k95j49j3k6o9L92l2j3k92J80J94l12J84J6m4l06K92k5
7181a0m0K98k62p7j20L59j64k18L88j69pJ3J87k06k0J81k18K26k47J41j02m7J28
7204A4K72j6k66j67O0q6K61k22J32O0j21M3K9K53l71K47n2p8l2k3R4k59M6K8K77
7229A23j82O5J47j58o4O3J2J67Mk46K63J2Nk86K36k09R2j32N7K47l30K44k70J9
7253a21J21o0J39j05m9k4L4K10j70J6J27o5l05L91J13k66j43Q1R8j13q3k8J20
7276h2j90M04J4k75L18N3l36M9J38j53j67J90K17l42K18o3Kl%j02Q0K55k59lP8
$$ plain form
7110 168 -47 75 266 -56 -40 69 193 84 -95 -147 -150 140 -152 57 45 -397 -31 -54 218 -221 -51 -70
7132 -70 -68 13 115 119 -9 -23 126 -80 -162 13 211 -19 50 -77 -57 -273 -171 -153 -150 -94 151 8 -105 -189 -105
7157 -105 42 14 12 12 -205 308 13 -136 -149 -175 -244 148 116 103 -189 -9 185 -127 57 73 29 -277 15 -10
7181 -10 -50 248 -14 -91 -211 148 -16 -234 154 -15 -22 -9 178 -28 -48 133 -85 141 -106 35 -67 -114 14
7204 14 286 270 4 -163 -103 -189 72 -150 -18 42 -79 -36 -7 246 -125 122 70 -8 -40 -63 31 -228 -182 -154 123
7229 123 -59 6 153 -5 -69 -6 6 173 177 -69 194 206 211 -75 161 -48 44 -88 -31 216 -114 130 -140 -121
7253 -121 0 -60 79 -26 -75 -99 -65 145 -25 -9 118 53 -252 139 252 -14 -157 -76 22 -91 -174 -202 -82
7276 -82 -272 132 146 -129 189 242 -94 -45 93 -60 -227 -37 180 -162 56 -7 -5 -8 -8 -110 -30 225 -34 -37 41
7301D1M2Q6r8r1K29K1J96o88O3N6L21k02q7K5N0j93K30jJ8J50qk81J18O3k69N2
7327a57Q8L45m01N1J82M1l24K96rk4q3J2J74l38Q2J22J11k13J22j70J82J69k60
7350bJ91m38K15K8j84K84k00K28J31k07K49k34k07P0Q7j16O7j11J20o4K53n4q4
7373B2l5q6L8l2J39o7J49r1m8p2p9K47o0pj70L8pJ09j4pM2k9J65k85J19J38n7
7400F0o8J12j15J19R2l54J28Ql71N07k53K31R1l73L10l9k11p0K89q5j88L06j34
7423hk7n4J84j06k27K29J04k21M7K27k04K1n8P5j61L8J70k04J88L57m86J62j86
7446a40j6K74j5o2j33j31L34N8m16R7K08q4J21o3o1R1n8J0l58L74K9k35L16m37
7470b97K91K64M5l81Q0N5qJ18l30K23N1j43J28k35J72j49M4L61k89K3o6m7j14
$$ plain form
7301 41 83 169 71 -20 209 230 426 -262 -199 -143 178 -24 -111 -86 -36 -229 1 0 18 168 160 -121 -3 60 -209 -157
7327 -157 -69 276 -125 -74 108 149 -175 121 112 88 5 17 191 -147 -65 57 168 -45 77 -93 89 258 -2
7350 -2 189 -249 -34 -6 -190 94 -106 122 253 46 295 61 -146 -76 11 -105 -38 -149 -29 -93 160 106 22
7373 22 -13 -99 -61 -93 46 -21 128 37 -11 -83 -162 85 25 18 -152 -114 -121 -12 -26 -33 9 -20 145 -140 -21 117 60
7400 60 -8 104 -11 108 200 -154 -26 -18 -389 118 -135 96 187 -186 124 85 -126 -196 93 8 -180 126 -8
7423 -8 -35 -89 95 -11 -238 -9 95 -126 -79 148 -56 -35 -93 -18 -179 -141 29 -175 13 370 -116 46 -140
7446 -140 -156 118 103 41 -92 -223 111 169 -247 -150 58 -26 95 32 -29 62 4 14 -344 30 59 -176 140 -297
7470 -297 -6 258 303 -78 2 57 49 167 -163 60 111 -32 96 -139 33 -116 -72 289 0 23 -43 -90 -204
7493b04J29L68j21l04L12l3k02L1J9j10N4J24j26J6j9J45K8o8k07L36L6J27o00
7516b69L57k45K36k12O8l4M3K8K40m21L10l3J20J18o23M95k72K76m52N0K60j71
7538a31o2M2J53p1Q8j05J63K7l71J72K08P4m1j43O6j64N4K0k16R3K53l3o0M12
7562D28o41P1J68Rk04K45L1k73r3L31k33Q5J05j13m0k6O57l09k95J71l75M81j9
7585A61l21j5K31o6m0L23k85kL09j50kj59nr6J52k51M11j66j02J10K01j57k30
7608a49J94j85L61l69M59r3j42r5J15j57Q2j9J39k77Om4P4P8k11L8o8K57J16O7
7632A77J52l50OR0Q3k20J45M0j24r9K51j34J30k87j0K29r3J12k98J44n4K11J1
7655A12m3O8j27j91L74j86nr2j70M66J91k36l12J30qK0M10m08l0R1q9j00K6J79
$$ plain form
7493 -204 -75 293 172 -132 180 147 -55 -24 -5 -115 -61 63 -63 -47 -66 79 107 39 -168 168 204 331 -269
7516 -269 88 -157 79 -133 -65 -99 -56 -28 212 -209 101 68 188 306 -317 178 -94 182 -270 -220 40 -131
7538 -131 -193 -151 2 -69 19 -86 77 104 -267 -95 113 187 146 3 69 -95 -41 -21 -237 -144 109 76 16 428
7562 428 -213 -142 26 35 -169 76 107 -166 -259 72 -161 -76 29 -84 -124 -150 507 198 -97 74 -301 180 161
7585 161 -160 -175 56 -10 -50 273 -12 -14 295 145 143 -16 -21 -117 35 -216 195 29 -73 37 238 81 -149
7608 -149 45 -140 221 -148 311 218 76 -19 96 -61 21 2 141 -136 -130 -174 -100 -22 -233 -195 -263 -6 110 177
7632 177 329 -21 -15 75 158 -62 83 123 -1 -100 151 17 147 -140 -150 79 -14 98 -200 -56 -110 101 112
7655 112 69 137 10 -181 193 7 2 -90 -260 206 397 161 -151 -21 -29 -9 401 -7 -37 54 -35 -135 -109 70
7679G0j04J13j6j24p2L40l85K74P1k71L57k84j88O7L30l29o9K2N0K74j56N4j84
7702a60P1J43j68J94K60m24P3J0R1l5J43l12m4K17O3j15R0j34L8J32j06jl6R1
7726H1j51L51l25M69l75k0M9j40j1n4pL9J91j3o2Kl40K0K70k55P8K98m04K18j37
7751b28K30K04k35r2M01k04N1L4n6R9o29L90p9n8K45j05J9l3J71j09N2J2P5k58
7775a03K14M3k78j05M12k65o3L2K91m29L16j33J04j3l08L07k11K49r8M16n97L31
7797A12j04p9J24O2J34j50n8j1J39n8l08L32J48k02l0j25k28N35j93r4o1J23O5
7820G3j44K2K70q3N1j71j02J98k63J93j84O3M2J2J64k0k29J70k71J64J25R2l41
7843a69J75K11m45K98K0j10p7p1J81j98K48L5k43K87n5p5k70N47l42K34k03K32
$$ plain form
7679 70 -34 79 63 -61 -133 207 -178 96 167 -104 253 -31 -219 -152 178 -151 -220 -198 -148 126 -30 24 -160
7702 -160 -89 54 -114 80 340 -84 -11 -1 90 55 198 -114 -158 59 122 7 97 -37 1 133 27 26 -10 81
7726 81 -70 281 -44 425 50 30 79 -61 -72 -126 -133 -94 97 84 22 24 -316 -296 -26 -281 -203 95 -309 -91 -228
7751 -228 2 206 -29 -121 280 76 127 161 105 204 -425 -35 -114 -172 73 -32 -13 -46 125 16 68 80 155 -103
7775 -103 111 154 -124 -229 183 -82 -145 -113 178 -251 65 -68 36 23 -285 22 -189 60 -38 378 -219 112
7797 112 8 -71 53 115 249 99 41 30 169 111 -197 135 283 81 51 -74 -302 233 40 -54 -115 8 73
7820 73 -71 -49 221 138 189 18 -84 114 -149 44 -140 -77 -35 -23 141 121 -108 62 -209 -45 80 172 -169
7843 -169 6 217 -228 70 90 -20 -97 -168 13 -185 63 98 -145 142 87 12 -258 289 -53 181 -22 210
7865B10j10l17J26K32n6k8p6M1J4kp3o3L70j15J4l22K51j51R4K18k79J95l49R0
7889h6K9q1j85K19p2l6R6L88k53k08K53k40J77J40l45L59j17k04M04j48o5j28
7911a03J88p5o5N3L7j08K28J9m69O47m14l74N13m9k06J8P1J08J67j22Pk60K25
7934C6J07j57J31r6j23J73j07J55J21k63m4o0K04K67l15J17l0j61J52o5o4J93
7956A71j88J64j40J23O7k51K93m26K98n2q2k4K25l23J65K20k2j83l2MJ18l74L72
7979A23j31j22K12J50k83O8J2m9Ok29MK72k79O9K59l3J76k98O0J49l68J96p6J39
8003B7k24L58j88%Q4l74K95J10j62n4K07k55L79j36o6J47k07J27r2Q7J79l06J47
8026H3k94J95m0R3K22j53n4m8K4J49J3j39j52K64l14J00NN5j53J5K36j01n2j15
$$ plain form
7865 210 100 -217 -91 141 85 57 -19 22 36 34 -39 -102 268 153 167 -155 96 -55 39 257 -22 173 -176 -86
7889 -86 -57 -138 -323 -104 -176 -212 -116 272 19 -189 64 -176 1 141 -204 155 38 -166 238 90 25 -103
7911 -103 85 10 -55 -2 35 -73 155 174 -295 352 -62 -436 77 28 -178 -160 -89 19 186 64 71 -189 36
7934 36 143 -14 117 21 -102 71 -36 119 240 -23 -67 -127 77 344 29 146 116 -45 107 42 -22 171
7956 171 -17 147 7 130 197 -54 239 -187 111 59 -23 -47 178 -145 20 240 218 35 3 7 125 -249 123
7979 123 -8 -130 82 232 -51 17 29 -20 -14 -243 -239 33 -246 -177 82 49 225 -73 -13 136 -232 -36 -112 27
8003 27 -197 161 -27 -27 57 -317 -22 88 -74 -128 79 -176 203 67 1 148 -59 68 -24 63 242 -64 83
8026 83 -211 -16 -56 37 259 106 52 4 28 177 190 51 -101 163 -151 -51 -46 9 -144 -129 107 6 -46 -161
8050a61K43m2J85l52M03k80J92Nj41N4k1M4j24k9j89M66m29K03K8L88m13o5L23
8073B88j84pk44R2J37J2K38j62k7J32j29P7j69K52p2k78R9K0M9q6J25k04nO0J88
8098B02j8l59K66r9J40l26J64K09k22K60K8m02R0l7J46j05P4k15L14m30K40K03
8120A23k92K59K24n28o0M2m8L63r8r7K12q2k02J53j66M10j30k50J48j82J25J90
8142A14M4j30j09L12k84l3J02J02l5Nk59J17Q8j38m1K91j33J57J25l76R3qK8K29
8166B61m96L8M4m6L18L3l26N39k89k8J43j58J56l14L99j63n40L16M06l24R1q2
8188b2n9m5K48
$$ plain form
8050 -161 82 40 225 -127 276 -4 188 193 52 106 85 129 5 -24 -213 253 -176 27 55 443 30 -35 288
8073 288 104 97 -147 -55 82 94 332 170 143 275 146 223 54 306 234 -44 55 75 124 38 163 -41 -46 14 202
8098 202 184 -175 91 -8 132 -194 -30 179 -43 217 245 -157 -67 -104 42 -63 11 -204 110 -320 -80 123
8120 123 -169 90 314 -214 -274 -232 -280 83 -15 -112 100 18 -184 -31 -197 213 83 -167 -19 -201 -76 114
8142 114 158 28 -81 231 -53 -86 16 118 83 88 -171 -54 34 -104 -145 146 13 170 295 -81 12 4 32 261
8166 261 -235 -197 -153 -199 119 152 -174 365 76 48 191 33 189 -125 274 111 -429 -113 293 -31 60 -22
8188 -22 -81 -126 122
8191A22
$$ Imaginary data points
##PAGE= N=2
##DATA TABLE= (X++(I..I)), XYDATA
0@%%%%%%%%Pj5J6j6K4l2L2m0N6p2Q8j04J24j48J76k08K47k90L38l92M50n20N98
31C19o81P74q77R92j120J258j411J580j764J967k188K427k689K977l291L635m010
48b102M419m868N363n908O510p180P928q769R721j0810J2067j3540J5293j7419
62i295K0063k3456K7992l4402M4203o1234R9116l36371J02413M22727m58386J04947
74a01683L24239k17863j93470L73670K0712k15165J19082O7184k79535K7297J78663
85A03131j14811p8386J62350p0643j60979Q0724Q4821p3738J5720M1578l2730
96d2963R887O3638K0143K6761J2881j6060L864r574m9913Q384k550j01204l1835
109a08541P0384l8391m2019J16056K4149j15479O5834J35935o7022l4807J09046
$$ plain form
0 0 0 0 0 0 0 0 0 0 7 -8 8 -8 16 -16 16 -24 32 -40 48 -56 68 -80 96 -112 135 -155 183 -209 241 -279 319
31 319 -362 412 -465 527 -593 665 -746 834 -930 1037 -1151 1276 -1413 1564 -1727 1908 -2102
48 -2102 2317 -2551 2812 -3096 3414 -3766 4162 -4607 5114 -5696 6371 -7169 8124 -9295
62 -9295 10768 -12688 15304 -19098 25105 -36129 62987 -273384 -170971 251756 -206630 -101683
74 -101683 222556 4693 -188777 184893 205605 -9560 109522 176706 -102829 -75532 103131
85 103131 -11680 -90066 72284 1641 -159338 -78614 6207 -67531 -51811 -10233 -42963
96 -42963 -33076 30562 50705 77466 90347 74287 78151 68577 18664 27048 24498 -76706 -108541
109 -108541 -38157 -76548 -118567 -2511 21638 -93841 -28007 107928 40906 6099 115145
120A15145l8961j16632N6050M8724p2874J1220M8220q5818n5836P3419J2876m7755
132e2222L6254J9723o9982k317P7603J8185j1094L3754J3842l7883j1569L5210
144D9504P320m0123j8860j931m8779l5433M7281L2167l2209N642L4698k0522P97
157b0448P1277J3341n1120J4147K3046n1727q044N3856k2652n0542K4331J761
169b774m3752K1505L3328l6552j5003L6044n546j4282M1542K1984k6816L942K3544
182C7164j0073k070J7157k0422l9081o175L920o141J27N509q39p584k819K1282
196a0045L2015N489p230L376o969j5764J2239J7684j4669j2957K917k2068j9677
209c5659K6845J7390k4852p883J2825j3146l323L2423J3430j1059O523O057j1415
$$ plain form
120 115145 76184 -40448 15602 64326 -8548 2672 50892 -34926 -90762 -17343 -4467 -52222
132 -52222 -15968 3755 -66227 -68544 9059 27244 16150 49904 63746 25863 14294 49504
144 49504 56824 16701 -2159 -4090 -52869 -88302 -41021 -8854 -41063 -35421 -723 -21245 -20448
157 -20448 50829 64170 13050 27197 50243 -1484 -9528 44328 21676 -28866 -4535 -2774
169 -2774 -46526 -25021 8307 -28245 -43248 -7204 -12750 -27032 14510 36494 9678 13620 37164
182 37164 27091 25021 42178 21756 -17325 -23500 -19580 -25721 -25594 -20085 -20924 -28508 -31327 -10045
196 -10045 21970 27459 20229 23605 16636 872 13111 30795 16126 3169 6086 -15982 -35659
209 -35659 -8814 8576 -16276 -24159 -11334 -24480 -27803 4620 18050 6991 13514 19571 8156
222H156Q485K0144j3202k1825K72r276j9807J0124J4632j7431j0608J5948L121
235a1267l193K2303J8108j4261j1358J0782L682l818Q632J766k0394j2049O245
248d822j173m407R111O74k0787r563J6075J2723J21O862P500o567m957J1398J0055
263B2243M43l097j0723j7309m246Q131O4o090Q57k598j0435L666J9248Q790l275
278E669J564j155o938N155J3815p76q741k736n100r344L431R970n321r716j062
293a1285l070m741J0967J3964l860o175P175M061k168P314Q677o971j1998j632
307B58j449l328M189J233j1919o003P537L179j160R365O857r533o375R558O059
322H468j218L251J58j0259m194O935J63l792L184k207j2816k603J0351K999k986
$$ plain form
222 8156 16641 36785 23583 1758 2030 -7246 -27053 -16929 -2297 -19728 -30336 -14388 -11267
235 -11267 -14460 7843 25951 11690 332 11114 14796 10978 19610 21376 982 -11067 -4822
248 -4822 -5995 -10402 -1291 -617 -21404 -30967 -14892 -2169 -2048 4814 12314 5747 790 12188 22243
263 22243 22686 19589 8866 -8443 -12689 -4558 -4494 -10584 -9727 -12325 -22760 -19094 154 8944 5669
278 5669 7233 6078 -860 4295 18110 17334 8593 5857 757 -8587 -5156 4814 -507 -10223 -11285
293 -11285 -14355 -19096 -8129 5835 1975 -4200 2975 7036 4868 12182 20859 13888 1890 258
307 258 -1191 -4519 -330 903 -11016 -17019 -9482 -6303 -7463 1902 8759 -774 -7149 2409 8468
322 8468 7250 10501 10659 400 -3794 3141 3304 -488 2696 489 -12327 -14930 -4579 -1580 -4566
337d566L740J059n064K513R711J748j961J706l738q274J858N789l194m525M31
352b767k504m716N340O636l188k098M616k143l447P390N886n823l917M157j240
367B182l811N605J997q097l381M340k517l275O912L248p402k673P356K004j369
382A119L331J242m717j754K704m75l01K350k388o617J085M812r51j657K849n98
398C4l949J393M666J66j84J266k331l041L205L974l362k573J792k942l429L666
414a649L756k979k047K778j035k050M497M728m074l534K449M74k420K691K939
429D524m275k824J701o58q13M411P61o733j357N364k60k096M658K279n368j295
445a981M184k03p31K590k391n898J690L503k786K81L707k347m476L094L466p43
$$ plain form
337 -4566 -826 233 -4831 -2318 7393 9141 7180 8886 5148 -3126 -1268 4521 1327 -3198 -2767
352 -2767 -5271 -9987 -4647 1989 -1199 -3297 1319 -824 -4271 3119 9005 3182 -735 3422 2182
367 2182 -1629 3976 5973 -2124 -5505 -1165 -3682 -6957 -45 3203 -4199 -6872 484 2488 1119
382 1119 4450 5692 975 -779 1925 1450 1149 3499 1111 -5506 -4421 391 -560 -2217 632 34
398 34 -3915 -2522 2144 2310 2126 3392 1061 -1980 1225 5199 1837 -736 1056 -1886 -5315 -1649
414 -1649 2107 -872 -2919 -141 -1176 -3226 1271 5999 1925 -1609 840 1314 -1106 1585 4524
429 4524 249 -2575 -874 -1532 -2345 2066 2827 -3906 -5263 101 -159 -2255 2403 4682 -686 -1981
445 -1981 2203 2000 1269 3859 1468 -4430 -2740 763 -2023 -1742 1965 -382 -4858 -1764 1702 959
461I59M80P61k731j741K984J415p43M21k98k528p39J897P78j84q70j931j596Q07
479b859J809K166m02q27M09L22p77J969L385k335l731K06r1j248K047K124l286
496a119j797K338k79j822M084K219n051j216L306l68o59L253j8l175M63J154j270
513D3O07J930k430l571Q63J028o14J484J163j429K55R98n4J162J953o50k438q63
531e63Q22K65j97k31o4j178p20L54J449L8n73J79n67r68J329K057n37l51L11P14
551A569j125J061N87j476o55k89j438j13J588R2j761J81J375K16q4J077Q69l50
569A324r91l15O68L17r7l38o01l61M30l91m49N90K53j339m35J503J31n15J333
588G17L94j331Q55J496j514q4J173r12k042J453M76k259L82J299j663k47K608
$$ plain form
461 959 1439 2200 -531 -2272 712 2127 1384 1805 1507 -1021 -1760 137 915 731 -139 -2070 -3666 -2859
479 -2859 -1050 1116 714 -113 296 618 -159 1810 5195 2860 -871 -665 -756 -2004 43 2167 -1119
496 -1119 -2916 -578 -857 -2679 1405 3624 -1427 -2643 663 295 -364 2889 2871 -304 159 1313 43
513 43 650 2580 150 -3421 -2558 -1530 -2144 -660 503 -926 -671 327 273 1435 3388 2738 300 -563
531 -563 259 524 327 96 32 -1146 -1866 -1512 -63 -25 -598 -419 -986 -1954 -625 1432 895 544 855 1569
551 1569 444 1505 2092 616 -39 -328 -1766 -1879 -291 -199 -1960 -1779 -404 -188 -272 805 1674 1324
569 1324 333 18 686 1003 906 568 -33 -394 36 -355 -804 -214 39 -1300 -1735 -232 -101 -616 717
588 717 1111 -220 635 2131 617 533 1706 794 -1248 205 681 -1578 -1196 103 -1560 -1807 801
605H01j08j901J267J170j471J15J955r19j014J005o24o99O97P59j472k91M3j95
623h82K5K33N46L13k03l22Q41O11l32k42J90m87n88N95J16j065O81K0j617M73
643a094K029r45o41N70r7n80J072J178j220P6P60j319n45J483M79j668M78K37
661B53j583K7J275o2n98N91Q71j089K50J548m10p76l6nn57k64N49k7p52K92N78
682G5o26j86J301O9j330J46R92n28l5R72n4q80K46N20j016L29Q18j106j604J083
702h14L67n36M25Q76k47n70J011K35k24Q89k85j295l73N57k41n06L20N96m89n97
722i01O52M80m10K72K31m43j08O28M32r44K48P32l36p47R31k39r53O1K07q48k19
743a274J366p31l55R60P11q36M97R14k78n19J67j39p16L12Q4n90j42P54k87q73
$$ plain form
605 801 693 -1208 59 1229 -242 -127 1828 909 -105 900 276 -423 274 1033 -439 -730 -687 -882
623 -882 -857 -624 -78 235 32 -290 551 1162 830 588 778 291 -297 298 414 -651 30 50 -1567 -1094
643 -1094 935 -10 -651 -81 -178 -758 314 1492 272 348 1108 -211 -756 727 1206 -462 16 253
661 253 -1330 -1303 -28 -90 -688 -97 774 -315 -65 1483 1073 297 261 256 -301 -565 -16 -43 -795 -503 75
682 75 -551 -737 564 633 -697 -551 441 -87 -122 850 796 -84 162 682 -334 -5 813 -293 -1897 -814
702 -814 -447 -983 -558 318 71 -499 512 747 523 1412 1127 -168 -541 16 -225 -731 -411 185 -304 -901
722 -901 -249 231 -179 93 324 -119 -227 401 833 -111 137 869 533 -214 717 478 -475 -414 -207 -1055 -1274
743 -1274 92 -639 -994 -34 677 -159 338 1252 974 455 622 483 -233 79 163 -427 -569 185 -102 -975
763i75N41M81j41k9p1K28l3k40L61J78k15Q69l12m40J98m2m40m69L16l10o46M14
785g77M89n06N98P85k06n81P96M31n35j18L97m90q59L57N14p10L17L25o52k33
805f58P56K33o17j40O93m16j78L00O97l30L48k42n64j67Q07m00n32J20R4n61P6
826f81M87R13o41j26L67k79R2N94j99n40j27K75o95L38O55n5n29j7K05k15N4M44
848C20k45m81L06K55k76P7N69l13m40Q4K38j93L51j7k24m59K99J1NM16J82k64
870B01o71M95N05l40k68Q7l24k67L68NK4N77l1n58J36M42j12m04Q1J08j90j94
892c30M63K34m67M17k61k65K24K16m43j80K98j67m40O06K74J19l0r7K31l69j35
913a02N23l15m26k3K67l70L51K67j01%q9N5j19L63R6n84k1N47k42l88K99M70k97
$$ plain form
763 -975 -434 47 -94 -123 -194 34 1 -239 122 300 85 954 642 202 400 358 -82 -551 -235 -545 -1191 -777
785 -777 -288 -794 -196 589 383 -198 598 1029 494 376 773 283 -576 -219 295 -415 -98 227 -425 -658
805 -658 98 331 -286 -426 267 -149 -327 -27 670 340 688 446 -118 -285 522 122 -410 -290 -196 -757 -681
826 -681 -194 719 78 -48 319 40 132 726 527 -13 -140 135 -560 -222 433 378 -151 -168 37 -178 -124 320
848 320 75 -406 -100 155 -121 -44 525 212 -228 -144 94 -99 252 235 11 -448 -149 -138 -133 283 465 201
870 201 -470 25 530 190 -78 9 -315 -582 -214 -209 -185 392 361 -197 -61 381 269 -135 -54 54 -136 -330
892 -330 133 367 -100 317 56 -209 15 231 -212 -392 -94 -261 -701 -95 179 298 268 171 402 33 -102
913 -102 421 106 -320 -343 -76 -446 -95 172 71 71 -18 37 -82 281 377 -207 -228 319 77 -311 -12 458 161
936A61o2N6qj35o6l75q3M93P9k86m6M20j15j02J22K84K14k23l69k6M4Lo7M3k7
961g1k8JK8J04l7K47n87o8N96k02M0J29k6Kk0K78o24M00M77n61n39K48L25m41
985c29O75l84l10R5M74J48k37R0l5k33n04N16j49J60J02k38n2J03L64k63n3P3
1007A3K15l57l09K06L56K7n01L54k36K04M68l2n71J02K7m05N08M22m93k9J72p1
1029G0k63K28L51j03m52m0Q5k7L06J30j73l18L08J12k20L46J88k95k46L4l01L62
1051H2Q5q8p2k76K79m7J00q5J39k68RJ26P9K40j58l8j59j11j1M48l9l6l16j27
1075b44OK93K0j05O6r8m48M82N61m86j66K07M8k58m2M48j36l87R8p4j88J96L26
1098A19k64J73J13m99L17J21K0J66k84P9J42j68J25L6k68J32j62K0j57L8O1O8
$$ plain form
936 161 99 155 147 12 -54 -429 -512 -19 60 -226 -272 148 33 -69 53 337 551 328 -41 -67 -23 -20 -87 -44 -71
961 -71 -99 -98 -70 34 -3 244 -343 -411 185 -17 23 152 126 128 108 386 -238 162 639 78 -461 -213 112 -329
985 -329 346 -38 -348 -253 221 369 132 222 187 -46 -550 -34 -183 -23 79 -159 -211 -108 256 -7 -60 13
1007 13 228 -129 -438 -232 124 151 -350 4 -232 -28 440 408 -163 -61 -34 -439 69 491 -2 -31 141 70
1029 70 -193 35 386 283 -169 -209 -124 -151 155 285 112 -206 102 214 -6 340 528 233 -13 21 -280 82
1051 82 167 79 7 -269 10 -37 63 -22 117 -151 -142 -16 63 303 145 107 -52 -163 -174 274 235 199 -117 -244
1075 -244 -238 55 75 -30 36 -62 -510 -28 533 47 -119 88 136 -122 -164 284 148 -239 -141 -215 -403 -207 119
1098 119 -145 28 141 -358 -41 80 100 266 -18 61 203 35 160 196 -72 60 -102 -82 -239 -201 -140 -72
1120g2l77J82L49j45L06J1j20l53P7O2j26N39j73k04J04J4l41J85k2J25J04n6
1142F9K11k12j66K99j25k69K25K39l25J37MJ3k2K66l26Q4J8k66J21j09M41k39
1164F8J2l13J36mjJ59ql8J97k76k7p7J99J49n13R6K60J00j77K23l36P7J73J29
1188B08l17M12l97J75j12k24J45J13L06k08j28J69j24l16M31N1k8l36J45J45J60
1209B70l23J29j25j29K88r2K1r1J21k91j34K17P3P0Q3m4k0m5j04K80k9k74r0j89
1233d28O11k34K4J32k02J50l20L55J66l07P1l5j50L34M5k16P0j82j11L66k68K61
1255A32j58N2o6j77p0K10j01M86l20m2L99k12q5Pk94N12m55P4L2j7K02l00j1O7
1279a35l6K18j29J2J88Q7j10r9J0q1K74l04L23l41PJ5k9K45M8l03K06J98l44J39
$$ plain form
1120 -72 -449 -267 82 -63 243 254 134 -219 -142 -80 -206 333 160 -44 60 74 -267 -82 -104 21 125 69
1142 69 280 68 -98 201 76 -193 32 271 -54 83 87 100 78 344 18 102 120 -146 -25 -134 307 68
1164 68 80 -233 -97 -101 -102 57 49 11 208 -68 -95 -172 27 176 -337 -241 19 119 -58 165 -171 -94 79 208
1188 208 -109 303 -94 81 -31 -255 -110 3 309 101 -27 142 18 -298 133 184 156 -180 -35 110 270
1209 270 -53 76 -49 -178 110 18 39 -52 69 -222 -356 -139 -66 4 87 43 23 -22 -126 154 125 -149 -239 -428
1233 -428 183 -51 -27 105 -97 53 -267 88 254 -53 18 -17 -167 167 212 -4 66 -116 -227 139 -129 132
1255 132 -26 26 -40 -217 -287 -77 -178 308 -12 -54 345 133 48 55 -239 273 -182 -108 -76 -93 109 -191 -202 -135
1279 -135 -171 47 -82 -70 118 205 95 -4 6 -75 199 -105 218 -123 -116 -101 -130 115 163 -140 66 264 -80 59
1303E9j59L62l70J2K64J41j34L04l37j74q6r8M2J41l22K37K16j39N0K05l87L3
1325a40M7J26K8j07J17j99J68J06j9l50L25r2J34l26k2J05k19M36m5j16K00j71
1347a4J14Rl41J78K84l47L2J44j89J05j28K27k89L96m09L29J12l56N0mpL02l22
1370a24K57o3K32j94k49K49j16J97k64L65l50K06j50p4J30k7l7J60k09K93j27
1391A05k42M02k70k44J15K83n3k79j05M93l20K44R2r0j11R1K12l44J33j69K26
1412A69l4k99J43o9j30J75j25M10k74P4j43K02j49l01M18m9m8o7P0J40l49J64
1434g2M4j83M29k83K9O5P8k69R9L36k24k0JJ4J60j76q4J55r9l42L32r0K7rJ51
1459F9L1j16L93n29J90k1J54M1m32pJ96j02J61k68Q3J76j24L30Lm85K22j75J62
$$ plain form
1303 59 -100 262 -108 -96 168 309 175 479 142 -32 -118 -216 -174 -33 -355 -118 98 -41 9 214 -173 -140
1325 -140 -93 33 61 -46 71 -128 40 146 127 -223 102 10 144 -182 -204 -99 -318 118 73 -43 157 -14
1347 -14 100 109 -232 -54 230 -117 -85 59 -130 -25 -153 74 -215 181 -228 101 213 -143 -93 -97 -104 198 -124
1370 -124 133 70 302 108 -141 108 -8 189 -75 290 -60 146 -4 -78 52 25 -12 148 -61 232 105
1391 105 -137 265 -5 -249 -134 149 96 -183 -288 205 -115 129 221 131 20 111 323 -21 112 -57 169
1412 169 135 -164 -21 -90 -220 -45 -170 240 -34 40 -103 99 -50 -351 67 18 -30 -97 -27 113 -236 -72
1434 -72 -28 -211 218 -65 -36 29 107 -162 -63 273 49 29 30 44 204 28 -56 99 0 -342 -10 -100 -73 -82 69
1459 69 100 -16 377 -152 38 17 171 212 -220 -227 -31 -133 28 -240 -157 19 -105 225 228 -257 -35 -210 -48
1482d8J52k83J94J03q5j55m0J20P1O2l06J72j5o4K45j41P8j22mK00N1k43J54k31
1506a35K0K83k39K7K8r3J17n8j61K31k75N28k02R6n6n4o2l0J90l63J30J70q7j50
1530a45n0k7P6J16m3l8J82n8o4rQL50l34m4J96n4j97M1j17L96o8J50j48j26j36
1555a43m0K67l73M34l67J10J35j66J49O5p9J44n7m4P9J13l92J39J40k9l25K78
1577C8N0Lj46m7K01l20L63J5r9o0R5j46K32k62Kj88K89o9L78k53k36L19m23K88
1601B4Q9m0K50j20l40qJ63Q8j17N1J0j70KJ55O7j58k5j04Q8k7K0J47p8j84L80
1626A63k54N7J23n0j82K97r1j89J11M9k68K24P9p0qj81M06k18j78L30k53K04Q4
1649A85J1l71J82R8jk70J02O4R4j01L96m48J69M2j78k33Q0L09j57l2J85l94n0
$$ plain form
1482 -48 104 -179 15 118 33 -122 -162 -42 29 91 -215 -43 -58 -122 123 -18 60 -62 -66 134 185 -58 96 -135
1506 -135 -115 168 -71 -44 -16 -109 8 -50 -211 20 -255 273 71 167 111 57 -5 -35 155 -208 -78 92 5 -145
1530 -145 -195 -222 -146 -30 -73 -111 71 13 -51 -60 -52 298 -36 -80 116 62 -135 -94 -211 185 117 267 119 -7 -143
1555 -143 -183 84 -289 145 -222 -112 23 -143 6 71 -8 136 79 35 114 227 -165 -26 114 85 -240 38
1577 38 88 91 -55 -102 99 -221 142 157 58 -2 93 -53 179 -83 -81 -269 20 -49 329 76 -160 159 -264 24
1601 24 113 73 323 203 -137 -145 18 106 -11 40 50 -120 -118 37 104 -54 -79 -183 -95 -122 -102 45 -33 -217 163
1626 163 -91 -34 89 39 -143 154 63 -126 -15 34 -234 -10 69 -1 -9 -190 216 -2 -180 150 -103 101 185
1649 185 196 -175 7 105 104 -166 -64 0 94 -7 389 -59 110 152 -26 -259 -179 130 -27 -59 126 -268 -318
1672c18K35o2K18K9j79N7n9n8j07J86Q4j18K07J39m19j42M23j96r5K25j87L56
1694B19m18L27O4m27J60J5O3J80k37J31q9N3K02k27j50Q8m6K3j9l2J61m0O1O0
1718A22l50K41j30q3K56k32J13J72j24J11J18n00J75j03K47j27K05j74k3O9l49
1739c66J83k8R0P4L7k9j25K18J4l2P3j53N5J06l5k71N9J15n9j56J92J99m9O6l72
1764a94L65k95m1R4J12k60M6O3O3j6O9j68J72J5k77L82j32M9p5J20j08J31J20
1787B35l13j32M24l74K24l52K53k0P5J51l12Q0nML1J8R1j38q1K69k41K1K31q2
1811E7R2Pj63R6j77j8j09J79k1L34k86N7m9J9j79J10j56L08n2O0q7J18m0qk01
1836a09K10k32j93J44MJ42J64k62M2M2O5L77k59J2M6p2k41JqM8%R2J62J24k91
$$ plain form
1672 -318 -83 -145 73 102 -77 -20 -79 -137 -244 -58 26 -92 115 254 -165 -307 116 -80 -175 50 -137 219
1694 219 -199 128 192 -235 -75 -60 3 183 -54 77 -12 41 243 16 -134 -46 -92 -69 -88 -120 41 1 62 122
1718 122 -228 13 -117 -200 56 -176 -63 109 -15 96 214 -286 -111 -214 33 -94 111 -63 -86 -17 -366
1739 -366 -183 -211 -121 -47 -10 -39 -164 54 68 36 109 -44 11 117 82 -189 -130 -15 -74 -230 -38 161 112 178 -194
1764 -194 171 -124 -165 -71 41 -219 -173 -110 -47 -63 6 -162 10 25 -252 130 -2 47 -28 92 -16 115 235
1787 235 -78 -210 214 -160 64 -288 -35 -55 20 171 -141 -61 -66 -62 -31 -13 78 -60 -141 128 -113 -92 139 57
1811 57 149 156 -7 89 -88 -106 -215 -36 -57 277 -9 48 -1 18 -161 -51 -207 101 49 109 22 140 100 92 -109
1836 -109 101 -131 -324 -180 -176 -34 130 -132 -90 -48 17 394 135 147 193 121 -120 -119 -127 -79 -79 13 175 299 8
1861HJ93m07K68%K41l93Q9j0j0K26k84Q8k47K08J31k00k5J12j15j81K00lJ5K07
1885A11j20L41l55J27o8j25L00K0j72j65K48q2l15M26r7J77J4k52j91M6J05k0
1907d7J99j28O3j00k09L01k95K05J07l44M18k44J46K13k12qq9J6j44M9l3K60m3
1930H1J43l34J30j30Q0O7l20N71k16j70L99j82q4J96l25k4L50j54m8p6o8Q3K24
1953A93k22j11L06l00J81K01j31k39L10k56N9m72M95j25N4J00j70J61m05L86J10
1974A25l2k02K08o0k53K51j72N52k39j61Jj4k5K28mj83j03j16L18k75J25Q8j8
1997C9n2j45Q9R8n1J39n4l64L53j1j55R8M7r6J39l8k01N5M05j87j20q8J32l03
2021b71L40j6j36J53n8PQ5j24J92j00j58r3K18j50L13k99K36l23L61n5l33M43
$$ plain form
1861 8 201 -206 62 62 303 -90 -1 -11 -21 205 -79 9 -238 -30 101 -99 -124 -12 -127 -308 -108 -111 -96 111
1885 111 -9 332 -23 104 36 -89 211 231 59 -106 142 60 -255 171 74 251 265 13 -178 -132 -27 -47
1907 -47 152 24 87 -13 -222 79 -216 -11 96 -248 170 -74 72 285 73 65 -24 -8 -152 -103 -136 124 81
1930 81 224 -110 20 -110 -30 37 -283 288 72 -98 301 119 35 231 -94 -118 232 78 30 -46 -114 -31 193
1953 193 -29 -140 166 -134 47 248 117 -122 188 -68 -9 -481 14 -111 -57 43 -127 34 -371 15 125
1974 125 93 -109 99 39 -214 37 -135 417 178 17 18 4 -21 207 203 20 -83 -199 119 -156 -31 57 39
1997 39 -13 -158 -69 29 -22 117 63 -301 52 41 -114 -16 31 -65 74 36 -165 -110 295 108 -12 -100 32 -271
2021 -271 69 53 -83 70 12 19 104 -20 172 72 -86 -179 39 -111 202 -97 139 -184 177 122 -211 232
2043B32k57j6l31L87j07J68l50J10M38j63J71k15N7l43K00J60Mj30R1k25OK93
2065A80Q3l16M44l90j83J00K47r3J53j27k24K23q8j42J52L0r4j2jJ53k99K64J61
2088B21l58K73j49n1L35o37K98L77k13k41M34l28K11n6N1k15o5J90P3j82j8K15
2110A65N3L0k44J20N8p6k0l23M75o4k93J90j79p1K14l9K6k94K51k78K39J00m3
2133cj41M2J21M0K05J03j76L45m62K18k25j4p3j58R2mJ27mk15K83K31k58k89J14
2157a01J19R6J90k12j26J10j03J8k27J32R3j82J68O7m00M56L1j01j25o6J22O1
2179B0k46J68N8N4k54p0K67p1P8PM4n0j47l1K61j24J56k88J74M3j15k44K34K2
2203e4K37k67O4L3j24J40j99m1L83J10j70j28k63K61j52J46Oj68R7J05Q0K7j3
$$ plain form
2043 232 -25 -41 -372 15 -92 76 -274 -164 274 111 282 67 124 -219 -19 141 145 15 106 -119 -113 180
2065 180 263 -53 391 1 -182 -82 165 72 225 98 -126 97 9 -133 19 49 -45 -57 -58 95 -204 60 221
2088 221 -137 136 -13 -64 271 -366 -68 309 96 -145 289 -39 172 116 167 -48 -113 77 150 -32 -50 165
2110 165 218 248 4 124 182 106 86 -237 238 174 -119 71 -108 -179 35 -4 22 -272 -21 -299 -60 40 -3
2133 -3 -144 -102 19 59 264 367 191 536 74 292 67 53 -20 -178 -86 -90 37 33 -182 101 332 74 -215 -101
2157 -101 18 114 304 92 -34 76 -27 -9 -236 -104 -11 -193 -25 42 -358 98 129 28 -97 -163 -41 20
2179 20 -226 -58 0 54 -200 -270 -3 -74 4 11 55 5 -142 -173 88 -36 120 -168 6 49 -66 -310 -76 -54
2203 -54 183 -84 -20 13 -111 29 -170 -211 172 282 112 -16 -279 -18 -170 -24 -18 -186 -89 16 96 123 110
2226A10l98K67j4K34j77K71j99l10M40m6j01Q3k50m1L18k43J67N7j97o3J4Q2J03
2249A07j54p8k2N1j61J84J1m4J41j21M5R8j11QOj15R9k9O0P3J52j80l1j89L76
2274A76k63M6K47k11j41J3j96N15l4j25j17mj67J77k66L16R5J07l32J50rM8J01
2297A26nj99J63j23p0O2j59L57L5k36m6J84K5L8l28n0K86Kl1J78k63k2L4J48k25
2322a19J59k22K2j46K20J34l94M81k29o1K43o7j25P6K17ll41L02m13P8J05j81
2344b64J69p0k3L77j57l3K77k59J54m4o7R1k72j71M63K6j82p2pK9J9l6P8O2j51
2369f3K73j96m2Q8j1N1k50K78j55n8o4J45p0O0Rj16l4K83j74J44l02j26K73j91
2393b48K02k61N52l02Q4J2q4J83R8m27K25R2j79j54J95R0L9n2L8n4j14J31k15
$$ plain form
2226 110 -288 -21 -35 199 22 293 94 -216 224 178 77 160 -90 -131 187 -56 111 168 -29 -92 -78 4 107
2249 107 -47 -125 -147 -96 -257 -73 -62 -106 35 -86 -41 57 -54 -46 -40 -155 -56 -85 -25 48 200 20 -11 -200 176
2274 176 -87 -41 206 -5 -146 -133 -329 186 152 27 -90 -94 -261 -84 -350 -34 61 168 -164 -14 -23 25 126
2297 126 121 -78 85 -38 -108 -46 -205 152 187 -49 -95 89 114 152 -176 -226 60 62 31 209 -54 -76 -42 106 -119
2322 -119 40 -182 -160 -306 -86 48 -346 135 -94 -155 88 21 -104 -28 189 186 -155 147 -266 -188 -83 -264
2344 -264 -95 -165 -188 189 32 -1 276 17 171 127 60 151 -121 -292 171 197 15 -57 -64 -35 -16 -52 26 88 -63
2369 -63 210 14 -28 60 49 100 -150 128 -27 -85 -149 -4 -74 -14 -5 -121 -155 128 -46 98 -204 -330 -57 -248
2393 -248 -46 -307 245 -57 27 39 -45 138 236 -191 34 126 -53 -207 -12 78 117 65 103 49 -65 66 -149
2416a49K35k52P9J24K9j21j04J16L1k1k79M03o5k80L03J83k39N8K76l45pK0j66
2439a71K14K41j38k91J63l0N7K58m72lJ40K65j53J18j80q2K58j28PNJ33l93L22
2462A40K64l98K21k6Q5j12l25K87m9r1j10RM4j58M6L22k03L0m1L05j83k49K12
2485B0j17Q9N8l7q5pJ60Kj9L48k97k13k37K69K09j25K43m54Nl3n5o3L19j8J14
2510G6k31l1J75k41L05OK0qJ73k26n3k3K82L1m13K99k75pJ84k00M16l65K06j13
2534a3J35l39mK52K32k16KQ5Q1k20r4M07j72M0k08j23J43j16k5J02O5J54k22Q6
2558C2j14J55j33K7j16J81j08k7N6L46l08l8Jm9P9j25J82n3r8K8PJ36k2Q6j81
2583e6m3J84K5J5j37n7j08J61q6J30J33j69M8L5j04N1P4p4j15R9J07K05k69l8
$$ plain form
2416 -149 86 -166 -87 37 66 -55 -159 -43 -12 -33 -312 91 26 -254 49 232 -7 51 327 -18 -25 -5 -171
2439 -171 43 284 146 -145 18 -12 45 303 -169 -172 -32 233 80 198 18 -64 194 66 73 78 211 -182 140
2462 140 404 6 227 201 286 174 -151 136 87 -4 -114 -105 -61 -219 -173 149 -54 -24 -65 240 57 -192 20
2485 20 -97 -8 50 13 -72 -79 81 83 64 412 115 -98 -335 -66 143 18 261 -193 -188 -221 -276 -339 -20 -38 76
2510 76 -155 -186 -11 -252 53 59 79 71 244 18 -35 -58 224 255 -158 141 -134 -141 43 -157 259 -106 100 -13
2534 -13 122 -217 -221 31 263 47 49 134 215 -5 -99 308 136 176 -32 -155 -12 -128 -153 -51 14 168 -54 32
2558 32 -82 73 -60 -33 -149 32 -76 -103 -47 299 -9 -47 -46 -95 -16 -141 41 -12 -110 -82 -75 61 39 125 -56
2583 -56 -99 85 110 125 -12 -69 -177 -16 -102 28 161 -8 40 75 -29 22 96 22 -93 6 113 318 49 11
2607A1N4Nj99K52j64K8Q7m2L07n0k11J06j87p3J27j56p1K87J87m97R4J37J68j61
2631C9k14M00m17J97k22J80M15n09L36k84%K83j95J19k92K04m39N55k24O3P1j96
2653a30L20j66k25K01k0J4j48OM46l95K74k36J86l7o1m5L8J4o7Q8l38K68m7J52
2677I2o2j71J21L56l01J00k13L98k36j44k01M53l03K81k51O2q3K57Q2m19L77k44
2699d9k5j9K4k01P5Q3J33j68l4K69o8J24q9r9R5O3j86L03k40k30L11k05J47J16
2723A30j96J33J3j13J46l32K41l8j86p9L31pJ10J98k50k19K92M3j01r0P8J3k4
2746I3R5j91J22L8p1j31J03n4j60J35O2k17J31N6j80J83j39M6j68L97k35J80o5
2769C0J52m04M49l42J3J52m2r3k43L93j33L34m93J3L10k12K70j30L05k15j24J7
$$ plain form
2607 11 65 70 -129 123 -41 -13 74 32 339 289 78 184 -3 -76 51 -105 -176 111 298 -199 -105 32 200 39
2631 39 -175 225 -192 5 -217 -37 378 -131 205 -79 -79 204 9 128 -164 40 -399 156 -68 -5 66 -130
2653 -130 190 24 -201 0 -20 -6 -154 -148 298 -97 177 -59 127 90 29 -16 22 36 -31 57 -281 -13 -60 92
2677 92 30 -141 -20 336 35 135 -78 320 84 -60 -261 192 -111 170 -81 -19 -102 155 237 -182 195 -49
2699 -49 -74 -93 -69 -270 -195 -112 21 -147 -181 88 20 144 55 -44 51 114 -72 231 -9 -239 72 -133 14 130
2723 130 -66 67 80 -33 113 -219 22 -16 -202 -281 50 43 153 351 101 -118 174 217 116 26 104 117 93
2746 93 188 -3 119 157 86 -45 58 4 -156 -21 41 -176 -45 11 -169 14 -125 -79 -247 150 -85 95 30
2769 30 182 -222 227 -115 -102 50 8 -85 -328 65 -68 266 -227 -214 96 -116 154 24 329 114 -10 7
2791GO1p8QJ43j90J46j53L93n39J82J19r6j9k5OJ09LRJ87l50K38p3L2J6j45N2
2817D3J5M0k7m6j08o9J82o2K93l97K66j82k35L83nK08k24K6J0q0j2j66P0O7QM5
2843D3pm9j34J12L66o09J20K20k00J66rn5j79k7K28J76k84J75k0r5J05k44K17
2866A6M0l1q9J05j7p2J97k09J0K0N3pO4M9q6N3n3o7R6o4j19K46qj28k02j41N09
2893A65k90j19O2K33j66O2k01K45p3J16j33J42rK72m43L2O7O4Pn5J38l33M7L24
2917A54k59QQ7p2K10l65J93k91J53L50N1l80L43k18K6J67k79K54K0j60M4N1n6
2940C1M9k27K73j54j11L9J38pl1R9j64K96J79m13k6L51k34j53j74K18K76k75J14
2963I4j67K2Q0j70K21j4l3m99M23P7J65j64J00n58K83K40j69J96r5Q6j61j22M4
$$ plain form
2791 7 68 -10 -2 141 -49 97 -56 337 -202 -20 99 3 -16 -41 -35 74 77 86 273 -77 161 88 120 136 -9 43
2817 43 58 98 71 25 -83 -152 30 -32 261 -136 130 -52 -287 96 91 299 75 101 111 31 19 -147 -77 -10 -2 43
2843 43 36 -13 -147 -35 331 -278 -158 62 -138 28 19 -36 -215 -242 -14 162 -122 53 33 -62 43 -201 16
2866 16 56 25 -64 41 24 -48 149 -60 -50 -30 23 16 80 129 43 96 43 -24 72 8 -111 135 127 -1 -203 -344 165
2893 165 -125 -244 -182 51 -115 -53 -254 -9 -82 34 -99 43 34 306 -137 -105 -38 26 33 -22 116 -217 -170 154
2917 154 -105 -97 -10 -82 128 -237 -44 -335 -182 168 219 -161 182 -36 -10 157 -122 132 152 -8 36 87 31
2940 31 80 -147 126 -28 -139 -100 38 31 0 99 -65 231 410 -3 -29 322 88 -65 -239 -21 255 -20 94
2963 94 -73 -51 29 -141 80 66 33 -466 -43 34 199 35 135 -423 -140 100 -69 127 32 118 -43 -165 -121
2986a21j12K35o6j49J38k23K58J00P7J42l55J38k14j01L56k26o7J10J7J41o3k51
3008b36O9J58j22R6k68L50l09J54j77N35r5j08p8L37j55k30LM9j83K34n7j4J87
3031A40j92k53M99j65K4m49J57M9R4lj5J8J05p1J4J23k11K33k63K63l52jK40J31
3055A15l7r7j15K49n7j13q2J28j63K07j4l06M43jk74K97k39K08m53K31K44j01
3077G0P4J22k11j76K3J92M0Kl0j84K75k78l9Q3j17J71r4K12k27q2J52k62M38j16
3101C8J32m00K72k94L63j05j83M4J79J25j05n1J67j60j63L1j35MO23k22M1m33
3123b32J00k77M71k0j76L42J5l12l0K73L1nj82P6P8j74J28n5j40J11O0K3q7k23
3147b05J33Q5j11q9K65k2k27r6L36j60K01j38q0L33j63O5j3j28J53j79pJ97j42
$$ plain form
2986 -121 -233 2 -64 -213 -75 -298 -40 60 137 279 -76 62 -152 -253 103 -123 -190 -80 -63 78 15 -236
3008 -236 -167 -9 -131 -35 -303 47 -262 -108 -285 250 155 47 -31 306 151 -79 -76 -27 -210 24 -33 -47 140
3031 140 -52 -305 194 29 53 -396 -239 -190 -96 -99 -114 -96 9 -62 -48 75 -136 97 -166 97 -255 -256 -16 115
3055 115 78 -19 -134 115 58 -55 -137 -9 -172 35 21 -285 158 157 -117 180 -59 149 -304 -73 171 70
3077 70 144 266 55 -121 -98 94 134 136 106 -78 197 -81 -120 -37 -154 17 -77 135 -92 -174 -22 -284 154 38
3101 38 170 -230 42 -252 111 6 -177 -133 46 171 66 15 182 22 -141 -110 -245 -241 382 160 201 -232
3123 -232 -132 -409 62 42 -134 208 223 -89 -119 154 185 180 -2 74 152 -22 106 51 -89 22 82 105 18 -205
3147 -205 -72 13 -98 -187 78 56 -171 -267 69 -91 110 -28 -108 225 62 127 114 -14 139 -40 -47 150 8
3170HK35l83K29P5k04J12nk81M41j18pk20Q9K90k74Oj24Q3j5J12j91L63l21kJ08
3195Fn1k82K92m9Q9K02n8o4k%l7m0J11k73K60k2j02K47k57K61l45Q9L8k90L23
3220D6L2j6k33J41k59J77J07M9q0p5K16j2j35N1M4O3k14K88k04l41L28OP4K67
3244C20j90j09j23m4J5m7Q0J37j34M29k81p5j0k30M60k88j04K71J35j85L4l17
3266b56J91j96J06K84k08K38q1n6R5j00k00l7J52j9K7K00k94K63k81K25K4rJ93
3289B61k04j51J30J45l62Q9o9M7J22K25l12J68o6j85j49J60J80n3J08j71M23m09
3311g3N53l00m74M43m25N59l68J27j49L4K3J10P9rk62j3M01l01o2L57r4l4j36
3334a4oJ02k58K53R6k70%M0N3O6J20k70R3J6K27k00l6K10p1J25j66l30L55M2k51
$$ plain form
3170 8 243 -140 89 164 -40 72 67 -214 227 109 102 -118 -29 261 -13 -7 -131 -48 -63 49 -142 221 -100 -102 6
3195 6 -45 -327 -35 -84 5 207 149 85 83 83 46 6 117 -156 104 82 -20 227 -30 231 -114 -25 13 -277 46
3220 46 78 62 -171 -30 -289 -112 -5 44 -36 -111 105 93 -42 9 53 116 -98 190 -14 -355 -27 -21 53 320
3244 320 130 21 -102 -146 -131 -178 -98 39 -95 334 53 -22 -32 -262 198 -90 -194 77 212 27 61 -256
3266 -256 -65 -261 -155 129 -79 159 78 22 117 17 -183 -220 -68 -87 -60 140 -154 109 -172 53 77 68 261
3289 261 57 -94 36 181 -181 -92 -161 -114 8 233 -79 89 23 -162 -311 -151 29 -24 84 -87 336 -73
3311 -73 480 180 -294 149 -276 283 -85 42 -107 -73 -50 60 139 130 -132 -145 256 -45 -107 250 156 122 -14
3334 -14 -20 82 -176 77 173 -97 -97 -57 -4 62 182 -88 5 21 248 48 12 222 151 276 110 -220 135 177 -74
3359g4L29m40L52J27l64J91K6J46k11k50K24n2M9p2k34L46j40Q1k80K98o5P2k62
3382b03L52Npk1R4r8o0k91J09K7o7L59r7j29J06mk61J96J23j5k31Q1j98P4K34
3407G8n5M1j8J1r9J10l4l66K39k4ON7J37r6m1m4J08K18j39J37k56J67k55R8J30
3432A10l82L91j33M6j79M60l03k87J56Q4J2N4K2j3l83K70K68k71k5J80k67k1K27
3455A6J52j65J34l30m7K56j77J99K38k11k99J95J93j62q7L24k60J41j46O7m1j17
3477a27j47L06K57k78L9k74J00O5J38k23L4K84j10j42J44j39Q0p8L67m89M15j30
3499I2k16J92j24R5j7q3R2K02k50Ml6j2p7P4L23j77Rk18K25J1j0j1k8l16J01N9
3525i6L29o4j05J14k18J2r2J03J73j71j9K40l60K2J23K32P8k08m2k64L32l54K03
$$ plain form
3359 -74 255 -185 167 294 -70 121 147 293 82 -168 56 4 53 -19 -253 93 -47 34 -246 52 -13 59 -203
3382 -203 149 154 147 126 220 122 62 -229 -120 -93 -160 199 102 -27 79 75 -186 10 133 118 -113 -32 -230 -156 78
3407 78 23 64 46 57 -42 68 34 -332 -93 -117 -111 -54 83 -13 -54 -98 10 228 89 226 -30 137 -118 -20 110
3432 110 -272 119 -14 32 -147 313 10 -277 -121 -37 -25 29 51 38 -345 -75 193 -78 -103 77 -190 -211 16
3455 16 168 3 137 -193 -240 16 -161 38 276 65 -234 -39 154 -8 -95 229 -31 110 -36 31 -10 -127
3477 -127 -274 32 289 11 50 -224 -124 -59 79 -144 -110 174 64 -78 66 -73 7 -71 296 -193 222 92
3499 92 -124 68 -56 39 22 -61 31 233 -17 -13 -49 -61 -138 -64 259 82 91 -127 98 109 99 88 60 -256 -155 -96
3525 -96 233 169 64 178 -40 -28 -120 -17 156 -15 -34 206 -154 -132 -9 223 301 93 51 -213 119 -235 -32
3548c2J51k69j3O1L52j32j34j3J70k15j9k48L95mR6J4q7l1l49%L46k44N7J77L4
3573F3q7lj62K81n1J67k20j08K08l2P4m7k9o3l6POr0M24k27q8q9J41J62n9O9k73
3600f2K74m89K44O8l33J02L82k97K05j26N9k82M63o0l46K55j07p4j29K04K24k77
3622a02o9L62l14J20r3K13P4p7k37J25j62J96q9l4J20k15J51l0J40j58J86k2J49
3645B34k81K42k73j33K66j92K43j65n7L8k51J11Q1J62k39J3j9K67k87L84j81J00
3667F3n5j27K59j87J35J47k05o6mj5l5K32j30J65n9j28K31k04m3L17m46K0J47
3690A2P2j05p0J22J32k21j22L40Jn5j43M7k03Q1n2J57M19o83L08j11R4n0K39j59
3714E0j34J10k0j2j56N56m05J08k77Q8J47n5K1R0k6j52Q2K65k09K02m92K88j96
$$ plain form
3548 -32 119 -150 -163 -102 250 118 -16 -29 141 -74 -93 -341 54 50 146 160 73 42 -307 -307 39 -205 -148 29 63
3573 63 -24 -27 -189 92 41 208 -12 -120 88 56 130 83 54 -9 -45 -38 -32 -122 302 75 -13 -102 39 201 142 211 -62
3600 -62 212 -277 -33 35 -298 -196 186 -111 94 -32 27 -255 208 148 -198 57 -50 -124 -253 -49 175 -102
3622 -102 -171 191 -123 -3 -96 117 191 114 -123 2 -160 36 -53 -87 33 -182 -31 -61 79 -79 107 85 234
3645 234 -47 195 -78 -211 55 -137 106 -59 -116 -78 -329 -218 -137 25 -214 -201 -220 47 -240 144 -37 63
3667 63 8 -119 140 -47 88 235 30 -36 -40 -55 -90 142 12 177 118 -10 221 17 -26 291 -155 -135 12
3690 12 84 -21 -91 31 163 -58 -180 160 161 106 -37 10 -193 -112 -164 -7 412 -271 37 -74 20 -30 209 50
3714 50 -84 26 6 -6 -162 394 -11 97 -180 -92 55 0 21 111 85 -67 15 280 71 273 -219 69 -127
3737a27K59P7j67k75N3J18n4lQ5k9j39J95O3P4m2J77k84k19K87%j40J14j57K11
3761G7R0K6k82J44k18L75n9k99L39k96K95j96J90j3j62k59r2P10m71n2n7K38J98
3784B26k83J05m4K3K20j82J52j35N0l23J53K4L18l41L99m17Q7j24m5M8K99L5j39
3807A06N8l01K58j24M7J42j86N1j21j04M36q3k44M1J1q0J61k17O0J56j43J38j58
3830i6pJ98k63n9K01j06K91k17J34j36k34L39q4m1O9J41k05n0N3p8J71K4k04Q2
3854g7p0K11j18Q3k03J92j00N5j02O0J69k96K29k7j96J70R1k96L35j59J41j51
3876e9N5J68R5j10k38k63N06k25j13L26j31P5j7J01r3j87K48m51K05K89m93L32
3898B0oO6j67n6K60k85K44L5l22K50K02l47J30j91J98k94N03k99j28Q1N6P8k03
$$ plain form
3737 -127 132 209 42 -233 -180 -62 -116 -119 -34 -63 -202 -7 56 130 88 265 -19 -238 49 49 -91 23 -134 77
3761 77 167 193 -89 55 -163 212 153 -146 193 -103 192 -4 186 173 11 -248 -340 370 -101 -153 -210 28 226
3784 226 -57 48 4 27 247 65 217 82 132 -191 -38 -14 304 -37 362 -55 32 -92 -137 -89 210 245 106
3807 106 164 -137 121 -3 44 186 0 51 -70 -174 262 179 -65 -24 -13 -93 68 -149 -89 67 -76 62 -96
3830 -96 -103 95 -168 -227 -26 -132 159 -58 76 -60 -294 45 -39 -80 -11 130 -75 -125 -72 -150 21 45 -159 -77
3854 -77 -147 64 -54 29 -174 18 -82 -27 -129 -69 100 -196 33 6 -190 -20 71 -225 110 -49 92 -59
3876 -59 -4 164 259 149 -89 -352 154 -71 -184 142 11 86 69 170 77 -110 138 -313 -108 181 -312 20
3898 20 14 80 -87 -143 117 -168 76 111 -211 39 241 -106 24 -167 31 -263 240 -59 -187 -106 -50 28 -175
3921a75K78k75K2J73K5L2j40j27J97J74l63L02l3r3n2Q6k11Q1J84l22J0M48k52
3944c1l1k01M55k09L3L2jl9K2j22n8J42k1J77k09j2O5PPj10J11J09n5n1j71M5
3970a16L51N4n39K94p6j6k22K09L29l46J36j6l5j70J07o5K3K07m61J11K97k69
3992b13K38j85J28j4L37l31j70M92m74J99nk0j7j25J40q8J47J94l03PJ45j6j41
4015g5Mj4l0Q3J72L4j00J1j55J9K01l42L20K61j14m83P0P4k8M8q1J67N0J24m2
4040A74k92J14P5q1K07l71K01k87K29R6j10K59l88L94m63M63n15M20m6j19J06
4061F6j34r2L32j61p9j03l0J36j01oj01L13R3j28J38k4K30l63J68j09q3mj88J28
4085a02n5J95J78n4r9l13L48j57m1n1j04J60R4j2k4L14l55J48Ol15K45Mj3J25
$$ plain form
3921 -175 103 -172 -150 23 48 80 -60 -187 10 184 -179 123 90 -3 -55 31 -180 -99 85 -237 -227 221 -31
3944 -31 -62 -263 192 -17 16 48 47 8 30 -92 -150 -8 -29 148 -61 -73 -8 -1 6 -104 7 116 61 10 -161 -116
3970 -116 235 289 -250 44 -32 -48 -270 -61 268 -78 58 42 7 -163 -56 -121 -98 109 -352 -241 56 -213
3992 -213 25 -160 -32 -46 291 -40 -210 282 -192 7 2 -18 -35 -160 -20 -108 39 233 -70 -63 82 66 -75
4015 -75 -71 -85 -115 -32 140 174 74 85 -70 -51 150 -192 128 389 275 -208 -138 -64 -92 -44 -125 42 92 216 174
4040 174 -118 -4 71 -10 197 -174 27 -260 -31 65 -45 214 -174 220 -243 220 -295 125 79 -40 66
4061 66 -68 -160 172 11 -68 -171 -201 -65 -166 -172 -273 40 133 5 143 119 349 -14 154 45 -38 -42 -230 -102
4085 -102 -157 38 216 162 63 -250 98 -59 -100 -151 -255 -95 -1 -13 -37 277 -78 70 76 -239 6 10 -3 122
4109A22l87K67j57J41q6J27K29k71J62l62j19J81K37M3j87M0J13k15j17L74j76
4130d1M34k52m78L29O1j88K97j61l5o5J3K22j72J21o4R1K3j09J60m73J59J93n1
4153A4L03l95n9J99l0M5j77k0J83LQ2m25J51l4M1o0L76k53K28j3p7q3j7Q7k06
$$ plain form
4109 122 -265 2 -155 -14 -100 27 256 -15 147 -215 -334 -153 84 127 -60 -20 93 -122 -239 135 -41
4130 -41 393 141 -337 -8 53 -135 162 1 -34 -99 -86 136 -36 85 21 112 135 26 186 -287 -128 65 14
4153 14 317 -78 -137 62 32 77 -100 -120 63 66 148 -277 -126 -160 -119 -179 197 -56 172 159 82 -1 -18 69 -137
$$ [...]
8191a63
##END NTUPLES=NMR FID
##END=
