##TITLE=1H_DE-85_AC
 200.13MHz, CDCl3,
 8 sc
 
 24.3.2025
##JCAMPDX= 6.0         $$ Bruker NMR JCAMP-DX V2.0
##DATA TYPE= NMR FID
##DATA CLASS= NTUPLES
##ORIGIN= UXNMR, Bruker Analytische Messtechnik GmbH
##OWNER= pz
$$ XWIN-NMR		Version 3.5
$$ Mon Mar 24 14:09:45 2025 Russian Standard Time (UT+4h)  she@DPX200
##.OBSERVE FREQUENCY= 200.1313
##.OBSERVE NUCLEUS= ^1H
##.DELAY= (6, 6)
##.ACQUISITION MODE= SIMULTANEOUS
##.ACQUISITION SCHEME= undefined
##.AVERAGES= 8
##.DIGITISER RES= 18
##SPECTROMETER/DATA SYSTEM= spect
##.PULSE SEQUENCE= zg30
##.SOLVENT NAME= D2O
##.SHIFT REFERENCE= (INTERNAL, D2O, 0, 14.3821)
##AUDIT TRAIL= $$ (NUMBER, WHEN, WHO, WHERE, WHAT)
$$ ##TITLE= Audit trail, XWIN-NMR		Version 3.5
$$ ##JCAMPDX= 5.01
$$ ##ORIGIN= Bruker BioSpin GmbH
$$ ##OWNER= she
$$ F:/spectra/data/she/nmr/H-C/1/audita.txt
$$ ##AUDIT TRAIL=  $$ (NUMBER, WHEN, WHO, WHERE, WHAT)
(   1,<2025-03-24 14:08:20.35 +0400>,<she>,<DPX200>,
      <created by zg, POWCHK disabled, PULCHK disabled
       configuration hash MD5:
       00 E9 B6 7A A2 85 ED C7 34 08 36 98 17 FE 4E 26
       data hash MD5: 16K
       CF 48 1A 06 84 5D 82 3F 45 6E 27 9E CD 92 16 E2>)
$$ ##END=
$$ 
$$ hash MD5
$$ 65 3E D3 BE 66 C8 67 E6 20 60 C9 4B D4 4D A9 98
##$RELAX= 
##$RELAX= 
##$RELAX= 
##$RELAX= 
##$RELAX= 
##$RELAX= 
$$ Bruker specific parameters
$$ --------------------------
##$DU= <F:/spectra>
##$EXPNO= 1
##$NAME= <H-C>
##$PROCNO= 1
##$TYPE= <nmr>
##$USER= <she>
##$AMP= (0..31)
100 100 100 100 100 100 100 100 100 100 100 100 100 100 100 100 100 100 
100 100 100 100 100 100 100 100 100 100 100 100 100 100 
##$AQSEQ= 0
##$AQ_mod= 1
##$AUNM= <au_zg>
##$AUTOPOS= <>
##$BF1= 200.13
##$BF2= 200.13
##$BF3= 200.13
##$BF4= 200.13
##$BF5= 200.13
##$BF6= 200.13
##$BF7= 200.13
##$BF8= 200.13
##$BYTORDA= 1
##$CFDGTYP= 0
##$CFRGTYP= 5
##$CHEMSTR= <none>
##$CNST= (0..31)
1 1 145 1 1 1 1 1 1 1 1 1 1 1 1 1 1 1 1 1 1 1 1 1 1 1 1 1 1 1 1 1 
##$CPDPRG= <>
##$CPDPRG1= <>
##$CPDPRG2= <>
##$CPDPRG3= <>
##$CPDPRG4= <mlev>
##$CPDPRG5= <mlev>
##$CPDPRG6= <mlev>
##$CPDPRG7= <mlev>
##$CPDPRG8= <mlev>
##$CPDPRGB= <>
##$CPDPRGT= <>
##$D= (0..31)
0 0.7 0 0 0 0 0 0 0 0 0 0.03 0 0 0 0 0 0 0 0 0 0 0 0 0 0 0 0 0 0 0 0 
##$DATE= 1742810900
##$DBL= (0..7)
120 120 120 120 120 120 120 120 
##$DBP= (0..7)
150 150 150 150 150 150 150 150 
##$DBP07= 0
##$DBPNAM0= <>
##$DBPNAM1= <>
##$DBPNAM2= <>
##$DBPNAM3= <>
##$DBPNAM4= <>
##$DBPNAM5= <>
##$DBPNAM6= <>
##$DBPNAM7= <>
##$DBPOAL= (0..7)
0.5 0.5 0.5 0.5 0.5 0.5 0.5 0.5 
##$DBPOFFS= (0..7)
0 0 0 0 0 0 0 0 
##$DE= 6
##$DECBNUC= <off>
##$DECIM= 32
##$DECNUC= <off>
##$DECSTAT= 4
##$DIGMOD= 1
##$DIGTYP= 9
##$DL= (0..7)
0 120 120 120 120 120 120 120 
##$DP= (0..7)
150 150 150 150 150 150 150 150 
##$DP07= 0
##$DPNAME0= <>
##$DPNAME1= <>
##$DPNAME2= <>
##$DPNAME3= <>
##$DPNAME4= <>
##$DPNAME5= <>
##$DPNAME6= <>
##$DPNAME7= <>
##$DPOAL= (0..7)
0.5 0.5 0.5 0.5 0.5 0.5 0.5 0.5 
##$DPOFFS= (0..7)
0 0 0 0 0 0 0 0 
##$DQDMODE= 0
##$DR= 18
##$DS= 0
##$DSLIST= <SSSSSSSSSSSSSSS>
$$ [...]
##$SUBNAM0= <"">
##$SUBNAM1= <"">
##$SUBNAM2= <"">
##$SUBNAM3= <"">
##$SUBNAM4= <"">
##$SUBNAM5= <"">
##$SUBNAM6= <"">
##$SUBNAM7= <"">
##$SUBNAM8= <"">
##$SUBNAM9= <"">
##$SW= 18.0517328524113
##$SWIBOX= (0..15)
0 0 2 0 0 0 0 0 0 0 0 0 0 0 0 0 
##$SW_h= 3612.71676300578
##$TD= 16384
##$TD0= 1
##$TE= 0
##$TE2= 300
##$TE3= 300
##$TEG= 300
##$TL= (0..7)
0 120 120 120 120 120 120 120 
##$TP= (0..7)
150 150 150 150 150 150 150 150 
##$TP07= 0
##$TPNAME0= <>
##$TPNAME1= <>
##$TPNAME2= <>
##$TPNAME3= <>
##$TPNAME4= <>
##$TPNAME5= <>
##$TPNAME6= <>
##$TPNAME7= <>
##$TPOAL= (0..7)
0.5 0.5 0.5 0.5 0.5 0.5 0.5 0.5 
##$TPOFFS= (0..7)
0 0 0 0 0 0 0 0 
##$TUNHIN= 0
##$TUNHOUT= 0
##$TUNXOUT= 0
##$USERA1= <user>
##$USERA2= <user>
##$USERA3= <user>
##$USERA4= <user>
##$USERA5= <user>
##$V9= 5
##$VALIST= <valist>
##$VCLIST= <CCCCCCCCCCCCCCC>
##$VD= 0
##$VDLIST= <DDDDDDDDDDDDDDD>
##$VPLIST= <PPPPPPPPPPPPPPP>
##$VTLIST= <TTTTTTTTTTTTTTT>
##$WBST= 1024
##$WBSW= 4
##$XGAIN= (0..3)
0 0 0 0 
##$XL= 0
##$YL= 0
##$YMAX_a= 345652
##$YMIN_a= -373854
##$ZGOPTNS= <>
##$ZL1= 120
##$ZL2= 120
##$ZL3= 120
##$ZL4= 120
##$ABSF1= 10
##$ABSF2= 0
##$ABSG= 5
##$ABSL= 3
##$ALPHA= 0
##$AQORDER= 0
##$ASSFAC= 0
##$ASSFACI= 0
##$ASSFACX= 0
##$ASSWID= 0
##$AUNMP= <proc_1d>
##$AZFE= 0.1
##$AZFW= 0.1
##$BCFW= 1
##$BC_mod= 2
##$BYTORDP= 1
##$COROFFS= 0
##$CY= -3
##$DATMOD= 1
##$DC= 2
##$DFILT= <>
##$DTYPP= 0
##$F1P= 0
##$F2P= 0
##$FCOR= 0.5
##$FTSIZE= 0
##$FT_mod= 4
##$GAMMA= 1
##$GB= 0.15
##$INTBC= 1
##$INTSCL= 1
##$ISEN= 128
##$LB= 0.25
##$LEV0= 0
##$LPBIN= 0
##$MAXI= 10000
##$MC2= 0
##$MEAN= 0
##$ME_mod= 0
##$MI= 1.114404
##$NCOEF= 0
##$NC_proc= 0
##$NLEV= 6
##$NOISF1= 3.799351
##$NOISF2= 2.8
##$NSP= 1
##$NTH_PI= 0
##$NZP= 0
##$OFFSET= 14.38212
##$PC= 1
##$PHC0= -474.4585
##$PHC1= 16.99221
##$PH_mod= 1
##$PKNL= yes
##$PPARMOD= 0
##$PSCAL= 0
##$PSIGN= 0
##$REVERSE= no
##$SF= 200.129724274929
##$SI= 16384
##$SIGF1= 3
##$SIGF2= 2
##$SINO= 400
##$SIOLD= 16384
##$SREGLST= <1H.CDCl3>
##$SSB= 0
##$STSI= 0
##$STSR= 0
##$SW_p= 3205.1282051282
##$SYMM= 0
##$S_DEV= 0
##$TDeff= 0
##$TDoff= 0
##$TI= <>
##$TILT= no
##$TM1= 0
##$TM2= 0
##$TOPLEV= 0
##$USERP1= <user>
##$USERP2= <user>
##$USERP3= <user>
##$USERP4= <user>
##$USERP5= <user>
##$WDW= 1
##$XDIM= 8192
##$YMAX_p= 0
##$YMIN_p= 0
$$ End of Bruker specific parameters
$$ ---------------------------------
##NTUPLES= NMR FID
##VAR_NAME=  TIME,          FID/REAL,        FID/IMAG
##SYMBOL=    X,             R,               I
##VAR_TYPE=  INDEPENDENT,   DEPENDENT,       DEPENDENT
##VAR_FORM=  AFFN,          ASDF,            ASDF
##VAR_DIM=   8192,          8192,            8192
##UNITS=     SECONDS,       ARBITRARY UNITS, ARBITRARY UNITS
##FACTOR=    0.0002768,     1,               1
##FIRST=     0,             0,               0
##LAST=      2.2672688,     0,               0
##MIN=       0,             -373854,         0
##MAX=       2.2672688,     345652,          0
$$ Real data points
##PAGE= N=1
##DATA TABLE= (X++(R..R)), XYDATA
0@%%%%%%%%%%%%%%%%%qJ6j6J6j6J6k4L2l4M2m8N3o1O9q1R1j00J14j30J46j64J84
39I7k03K26k55K81l10L44l80M22m63N09n62O18o82P53q29R16j017J129j258J410
59G46j590J808k078K421k877L511m451O006r024J7033q0938k73496l0925J96062
73a77792K78077J47853n0687j68743j14673K4956J16467O0802q2413j79315j18443
84b63911O4675K33604K39655P1629j55136k68729j95431J523J65330J84944P0398
95A48551o0580r8503k4813P0000Q4153j0872j31887j66662o4911J05701K17375
106F7552J80103K1889j42872j96810j17224K0019J06563R1380J4881l9333k0358
117a4210M2712P6542L1497o8152j41156j19928r416J13705J63025J07097p506
$$ plain form
0 0 0 0 0 0 0 0 0 0 0 0 0 0 0 0 0 0 0 -8 8 -8 8 -8 8 -16 16 -18 24 -24 29 -32 37 -44 47 -53 61 -69 77 -87 97
39 97 -106 120 -135 146 -164 180 -200 222 -241 268 -294 324 -358 395 -434 482 -535 594 -664 746
59 746 -844 964 -1114 1307 -1570 1941 -2510 3496 -5528 11505 -69433 -342929 -373854 -177792
73 -177792 100285 248138 197451 28708 -85965 -61009 55458 116260 33847 -145468 -263911
84 -263911 -199236 34368 274023 345652 190516 -78213 -273644 -272121 -106791 78153 148551
95 148551 87971 -10532 -35345 34655 118808 107936 -23951 -190613 -255524 -149823 67552
106 67552 247655 269544 126672 -70138 -187362 -167343 -60780 30600 45481 6148 -14210
117 -14210 28502 105044 136541 68389 -72767 -192695 -202111 -88406 74619 181716 174210
128A74210r6381j08687n5529O481K9989J4425l724Q931M6798P0728M5307k4139
140A08409r2868j09539n9062K4372Q6034R1840M9755k888l3629l6384k9900l0897
152c4757l4297k3965J1685N6947Q0631N9635J157n7091q0557n8986j2690K4716
164f7572L6179L1806K6372K8587K5296J378m0985p5302p0870k0332M7344Q8811
176A0712P5330K0517l5996n7043l9008q923L444o940j6805p04M0298P3104O0701
189A18687j238p4615j07119o9865J1898Q0883Q9624M0284k2092m8543k6540J0614
201A978J9428j2781n2881n4124O34P6302J10347O6430l0756j11227j14786m0962
213a42398N2949R5171O3468o830m9899l2450J9919M9622J8244n0929r4215o3506
$$ plain form
128 174210 77829 -30858 -86387 -79906 -49917 -35492 -39216 -30285 16513 87241 132548 108409
140 108409 15541 -93998 -153060 -128688 -42654 49186 98941 96053 62424 26040 -3860 -34757
152 -34757 -69054 -93019 -81334 -24387 56244 115879 117036 59945 -20612 -79598 -92288 -67572
164 -67572 -31393 413 26785 55372 80668 82046 41061 -34241 -105111 -125443 -78099 10712
176 10712 86042 106559 70563 13520 -25488 -34411 -30967 -37907 -54712 -55416 -15118 57986 118687
189 118687 117449 42834 -64285 -134150 -122252 -41369 48255 88539 66447 17904 -8636 1978
201 1978 21406 8625 -44256 -98380 -97746 -21444 88903 155333 124577 13350 -101436 -142398
213 -142398 -89449 5722 69190 62360 12461 -19989 -70 49552 67796 16867 -77348 -140854
225a40854K9264J14614J23215M2631o8456j26939r3331j75P6786Q0343K0425m1088
237A6435m6692N239N9732N8629q939q9173j10511m4991O4416J33850J08021P619
249A53635r1701j16310n6161L2093P5215M5465j9070n2971k0920M5668Q1486M4046
261A20475m4638j14039j03060j2577Q9599J28512P5993k2171r1197q3745j8923
272g5771M2011M8128M106m0450l6402J6846P2125P5005J2247p1805j10765p2741
284a37466J5480Q9397R6891M0918l0284o3337m1282K516K4655P400k6635l6562
296e8309l893M8813P6182M8965j8615p8159q6590l8700K8050O6318N7377J7280
308E8719j7301k2927p415L542o830k9194l7716j5014K9154O2474N8327J7388l4382
$$ plain form
225 -140854 -111590 3024 126239 168870 100414 -26525 -119856 -120031 -43245 37098 57523 16435
237 16435 -30257 -25018 34714 93343 84404 -4769 -115280 -160271 -95855 37995 146016 153635
249 153635 61934 -54376 -110537 -78444 -3229 42236 23166 -29805 -50725 -5057 76429 120475
261 120475 75837 -38202 -141262 -153839 -64240 64272 140265 118094 26897 -56848 -75771
272 -75771 -33760 14368 18474 -21976 -58378 -41532 30593 105598 117845 46040 -64725 -137466
284 -137466 -121986 -32589 64302 105220 74936 11599 -29683 -27167 -2512 4888 -21747 -58309
296 -58309 -62202 -13389 62793 111758 93143 14984 -71606 -110306 -82256 -15938 41439 58719
308 58719 41418 18491 11076 14618 7788 -21406 -59122 -74136 -44982 17492 75819 93207 58825
321E8825o1182n0038j5757J7060K8575K3016J4928J4287J5604O988j5999m1059
333d752m8297k5915J4752M7699N2296K8237n415k7451k7999j8896j1823j1059
345c8623r206O557L1371M8362L8721M57m3131o2967m4437j082L5988M4948K5508
358C2466L6r533j725O967k887k8109m5599l2677J1580N8474P2035L7869k0918
371G7979o4486o2366k1791K3202L9419K1055n818j2635P237L2167K8618q664n4841
384i24p0389l4510L1439P9993P5191J9987m3306o8618m3079O022L5042K3889j0209
397E28k8408p374L4888N8637L3945k8375q0039p8122j9678N4456Q8536O0036o155
410H2875n6010n5619j2965K7530L0209m462l7884l3617J2807O2131O9116K0153
$$ plain form
321 58825 -2357 -52395 -68152 -51092 -22517 499 15427 29714 45318 52306 36307 -4752
333 -4752 -53049 -78964 -64212 -16513 35783 64020 58605 31154 3155 -15741 -27564 -38623
345 -38623 -47829 -41272 -9901 38461 77182 77639 34508 -28459 -72896 -73978 -37990 6958 32466
358 32466 32502 22969 21244 28211 25324 -2785 -48384 -81061 -69481 -11007 61028 98897 77979
371 77979 13493 -48873 -70664 -47462 -8043 13012 7194 -5441 1796 33963 62581 53917 -924
384 -924 -71313 -105823 -74384 5609 80800 100787 57481 -11137 -54216 -48194 -13152 10737 528
397 528 -27880 -35254 -366 58271 92216 63841 -16198 -94320 -113998 -59542 28994 89030 82875
410 82875 26865 -28754 -41719 -14189 16020 11558 -26326 -59943 -47136 14995 84111 104264
422A04264n1324r0600o6577L593O6559P7508L3195k4712n0154k8127J2311L1222
434A7158Q889l1285m9443k0147L6851P5338O0833j982o5678q3250m2855K2152
446g3419O2694N2359Q185k9120k9563J32K5881J9418j7306m9151m4075J466N4680
459a7819P2615L9766k0529o4500o1629j9293K6731M3131K4466n167j6514k437
471a179J8996K1931l493l7167m9190k4618K1268N6059N3669J7155k5747m6681
483A003l4720o075J4589J5140L791j570O407K1193K3030M144k5610m3521l4885
496e7084l317L0369M2837K9507K978j6620k1053j3486p197p991q926k800J3550
509a9233K9822L1036J2018j6122l6323l4012j4243J0364K2455K0097J0667N000
$$ plain form
422 104264 52940 -37660 -104237 -100644 -34085 43423 76618 51906 1752 -26375 -14064 17158
434 17158 26047 -5238 -54681 -74828 -37977 37361 98194 96212 30534 -52716 -95571 -73419
446 -73419 -10725 41634 49819 20699 -8864 -8732 17149 36567 19261 -29890 -73965 -72499 -17819
459 -17819 54796 94562 74033 9533 -52096 -71389 -44658 -1527 22939 17772 1258 -1179
471 -1179 17817 39748 36255 -912 -50102 -74720 -53452 2607 56276 73431 47684 1003
483 1003 -33717 -39792 -25203 -10063 -6272 -7842 -1435 19758 42788 46932 21322 -22199 -57084
496 -57084 -60401 -30032 12805 42312 45290 28670 7617 -5869 -13066 -21057 -29983 -32783 -19233
509 -19233 10589 41625 53643 37521 1198 -32814 -47057 -36693 -14238 5859 16526 21526
521B1526M393K405p237k2374l1119k0601O179L3245M2042K5037n380k9068l1815
534a2767j5349K741R497L707j622M219J9020K7399J5693j4521m2292m5350j8140
547f7765K2105M7074M0573R040k0788k9515j4268M934Q300n146j9242j4632J1840
560b7490L9692M3293J4134l0252n7309m5396m090L6559M7815K5148q876k4947
572H281j5213P483J5949j70k5695l5576j3489K8207N5655M5710J531m5003n9464
585c1794l3466J2079M1226L5361N348j9159j7589N936K4185J5353j6491m4703
597b3714m0526j690M4712O1810L6034j4150n1427n0088j5142K3020L4268J5083
609A8190j1635j8941k06K5575L0218L925l4110n2820l2609J3311N2441N4577J9928
$$ plain form
521 21526 25919 28324 21087 -1287 -32406 -53007 -46828 -13583 28459 53496 48116 19048 -12767
534 -12767 -28116 -25375 -15878 -12171 -13793 -9574 9446 36845 52538 38017 -4275 -49625 -67765
547 -67765 -45660 1414 41987 51027 30239 724 -13544 -8610 -310 -5456 -24698 -39330 -27490
560 -27490 12202 55495 69629 39377 -17932 -63328 -67418 -30859 16956 42104 33228 8281
572 8281 -6932 551 16500 16330 -9365 -44941 -58430 -30223 25432 71142 72673 27670 -31794
585 -31794 -65260 -53181 -11955 23406 28754 9595 -7994 -2058 22127 37480 20989 -23714
597 -23714 -64240 -65930 -21218 40592 76626 62476 11049 -39039 -54181 -31161 3107 18190
609 18190 6555 -12386 -12592 12983 43201 47126 13016 -39804 -72413 -59102 -6661 47916 67844
622F7844k3787m5344l2014J97K1950J7075l755j7417p525J8668L4923K3498j1112
635D3201m3961m8157j7841K4052M7966L7436N680k3266k8983j2299O506J0109
647D43l004j5530j1944R170L1044L2898J0083k3324m2796l3591m054K4341L3040
660F776K0125k07j1947r446q47J049o742j6448j5220J482K2304L1456K1025l111
674D0249k5017k9869j7721J606J3847J4317Q118M600N598O394L39j2139k2159
687a1837k0704m957J5471K6960K2406N356j0444j6872j1959n429k448l561j879
700a9897O232J7793K2151J2141q435k6512k8976j3851R017K3213K0209O744m708
713A5121o621p98K527m010j5136j9881q285J4777L1672L0354O900k0643l4621
$$ plain form
622 67844 44057 -1287 -33301 -33104 -11154 5921 2166 -15251 -22776 -4108 30815 54313 43201
635 43201 -760 -48917 -66758 -42706 5260 42696 48376 25110 -3873 -16172 -9666 443
647 443 -2561 -18091 -30035 -20865 10179 43077 53160 29836 -12960 -46551 -50605 -26264 6776
660 6776 26901 26694 14747 5301 4454 5503 -1239 -17687 -32907 -31425 -9121 22335 43360 40249
674 40249 15232 -14637 -32358 -30752 -16905 -2588 5530 10130 15728 22122 22461 10322 -11837
687 -11837 -32541 -37498 -22027 4933 27339 32695 22251 5379 -6580 -12009 -14457 -18018 -19897
700 -19897 -13665 4128 26279 38420 29985 3473 -25503 -39354 -30337 -7124 13085 19829 15121
713 15121 8500 7702 10229 6219 -8917 -28798 -37083 -22306 9366 39720 46620 25977 -8644
726h644k5204o63J8749K0336O857p051o170N169J5280R477j1163l0152k9892n080
740d8151K6746M1991K8670m185l1156l3734j2915J2131K0652Q760q952j3477J234
753a2386K1165K6011O318k4480m1441k9200N354L7403M2558J7840j5769l2877
765D96k3326J658J7845J2658o742j9149j0427J4868L2946K6664l863l5592m3797
778c5761k0514J6711M0509L3593M550k1431k5768q221J1928J4895r82k0261k0799
791c1551j76K7635L7640J9196j5794m0806l6887q060K3811L3801J9608n364j9034
804D019j1854M991J4449M653j5132k5757j4459J2394L3916L2483P522k2337l6099
817a1211k4833J690K1012K1293O729p395q483K142J1763Q054q668k2975k2366
$$ plain form
726 -8644 -33848 -34511 -15762 4574 11431 4380 -1790 3379 18659 28136 16973 -13179 -43071 -48151
740 -48151 -21405 20586 49256 45071 13915 -19819 -32734 -20603 49 8809 -143 -13620 -12386
753 -12386 8779 34790 41108 16628 -24813 -54013 -48659 -11256 31302 49142 33373 496
765 496 -22830 -21172 -3327 9331 2589 -16560 -26987 -12119 20827 47491 43628 8036 -35761
778 -35761 -56275 -39564 945 34538 39088 17657 -8111 -16332 -4404 10491 9509 -10752 -31551
791 -31551 -31727 -4092 33548 52744 36950 -3856 -40743 -48803 -24992 8809 28417 23053 4019
804 4019 -7835 -2844 11605 16258 1126 -24631 -39090 -26696 7220 39703 47225 24888 -11211
817 -11211 -36044 -34354 -13342 7951 14680 7285 -1198 944 12707 20761 12093 -10882 -33248
830c3248l345K0712L1320K1729k352k1456k4143j1966M252J0912O235q17j590
843c757N451J2557J0250l718j8244k3412j2706P070K0965K1735R608n085j2141
856H573j0818m074j660k777l647L45R207J5697J3904J716j3349k0436j5435j919
870b4673J0222J3445R195K769l88Q26K40m595j2211j4727p184P940J9682K0844
884B1385Q044q670j8251j5333l878N339O327J434j419K711J0212J3100L948j1696
898A3253k3554k0031k678J7428K5729J6154j452j5377j4793m197N271M406l569
911c410j0144m819R718K1679J8743O35k1725k9631j7560N680K4382K3457P525
924B4530j0531j4782n758O773Q579k236j5531j6377j821J9499K9876J7852q014
$$ plain form
830 -33248 -36593 -15881 15439 37168 34816 13360 -10783 -22749 -18497 -7585 -1350 -2167 -3757
843 -3757 1694 14251 24501 20783 2539 -20873 -33579 -26509 -5544 16191 25799 20714 8573
856 8573 -2245 -6319 -7979 -10756 -14403 -14058 -4851 10846 24750 26466 13117 -7319 -22754 -24673
870 -24673 -14451 -1006 8189 10958 10570 11396 11636 7041 -5170 -19897 -27081 -19141 541 21385
884 21385 29429 20759 2508 -12825 -16703 -11364 -5037 -3603 -5022 -2311 7901 21001 24949 13253
898 13253 -10301 -30332 -33010 -15582 10147 26301 24849 9472 -5321 -9518 -4247 159 -3410
911 -3410 -13554 -18373 -8655 13024 31767 32402 10677 -18954 -36514 -30834 -6452 17005 24530
924 24530 13999 -783 -6541 232 8811 6575 -8956 -25333 -27154 -7655 22221 40073 32059
937C2059k8913k9298r830J4286K4511J5334k902j3758q032N913J3523N846j3183
950E556k4038j6420O433K8084L0519J0737j6002l0318k2393M0J7461J8222M224
963A2105r613j0016K280J4842J3449k783k1606k6258j0445J5294L0644K4724K188
976C4805k0026k4756j1990O092J4221P772n162r887j482J2448J8506P740j2573
989A5708k5940k1673j739J9858K6758J5047m243j7181j4722k810O362N869k830
1002a536q695m544Q326J7896J4776n88j7224k3555j3688M103J7833J7984O613
1015A7701m686q520m575Q64J350m722q862o290L774J4962J6693P630p144j7003
1029A172j5764n485O109R729P404K326M96K086K730q78p893j2126r485M30J1629
$$ plain form
937 32059 3146 -26152 -35982 -21696 2815 18149 15247 1489 -6543 -630 12893 18739 5556
950 5556 -18482 -34902 -28469 -385 30134 40871 24869 -5449 -27842 -27802 -10341 7881 12105
963 12105 2492 -7524 -5244 9598 23047 20264 -1342 -27600 -38045 -22751 7893 32617 34805
976 34805 14779 -9977 -21967 -15875 -1654 6118 956 -8931 -10413 2035 20541 28281 15708
989 15708 -10232 -31905 -33644 -13786 12972 28019 23776 6595 -8127 -10937 -4575 1294 -1536
1002 -1536 -10231 -14775 -6449 11447 26223 25635 8411 -15144 -28832 -24729 -6896 11088 17701
1015 17701 13015 4495 -80 784 2134 -2588 -11450 -17740 -13966 996 17689 25319 18175 1172
1029 1172 -14592 -20077 -13968 -4239 3165 5491 5987 8073 10803 9925 2032 -10094 -19579 -19149 -7520
1044g520J5704J0435l04q882j0720o236j242J006m01M58M060R078J0262L864p044
1059A2518j5417j4258m761P623J4271J0467K277m016n009j240N06k455q113q340
1073a5947j721J0113J7689J3725l12j4018j9025j1542L172J2182J0531K759m362
1086C244l424L599P171K451q476j6476j2798J751J7555K2188J1182o658j8750
1099B559j6792l790Q334J0974L317n303n839K867J1919J1389q10j6090k1540j1103
1113b9908Q252K2033K0848N177j2238j7987j0159L542J0132N125n259r775k727
1126a2944J1073J7861J0277p305k1640k1635n791J4109K2458J4961j759j3979
1138E686j2633j339P686O818l463j2001q778M057J7674J8618N509j2998k3451
$$ plain form
1044 -7520 8184 18619 18315 9433 -1287 -7523 -8765 -7759 -8160 -7702 -3642 5436 15698 19562 12518
1059 12518 -2899 -17157 -21918 -14295 -24 10443 12720 8704 3695 2455 2961 506 -7607 -15947
1073 -15947 -17668 -7555 10134 23859 23547 9529 -9496 -21038 -17866 -5684 4847 7606 3244
1086 3244 -180 3419 10590 13041 4565 -11911 -24709 -22958 -5403 16785 27967 21309 2559
1099 2559 -14233 -18023 -9689 1285 4602 -701 -6540 -3673 8246 19635 18825 2735 -18805 -29908
1113 -29908 -21656 377 21225 26402 14164 -3823 -13982 -10440 -308 4817 -442 -10217 -12944
1126 -12944 -1871 15990 26267 18962 -2678 -24313 -30104 -15995 6463 21424 19665 5686
1138 5686 -6947 -8286 -600 6218 2755 -9246 -18024 -13967 3707 22325 27834 14836 -8615
1151h615j6681N88J6087J7750P331o012j0759m415M974P393k84j0392j3464m379
1165b0878J0769J9999J5104j028j6366j9322r281M968J3159R847P92n628l660
1178a525L399O858K435p580j3725j0166K189J4287J7479Q292n508j3909j2273
1191i747l444M948O353K602j664j051M065P302M172l978j1492j2680m600P104
1205a2110J3414J1173K712n609q143n040q14K26j013k273P24N353R536O761o63
1220A4234r389j2434p285J072Q341P991M288p8j480m22k67k336o819p204k334
1235a4122N693J1724J0426K632o729j0587q010j348M035M086J397m02J965N087
1249E847N400P35q271j2181r062J099J0681J4113P199k637r046p824k174L067
$$ plain form
1151 -8615 -25296 -24708 -8621 9129 16460 10448 -311 -4726 248 7641 7357 -3035 -16499 -20878
1165 -20878 -10109 9890 24994 23966 7600 -11722 -21003 -16035 -2876 6971 7763 2135 -1525
1178 -1525 1874 8732 11167 3587 -10138 -20304 -18115 -3828 13651 21943 16435 2526 -9747
1191 -9747 -13191 -8243 -1890 712 -952 -2003 2062 9364 13536 9558 -1934 -14614 -19214 -12110
1205 -12110 1304 12477 15189 9580 1437 -3603 -4417 -4191 -5204 -7477 -6753 -1400 8136 14897 14234
1220 14234 4845 -7589 -14874 -13802 -5461 2530 6818 6740 5260 4838 4571 2235 -4584 -11788 -14122
1235 -14122 -8429 3295 13721 16353 9624 -963 -8973 -10321 -6286 -2200 -803 -1205 760 5847
1249 5847 11247 11982 3711 -8470 -17532 -16433 -5752 8361 15560 12923 3877 -3947 -6121 -3054
1263c054K248k130m158j068O450J1696Q031k836j3459j5421o950O360J4149J1708
1277A1566K040p015p639k165L850L514l092q736o931K364J2756J5089O580p830
1291A4351j7236j4080k180J0300J2721O679l142p222l007M670O058M9q670j2821
1305a3530o025P770J6737J4749J884j1797j6889r500K380J1096Q700q8n502m044
1319d059L409Q953N218n062j3986j3017j469J1982J7166J1106k967j2948j2741
1332h415l609M954P340K638m418m408J633Q927R290J189j0063j5484r538K858
1346a7106J3263J4567N715n291j0350o745K19M574J791k789n191p59O930J0757
1360I585O813l443j2203j2761m997N553J1305Q687J810m436m980j092J136L41
$$ plain form
1263 -3054 -806 -2936 -7094 -8162 -1712 9984 18015 15179 1720 -13701 -20651 -14291 -142 11566
1277 11566 13606 6591 -1048 -3213 637 4151 1059 -7677 -14608 -12244 512 15601 22181 14351
1291 14351 -2885 -16965 -19145 -8845 3876 10555 7413 191 -2816 1854 7912 7961 -709 -13530
1305 -13530 -19555 -11785 4952 19701 21585 9788 -7101 -16601 -14221 -3125 5575 5487 -15 -4059
1319 -4059 -650 8303 13521 8459 -5527 -18544 -20013 -8031 9135 20241 17274 4326 -8415
1332 -8415 -12024 -7070 270 2908 -1510 -5918 -4285 4642 13932 15121 5058 -10426 -19964 -17106
1346 -17106 -3843 10724 16439 11148 798 -5947 -5728 -1154 637 -2152 -7343 -8102 -1172 9585
1360 9585 16398 12955 752 -12009 -17006 -11453 -148 8539 10349 5913 933 -159 977 1318
1374A318l700n728k464M151R701R394J991o296j0699q203q03M875N997L241P75
1389C550K1J204J226j054m884p064m827J783P819R111M896j913n981o364l036
1404e513k73J361P51K88K658N341N240L87m897r160p339j043N803Q434N211K97
1420G546k966k841p98pk259m426l775R72P028R798O047k635r463j0068m566L211
1436i202P260N650N17k360j142K407L191m23n995r201m811L607J1504J1502L320
1451A5824o208j0921q297m08N841N624O19k986j938L087O840M667l437j0661j1426
1466a3780l112P890J3793R620K4q945r747m083L164N793J206m028m656J224P920
1481B283J0099K573p559j3597j0526M03J0532J3152O165l712q521o083J123M029
$$ plain form
1374 1318 -2382 -8110 -10574 -6423 3278 12672 14663 8367 -2332 -10535 -11338 -6463 -466 2775 3550
1389 3550 3571 4775 6001 4947 63 -7001 -11828 -10045 -2226 6885 11781 9868 3887 -2477 -5513
1404 -5513 -5786 -4425 -3674 -3386 -728 4613 9853 10240 5343 -3817 -11156 -12199 -6396 2038 7249 7546
1420 7546 4580 1739 941 934 -1325 -5751 -9526 -8554 -1526 8272 14319 11684 2221 -7847 -12413 -9202
1436 -9202 -1942 3708 4225 1865 723 3130 6321 5898 -97 -9298 -14109 -10502 1002 12504 15824
1451 15824 9616 -1305 -9602 -10010 -4169 1455 2074 -912 -2850 237 7077 11744 8307 -2354 -13780
1466 -13780 -16892 -9002 4791 14411 14435 5490 -4257 -8340 -5176 617 1823 -2205 -6861 -5637 2283
1481 2283 12382 14955 7396 -6201 -16727 -16324 -5792 7360 13525 9813 1292 -4791 -3668 361
1495C61K558l897o611k779N253J1768R086o08j0584j4096o947L837J0738R428
1509G507J856m626n580o84L595K816k364p731o707M13R531J2173O094m109j1281
1524I03j0652l588N622P800M706j132l497l40L005L891l12o911q701m545M695
1539i056J0368R929K641n485r299o795l52M112L528O96j525j2L750M791J783m520
1555D554q552p119j143O278R545N695J69m756m529k968J71K60j279j425O86M884
1571D71O104L843k389o540p529l975J509N900N077K506m16q92k84p21k470l930
1587c736l967p42M246P361N697R83m292o724m659m54K054K373J039M27K196L323
1603E125K203r85n977p454l969K096P217P828L307k420n232l890p59J512J21k109
$$ plain form
1495 361 2919 -978 -7589 -10368 -5115 6653 15739 15131 4547 -9549 -16496 -12659 -1921 7507
1509 7507 9363 4737 -843 -1527 2068 4884 2520 -5211 -11918 -11505 -1974 10199 16293 12184 903
1524 903 -9749 -13337 -7715 85 4791 3659 162 -178 2827 6718 6406 -505 -9206 -13751 -9056
1539 -9056 1312 11241 13882 8397 -902 -7697 -8049 -3937 -409 287 -1238 -1250 2500 7291 9074 4554
1555 4554 -3998 -11117 -12260 -5982 3563 9258 9427 4671 142 -2826 -2655 -2395 -3674 -5099 -4413 471
1571 471 6575 10418 8029 1489 -6040 -10015 -8506 -2606 2471 4977 4561 3669 3385 2664 194 -3736
1587 -3736 -7703 -8445 -4199 3162 8859 9842 5550 -1174 -5833 -6287 -4233 -1860 -821 -394 1802 5125
1603 5125 7328 6343 366 -7088 -11057 -8961 -1744 6084 9391 6971 1739 -2151 -2910 -1398 -1277 -3386
1619c386k220J089N532P123L249l872q826q392k271N372P892N772m41l686l616
1634f81Q9K278P33l485n218l229L553Q895Q463J416o953j0059o765J020O604O824
1650C485K092l344l166K74L530L019j703p085p419j120O694J0450P133j157q980
1665B703q950l350L373O075L351j049l757q51M027N284J581n074r404o416J628
1680a0829Q958R989M408m138q332o499j17M183L854k24l540k249K898O401M821
1695I584j208p788r162m174M195R418P479J388n000o238k355J665K522J70l049
1710b553l136R36N776O899K305m043q509o924j140N507P063M099p41l594k004
1725e9j60J391m19l252l479r79M212O539N087l38n332o718m062R02L915L904J390
$$ plain form
1619 -3386 -5606 -4517 1015 8138 11387 7515 -1311 -9703 -11974 -6602 1290 7062 6621 2935 -681
1634 -681 -592 1686 2419 -1066 -6284 -9513 -5960 2935 11398 12814 5861 -4198 -10963 -9943 -3339 3485
1650 3485 5577 2233 -933 -659 2871 5890 4187 -2898 -10317 -11437 -4743 5707 12840 11683 2703
1665 2703 -6247 -9597 -6224 -149 3202 2153 -1604 -2455 1572 6856 8437 3363 -6041 -12457 -10829
1680 -10829 -1871 8118 12526 8388 56 -6443 -6560 -2377 1477 1253 -2287 -4536 -1638 4763 9584
1695 9584 8376 588 -8574 -12748 -8553 865 8344 9732 4732 -1506 -3861 -2196 326 496 -2553
1710 -2553 -5689 -4753 1023 7922 10227 6184 -2325 -9249 -10389 -4882 2181 6280 5539 1945 -59
1725 -59 -219 1172 753 -2499 -5978 -6957 -2745 3794 8881 8543 3211 -3507 -7569 -6667 -2752 1152 2542
1742B542m42m01J201P82p40l921m962j827J955N761N896K155k268m750l832j099
1758c950M71J371O4M01J947L182K932m76l815n623m007K47M232N256K967j51k782
1775B266j316q50n3j699k470k000J940M536N896K914k602o645n997j506K447M657
1791d82L021J07j289k31J398J291j267m321n388j830L992P633O020P77m848o991
1807b408m029J074L619K649k63j784m70L177M221J427l551p629n871Q9N755Q725
1823D731M817j646o092n151j442K556K989j71l086k012K156N542N524j22o281
1838B312q480n037K468P285P389K393l443n123k547J303K737P8l142m180l44N268
1854a063P335M372k287q269p746k772M177P000M368J51l848k343O20K599O59k597
$$ plain form
1742 2542 2100 1699 2900 3682 2942 -979 -5941 -7768 -5813 -52 5844 7999 5731 981 -2851 -3950
1758 -3950 -3479 -2108 -2044 -1643 304 3486 6418 5942 2127 -3496 -7503 -7256 -3024 2232 5199 5048 2266
1775 2266 950 100 47 -1652 -4122 -6122 -4182 354 6250 9164 6562 -83 -6080 -7586 -5139 -482
1791 -482 2539 2646 1357 1126 2524 3815 2548 -1773 -7161 -8991 -4999 2634 8654 9431 4583 -2408
1807 -2408 -6437 -5363 -1744 905 642 -1142 -1612 1565 5786 7213 3662 -3967 -9838 -9749 -3994 4731
1823 4731 9548 7902 1810 -3341 -4783 -2227 762 591 -2495 -4507 -2351 3191 8715 8593 2312
1838 2312 -6168 -11205 -8737 -1452 5937 8330 4887 -236 -2783 -1480 1257 1335 -1807 -5987 -6331 -1063
1854 -1063 6272 10644 8357 88 -7658 -10430 -6253 747 5115 5266 1418 -925 -305 2294 2953 356
1870C56n702l001K195O932P233K425m336p652n694k55M228M403J625q80k290N77
1886A64K789J722j635n026n190j591M310P426N034K44m803n687k973J042K646
1901a528J841o73j023J163K840K923J30m170n743l882J096N011N579L039j853
1916D750l144k865n80R0K59j083q54R26L831L708J493j975n180m598j553K749
1932d026L609L104P82p50j350K66m43j386l010j843j47L476M855L426k75l860
1948B428m701k354N63K196J560P25j48J094K090J066j071m260m499j976K087N306
1964A06M626J563k484l782k242O2J238L37j301j061J273L511M112R82l226o178
1980b464m701l19L969N555L263p80l285k094K68J335m0k047l322r20L235N756
$$ plain form
1870 356 -5346 -8347 -6152 780 8013 10438 6102 -1550 -7244 -7499 -3271 1132 2757 1877 -413 164
1886 164 2953 4675 3040 -1986 -7176 -8767 -4457 2969 8003 8247 3444 -2243 -5216 -4174 -1528
1901 -1528 313 -360 -1383 -220 2620 5543 5673 1503 -4240 -8122 -7026 -2015 3564 6603 4750
1916 4750 1606 -1259 -1839 -1749 -1490 -2573 -3427 -2501 1330 5038 6531 4556 -624 -5222 -6775 -4026
1932 -4026 -417 2687 3469 2719 1369 1635 1192 -194 -3204 -5047 -5194 -1718 3137 6563 6288 2428
1948 2428 -2273 -4627 -4064 -1868 -308 417 269 1363 3453 4519 3448 -812 -5311 -7287 -5200 106
1964 106 4732 6295 3811 29 -2213 -2151 -913 -576 -1877 -2938 -1665 1846 5958 6940 3714 -2464
1980 -2464 -7165 -7484 -3515 2040 5303 4523 1238 -856 -588 747 707 -1340 -4662 -5582 -2347 3409
1996C409M676n13n522o555l186J725M620M615O52k112k222L93K316Q96j873m657
2012c338l911Q56N352O373L792k282o513n424j496K924M116J627p77j970J94K413
2028A936K910p2m638n923k772K627O310O036J859l866n409l190k7K998J865m81
2044A63j935l99K622M191K244k575o077n280j072L876O155M247j28l643l541j114
2060b266J285J226q93j754j464K059M132M236J43l865o081l822O71L658M761K053
2076D079p60k219j117L47O21j142k212k444K02L935M831K552j221m395m324j955
2092e222J125K825J942P62m95O48R73N39j179l496k728j127J866M449L851R46
2108E679k066l486k171p69Q81M28L0L48J261K220K265l43l147l948k801K20L423
$$ plain form
1996 3409 8085 7572 2050 -4505 -7691 -5966 -1346 3269 3921 1809 -413 -20 2296 3192 1319 -3338
2012 -3338 -7249 -6393 -1041 5332 9124 6842 329 -5095 -6591 -3667 449 2076 1299 -671 -477 1936
2028 1936 4846 4774 136 -5787 -8559 -5932 378 6414 8273 4407 -1002 -4192 -4219 -1221 644 163
2044 163 -1772 -2171 451 4642 6886 4311 -1766 -7046 -8118 -4242 1913 6160 6032 2389 -1152 -2266
2060 -2266 -981 245 -648 -2402 -3866 -1807 2325 6561 6704 2839 -3242 -7064 -6393 -2735 2026 4079
2076 4079 3319 1100 -17 330 951 -191 -2403 -4847 -4645 -710 4121 6673 5452 1057 -3267 -5222
2092 -5222 -4097 -1272 670 1432 937 1585 2558 3097 1918 -1578 -4306 -5433 -3567 882 4733 5679
2108 5679 3613 127 -2044 -2813 -1932 -1504 -1474 -1126 135 2355 4620 4277 1130 -2818 -5619 -5399 -1976
2125a976L947J944n31j732j330k43o6j080j726j270J291L227L895J803k109m489
2141d45l773j059K144K802K065J01j092k3R65R52j206l448k866r20K939N023L750
2158E909K14l740m265k269J168J765J618j12j132M74J789K494P61k644m934l667
2174f571M14M184N474K771j356m448k756k99J577J450n27k057n69J674M034L006
2190F001q23m381n230k576K047N040L919O99k173l051j127J632R67n19k632k222
2206d429M97L915M654K061k425n002m632p06K936M299K152r24j594j335O22J849
2222A938o2k262l522j621K486M195M652O14l597m761k776K97L291K347M59j381
2238B97p24Q77K078R60j824l839k905L4L345M669K592r82l043l712j262J454J617
$$ plain form
2125 -1976 1971 3915 3384 1652 322 79 13 -1067 -2793 -4063 -2772 455 4350 6153 4044 -445
2141 -445 -4218 -5277 -3133 -331 1734 1835 743 720 1685 2637 1431 -2017 -4883 -5803 -2864 2159 5909
2158 5909 6123 2383 -1882 -4151 -2983 -1218 400 288 -844 -370 1419 3913 4674 2030 -2904 -6571
2174 -6571 -6157 -1973 3501 6272 4916 468 -2288 -2587 -1010 440 -87 -2144 -2713 -1039 2995 6001
2190 6001 5178 797 -4433 -7009 -4962 78 3997 4696 2523 -528 -1655 -23 944 425 -2207 -4429
2206 -4429 -3932 -17 4637 6698 4273 -729 -5361 -6067 -3131 1168 3320 2396 802 -533 89 1938
2222 1938 1876 -386 -3908 -5529 -3043 1152 5804 6418 2821 -1940 -4716 -4419 -1128 1219 1678 297
2238 297 -427 450 2528 3488 1664 -2175 -5080 -5046 -1701 2968 5560 4578 1535 -2177 -3439 -1985 -368
2255c68M50q16o42J196K631J891n91l187m007j972J284L752L231J205j172k271
2271F14j801M0O33j05j311o62J080K765K522Q79k095l454l386j52K246K637J711
2288B161k86n55m23mj80m92k171j549J67K533L407J937q56k642k809j444O05J606
2306i95J222j72j82O45J698O29j018k581k553j337J455L628K659J158j836k351
2322F9j424L09N09J95r09p98J080K603K288L11k342l912k423k38K999L352J410
2339C079m70j948q99P5O21P8k019j731R7J982L909K200o13l565l902j603J401
2356c308L111J978L81j439r80M53J323O70j610l260k084Q32L937L739J866k236
2372C373l824l000k94J882K304K63k73j300M12K359J230n39l024l411j386K164
$$ plain form
2255 -368 82 -734 -1376 -180 2451 4342 3751 564 -3443 -5415 -4131 -379 2852 4057 2885 614
2271 614 -1187 -1147 -514 -619 -1930 -2592 -1512 1253 3775 4654 2559 -895 -4281 -4433 -2187 450 2161
2288 2161 1875 1320 897 893 713 221 -1950 -3499 -3332 -799 2608 4545 3689 1047 -1762 -3206 -2601 -995
2306 -995 227 55 -127 518 2216 2845 1827 -754 -3307 -4644 -3189 439 3098 4256 2420 69
2322 69 -1355 -1046 -537 -342 -1251 -2049 -969 1634 3922 4233 1891 -2021 -4444 -4682 -1683 1669 3079
2339 3079 2609 661 -238 -163 458 536 -1483 -3214 -3117 -1135 2774 4974 4361 796 -3106 -4709 -3308
2356 -3308 -197 1781 2162 723 -257 196 1519 2189 579 -2681 -4765 -3933 4 3743 5609 3373
2372 3373 -451 -3451 -3745 -1863 441 704 431 -869 -457 1902 3132 2593 -431 -3842 -5228 -3064
2388c064M297L239j42k283l424j448P53J941N47r75r81k60K683K404Q64j978l888
2405a715k866j27K540M138K013p73k278j851l07R71O33j020j491o36J628L086
2421A945K007M74l241l521k221J010K936K639M00j022j235m3M70M59j060k284
2437b287j134P88K674L073Q74j219k525k849k63O78J853J003q8k01J01J256J78
2454A912o68k333k110m61J867L101J805J16j634k244j093K35O87L6l50K46J051
2471A63J655J257n43k075k789j501R46K317K175O65n37j162p77J77Km80j472p17
2489b696R34K623K340O63j443l263k121R0J340J750Q69l35k25J3O90N92j382k127
2507a688j611l15K122L371K082n92k401k461r68M34J887K68m05m33J29J726J753
$$ plain form
2388 -3064 1233 4472 4330 2047 -1377 -2825 -2072 -131 416 -559 -1540 -1800 883 3287 4151 2173 -1715
2405 -1715 -4581 -4708 -2168 1970 3983 3210 932 -919 -1226 -255 378 -642 -2133 -2769 -1141 1945
2421 1945 3952 4426 1185 -2336 -4557 -3547 -611 2028 2428 1406 171 128 598 1057 -3 -2287
2437 -2287 -3421 -2633 41 3114 3988 2769 244 -2605 -2868 -2190 -337 666 578 377 478 1734 1912
2454 1912 1244 -1089 -3199 -3660 -1793 1308 3113 3229 1595 -649 -1742 -1507 -820 -784 -1134 -888 163
2471 163 1818 3075 2532 457 -2332 -3833 -2887 -570 1605 2270 1733 571 -206 -29 -27 -507 -1979 -2696
2489 -2696 -1762 861 3201 3864 2421 -842 -2963 -2873 -1533 217 1086 751 526 539 1229 1821 439 -1688
2507 -1688 -3299 -3614 -1492 1879 3961 3369 968 -1493 -2461 -2027 -140 128 -277 -710 -581 1145 2898
2524B898J5k465k982j848J101K959L222R16j525k101j558R5R76L02m49j261P1
2541a634J519K586J496j413k728l323p35J379L350K355k72j324j786l33R62Q92
2557I91j166j793r53P55K768K941P42k174k966k890J58K271K345R54q33j213p4
2574a37Q95P29m66j646k352n12J986L225K075m0k539k817j192N66J696J112L22
2591I05j044n8J139J414P8j911k327j925Q56K254K905J350j189k158j612l54R32
2608g45O85l42n33j51J397J806P33n77k267k777n86J133K637J680m7p25j208k44
2626a31N2P2n06j325r4Q68J932K067K31j645k488j834N88J235J411Q41k56m69
2644E49J74M04j01j205j292r16K5J987K080J347p90k020j722m02Q09J036K14m50
$$ plain form
2524 2898 2913 448 -2534 -4382 -3281 -322 2900 3816 2291 190 -1368 -1273 -297 5 -444 -1705 -1634
2541 -1634 -115 2471 3967 2554 -174 -3497 -4232 -2853 497 2852 2580 1256 -530 -863 99 991
2557 991 -175 -1968 -2921 -2166 602 3543 4285 2111 -855 -3745 -3587 -1316 1029 1983 1150 -63 -137
2574 -137 758 1487 1021 -625 -2977 -3489 -1503 1722 3797 3757 1218 -1599 -2791 -2225 -529 583 905
2591 905 -139 -197 942 2356 2434 523 -1804 -3729 -2873 -619 2286 3636 2447 289 -1323 -1677 -745
2608 -745 -60 -402 -935 -1086 311 2117 2850 2273 6 -2771 -3357 -2224 413 2093 2046 1321 113 -131
2626 -131 -79 -7 -513 -1838 -1932 -1064 868 2935 3166 1521 -967 -2801 -2213 -978 433 1274 1018 549
2644 549 723 1127 1026 -179 -1471 -2387 -2362 -375 1705 3052 2262 242 -1480 -1882 -1073 -37 177 -273
2662b73J27N81J143P65q51k113j740q75J461J916K115J45j440j169p40K80M07
2679b61n18k53m78P27J966J484J75k023k180j745L89K014K147K58m44j228m26
2696c96M85N95j84j390j528P5J985K311J370n64k790j825r55R24K018J030j93
2713I68q95l99Q15J005J19j570j942j321P67K888K242N27j385k437j224j36J361
2730f17J260j24q60n96O87J837J063n41l005k015n14J636K671K123k95j930j592
2747h12o23R18Q26J36j064p14L81J827J575Q9j322k756j604L02K247K056N87p30
2765A319j420n17K48O70Nr27j165k79J534K195J393r13j933k298l34N07J781J371
2783A237J7j026l51M83N48J2j043j753o95Q77J898K087K73q93j858j469K24M09
$$ plain form
2662 -273 -146 435 1578 2343 1492 -621 -2361 -3236 -1775 141 2256 2401 961 -208 -948 -668 -261
2679 -261 -779 -1032 -1510 -783 1183 2667 2842 819 -1361 -3106 -2717 -703 1444 1702 1258 30 -396
2696 -396 89 684 500 -890 -2418 -2343 -358 1953 3323 2759 -31 -1856 -2811 -1887 131 1161 968
2713 968 73 -326 489 1494 1613 43 -1899 -3220 -2453 435 2677 3204 1819 -618 -1842 -1978 -617
2730 -617 643 519 -341 -937 -250 1587 2650 2109 -896 -2911 -3425 -1789 882 3005 2710 780 -812
2747 -812 -1435 -517 309 445 -619 -1333 -952 875 2450 2539 1217 -1539 -3143 -2841 -594 1462 2049 1319
2765 1319 -101 -618 -370 300 305 -622 -1787 -2066 -532 1663 3056 2143 210 -2088 -2422 -1915 -134 1237
2783 1237 1254 228 -123 360 908 920 -123 -1876 -2571 -1694 204 2291 2564 1671 -187 -1656 -1432 -1023
2801a023J174J22n32o1O31R90L58j181j236j495j49J366K061R95j16j386j144
2818f26l46N26K58k93m85J80J041J192Q56l10j881j862q03J277J069J184J01K
2836A080j026K22K75o5q26j229o16R60J809J540N20j200j969j517J00J146J290
2853D94L07n95l68P16L35O07j065j488j184O1J433J860J658q59j481j434n08O61
2871h50Q03L48o56l96P98P82J148r9j209k507j051O79K162J864N09j107j408n88
2889g78L9P22l0q45o77L24J125K016J121j454k037j783m30J231J793J447l75q06
2907F03q00k4P92N2j006j456l55J057J788J681O17j787k033j360J15J672R56M73
2925I85n21p59J99J195M00q79j495j551J10J616K529Q10n02j729j608n48M88J176
$$ plain form
2801 -1023 151 273 -259 -320 311 1301 1659 478 -758 -2253 -2402 -1036 1025 2020 1904 518 -626
2818 -626 -972 -446 -188 -481 -966 -786 255 1447 2303 1993 112 -1750 -2553 -1276 -207 977 1078 1080
2836 1080 54 276 551 486 -340 -1569 -2185 -1225 584 2124 2644 1444 -525 -2042 -1942 -796 494
2853 494 801 206 -162 554 889 1496 431 -1057 -2241 -2180 -747 1113 2771 1912 431 -1003 -1511 -850
2871 -850 -47 301 -355 -751 47 829 1977 1878 669 -1838 -2889 -2210 -48 1816 2325 1218 -190 -778
2889 -778 -739 -17 -47 -892 -1569 -1245 -120 1896 3017 1563 -474 -2257 -2687 -1456 337 1784 1409 603
2907 603 -197 -221 571 623 -383 -1839 -2194 -1137 651 2332 2949 1162 -871 -2231 -2116 -444 512 985
2925 985 464 -295 -96 1099 1499 620 -875 -2426 -2316 -700 1829 2639 2137 408 -1200 -1748 -1260 -84
2943h4L70l89n03M65R89Q30J38j481k020r80P99J476K082O80j015j426o85M4M63
2962b47J40n44n56L57J372J453M94j326j773j374m4Q50J601P01m7o34k00k16J65
2981A72J15r84q04l18J226J596J332j8j679j471q91N0J391M99P4J78L3Q0M16k86
3001G11o07j715q97O42J840J452J026r97j093j169j12L6N81jm18K93Q29J200K41
3020A842o43j652j755P2J169J218R14L22o63o93k55j22L00q03n26k26J119J574
3038A192J085j94j460j844j016K31J197J807O9k43n83k47J071l06p50j049q99
3055a939M11J310J944J005r87j899j196n97Q75R27L99J1j44r5J020J09j63j209
3073b18j528p78J005J939J659P4p33j655q39pO85M36j64m43j83J334J170L34q90
$$ plain form
2943 -84 286 -103 -606 -141 848 1678 1816 335 -1685 -2665 -1866 -390 1692 2372 1357 -69 -754 -710 -247
2962 -247 -107 -651 -1207 -850 522 1975 2469 1143 -630 -2004 -2048 -1198 403 1104 1057 423 223 7 172
2981 172 287 -697 -1501 -1819 -593 1003 2335 2317 638 -833 -1724 -1674 -283 216 290 468 501 581 997 711
3001 711 104 -1611 -2508 -1866 -26 1426 2452 1455 362 -807 -919 -883 -302 -303 -721 -428 401 1601 1842
3020 1842 1199 -453 -2208 -2136 -967 251 1165 1487 824 131 -124 -246 54 -749 -1275 -1501 -382 1192
3038 1192 2277 2083 623 -1221 -2237 -2006 -809 998 1067 824 241 -6 1065 759 9 -1040 -1939
3055 -1939 -1528 -218 1726 2731 1744 -155 -1351 -1948 -1073 -146 253 264 120 25 1045 1154 991 -218
3073 -218 -1746 -2524 -1519 420 2079 2153 1420 -235 -1074 -1081 -396 40 -124 -567 -750 584 1754 2088 1198
3092A198j847j706j81J190K156R78k9j025r70m69M32K15l15p34m52R72J552J318
3110B283k29j311j905q89L02J078J714K08p48k29o7K20K25l90j370r79O91J592
3128A96J581O77o94j478j653l33N33O41R02k05J56n6N44M08j86j544j119n02Q61
3147a271J799J035L67q36j005r01j34J67N36l04J63J72J060J000k49j187j415
3164a003j126L34J070J314Q19j04n38j107PJ17j32k29o44L19J094J138P60n05
3182A584j482j555n72J015P23Q49K10j4n37L66J43l93r62p41o61J123J512J290
3200A898L2p08j412j475N27O28K20K32J11J14O26P34l65q11j149j082k57J478
3218f59J669N87N5j193q45k90J29K04J45n67N0Q32J021P93m04j110j786p76N05
$$ plain form
3092 1198 -649 -2355 -2536 -1346 810 1788 1759 734 -236 -705 -273 -58 -373 -1107 -1559 -587 965 2283
3110 2283 2054 743 -1162 -2051 -1749 -671 1043 1251 503 274 207 427 652 262 -1108 -2087 -1396 196
3128 196 1777 2454 1760 282 -1371 -1704 -1171 -530 372 167 323 267 811 1219 1033 -511 -1630 -2132 -1271
3147 -1271 528 1563 1930 1094 89 -812 -946 -779 -243 -547 -384 -212 848 1848 1599 412 -1003
3164 -1003 -2129 -1795 -725 589 1408 1304 766 -341 -334 -217 -349 -578 -1222 -903 191 1329 2089 1584
3182 1584 102 -1453 -2025 -1010 -287 562 772 758 221 587 730 337 -625 -1366 -2027 -904 608 1898
3200 1898 1930 1222 -190 -1665 -1138 -510 -290 -58 53 167 793 1527 1162 351 -798 -1880 -2137 -659
3218 -659 1010 1597 1652 459 -386 -676 -547 -343 -198 -765 -715 117 1138 1931 1527 417 -1369 -2145 -1640
3237a640J035J575O91o64o47k89j64L06k59p24o13N21J245J228O84p89j761j258
3255a523m19Q21J347M93l3l22j30M6K37j94j063r96j17J167J413J122K79j177
3273I51j706m55k65R38N15L28m99J36O67L89L30j196j085q96K30R83J800Q01m19
3292A547j283r98j80L82R8J41m03L04N08R42O55o93j180j520m95R04J309Q98K89
3311A225m64m71n35P0J04l76m79j25P56P74J282J5n91j937o92r8Q12R03O17k8
3331G62j47l95J30j0m42r28m73J3J216J338O41j66j078j051l65k46O17O90l5K31
3351C02m2N42K49k40j071r29o60P09J159J272L32l45j007r17l33N13K57j96k25
3370f30N27P61P80r7n49j293j032l56R00J335Q70r9l92n04l09m3pm85n01K32N50
$$ plain form
3237 -1640 -605 970 1661 997 350 61 -103 203 -56 -780 -1393 -872 373 1601 2285 1496 -265 -1523
3255 -1523 -1942 -1121 226 719 686 364 234 280 517 323 -740 -1736 -1853 -686 727 1849 2128 951
3273 951 -755 -1210 -1475 -537 -22 306 -193 -57 610 999 1329 133 -952 -1848 -1618 -635 1165 1966 1547
3292 1547 264 -734 -914 -532 -434 -293 -696 -392 116 1058 1713 1020 -160 -1680 -2175 -1271 38 936 1225
3311 1225 761 290 -245 -175 -71 -447 -926 -1051 -295 479 1761 1776 1185 -752 -1444 -1542 -730 173 790 762
3331 762 615 220 350 340 -102 -1030 -1503 -1490 -274 1064 1705 1539 461 -590 -955 -1201 -584 106 71 302
3351 302 260 802 1051 811 -260 -1189 -1849 -1140 19 1291 1623 1278 271 -646 -979 -466 -209 -405 -630
3370 -630 -103 658 1438 1341 792 -501 -1533 -1889 -989 346 1216 1117 725 221 -88 -131 -138 -623 -1124 -892 -342
3391c42J417P49m29q60j467j139P08R61Q11J72J57l51k63L81J8o85j312o7K06
3410a335J212J248L89oj322j070o03O94M51M55J8k5N17M38K89q20q78j400k67
3429b015Q56J514J008L48o37j257n14m49O50j15J20P9N11Q89M68k9j031j326p77
3448a707J28Q28J499P84k30n30p58l52J56q8m75r8Q6P60J116M87n8j459j159p16
3468a786L69J037N28O23n1J71n15j13j57o98l79k11L05J334J076K40p10p92j571
3487a300j53L78R28K08k1J99K24M31p8p81p55p36J36O31J258Q16J28q26r19o65
3507h97L61q9o8J69K01P23O97L17P0j412j102o72K24J063J062O57j32p22m11k03
3527a64j35l89l67jN34J054N95K11k89j227r12q16O25J104L63N76l71K49l9n1
$$ plain form
3391 -342 1075 1824 1395 535 -932 -2071 -1363 -402 409 581 738 387 124 505 523 -162 -1474 -1541 -1335
3410 -1335 -123 1125 1514 1508 186 -884 -1487 -793 -342 113 131 106 623 1061 1350 530 -348 -1748 -2015
3429 -2015 -1159 355 1363 1711 1074 -183 -697 -1146 -496 -611 -491 -412 99 988 1456 1427 396 -930 -1707
3448 -1707 -1579 -751 748 1532 1302 772 14 -338 -182 -270 -745 -843 -757 3 1119 1606 1548 89 -1070 -1786
3468 -1786 -1417 -380 148 771 720 891 376 263 106 -592 -971 -1182 -877 457 1533 1773 1063 271 -1300
3487 -1300 -1453 -1075 -147 61 40 239 463 894 816 35 -720 -1456 -1320 -689 569 1385 1513 687 -232 -897
3507 -897 -536 -625 -693 -524 -323 400 1097 1414 1484 72 -1030 -1702 -1478 -415 647 1304 1172 450 39 -164
3527 -164 -299 -688 -1055 -1056 -522 532 1127 1338 1049 -178 -1090 -1906 -1281 -177 186 762 391 640 601 550
3547E50p05q09m94n2J163J125P12K48q14j566j63l78L55P28O5L52o6M71K62l63
3567F21p68r37p42M21J074J450L96k09q47p79j46k23J12J59J88O6M98P54N29o54
3587I63j438r12n69Q27J077R99K67l36k42m55l96j64l80k56j79Q64J086P75k39
3606A292k60j683o98k12Q98O06P70R0n49K73k07L17q91l59p04J96P09J274P77
3625A639j13j025j160p09J87M24Q76k26M72J2O47o7j43j058o98p83N34J049J252
3644A110K01k7r64o18n15j71J19K39P7O42O06M85j05m63q83q78m34L58J370R54
3664A103j27l35j24p48J74l65k17l35K52N83J039O97j82j092j057p19J01M00P52
3683b00Q46k22K84j39j86l38o75m71j20M57Q16R38M64j69r26q12o13j16P07K80
$$ plain form
3547 550 -155 -964 -1458 -1510 -347 778 1490 1738 924 -642 -805 -1183 -828 -100 -35 317 251 722 984 621
3567 621 -147 -1084 -1826 -1405 -331 1119 1515 1306 459 -320 -466 -689 -577 -418 -230 -164 334 1088 1617 963
3587 963 -475 -1387 -1956 -1129 -52 947 1214 878 636 181 -215 -379 -759 -1015 -1194 -330 756 1531 1292
3606 1292 1032 -651 -1349 -1561 -663 -57 713 803 254 527 320 637 -254 -613 -1317 -1121 -412 862 1639
3625 1639 1526 501 -659 -1368 -1181 -757 119 -107 365 377 1024 957 814 -244 -942 -1725 -1191 -142 1110
3644 1110 1311 1284 320 -298 -813 -984 -865 -626 -549 93 699 1184 1079 616 -267 -1145 -1579 -1221 149 1103
3664 1103 976 641 517 -231 -57 -422 -639 -974 -722 -139 900 1597 1415 323 -734 -1453 -1352 -952 -200
3683 -200 646 424 708 569 383 45 -630 -1101 -1221 -764 52 990 1454 1285 359 -453 -1066 -1182 -475 -195
3703a95M52R8N32k11j36j05j147o22l71N30J118J108L13m31m78q35j65j2j77j8
3723g52K53O95O44N99j92q10j276l86k13P10J123K23L25j74m85k32l24o09J68
3742g13l20M19N82J057N86l54j141r15m18k47Q91O69O18o5J11k58k97k29o27m78
3762a129j92L74J066J032L63l28j101r38p0q7M51M08M12J90K29J08K00r69p63
3781g44o69J09P53Q36J060O8m84q89n19l81K10K08kL18L78L61N78m0p86r47p15
3802a297j03Q06P38O99J87m9r41k44j3k63m34J51R3Q76O67L16J97j624n77k40
3822a055K26O65L43L09O5mk63k6l13m99m63J34J94J041P79K25n43o75p26n41L90
3843g37L34P31R9k20M51K27m56n29n72m75L9O98O68Q27M4n55p37m63j98K08L1
$$ plain form
3703 -195 257 355 887 676 540 435 -712 -1334 -1705 -1175 -57 1051 1364 933 455 -380 -545 -557 -734 -752
3723 -752 -499 196 840 1439 1247 437 -839 -1225 -1438 -728 395 618 943 769 284 52 -272 -881 -713
3742 -713 -1033 -614 -32 1025 1611 1257 116 -799 -1217 -1464 -573 96 714 649 760 502 205 -24 -651 -1129
3762 -1129 -1321 -947 119 1151 1514 1186 85 -853 -923 -1010 -559 -151 261 451 680 788 988 19 -744
3781 -744 -1413 -1304 -551 285 1345 1413 929 40 -479 -860 -650 -442 -444 -126 252 613 1191 1151 365 -582 -1297
3802 -1297 -1400 -594 144 843 1030 981 40 -204 -217 -480 -914 -763 -670 206 873 1189 1386 -238 -815 -1055
3822 -1055 -829 -164 179 488 553 549 286 260 -53 -552 -1015 -881 -687 354 1133 1358 815 140 -586 -1127 -737
3843 -737 -403 328 427 207 658 885 429 -100 -672 -1147 -1108 -410 258 1085 1129 574 -163 -626 -824 -616 -585
3864e85K89J66P22qM61n28q36p26l88N98M77Q04M77M2l47l90o11k86om8J9N71
3886a33O63L10M93o67q25r76R6K46Q37N5O31k94p1j11l06k33l94m00K36P84O58
3907E99N28R7p03o49l36n48L04O82L19J70O5K45n1m24n22q98j19M45P77R29Q0
3928I90k02m33o30l22n9J58j77L50M83L71J03M74p40p25n29m01M97P26J071k2
3948I83j91l66n02l6m21J47j65J65K60Q33M43l38l25r45q16J23M04Q42M75N33
3968A103n19j65q3k38l80n79k20N39M19P12N73l5p06j102k13l0J57O76L42J67
3988D18K43j86K24o02o02o88OP97N85O39O52m50p81p21l01J51j89K99L68J94N10
4009E66J28M28p38q70m54k15K45R13N62L53k75l95l32l03j40Jl26M95L73Q26J40
$$ plain form
3864 -585 -296 -130 592 584 1045 517 -319 -1045 -1433 -835 -358 446 923 965 618 228 -383 -669 -675 -723 -704 -133
3886 -133 530 840 1333 666 -159 -1135 -1039 -793 44 99 730 436 365 254 -52 -285 -679 -1079 -843 -59 599
3907 599 1127 1224 521 -128 -464 -1012 -708 -26 293 463 528 773 722 298 -224 -1122 -1241 -796 -19 910 990
3928 990 788 355 -275 -597 -656 -498 -675 -325 158 529 632 1106 366 -359 -888 -1289 -792 -66 1005 983
3948 983 792 426 -76 -112 -533 -386 -551 -386 -126 707 1150 812 487 -458 -1274 -1151 -747 95 570 1103
3968 1103 584 419 336 98 -282 -861 -1081 -542 -123 589 1162 1127 421 -681 -894 -924 -767 -91 251 418
3988 418 661 475 699 97 -505 -1193 -1187 -390 195 834 1486 1036 255 -466 -767 -616 -805 -506 -138 56 566
4009 566 694 1122 384 -486 -940 -1155 -910 3 565 918 643 248 -84 -387 -527 -526 -852 -357 16 842 982
4030I82l7r06n53m80j49O13O06L56J10m5k67K75p68j0p61P8J99Q94P93K93n06
4051G17m88o59l33mN28P6L16L61N0pO1n21m71n57k20N91P44P88N0k80p23k64m15
4074f60L66r0J50M52J1N63Nk6o65r90k00k42P81P97N82k7o0m19n73K9k74j16J39
4097d67J04P79K03N89k75j105m82l18M7M02P39N00K5k55R7n26n7o25l17lO57N85
4119B97J012l48m80n28m29m15N1K91O22M27n6M6j17J64k07q48o20K92M63Q69M86
4140I72J2k99q24o9m37L3K70J79L43K81J16J57J27j024n33l96K00O28O65P49k98
4161H52n43k1k18o61k54J67K7L05P60M02K29n89n49p78l00L72O98P87j52J71k94
4182D11l27J3o24m5k77j32R07N06N09J1l17o40p35j5J5M94K02L55P7J6j7nm95
$$ plain form
4030 982 945 39 -514 -994 -1143 -530 76 432 542 497 230 505 -263 -273 -1034 -956 -757 137 930 1223 717
4051 717 229 -430 -763 -767 -239 -163 153 514 564 557 618 97 -374 -931 -1151 -560 184 972 1022 742 19 -245 -660
4074 -660 -294 -384 -234 218 229 792 797 771 106 -884 -1084 -1326 -545 252 834 807 747 328 -245 -216 -490 -606 -467
4097 -467 -363 416 619 1208 933 -172 -654 -972 -925 -523 216 716 741 486 583 57 0 -625 -942 -945 -288 297
4119 297 1309 961 481 -47 -476 -891 -840 -549 73 500 444 490 373 537 330 -518 -1138 -846 -383 486 972
4140 972 984 685 -139 -208 -645 -612 -342 -163 180 461 577 734 861 -163 -696 -1092 -892 -264 401 1150 852
4161 852 309 288 70 -591 -845 -678 -651 -346 414 816 1045 456 -93 -871 -1171 -799 -101 686 534 705 411
4182 411 84 97 -527 -572 -849 -981 -74 432 941 952 635 -5 -740 -755 -740 -246 -44 311 388 404 387 382 -113
4205a13o39k66K66N07R64J06K09o72k11n64j82l00P12J94o7N27L97r0l82l80r62
4226i46l14K19R06O58K95j96j4l89l51j71l25M7J00M06N58N65N1q99m66m68j24
4247h58P5Q15K49R6M39k63k7k36p09l69J22o3O85O05N17k01m69q29n23j15L37
4268g22O16J69J5J98N08k46m50m02o27J44mO62Q23K85q4m53q37K6j17J41N9L15
4290A9m6M32N01p5m94n30m33k04N11O01N68J61l66l59k55j04l73j96K36j4N35
4311A15O80K36j52p05n67l47l16N08P53K53R1k72J7l85P7p4n39k3JQ28L67N27
4333A073k34p09l96m98R1J72M10J10N36J18J71k43o37m47Kj98L08K82Q74K46k84
4354G47o55k76m24o1L22o7M17M55r0M28j89o30j43p99m5O57M16O00J53j56l76
$$ plain form
4205 -113 -752 -1018 -752 -245 719 825 1034 362 151 -413 -595 -895 -183 11 -56 471 868 778 396 16 -946
4226 -946 -1260 -1041 -135 523 818 622 608 219 -132 -303 -628 -581 -481 -75 483 1048 1099 200 -266 -734 -858
4247 -858 -783 32 281 377 816 553 526 290 -419 -788 -666 -729 -44 561 1078 877 408 -421 -944 -1059 -722
4268 -722 -106 63 78 276 784 538 88 -314 -941 -797 -801 -139 684 969 885 432 -405 -379 -496 -355 -296 19
4290 19 -27 405 906 831 337 -193 -626 -830 -319 282 850 1011 645 286 31 -73 -446 -642 -406 -420 115
4311 115 795 1031 879 174 -393 -740 -1056 -548 205 458 549 277 294 -91 -14 -88 -627 -650 -649 179 546 1073
4333 1073 839 130 -266 -764 -673 -501 -91 19 555 673 844 601 -36 -483 -481 -679 -371 -89 785 1031 747
4354 747 92 -184 -608 -669 -347 -414 3 458 368 796 607 -23 -166 -965 -1010 -353 63 663 816 660 284
4375B84l89p7l38p8K55J32L49N05K40l65r2q42l27m2M80L68M50K40O6n76k28Q3
4397I8n24m34J73N82M94M54j03k15m07m03k39k56L83N07L48l53M25Q3j50o19m20
4418e76m02K65L29R51M11j1p59j94n23j38pM06p7L62M39O3L2O3p86m23l56J88
4440g43O11J91M29R0M5l58l04o57L6j70L62N18J75N30J55l17n73p08q2k11P52
4461b29O47o8L17j32k93k68k41j77l03o1M90O02M18K01k05p97n18j73j09M63K28
4482b08M70J88J19p6m08j98n56k10K41L10J219r1p4j57p11k70j71L01q7K11K50
4503I2J90M19o3l17l37p14k55L57M44N33M27m51K77m22n18J5k33m7N40m5M17O54
4525I63l55no70p39k13L80Q4Q44J94O4q3K5o26l16j01k23K74M02N98L38j53k40
$$ plain form
4375 284 -105 -182 -520 -598 -343 -211 138 643 883 518 426 -416 -743 -785 -305 63 513 753 819 243 15 98
4397 98 -426 -860 -687 -105 389 843 740 525 118 -285 -524 -780 -397 110 458 105 530 613 463 -156 -576
4418 -576 -978 -713 -384 567 978 967 208 14 -509 -647 -654 -248 -325 37 476 539 571 634 -152 -575 -931 -743
4440 -743 -132 59 488 578 623 265 -39 -696 -660 -830 -468 50 225 755 910 593 20 -688 -770 -981 -229
4461 -229 418 350 667 535 242 -26 -267 -444 -747 -808 -318 284 702 903 698 -99 -617 -790 -899 -436 -208
4482 -208 262 450 569 493 85 -113 -669 -879 -638 -328 891 800 726 569 -142 -412 -583 -282 -369 -158 92
4503 92 282 701 638 321 -16 -730 -985 -628 -184 349 776 325 602 180 -338 -323 -556 -603 -63 -108 309 963
4525 963 608 603 -67 -806 -1019 -639 -555 289 483 547 464 489 -137 -453 -554 -777 -503 -101 497 835 682 442
4547D42n70l98l19J10M92M18J97L07J74o38j95l02j66k24K96M95L00K56K1j30
4567E66o71l84p5j26J29K85P83O7O5n7m09k95m28l73O54J96K84N96l93j5l69l82
4589c52k94J89k56N15K59L06M30j13n67m44k90l7k12Q24K96R7J40Jl82n6l47j70
4611d63l09J50P85L35K77j12l16l91p54j34M69K60L75L93L1k0l80k8p08l35K67
4632f08J97O28N40R2l11m07l23k31k33LM98J26K41J66L46k77k12r23k64O5J24
4653g63R37N07J19k18l28r27M16l13J58j32N03K08O63q9k26n03m45m26J07L99
4673c53L47M19p1L53n78J2m27m20O9J39J47P70K67L93p48l79k49l53p1K31M95
4694gO80l62J85k0n14l36k6j80M9J11P99R4L74l18p85J1p70L52J86L40L86J01
$$ plain form
4547 442 -128 -526 -845 -735 -243 175 372 679 853 215 20 -282 -448 -672 -376 119 419 675 696 566
4567 566 -105 -489 -564 -690 -561 -276 507 574 639 582 173 -122 -550 -923 -269 -73 211 807 414 399 30 -352
4589 -352 -646 -457 -713 -198 61 367 797 684 117 -327 -617 -654 -866 -42 254 351 491 492 110 54 -293 -463
4611 -463 -772 -622 163 498 775 663 347 -44 -798 -932 -463 -203 172 565 596 576 196 168 -540 -875 -608
4632 -608 -411 217 757 849 538 131 -192 -423 -656 -653 -155 -29 212 378 724 447 235 -688 -952 -887 -763
4653 -763 174 681 800 582 254 -673 -257 -570 -412 -544 -41 167 830 741 515 12 -433 -859 -752 -353
4673 -353 -6 413 342 695 117 129 -298 -718 -649 -510 -363 407 674 1067 319 -60 -309 -662 -733 -502 -7
4694 -7 673 311 496 476 -38 -374 -400 -580 -531 -420 379 473 847 529 -256 -245 -1015 -663 -477 -137 249 350
4716C50J66J43m88j93l49n66J11N42O40M53J4j34o98k87k31l13K84K23K06M37
4736C10R0L17j04m40o07o72L86M41M40L97O7j02n78L8o27N9o5K19J66O75L03j21
4758E92l28p4q29j62M53pO79M1L83j53j45m07m86j60j87P1N37N36L19j8L9o98
4780dl02j47k32K57L26N27q4K81l84ml88o51m7J89J56N83L96J08k20k87J57p00
4802d70j8r3M38J66L42J97r0P2o68l75m66L92L98M91L24m35P8K5k46m46k95K53
4824d26J50J18O04L54l54k15m45l30j1j99O32K95q7K07Q7l99N3o8n86j9J90O64
4846B15J12M59l37j15m46l59j06K72nL17J32K93J16k6m93j48o11K9L43O12N6M25
4868G35K1p38n7k18N4l56K72J79K32N26K72p17J55o64m64J05RN75K94J56q5K94
$$ plain form
4716 350 516 659 171 -22 -371 -937 -826 -284 356 809 823 689 -9 -296 -527 -840 -556 -333 -127 310
4736 310 400 717 613 173 -434 -1106 -720 -279 161 558 625 523 -55 -17 -644 -585 -650 -431 -265 410 713 592
4758 592 264 190 -639 -801 -348 -355 324 365 748 595 450 43 -443 -603 -790 -719 -182 354 673 655 694 -4
4780 -4 -306 -453 -685 -428 -102 425 341 622 238 234 -154 -805 -852 -663 -507 76 472 580 360 73 230 -470
4802 -470 -488 -581 -143 23 365 562 472 544 -124 -499 -965 -573 -175 316 640 205 283 308 62 -384 -679 -426
4824 -426 -276 -158 446 800 446 231 -214 -544 -555 -754 -122 173 86 293 380 -19 34 -34 -620 -639 -449 215
4846 215 327 786 449 334 -112 -471 -577 -305 -310 7 139 432 548 522 29 -119 -730 -701 -358 254 310 735
4868 735 756 18 -39 -257 -203 -559 -287 -108 124 650 922 205 360 -304 -768 -663 -654 -79 215 371 286 580
4890E80n36r8j27m10K81K62J23P36q8m73k53n98LJ21J98K34M02K77o2o7l23j62
4912B0n42j26J22L89M08J49K21o6n26k19l36N9O6J33M43k38M60r7j57r1n66l4
4934e28r7K55M47K58L98l25k21j06p75J49k9M29K99J14K72K07l95o97p0k44K1
4955f38K86L82L70J66l88j08l00k41q6J04j0L27L65K99J90k68n54k43l16K0J29
4976e14M00M89J80R9k07m02l89j77o1K29K0P94J47j02l15k39n03j57Q9L48L87
4997A16K41J46P5J28l06m33l57n62L62K00Q46N2K38k92o04n9l60K5K60j22L04
5018a02N19J0L55k91o20l39l84L81K87K77N03r6kl82n10p1m01N12J04K90L87K88
5040G15l9m06k13o65p4M6L06O80j7K53j22n1l11n85m7J33j01M16L64L54J48k42
$$ plain form
4890 580 44 -54 -181 -591 -310 -48 75 811 723 250 -3 -601 -598 -477 -279 -45 357 634 572 505 182 20
4912 20 -522 -648 -526 -137 271 420 641 575 49 -170 -506 -447 -381 -248 195 -43 417 320 163 72 -494 -528
4934 -528 -625 -370 77 335 733 408 187 81 -694 -545 -574 -145 154 268 540 747 352 -345 -415 -659 -638
4955 -638 -352 30 400 566 178 70 -230 -471 -557 -453 -463 -136 229 528 718 450 -104 -347 -663 -643 -514
4976 -514 -114 375 555 654 447 45 -344 -521 -582 -353 -333 461 608 506 191 -48 -551 -708 -619 -271 116
4997 116 357 503 578 706 400 -33 -390 -952 -590 -390 456 508 746 454 -150 -209 -569 -544 -284 -406 -102
5018 -102 417 427 782 491 -129 -468 -852 -471 -184 93 596 500 498 116 -394 -465 -866 -354 -250 40 427 715
5040 715 676 270 57 -608 -682 -636 -330 350 333 586 464 413 102 -483 -530 -397 -498 -82 282 636 784 542
5062E42o00k00m18L8M24P4K55L50q4j01k54k89j98n3N6N02J82N38n09M6n40k10
5084d49LK80k92P9M65J2N13q0j98p10N6m12M74L69J08L08J16l65k05k94j47m0
5106d09P8k2O62r6L73m8n45L0n07J04N0J30P22q6J01k89l1m66l2r8k04K16K39
5129a28N28J58K1m32l36l02j00M63l5L97K03k5K66l75k64m48j48j3M23L62K93
5150E08P9j42m35q4n47P8k5J77M87J13Q0K25k45O3q23q4n6N04L84nL30k96J67
5173D53l51l79k49K20j4L42j1M54O2j41k34m39k8j35PO62j51K53O9j3l45l99J14
5196b53k94m9N40N26j45L25j44n17l91k02K39lM70J54K53j67J30j97n29K20n64
5217e98K07L15L26R2J90J26l91n87L1k25P6L0L55K30L32k01L5l17o39J98k49L75
$$ plain form
5062 542 -58 -258 -676 -638 -214 -140 115 465 381 280 26 -263 -461 -514 -458 44 226 764 255 301 -239 -449
5084 -449 -446 -166 -458 -379 86 98 611 531 333 -377 -321 -733 -259 110 218 526 642 277 72 -222 -369 -409
5106 -409 -331 -353 309 213 586 538 -7 23 -484 -380 -330 -200 522 436 537 248 217 -249 -281 -379 -583 -367 -128
5129 -128 400 558 579 147 -189 -491 -591 -128 -163 234 437 412 678 303 39 -409 -557 -570 -147 215 508
5150 508 587 445 10 -74 -621 -543 -568 -391 96 209 289 514 269 332 -491 -575 -631 -127 257 252 582 286 453
5173 453 102 -277 -526 -306 -320 22 11 465 527 386 152 -287 -315 -450 -443 219 68 321 390 377 32 -367 -253
5196 -253 -547 -596 -56 470 325 650 506 -11 -402 -604 -365 -368 102 256 509 342 472 275 -254 -34 -598
5217 -598 -391 -76 250 342 532 658 267 -320 -289 -514 -438 -408 -53 177 509 308 343 26 -613 -415 -664 -289
5239b89N82kR5L5l39o5m76M3L7J35M56O2N8N28o58q7o82O7N0L02L93N0qN9k64
5264H2j3j78l31j09k41O54L49L41L6j96m27k72l32R7L97L5J33J52J68k55l73l4
5286c17j3j89O8N95J21L11k17R6k39m08l69J27JK09J38L71N2klm57m11J90k36
5309e82L10N55K58k41p5k40l41KM1l13L51J95K83O3K4j30j83n06KJ49p2O20K38
5332D08K2k56k05K6l64j11q6N37JM06J44O4n22j90j22k54Q0K89J01L13M07m90
5354A98K03j92m96l52K07J33L83K01K66j27m51l34j65K41L7J08N4O11l79J51J12
5375D09l37j47j38o8N3L07K86j19K10p8m74K8k49l7M95j22J59J97J2j12j59n19
5397d03kR8M2Q7N73J23k16K7j12k03m31K07k16L09J51K84K08k21oq28K50o9L8
$$ plain form
5239 -289 293 291 386 421 82 17 -459 -416 -379 -244 212 274 332 860 202 115 -567 -500 -450 -148 245 295 287 346 82
5264 82 69 -109 -440 -549 -790 -136 213 554 590 394 -33 -305 -637 -540 -143 -108 25 177 345 90 -283 -317
5286 -317 -330 -519 -451 144 265 576 359 455 216 -192 -561 -434 -433 -224 -86 285 337 335 332 -125 -536 -346 -582
5309 -582 -272 283 541 300 225 -15 -356 -354 -313 -626 -275 -80 203 266 290 160 -23 -529 -527 -378 -450 170 408
5332 408 430 174 -31 -5 -369 -480 -566 -29 -28 378 522 586 64 -126 -248 -502 -422 -133 -32 281 688 198
5354 198 401 209 -287 -639 -432 -299 84 285 551 424 -27 -361 -526 -285 -248 -140 -86 525 146 297 409
5375 409 72 -75 -213 -281 -228 79 365 246 456 378 -96 -68 -317 -354 141 19 178 375 387 275 116 -403
5397 -403 -405 -307 -265 -178 395 518 302 329 217 14 -417 -210 -426 -117 34 318 526 305 299 -529 -279 -348 -310
5420c10K96P7K80n4J13m66J69l15j94R6M1K79K15K74k57j15j49k43j46n2K80L29
5442A48J74n1N6j7l56k45L8l0J56N83k95J67j86P6j76l75L0n3Q4N53J84J16k89
5465B92L7k83m97n7P2N07J97k54M08K1j92m72p3J03j37r1M67L07L1K63k93k35
5487A21j92mm19L05K33J52J18M7k24J59l87j39p5Q9J11j51P38j28k9k0n19k90
5509e04K61J51l4L22l5K33k52k8j91l53J25j59K58m6N95O2k35k46p1m6k65J99
5531b59L58J89p9M34l96l07l6k73k50K56K51K98L25k30N8j53j22m25Q7o6J99K10
5553F9r5N77j76J48n60l90q9J85K64N4J69l4Jj69M4j73k00l5j89P27l4L95k1%
5577D68n70j25k9J3k63P07l12L72j02L11k39k06m08K06J15M5jJ21J91k72M7k50
$$ plain form
5420 -310 -14 63 343 289 402 -64 105 -210 -404 -308 -267 12 227 501 244 129 -20 -263 -409 -461 -181 148
5442 148 322 271 327 310 -46 -291 -253 -283 -127 456 161 328 142 218 42 -333 -303 -356 -272 281 465 581 292
5465 292 329 46 -451 -508 -436 71 268 14 422 443 251 -221 -294 -191 -328 -419 48 355 386 649 356 121
5487 121 -71 -75 -494 -189 44 196 314 361 137 296 -91 -230 -305 -216 -105 -256 482 354 325 305 -214 -504
5509 -504 -243 -92 -126 196 161 394 142 114 -77 -430 -305 -464 -206 -252 343 405 170 -76 -147 -193 -458 -259
5531 -259 99 288 209 643 247 -60 -96 -369 -619 -363 -112 186 511 281 339 186 64 -361 -274 -340 -141 69
5553 69 -26 551 375 523 -37 -427 -516 -331 -67 -13 156 122 123 -46 -2 -175 -375 -410 -599 128 94 489 468 468
5577 468 -102 -227 -256 -243 -506 201 -111 261 159 470 231 25 -383 -177 -62 -17 -18 103 294 22 69 -181
5599a81k84n6M54j69L68J61R0Q7m75N2l59k98K64K93n9M89p6J57l52k50j30n5
5621c29j02K25K39J80M54m22n68M91l50k3q8J35M62J1j74K18k99P4m95k1R1P9
5643b12L02j50N78l20j29k74l6J42j51J37K41j68K01M37l48k46n79L88l31M41
5663g7N1J59J92M2r2m08k33j24M7J03M30N0J07J12q9l8n39j66N0K55K01j3L15
5686C35j35r9j64l14K00R5l67M77P9K78L9J03r2o55k0o2K99J04K23k48K43p6k30
5709A3k3k56n6J15J62J96J0P5l7O1k14l05J45j30J81qL35o8K5l5m37q6M46m82
5733c73K70J29K18N2J52o13j1Q8m14K71K07J41j08J93J40q6m73M0k36j09L68J78
5755B4K67j04k65J42M6j2l55P5O4K0K13m8LK15k54k35o5J95KJ65j32K54J36l10
$$ plain form
5599 -181 -465 -521 -67 -236 132 293 383 470 -5 47 -312 -610 -346 -53 -112 377 301 458 106 -144 -274 -329
5621 -329 -431 -206 33 213 667 245 -323 168 -182 -205 -293 -158 304 315 141 359 60 134 -361 -382 -291 -212
5643 -212 90 -60 518 198 69 -205 -241 -99 -250 -113 128 -40 161 598 250 4 -575 -187 -518 -77
5663 -77 -26 133 325 367 275 -133 -366 -490 -443 -340 90 140 247 359 270 232 -307 -473 -423 -168 33 20 335
5686 335 200 101 -63 -377 -177 -82 -449 28 107 385 424 527 435 -220 -240 -302 -3 101 324 76 319 243 13
5709 13 -10 -266 -322 -207 -45 151 161 236 199 260 46 -259 -114 -244 -63 -71 264 196 221 186 -251 -337 109 -373
5733 -373 -103 26 244 296 448 -165 -176 -88 -502 -231 -24 117 9 202 342 256 -217 -177 -413 -522 -154 24
5755 24 291 187 -78 64 110 98 -257 -182 -118 -98 115 67 70 285 31 -204 -269 -74 -72 93 -39 215 351 41
5779D1J19k20k82J14N3p7R0N78k25k5l46J19n34L74j0K1N12k80L55j37k54O6j93
5802a41m37L01j33N20O0M2J31l40k98l31M60OJ58K16P5O8j03j13K2n07L07k10
5824b47L6M07l92K66jj6j50q0k9k5k23L15J50K40j22l36K60m09L24j84K7n1L94
5847A54L86o06J23k94J25K0l39J46L89o4L55j68j14l5k12j31J50J79l1J75Qn2
5869A64R4k62j38J2k64J50L50l07N22k7l25J60k56o3%O0L35l32J06K89n1j35k43
5892a61L4l8R5j87N77k35J80q2Oj01j74j60O4L5L02K59j74k82J31r1k37j17L58
5915Bj00K62K36j68l2j88l8k11P4K51j9L1O6L0n9p5O0m11j7L35K42m37J52J32
5939A18J45l7l13K9j33j57K08L22j01K07n5k06K00l21J11m90M34K47J44k84K79
$$ plain form
5779 41 160 -60 -342 -228 -175 -252 -162 416 191 166 -180 -61 -595 -221 -231 -210 302 22 377 240 -14 52 -141
5802 -141 -578 -277 -410 110 170 212 343 3 -295 -626 -166 -160 -2 214 289 357 254 141 163 -344 -37 -247
5824 -247 -211 196 -196 70 69 53 -97 -177 -206 -231 -454 -139 11 251 129 -207 53 -356 -32 -216 -189 -240 154
5847 154 540 -66 57 -237 -112 -92 -431 -285 104 40 395 227 113 78 -134 -265 -115 64 33 208 216 164
5869 164 258 -4 -142 -130 -394 -244 106 -201 321 294 -31 129 -127 -190 -190 -130 205 -127 -21 268 217 82 -161
5892 -161 -127 -165 -70 -257 320 85 265 183 189 88 -86 -246 -182 -147 155 414 240 -42 89 -2 -239 -356 2
5915 2 -98 164 400 232 200 12 -26 -237 -163 88 69 100 166 196 137 62 122 -289 -306 29 271 -166 -14 118
5939 118 263 226 -87 -58 -191 -348 -140 182 81 288 233 27 227 -94 17 -473 -39 208 352 68 347
5960C47k51r0M1l53j90N43K98P5k43O9r9l18l3K37m31L23l05L21J50j02J09q3
5982A5l83J99J1J47J90k28J65J2R1l75k41L59l30p8J76L44j22N46n24j36K30k85
6004b17J79J11p9k12M16k00N4J01k17j60j31K81J78Q7K41l89J27m33J97K75m60
6025b51j00K67j97K43O1K08n2j72q8L2K7q0K20lN0r7L8k41K7r9k1K10j03J67p
6050C9J40k34j59O0M8n4m8J03J88j06j12K46j7l52L73r5j21N1J81J52O3m58j68
6073b80J58L0j49j65N96J5p8J83j00l8j89r7O4k06R0M13j71N3P8k29j01r9J19
6096a03R3j34J75R0J84j30j08k44k37L50oo5J48q4K63j39R3N3j08j69j51L60k36
6119a05J22J33K8Ml04M9J0k9m4j8R3J10oJ11k03P9k66K53l52K37j69P44m02M06
$$ plain form
5960 347 96 6 47 -306 -496 47 345 420 177 246 147 -171 -204 33 -398 -75 -380 -59 91 -11 98 15
5982 15 -368 -169 -158 -11 179 -49 116 128 219 -156 -397 -38 -368 -446 -270 74 -48 498 -26 -162 68 -217
6004 -217 -38 73 -6 -218 198 -2 52 153 -64 -224 -355 -74 104 191 432 43 170 -263 -66 209 -251
6025 -251 -351 -84 -281 -38 23 231 179 7 -81 -49 -22 -102 118 115 165 68 106 -135 -108 -207 -228 -18 -121 46 39
6050 39 179 -55 -214 -154 -106 -160 -208 -105 83 -23 -135 111 94 -258 115 20 -101 -50 131 283 346 -112 -280
6073 -280 -122 -92 -241 -406 190 205 127 310 210 172 -17 -114 -50 -256 -166 247 76 129 207 -22 -123 -222 -103
6096 -103 -10 -144 31 121 305 175 67 -177 -414 -64 -70 -135 13 -71 192 53 146 199 91 -78 -229 131 -105
6119 -105 17 150 178 182 -122 -73 -63 -92 -136 -154 -61 49 43 154 -49 30 -236 17 -335 -98 -267 477 75 481
6143D81m99l74K37J8L69j99r4Q3K34j72j50o2j75M1K65l3M2J87R9j17j04l28J09
6166a42j0J8J1K41k3j04J98L4k61j26J03J64j49L08j72k0k2j04l3k1J16J9j45
6189a20K56LN5o5k15p8k25K29J19j38K45j16K40l54J07j91n6L2K1N41l23P14o76
6212EJ34j07n1P5m28K37O0K59K4j35K9j62r0k96J72M2j4L68J7J24l97k35M25j90
6236a34J54j33j32J54L22o8J11j72j04j05j48J05L33q6o6L8N5q5M1k37M9j92J48
6259a52K21L0p3j19K12l70J31n8L89j18P1l55L32k48mJ48r9j84jM02m18K99L0
6282F6L5Q9j85j37K50j09j65J77q7K35J01j49k11K41o0k62JL60j83qJ22J66q08
6305e21M21J5P6MM4j19j45K02K66k6l85L80k00k18J19K0K64j76l19N75l54pk3
$$ plain form
6143 481 -18 -392 -155 -137 232 33 -61 22 256 84 -66 -128 -303 -262 3 -30 12 199 298 181 77 -251 -142
6166 -142 -152 -134 -123 118 95 -9 189 223 -38 -164 -61 103 -46 262 90 70 48 -56 -89 -110 6 25 -120
6189 -120 136 139 194 129 -86 -164 -389 -160 -41 -179 66 -50 190 -164 -57 -248 -304 -272 -251 290 -33 681 5
6212 5 139 32 -19 56 -372 -135 -75 184 208 73 102 -60 -150 -446 -274 -232 -246 122 139 263 -134 -369 56 -134
6236 -134 20 -113 -245 -91 231 163 274 102 -2 -107 -255 -150 183 97 31 69 124 39 80 -157 -108 -300 -152
6259 -152 69 99 26 -93 119 -251 -120 -178 211 93 164 -191 141 -107 -111 37 -62 -246 -247 155 -263 36 66
6282 66 101 190 5 -132 118 9 -156 21 -66 169 270 121 -90 151 91 -171 -170 190 7 -1 121 287 -521
6305 -521 -100 -85 -9 -5 39 -80 -225 -23 243 217 -168 212 12 -206 -87 -67 197 21 -298 277 -77 -84 -107
6328a07p9Q0L2R5K46k29j8l4j63l3j36K45R3J63k20J3J17j00j57j14L19k37M79
6351B55%q3r0k20J2J73j37J13J09j42j25n0O12l14j4k38J04K0j04P2J79J52n24
6374b40L74P4k04N3J46j43o0q7L07j46p1L4Pk15O3J62p1J63J31Rl53J75j32J5
6398il6j31j16K21R0j01k49M19r0j75J91r3J79rm21P06n52OR2J17j04J7j29K04
6422B7K6m0Q4q1O0l65J38J44J2j17K83J03l03J42l00J94o1L5J25k8L61l54O1N1
6446A97r4n9K7k47K69N4L8j11k00K72m0k54j66K65o4J27o2L76j61q7k44M11k76
6469b9j70J4J16K5J14j04o1P9P1J70l21k16L24r8K25k24O0Q5k1O5k73P9L57j56
6493A11P2Mk60P3K37j59j61k21K78j07O3R9R3N1j84k4kl2j40J24N7M0Q7J2l84
$$ plain form
6328 -107 -186 -106 -74 21 267 38 20 -14 -177 -210 -346 -101 -8 155 -65 -52 65 -35 -192 -306 13 -224 255
6351 255 255 172 82 -138 -126 47 -90 23 132 -10 -135 -185 427 113 99 -139 -35 -15 -119 -47 132 284 -240
6374 -240 134 208 4 57 203 60 0 -87 220 74 3 37 44 -171 -108 54 -17 146 277 286 -67 108 -24 -9
6398 -9 -45 -176 -292 -71 19 -82 -331 88 -2 -177 14 -79 100 91 -330 376 -176 -170 -78 39 -65 -48 -177 27
6422 27 53 13 97 16 76 -289 -151 -7 5 -112 171 274 -29 113 -187 7 -54 -19 106 78 439 85 146 197
6446 197 103 44 71 -176 93 147 185 74 -126 146 106 -148 -314 -49 -113 14 -48 328 167 80 -164 247 -29
6469 -29 -199 -185 -69 -44 70 -34 -95 -16 55 225 -96 -312 12 -86 139 -85 -25 60 39 104 -169 -90 267 111
6493 111 183 187 -73 0 237 78 -83 -304 -26 -133 -70 29 122 173 -11 -35 -37 -69 -209 -85 -28 12 99 111 -273
6518b73M62n38L53j33J69J17j17l5J67j30j57R1j49K71lk7J50Q4k33K15l12j52
6540a80j31J41K46j72K09J80l8K3l97n8P9J27N1p7j5J40o1K9q1j94K33q9J79r3
6564E1N1N0n1J29k64J50l44M55j81r5k0P3J18J1j73j29m4P4J0M6P1L4r0N2K38
6589B22m1o0j32m4J58k60N43j36l44O7j25j8j6K07m3j46J36J81k81J03J39j97
6611h7j73J81K61N3j97J63n7M4l20q9J01J77J54oj91L10k41N2j42j37M3K32k25
6634i4P3L66l84K3J26j26j37K00k83J38K0J75j48J26k3J89j03k57j11J31K96n6
6656A41j02j85N40m56o1N4l6p8K60J58Ol82K77k68J60j27j14J1J88O5J31l1l84
6679b33K16J0KLj78K81j88PJ95k94K4j5L6l3K72R7k70K18r6K1k29J68k68J76P1
$$ plain form
6518 -273 189 -349 4 -129 40 157 40 5 172 42 -115 -24 -173 98 95 68 218 302 69 284 -28 -180
6540 -180 -311 -170 76 -96 113 293 255 278 -119 -177 -98 29 80 3 -12 128 67 96 15 -179 54 -35 144 51
6564 51 102 152 101 230 -34 116 -228 227 46 -49 -69 4 122 133 -40 -169 -213 -139 -129 -83 -12 22 -68 -16 222
6589 222 181 121 -11 -55 103 -157 386 250 -94 -27 -152 -170 -186 21 -22 -168 -32 149 -132 -29 110 -87
6611 -87 -260 -79 182 235 38 201 144 188 -132 -221 -120 57 211 205 14 324 83 135 -7 -144 -101 131 -94
6634 -94 -21 345 -39 -16 110 -16 -153 47 -236 -98 -78 97 -51 75 52 241 138 -119 -230 -99 197 141
6656 141 39 -146 394 -62 -123 -69 -105 -183 77 235 241 -141 136 -132 28 -99 -213 -202 -14 51 182 151 -233
6679 -233 -17 -7 -5 -2 -180 101 -87 -80 115 -179 -155 -170 -134 -167 105 202 -68 150 54 75 -154 14 -254 -78 -7
6704gj0J4N17l38n7j57r6N9o7Q3m5K70R2m74J96RQ6k15n1J89P5K0j59L13j98k09
6730a60j32KM03k10k38K34L89j77N8j63j33J51j15k6m0M27j46j43J95p9k9J64
6752B32m80J25M9l00L39r6K67j33j12J38m40R8K32K22j73K30k46K82l03N7l4k61
6774c07K26n7L41q1J51l75j27K79k77L61r6J72r4j64R5N8L9k09N6n5J25l9j51
6797a29M29n42L15LK7j7o4k04K3KO8L38l93J72L5q3j3J16K2M8k40j76K14j58J21
6822h6k37J45L60J48j10k03K7N6j46k71M7j8O68m90J35J86j23J17J3l23J28j02
6844g9JJ59l05N81j58n51L61o4O4r8L70l46J25O7k66M03k40j73L33l10J79MK57
6867C14l85l6J28l6j59K42Q8k12q4L04k15J92j5j64R9k44K4K03K5pn0q9J56k06
$$ plain form
6704 -7 -17 -3 514 176 119 -38 -134 -75 -142 -59 -104 166 258 -216 -20 -11 75 -140 -191 -2 73 93 -66 247 49 -160
6730 -160 -292 -290 113 -97 -335 -101 288 111 169 6 -127 24 -91 -117 -157 270 124 -19 176 97 68 232
6752 232 -248 -123 -74 -374 -35 -131 136 3 -109 29 -411 -313 -81 141 -32 198 -48 234 -69 -12 -46 -307
6774 -307 -81 -138 203 122 273 -102 -229 50 -227 134 38 210 116 -48 47 105 144 -65 -9 -64 61 22 -129
6797 -129 300 -242 73 76 103 86 22 -182 -159 -157 -89 249 -144 28 63 -20 -33 83 105 153 -87 -263 -49 -207 -86
6822 -86 -323 -178 182 330 220 17 44 100 -46 -317 -270 -288 380 -110 25 211 88 205 218 -105 23 -79
6844 -79 -78 81 -224 357 199 -352 9 -55 9 -89 281 -65 60 127 -139 264 24 -149 184 -126 53 57 314
6867 314 -71 -107 21 -15 -174 68 156 -56 -140 164 -51 141 126 -38 61 -183 -159 44 69 62 12 -77 79 -127
6891a27j68J01q7L38k4J23j1k51J59k91P4K05j96O7K56j81o6L9K6J17j4j94K86
6914A81k68k39M24j05K82l03N4j1j03M95m78J41J59j65k19L04j31K59l57Q0j09
6935a09K1mM7j83O6J52J5j6p2J8Q5P1J15l19K6L33j28k35L6r3j56M13K4mq3j35
6961a15K61l64K26q7p9L06k8k54J91j79L5P9m3k22J23L04j86L61q6k50J03j25
6983b9J84m57P5K70j2j08K70J1j02j21R0N1J23k67K23j1k09J06J24k00R4k86Q6
7006i5K89k36K19P9k26J51l37k49K83J12n7Q6L37k57j60K46k84n6J24nN8r5J73
7029A00L8K04n49R1n3L24j83L4J88j41J62lj19k44J13r4l0r9K73J74k15j22P2
7052g9K71L1q1N2k13j8j61M47l14L3k0L6k23L35k02J68K4J4j86K45k82q7R9O8
$$ plain form
6891 -127 -295 -194 -281 57 33 156 145 -106 53 -238 -164 41 -155 -88 168 -13 -79 -40 -14 103 89 -105 181
6914 181 -87 -326 98 -7 275 -28 26 15 -88 407 -71 70 229 64 -155 149 18 277 -80 0 -109
6935 -109 -88 -92 -45 -228 -162 -10 5 -11 -83 -65 20 91 206 -113 -87 246 118 -117 -81 -174 -330 83 107 103 20 -115
6961 -115 146 -218 8 -79 -158 148 120 -134 57 -122 -87 -8 -51 -273 -150 154 -32 329 243 -7 96 -29
6983 -29 155 -302 -227 43 31 -77 193 204 102 -19 71 122 245 -22 201 190 -19 87 211 11 105 -181 -95
7006 -95 194 -42 177 256 30 181 -156 -405 -122 -10 -67 19 356 99 -61 185 -99 -155 -31 -36 22 -73 100
7029 100 138 342 -207 -116 -169 155 -28 6 194 53 215 212 93 -151 -38 -132 -162 -261 12 186 -29 -151 -79
7052 -79 192 223 142 194 -19 -37 -198 249 -65 -32 -52 -16 -239 96 -106 62 86 100 -86 159 -123 -210 -111 -43
7076d3Q0j27J21K35J6j3k47l25K33K49k96O3L40m69N8L58k7j90m3L7j7J04o7L4
7100F4k02K17l4j18j27K47m4O3m2K23O5k27j0q8l32J08P4J79R1r3j50k0J08j8
7124f6K70q1k59J64K25j36L9L2n65Q2J14N19l13K31k05K50m11K10K31l88Q1K42
7146B66m07p3N2J15K97l23k01J66J60k59J69L05l36J27LJ4P9k63O4j49k88P53
7168B71k76N1R3k42P0j82J36K10j36K01j75k26Q0L78l58Q6l7QN1P2j09K35m76
7191b75M49Mj63n2j28J22j67M7K80k96L22j12P4j61j68N4J56J80j61K8%J3q3J81
7215A44m40L23k06o3N16j78p9Pp2R7j59J02j85L00k60K76k85K05j61M5k09J31
7237a51J73j28R4k65J85J44p7L8mj05k4J72j86K17M7j53J49k22R0L9k39K18L90
$$ plain form
7076 -43 37 -90 31 266 282 269 22 -303 -70 179 -117 -54 286 -183 -125 233 206 16 -27 10 -7 97 30 64
7100 64 -138 79 45 -73 -200 47 3 66 24 247 312 85 75 -13 -345 -237 -163 16 107 14 -136 -156 -48 -66
7124 -66 204 123 -136 28 253 117 156 188 -377 -295 -181 338 25 256 51 301 -110 100 331 -57 24 266
7146 266 -141 -214 -162 -47 250 -73 -274 -108 52 -207 -38 267 -69 58 61 75 154 -109 -45 -194 -482 271
7168 271 -5 46 139 -103 -33 -215 -79 131 -5 196 21 -205 -125 253 -105 -19 -56 -48 3 75 -34 201 -275
7191 -275 174 178 15 -37 -165 -43 -210 -163 117 -179 143 31 105 -56 -224 -170 -14 166 5 33 33 46 -37 144
7215 144 -296 27 -179 -242 274 96 17 24 -48 49 -110 -8 -193 107 -153 123 -162 43 -118 -73 -282 -151
7237 -151 22 -106 -12 -277 -92 52 -25 13 9 -96 -120 52 -134 83 130 -23 126 -96 -6 33 -206 12 402
7260D02k52k08Qk8J26M1k69k0J30J88l2K0M0k58L27k32J42rj76l5K08r3l68K44
7284a04J92J37l23o1J15o1L54m5O5k77J08l10J26K17J24R8m57K48l59K44K43k06
7306F8K1m0k29ML47k17J74j82J01K47m19k13K38K95j86K7m53M59J61k44j03R7
7328d7j63K42J04m5k53K45m25K58K20j22K31j26k42J88q3J18j06q9K1Q0K66j02
7350A70J28l62K40k07j5k8j33K80j04K61j74r9N69m04j83j7Mnr6K72k74L36j00
7373E9K8j13M3j90L66o55Q04n47M76j10p6q1n5J77M3m6j24J91k44q9m4K10R1J9
7397A33P0l41r0L57K79k60P3k90O8L9J25l28M40l01J23j40K21l71J82J4m5K40
7419A98%J84j88k04o5J16ON4k89KL06k7K05M7l75j3k03J98K69j42Q7p1ql8Q5k3
$$ plain form
7260 402 150 -58 -50 -78 48 89 -180 -200 -70 118 86 106 146 -112 215 -17 125 116 -60 -95 113 20 -348 -104
7284 -104 88 225 -98 -159 -44 -105 249 204 269 -8 100 -210 -84 133 257 355 -102 146 -213 31 274 68
7306 68 89 49 -180 -176 171 -46 128 -54 47 294 -125 -338 -100 195 9 36 -417 42 203 -41 -144 -47
7328 -47 -210 32 136 91 -162 83 -342 -84 136 14 245 119 -123 65 -18 100 -6 -95 -74 6 272 170
7350 170 298 -64 176 -31 -46 -74 -207 73 -31 230 56 -43 526 122 -61 -78 -74 -79 -175 97 -177 159 59
7373 59 87 -26 17 -173 193 -462 342 -205 271 161 85 4 -51 126 169 123 -1 190 -54 -143 -187 23 114 133
7397 133 203 -138 -228 129 408 148 221 -69 -1 38 163 -165 275 -26 97 -43 178 -193 -11 3 -42 198
7419 198 198 382 194 -10 -75 41 47 101 -188 -186 120 93 298 345 -30 -43 -246 -48 221 79 166 95 87 49 134 111
7445A11M5k00k30L55m20M57j86J34k73P2J09O9j04R3J65r1k43K06r2l1qJ50j60
7468g2K70l11J13J21j35J26k78qp5M66n5j9m46M36q8M0n9k93K40k35M0L44j27
7491eL42l65k17K92r3J0j29R5L21j90J12r4Pr9J64j63J68k26Q0j05K94j83L7K0
7515G3p6N7j23J8n8O7K62k07l4q8K9J11j05K27k22K54k35L8j04o8J2Q4J96j84
7539g6n6J20j4N0%n6Nk33J81lP5Q1J76j79J9N6j92j21P8K17j75j6J33k00K74o6
7565G8l34Q9J21n4J81L7j73J0L0J14k16K31j38l16M34j92K02j05J04l50J86K49
7587A88k16j28Q5L4l3N03l33j05J77j04j14o4J21Q3j88nJ34m0O8l05K21k00L76
7610A55j64J34l8Q1n6l86K49MM4J7J57L8m32K18N9m73J44K6K26L7l0N7P4M8j22
$$ plain form
7445 111 156 -44 -274 81 -339 118 -68 66 -207 -135 -26 43 -61 32 197 106 -137 69 -23 -54 -62 88 -72
7468 -72 198 -113 0 121 -14 112 -166 -174 -249 217 162 143 -303 133 45 85 26 -267 -27 -262 -222 122 -5
7491 -5 337 -28 -245 47 -46 -36 -165 -70 251 61 173 79 86 -13 151 -12 156 -70 10 -95 199 16 53 73
7515 73 -3 54 -69 -51 -109 -42 220 13 -21 -109 -80 31 -74 153 -69 185 -50 -12 -116 -184 -172 -88 108 -76
7539 -76 -132 -12 -26 24 24 -32 -27 -260 -79 -82 -7 74 250 71 90 146 -46 -167 -89 128 -47 -63 70 -130 144 78
7565 78 -256 -167 -46 -100 81 118 -55 -45 -15 99 -117 114 -24 -340 94 -98 104 -1 103 -247 -61 188
7587 188 -28 -156 -71 -37 -70 433 100 -5 172 68 -46 -110 11 94 -94 -99 35 -5 63 -242 -21 -221 155
7610 155 -9 125 87 168 112 -274 -25 -21 23 40 197 235 -197 21 80 -393 -249 -223 3 40 10 67 141 189 67
7635F7m34M41j65kJ07o7l6q3K09j77N2M8l50O92m68K28n5j09O3O4J9q4k05J56
7659h9K09k13R8K75l41J57k04K29j74k72M90k08N1o7J36J02j40k01L05j99J01
7680D5K4J6l9K0J24k94k9k39K08M22M8k31J87n2k26L2K2j19Q3j46J02JL44R6m27
7705b8j44J98m48L73LJ08J1j02K90l27K44l95L24m05K13M8R5NQ5j23K59j78l83
7728b77J51J79k0NJ20r3o7n1J36L2j7k24M12r4j29j85J82Q8j23j75K60P7l49J20
7752d2l05K77r0j1K19k45K33ro4R0j14l8O2r3P5K84l25k6K07q6L8l1L64k26k03
7777e9j20p1K86j54J18nK7r1o0K43j44R2j40j82M1N8L82o3m5r5j65Pk8L58j26
7802F4j49N5R0j35L26N9j52Q6l65J03J00k3j41k0J99n5J27o3k0J1n80O46R2k27
$$ plain form
7635 67 -367 74 -91 -93 14 -53 -89 -172 37 -140 -88 -40 -390 302 -166 62 7 -102 -39 25 44 -40 -245 -89
7659 -89 120 -93 5 280 -61 96 -108 121 -53 -325 165 -43 8 -59 77 179 39 -162 143 -56 45
7680 45 69 85 46 66 190 -104 -133 -372 -164 258 306 75 262 210 -16 16 38 -81 2 -144 -42 -41 303 399 -28
7705 -28 -172 26 -422 -49 -46 62 73 -29 261 -66 178 -217 107 -298 -85 -37 58 63 148 25 284 106 -277
7728 -277 -126 53 33 38 158 65 -2 -53 83 115 98 -126 286 192 63 -122 60 148 25 -150 110 187 -162 -42
7752 -42 -347 -70 -160 -171 48 -197 36 27 -37 53 -61 -99 -37 -130 -55 229 -96 -122 85 -1 37 6 370 144 -59
7777 -59 -179 -250 36 -118 0 -5 22 -69 -129 114 -30 62 -78 -260 -219 -161 221 158 113 18 -147 -140 -168 190 64
7802 64 -85 -30 60 -75 251 310 158 244 -121 -18 82 59 -82 -102 97 42 169 106 86 97 -483 163 255 28
7826B8q8K34m41l8K66p1K17j34J55j12k33K24n2j02K17j72N1K36J4P2k22o2r7
7849a10pp7L08M7J83l00j76K07o2q3J2j12J94L57m14Q2Kp1J5N2j00r3L0K42l10
7874a84K43P2M5p0k82j53L04o4L09m4j12J35l65K40q3k30J81k39L29Q0j48L16
7896B80k87r3P2j73J16J18J55n8R4o6j01k63K88k01K45r3j17K20o2P2j30k60N2
7919a92J10J85p9QK99j10k63M14m82O5j03L27j98k04lL21M0j76L32m13M7M2P4
7942D1k92M73k68P6J8K6j97R3Ok03L50r7K59q5l63K65l06J06m9J27K67m0j89j70
7966a52J93K63n00j5j13J24J75n1N8P1k65K42m52P82k30J79o43L66K36j11m9M2
7988A50M9o03L30P4R1q6M02l57r2K03J0l2lj87J0K04k52J8k5j22J76o4O9P5r6
$$ plain form
7826 28 -60 174 -267 -305 -39 -110 107 -27 128 16 -217 7 -45 -147 70 -102 -51 185 199 271 49 -13 -110
7849 -110 -117 -194 114 161 344 44 -132 75 13 -70 -58 -170 24 381 -33 49 51 -20 -5 47 -53 -146 -116 126 -184
7874 -184 59 131 176 106 -176 -329 -25 -89 220 176 64 199 -166 74 -9 -239 -58 -297 32 112 -36 280
7896 280 -7 -100 -28 -201 -85 33 188 130 224 158 57 -206 82 -119 126 33 -84 136 74 146 16 -244 -192
7919 -192 -82 103 24 32 331 221 -42 372 -110 -45 -148 179 -19 -223 -226 95 135 -41 291 -122 -75 -33 41
7942 41 -251 222 -46 30 48 74 -123 -30 -24 -227 123 26 285 200 -163 102 -204 -98 -147 -20 247 207 18 -152
7966 -152 41 304 -196 -211 -324 -200 -25 -76 -18 53 -212 30 -422 360 130 309 -334 32 268 157 108 150
7988 150 199 -404 -74 0 91 5 407 50 -42 161 171 139 136 -51 -41 163 -89 -71 -96 -218 -42 -106 -37 38 -58
8013e8O7M6K0M4m4J29j96jk56L39J25j29P6j28J40j97j65J34j41K65k1k02k2N09
8037C34j14l92L6Q8j91J09K76P2j11K7N4j89K66n75L01J53j58R7jl6p5K53m04
8060a80j0M7K65p3J16J26j89j47K9j83N7O4R3J20k91K75j32J95%l19k0K32j94
8083a19L91k79n0p3M94k77p9L2n2j3K01j34Q3Q4j19P3p6lo5K69k96p5M3R9j26
8108f7L76om50j10K58l00L52K52k39L2l50L62j69L87k93J29j98K0n3L0oJ60j89
8131g2j02M40j62o7K05j90O5k51J2j5N7l25L61K9r6K38k89J25j1j9j04j11K68
8154a4L2K5O9N6o8j34p3K04j46L69l06k6K54l9K1j08n4p0K03l27l2m6K44L26j24
8179B36k53qJ3l09L2J44Q1Q5R6l99L42j74
$$ plain form
8013 -58 9 55 75 119 75 204 8 7 -249 90 215 86 162 34 174 -23 -188 -54 -195 70 49 -153 -175 334
8037 334 220 -172 -136 -48 -239 -130 146 218 107 134 188 -1 265 -310 -9 144 -14 83 82 46 -29 224 -180
8060 -180 -190 -143 122 49 165 291 102 -45 -16 -199 -142 -78 15 135 -156 119 -13 182 182 -137 -157 75 -119
8083 -119 272 -7 -57 -130 364 87 8 40 -12 -25 176 42 125 209 90 163 87 84 19 288 -8 -83 -40 59 -67
8108 -67 309 303 -147 -257 1 -299 53 305 66 98 -252 110 -59 328 35 164 -34 -14 -67 -37 -43 117 -72
8131 -72 -174 266 104 37 242 52 117 -134 -122 -137 -80 -405 -44 -15 -111 127 -162 -37 -48 -67 -171 -282 -14
8154 -14 18 43 112 168 100 -34 -107 97 -49 320 14 -12 242 203 224 116 62 -8 195 -132 -164 -210 34 360 236
8179 236 -17 -25 -12 -321 -289 -145 -64 21 117 -282 60 -114
8191a14
$$ Imaginary data points
##PAGE= N=2
##DATA TABLE= (X++(I..I)), XYDATA
0@%%%%%%%%%jJqJ6j6J7k5L2m0M9n7P2q8J03j20J39j63J93k23K55k92L35l82M36
33B33m94N58o30P07p94Q89r92J104j228J364j511J672j847K040k252K482k733
50a432L011l318L656m035M457m929N464o077O789p622Q614r819J1323j3262J5868
65H688j9580K5332l5557N9279k22011q2539L76524J85743J9224k13409j90537
76h8843p8313J00193J09721K3831j18603j17329k548J75405K18932J05014j22113
87B05347k64084k33994l3111J67631K42664J37290l2308j41107j07718L75P9305
98B0290M3961n8088j28407p8117O2311J87825J84101M5555j33550k20129j56896
109b31144P14J33124J52144O7671l3250o7260k3684L5475L8365k6877r9724j05635
$$ plain form
0 0 0 0 0 0 0 0 0 0 0 -1 0 -8 8 -8 9 -16 16 -24 25 -32 40 -48 55 -65 74 -89 104 -119 136 -156 179 -203 233
33 233 -261 297 -333 374 -420 469 -523 581 -647 717 -794 878 -969 1071 -1181 1301 -1432
50 -1432 1579 -1739 1917 -2118 2339 -2590 2874 -3203 3586 -4036 4578 -5241 6082 -7180 8688
65 8688 -10892 14440 -21117 38162 -183849 -266388 110136 295879 315103 101694 -88843
76 -88843 -167156 -66963 42758 66589 -52014 -169343 -171891 3514 222446 327460 205347
87 205347 -58737 -292731 -325842 -158211 84453 221743 189435 48328 -59390 -59015 20290
98 20290 64251 6163 -122244 -200361 -138050 49775 233876 279431 145881 -74248 -231144
109 -231144 -230430 -97306 54838 122509 89259 21999 -1685 33790 72155 45278 -54446 -160081
121a60081k1204R8305J62590J19822m06j12737j43699q4186Q985O7156O3579K5307
133B3431K85R454L2289K7736j7572p5672r6971n5769K6509R6402J06825N7051
145A33998j6032o4246o6721m0327j3734r20M466K0619M5974O2300M6094m404o1325
158D5742q6958o3466o892M4478O3062M7134J9680N72n950j4229l3840n4770n1874
171i7311j3456M5901Q7673P8675K2693m4664p8166o1577j5328K1948K7621J1497
183a4494L383J8201M1788M2224J050n9884r5559p0670N695Q2447J05278N9076
195A18535j8030o8998o2419j6124K3189K0116j3683l4941j1471M6248Q6603O5460
207A34485j5585r8840j20838n7794M4104J10285R5249J8013n4884o9142k2729
$$ plain form
121 -160081 -181285 -82980 79610 199432 199026 86289 -57410 -141596 -132611 -65455 -1876 23431
133 23431 23716 33170 65459 93195 75623 -49 -97020 -152789 -126280 -29878 76947 133998
145 133998 117966 53720 -13001 -53328 -67062 -67982 -63516 -42897 3077 65377 111471 107067 45742
158 45742 -41216 -104682 -111574 -67096 -4034 43100 62780 63352 57402 43173 9333 -45437 -97311
171 -97311 -110767 -64866 22807 101482 124175 79511 1345 -60232 -75560 -53612 -25991 -14494
183 -14494 -11111 7090 48878 91102 92152 32268 -63291 -133961 -128266 -45819 59459 118535
195 118535 100505 31507 -30912 -47036 -23847 -3731 -17414 -52355 -63826 -17578 69025 134485
207 134485 118900 20060 -100778 -158572 -114468 -4183 91066 109079 54195 -14947 -37676
218c7676L0328L7538r085o1274o0694N092Q7445J15884N6724n1240j28310j14963
230a30231k3039P7057J10182O0725k2273o5843m0561K1372N3288K0907m9897r1055
242g9368n5540L8488J18458J16745K7939q3012j32931q7202J3451Q8926Q6329
253E2283J9126m5939n1912Q99N3548N2140j2092q5246r8504l0232P1566J29218
265E4855R4810n343r6761j12441m9886L5163P3939M6359j2634m2118j6362L6684
277F265O1834K5978m7786r7631p8026K327Q5725J10412N9714k5101q1503p3218
289e1010j9125L0671L7072O695k1487j6025K2775N5706M5934q196o8327q6860
301g2177m5760K5192P7450P6231K8654k5157m7836l3090n828N819l754j7381j0644
$$ plain form
218 -37676 -7348 30190 21105 -40169 -100863 -95771 -8326 107558 164282 113042 -15268 -130231
230 -130231 -153270 -76213 33969 94694 72421 6578 -33983 -12611 40677 61584 11687 -79368
242 -79368 -134908 -96420 22038 138783 166722 83710 -49221 -136423 -122972 -34046 52283
253 52283 71409 25470 -26442 -25543 28005 80145 68053 -17193 -115697 -145929 -74363 54855
265 54855 149665 144322 47561 -64880 -114766 -79603 -5664 40695 28061 -14057 -30419 6265
277 6265 68099 94077 46291 -51340 -129366 -127039 -41314 69098 128812 103711 22208 -51010
289 -51010 -70135 -39464 -2392 4303 -17184 -33209 -10434 45272 91206 83010 14683 -72177
301 -72177 -117937 -92745 -15295 60936 89590 64433 16597 -16493 -22321 -16502 -20256 -37637 -48281
314d8281J9336M9587N2053J7032l4805o6362n7738j6084K7714M8126L8061J4729
326D3368j980o326p196j5642k9568l4526j8059J5665M7979N3650K9182j1178m0644
339B4725m3396k4113k314R180J0107J2228K1833L1365K5983j619l9468n8990m5173
352g9652j854M2592N8016L7371L78k5121k5121r521q26r038k3095k1847O741M5618
366e359O2656L8655j7147o5011p1958l2460K3965N5306M4875Q438j9723j7359
378D878N042J9265K762l2594n4393l4161K0673P1329P7352K9814l9636p8871o3263
391g1803p743M1825M9799J7643j8412k3525N393L6910L3887j0707o0796p3046
403h0575k8986M3381Q9948P3977O804n8759p6896l8958J8572M6456K7068j3628
$$ plain form
314 -48281 -28945 20642 72695 89727 54922 -11440 -69178 -85262 -57548 -9422 28639 43368
326 43368 41388 35062 27866 12224 -17344 -51870 -69929 -54264 -6285 47365 76547 65369 24725
339 24725 -18671 -42784 -45098 -35918 -25811 -13583 8250 39615 65598 63979 24511 -34479 -79652
352 -79652 -81506 -38914 19102 56473 56851 31730 6609 -2912 -3738 -12776 -35871 -57718 -50977 -5359
366 -5359 57297 95952 78805 13794 -58164 -90624 -66659 -11353 33522 41960 22237 4878
378 4878 9920 29185 31947 -647 -55040 -89201 -68528 2801 80153 109967 70331 -8540 -71803
391 -71803 -79546 -37721 12078 29721 11309 -12216 -6823 30087 63974 53267 -7529 -80575
403 -80575 -109561 -66180 23768 97745 104549 45790 -31106 -70064 -51492 -5036 22032 8404
415H404l2763r978L5556N7445K8794l4144q0805p2520q779O2724Q9196N3211j5784
428H0557o2230n5851j0551L0167L1680k049l3287k7725J4681N7369N8602R559
440I0922n4641q4360n4500J3030O8160P1752K6642k7541m9458k7269J0167K6243
452I147O374k6738l7696r538L8685O5252M4263j2152o3476p1063l1207K6018N6879
465e252M5489O568k3285k3779k252J4698P188j9097l6703k4878J3420N0045N4538
478E6700K2267k5824n4506m6476j2058K2403L2441J9570J496m398L341J0997M010
491B9963j7021l5182l1308l687L0070M6568L3957K531k5553l3664k2307m542N101
504b5074N416M746J0807K0000K2250Q521j6083l5136l5492j4124J4616L1893K8704
$$ plain form
415 8404 -24359 -34337 1219 58664 87458 53314 -27491 -100011 -108790 -46066 43130 96341 80557
428 80557 18327 -37524 -48075 -17908 13772 11723 -21564 -49289 -34608 22761 81363 90922
440 90922 36281 -48079 -102579 -89549 -21389 50363 77005 49464 6 -27263 -17096 9147
452 9147 15521 -11217 -48913 -58451 -19766 45486 89749 77597 14121 -56942 -88149 -62131 -5252
465 -5252 40237 46805 23520 -259 -2511 12187 19375 278 -36425 -61303 -47883 2162 56700
478 56700 78967 53143 -1363 -47839 -59897 -37494 -5053 14517 16013 11615 14956 25953 29963
491 29963 12942 -22240 -53548 -57235 -27165 19403 53360 55891 30338 -3326 -25633 -30175 -25074
504 -25074 -19658 -14912 -4105 15895 38145 46666 30583 -4553 -40045 -54169 -39553 -7660 21044
517B1044J2853l425j0066r008q784j3781j9048j2575O396K9015L9002K5009n599
530E1033l3479l9652k1756M678K0922J9089P244j18M656J2742R620r445l1956
543f422l8797j8867J8826M7646M6330J5054k3382m0722k9710k302J6392J3428
555b526k659j1043J407K3649L3739J5522k2071n1271m7797r801L5375N6135L7557
568E6216k534l2907l3592r479J3099J3839n897k2582j5853J4571M3186M3725Q044
581F9836l8474o1606m2414N516M5969N0843K0436j6848l1278j5925J0346J8786
593A5187L04k6554l4672r680L2458N6704M0949o432n1397n9272k7434K0036M6278
606c525L4405J599k2817j8121N349K2439J2642j7703m2276l3760N481M5666N7291
$$ plain form
517 21044 33897 30472 20406 11398 2614 -11167 -30215 -42790 -36394 -7379 31623 56632 51033
530 51033 17554 -22098 -43854 -39176 -18254 835 8079 7961 12617 25359 34979 25534 -6422
543 -6422 -45219 -64086 -45260 2386 48716 63770 40388 -334 -30044 -32346 -15954 -2526
555 -2526 -5185 -16228 -14821 8828 42567 58089 36018 -15253 -63050 -72851 -37476 18659 56216
568 56216 53682 20775 -12817 -22296 -9197 4642 -1255 -23837 -39690 -25119 18067 61792 69836
581 69836 31362 -30244 -72658 -67142 -21173 29670 50106 33258 1980 -13945 -3599 15187
593 15187 15491 -11063 -45735 -55415 -22957 33747 74696 68264 16867 -42405 -69839 -49803 -3525
606 -3525 30880 32479 9662 -8459 -3110 19329 31971 14268 -28008 -61768 -56287 -10621 46670
619D6670K7490k0053n1694m5401j0299K4385L3248J4363r687j5715J083K1034
631A5424K2098k553l3386m3960k2539J9907M8497M5620J2030k5806m0527k6538
643c1733J105J8069J3534k106j0068n33J8125K6703J1471j7627l9231l5781p223
656e5295K5716M0773K7875J679j9673k2507j0471J456K690m491p627o05J5859
669d621K5889J9611k612k5111l3393k0044L060K0597K3560J2934J239m494l729
682A2886l598q457j5055j4863l226J4486K7110K3175N579j4608k3421j8681n210
695b3883M915P082N465N199J0097J3906Q067p132k3478k7434j4260R144K6412
708e900K6501J0903p343j5981j1612k115J165m522j0222n806R306K5018K6392
$$ plain form
619 46670 74160 54107 2413 -42988 -53287 -28902 4346 18709 9022 -6693 -5610 15424
631 15424 37522 34969 1583 -42377 -64916 -45009 3488 49108 61138 35332 -5195 -31733
643 -31733 -30628 -12559 975 -1131 -11199 -11732 6393 33096 44567 26940 -12291 -48072 -55295
656 -55295 -29579 11194 39069 40748 21075 -1432 -11903 -10447 -7757 -12248 -19875 -20480 -4621
669 -4621 21268 40879 38267 13156 -20237 -40281 -37221 -16624 6936 19870 21109 16615 12886
682 12886 9288 831 -14224 -29087 -32313 -17827 9283 32458 38037 23429 8 -18673 -23883
695 -23883 -18968 -11886 -6421 -1222 8875 22781 30848 23716 238 -27196 -41456 -32312 -5900
708 -5900 20601 31504 24161 8180 -3432 -5547 -4382 -8904 -19126 -24932 -15626 9392 35784
721C5784Q973j8704l5338k9747m288K1079K9365J7114l160j3907q098M307R169
734A2549k091j8571k4227q211J9907L8257L1419O78l0931m0447k2186Q881K7685
747g288K2804K007j4012j0497O584J8727J0912j3372l3570k9681k71L2492M5161
760B9996K4869j1397l7184l5015q763J7883K4580Q414j0952j5364J333K0999K4894
773C4293L240k6348m1136k5030J0932M0039M1515J3448k0547l5399k2095L975
785b3113J9564J2893o087j7898p998J5207L0678K1656q209l6257m0163j4121K0911
798c2937M0120K9817P84k2593k4706o794J0550J2480j787j6746j5506M658K5907
811C247L1121J1745j8295l7758l0291l072K3470L0436J5956m681j5866r898L047
$$ plain form
721 35784 44757 26053 -9285 -39032 -43320 -22241 7124 24238 21078 7171 -927 3380 12549
734 12549 10458 -8113 -32340 -40551 -20644 17613 49032 49710 18779 -21668 -43854 -34973 -7288
747 -7288 15516 17523 3511 -6986 -402 18325 29237 15865 -17705 -47386 -47657 -15165 29996
760 29996 54865 43468 6284 -28731 -37494 -19611 4969 13383 2431 -12933 -11600 9399 34293
773 34293 37533 11185 -29951 -54981 -44049 -4010 37505 50953 30406 -4993 -27088 -23113
785 -23113 -3549 9344 3257 -14641 -22639 -7432 23246 44902 36693 436 -39727 -53848 -32937
798 -32937 7183 37000 37784 15191 -9515 -16309 -5759 6721 4934 -11812 -27318 -22660 3247
811 3247 34368 46113 27818 -9940 -40231 -43303 -19833 10603 26559 21878 6012 -3886 -839
824h39Q408j74j3778j8405o010J5873K9154K3162O56k2731k9514j7592L787J7485
838a0518J5911N366l257l121L581O316r74j3090j9022j1793N418K1408K3799J1574
852C1598o783j7866j6999p156K528N105L245J894N260J0473R537P92j1818j9438
866i628j5987j895J2927J8519J2774K080n731p065m267l690o283p856m582O161
880a4523J7173J9066Q413q446k0522j9478o443P553J3550R156R27k087J962O281
894A2582L404p707j7667j7719l859J5287K6333J9732P40j7755k1533j1458M029
907a5591J0792O054k979n910K486J3472J5768L089j6445k7786j9694L057K4539
920i148K8236J3244q507k0890j5736l5J0268O720n024j2410o051J1502K3806J9119
$$ plain form
824 -839 7569 7395 -6383 -24788 -30798 -14925 14229 37391 38047 15316 -14198 -31790 -28003 -10518
838 -10518 5393 10759 7502 4381 7962 14278 13304 214 -18808 -30601 -25183 -3775 20024 31598
852 31598 24815 6949 -10050 -17206 -14678 -9573 -6328 -4434 826 11299 20836 21628 9810 -9628
866 -9628 -25615 -27510 -14583 3936 16710 18790 13059 5994 1727 -1963 -8246 -16102 -20684 -14523
880 -14523 2650 21716 30129 21683 1161 -18317 -24760 -17207 -3657 5499 6426 4339 6301 12582
894 12582 15986 8279 -9388 -27107 -30966 -15679 10654 30386 31126 13371 -8162 -19620 -15591
907 -15591 -4799 1255 -1724 -7634 -5148 8324 24092 27181 10736 -17050 -36744 -33687 -9148
920 -9148 19088 32332 23825 2935 -12801 -12836 -2568 4152 -872 -13282 -19333 -7831 15975 35094
934C5094l701k5727l1264j4901J1974K8668K3698L318j5120j7698m805R489J0045
947I070k453j5889j6299M03K1649K9385J4546j2096l1036k8038n953J7871K6002
960G162J4086n104j4774q343N744J2223M074j2864k1930j2741R666K7861K6799
973C1859O754j8622k9698j9297K168J8302J7519L564q801q736K629J2772R232
986A9645n814k0486k1272m774J7330K7640J9496j501j9653k1770r647O099J2296
999b411O154l586o074J383J1451J2690K284j4254k1927j5007K708J8882K1596
1012A3889J0707m825j4194j1319l384L371K356k664m152J488J0323J4128P425
1025B3149o255j7095j7257o864P371J4748J1704M067l130m522j820j527m211p793
$$ plain form
934 35094 31393 5666 -25598 -40499 -28525 143 23841 27159 12039 -5659 -10464 -975 9070
947 9070 6617 -9272 -25571 -25168 -3519 25866 40412 28316 -2720 -30758 -36711 -18840 7162
960 7162 21248 16144 1370 -6973 -1229 10994 15068 2204 -19726 -32467 -22801 5060 31859
973 31859 38613 19991 -9707 -29004 -26836 -8534 8985 12549 3748 -4988 -2359 10413 19645
986 19645 13831 -6655 -27927 -32701 -15371 12269 31765 30264 10611 -11159 -20806 -14707 -2411
999 -2411 3743 157 -5917 -4534 6917 19607 21891 7637 -14290 -29297 -26589 -7707 13889
1012 13889 24596 19771 5577 -5742 -9126 -5755 -3399 -6063 -10215 -8727 1596 15724 23149
1025 23149 16894 -201 -17458 -24322 -16951 -2203 9501 13568 10438 5916 4096 2569 -1642 -9435
1039i435p474J281J0405J4962J1050m92j1180j4408q505m57N151N420L622K501
1053B441M383N852K152o024j3285j3051m590P715J5790J3499L749o352j0572o272
1067d565r49J427j407m038j605O565J3641J1987R89j2799j9580j3400J219J4250
1081h265J6228P560m071q540m088K433L894k642j0248j1112l40J3714K0557J2979
1095B8059m363j9494k0735p902P933J6139J0729j048p771m217M561Q566L075j0079
1109C453j7703j2418N018K0618K2412Q465j0565k1711j6389p04J1952J2267K834
1122G529p430o831K973J2611J0716k255j7370k1163r056J1562K3797J9027K231
1135B6341j4657j8982q807N382J1103M740n175r318j276J1056J6129P666r240
$$ plain form
1039 -9435 -16909 -15628 -5223 9739 20789 20297 9117 -5291 -13796 -14253 -9102 -3682 -60 2441
1053 2441 6824 12676 14828 8804 -4481 -17532 -22122 -14407 1383 14882 18631 12279 1707 -4565
1067 -4565 -5514 -4087 -5494 -9532 -11137 -4572 9069 21056 22045 9246 -10334 -23734 -22515 -8265
1081 -8265 7963 15523 11452 2912 -1176 1257 5151 2509 -7739 -18851 -19191 -5477 15080 28059
1095 28059 23696 4202 -16533 -24435 -16502 -363 10366 9318 1547 -2670 1891 10457 13532 3453
1109 3453 -14250 -26668 -21650 -1032 21380 29845 19280 -2431 -18820 -19524 -7572 4695 7529
1122 7529 99 -6732 -3759 8852 19568 17313 -57 -21220 -30276 -18714 5083 24110 26341
1135 26341 11684 -7298 -16105 -10723 380 5120 -55 -9373 -10649 407 16536 24202 14962
1148A4962k1492j8864k156J5058K2373J2150l218j4469j1777j353P422N441l262
1161H15r751n906N524J6128J5226J996j4675k0971j2618L140J5860J5292N369
1174A5429n855r056l276L325M375k247r299r114J72J1597J6648R831m493j4829
1188C208j5665o022N463J1002P411Q94l232j305K987L329j797q494j0632m694
1202a7547N563J4020J2666L407o694j1687q355j626L120L781J342O66K633N733
1216G022N124j226p741j1370p970J375R601J0746O094j127m848m669k325j019
1230b333k309m060j499M522R187R939L123o744j2051r896k367N840Q119N227K4
1245D722j015L12K268P08n166r359p955M02R735J4071Q955j769j0963j1508m985
$$ plain form
1148 14962 -6530 -25394 -27550 -12492 9881 22031 18813 4344 -7433 -8786 -1364 4077 815
1161 815 -8936 -14842 -9318 6810 22036 24032 9357 -11614 -24232 -21092 -5232 10060 15429
1174 15429 9574 518 -2758 567 4942 2695 -6604 -15718 -15546 -3949 12699 22530 18037 3208
1188 3208 -12457 -18479 -13016 -2014 5397 6291 3059 1754 4741 8070 6273 -2221 -12853 -17547
1202 -17547 -11984 2036 14702 18109 11415 -272 -8627 -10253 -7133 -3352 -2010 -1344 1289 7022
1216 7022 12146 10920 3179 -8191 -16161 -14786 -5185 5561 11655 10528 5680 1011 -1314 -2333
1230 -2333 -4642 -8702 -10201 -5679 3508 13447 16570 9826 -2225 -12121 -14488 -8648 -529 4698 4722
1245 4722 3707 4019 6287 6995 1829 -7530 -15485 -15083 -5348 8723 17678 15909 4946 -6562 -11547
1260a1547L133N972L092j143k234J947P655O532j043j0158j4793q141M677J5101
1274i50J4294M979p093j2030p186J259N180L100l423o100p22Q004J2669P581n269
1289A4293j5856j6119m438R821J5840J1311r08r018q380j440N265M110l551q763
1303g833o660L959J3902J4072L941r818j8084j2765M25J2214J3410N374m930p743
1317e36k559M296O309p74r076j1989l740R076J6757J2994j089j3055j6131p781
1331a7298M611J0898P886l69n377l355L871P439L049o463j2660j0140Q91J2654
1345d363J5274Q320m372j2579j1207k997N474O383J906k969k826K742P688O268
1359A2742j302j0522j2495o066M782J2199J1529L539m919q676n565J69K406J31
$$ plain form
1260 -11547 -8414 -2442 650 -493 -2727 -780 6875 13407 12364 2206 -12587 -20728 -16051 -950
1274 -950 13344 18323 11230 -800 -7986 -6727 -1547 1553 -1870 -7970 -8692 -688 11981 19562 14293
1289 14293 -1563 -17682 -22120 -12299 3541 14852 13944 4926 -3454 -4894 371 4481 930 -7833
1303 -7833 -14493 -10534 3368 17440 21381 11563 -6521 -19286 -18861 -6647 6763 12137 7207 -536
1317 -536 -3095 1201 7510 6736 -2340 -14329 -18069 -8993 7764 20758 19669 6614 -9517 -17298
1331 -17298 -12687 -1789 6097 5728 351 -3004 867 8306 11355 4892 -7768 -17908 -17017 -4363
1345 -4363 10911 19231 14859 2280 -8927 -11924 -6450 -67 1839 -1130 -3956 -1214 6474 12742
1359 12742 11440 918 -11577 -17643 -12861 -662 10867 14406 9487 811 -4754 -4585 -2179 -2048
1373b048k206k098K207P237P945K550o214j0775q944j513O185Q948O150N78k866
1388E136k498j146o75k124m882l128J236O729Q670N262j755p683p985m363J334
1403g872L762L507J792J252K329K358K94m361p389o849q84N716R360O857P52m794
1419E830o355k868m66J091q07j812J71N064P429N323j556q823j0807n839L258
1434a1167R208Q196K434l062m588j513J624J303k954o019m602K392R048J1125
1448A1425M660n275j2125j0275k162O337R051M830j690m108j687L714M084n49
1462F230p531r806m407O258J2897J1414J756r290j2471p001J981P782N535q3m001
1477g37k702L479P649M100m627j1749j0757j246R835J3898R007k443j0016r614
$$ plain form
1373 -2048 -4254 -6352 -4145 3092 11037 13587 7373 -3402 -12346 -13859 -7674 1274 7424 8002 5136
1388 5136 2638 1492 817 -1307 -6189 -9317 -8081 -1352 7318 12580 10825 3142 -4843 -9206 -7872
1403 -7872 -4110 -603 1189 2441 4770 7128 7422 3061 -4328 -11177 -12061 -6345 3015 9872 10624 5830
1419 5830 -525 -3393 -3859 -2768 -3575 -5387 -5216 -152 7277 12600 11044 2221 -8586 -14425 -11167
1434 -11167 -1959 6237 8671 5609 1021 -492 1132 2435 -519 -6538 -11140 -8748 300 11425
1448 11425 16085 10810 -1315 -11590 -13752 -7415 1636 6466 4776 668 -1019 2695 6779 6230
1462 6230 -1301 -11107 -15514 -9256 3641 15055 16811 7521 -4950 -11951 -9970 -2188 3347 3264 -737
1477 -737 -3439 40 7689 11789 7162 -4587 -15344 -16590 -6755 7143 16150 13707 3691 -5923
1491e923l176M101O072J180m220m269J960P737R137J338r033j3180q797K525J1685
1506b863J2058M614m861q781n306J126M626J529m074n090j536O077J0460P172
1520A5151k571j1270j2121m845N166J0442P734J228m776m727j85K659J299l022
1534A62o335m643K676Q828J0176L698n154j0647q583k078N457O809L904r12j667
1549A691l50K770J397k293o780o437j077N214R520P304P18o143p639m504L76K430
1565c803J991N09L26K325L899K934j309o432p322l875J786O610O934L529j718
1580F384l161k966j544j027j510j791n07L628O255N260O64m429p746n511n59L874
1596d686M589K880P10r39Q49J078p20m141n668l923J642P060P981M021k304o760
$$ plain form
1491 -5923 -9099 -4998 1074 2254 -1966 -6235 -4275 3462 12599 13937 4904 -8276 -17073 -14548 -2863
1506 -2863 9195 13809 8948 167 -5139 -4013 613 2142 -1932 -7022 -8558 -2481 7979 15151
1520 15151 12580 1310 -10811 -15656 -10490 -48 7686 8914 4138 -589 -774 1885 3184 162
1534 162 -6173 -10816 -8140 688 10864 14562 9408 -1239 -9822 -11900 -6443 366 4270 3358 1691
1549 1691 1341 4111 5508 3215 -3565 -10002 -11079 -5865 3655 10959 11677 5534 -2105 -6609 -6233 -3803
1565 -3803 -1812 -1303 -977 1348 5247 8181 6872 440 -6882 -10757 -8971 -2361 4573 8102 6384
1580 6384 3223 257 -1287 -2314 -3824 -5615 -6122 -2494 3761 9021 9685 5256 -2490 -8001 -8560 -4686
1596 -4686 -97 2783 3493 2554 3403 4481 3761 -380 -6048 -9971 -8329 -1269 6712 10733 8429 1669
1612A669o116j988K005K908J040r89l43K785M992K941k432p328q559l159M603
1627g971R452P531P82m661o498k843J450K708J17l150k836J551O279P229K879
1642A2019n662j0131p995n99P137R476M621k469n418l092O88L163J276m027n947
1657f960k680M776R543P565P3q318j0531n674K836Q209O327R54l675m075M69L692
1673B531K937k119p325o065j53P403J0484N292k533r283q947k527M768O277L478
1688D218j915l449p70L629M502N17n502q065n175L138R066Q969K565n251p654
1703a177n256K33L914L329k93k569r85L076N338L116k829p508p370j886N045Q326
1719B504N561J36m536n280j318O09J616k94k186j036K109N449M760J43n161p103
$$ plain form
1612 1669 -4447 -6435 -4430 -1522 -482 -1471 -1814 971 5963 8904 6472 -856 -9415 -12574 -7971
1627 -7971 1481 9012 9794 5133 -1365 -4208 -2758 -50 67 -3083 -5919 -4368 1911 9140 12019
1642 12019 6357 -3774 -11769 -12368 -5231 4245 8866 6397 979 -2113 -1425 1738 3014 -1013 -6960
1657 -6960 -9640 -4864 4679 12244 12317 3999 -6532 -12206 -9370 -1161 5166 6120 2445 -1630 -1161 2531
1673 2531 5468 3349 -3976 -10041 -10194 -2791 7693 12985 10452 1169 -7778 -10305 -5537 740 4218
1688 4218 2303 -1146 -1916 1713 6215 6732 1230 -6835 -12010 -8872 194 9163 11728 6477 -1177
1703 -1177 -6433 -6200 -2286 1043 750 -1819 -2804 272 5610 8726 5897 -1611 -8981 -10867 -5822 2504
1719 2504 8065 8201 3665 -1615 -2933 -2324 -708 -1002 -3188 -4224 -2115 3334 8094 8237 3076 -4027
1735d027m588M58N076N442K793m24k291j380l18l10j677l174j967J869M809N684
$$ plain form
1735 -4027 -8615 -8157 -3081 2361 5154 4730 2439 1059 741 431 -1246 -4420 -6387 -4518 291 5975
$$ [...]
8191A22
##END NTUPLES=NMR FID
##END=
