##TITLE=1H_DE-84_ext3
 200.13MHz,D2O,
 8 sc
 
 14.3.2025
##JCAMPDX= 6.0         $$ Bruker NMR JCAMP-DX V2.0
##DATA TYPE= NMR FID
##DATA CLASS= NTUPLES
##ORIGIN= UXNMR, Bruker Analytische Messtechnik GmbH
##OWNER= pz
$$ XWIN-NMR		Version 3.5
$$ Fri Mar 14 14:08:48 2025 Russian Standard Time (UT+4h)  she@DPX200
##.OBSERVE FREQUENCY= 200.1313
##.OBSERVE NUCLEUS= ^1H
##.DELAY= (6, 6)
##.ACQUISITION MODE= SIMULTANEOUS
##.ACQUISITION SCHEME= undefined
##.AVERAGES= 8
##.DIGITISER RES= 18
##SPECTROMETER/DATA SYSTEM= spect
##.PULSE SEQUENCE= zg30
##.SOLVENT NAME= D2O
##.SHIFT REFERENCE= (INTERNAL, D2O, 0, 14.3821)
##AUDIT TRAIL= $$ (NUMBER, WHEN, WHO, WHERE, WHAT)
$$ ##TITLE= Audit trail, XWIN-NMR		Version 3.5
$$ ##JCAMPDX= 5.01
$$ ##ORIGIN= Bruker BioSpin GmbH
$$ ##OWNER= she
$$ F:/spectra/data/she/nmr/H-C/1/audita.txt
$$ ##AUDIT TRAIL=  $$ (NUMBER, WHEN, WHO, WHERE, WHAT)
(   1,<2025-03-14 14:07:38.56 +0400>,<she>,<DPX200>,
      <created by zg, POWCHK disabled, PULCHK disabled
       configuration hash MD5:
       00 E9 B6 7A A2 85 ED C7 34 08 36 98 17 FE 4E 26
       data hash MD5: 16K
       2B 59 48 2E 53 CD 8E A8 59 34 D2 63 3C 3B 31 9B>)
$$ ##END=
$$ 
$$ hash MD5
$$ 22 0A C1 EB EA 8A A3 9A 04 DC CA 2A 2A 62 B8 15
##$RELAX= 
##$RELAX= 
##$RELAX= 
##$RELAX= 
##$RELAX= 
##$RELAX= 
$$ Bruker specific parameters
$$ --------------------------
##$DU= <F:/spectra>
##$EXPNO= 1
##$NAME= <H-C>
##$PROCNO= 1
##$TYPE= <nmr>
##$USER= <she>
##$AMP= (0..31)
100 100 100 100 100 100 100 100 100 100 100 100 100 100 100 100 100 100 
100 100 100 100 100 100 100 100 100 100 100 100 100 100 
##$AQSEQ= 0
##$AQ_mod= 1
##$AUNM= <au_zg>
##$AUTOPOS= <>
##$BF1= 200.13
##$BF2= 200.13
##$BF3= 200.13
##$BF4= 200.13
##$BF5= 200.13
##$BF6= 200.13
##$BF7= 200.13
##$BF8= 200.13
##$BYTORDA= 1
##$CFDGTYP= 0
##$CFRGTYP= 5
##$CHEMSTR= <none>
##$CNST= (0..31)
1 1 145 1 1 1 1 1 1 1 1 1 1 1 1 1 1 1 1 1 1 1 1 1 1 1 1 1 1 1 1 1 
##$CPDPRG= <>
##$CPDPRG1= <>
##$CPDPRG2= <>
##$CPDPRG3= <>
##$CPDPRG4= <mlev>
##$CPDPRG5= <mlev>
##$CPDPRG6= <mlev>
##$CPDPRG7= <mlev>
##$CPDPRG8= <mlev>
##$CPDPRGB= <>
##$CPDPRGT= <>
##$D= (0..31)
0 0.7 0 0 0 0 0 0 0 0 0 0.03 0 0 0 0 0 0 0 0 0 0 0 0 0 0 0 0 0 0 0 0 
##$DATE= 1741946857
##$DBL= (0..7)
120 120 120 120 120 120 120 120 
##$DBP= (0..7)
150 150 150 150 150 150 150 150 
##$DBP07= 0
##$DBPNAM0= <>
##$DBPNAM1= <>
##$DBPNAM2= <>
##$DBPNAM3= <>
##$DBPNAM4= <>
##$DBPNAM5= <>
##$DBPNAM6= <>
##$DBPNAM7= <>
##$DBPOAL= (0..7)
0.5 0.5 0.5 0.5 0.5 0.5 0.5 0.5 
##$DBPOFFS= (0..7)
0 0 0 0 0 0 0 0 
##$DE= 6
##$DECBNUC= <off>
##$DECIM= 32
##$DECNUC= <off>
##$DECSTAT= 4
##$DIGMOD= 1
##$DIGTYP= 9
##$DL= (0..7)
0 120 120 120 120 120 120 120 
##$DP= (0..7)
150 150 150 150 150 150 150 150 
##$DP07= 0
##$DPNAME0= <>
##$DPNAME1= <>
##$DPNAME2= <>
##$DPNAME3= <>
##$DPNAME4= <>
##$DPNAME5= <>
##$DPNAME6= <>
##$DPNAME7= <>
##$DPOAL= (0..7)
0.5 0.5 0.5 0.5 0.5 0.5 0.5 0.5 
##$DPOFFS= (0..7)
0 0 0 0 0 0 0 0 
##$DQDMODE= 0
##$DR= 18
##$DS= 0
##$DSLIST= <SSSSSSSSSSSSSSS>
##$DSPFIRM= 0
$$ [...]
##$SUBNAM0= <"">
##$SUBNAM1= <"">
##$SUBNAM2= <"">
##$SUBNAM3= <"">
##$SUBNAM4= <"">
##$SUBNAM5= <"">
##$SUBNAM6= <"">
##$SUBNAM7= <"">
##$SUBNAM8= <"">
##$SUBNAM9= <"">
##$SW= 18.0517328524113
##$SWIBOX= (0..15)
0 0 2 0 0 0 0 0 0 0 0 0 0 0 0 0 
##$SW_h= 3612.71676300578
##$TD= 16384
##$TD0= 1
##$TE= 0
##$TE2= 300
##$TE3= 300
##$TEG= 300
##$TL= (0..7)
0 120 120 120 120 120 120 120 
##$TP= (0..7)
150 150 150 150 150 150 150 150 
##$TP07= 0
##$TPNAME0= <>
##$TPNAME1= <>
##$TPNAME2= <>
##$TPNAME3= <>
##$TPNAME4= <>
##$TPNAME5= <>
##$TPNAME6= <>
##$TPNAME7= <>
##$TPOAL= (0..7)
0.5 0.5 0.5 0.5 0.5 0.5 0.5 0.5 
##$TPOFFS= (0..7)
0 0 0 0 0 0 0 0 
##$TUNHIN= 0
##$TUNHOUT= 0
##$TUNXOUT= 0
##$USERA1= <user>
##$USERA2= <user>
##$USERA3= <user>
##$USERA4= <user>
##$USERA5= <user>
##$V9= 5
##$VALIST= <valist>
##$VCLIST= <CCCCCCCCCCCCCCC>
##$VD= 0
##$VDLIST= <DDDDDDDDDDDDDDD>
##$VPLIST= <PPPPPPPPPPPPPPP>
##$VTLIST= <TTTTTTTTTTTTTTT>
##$WBST= 1024
##$WBSW= 4
##$XGAIN= (0..3)
0 0 0 0 
##$XL= 0
##$YL= 0
##$YMAX_a= 341679
##$YMIN_a= -384863
##$ZGOPTNS= <>
##$ZL1= 120
##$ZL2= 120
##$ZL3= 120
##$ZL4= 120
##$ABSF1= 10
##$ABSF2= 0
##$ABSG= 5
##$ABSL= 3
##$ALPHA= 0
##$AQORDER= 0
##$ASSFAC= 0
##$ASSFACI= 0
##$ASSFACX= 0
##$ASSWID= 0
##$AUNMP= <proc_1d>
##$AZFE= 0.1
##$AZFW= 0.1
##$BCFW= 1
##$BC_mod= 2
##$BYTORDP= 1
##$COROFFS= 0
##$CY= -3
##$DATMOD= 1
##$DC= 2
##$DFILT= <>
##$DTYPP= 0
##$F1P= 0
##$F2P= 0
##$FCOR= 0.5
##$FTSIZE= 0
##$FT_mod= 4
##$GAMMA= 1
##$GB= 0.15
##$INTBC= 1
##$INTSCL= 1
##$ISEN= 128
##$LB= 0.25
##$LEV0= 0
##$LPBIN= 0
##$MAXI= 10000
##$MC2= 0
##$MEAN= 0
##$ME_mod= 0
##$MI= 1.114404
##$NCOEF= 0
##$NC_proc= 0
##$NLEV= 6
##$NOISF1= 3.799351
##$NOISF2= 2.8
##$NSP= 1
##$NTH_PI= 0
##$NZP= 0
##$OFFSET= 14.38212
##$PC= 1
##$PHC0= -472.7805
##$PHC1= 9.59221
##$PH_mod= 1
##$PKNL= yes
##$PPARMOD= 0
##$PSCAL= 0
##$PSIGN= 0
##$REVERSE= no
##$SF= 200.129724274929
##$SI= 16384
##$SIGF1= 3
##$SIGF2= 2
##$SINO= 400
##$SIOLD= 16384
##$SREGLST= <1H.CDCl3>
##$SSB= 0
##$STSI= 0
##$STSR= 0
##$SW_p= 3205.1282051282
##$SYMM= 0
##$S_DEV= 0
##$TDeff= 0
##$TDoff= 0
##$TI= <>
##$TILT= no
##$TM1= 0
##$TM2= 0
##$TOPLEV= 0
##$USERP1= <user>
##$USERP2= <user>
##$USERP3= <user>
##$USERP4= <user>
##$USERP5= <user>
##$WDW= 1
##$XDIM= 8192
##$YMAX_p= 0
##$YMIN_p= 0
$$ End of Bruker specific parameters
$$ ---------------------------------
##NTUPLES= NMR FID
##VAR_NAME=  TIME,          FID/REAL,        FID/IMAG
##SYMBOL=    X,             R,               I
##VAR_TYPE=  INDEPENDENT,   DEPENDENT,       DEPENDENT
##VAR_FORM=  AFFN,          ASDF,            ASDF
##VAR_DIM=   8192,          8192,            8192
##UNITS=     SECONDS,       ARBITRARY UNITS, ARBITRARY UNITS
##FACTOR=    0.0002768,     1,               1
##FIRST=     0,             0,               0
##LAST=      2.2672688,     0,               0
##MIN=       0,             -384863,         0
##MAX=       2.2672688,     341679,          0
$$ Real data points
##PAGE= N=1
##DATA TABLE= (X++(R..R)), XYDATA
0@%%%%%%%%%%%%%%Qj6J6j6J6k1K9l2M0m8N3o1P2q5R7j09J23j42J61j79K02k26
36a18K52k84L16l52L90m31M80n32N87o48P13p85Q64r49J047j156J275j408J557
55H18j727J922k150K418k735L124l612M237n072O249q024J0968j6667L1375j35209
70a14085k70778L96927O9409k70676K12336K24831k74544m9146J91669j69054
80e3111j03551K64899l7226k20373J65943Q7539k01091J52279K11412l10932j63021
91b07233K76440r1245k70712K77282K54202k23159j7401J63625k24180j32827
101a95208K70009j0112k15676J85347J37098k45325J2082K21921j45010j22354
111a07228J87626q8373k44273J90282J95006j54642M6058J85904j88583j54008
$$ y = [0, 0, 0, 0, 0, 0, 0, 0, 0, 0, 0, 0, 0, 0, 0, 8, -8, 8, -8, 8, -13, 16, -16, 24, -24, 29, -32, 40, -45, 52, -57, 66, -76, 85, -94, 108, -118, 134, -150, 166, -186, 204, -227, 253, -279, 308, -340, 373, -412, 452, -497, 550, -606, 669, -739, 818, -909, 1013, -1137, 1281, -1454, 1670, -1942, 2295, -2777, 3472, -4552, 6416, -10251, 21124, -114085, -384863, 12064, 81473, -189203, 23133, 247964, -26580, -75726, 115943, -53111, -156662, 108237, 71011, -149362, 16581, 104120, -96971, 55308, 266720, -44212, -207233, 69207, -22038, -292750, -15468, 238734, 15575, -1826, 161799, -62381, -195208, 74801, 64689, -150987, 34360, 171458, -73867, -61785, 160136, 15126, -107228, 80398, -7975, -252248, -61966, 133040, -21602, 24456, 210360, 21777, -132231]
121a32231J66075n8428j66745K37068J53671k50495r307K15262j46368j52677
131a44175J93400m346k12979J12163J39362j50343M0240K18763j01922j49499
141e9336R8734o0236j64557J57450J39643j43983L7933J71988j59862j59880J54187
152A2081P928j62156J07335J22502j40807J4763J84915p5448j15429J11824l2771
163C4737j82155P1318J16016q7392M8540J64243j03933j39405Q9374k0423j44076
174a53156R5218J29447q9812Q998J36990p1972j00395R7702j1347j50211M3308
185f5230Q8610p9869K4131J49484m2800r8844N7654k9311j38024M8961J09869
196B4631m2216K0809J18297m4639r5131M9281j1203j11598L1193P5128n7034P418
$$ y = [-132231, 33844, -24584, -191329, 45739, 199410, -51085, -60392, 154870, 8502, -144175, 49225, 44879, -168100, -55937, 83425, -66918, -26678, 192085, 90163, -59336, 39398, -20838, -185395, -27945, 111698, -32285, 5648, 177636, 17774, -142106, 12081, 20009, -142147, -34812, 87690, -53117, -38354, 146561, 71113, -44316, 67508, 34737, -147418, -76100, 39916, -47476, 1064, 165307, 61374, -78031, 11343, -9080, -153156, -57938, 71509, -18303, -9305, 127685, 55713, -44682, 53020, 41673, -108538, -65230, 23380, -56489, -32358, 117126, 74326, -24518, 33136, 3825, -134199, -85238, 24631, -17585, 3224, 121521, 76882, -18249, 31032, 19829, -91769, -60576, 14552, -42482, -35064]
208c5064J14902j7614p2246M7426j2356j17904R670P8625k5835J8215J10099p161
220I0757p6309J8290j5787r7165O899O4339k4555Q707Q6871n010n5045K8779p787
233B2984q7126l23N1831k2458J4165R2258P194n1792J5973j3552r0716j5040N0620
246b5982r291L314P3928K0366m0210J456m616n6559j7211K5834q99J8006N7612
259D5748J0815k0455J0527k0860o8856j5228K6723j3466O155O6876K8067k8985
271B7061p0K435m8863l2988J8121J1549O902L6756K8823m819p241j7308l9071
284a8713k3784l60l227J5032M2272K2898k733O304p548m0310k4396P048j529L029
298b6017L6618L1110m337o518l216k8490l6126q566Q529Q335J9771K8562J8323
$$ y = [-35064, 79838, 62224, -10022, 37404, 25048, -92856, -83186, -4561, -30396, -12181, 97918, 90757, 14448, 32738, 16951, -80214, -73315, -8976, -33531, -24824, 62047, 57037, 1992, 30771, 22984, -64142, -64465, -12634, -35092, -20927, 71331, 78525, 26733, 42706, 29154, -61562, -76602, -25982, -35273, -31959, 41969, 62335, 22125, 23581, 18965, -37594, -54805, -28971, -29870, -11864, 45748, 56563, 36108, 46635, 25775, -43081, -58309, -31586, -45052, -38897, 27979, 56046, 27061, 26991, 29426, -19437, -52425, -34304, -22755, -15853, 20903, 49726, 44907, 37666, 20358, -18713, -42497, -42857, -46084, -31052, 11220, 34118, 31385, 37689, 30141, -10169, -34565, -27517, -29046, -26017, 10601, 41711, 37374, 30856, 27640, -850, -36976, -45542, -37013, -28678, -8907, 19655, 37978]
311C7978M57j4363k0010j6683j4256q503J1281K7135J9042O837M592l922k4423
324E162k8757j3341J395N401J2376K5823K4999L557j1588r695j4249k3828j1268
337c4013J1579J5228J2540J7773R699p660j3018j8439k3292o646R373O036J3838
350g002L1627J3306j3265n212n190k7876j9487J0968R284M690K2385J6161q548
363B1841o192q155k7853j3797J1489L47K785L4295K2153j4941p16O082l1411k8273
377c2346J2119M181o904K7411K5827j1624l277M724k9999k4141J5756l7j0087
390b8397L3034K9046j6331J776J8271l1450l4522J4149j721k1373L0133L6335
402B8950j4248k91J9479l2265l5958J7646J290k0845L3785L7086k0678o20K8377
$$ y = [37978, 38435, 24072, 4062, -12621, -26877, -35380, -24099, 3036, 22078, 28915, 33507, 29585, 5162, -23595, -36936, -35541, -30140, -17764, 8059, 33058, 36615, 25027, 15332, 1083, -22745, -34013, -22434, -7206, 5334, 23107, 32806, 25146, 12128, -6311, -29603, -36249, -26876, -20840, -7002, 24625, 37931, 24666, 19454, 14264, -13612, -33099, -22131, -12847, -8157, 14228, 30389, 21841, 15649, 7494, -20359, -34156, -22667, -22320, -19535, 14760, 36913, 21972, 21256, 27338, -4073, -32346, -20227, -16046, -22950, 4461, 30288, 18664, 15387, 20111, -9888, -34029, -18273, -18310, -28397, 4637, 33683, 17352, 19128, 37399, 5949, -28573, -14424, -16145, -37518, -7385, 28950, 14702, 14411, 33890, 1625, -34333, -16687, -15397, -36242, -2457, 34629, 13951, 13331, 41708]
415D1708k9202l9190J9538k552l4855K6184M1221j7064L415L6126k8124m6458
427b9253J5957nl3026L2644M7962j9348k907L4484l0265m6376K3916M003m1642
440d3856K2689M2654k4955P59M9877k0605m8380K1078j733n1769K3516N7565j6401
453A0439o39M6846k8230n8971K0222O596m4870K5537N0387k9344n941N1380k1634
466B1778m6153L6058L526o6786J5695N7359k6850k674O8166j4050o5136J4119
478d948L509n6552J9973O1272j9001o029M9248k5791n1389L7201R339o0862J9323
491b4707N2052m1834j1401P4644m638n7526K6239M785p4085M599O1162j5321M99
504e532O3879j9496o3313K5630R584n9304K1482O0884l6700k0861O0545q677m9498
$$ y = [41708, 12506, -26684, -7146, -9698, -44553, -18369, 22852, 5788, 9203, 45329, 17205, -29253, -13296, -13301, -46327, -13683, 34279, 14931, 12024, 46508, 16243, -30133, -6217, -2214, -43856, -21167, 21487, -3468, -2709, 47168, 26563, -21817, -739, -2472, -54241, -30725, 26840, 10439, 9800, 56646, 28416, -30555, -10333, -3737, -48607, -23070, 27317, -2027, -7968, 43412, 21778, -24375, 11683, 15209, -51577, -35882, 21477, -5373, -8047, 60119, 46069, -19067, -4948, -1439, -57991, -38018, 23254, 4253, -1776, 47472, 21681, -29708, 7493, 16832, -44030, -24707, 27345, -14489, -25890, 48754, 44116, -13410, 12829, 17614, -56471, -51872, 9290, -6031, -5532, 58347, 38851, -24462, 1168, 10752, -48552, -27070, 33814, -2886, -23747, 36798, 28121, -21377]
517b1377L8808J3855p1440q30M6141l0988K58P8906o759n7356K9705J543q0617
530f0151J2625P5125k3784k3114N9933n272o0477K5232K2665n1232M452L9913
542A5915l8594j3258O6454J376l6863M0105J130q4406J558N9865l1694j3056Q0272
555D8804M540o9195J2994J9102n2228N698N1899k9052k1046N4056l613m1225M0889
568B1623K0297o3400m018L5796m3852j2734Q1230J1660n2265K2789J2857o6843
580c6860o033N0182j9159q306N7930r203n3703L2313K7070n0739k480L7978l7272
593a8282k4148N5533R030l2904L6899K0359o4436j9181L3366k0025n299N9405
605C0317L545m2251K3762J3290n5464j324M6907k2738k5601L9672K313l1643L4612
$$ y = [-21377, 17431, 31286, -40154, -40984, 5157, -25831, -25573, 53333, 46574, -10782, 18923, 20466, -60151, -47526, 27599, 3815, -19299, 40634, 35362, -25115, 117, 22782, -28450, -23998, 15915, -22679, -35937, 30517, 31893, -4970, 35135, 36265, -48141, -46583, 13282, -18412, -31468, 48804, 53344, -15851, -2857, 16245, -35983, -30285, 21614, -7438, -28484, 25572, 21959, -19266, 21623, 41920, -21480, -25498, 10298, -33554, -46288, 34942, 46602, -5663, 17126, 29983, -36860, -42893, 7289, -11870, -20176, 37754, 28551, -25152, 7161, 34231, -16508, -18988, 18990, -18282, -42430, 13103, 22133, -10771, 26128, 46487, -17949, -37130, -3764, -23789, -29088, 30317, 33862, -8389, 15373, 28663, -26801, -28125, 18782, -3956, -29557, 10115, 12428, -19215, 15397]
618A5397K6632m8492j2581K7595l0007k1341N0459J7102k4123K5499R455n5699
630b0104r059L6996j9252j7580M3409O119l4056K0258K0414l5492k267K9323k9762
643a1053k7928L7044J3832j9433K7013K0012m0457j4553J9313k4191j5649M2891
655F841J3636k5005J5172J4738l3136n278K4671j8784j9782K9285N487k2186K2172
668G831K4553k5955j0387J3770k4168k0798K9343J3984j3655J9217J6881k8344
680B272j2834J4820j4522j3498K4708O414j7173J5935J7358j9938o007J4792j8179
693e852k0816J8170Q335j0504J8938K0074j8250j2226Q403j5028j5940J7327J0501
706C132p798J1864J3756j5070p432R828j2562j4830J1519N462q815J3704J7602
$$ y = [15397, 42029, -6463, -19044, 8551, -21456, -42797, 7662, 24764, 641, 26140, 35595, -20104, -29163, 7833, -11419, -28999, 14410, 20529, -13527, 6731, 27145, -8347, -10614, 18709, -11053, -38981, -1937, 11895, -7538, 19475, 39487, -970, -15523, 3790, -20401, -36050, 6841, 20477, -4528, 10644, 25382, -7754, -13032, 11639, -7145, -26927, 2358, 7845, -14341, 7831, 32384, 6429, -3958, 9812, -14356, -35154, -5811, 8173, -5482, 13735, 30616, 2272, -10562, 4258, -10264, -23762, 946, 7360, -9813, 6122, 23480, 3542, -2465, 12327, -5852, -26668, -8498, -163, -10667, 8271, 28345, 10095, -2131, 6272, -8756, -24696, -7369, 3132, -4666, 7198, 20954, 5884, -1548, 8280, -4282, -19112, -7593, -2131, -10946, 2758, 20360]
719B0360r954o776O927j3687j8191J0057R106n310J0998J5713q002r098M021r090
733b926j2987N975N706m136R514J3461m948l798M339j0257j4315M105L839l736
747a0164R931J5232l005n863K506q388j3512J574M971j429O733J2311j09l903
761F885J664o270j1519j580K939j053O504J0470K292j700M40o373j1003j867J569
776h602j013O331J1179K262k224J301m280j0933m590K106j54L722R179N146O2
791I492r21m176p955m806j503j76M933Q908M184Q30J091l460r138n516n37l60
807i110K764P386O452J843j83l309o219n896l365j36L617O313N603K865J256k644
823G237o422o176l106j146K212N526O282M128O20k419m535n496n602r11K991M362
$$ y = [20360, 10406, 3630, 10557, -3130, -21321, -11264, -2158, -7468, 3530, 19243, 11241, 2143, 6164, -2926, -15913, -9938, -4232, -8368, 1146, 14607, 9659, 5861, 10200, -57, -14372, -10267, -6428, -10164, -233, 14999, 11994, 6131, 8637, 249, -13263, -11689, -6718, -8147, -1414, 10897, 10788, 6885, 8549, 2279, -9240, -10820, -7881, -8934, -2430, 8040, 10332, 8632, 9072, 2699, -8304, -10171, -8602, -9615, -3284, 7895, 10157, 7933, 9234, 4954, -5979, -10569, -8463, -8617, -4895, 4284, 9430, 9492, 8571, 4395, -3560, -8366, -9869, -10045, -5112, 3796, 7980, 8810, 9901, 6441, -2697, -8213, -8750, -9110, -6346, 1040, 7492, 9335, 9152, 5843, -376, -6272, -9637, -9773, -6156, 157, 5760, 8625, 9881, 7237, 815, -5361, -8467, -9613, -7401, -1875, 4407, 8535, 9155, 6736, 2201, -3295, -8897, -9808, -6817, -2455]
839b455N008N273J780k284m008n446n312j788J744L446N269O045J737k258k134
854D617m812o756k403K175K555L964P371K753k586k192l502p286l083K280J579
869e326L031Q286K806k195q84k876p957l681K372M74K161Q227M657k614m46j597
885D438q752m846L145j07J174Q745M752l155M42l70q724m944L332j047q78R287
901B492N501l404J788J198r618o145L408j713j507J0009O499l890J402K381j0244
916a843o353M721j762l199R463N909m583K563M837r259p060L882l178n137R807
931a192P960l934L624N054j0803q609M880k303n135J0245P693n750K256O005r165
946H26o940O324l585p911P929Q137m997M352R089q871r783M800m586q370J0388
$$ y = [-2455, 2553, 7826, 9606, 7322, 3314, -2132, -7444, -9232, -7488, -4042, 1227, 7272, 9009, 6751, 4617, -195, -6951, -9354, -7179, -4624, -660, 6711, 9464, 6878, 4686, 1184, -6102, -9185, -6905, -5326, -2295, 5991, 8797, 6602, 5718, 2842, -5115, -8796, -6424, -5950, -3789, 4438, 9095, 6481, 6035, 4438, -4314, -9160, -6015, -6122, -4948, 3797, 8549, 5394, 5836, 5466, -3258, -8202, -4870, -5917, -6795, 2492, 7993, 4589, 6377, 7575, -2043, -8188, -4780, -6493, -8000, 2009, 8508, 4618, 6020, 8401, -1843, -8196, -3475, -5237, -8436, 1027, 6936, 2353, 4916, 9753, 494, -6566, -2684, -5862, -10999, -1192, 6768, 2834, 6458, 11512, 709, -7900, -3020, -5323, -10458, -213, 7480, 1730, 3986, 9991, 826, -6114, 210, -3375, -11286, -3357, 4780, -217, 4135, 13224, 4353, -5430, -630, -5216, -13586, -3198]
961c198R991n386K881Q016j0572q904P377k347q779Q786P443p951L234J1498p501
976D588q018P088n306j2570P711R710m854N166J1599r657j1081N800l254r799
990a2877R753R812q135J198J1091p950p723R425j903j3479M967P705p683M432
1004a367J4854n755r230O117n692j4079P439J1662o093L484J1803q768j0333Q843
1018B885j421j1675P040P613j0335R66J4182l737o506Q995l683j6542L531Q622
1032f5o335M788J5685n573j0684N971l265j3130P472J0344q698K83J2097n669
1046C221p683J0716N66j3999K197N756r679J525J6865j205p342P097l823j6120
1060a1908L351R611o068K465J3488n317r830Q056K50j1373M416O998j0505j374
$$ y = [-3198, 6793, 1407, 4288, 12304, 1732, -7172, 205, -2142, -10921, -2135, 5308, -2643, 591, 12089, 4588, -3430, 3658, -1648, -14218, -6507, 3203, -1651, 3515, 15114, 5457, -5624, 176, -3078, -12877, -3124, 6688, -1447, -249, 10842, 2892, -4831, 4594, 2691, -10788, -5821, 1884, -5799, -1367, 13487, 7732, -1498, 4619, -1073, -15152, -7713, 3949, -2144, 1340, 13143, 4375, -5958, 2885, 1464, -10211, -3171, 4442, -5893, -4927, 9255, 5518, -988, 8007, 4324, -12218, -8687, -65, -6400, -1612, 14073, 8500, -2184, 3787, 522, -12608, -5136, 5208, -3490, -3207, 8890, 3221, -4462, 6254, 6820, -7179, -4982, 774, -8905, -7380, 9485, 8280, 938, 8035, 4212, -11908, -8557, 1054, -5014, -2549, 10939, 5622, -4208, 3848, 4098, -7275, -2859, 4139, -6366, -7740]
1074g740J2781j524m380J0222n83j5243k32N472p806K333J5781j227p588N684
1088E950j666j3061L546Q558p300j220J0667k893o322R158K702j1139Q94L788
1102A662j0316j109J2949J430l446P412l50j4000m72O034n907O51J1748j332p492
1117b538O399J695r136J951N141q176l130Q843m56k844R258K735j0425j707K750
1132C60p971j167J1898J108m086N689L23r669k88N520n207j923P275r26m478P147
1148C605L494o722K07K282p780l464P454J283j353P456J761q682j707K616n558
1163e108j518P714O64l511M553K553n214l37L454n313l926M267L37j286N921L620
1179F870m630j353P62o248k434N950J218j890N028K972n340j225K659l848l154
$$ y = [-7740, 5041, 3517, -863, 9359, 8776, -6467, -6699, -1227, -9033, -6700, 9081, 7854, 266, 5950, 4284, -8777, -5231, 3327, -3973, -5193, 5474, 2581, -3741, 5417, 8119, -3020, -2126, 1662, -8654, -9763, 3186, 4616, 1170, 8582, 8232, -5768, -6240, -206, -6113, -5462, 6286, 4954, -2538, 3861, 5556, -3580, -1629, 3512, -4664, -7794, 1049, 593, -2251, 7007, 9742, -683, -2390, 360, -7611, -8778, 3120, 4228, 142, 5831, 6154, -3515, -3803, 1717, -3490, -5413, 1862, 936, -3542, 3605, 7099, 377, 584, 2866, -4914, -8378, -924, 359, -994, 6462, 8223, -459, -2166, 450, -5108, -6626, 1088, 1752, -1759, 2794, 5347, 133, -204, 3250, -2063, -5989, -1722, -1385, -2671, 3250, 6870, 2240, 887, 1649, -4599, -7033, -1083, 135, -1755, 3273, 6245, 905, -320, 2339, -1509, -4663]
1194d663L649N87k737L930L913k138n28P68m387l534K176M4K62N035L333l428
1210B282o87Q28m548l059L700N28j876L280L091j592o87J563k528l812L55K99
1226b863K17K832L383m37j71L5l624k657M68N1PL092K496r19K72J204l196l012
1244b822Q05Qj416K307L196P17l83R27j813l368j028J65k55J552K872J112Q18
1261C394n33k211j514q07j160o83K471K450J56J057J165j528l525r81l8j120N45
1278b862L007K018P50jq63j966j572j438m03J421K016J175J355J068j174k577
1294d6j221j224q65M01K237J822J166Q03j19j835k015j310r42P09J607J845J071
1311B084R97k94j917j651j483q38j7J468J915J532J283l02r79j647j918j048L16
$$ y = [-4663, -1014, -427, -3164, 766, 4679, 2541, 2013, 2781, -1606, -5140, -2964, -2920, -2658, 2377, 5710, 2282, 1595, 2423, -2125, -5184, -1484, -956, -2832, 448, 3539, 1947, 1260, 2823, 295, -3517, -3162, -2863, -2646, 186, 3569, 3132, 2961, 2996, -628, -3285, -2817, -2766, -2759, 333, 2829, 1910, 2182, 3386, 190, -2822, -2017, -2009, -3425, -1118, 2078, 2795, 2412, 3339, 1526, -1842, -2870, -2705, -2960, -1408, 1464, 2576, 3394, 2861, 650, -864, -1671, -2831, -3514, -1043, 1407, 1563, 2620, 3785, 2257, -1268, -2249, -2287, -3407, -2862, 145, 2163, 2913, 2912, 2049, 83, -1489, -2927, -3330, -1909, 107, 1282, 2637, 3705, 2531, -46, -1267, -2491, -3356, -2955, -718, 1104, 2270, 3073, 2954, 1119, -896, -2206, -3148, -2439, -832, 1013, 2084, 3081, 2787, 870, -781, -2264, -3102, -3119, -1651, 264, 1796, 3079, 2777, 1798, 151, -1767, -2815, -2499]
1328b499P96J406K092Q76J42j108j692j591j548j42J105K057J311J222M10o23
1344B214j548j760j032p52P72J125K336J283J05n21j018j888j816o22R22P25K133
1361F58J607M24m42o77j959j585o54J42R26K093J240L47K16m53j933k297J09J93
1379b045j80K114K022N33j2M6j771j980q37Q4k91J704K075M88N72j35k003k024
1397a640j98p97K2K160J586L80O86J037j869k322j53l53j686J580K521L18M64
1414A736J208j222k759o45n52q67J905K060K36R48J071j624k061Q43j547k108
1430c378J929K046p23Q30K847j367k390l96q30k705J572L092p9O11K452j260k628
1447c77K14p47k181J449J803o48N03K973j006j891J231j434l410R67K547j283
$$ y = [-2499, -1703, -297, 1795, 2671, 2813, 1705, 13, -1578, -3126, -3268, -2163, -106, 1205, 2427, 2837, 2214, 666, -1094, -2126, -2878, -2106, -981, 1355, 2638, 2743, 2222, 1204, -684, -2500, -3122, -2200, -1475, 658, 2265, 2689, 2247, 1570, -389, -1974, -2628, -2486, -1560, 533, 1773, 2120, 2336, 1883, -50, -2347, -2238, -2045, -2225, -111, 1911, 2444, 2432, 2478, 707, -1273, -2110, -2026, -2317, -613, 1462, 1950, 2522, 2387, 384, -1640, -1838, -2635, -2613, -453, 1133, 1513, 2199, 3236, 1367, -955, -1108, -1461, -3147, -1567, 954, 1272, 1736, 2944, 1722, -1037, -1682, -2234, -3101, -1196, 864, 1100, 2048, 3119, 1495, -566, 277, -1270, -3378, -1449, 597, -126, 704, 3551, 2184, -206, -602, -1432, -4137, -2565, 527, 448, 1059, 3511, 2251, -377, -163, -910, -3091, -1642, 161, -487, 16, 2989, 1983, 92, 1323, -111, -3521, -2554, -7, -1290]
1463a290J497M132r23l526O17o05l636R84K945n86N80K311p01j845Q62n35l101
1480b820J050J655k379J390M796p18k299J426p76n244J59K985o64J111L897q78
1496B691k968J368m31l408J112K268k312K45M040p90j675K615l4n194o34J947
1512a160k037J190N021j61j678J415j581m788R66L066j666J88M345j421k398K911
1528B212K35m036l1J790l827j74N009J197j255K758p56n539m51J917j951J099
1544a803N322o79k805K275n84m516J099K410l215o39M254o30p95L850N55m545
1560d46q94Q95l821L01N641Q19j469K521r48n164j21K455k175L16M213r74k454
1577a305L313R68l548Q32P45m186q80M165N16m28L876J81n157j065J127l166M53
$$ y = [-1290, 207, 4339, 3416, -110, 507, -98, -3734, -2750, 195, -391, 189, 2500, 1799, -46, 816, 281, -2820, -1770, -115, -2494, -1104, 3692, 2974, 675, 2101, 1325, -3919, -3760, -775, -1439, -328, 3569, 2691, -277, 1091, 660, -2748, -1636, 632, -1680, -1435, 2605, 1815, 140, 2755, 2721, -2473, -3107, -1160, -3197, -2007, 3014, 2853, 1175, 2590, 1009, -3779, -2813, 253, -1413, -1225, 3120, 1699, -699, 2212, 2447, -1589, -1620, 170, -3657, -3831, 1178, 2375, 1120, 3878, 3122, -2417, -2868, -951, -2902, -1803, 3519, 2840, 35, 2310, 1726, -2790, -1691, 719, -2496, -3135, 1119, 489, -306, 3544, 4099, -446, -1340, -445, -4266, -3965, 1676, 2495, 1026, 3547, 2599, -2565, -2686, -231, -2406, -2090, 2123, 1149, -1305, 2008, 2976, -572, 260, 1005, -3181, -4061, 104, 620, 192, 4068, 4249, -908, -1973, -846, -4012, -3559]
1594c559N367M12j960K214k9l568N77J971l240j050K965p89o26M009J095l301
1610D88l16K15m192n73M201Q60k83L002L66m806N2J529k752j82L209l79j679K207
1628I67J313k008K80R19l423j660K579n4L56M077P60l358l80J91l665j93L443
1645A44L00j262K489N50k791P57J072k603q23J864p28p75L151J450j448L47k0
1662A674l825r28K158q1j74L331L29k454j18R67k106j046K425l12j447K029J309
1679A731j094Q86K78k210j614Q17r22P2L296P80j457R84J90l082r91K060n93n06
1697a375K290R80j421N71O42j605j437O77p21r02K138R84j9J316J6k425j041N38
1715g94n53m60K001J078l69N74Q6j821n26J45j032m75J716J232o58J352R80j896
$$ y = [-3559, 1808, 2220, 260, 2474, 2445, -1123, -546, 1425, -1815, -2865, 100, -689, -1315, 2694, 3789, 488, 172, 387, -3805, -4378, -177, 683, 400, 3402, 3768, -1038, -986, 543, -2209, -2391, 818, 439, -1240, 967, 2280, 272, 552, 1471, -1952, -3612, -1033, -1087, -731, 3346, 4106, 748, 368, 559, -3106, -3299, 144, 444, -818, 1671, 2221, -570, 187, 1259, -1344, -2167, -303, -1031, -1806, 1345, 2795, 1347, 1694, 1674, -2151, -3079, -921, -1002, -1176, 2155, 2484, 30, -88, 879, -1227, -2273, 152, -160, -1607, 422, 1731, 637, 1523, 1801, -409, -2023, -1206, -2128, -2056, 1240, 2020, 563, 1547, 1737, -1345, -2336, -276, -869, -1375, 915, 1895, 474, 1045, 1687, 82, -1355, -678, -1399, -2301, -163, 821, 802, 2118, 2134, -291, -1332, -794, -1347, -1807, 194, 1272, 903, 1477, 1563, -258, -784, -639, -1671, -2146, -430, 802, 144, 1496, 2476, 580]
1733E80j105Lp08j036J484J484J98J019l98r77o99n00j360k67J669P31l1J154
1751A241R59j241j044q9n34j094N98J491K51O77N65o09q22q61j076m25J088N94
1769c31L24J228N32m05j026m93p19q42M46R95P93O53K66K2q36q61j055l17N14
1788a112K96N78J452N14j21j080n14m86r29J1Q70N16N48Q26Jm02r41j006m73k6
1808a478K69Q43J238Q06j75l42n32r18q04j96M03K93P82J144J89n00p09q55p51
1827a293j79K65O43J220N03L22j40o93r46j065r8M28K84N95J253K40n20m73o37
1846b91n65q13M01N98O57O60M67O71q38j064p18k5n31N34O18Q95L66J73l32m63
1866D00j196n97N48J86N85R09O12p9o1r43r72n58k35N22P33L33O49J17q9l75p55
$$ y = [580, -525, -522, -1230, -2266, -782, 702, 900, 1919, 1521, 544, -155, -655, -2015, -2282, -613, 118, 87, 1241, 2200, 959, -85, -174, -708, -1802, -1204, 287, 538, 1215, 1780, 1171, 349, -512, -1588, -2013, -925, -331, -7, 1221, 1753, 1348, 322, -171, -890, -1732, -1286, -291, 502, 1155, 1421, 1443, 607, -254, -1309, -1626, -1112, -816, -238, 1214, 1728, 1607, 527, 13, -473, -1402, -1391, -521, -5, 543, 1369, 1370, 968, 27, -979, -1452, -1478, -1209, -366, 872, 1678, 1503, 1161, 629, -289, -1093, -1289, -886, -593, 189, 1333, 1522, 1022, 313, -542, -1293, -1472, -1207, -564, 656, 1159, 1481, 1341, 648, -298, -1363, -1461, -1033, -749, -154, 1099, 1339, 819, 346, -291, -856, -1669, -1268, -670, -13, 647, 1114, 1785, 947, -117, -835, -860, -1391, -857, -239, 656, 1022, 1195, 863, 400, -796, -1393, -845, -659, -74, 835, 1447, 1368, 1307, 364, -608, -1166, -1401, -879, -146, 187, 836, 953, 864, 489, -266]
1887b66m78J49m88Q80O42L69L9J84n55p61n70p9j54M06Q51N17M79J0o00q05n7
1908b87m03l20P63L99L28M28L87o59q72j31m77n01M90R89L14K81L28l37q28l35
1928d43k29j26K03P36J24K48O35n39o4k51p70r38N31K87M3R03J093m97n37j42
1948B67o75q76N47N97r0M42P21k02m80q5n59m59K57L52r5N09J119l39n00L82r39
1969a06j210M90L94j56Q80Q83l36o35L56r86n31M72K86m35O65O93J34n80O13m95
1989C96j295L49ql72N52J317j90j81L87q92j183L46L44l45O56J136m14n06N89
2008F86k13j047O30m19o13J23J326l11M85L94l30j432j30J28m05Q46J020K13o29
2027C22P10r02q99O50Nm11J07M84j02l1J140l1j336L25o15p45N22J343k50M66
$$ y = [-266, -744, -595, -1083, -203, 439, 808, 847, 1031, 476, -285, -855, -934, -1088, -682, 169, 686, 1165, 1175, 575, -230, -287, -690, -1010, -247, 152, 480, 908, 1295, 636, -236, -367, -844, -1345, -855, 134, 448, 729, 1057, 720, -108, -443, -672, -798, -595, 141, 265, 513, 1148, 609, 545, 294, -476, -1414, -883, -596, -553, 350, 1443, 946, 409, 267, -408, -1284, -737, -140, -230, 212, 933, 731, 251, 166, -393, -852, -595, -243, -338, 171, 1290, 951, 451, 833, -106, -1316, -826, -432, -588, 292, 1175, 839, 204, 560, -426, -957, -485, -199, -634, 31, 724, 858, 278, 891, 396, -899, -550, -558, -930, -378, 939, 749, 568, 955, 63, -1120, -774, -430, -775, -119, 1017, 603, 97, 686, 473, -574, 56, -363, -976, -853, 473, 162, 647, 1041, 711, -721, -851, -723, -1128, -282, 738, 951, 322, 1032, 130, -769, -119, -114, -525, -418, 66, -36, -67, 1073, 1042, -294, 31, -584, -1329, -807, 536, 286, 752]
2047G52N33p42j323N4N91q05M23J151m42l15R19l18o79L50m9r03j77R15L5K73
2067B43J240k27j190k80k62p78N14J174q9k97P98l38j073M45L6k21j04L52l48
2086d05j00J154N67j047J22j62j087k5Q23K21Q7R30l05r08o3J10q28L83Q28o93
2106c98L30O05J40r76P89m3r34n05Q60n41M94J014r3n09K08k27r90o0P78K4j89
2127b23R31j57m05L80J30j313N12L9l16l01J020J76j71K64L35j206m12N02j95
2146d10n9J078j71l07L27k80p99K47L59l76J22M60J3l54M17K24o56K6l2l96q2
2167f49R19J54J19L14l42q76k29L15l75K42P59o4q6K80k60k95k34L01o55r7P69
2188A0L74l01L77L84j143j05J65m13n4N03N36j96K80k5m51Q7M0k79p5K0K93o5
$$ y = [752, 1285, 543, -780, -726, -135, -940, -517, 634, 192, -123, 796, 478, -201, 149, 100, -803, -980, -65, -30, 243, 1483, 1256, 66, -214, -476, -1254, -740, 434, 345, 48, 846, 508, -565, -120, -84, -305, -409, -57, -405, -505, 649, 1216, 169, 291, 129, -958, -983, -160, 61, 148, 1078, 773, -135, -198, -88, -916, -533, 295, -398, -68, 537, 677, -299, 490, 447, -487, -992, -132, -673, -179, 835, 742, 233, 441, 214, -776, -836, -58, -34, -223, 708, 551, 146, 526, 656, -657, -145, -106, -422, -723, 297, 473, 302, 566, 901, -305, -717, -215, -410, -469, 609, 438, 131, 458, 178, -621, -374, -15, -391, -269, 191, 204, -150, 267, 491, -165, -139, -171, -567, -649, 270, 424, 543, 857, 515, -361, -590, -275, -650, -408, 351, 287, 201, 481, 221, -74, -308, -7, -662, -759, 10, 384, 83, 460, 844, -299, -404, -239, -652, -706, -203, 333, 137, 417, 392, -59, 28, 68, -211, -286, -266, 27, -38]
2210c8J92O62r16L4q1m16lJ73O42l07L82J93kp48J21k22p8J64K85k80N78L6Q7
2233D58n67J77k94m24K03L65J23L14j6J22l65o3k24n60N93j80J40N99J58Q4k95
2254C48m13j04l38j36L49K77J11N69k42j69j7k71j59Nj28K12J02O44k25k95K24
2275C44l39m10N7K2J05L77j1L10j93K00l90l15j85n0K63j39O92j95K29J9r2m26
2297a27j25l2Mk46M29O60k49J85m11k16l09J85l62N53O5N29o5L9l26k57m59J70
2319c65r6J0M47K34K35l0k74m37N5j38j79O05j34J64J85K24o40J42p2m53R2P5
2341c50J64L75J09j6J06k11m0n05J45j84j2N88K61k23M32k89n01j3j48l19L35
2362b96K32J53J74J93j4m18l08l5r7L92R4K26J81K7m8m03j28k52m6j42K22N46
$$ y = [-38, 154, 816, -100, -66, -147, -563, -566, -393, 249, -58, 324, 517, 515, -233, -112, -334, -412, -248, 37, -243, 335, 371, 458, -109, 68, -226, -650, -447, -82, 41, 355, 339, 461, 96, 33, -191, -751, -158, -338, -198, 401, 559, 643, 348, -65, -169, -507, -643, -294, -17, 94, 663, 421, 252, 235, -36, -195, -190, -318, -106, -4, 640, 415, 120, 344, 5, -405, -348, -326, -221, 156, 145, 455, 262, 462, 72, -243, -428, -478, -215, -354, 338, 143, 372, 391, 299, -127, -252, -284, -280, -526, -97, 563, 314, 499, 88, -128, -437, -252, -614, -61, 4, 533, 468, 507, 181, -76, -535, -365, -461, -451, -4, 230, 465, 435, 161, -276, -221, -359, -538, 67, -67, 97, 282, 506, -134, 8, -64, -517, -425, -350, -186, 189, 298, 282, 388, 177, 137, -368, -223, -407, -419, 169, 430, 207, 639, 350, -151, -164, -312, -631, -296, -64, 89, 263, 456, 442, 24, -284, -319, -416, -24, 70, 296, 477, 504, 456, 53, -75, -327, -373, -515, -293, 253]
2384B53J37l04L28k61j14m61q6Q6K39K1K29M68l68mj04k10l07K83k18K00O35j58
2406B84R9j49M6o58k29J72L04qO14J46j83k53J14k96m26k0k69O19J92L00j32J55
2428D22j74k21k47j76j46L38N22J09k49J65Nm33r5j83n9q7N15R2K16K16n7k08
2450B65k65m27K38m85Q58K08J74j21J20n59l45J93j45k28L94M61m6R0r4q4l30
2471a28Nl89J43K10J81r3O68K52p60j57j80j94j83M90M19j34K21J73m12Lj15m49
2493d29o1N3K02Q7M89L23l44l54L13j109J58M98J91J21J31N43o35n35M19m97k84
2514g20M76P3r3L87M10l27R6J71r93k55J91K20L82N45L11j79o16J19p18k58M51
2535c27L84k35O31J15n46L92N4n91n29L50jl03N17J030l57m9k34q07m21L87L11
$$ y = [253, 390, 86, 414, 153, 39, -422, -508, -422, -183, -162, 67, 535, 167, 163, 59, -151, -458, -175, -393, -193, 442, 284, 383, 234, 280, -378, -607, -435, -131, -139, 475, 621, 438, 185, 299, 3, -423, -443, -712, -93, 99, 399, 267, 422, 248, 27, -220, -396, -542, -204, 318, 427, 178, 343, 348, -85, -180, -363, -422, -509, 6, 98, 314, 530, 473, 265, 0, -427, -189, -674, 184, 392, 566, 445, 565, 6, -339, -146, -291, -519, -125, 336, 290, 380, 286, 202, -128, -123, -512, -369, -159, 22, -71, 597, 849, 89, -68, -248, -442, -625, -135, 284, 150, 371, 544, 132, 135, 20, -429, -490, -437, -235, -148, 341, 664, 320, -34, 279, -830, -672, -174, 17, 138, 269, 812, 177, -358, 61, -436, -720, -244, -171, -264, 123, 533, 206, 302, 473, -520, -775, -584, -364, 18, 563, 874, 695, 79, 198, -520, -778, -327, 57, -178, 453, 568, 22, 414, 468, -123, -652, -302, -303, -606, -89, 941, 584, 535, 301, -506, -927, -540, -229]
2556b29K20M43N1r4o11N31o21j82N62r3o33Q90K87m12N65K66p87j045N01j82m17
2577i90J355R92p69l05N38j170o58P40Q0m29O82N70q13O03N96n89r94M00m04l41
2597i06P35R16l65K88K27q58j003M65j20n13J309N40o36L8M24p7j048O89j8o98
2617f11M31N55l77N51P95q72r67M56m45p20Q73Q73j03K5O72r41p64N93K0o97O70
2638A7M32k71o8R82q72J22j25o77o35L76J159n67N88J075j183p78M86m96n59R43
2658e1O41q27K91R34q27j21L03p70n58P33K80l59K41J260q02k54J71q21n12L52
2678f96J088n65Q13K02m80p00M69l48p37Q14J99o31L04J306n89j66J47l90j168
2697a128N33L05j89P91P20l89n23J53n61m87J02O53n40Q17M70j93l15K30m50q17
$$ y = [-229, -9, 434, 485, 391, -220, 311, -310, -492, 70, -23, -656, 234, 521, 109, 674, 940, 153, -892, -391, -573, -990, 365, 1357, 588, 283, 821, -349, -1007, -267, -187, -616, 66, 636, -177, 426, 1022, 433, -561, -161, -565, -906, -171, 745, 380, 668, 895, 37, -966, -501, -621, -1134, 175, 715, 79, 117, 541, 464, -584, 105, 87, -611, -180, 375, -2, 549, 1344, 472, -495, -39, -484, -1204, -331, 542, 439, 464, 1136, 195, -569, 24, 44, -653, 17, 449, 178, 110, 1092, 220, 342, 217, -460, -1095, -719, 440, -127, 461, 1536, 353, -425, 61, -435, -994, -51, 590, -237, 54, 988, 161, 40, 343, -427, -985, -252, 28, -331, -90, 1170, 368, 114, 285, -536, -1048, -696, 392, -173, 640, 842, 362, -338, 131, -217, -954, -140, 59, -572, -268, 1038, 449, 283, 430, 40, -1128, -595, -290, -479, 312, 1032, 643, 120, 273, -288, -775, -673, -20, -560, 257, 727, 534, 219, 449, -1, -818]
2717h18J02L63k45N78Q29l43j10K03n16r07N13mk27M52R96j64m74M90l59j405
2737a046O48L20n46N64Q48k90j63K86p59n06J56K76m62M81J087m81k9O2j03q20
2757d77J57j39j73L51P60j49NL21j98q75j43P3j33L80O57K65j50J76l53p71R0
2778c26j78PM8R38J26k65M30m19o09j16P4k86N5P96J85l06O91j71q42k8m87k37
2800i20M22Q63Q0J50K45k67n05m40k39mQ7Q26j61K30O87k33q93l64k7l26K23N32
2822c4L65J29L9J45l50j30m63k53J72J93M98P6K55j8n31l58J51o14j85O79K01
2843c3L95L21k6n90j73l48r2r2L73J78N30K07K35m24n05k10k24l19L77M08M42
2864D30M91l41R5n81k98l95Q1L07j02N80Q7M10l97k0p64j80J68k43M78O41J42
$$ y = [-818, -716, -353, -598, -20, 809, 466, 356, 559, 43, -864, -351, -355, -582, -130, 866, 702, 228, 718, 359, -1046, -398, -78, -624, -60, 788, 498, 335, 621, -138, -644, -488, -212, -674, -193, 894, 413, 384, 446, 343, -477, -320, -459, -632, -281, 479, 330, 335, 656, 458, -417, -560, -487, -620, -240, 417, 682, 532, 708, 355, -416, -326, -504, -497, -449, 489, 615, 350, 780, 361, -248, -364, -290, -576, -521, 275, 460, 154, 845, 674, -168, -196, -683, -920, -498, 365, 445, 595, 840, 573, 68, -372, -611, -615, -528, 298, 137, 367, 1054, 821, -72, -436, -463, -789, -566, -34, 331, 460, 499, 644, 294, 164, -299, -552, -380, -187, 311, 387, 642, 624, 93, -265, -114, -728, -913, -234, -33, 362, 683, 657, 67, -106, -454, -546, -638, -265, -87, 443, 650, 885, 461, -44, -254, -478, -797, -420, -12, 430, 921, 580, 675, 94, -204, -599, -518, -211, -313, 267, 354, 764, 367, 347, -417, -597, -429, -672, -194, 447, 589]
2885E89J97k3q10k88k20J16k69L43L47N42J70k98k38l09l13k59R4J87N86L38L16
2906G98k23J7n16l92l80J08J73M76M46R9Q1l40m61j76m55J20L68K32M64Q0o4K54
2928G09p08k13m73J11k9O73M1K43P6L61m49m98m23J78n0K94M63J62K01Pl39k78
2950E9m22k1m12M56L28M14L11K69m57r82J64k52m87O13N97K26R5M3j28n60j17
2971b63k38k38k4R04m4J17O18l14o46J01l53p25K80P70K02L42L59m89n20K16o71
2992f16j85K88M54J59K29J89J19k67k92l53q18L54O86k42O06Q63l77o82k0l43
3012b48q21O62M46l8M34K21j60l63q1k3r60O52J91l71O46P65j50m70J7l93j187
3033a231K03P67J74J52J127k58r83R5m88n36M99O76l71j34O88J95k02J97k43j212
$$ y = [589, 786, 763, -47, -335, -555, -439, -708, -365, -18, 524, 694, 396, 158, -151, -464, -723, -629, -442, 144, 482, 798, 575, 592, 76, -316, -696, -588, -415, 61, 507, 606, 687, 347, -114, -290, -745, -625, -257, -25, 439, 519, 455, 709, 1, -212, -685, -574, -603, 70, 111, 354, 430, 791, 342, -156, -579, -401, -451, -157, 306, 468, 669, 676, 337, 59, -363, -384, -796, -340, -12, 402, 713, 982, 525, -457, -293, -545, -1032, -419, 178, 404, 499, 542, 414, -146, -263, -501, -739, -763, 141, 97, 214, 832, 518, -128, -27, -380, -1105, -825, -55, 147, 489, 848, 359, -161, 55, -616, -801, -513, -59, 100, 329, 518, 637, 370, 78, -275, -1093, -739, -53, -295, 311, 1174, 797, 115, 95, -248, -1069, -407, 39, 1, 435, 656, 496, 133, 52, 29, -931, -279, -88, -459, 187, 952, 802, 332, 349, -44, -1231, -1028, -261, -87, 65, 1192, 934, -49, 46, -442, -978, -479, 197, -174, -308, 380, 575, 373, 570, 327, -885]
3053h85lN84l08N33J152n1j057M55m05j030P1R95m95L71J118o55n42N42l9j318
3073i67O62K60r50O23J053j18J11R0m29j357K63P11m43M75R14k40r49O05q9j452
3093a227P46M36p65J66J498l75l35R31l18j386o0L32o46L69J314M9l51M25n43
3112B60j249M77N62o99K51J288n81o83J014O7j082k6L08q10j2J352J47n13J093
3131A164m13j169l04K82n12L72J386j57n89Q27p18q55M75L21r69K16Q16m31L95
3150A37Q89j99j078j1k5q28J43J375J23p6Q81n47j292Q5M01r10M72R63m13j22
3170c2O59j5n74j16J14j034K62P82n2J91Q76k14j117J19n3n73P0Q90j15J17N51
3191G36j8r02j6M52q83JP72m88L3J177j06m83j29k52r91L41O59J92k17Q53J3m50
$$ y = [-885, -888, -304, -612, -79, 1073, 1022, -35, 420, 15, -1015, -944, 51, -444, -73, 1045, 390, -152, 390, 351, -967, -305, -45, -995, -372, 681, 563, 674, 764, 335, -1022, -759, -48, -491, -16, 898, 658, -291, 314, 225, -1227, -481, -45, -810, -644, 854, 479, 144, 1075, 757, -629, -689, -357, -1003, -634, 680, 729, 378, 803, 260, -989, -512, 50, -649, -398, 890, 309, -374, 640, 707, -375, -401, -93, -903, -915, 437, 584, 71, 1164, 751, -418, -722, -440, -952, -580, 806, 649, 60, 887, 169, -686, -211, 110, -859, -643, 173, -258, 137, 1026, 827, -251, -262, -287, -1115, -972, 403, 526, 450, 1331, 784, -508, -423, -22, -932, -460, 503, 90, -32, 627, 612, 38, -78, 36, -998, -736, 46, -6, 185, 1061, 847, -270, -151, -204, -777, -707, 183, 68, 185, 736, 718, -184, -200, 252, -631, -630, 142, -346, -313, 864, 758, 275, 146, -106, -1097, -756, -97, 95, -122, 731, 744, 294]
3213B94l91J29o28j28N59j05L4J118N5q19N41n68p38j05O56j11j65J004L48o47
3233C33K6k51n79j6L36j90J32R69j64m72J16r5q11KN73n07L40Q74m5j69J2l57
3255E7p10q8J78M07J13O10K74q49N29m49o08j28O07m43K29J002j51k15j08J42
3275C99p24j88M39l98P1O96J91j51L22m53m69Oj46K1oN32K64l2j43K12p96J0p0
3298d13m7K04N55l6K02o6P6m63l65j51K09oK73O53k69R4q4l42m79kl21J86M95
3321i7M67l4K09K7p65j52l18L43k01K72M88M83j04l68j33m20j55p8p7M58L95R5
3343C35L4J14l00j05j56m38j57N73O8R1M60j2o08q7p0m12J48O3N28L08l7Pk4n95
3367b72J04r2j52j9M72J24N76k62k82k36j08j82k57K71L94m1N05J36l53o4k14
$$ y = [294, -97, 32, -596, -724, -165, -270, -236, 882, 937, 118, 659, 91, -647, -752, -96, -207, -372, 632, 980, 333, 359, 108, -471, -487, -151, -341, -209, 760, 596, 124, 240, 145, -666, -664, -91, -598, -258, 616, 571, 402, 414, 57, -653, -741, -563, -156, -43, 567, 841, -8, 521, 72, -536, -664, -57, -500, -271, 731, 580, 365, 257, 399, -325, -513, -74, -472, -401, 295, 486, 335, 657, 204, -265, -259, -405, -384, -390, 142, 406, 374, 231, 443, -353, -343, -413, -460, -256, 299, 263, 465, 399, 475, 12, -353, -504, -295, -301, -28, 625, 356, 450, 366, 24, -455, -457, -778, -592, -97, 370, 336, 545, 572, -193, -345, -663, -320, -521, -249, 239, 722, 618, 250, 117, -303, -458, -536, -613, -155, 240, 335, 369, 483, 183, 78, -78, -516, -673, -100, -32, 59, 519, 507, -101, -188, -258, -670, -522, -459, 69, 377, 340, 347, 323, -272, -168, -260, -412, -431, 41, 165, 741, 479, 197, -39, -147, -329, -586, -315, 79, 38, 543, 679, 326, 262, 48]
3388D8n72kj4M50PN44J20l51l33P5n61L34l87N17K17N98j23l62Q6l09k81k85J97
3411c87M22J19J98J71J91l96o72j55R9K10J12J73K18K57j41L2n11k59j68N5L5
3432c97N29K63O1l64R7L8o15M6o9J10K62M42J12j48j2l85k83q2l53M06K68J08
3454C4J77K96k44Ol73l31J0k20L28M91R2K5J19l37m87J48k75P2K82O35j95o8L17
3477E02k33l07l35L65n53pM27K86J07M79k15o09l45j18L27l86O64L52j50L43l16
3498B78o07J00J43j04j70M83o9o3M26K55m58m50j5k61J43L60O5K25R4L2m45k79
3520c17K57k13j60N99p8J04L98k69j78M8k48o60N2O53lm3R70l14o27m4J5k88k10
3543e56M57N78k35J61r3j57j81J16m10L8L57k1k90L74L87k92J5Pp29j90Q46q4
$$ y = [48, -524, -526, -540, -90, -83, 461, 581, 230, -103, -28, -589, -255, -642, -125, 92, 690, 567, 205, 291, -18, -299, -584, -387, 35, 154, 352, 523, 714, 318, -354, -509, -410, -200, -88, 85, 303, 560, 419, 451, -60, -319, -487, -432, -397, 132, 395, 456, 92, 189, 227, -388, -342, -411, -301, -39, 403, 515, 367, 355, -30, -313, -395, -748, -342, -74, 34, 211, 507, 263, 269, -104, -435, -425, -645, -317, 174, 266, 291, 410, 73, -414, -266, -541, -469, -187, 448, 253, 185, 502, 269, -38, -373, -8, -561, -568, -141, 145, 252, 731, 516, -93, -438, -556, -229, -615, 49, 401, 251, 594, 278, -329, -229, -86, -190, -360, 123, 54, -9, 417, 672, 214, -236, -251, -512, -369, -9, 56, 281, 375, 407, -38, -317, -60, -273, -433, 166, 88, 192, 590, 321, 143, 191, -57, -717, -665, -12, -15, -58, 912, 598, -29, -73, -58, -346, -556, -99, 479, 244, 405, 312, 155, -26, 90, -320, -282, 75, 54, -236, 138, 525, 233, 248, 255, -474, -664, 182, 98]
3565I8j17O90k83l46k29N6n18M73K84n4j06O47k20k59K19J42o66l85M73l41M8
3586c94Q78q0j54q5K2r41j3P13M0o2M94j69j24J72l55l36k81P40l55q9O33M01
3608F55n46M34l31k70n57M74k29J31P54J92o58k8M27r55J05O12n23r9P66j31l70
3629a47M75J72p87P2m4k5pP05j34k61L77l03o57K40L78k66k45O95O5p52O68J62
3651C81n59k67N21m31m2M52K96k20L52Km12n52M40m25j32P82J50m44P43k11q81
3672d57J27K98r2l82N53K32m00M70L97q14j06L77l64k07L67L57j92J26J33k71
3692A52k32K62n49m5M90M3K3j70L80m06j90O2k49O2K80o4pM73K12k66k62Kj94
3715a93k30K53N08l96L87p0m1l78j18J36J26j0L2K44k98O37n38j3j14k60J24K30
$$ y = [98, -19, 671, 388, 42, -187, -131, -649, -176, 108, 54, -52, 595, 375, 116, 335, 477, -189, -574, -101, -442, -394, 484, 404, 250, 165, 187, -754, -767, -54, -14, -76, 418, 249, 125, 297, -58, -394, -675, 65, -290, -379, 254, 655, 109, 543, 212, -58, -615, -141, -370, -239, 515, 707, 49, 21, 448, -507, -402, 210, -313, -412, 354, 223, -147, 328, 500, -287, -215, -259, -284, -291, 414, 280, 19, 396, 93, -564, -324, 54, -212, -457, 238, 303, -449, 219, 381, -178, -445, 76, -355, -397, 55, 351, 131, 483, 485, 73, -479, -39, -464, -596, 186, 336, -108, 635, 424, -457, -330, -32, -124, -506, 47, 279, -121, 349, 746, -68, -174, 203, -161, -368, -1, 356, 164, 290, 423, 152, -80, 182, -367, -412, 78, 121, 144, -26, 354, -52, -242, -180, -429, -367, -87, -151, -158, 315, 527, 261, -1, 1, -193, -423, -170, 338, -58, 329, 259, 218, -160, -278, -142, -16, -26, 6, 250, -48, 589, 51, 38, -76, -336, -212, 18]
3737A8R1j31L11J54m74O7j29j43J18K94k94m0L80Q3j03N8j26j28k04K19j42J75
3759E4J66K84l80n0k22o1j73K14J69j26O32k46j14p0o5j30p4k9o5L57M08P1k72
3782B78k50J11k04k88L01j34J82J84R9j4k56J27m48O1l25L66k5N48p3l9k89o0
3804a48J63j52j62J74J63J47J17j49j43J20K2m88n3N34k85M9L93j09n6m1m87j20
3826e11J31J99p6M97J06k50J81j58j82k6m96M14L13l71N43L16l64l58K66j34k72
3847b32j55J66J41K53L14m75M02k85l45Q1j32L00k19N72j61p2j49m5K6O2j5k97
3869b65K06L2J30O4l71J42N0k86P7j44L18K05O2M2j49o2k87J27j65K17k0J24O
3892E3M04k71l26j45K1J03K2J05j41M56P9l23J13k23j46M3k43K98J36J21q1K74
$$ y = [18, 109, -22, 289, 443, -31, 36, -93, -236, -118, 176, -118, -158, 222, 305, 202, 260, 134, 6, -198, 21, -121, 54, 220, 504, 124, 74, -148, -209, -382, -168, 1, -125, 507, 261, 147, 77, 12, -118, -192, -221, -286, 71, 479, 550, 278, 28, 139, -65, -353, -52, -186, -4, 180, 279, 265, 9, 136, -312, -251, -576, -210, -235, 313, 240, 201, -88, -148, 15, -137, -299, -125, 38, 185, 302, 153, 10, 130, 152, -336, -389, 145, -140, -91, 302, 193, 137, 96, -391, -511, -380, -181, -257, 240, 346, 96, 277, 119, -63, -89, -585, -171, 142, -229, 314, 630, 266, -92, 174, 40, -232, -387, -221, -80, 173, 487, 12, 414, 129, -216, -135, -267, 33, -186, 386, 225, 153, 4, -41, -15, 47, 32, -265, -59, -27, 103, 167, -204, -62, -12, -298, -221, -365, -47, 158, 220, 262, 113, 51, -236, -109, -274, -57, -77, 47, 53, 457, 186, -140, -285, -264, -161, -139, -34, -175, 281, 360, 37, 150, -73, -219, -176, -419, -121, 15, 136, 55, 329]
3914C29o62J46L1j19l7J92j24O6M75o6M8m87Q6l6j00J43L3j21K60J20P5j77m34
3937c59K0J3J53J20k4J68l4J29j46j66j04j0P8J40J7J13l2k6n5ok37o6M14k39
3961a39L33K05k1m01N4j60j95q1J76J94j47M79K89l53jj91l85L62j68K52j34N34
3983E02n58q7M63l40q9j62J89l87L70J28L68j83r1j06m26J59J7Q1L23L22j82k58
4005E3R3j98k06K77j22J38r6O8j89J76O09l77m66k14N54m7m64N31K87j55l8j14
4027A00k61N1K70l76L04j01J76j48K91J18p87J63R7j69pL94j6j28K74k95j35l37
4049e22L74j31j3M42J50k08K48qn78l3M10m20k87O08Q9j00K85l30k64nJ71j70
4071b92q7P09j17j04K51k48l11J0L37k24j01J53K76k40K58p0p2k38j61k21o0O29
$$ y = [329, -333, -187, -156, -275, -312, -120, -244, -178, 297, 231, 279, -208, -122, -158, -258, -115, -82, -203, 57, 177, 252, 75, -359, -339, -326, -173, -53, -77, 91, 57, 186, 40, -126, -230, -240, -162, -22, -5, 108, 76, 50, -5, -11, -248, -314, 100, -139, 194, 399, 378, -23, 31, -129, -324, -405, -229, -35, -182, 297, 586, 233, 232, 41, -344, 18, -150, 102, -32, 502, -56, -143, 320, -20, -109, -271, -82, -469, -99, 29, 397, 214, 123, 17, -409, -250, -233, -152, 171, 493, 311, 53, 146, -52, -258, 19, -103, 35, -61, 7, -182, -6, 603, 226, -240, -454, 100, 53, -411, 120, 407, 252, 214, 100, -161, -110, 160, -216, 88, -13, 163, 15, 306, 424, -363, -200, -103, -272, -279, 115, 99, -29, 245, -50, -185, -522, -148, -279, -292, 150, 300, 92, 340, 332, -246, -279, 131, -289, -576, 32, 121, 21, 306, -24, -288, -293, -122, -292, -379, 330, 213, 109, 360, 112, -199, -189, 148, -76, -177, -24, 252, 12, 270, 200, 128, -110, -271, -492, -552, 77]
4093G7j5K53N3m0p09N1K00J6k23M14m8O0oJ42n15K30K48m52m0M12k17l9O00k41
4117B11j54j25J90n36P9L13k24J10N37l1p07J14J90m37K41k5K81j29L01R1j27
4138A63L8L32q34k70O12j99K01J04J62j85N2j29k35j22K72m3j72M80J61m09m0
4159f1L93k74l89O8J36l81Q02K80k11j88r3m57J14L50j74j24L06l9j51j66N88
4180C29n98p6J29K69k99L94m4q7K91L2l46j45N5R9j27M03P9p4k69j19j71M7R4
4203a34k44O0L65J63R2k9j4J7o07L77l76o7N94P5J01k57J14m28j56k62M02j29
4225c43M13K08k01R4k1l68J49J08k76K4L45K04k68J66R0l08j43m2j05J39R5J05
4247F5l5M0j2J5j87K5k66N4M06J32k37L58p3o5k88K53l77j48L94J46l12J08M36
$$ y = [77, 62, 315, 368, 328, -381, -330, -130, -114, -337, 77, 29, 89, 83, 225, -290, -60, 188, -264, -304, 108, -109, -148, 452, 211, 57, -68, 122, -414, -335, -22, -246, -136, 401, 370, -337, -223, -33, -470, -229, -254, 27, -102, 199, 290, 163, 201, 533, -301, -571, 41, -158, 43, 147, 309, 124, 176, 47, -188, -310, -38, -81, -253, 227, 388, -21, -61, 332, 58, -331, -263, -127, -508, 294, 574, 363, 175, 82, -375, -261, 89, -85, -209, 97, 58, -93, -259, 329, -269, -345, -216, 53, -246, 148, 104, 17, 308, 340, -6, -151, -96, 3, -124, 279, 358, 284, 15, -104, -275, -228, -134, -378, -318, 47, 210, 302, 273, 259, 276, -331, 46, -330, -397, 197, 272, 373, 116, 230, -198, -354, -616, -214, -343, 70, 278, 77, 171, 150, -218, -69, 39, -237, -213, 132, 336, 68, 234, 324, 16, -127, -169, -274, -135, -40, 65, 30, 70, 58, 73, -114, -89, -355, -301, 105, 237, 0, 358, 285, 220, -68, 185, -192, -340, 54, 200, -112, -4, 432]
4270D32m24j42M89l82l01K80K75O9l89J65K3l05K65k82j37L12K37p7M9J65k66
4291E6p9J07k8k29K00K51k38K98o5j44Q8m21o8n2L6L48J6O0J2m1K14j35l12P9
4315d7l4L95l85J85j34L36l66Pj90r3J20J37K64k8K6j60R1j84J00K2l07p8M51
4338A28p5K07j87Q9l65j8m7J41J30l24K29N02K5n77K89k31l27L7K49L2j11J18
4360h6L21J08o09K02o2J08k84K76P6K42j67J94j95k16j73J38k03K76j00J89M03
4381D38k46J63Qo07jJ49k51L12J44l2K89j44Km67q7J1J39M41k47mJ27R1k64j58
4405a94M89n37J18j97M05p8O4k82K58r5m0J2l05J20M79m3o5O6j14o0k27j00O6
4428b60J89M8K62P5P8k73k96p7R7j58J77K25J22O8m0J6p17M12j43k04M2L48K8
$$ y = [432, 8, -134, 355, -27, -328, -48, 227, 296, -93, 72, 95, -210, 55, -227, -364, -52, 185, 108, 157, 322, 56, -23, 84, 56, -173, 27, 278, 40, 338, 273, 129, 217, -204, -272, -324, -288, 60, 76, 136, 148, 107, 321, 186, -126, -47, -81, 314, -71, 114, -20, 316, -50, -43, -233, -326, -206, -69, 195, 167, 193, 33, 124, -60, 40, 62, -245, -323, 128, 53, 260, 73, 162, -203, -221, -268, -127, 3, -321, -92, 410, 435, -142, 147, -84, -411, -374, -125, -93, -204, -86, 235, 343, -266, -64, -126, -18, -302, -26, 50, 292, 125, 319, 124, -92, -265, -127, -330, -54, -154, 35, 438, 192, 355, 363, -244, -245, -96, -347, -35, 109, 77, 366, 222, 224, -243, -330, -319, -180, 261, 14, 10, 137, 228, -36, -194, 295, -242, -124, -321, 84, 6, 70, -212, 46, -49, -89, -77, -382, -262, 217, 174, 109, 175, 61, 1, -226, -326, -260, -71, -23, 239, 314, 392, 119, -177, -254, -157, -315, -138, 87, 209, 277, 237, 253, -464, -52, -195, -399, -357, -9, 19]
4451A9J15K41m56J44l2R0m25q9M17j25J94M9J19j0j03l62j23N8M25j92J87J29
4473B70k19J38r9j30j37o3J93Q3KJ39j63k81K58mR2k45J51o2J70j36P0J07K8j12
4497E0l02K3J41J14q1O27m63J40j72J17n65k88N03O2J28K66K2l56M33l77j45J75
4519E2o1j91K46J64K18mon14l67N10oj27J86L18m50k18L81n0k45r5l5J07L29k25
4543h3K36J00k56K17l31Q7k07k05L96L20m28K68M09n37l01J83r7p6M25k0j05N2
4565D7K62j59j18n9j67p4k8L33o9K12rL22l38m17L10l48L22L35j94k34K34o9k60
4588a66L59l55pn4K39J5k79L98J30k05k09m4l41J77N05k0j7L04j29l01Q7r2j38
4611a43J53J20k3J9J12j68O2q5Mm41Q8K79%j10N98k96k93M10m31j18k70O65j99
$$ y = [19, 134, 375, -81, 63, 31, 121, -304, -393, 24, -101, 93, 142, 261, 251, 148, -214, -337, -279, 146, -46, 141, 270, 51, 189, 90, -40, -177, -240, -47, 36, 38, 177, 14, -267, -9, -13, 79, -166, -15, -77, 93, -43, 27, 134, 162, 50, -252, -229, -88, 26, -55, 572, 109, 249, 77, 194, -371, -659, -156, -94, 34, 300, 322, -34, 399, 22, -123, 52, -9, -200, 46, 210, 428, 424, 418, -96, -463, 47, 41, -86, 100, 418, -32, -250, 131, 81, -164, -259, -294, -187, 142, -83, 153, 253, -3, 214, -117, -30, -237, -442, -46, 274, -154, 114, 523, -14, -315, -132, -229, -305, 120, 100, -5, 47, 309, 150, 32, -27, -194, -268, -296, 37, -32, 180, 171, 493, 155, -262, 48, -300, 22, 357, 163, -71, 163, 94, -166, 193, -162, -169, -223, 16, 31, -248, 150, 280, 75, -134, -178, -519, -342, 163, 143, 126, 430, 301, 0, 87, -5, -143, 10, 130, 107, 126, 238, 70, 132, 47, 51, -390, -302, -23, -23, -133, 465, 169, -124, 286, -145, -263, -533, 132, -67]
4634f7O3J92j70k60J72J0l43J42M51m07j4N16p7L9r5J26n77K57Mj54k1P28j49
4657C66n59P9J87m94M18L6j25l9L7L63l27L17J41o32j8K00n4pJ97L47m84L24k21
4680E2n27P4N34l99r8O74l1n53L25K34k43j25k78K55j84L09K12Q6j89L29n36j99
4702b78K52l95K95M20l7k29J14j23j87k0L74l31j00J80J4Q6L78j94k32J92l93
4723b14m7J55o5M42r8R0P9l93p3n9k15n2O74k4j86N24k32o2l37L91m91j71L32
4746c2J0k0J06R1L5j93k16nK5P4J61j11J07L11l40j09K7K4k90Q2L23K57O4R2k85
4771A88l27K7P6j51J15J88J06j03J97k66M4j73j20j40K75J6k25R1M19k66J47j01
4793A7l8m87M85k27K36j08J53K84k47R4n41N20m22R3j1K62K74j79P0m8k45l70
$$ y = [-67, -4, 188, 18, -242, -70, -60, -403, -261, 190, -217, -231, 285, 208, 247, 152, 278, -299, -42, -38, -192, -213, 515, 366, -193, -114, 73, -421, -3, 33, -92, -131, -94, 269, -58, 259, 400, -232, -250, -50, -104, -111, 86, 433, -51, 273, 52, -475, -401, 133, -266, -364, 310, 279, -274, 51, 285, 42, -83, -361, -106, -290, 19, 231, 317, 128, 457, -79, -278, -26, -421, -126, 294, 257, 28, 142, 19, -168, -188, 186, -145, -245, -65, -51, 35, 413, 219, -13, 179, -214, -261, -106, -171, 271, 173, 263, 342, -51, -124, -183, -398, -450, 224, 200, 14, 538, 306, 244, -93, 298, -193, -364, -32, -22, -42, 64, 155, 190, -3, -219, -224, -199, -125, 36, -75, 32, 343, 3, -106, -79, -55, -345, -263, 60, 317, 381, 473, 188, -139, -112, -36, -187, -72, 116, 222, 119, 316, 50, 94, -79, -199, -339, -64, -48, -273, -182, 237, -29, 118, 17, -21, -508, -23, -250, -14, -122, 31, 315, 68, 162, -379, 141, -281, -188, -199, 63, 337, 158, 228, 180, -65, -435]
4815d35K35L06m55L21L25m04J65K87l62k56P4J51j49J15K63oL38m69L3j2l42q6
4837c63J89J48K06J2l1K30m88k10m1L84l08M46K53m18K11O8l92j75J37Q4j0k6
4859i4N09j66K06l08m0m49J75P5k09L39M08l62L1J05k65m19L6K35j23M39K6j49
4881@J1j02L2j8j89J85j95J74J46j62L55K00k83k68k28J32j60K23K57Mp2L40j95
4904A87k06m5j50o8K48m0J61O7O9k52k06Q4m6J8j26M19j66L38J33l63j66J28j59
4927a41LK26l7L6L8N21k23k16l5l46j64K34O8K51J18j44l5l5j82J19m54K98J35
4950C5k25k4M52k6r3M3r7l95K33J03m7kL9J71O5l55K6j85M18o8O1p5J68L0j46
4975A06R2l43l75J95L02m7K76L27k88m07L08k22k58J34K12j33M17K3k32j69Q2
$$ y = [-435, -200, 106, -349, -28, 297, -107, 58, 345, -17, -273, -199, -48, -197, -82, 181, 175, 513, 44, 77, 65, -277, -363, -174, -26, 180, 192, 161, 391, -97, -307, -348, 36, -272, 174, 427, 9, 220, 288, -104, -279, -142, -58, -68, -94, 415, 249, 455, 147, 107, -342, -167, -92, -301, 38, 446, 84, 115, 220, -45, -464, -428, -193, -316, 123, 149, 0, 11, -91, -59, -77, -266, -81, -276, -102, 44, -118, 237, 437, 154, -114, -342, -210, -370, -147, 110, 114, 42, 382, 187, -19, -64, -214, -282, -34, -74, 87, 154, 223, -29, -235, -151, -197, -179, -305, 114, -52, 286, 419, 56, -110, 18, -141, -138, 88, 51, 87, 125, 646, 423, 207, 172, -174, -338, -104, -36, 215, 333, 189, 154, 119, -63, 56, -398, -100, 35, -190, -214, 238, 212, 119, 162, 65, -330, -97, 6, -41, -43, -4, 167, 232, -123, -97, -282, 136, 68, 129, 54, 222, 252, 106, 198, -145, -520, -325, -23, -70, 206, 533, 245, -162, 146, -76, -334, -200, 12, -121, 296, 319, 87, -82, 0]
4996@P5o05M88j33k22K49J58M11k98M7r7l38k42M23l65M99L8K18o1m8m58j58o2
5019d81J82Q7K68J79o7o7K39j54k10Nk19j86L80M00j97M0J28j72l92J42L0J4K8
5042b3L12j94k36K05l40j58M98J8m77L52R8J98k68L22j70l65J32j08j9J2M47k96
5064f0M1L78j43k89J46k45k68L55L10j33J39p3n2j85J19j75k27J37K71J36q5L86
5086D83N1o38N9k52J51j4j42K40J47M44n63o8M44j62q60J79L76M0J75M89m07k27
5108e5R6P0m21L05O0o3K14J56k9j47j78K6m22J36L06j59j10M64K63o13K72q5m21
5131c35O1J68j93K72M89k14R8k75o2l88K9R0L20k82L49k58J30J75k74j35R0N8
5153h7k07K17K98n2q0K14n3n69O8O8o4J39L67q7k19L26r0k60o4J54Nj04n6J84
$$ y = [0, 75, -530, -42, -175, -397, -148, 10, 421, 123, 170, 73, -265, -507, -84, -449, 50, 88, 306, 245, 197, -261, -419, -481, -299, -212, 56, 235, 168, 101, 340, 186, -24, -19, -238, -424, -44, 356, 159, 199, 327, 155, -237, -95, -65, -51, -23, 289, 95, -141, 64, -276, -434, 64, 82, -395, -43, 55, 253, -15, 307, 137, -228, -96, -204, -223, -211, 236, -60, -19, 359, 216, -73, 73, -172, -440, -85, 225, 92, 231, 158, 106, -79, 40, -135, -362, -225, 46, 182, 97, 483, 534, -104, -45, -297, -146, -160, -302, -62, 85, 529, -34, -102, 342, 180, -680, -501, -125, -85, 90, 579, 172, -55, 41, 111, -310, -5, 55, -8, 206, 362, 333, 186, 8, 34, -388, -252, 54, -105, -215, 249, 512, -101, 171, 86, -335, -274, -106, -299, -27, 462, 248, 346, 71, 9, -379, -350, -260, 60, -222, 127, -131, -1, 174, -100, -235, -145, -87, -294, -77, 221, 169, 89, 303, 250, -319, -251, -183, -247, -108, 259, 172, -47, 279, 189, -71, -135, 19, 24, -80, -136, 48]
5177D8J02K23j29n64K02q4j18j2N86J81o25M22l89M6Qo8j75M60J15j55J21k70
5199g5K20j49r6O0l58N0O09O3k84J60ol84j70J33J66k52N50m5O2l1k63J6q7Kq2
5224a91J8J69l7K71J21j82J40o12J63l5k79N06K4J79j21J62l12j27K58m53M12
5245G4j52j3q0L00J23n3j83m3k14J12L40l3o2J89l54r3j00K67n00L62m5J93j3
5268B2Q5L71l21j4k79J04l24M17k91L13P3j20lJ20k84J42m58L37J01j9J20J13
5290B05j84oJ19j18q7J48m84L04K33O2K01n44K06l68j55O03n07K31K49k00K20
5311A28L5l01J3nJ44j39J18Jn5j05L05l7j08j01j74K26j30L56r8J33J02m53K43
5334I8l23J04J3j67L28K65m78L65J70l90j51J1r4M34P3k28k8J81l17K12j30J21
$$ y = [48, 150, 373, 244, -320, -118, -202, -320, -332, 254, 435, -190, 232, -157, -111, -103, -171, -346, 114, 229, 74, 195, -75, 145, -4, -100, -40, -398, -348, 261, 324, 40, 200, 194, -190, -360, -227, -61, -313, 237, 192, 254, 223, -40, -24, -111, -109, -191, -173, -4, -41, 230, 351, 169, 309, -303, -140, -175, -454, 52, 76, 255, 134, 296, -16, -143, 115, -338, 74, -78, -91, -171, 129, 252, 199, 16, -27, -241, -129, 211, 178, 116, 305, -49, -142, -242, 25, -475, -113, -158, 35, 22, 107, 478, 157, 143, -136, -32, -356, 61, -230, 83, 156, 36, 33, 153, -131, 11, -447, -110, -9, -28, 92, 205, 21, 15, 134, 16, -71, 77, -407, -103, 130, 192, 393, -151, 55, -313, -468, 135, -372, -141, 108, -92, 128, 163, -138, -125, -130, 14, -125, -7, -6, -61, -166, 139, 102, -6, -107, -281, -55, -185, 171, 73, 206, 308, -145, 98, -225, -121, -108, -275, 53, 318, -160, 205, 375, -15, -166, -155, -249, 185, 258, 30, 2, 183, -134, 78, -52, 69]
5356F9j76N6K25r3K15n3k06k05j26K13j8j81L18M3J0R3l5j00j85J32l43K07K43
5379A03k11O4M11j63l31O4Q6k60J05L70j00KJk18O1K34n99lJN72kk31J54K27k24
5404A13l45L38k95K01qk13J67K52j21k50R7R2k57K56j23L36j95L23k04k78K84
5425A70k24L2k52J79K27k91J70L81l47J57l02j72J11J45O4r3n7L36k39R7J9j15
5447dk53J40J29k39L53j4l4j1j71k94N38m37L89j3M5L44l35m2k73J66n8J23j22
5470g3j95N76k82n8L39m08j74K35k9j13K32R2O1k44j14M46l41J66j09j8l01M59
5492A47J9j88MJ79k39k07K10J22n8K91m8j98J66k20j62k2J53mj32K74L0k0k67
5515a70K81j60j30J01j13J35K02l9j02L88k87j52r2J13l2k26L08L8NJ67j23k27
$$ y = [69, -107, -51, 174, 81, 296, 243, 37, -168, -294, -81, -99, -280, 38, 81, 91, 184, 149, 49, -136, -4, -347, -140, 103, -108, -44, 367, 204, -127, -63, 23, -237, -132, 238, 138, 140, 141, -77, -16, 218, -381, -384, -383, 189, 187, -44, 110, 337, 113, -232, 106, -189, 12, 4, -209, -42, 210, 89, -161, -64, 28, -229, 27, -96, 240, 45, 368, 164, -114, 170, -54, -22, -274, -95, 132, -159, 11, 392, 45, 202, -100, -272, -161, -16, 48, -45, -102, 234, -5, 92, 111, -4, -257, -117, 12, -227, 126, 112, 78, 67, -104, -398, 140, -297, 92, 79, 124, 468, 133, 91, -182, -16, -74, 49, -73, -268, 308, 26, -32, 307, -101, -275, -40, -69, -182, 50, 142, 203, -41, -155, 291, -50, 116, 7, -11, -312, 147, 166, -22, -18, 161, -78, -285, -75, 47, -11, 280, 232, 34, 200, -20, -182, -204, -51, -55, -187, 87, 117, 97, -170, 111, -49, -179, -78, -191, -56, 146, 107, 5, 393, 106, -46, -138, -25, -57, -283, 25, 63, 68, 235, 112, -115]
5537a15J58j54M4Q8J91o5j60j34L16k12j18L11m37J78j78M91k34J16J15j5l21
5558a35p3K11j13J96k19J83K4Nk73j58K32J95k96J49R4O8j13K65l55K06O3k71
5580a15j84M54j37j23J11p0K94l98J72k77L24k57K12K3J15jj69J46J2j54k36L01
5602D3j35j02K02J87j29j27j88J80j9J9j23J37Q2K68r4m1j45j34R9L9j80r3M96
5625B42p6l10M64l65j71K23o2Lk62N33j57l9o9J86q8k78M06q7J70k62J11M6M1
5648A99k34k64J25R8q9J65R0K28l08J15j12o8l51O78l09N9L61l05j21J40j27k8
5670e8qJ78k83p1M05k09k3p1M2R3Q9l64K11K3p1K31k1J6lm24P1M1L24j0n0J54
5696B12l43LK2j41J42J57p3l27M87O1r7P9J99k60j57k59K71nL0J16l0l36K20l9
$$ y = [-115, 43, -111, -67, 21, 212, 147, -13, -147, 169, -43, -161, 150, -287, -109, -287, 204, -30, 86, 201, 186, -135, -208, 3, -110, 86, -133, 50, 74, 79, -194, -352, -120, 75, -221, -72, 22, 90, -23, 242, -113, 93, 156, -115, -299, 155, 18, -105, 6, -64, 230, -168, 4, -273, 51, -206, 6, 29, 144, 143, -26, 120, 132, -22, -258, 43, -92, -194, 8, 195, 66, -61, -249, -69, -88, -69, -192, -55, 27, 295, 201, 160, 15, -119, -20, 19, -161, -254, 242, 166, -144, 320, -45, -216, 7, -55, -52, -314, 219, 62, 23, -46, 140, 52, -226, 180, 93, 263, 1, 112, 158, 199, -35, -299, -174, -76, -165, 0, 90, 318, 10, 125, 13, -55, -406, 272, -37, 22, 383, 78, -43, 97, -30, -58, -66, 112, -171, -242, 163, -46, -69, -140, -98, -5, 84, -280, -69, -46, -117, 114, 93, 109, 106, -318, -247, -206, 118, 108, 58, 212, -131, -128, -106, -247, -105, 52, -21, -348, 139, 200, 103, 182, 381, 121, -36, -295, -24, -29, 1, 117, 87, -249, -29, -68]
5720f8l50N73n8l39K04J45O0K0k93n7r6J28L92m05L74m20Q9M5K36k88k98K04N1
5743a51j21K86K03m04M68m09L2M23o24M11J79k71j6M8L14j67j71n50M77j5ol01
5765c65L14K9l9QJ1l08L08k92J83J32j90L08L25k55k64m4m5K73j79J05P9r7J30
5788A27O0j07Kk05N8j30J09P1R4r9k11J77J21o7K5j3j45M8O1Q8K0m78L93J6j4
5813Am9M3n4P9N8J75ok32k29J92j2p5K81l1K3r7K04l60q1J72j85P5N1K44j67J12
5839A32J09L7j32m70J51K55q7J41m96O48l05l66L93j30J39l05K89M6J49l20J42
5860B0J63n2l07K07j98J61P0j95K06j74J54j67K9J8k34N58l36k6L14k34m7K7K30
5883A87m09K35N5N0K22l07rk09R5n2J11O6k22K38L6m3J92l96K95k54J03k42M08
$$ y = [-68, -418, 155, 97, -242, -38, 107, 167, 187, -106, -163, -259, -131, 261, -144, 230, -190, -101, -56, 180, -108, -406, -202, -151, -272, 14, 217, -187, 281, -128, -96, 327, -297, 114, 293, 22, 6, 54, 368, 201, 30, -520, -43, -58, -64, -365, -51, -22, -61, -53, -42, -350, -42, -334, -151, -19, -209, 99, 424, 169, -95, -139, -184, 89, -90, 15, 94, -3, 127, 187, 80, 82, -123, -65, -195, -86, -15, 79, -20, -231, -54, 67, 0, 25, 12, -133, -85, -24, 64, 84, -394, -1, 15, 1, -48, -5, -59, 20, 78, 253, 247, 15, -214, -22, -34, -109, 172, 141, 164, 67, 271, -89, -170, 2, -183, -108, -57, 187, 20, 132, 241, 278, 146, -324, -173, 82, -5, 136, -360, 288, -17, -383, 10, -120, 19, -286, 3, 49, 198, -122, 20, 183, 131, -176, 31, -167, -6, 64, -131, 75, -99, 55, -112, -83, -65, -299, 259, -77, -103, 211, -23, -70, -43, 187, -222, 13, 68, 118, 340, 33, 24, -185, -90, -142, -31, 35, -187, 51, 87, 44, 236, -160, 135, -119, -16, -258, 150]
5906A50m07L66R3o7J13n0k47j39K39n6P5R2p1l45L14j02N17o47R6R5j4J59k84
5929a20K78j14m6k71K76j07J80K10m29M41j82J56m08J40r2J50j07j30R8P1J2J39
5951A45j02q6J52l4j5o3P8k73J90r8j5R7M3j6j54K58j04L81j70j24k5m9q1P4R3
5976A02l11L22j3nj48L04n90J71J17N0r3l5OJ12J50n1q8P1k11J6mR2J5P6q1O8
6002D2L6k23o7K17j52L46j95O9jJ09l1l74NM36m18K16J96k61Q9j28K24n4n7n5
6026c1J30J88m61M21j84j8m5J7j83J62p4p1K23j38J90Oj58j88K37n8N5K08l29
6049a01K33J55l74j08P3k01M74l2j16j14K33j05j97J22K1L70l96N5J20k93J45
6070c6J42q4N6j96O2j71K61M7k08Q6P8J87j97P5P2k70k49K60j6J44K50k57Q8P2
$$ y = [150, -257, 109, 202, 135, 248, 198, -49, -188, 51, -5, 70, 162, 91, -254, 60, -42, 475, -172, -76, 19, 5, 164, -120, 158, 44, -2, -273, 3, -104, 76, 286, -143, 298, 116, 272, -136, 4, -88, 62, -45, -175, -77, -6, 6, 145, 43, -43, 109, 75, 60, -3, 75, -198, -8, -106, -121, -24, 19, 3, -151, 107, 3, 384, 214, 90, 65, 16, -65, 9, 102, -209, 113, 100, 95, -53, 251, -339, -168, -51, -1, -94, -129, -123, -11, 139, 88, 0, 71, -140, -124, -128, -36, -21, 55, -26, 42, 78, -145, -212, 5, -147, 199, 4, 73, 72, 181, 150, -224, -219, 217, -201, 15, 211, -50, 39, -89, 135, 81, 24, -31, 99, 287, -174, 247, 63, 45, 0, 17, -166, -4, -78, -149, 74, -64, 126, 132, -26, -214, 23, -35, 20, 228, -101, 132, 287, -87, -195, -122, -323, 151, 119, 3, -111, 122, 17, -180, -58, -37, 333, -63, -8, 112, -181, -36, 106, 22, 78, -118, -56, -227, 34, 81, -127, -41, 37, 224, 27, 102, 174, -96, -345, -85, -101, 43, 293, 36, 124, 196]
6094A96j97l8j03qj62L67K76l04J01j39j86J4j27M30q5m0K68L3k52J37k95j65
6116b79J54P1j89M1L73k38K32l1k90O1K07j02m7o7K83j41n9K42j80k67K83N4j38
6139b7J16O5j1j24Q9l6k22K59l05K96o1r1K5J53K66k77j6n10L10J11k0K87k52
6162B5j40J02O8l25N06n29K65P2j51J42J36m7j83r3O0K30k08r7K5L59k13M6K82
6185C32k76r3N8k18K53J6J01k45M34m21L7L9r2q5O8M2J24Jn9j68n6J4K01j12K09
6210A04Rj01M1l2rK3j82k08K65k19M13L8J5J47j60k49J63J17l17N8p9PP0R3K78
6235B85j15j74j75m6l9J43J49n1J27nj35j26Q8j82K85p1p5K56j52P1k91J61kl45
6259d19K02p5K56L14q1Q1p3k40J31n6n52L86K37j99J23K50K0k05k16k16K3J97
$$ y = [196, -1, -39, -142, -150, -312, 55, 331, 27, 128, -11, -197, -183, -310, 120, 35, -5, 263, 296, 44, 181, -114, -279, -125, -54, -243, -202, 171, -67, 165, 134, -156, -95, 112, 10, -37, -104, 179, 38, -21, 221, 41, -226, 57, 111, -27, 89, 154, 143, 19, 108, 72, -150, 109, -196, 100, 39, -52, -27, 126, 392, 115, 99, -411, -101, 10, -10, 277, 25, -115, -13, 55, -270, 236, -293, -28, 44, -107, 35, 171, 124, -59, -152, -92, 138, -70, -167, -142, 217, 4, 50, 332, 56, -37, 21, -197, 56, 72, 173, -72, 362, -59, -22, 17, -75, -160, -92, -50, 74, 75, 16, -152, -208, -194, 7, -105, 104, 113, 12, 53, 21, 12, 35, -147, -355, -90, -309, 104, 142, 157, 304, 144, -105, 58, 175, -142, -84, -163, -156, -86, 7, 285, 170, -4, -179, -225, -264, -121, 28, -23, 104, 99, -36, -162, -74, -256, 29, -42, -117, 139, -13, 58, -233, -72, -74, -419, -217, -292, -36, 278, 197, 278, 205, -35, 96, 40, -512, -126, 111, -88, 35, 285, 305, 100, -116, -332, -309, -112]
6281a12l2J81O6j82K39n9j60M6j09L0M0q9M34m4n8l3j30m20J69M7N5J3P9J65j5
6306A21J3l3k09j26Q1L6p5J87J55K1l16M1O3k1k23J96R4Q9J75j58L6N7l87p9K24
6331c8k04M98l60K80r4J32p9j79l22J70R0J68j81K04k4J85k81j48rP4Q5k9J55
6354I3J08m3O8m93L00k0k69J39J0K28r3O2K66ln09J16m53L36K2L10l4J7K7p7k62
6379a54P6jm4q8K49O8J32N6j63j25R4k90p2q7M20J80k59K19l05J80j09j66j74
6402c63L20K07k02L35j29j2k42O3l02R9K06k58L35l6j04K75M2j9m38R1R2r9R7
6425d2O7P8J26n0L1n95M9J97j38M6m3M57n0j97Q6j30j86J96K7j96K08J90n4J34
6449B11m48K35l29m3pL37J59k19K61j93j54j34K32j33O8J41j0J01o6J64j51j48
$$ y = [-112, -144, 37, 103, -79, 160, 101, -59, -13, -122, -92, -52, -141, 293, 249, 191, 158, 28, -392, -223, -176, -121, -108, -29, 136, 121, 134, 101, -108, -234, -153, -117, -192, -5, 150, 171, -145, -104, -41, -62, -285, -89, 5, 94, 269, 111, 147, 204, -183, -262, -38, -242, 256, -104, 176, 82, 214, 135, -44, -366, -196, -106, 62, -119, 85, 61, 246, -35, -183, -192, -118, -33, -62, 93, 201, 158, 226, -267, 33, 13, -256, -117, -107, 121, 28, 90, 356, 353, -156, -40, -493, -157, -135, 175, 141, 158, 185, 108, -154, -78, -79, -123, -211, 38, 106, 238, 294, 131, 6, 100, -190, -262, -349, 71, 251, -8, 211, -94, 86, -23, -189, -363, -43, 164, -38, 297, 168, 156, -86, -23, -325, -226, -20, -278, 57, 21, -83, 192, 234, 215, -223, -132, -40, -139, -42, 25, 103, 229, 179, 210, -385, -336, -139, -277, -231, -274, 183, 133, -64, 22, -108, -294, -98, -71, -267, -59, 131, 77, 211, -237, -2, -331, -374, -381, -44, 115, -104, 157, -36, -190, -324, -92, -225, -157, -16, -26, 75, 9, 173, 22, -126]
6471a26j0o5Q2K9J27J05K24j82k36k20J35k57K43rK01K15J54l79l9J03j24j35
6493a64j6mJ1K48M7J25r4k70N2L1k8j10j48L75P7R3k96K50j03r1ol44K50K82J2
6518A79o3K44M1m82l25L10J86r1j03L15k58K18L9m03n6M66n82K56K42mM0j62k8
6541b1j36j39K19Kk73J08L26J53Q8L0n01j43K63l95M48J3J35J6J46m0j63j24m20
6564d08N9J06J95o2J31J53J31k60p0r3k19L92k76M42j64K54L06n38k44J12l49
6585d02O7K85k64M65R0k60p6o6M38o63J33K55k4K14K89l47r5O0r9j83k75L05Q2
6608g1L18N0K48k93l56j4l50J55K48j0NL74Q4l46R8k17k07k7K1J50J78K09J89
6631D36l71K52l90l01J23J50L20k06J36N4j04J89j39l39M0M4j01J41L03l20K35
$$ y = [-126, -136, -201, -119, -90, 37, 142, 366, 184, -52, -272, -137, -394, -151, -160, 41, 256, 410, 31, -8, 95, -29, -164, -180, -184, -173, 75, 122, 247, 153, -117, -65, -34, -62, -172, -320, 55, 132, 225, -71, 179, 76, -15, -21, -365, -115, 167, 179, 116, 360, 401, -81, -406, -96, 90, -1, -104, 211, -47, 171, 210, -193, -249, 217, -365, -109, 133, 129, 169, 7, -21, -157, -296, -77, -75, -348, -240, 86, 239, 327, 357, -144, -287, -24, -419, 29, 42, 177, 193, 339, 299, 136, 12, -408, -349, -243, -48, -110, 21, 174, 305, 45, -25, -118, -337, 55, -221, 221, 57, 311, 617, 79, -165, -53, -402, -335, -50, -314, 151, 241, -19, -95, -161, 277, -386, -253, 2, -22, 192, 481, 134, 39, 99, 0, -183, -458, -153, -71, 247, 297, 545, 252, -104, -118, -468, -313, -65, -75, -70, 304, 388, 42, 140, -77, -284, -311, -290, -140, 38, 247, 436, 65, 317, -73, -374, -251, -101, 219, 13, 149, 203, 99, 288, 149, -190, -150, -106, -207, -66, 237, -83, 152]
6652A52K48j89l09l48n2M51Q2J85m0J2O7j25q7l36L80l19k00P04l37J26L0L4j10
6675A9j88j03o2j06P17N5j49R4n8m58M6p7J05k77L64R6K73n0p9K10k84j06k40
6698b58l5M49k44R4K90L3j10m42J52k73jN19J53q3j14M79p19M2l18K04r6L28k1
6721B9J32L97j12l93j68r5P3m46N93K33j17N05n52j16j14k50O2K44m0R8M53j86
6743B30m7n2o0r7n06M56p7J43O6O7L24n20J8j35J04j35j19J99L49M0J1j7j07l50
6767b15j39K21J24j41kL44M5L9k32j73O8l06K69n9J54K26o2J26n5l56k20l0M77
6790A03l71P7L65J06j33K7k59k38O9L6L9P2L63j16L73k35m84j4j32K32N3j49L48
6813A32K77kl34J09j78J17k44j8j35J13K27J16j49j4P5l77M7q6kk1M93j99M24
$$ y = [152, 400, 211, -98, -446, -498, -47, 35, 220, 180, 192, 259, 134, 47, -289, 91, -228, -428, 276, -61, 65, 95, 129, 19, -169, -272, -334, -440, 277, 332, 183, 277, 219, -239, -193, -270, -165, -442, -78, 18, 291, 241, 162, 372, 88, -18, -258, -293, 156, -88, 6, 296, 329, 219, -223, -71, -344, -345, 174, 327, 244, 130, 609, -110, -68, -386, -182, -278, 50, 29, 161, 558, 446, 53, -115, -210, -137, -583, 10, 243, 126, 631, 79, -37, -151, -401, -339, -95, -135, -37, 416, 230, 183, 131, 71, -26, -532, -76, -153, -10, 56, 123, 447, -73, -55, -190, -86, -221, -340, -141, 208, 248, 259, 242, 135, -215, -354, -133, -9, -150, -152, 192, 237, 276, 44, -129, -61, -367, -98, -157, -3, 223, 161, 287, 232, -124, -344, -374, 103, -268, -191, 174, 280, 147, 174, -85, -323, -254, -218, -179, -107, 256, 140, 513, 278, -206, -220, -352, -120, -67, -216, 132, 409, 407, 73, 182, 4, 121, -123, -141, -276, -163, 64, 180, 31, 17, 92, -285, -238, -324, -326, -347, 146, -53, 371]
6836C71j69k68k53K62Jj73K89K41j73K5r3k80K35k45J08j4J70K02r7J82n2j82
6858H7j83k90K92J75k06N53p3p2q3m3k09j0k42q0P1L71L91k07q5M7k93J85o26
6881e30K55L47j66N92k48m4j09j13j02o8k79J82M16j73L46j14k50j27J37l7j00
6902a85j2K05o4K25J48k75j2j20p5RJ20j60K07j2L54O3m02k68j80K39mJ83N1N3
6926H8J58P0k9l23p2k47o8L39J09J94K36l59J23k5k58j13J78j1L8O8J24k35L23
6949C08k75j05l03N87k98l0m2N69l61J01j40K0n03J16M56J83M4m16M29k31l0k38
6971a59k04j32J63J42K57K68j42k34L16m69j01j71L08J84m8L94j70M1n0l2j04
6992E7j71j31N8L14L2L93k62k86j20l09K55o5K88k1M4K24j13K83n38Q6k13J2j26
$$ y = [371, 202, -66, -319, -57, -56, -229, 60, 301, 128, 153, 60, -220, 15, -230, -122, -136, 34, 236, 139, 321, 269, 87, -96, -386, -94, 81, -125, 428, 355, 283, 200, 157, -52, -62, -304, -384, -313, 58, 449, 242, 157, 204, -89, 96, -530, -275, 72, -94, 498, 250, 206, 97, -16, -118, -186, -465, -283, 133, -40, 306, 192, -58, -185, -48, -85, -185, -197, 8, -56, 169, 317, 42, 30, -90, -165, -156, -36, -196, 11, -1, 353, 416, 14, -254, -434, -195, -199, -16, 35, 88, 246, 316, 287, -36, -108, -355, -423, -84, 25, 219, 455, 96, 219, 194, -64, -177, 1, -10, 28, 96, 220, -15, 308, 33, -72, -375, 212, -86, -116, -158, 411, 50, 151, 11, 31, -472, -356, 100, 283, 327, -89, 340, 109, 79, -159, -363, -495, -332, -190, 67, 335, 193, -41, 275, -194, -295, -466, -158, 26, -22, 372, 202, 243, 193, 161, 57, -114, -245, -187, 127, 159, 552, 290, 4, -116, -425, -170, -235, 53, 32, 76, 300, 187, 470, -68, 18, -195, -183, -309]
7015c09Q4P20j27Q7k81J17l26K8q2k66K1N56J24Pr5J07n45j52K43j84L04K29m8
7038B12M5k45K27n22M9L9jp1L17K84j79n3J13l12J01J5j61J23K28J5j99L07k93
7061C9k59L73k81m43L32L89q0j1K08K16o03M3n6j92Q9J12J37L0L16L5l76J23k83
7084a42k08J06J51L73N7L37l01l81L8k89j87L58q0K13OK83j70j8M0k22j22ok6
7107a90K40q2L10J95m20j31j30M6o1K28p2J49m0M04m25k28L82n07J69K24l05J75
7129f9M0LL46j12l57l05J07L38m2L8J81J35l32J44P6k02Nj80m4J84J44P1m68N36
7153B37j43l65N7J02J22RJ72oj23K97m05j17r0J1N8l39P93O8j4l37J53j71l2O1
7177bl65K06K67K75k61%j32k10NL00l42M4J61J48J80k23J38m94J29O4pp2K73O7
$$ y = [-309, -225, 495, 368, 455, 174, 291, -35, -7, -89, -355, -334, 222, 346, 353, 258, 365, -180, -332, -89, -273, 31, 260, 212, 257, 12, 239, -283, -234, -195, -196, -267, 50, 334, 155, 102, 215, -97, 4, 19, -142, -19, 209, 224, 25, 332, 39, -220, 153, -128, -571, -239, 150, 70, 59, 267, 483, -120, -77, -133, -325, -236, -124, 13, 43, 359, 394, 18, 141, -142, -350, -244, -93, 280, 337, 674, 373, -8, 30, -259, -446, -88, -168, 45, 51, 334, 164, 146, 186, -36, -158, -164, -190, 50, -32, 278, 473, 53, -78, -208, -162, -223, 5, -67, 82, 42, 446, 21, -207, 175, -332, -163, 61, -244, -69, -29, -26, 320, 208, -149, -454, -347, -9, -51, -13, 168, 303, -29, 115, 191, -11, -6, -186, -230, -46, 98, 169, -299, 237, 94, -271, -214, -112, 10, 19, 191, 185, 62, 359, -46, -163, -253, -242, -184, -523, 270, 338, 324, -13, 140, -31, -63, -2, -367, -161, 106, 381, 120, 120, -12, -222, -217, 83, -259, -215, -54, 94, 274, 51, 189, -305, -176, -112, -119, -191, 82, 149]
7201A49j09L67j24k85o3q0j86K08J36L11l49L32j39m67Q9o2p1L8L41O5k66L30
7223A65K94m78j21J58l24j39K42J94P3k5J2J49r4k76j80K31k2j40L46J85k38%
7245A2r4l4m72L61J45J53K67k21J78R5k88n1l08m8J91J3L83q4M2m12N01n40R4
7268a17M2j76L22k7K0K51O7l79l55J27J96l9n1L64n4m9J37k50j45p0j46K22o6
7291a76P5K18o0L5J65m18mQ4j21K00o5K49J36k53J74l41j49N6Lj85L59J3J57q9
7315F3R7J63l20j18k4j20K00L28J33j18p9j34j66l0m17K90J13K91J82k34j83Q7
7337DOj65K80m67L59O0J69j03L66l09j00l81J95k90K95J43j00K24J75J02n94R5
7359c6n06L8J83N14M4j95K66q8r1k74m6j83P4J79J25O1K05k55K36j81n7k59L06
$$ y = [149, 40, 407, 283, -2, -65, -145, -331, -123, 13, 324, -25, 307, 168, -299, -210, -272, -343, -305, 36, 101, -165, 165, 459, -19, -140, 18, -306, -445, -203, -9, 64, 39, 51, 200, 106, -170, -350, -119, -141, -281, 65, 250, 12, 12, -82, -116, -588, -227, -82, 71, 338, 117, 295, 390, 102, 51, -257, -305, -114, -101, 282, 198, 240, -172, 329, -211, -117, -75, -251, 71, 44, 64, 315, 382, 3, -352, -225, -29, -68, -119, 245, 191, 142, 279, 29, -116, -186, -332, -110, -176, -101, 117, 57, 92, 257, -161, -165, -81, -202, -2, -67, 182, 318, 65, 239, -102, -251, -195, -192, -377, -18, -5, 152, 63, 160, 323, 3, -115, -139, -259, -59, 269, 402, 284, 205, 71, -95, -125, -542, -252, -139, 152, 334, 100, -83, 4, 10, -155, 125, -342, 17, 77, 246, 143, 509, 200, 100, -281, -86, -376, -81, 62, -38, 186, 361, 463, -131, -36, -542, -504, -321, 193, 237, 42, 308, 220, 129, -145, -191, -374, -300, -121, 4, 65, 270, 15, 251, 70, 13, -246, 60]
7382F0j44L25m08K17N5J33o00J92p9K33j25L15J64j23q9J72l83j89O8O4L8K99
7404A95Jj17K38m27L24l73l15J48K56Q9L20M2j1j10l9j79l95J90K88J33n83M48
7426A23L86j87k27j81k29q3K62M9K18J41J19k96K72k79l37k27J9M87k73N06j87
7447G6J80j23j53k83p1K59k3K24j82L26k41J19J25j63j40k28K19K2K98j5j97J14
7469A43J10l80Pj09J05J12K15J21j86J46j18j66K2l81K73k99M64PR6k6j09q3n3
7492h9qRj19J69L64k26J70k2j83j40j21K6P0j9r7L00J94r5j69K8m30J70m17N33
7516a02M08k30J48j44N4m19R1K09k67P3J96J18K41j5p8k51j82J1k25M74j64J95
7538A41l0O7m5k45m2q6R7j0K32Q4oJ29o8l48j70J35j46K42K2K01K7M0j80j44J27
$$ y = [60, -84, 241, -167, 50, 105, 238, -362, -170, -249, -16, -141, 174, 338, 215, 126, 298, -85, -274, -206, -142, -104, 195, 196, 79, 317, -110, 214, -159, -474, -326, -70, 19, 339, 381, 370, 260, 221, 42, -353, -163, 125, 258, -325, 123, 509, 322, 95, -86, -315, -398, -136, -87, 131, 272, 391, 95, 367, 88, -249, -476, -457, 30, -243, 263, 76, 256, 133, -20, -303, -374, -115, -138, 86, -96, 230, -11, 108, 233, 70, -70, -298, -79, -57, 241, 226, 29, 143, 253, -127, -120, -229, -124, -12, 203, 324, 138, 284, 166, 0, 22, -359, -86, -385, 79, 86, 182, 156, 47, -36, -89, -97, -88, -207, -38, 326, 100, 270, 248, 65, -75, -196, -170, -100, -119, -216, 84, 278, 183, 14, 42, -388, -218, -635, -102, 306, 76, 224, 80, 134, -285, -194, 15, -252, -179, 17, 135, 376, 361, 283, 32, -150, -139, -364, 110, -54, 141, 111, 178, 133, -112, -154, -240, -143, -153, 79, 163, 157, 286, 218, -130, -300, -165, -311, -69, -47, 154, 181, 221, 41, -103, 24]
7563B4k96j46K43N64n45J47K42j77k04J80j38k46K85n8N2L84O2l14l57O85o39
7584b52O3%J01J10L08l13P9K3m2r7n80L91J34j74M54K44m74K60q6k23m79K70Q3
7607b00R9M16j20k05N2r5j26m1J37L57k98J34J28k59J95l4O5q36M28L5K07p3K68
7630B34j98K84m02J14m21J81R7k02M50K23m08K90j56Ql27L6oO2R6L36n9j27N7
7653A62l01J26k03q4k6O66l14L86k25O2m7k74j71J03kM8J21J03K70j81j10k68
7675a59J87o6k74J81Q9R7Q1J56j16k58O6p4l8o1K31J79R4j51j32K3o0l5o5J99
7699I4k6j78L54K32l86j15k1j28J75j14O9J62j69K15J22k73j87r3k81P68l13J79
7721H6qJ43l01L4j59L76n96L55K02k61J79L55K1m74j37j7j31L9M18l2j09K25m07
$$ y = [24, -272, -418, -175, 389, -156, -9, 233, 56, -148, 32, -106, -352, -67, -125, -73, 311, 373, 59, -298, 387, -252, -189, -189, -88, 22, 330, 17, 96, 119, 77, -20, -600, -209, -75, -249, 205, 449, -25, 235, 149, -74, -553, -283, -200, -101, 315, 195, -10, 42, -53, -179, -220, -83, 274, -24, 110, 238, -21, 174, 140, 205, -631, -203, -168, 39, -34, 234, 36, 320, -82, 32, -389, -208, -111, -313, 137, 360, -48, 242, 86, 94, -233, -197, -203, -141, -45, 291, 232, 105, 162, -139, -13, -216, -300, -326, 340, 26, 412, 187, 249, 202, -72, -243, -140, -142, -94, 27, 130, 400, 219, 109, -159, 28, -38, -312, -131, -42, 55, 136, 292, 176, -82, -16, -90, -128, -189, 42, 221, 315, 164, 32, 55, -5, -40, -105, 94, 68, -110, 244, 476, 90, -25, -46, -174, 1, -113, -44, 118, -51, 164, 286, 13, -174, -267, -548, 220, -93, 86, 78, 221, -80, -46, -205, 171, -425, -70, 132, -129, 50, 405, 426, -48, -185, -202, -333, -294, 124, 92, -17, 208, -199]
7744a99j07L9J89r9R3L92j55K46k96L0j58k75K06J96l14O9K95j04L14j09k17j75
7766a39K21j09l46M72j98K14J86q2k50k03J81j14Q8j09r5M15p9m9K4nk34J01r6
7789b06K06j94JK00K81n0K4m49p5K52k33K20J19K09m80K46j78J0J34m65L72J47
7811I1K35j81PN7j56j63K5J30j38j6M26r1j20j7j04j48K04l53K59K87j76L06k82
7834H2j01L45j60j61j68j16L10j13L9J16J32J1k47J51k88N1R8j8j4r4K92O6p0
7857A43r5O1j28j02J71p2J59j13J31k3j50Q1J1j34k20J03KN31j74K60o33J13j96
7880b74K94j38J01K15j59J49N2m18mJ93j20j4J41J39M6p5J76j36m06P9n6o3M38
7903A60nk16L44Q1k94j48j6l30J88O8K36j5q9J90o5n7k15J52r9q7L77j44J85j79
$$ y = [-199, -306, -267, -78, -177, -84, 308, 153, 399, 103, 133, -25, -300, -94, 102, -212, -143, 152, 48, 362, 253, 36, -139, 82, -27, -373, 99, -99, 115, 301, 219, -31, -234, -53, -167, -79, -188, -283, 132, 53, 4, 28, 23, -211, -110, -206, 0, -194, -193, 7, 288, 238, 262, -187, -262, -10, -243, -23, 96, 305, -175, 71, -107, -97, 37, -428, -56, 91, 326, 145, 152, 209, 53, -110, -85, 45, -93, -109, 317, 226, 106, 89, -15, -163, 41, -312, -53, 234, 58, 364, 82, -19, 326, 166, 5, -163, -279, 31, -82, -43, 73, 205, 216, -31, 120, -168, -117, -19, -37, -51, -145, 147, 213, 143, 48, 109, -19, -121, 50, -22, 137, 24, 155, 132, -18, 63, 74, -60, -280, -177, -175, 356, 182, 442, -191, -78, -274, 20, -118, -17, 198, 39, 188, 240, -178, -182, 11, -109, -123, 18, 157, 203, 128, 304, 168, -238, -159, -215, -278, 160, 155, -61, 283, 364, 70, -78, -94, -424, -236, -168, 68, 53, -36, 154, 89, 32, -183, -31, -130, -217, 160, 16, 201, 22]
7927B2J14k80j2Ml1j33L44L3J37R4%l54J65l80J62K09m3q6K50N1j37J64l90l3
7951a30J56m6k29K98M9R6j02J32k32k71J1L89k75K46j56K73j82k9r8o0R8k42K62
7974d2j19L91k06K62r4k97o1O1j25k3J90J02J45j99L23l57%J48k63J56q1N8L46
7997C15k65n3m7j09R5M4j3Q0J19O5n6j00j30K53j54j66l17M96Q9N5O1l9k32J86
8021A77m52L21m19L45J16p9J27Q1o2L6J1j24m19L54J96j43Qrk24K13P5k00n6k53
8045c80L00K95r0K33m57r9K69j77k40mL62J29l0J50j29j46k72J32N9K6J7J31R5
8068A74R0O7k83j3j54k1RO0k29O78m7K2n28K01j33J37P7j96J2J53l4J51j30j32
8092f9K85j72j54P3O9J26qJ6j1j52m2J23r5km9L69l44L59l02m01N10l72P5K1N
$$ y = [22, 136, -144, -156, -152, -183, -316, 28, 61, 198, 292, 292, -62, 103, -277, -115, 94, 51, -35, 215, 266, 129, 293, -97, -130, 26, -20, -249, 49, 98, 194, 92, 224, -8, -279, -268, 121, -154, 92, -64, 209, 27, -2, -100, -160, -62, -304, -42, -161, 230, 24, 286, 192, -105, -166, -105, -230, -253, -63, 39, 184, -15, 308, -49, -49, 99, -164, -8, -89, -31, 315, 50, -3, -50, -159, -64, -20, -33, 47, 166, 231, 175, 75, -55, 198, 44, -122, -439, 57, 146, 201, 262, 223, -9, 177, -275, 46, -373, -28, 88, 9, 136, 217, 155, 191, 202, 78, -341, 13, 209, 66, 74, 65, -159, 54, 129, -71, -127, -380, -80, 215, 125, 358, -99, -198, 71, -106, -346, -350, 12, 141, 111, 261, 132, -14, -286, -154, -95, -69, -52, 79, 174, 264, 331, 48, 35, -119, -140, -131, -71, -300, 378, 331, 353, -175, 26, -107, 30, 107, -89, -77, 76, 42, 193, 63, -69, 216, 44, -110, -37, 32, 158, 150, 166, 155, 3, -39, 84, -11, -13, -62, 307, -37, 322, 20, -381, 129, -243, -168, -147, -142]
8117a42J49J03K62l82K96k47q6l29K74Ll1K00N1Jj48j7K7J63k64NJ4J37l3L57
8141C63k46q8l10K5K79o5k8j2J27Q0j05L01m35j60O05l82L7J6j01J32K38j5Jl06
8165d9k89M3J78J23J19K2K69m70n7J25l25K64j2p9L1K12N9K21l87Q5o0k11j0J42
8189e6J20k1
$$ y = [-142, 7, 110, 372, -10, 286, 39, -47, -376, -102, -99, -130, 70, 121, 122, -26, -43, -16, 147, -117, -112, -98, 39, 6, 363, 117, 29, -281, -256, 23, -42, -70, -82, 45, 125, 20, 321, -114, -274, 331, -51, -14, 2, -99, 33, 271, 256, 257, -49, -338, -295, -117, 6, 125, 147, 416, -54, -111, 14, -311, -47, -59, -138, -107, 105, 164, 385, -2, 83, 23, -188, -198, -56, 64, 43]
8191D3
$$ Imaginary data points
##PAGE= N=2
##DATA TABLE= (X++(I..I)), XYDATA
0@%%%%%%%%%%Qj6J6j7K5l2M0n6O5p3Q9j11J34j60J86k12K51k95L41l92M48n10
32b71N81o61P43q35R41j059J186j322J473j640J821k018K234k469K726l008L317
49A739l654M022m431M885n385N945o577P290q104R046j0147J1454j3039J5009
63H053j7531K0894k5625L2826m5245P2508k40774J42387L04952l51640J40358
74D1163K34155k54366j85691K35019r6505j47634K29808O0057k45947J34443J68805
85A73307j90516N955J90393k77586k12120L06962P0438k45540K33302K87084k70068
96G1611j73205J67813j39054j60391K73239R0361k30436J20301J86106k36889
106c0544q5497K23324j03470j90903J77093L5061j98744J78036K51610j79297
$$ y = [0, 0, 0, 0, 0, 0, 0, 0, 0, 0, 0, 8, -8, 8, -9, 16, -16, 24, -32, 33, -40, 49, -62, 72, -88, 98, -114, 137, -158, 183, -209, 239, -271, 310, -351, 392, -443, 498, -561, 625, -697, 776, -864, 957, -1061, 1173, -1296, 1430, -1578, 1739, -1915, 2107, -2324, 2561, -2824, 3121, -3456, 3834, -4270, 4776, -5371, 6083, -6956, 8053, -9478, 11416, -14209, 18617, -26628, 45880, -194894, -52507, 252445, -99195, 41163, 275318, 20952, -164739, 70280, -26225, -173859, 55949, 116006, -129941, 4502, 173307, -17209, -11254, 179139, -98447, -310567, -3605, 66833, -178707, 54595, 341679, 71611, -101594, 66219, -72835, -233226, 40013, 130374, -100062, 20239, 206345, -30544, -116041, 107283, 3813, -187090, -9997, 25064, -173680, 4356, 255966, 76669]
116G6669r7656J45599j56763j96274J92155P5656j43690J77251J73520k68122
126b1655j09783K17647q9504j95485J87385R4589j91208Q3052J97536j37859o2337
137b7622J72560j00557k11106J02962N9830j16007J38016J73653j61812p2776
147d2859J39898j25327j81377J72529J08505j41269P1644J56059j35146o8383
157d5726J54625o4059j67585R6113M8172j41931P0810J69001q0819m3962J15384
168A10023r9328j70623J02794P6518j00970Q0869J52853j00358p5078J02976n7559
179B2117j32342Q9105N1615j20622L8225J32008o3646l6723J12407m5982j37338
190i1176N0649M1936r0904N5134J40385m5109n2306P2878m8687j21923M7216M7397
$$ y = [76669, -20987, 124612, -32151, -228425, -36270, 39386, -104304, 72947, 246467, -21655, -131438, 86209, -3295, -198780, -11395, 83194, -108014, -24962, 172574, 34715, -27622, 144938, 44381, -166725, -63763, -3933, -119940, 18076, 191729, 29917, -42859, 97039, -28288, -209665, -37136, 71369, -69900, 1744, 157803, 22657, -45726, 108899, 44840, -122745, -26632, 21540, -120391, -49581, 119420, 38601, -5361, 110023, 10695, -159928, -57134, 19384, -81586, -717, 152136, 51778, -23300, 79676, 22117, -110225, -21120, 30495, -90127, -51902, 80106, 16460, -20263, 92144, 46162, -91176, -40527, 1409, -89495, -34361, 106024, 60915, 8609, 81487, 32800, -89123, -41907, 5490]
202E490p6909L0200J02879m5830l7626Q6789j7620j01198L2984L2362q2289J8430
214e2338J09703j4402l1494O6911k2242j06207P623L0057n7831J6951Q9547j3447
226B2831k7479N8650r367p6155J6493K3710o0733O650P5678q516j7244O0306o529
239E8295q0043p66J4411n9161k95P7164Q319j8316M8217R670o0872j2365J4699
252a043l4381o791M4217J0609j35L4959k136m2966n591p300m8604n27N1064O834
266a791k057M9681J6279m8997j7583R455l2444k3227L3525K6175P27K0649J5462
279D5854k2055k3511j5087k5839r661J9972J5621J7036L4565J2674k0441j1510
291A7618j0884l4605j6858K1318J4858N845K9358K1444j9506k3495q569k3198
$$ y = [5490, -71419, -41219, 61660, 15830, -21796, 64993, 47373, -53825, -20841, 11521, -70768, -52338, 57365, 42963, 11469, 78380, 56138, -50069, -42446, -12389, -70220, -53269, 36278, 22831, -4648, 54002, 44635, -31520, -15027, 8683, -52050, -45400, 30278, 21762, 4518, 64824, 58295, -21748, -22514, -8103, -67264, -67559, 9605, 17924, -392, 47825, 57495, -3377, -15742, -1043, -35424, -42215, 2002, 12611, 12476, 47435, 45299, 2333, -3258, -10558, -59162, -59689, -8625, -1791, -3848, 45833, 62112, 13115, -4468, 4987, -27457, -50684, -17159, 9016, 9743, 30392, 45854, 23799, 288, -14799, -40638, -50299, -30327, -14706, 2330, 36895, 49569, 29128, 17618, 6734, -27871, -44729, -23411, -8553, -2708, 26650, 48094, 28588, 5093, -3476, -26674]
303b6674k5103Q489K7092J8790J8837K0660L976j7298k5926k2500j2271j476O596
316b6808K1586K8791J3512o911j0465j5000k6712k2663J051J9241J9930J9515
328A5067K2349J2036j3675k7828k0188j2382j3782K588K6280K4415J1381O794
340C3055l497k1717k3561j6265j0775Q428K6347K0244J4333J9806j600l1533k2601
353i336p908j8787p829K7466K5953P865J3626N054k3685k2619j0567j7022k268
366d0057K8637K0289O539K4648J0413l2245k4240j376k4065j9178K9028K7473
378E866M84J9554J8122k6869k5616j344j9924j5669L0534K3746k823K4205K2123
391E2389l1808k5333P160k5085k9899K8312K6173q527K3859L2343k7565k7468
$$ y = [-26674, -51777, -43288, -16196, 2594, 21431, 42091, 46067, 28769, 2843, -19657, -31928, -33404, -26808, -5222, 23569, 37081, 30170, 19705, 4705, -22007, -44670, -43619, -24378, -4448, 15067, 37416, 49452, 35777, 7949, -12239, -24621, -38403, -35815, -9535, 14880, 26261, 33055, 29558, 7841, -15720, -31985, -42760, -34332, -7985, 12259, 26592, 46398, 44798, 13265, -9336, -17244, -36031, -43860, -16394, 9559, 17424, 31050, 36104, 12419, -10200, -20767, -37789, -40057, -11420, 8869, 15408, 40056, 50469, 18224, -6016, -7392, -31457, -50635, -21607, 5866, 6350, 25904, 44026, 17157, -8459, -9803, -29727, -45396, -14862, 8884, 6061, 30266, 52389, 20581, -4752, 2408, -22677, -52576, -24264, 1909, -6618, 17241, 49584, 22019, -5449]
403e449P926k3194l0655L1324K9328j0233K3586L1814l3244k9251J6609k2280
415a3719l7569K8302K5810k0160K2004M3278k4386k6509K0183k3167m6191K5664
427b6460L1469j6597K4157M4872l0081l4211J9167k0972m5238L0193L2372k7319
439a8648J5404M7382k5816k6229L3908j6267n4839K2124K8428l2227J9411O1478
451E4109k1021l5334K5506k1552o0024K6159L9153k7495J6007N2991k9167l3503
463a4171L8407j1411n3801L0091K7766n0669R957O8456k0518l2227M5196j1854
475B5222p5387J2683L7751l2449J5485O7119j9675l7645L1891j4396n5920L3005
487a2316L3649m8920P295O0683l0936l2844N9973Q22p2971J2755L0477n1229M141
$$ y = [-5449, 2477, -20717, -51372, -20048, 9280, -953, 22633, 54447, 21203, -8048, 8561, -13719, -51288, -22986, 2824, -17336, 4668, 47946, 23560, -2949, 17234, -5933, -52124, -26460, 5009, -11588, 12569, 57441, 27360, -6851, 12316, -8656, -53894, -23701, 8671, -18648, -3244, 44138, 18322, -7907, 26001, 9734, -45105, -22981, 5447, -26780, -7369, 54109, 33088, -2246, 23260, 1708, -58316, -32157, 6996, -20499, -4492, 48499, 19332, -14171, 24236, 12825, -40976, -10885, 16881, -33788, -23831, 44625, 24107, -8120, 37076, 25222, -50165, -37482, 269, -32180, -16695, 50424, 30749, -6896, 24995, 10599, -45321, -12316, 21333, -27587, -20292, 40391, 9455, -23389, 36584, 37406, -35565, -22810, 7667, -43562, -39421]
500c9421P7212o004l0641L9532j5535p1952K0901L9167m1808R282O5677k9929
512A6481m3687M9919N310n9165K2700L0907n8876o774O5338j0945j9946N9053
524E0315n348p6499J3030K7375n7183R252Q5914j5453n0396M2653O314o5932J4406
537b1552M2792m0777q763M9616k0375k5044N8430R505n6706J5725J4320o9221
549e2050L45P9532j1715l3177O0243O611q2967L58M3734l4785m424N7469j5978
562A3196l6473M5279J0306n0731K1098K8504n8994j5597N2851j7280j9304P0589
574D3444J3789p2651M28K8428n0441q921O5422k045k7312M2598q09o0967J8935
587a0102L9950m6161j7346M6341j6760k8996N3372K0788m6223J2049K2097n8712
$$ y = [-39421, 37791, 31787, 1146, 40678, 25143, -46809, -25908, 13259, -28549, -19267, 46410, 16481, -27206, 22713, 28023, -31142, -8442, 22465, -36411, -43185, 22153, 11208, -8738, 50315, 44967, -31532, -18502, 8873, -48310, -39058, 46856, 31403, -18993, 23660, 29974, -35958, -21552, 21240, -19537, -28300, 21316, 941, -24103, 34327, 43832, -12874, 2851, 17171, -52050, -51705, 27827, 16112, -17065, 43178, 49789, -33178, -32820, 10914, -23871, -28295, 29174, 13196, -23277, 22002, 32308, -18423, 2675, 31179, -27815, -43412, 9439, -7841, -27145, 43444, 57233, -15418, -14990, 13438, -37003, -45924, 19498, 17453, -9859, 32739, 31930, -29037, -10102, 29848, -16313, -33659, 12682, -4078, -33074, 20298, 41086, -5137, 6912, 29009, -29703]
599b9703k3287N2448N231j4475M5943N606n6013O435K4380m4515q141N5100q895
612A0114l5673L5643J6734l6523J6203K7207m8164k4192L8460o654k0790M8379
624B0744K3672l8875k33J2001m7444j2506M9772j394k4378L6407J3840m1003N654
637c743K6052l2548j4121L3028j3879k7292L9636K5369k7626N888J6299m0974
649a3911k2220K9881k788j3586M0480J8749l5686j574J7274k8763j2883K9604
661D577n731k0529K8313J5679k5293Q817K1621k8913k2395J8203o755j5040L2982
674E536K2416k0714K035J2557k9576j8891K1561K9j1966K4382J3034k1008M502
687C897J6570k2246j5358J6303p065j6689K2224J8991j2090O057J4456k2869k1022
$$ y = [-29703, -52990, -542, 4689, -9786, 36157, 41763, -14250, -7815, 16565, -27950, -36091, 19009, 10114, -25559, 10084, 26818, -9705, 6498, 33705, -14459, -38651, -191, -6845, -27635, 20744, 44416, 5541, 5308, 17309, -30135, -42641, 7131, 5737, -18641, 17766, 31606, -9397, -3743, 22309, -10239, -24360, 8668, -5211, -32503, 7133, 32502, 4876, 10764, 27063, -13911, -36131, -6250, -9038, -22624, 17856, 36605, 919, -655, 16619, -12144, -25027, 4577, -1154, -21683, 6630, 22309, -2984, 5833, 27454, -1459, -23854, -5651, -12406, -27446, 5536, 27952, 7238, 9273, 21830, -7746, -26637, -5076, -5047, -17013, 7369, 20403, -605, 3897, 20467, -1779, -17137, -834, -7899, -24588, -2364, 16627, 4537, 10594, 25050, 2181, -18841]
700a8841J1039j638j0339K0394J7117j0917M25R764j7599j3472J0705l475j1509
713a8346J5166J3824q485N941J2906j4531j6504O104m860j2265J4706J7540m931
726F265J833J0195j2789j5845L709r24q493J0160J2880k784K917R040r096j1387
740d319K065n051r928Q749J2495j434N085J0043q444j3834M74l316q661O736J2505
755C165O61K966P883m861j1090j652l209p589L631R640K543M283P057l234q745
770A449l195m662p464L639Q537L083M501P603k570q927l171l303p426L60Q122
785c424M548L017O574N62o259n533m449n165r2M542M788N313O458k90n037l945
801A608m805o954j208N191M753M042N887K829m151n413m563n236k140K466M777
$$ y = [-18841, -7802, -9440, -19779, 615, 17732, 6815, 7240, 17004, -595, -14067, -3362, -6837, -18346, -3180, 10644, 2159, 8100, 21006, 6475, -10029, -3925, -8785, -21050, -6344, 11196, 6265, 8098, 18293, 5504, -10341, -6632, -7556, -16049, -5889, 6991, 4207, 7124, 16164, 7068, -4319, -2254, -7305, -17233, -8484, 4011, 2577, 7662, 17705, 9261, -4573, -4099, -7415, -16076, -9340, 3165, 3826, 6792, 14675, 9814, -1276, -2928, -6137, -13726, -10095, -455, 2088, 6371, 13428, 10194, 1449, -1746, -6408, -13872, -10233, -1696, 1387, 5888, 13491, 10921, 1994, -1177, -4480, -11906, -11546, -3424, 1124, 4141, 10715, 11277, 5018, -515, -4964, -10129, -10221, -5679, -891, 4422, 10880, 10590, 5553, 1608, -3197, -10151, -11359, -6168, -1415, 2627, 8514, 11343, 7192, 1779, -2784, -8020, -10160, -7694, -2917]
816b917N420N715J939k572l769n436o079k629K257M079N469M880L306p32m709
831D222n702m377l006N0L470N896N532K434L79l039n744n461k918r17L020N695
847d66M638L560J690k563o604m230k935k479K012O582M582K528L228j832o396
862A315m767k198l588J134O444M620K295L840n00o673m335j860m436m45O883M353
878B082J574N203J410p795m234j396n673j261P459M224J096N641J814p124m417
893a397k03n871k832P759L076j11O888L421p295l557N50p480m389P330L969m52
909e94P812M421p556m478J311p483n156Q265M109k362P344N414p627l376L617
924C661p774p171P260K813l100Q816P855p141l677K740r151q117Q219M391l385
$$ y = [-2917, 2503, 8218, 10157, 7585, 3816, -1620, -7699, -10328, -8071, -3992, 1477, 6357, 9663, 8931, 4222, -1480, -5857, -8863, -8813, -5343, 553, 6085, 8519, 8898, 5859, 115, -5346, -8264, -9181, -6161, -466, 4172, 7732, 9422, 6859, 255, -3975, -6910, -9389, -7377, -795, 3787, 6315, 9543, 7711, 1315, -3452, -5650, -9238, -8104, -1660, 2960, 5255, 9095, 8595, 1922, -2413, -4273, -8709, -9154, -2271, 2082, 3656, 8859, 10269, 2474, -1760, -3156, -8829, -10090, -2631, 1593, 2689, 8330, 10144, 3020, -1397, -1600, -7471, -10303, -2544, 532, 421, 7309, 10730, 3435, -122, 428, -7052, -11441, -4111, -142, -594, 7218, 11639, 4083, -395, 916, -6567, -11723, -3458, 651, -1711, 5633, 11047, 3420, 44, 3661, -4113, -11284, -4024, -1211, -4311, 4505, 12360, 5219, 1542, 4282, -4869, -12986, -4767, -376, -3761]
939c761Q316P595q656l594M236o923q039Q019K341o013P333R662o479k257O149
954G929q592j1360O571K979n260R707J1588q193m526N276q623r965Q813M464p234
969f426O900R730q408k218R022o338j1847O599J393r159Q132J3263n303k286P457
984A0511r544j3623P166M298p300R011J1623r166m162Q552o214j0196Q384K551
998A891j1947N079J2197n467j149J1748o398j4399M188J771r941Q322J5321o013
1012E203l828Q148p774j2945Q725M594j0253M828J1029q021l005J3121l046j2048
1026e272N579O01j4027M583J4859l517r92J1415o601j5357M204L485r393O419
1040d014J3187o823n025J0660l651j1245Q307L220j3495J023J1234n170q15J4605
$$ y = [-3761, 4555, 12150, 3494, -100, 4136, -2787, -10826, -2807, -466, -6479, 854, 10516, 4037, 1780, 7929, -663, -12023, -5452, -2473, -7733, 1974, 13562, 5369, 843, 6119, -2504, -12469, -3656, 808, -6426, 474, 10204, 1796, -422, 8600, 2262, -9585, -2986, -1593, -10752, -2620, 10643, 5340, 3054, 10511, 967, -12656, -5490, -1192, -8492, 519, 12142, 2976, -1186, 7366, 1152, -9044, -660, 1891, -10056, -4977, 7220, 1753, 604, 12352, 5954, -8445, -4257, -2486, -12427, -4105, 11216, 5203, 1375, 9523, 1749, -11196, -2471, 2123, -8130, -3302, 7727, -294, -3299, 9822, 6776, -5272, 307, 908, -13119, -8536, 6323, 2806, 1814, 13229, 6628, -8729, -4525, -1040, -10433, -4014, 9173, 2350, -2675, 7985, 4334, -6911, 1396, 4616, -8879, -7856, 3378, -1792, -2607, 11998]
1054A1998j717j3671K675J93j2249M107J4935l212k670R986m702j3192O000M852
1068C333j0553K265J0457p220l740J2727L84r688N826M71j4535m42J2181l274
1082a808J08J3383k084j3171K379J832j0412L526J2187n252m396R933j145r057
1096c977O034M051j1351j840P639n124j427J3526K204q781K251K9j2383l11J0802
1111A342j707j582J0053j185j0119K812M203q584j19P448n194l674R742K427n481
1126C82M231K380j1604l556O157k505j39J1082K057q132J322J649r325q60Q098
1141A237k155l275P534J069n750M278L349p689k807L636m209k320R594L458l839
1156B111K681R43r473l253N790j803j463P955K106n497J627K949o144j921L721
$$ y = [11998, 10281, -3390, -715, -522, -12771, -8664, 6271, 3059, 389, 10375, 5673, -7519, -1519, 3333, -7220, -4955, 5502, -1718, -5458, 7269, 7653, -2035, 3791, 4262, -10273, -10715, 1466, -1808, -1700, 11683, 9599, -3572, -1193, 639, -9773, -6247, 5940, 688, -3708, 6225, 5080, -3977, 2057, 6108, -5243, -7083, 556, -4568, -5995, 7531, 9735, 954, 3205, 3234, -9149, -9460, 1342, -365, -1947, 8106, 6921, -3198, -386, 3817, -4767, -4886, 2562, -2632, -6306, 3436, 5863, 382, 4613, 6993, -4611, -8167, -2010, -4515, -4654, 6428, 8485, 353, 1675, 3324, -6001, -6861, 1237, -918, -4193, 3341, 4410, -1340, 2938, 6287, -1402, -4209, -573, -4782, -7102, 2492, 5950, 2111, 4792, 5735, -3738, -6991, -1201, -3004, -4467, 3488, 5594, 97, 1724, 4673, -1471, -3392, 329]
1171C29k926l167N346L444k294L376K313o605l882J929k910q06P502L052l018
1186A683K007J705o514k668L564k098k454M429K961k464K149L095l870l181M37
1201a219k380j533L665L079j8K902R23m756l143J223k333j765M586K708j666K326
1217B599K325l499k892J411j783k945K049L160N79J905K192k497k637r66k079
1232c078j955K875K191O99K109J270k152j862r4j958k279K251K106l44J985K697
1248D461j350k483l48j751k743N00K550J223J692J721n56j352j679k048j039N95
1264b607J135R28K205K118r95j577j51j871k850L30J619Q71J435K106P01j428
1280A969j485j190j871k34K62J629J933J487M32o65r72j709k269m67J134M46J330
$$ y = [329, -2597, -5764, -418, 3026, 732, 4108, 6421, -184, -4066, -2137, -5047, -5853, 1649, 4701, 1683, 3690, 5395, -1119, -3787, -223, -2321, -4775, -346, 2615, 151, 2300, 5395, 1525, -1656, -1219, -3599, -5132, -1467, 1612, 1594, 4496, 5419, 663, -2480, -1257, -3590, -5355, -769, 1939, 273, 2599, 4924, 1425, -1467, -56, -1839, -4784, -2735, 425, 1004, 2909, 5101, 2604, -33, -999, -3078, -5033, -2158, 33, 732, 2841, 4111, 1959, 97, 3, -1955, -4234, -1983, 123, -221, 1764, 4461, 3111, 628, 280, -1471, -4214, -3714, -1164, 59, 1751, 3472, 2916, 1564, -115, -2163, -3202, -2607, -1472, -544, 1661, 3779, 2784, 1207, 1056, -815, -3665, -3335, -1716, -845, 590, 2696, 3397, 1969, 484, -706, -2577, -2811, -2549, -920, 1013, 2500, 2932, 2267, 1295, -414, -2683, -3150, -2016, -1570, -240]
1297b40K287J255q74q91j625j445j315M44P66J657J800R38m31k62j562k328q66
1314b692K2M78J479J901J386J49p03j131j530j363o33O80J528J286J057P33k35
1331B412j433j855j163n44j27J233J946J374J013k41q81j494j750r58j18J035
1347a551J329J531J150K98j590j130j313j185o26J217J757J215J247N58q66j399
1363F42j398j297o83Q47J105J120J997N93j121j129p28k030j185J369J103Q91
1379I6J795J286o30j432j180j414j509L16J462Q15J734J459n88r87q91j807j774
1396c249J127P76N07K296J690r96r51q5k018k199R32J023m54J852K989n12j213
1413A515k16j374k812j38J331M37K185K280k67j085j49k409k325J042N29q56J861
$$ y = [-240, 2047, 3302, 2428, 1537, -88, -1533, -2848, -2404, -1638, 19, 1819, 2757, 2326, 2064, 502, -1826, -2692, -2670, -2192, -713, 1188, 2574, 2723, 2020, 889, -641, -2004, -2637, -1957, -429, 857, 1914, 2647, 2412, 979, -876, -2039, -2583, -2710, -1477, 469, 1843, 2856, 2615, 1734, 240, -1510, -2468, -2586, -1551, -222, 1309, 2459, 2757, 1167, 37, -1276, -2461, -3087, -1870, -113, 1102, 2349, 2907, 2041, 642, -756, -2053, -2736, -1889, -784, 336, 2333, 2926, 1805, 676, -52, -2082, -3267, -1898, -795, 96, 1891, 3177, 2547, 1115, -65, -1479, -2988, -2672, -1210, -395, 1339, 2798, 2210, 1223, 332, -1475, -3249, -2122, -1346, -839, 1457, 3147, 2151, 1200, 1115, -903, -3102, -2170, -1147, -1601, 251, 3240, 2728, 1515, 1299, -75, -2887, -3025, -1694, -1257, 928, 3208, 2941, 1856, 1707, -702, -3027, -1985, -1456, -2312, -451]
1430d51L227p83r44J464j725l643J54J120p85J694L985m09j146P61j987l645N18
1447b595J172p04J515K753o41o45J675j501l117P76j69j919K113L835o07m29K423
1464C935k105m571j89J656k282J931M353o56r90J076j061k917N77Q56k297J292
1480a392K988j218N2L702j609m354O26M64l583J107M923K45o53K261j462m334
1496b237O46J228j985J245L119j323j066L227q01l292J359M75m251p3M079J18
1512D68M7M080j082m388K8l6l090J554M595r84j187L150j482l851J792J479l544
1529b451j72L107j420m82M666P44l845J326p22m968N14M237l21p9M080j197m702
1546a685J088P64l157P80L944k305j159L806M38k488J751P70m951q91K613j148
$$ y = [-451, 2776, 1993, 1049, 2513, 788, -2855, -2701, -1581, -2366, -672, 3313, 2904, 1758, 2519, 532, -3113, -2595, -1423, -2127, -612, 2141, 1500, 855, 2530, 1029, -2088, -1312, -1481, -3400, -1287, 2548, 1941, 1512, 3935, 1830, -2741, -2930, -1274, -3556, -1625, 2728, 2072, 1082, 2158, 1097, -1820, -1243, -387, -2684, -1392, 1596, 378, 430, 4132, 2523, -1831, -1205, -741, -4324, -3217, 1706, 1951, 1298, 3559, 2097, -2237, -1591, -363, -2348, -1103, 2016, 693, -373, 2854, 2053, -1239, 120, 595, -3656, -3729, 350, 468, 515, 4595, 3513, -875, -847, -883, -3973, -2419, 2176, 1192, 5, 3155, 1673, -2178, -386, 1093, -2451, -2623, 484, -936, -1418, 3248, 3992, 147, 1473, 751, -4217, -3703, 534, 213, 134, 4214, 3017, -1685, -597, 167, -2990, -2210, 1734, -571, -1730, 2076, 2514, 26, 1777, 2547, -2404, -3295, -682, -1830]
1562a830K05N515L4m011R02m63m290O57M122q20p08L427o23l418K265J537l771
1579a270n87J967k010j447M844J183j953J751l32n273p95L122p45K9M769J99l562
1596a10Q44O83l569M24K705j998j572L263O51j702K772R82m294j337J522k256
1612b992j17N195J058j910J558m86m566n76K668j104r97L414M12k413K187J184
1628B515k764m93R84k347j380L624J507q76K452M92m746j216J581j846l58L955
1644A084J327k542J765K07k905j32J739j450j729K232J034r31K569J160k781j047
1660d00j9k680m50L548P62m46K512K12l687p97J797j788j263L063K93p46J523
1677A434J140j973k77k65k080j115J487J520L07K510L93k351p39Ok537k24K647
$$ y = [-1830, -1625, 3890, 3924, -87, 815, 352, -3938, -3281, 841, 21, -687, 2740, 2117, -1301, 964, 2501, -1270, -1857, 110, -1900, -3347, 1497, 2680, 727, 2478, 2146, -3127, -3922, -800, -1545, -1516, 3253, 3452, -110, 734, 1417, -2152, -1728, 977, -1021, -2593, 670, 1321, -381, 2391, 3373, -921, -2258, -736, -2992, -3109, 2086, 3144, 1234, 2792, 2306, -2260, -2836, -168, -1272, -2269, 1145, 1557, -856, 1331, 2515, -249, -742, 242, -2105, -3485, 139, 1646, 770, 3222, 3714, -1032, -2248, -667, -2513, -2871, 1084, 2411, -131, 1634, 1841, -1064, -1196, 543, -907, -2636, -404, 630, -301, 2268, 3428, 647, -400, -419, -3099, -3549, -1, 761, 315, 2827, 3039, -648, -1445, 352, -1436, -2699, 364, 657, -89, 1434, 2574, 601, 324, 59, -2021, -3136, -1649, -129, 178, 2688, 3081, 730, -9, -3, -2540, -2764, -117]
1694a17R70j084J846R46k219n90L89j455j372J284N08L81J849J063q92m63l93
1711F51k514q10J949O10j56K132Q08j877n55k89j503p45J448J84j68K165O13p11
1729A232k95O5k045j245J061N91R1J315J471p10p78p19j372m26K36M75K00J859
1747A006Q11p71P6jj383j609P64L02l35J555J377n1p60m12q86j241K48l78J083
1766f05J474P48l90Q8k79j213q63L73j98j7R09J002J17j16j99q03j121l82j02
1785a577N82J111O10N14K93p8j220j197k32J03m14Q74J226O54m7r2p54q99l96
1804i39n11L09R42P82L80P58j66j435m48k25p71o2P45O18N95N70k57m63l42q55
1824g75m05L49L67L51R22M85j03k59q47m14o80l57M57P46K36N44N87l56q01o13
$$ y = [-117, 853, -231, 1615, 2561, 342, -248, 141, -1314, -2686, -1402, -894, -513, 1336, 2399, 1507, 1044, 651, -1863, -2673, -724, -114, -270, 1862, 2670, 793, 238, -51, -1554, -2299, -851, -667, -835, 1330, 1943, 1232, 937, 1002, -1043, -2288, -1227, -636, -545, 770, 2241, 1531, 753, 34, -1338, -1764, -1528, -1053, -853, 1006, 1817, 1046, 1122, 1121, -262, -1871, -1107, -805, -1140, 415, 1792, 1741, 981, 569, -317, -1558, -1310, -1688, -605, 869, 1617, 1227, 1315, 1036, -177, -1040, -667, -865, -882, 27, 1029, 1146, 1030, 831, 28, -1093, -1475, -1577, -995, 116, 726, 1240, 1533, 1455, 235, -962, -1194, -1091, -1505, -631, 595, 1249, 1202, 1110, 356, -543, -939, -1450, -1141, -199, 583, 963, 1721, 1555, 120, -328, -553, -1324, -1386, -641, -23, 572, 1142, 885, 422, 80, -775, -1180, -831, -464, -113, 809, 1294, 1191, 932, 85, -329, -1009, -1366, -909, -163, 73, 617, 1204, 848, 47, -566]
1844e66l00j14n6P55Q39M54J43k92k67n98r21m63N04M11L58J005M66l51p52m48
1864a93n89m52K32N35N24P03M90k70q3j028o91j17k56K93Q28P36K27L75o60m40
1884A64o53o44K54K13L58P23Q30j42j54m09q02r49k64M38O19L18O95O85m35m91
1904C54p50k85j63r9L58Q10N92K42mK05j236j125K78k6j90R39J000K09K0j25q32
1925A72r50j81J27J03R87M60K36m5j21q29n62J12m03j07M96J167oK09N37j079
1945C23r30J81k36o42J048R20j27K05K31n94q10l23Ql32P74P63j31K88P27q52
1965D91q64P4k17r33O17J126K73r7N91m34j099J3k81l13O72R86m86K43P56m22
1985F96o44J62n38o97L7J239m67O82J080m19r22l88k92j172J158P58r7O97O94
$$ y = [-566, -866, -980, -1036, -281, 558, 1012, 1155, 863, 596, -2, -923, -1386, -882, -471, -113, 892, 1358, 1007, 255, -193, -782, -1234, -1002, -467, 57, 760, 1250, 980, 897, -131, -822, -939, -1195, -902, -74, 662, 889, 1264, 604, 164, -489, -1133, -879, -666, -308, 415, 1245, 1103, 949, 540, -262, -1211, -1475, -1037, -418, -100, 595, 1280, 845, 354, -396, -681, -844, -943, -585, 225, 817, 1059, 1055, 1260, 24, -1101, -823, -849, -1039, -100, 900, 1109, 1129, 1004, 172, -778, -959, -832, -729, 258, 718, 954, 909, 788, -41, -603, -491, -894, -1001, -505, 662, 656, 865, 1402, 323, -607, -426, -662, -1304, -256, 664, 537, 742, 973, 379, -431, -754, -746, -1078, -304, 459, 328, 616, 1343, 491, -373, -299, -516, -1449, -832, 294, 567, 470, 1061, 627, -472, -459, -740, -1053, -381, 605, 119, 362, 1118, 696, 52, 214, -324, -1021, -984, 255, -212, 470, 1550, 1131, 209, -179, -471, -1643, -485, 273, 176, 873, 1567]
2004A567q69r63N59m50r54N10O35m34J72J122q4o32J91n51j155L17R55R5K82J117
2024A430m63r06J9m64p50M52Q18n25K41O37l54k78P69m15j116P6M72m57L71J682
2044A239j99p98J61n34j269L85J038J9J95O12j78j046R30l51r76M28L53n67q6
2063f44J324M5m49P55n38j400q4K36j4L18J568l53p57P80n68o60K09N97o18k45
2083d98J226o92k37P79J21r10k69J68p53L76Q51N28k84J08j34j073l9N25l35M07
2103a35O93k59m01N60J46r89M72J4n73k86R30j55N7Q00N0q92l96j21m07K04J185
2124D97J38m33O34l51q45K73J13m93q1N59J7j2O34L27p73m7o0q43l17R19M87j58
2146A85O21P4j224J26K35q52N02M55o6l51Q86j86k46RJ91r56k80L92M4J9J037
$$ y = [1567, 698, -265, 294, -156, -1110, -600, 35, -399, -227, 895, 811, 179, 370, -181, -1336, -1019, -64, 31, 313, 1430, 967, 61, 80, -384, -1134, -682, 136, -389, -148, 489, 135, -143, 626, 211, -905, -829, -357, -814, -443, 1239, 1040, 242, 403, -131, -1400, -1015, 23, 42, 237, 849, 671, -375, 555, 204, -772, -344, 9, -558, -644, 680, 725, 276, 1031, 493, -907, -991, -755, -769, -451, 1117, 764, 7, 787, 219, -441, -232, 365, -253, -498, 728, 36, -201, 578, 699, -211, -480, -312, -1065, -689, 162, 690, 406, 514, 380, -693, -732, -207, -542, -135, 558, 299, -102, 458, 604, -385, 87, 101, -472, -758, 172, 17, 74, 874, 924, 32, -364, -485, -892, -688, 497, 635, 202, 836, 485, -360, -87, 26, -467, -548, 11, 28, 16, 650, 977, 204, 157, 97, -746, -1063, -144, 343, 185, 806, 880, -344, -218, 17, -835, -333, 122, 56, -295, 591, 405, 159, 168, 359, -597, -877, -485, -441, -422, 615]
2167F15K56n29k71q8q62J09Q15j10n8L43J77j35J2k27m21n5M08k65k27P37K81
2188E05k42J33k02n51n0Pj1L44M69L59o69k06N47q50J7J61J42m57P23N04m64J09
2210C18O5l85p51O73k59j6N86K74N0j88O7n55l82O1J73j7M12K88m03L71K5j29
2232B78n44J5p4j57K48N31J15q6J77m72j50k43QJ25M36j58K13N2M08m94l24l3
2254a29n45P6M16K43J24K15J29m23n9j85j84p1J34M98j18K40J88m95N3l99J87
2275a05k18J46j8L44J7K60r1m3j61j25n23%M31J2K41L33n99L20k03k24l73J96
2297c83K56N8M08L5P7m69K77m45k50J00J78j77M22J58K41l84N3l83n9j56K41n0
2319b52K28M54J6m68N3j55K0j15n3M19j38P8L49j13ll13j4l00kJ8K89L31j09K41
$$ y = [615, 871, 342, 71, -17, -879, -770, 45, -65, -123, 220, 397, 262, 274, 47, -374, -429, -21, -286, -513, 224, 505, 263, 396, 194, -357, -407, -400, -411, -67, 402, 761, 92, -114, 433, -417, -400, -239, -97, -554, 169, 673, 209, 318, 383, -2, -753, -80, -339, -355, 231, 505, 555, 367, 434, -121, -503, -442, -269, -286, 126, 414, 11, 382, 407, 278, -266, -251, -325, -482, -234, 297, 412, 326, 503, 31, -119, -362, -354, -229, 207, 49, 262, 314, 722, 228, -96, -129, -674, -598, -182, 61, 185, 400, 529, 106, 47, -138, -322, -393, -259, 239, 121, 361, 549, 54, 107, -292, -105, -323, -177, -195, 149, 166, 426, 335, 292, 131, 6, -517, -517, -86, -74, 167, 500, -99, 221, 18, -206, -579, -383, -127, -69, 339, 374, 451, -18, 259, -186, -436, -336, -158, -335, 87, 245, 486, 102, 155, -228, -287, -443, -202, -252, -24, 430, 446, -22, 31, -124, -104, -219, -272, 147, 9, 87, 436, 323, 320, 7, -7, -307, -309, -291, -2, 329, 220, 461]
2343D61m83J24l32Mj16r0K89L84K0l7M74m81l84n5l34P6J75K74K74L56k60j77
2365A62k83K0k34n7J14K57L40j97L90k02k14k55k41N4j25K20M42J16K5j6l05k72
2387b61j42n9K82K10L03J43K05k19l83k65j38j05j17M94M64r4j6P1k13j62m31
2408d33J80k38M16lL87K06Q0Ko71L9m47n3L76K52J27Q8J68j93l71j64K58n52M3
$$ y = [461, -22, 102, -230, -226, -342, -432, -143, 241, 261, 224, 698, 217, -167, -222, -556, -480, -305, -31, 243, 599, 339, 162, -121, -101, -335, -392, -278, -21, 319, 122, 512, 310, 96, -159, -400, -346, -471, -251, 191, 307, 332, 316, 11, -261, -403, -462, -180, 30, 333, 476, 681, 462, 79, -186, -324, -429, -546, -52, 412, 318, 302, 373, 160, -2, -433, -253, -491, -75, -78, 309, 515, 595, 597, -74, -35, -482, -535, -159, 93, 220, 308, 476, 283, -88, -252, 6, -546, -503]
$$ [...]
8191A01
##END NTUPLES=NMR FID
##END=
