##TITLE=1H_DE-84_ext4
 200.13MHz,D2O,
 8 sc
 
 14.3.2025
##JCAMPDX= 6.0         $$ Bruker NMR JCAMP-DX V2.0
##DATA TYPE= NMR FID
##DATA CLASS= NTUPLES
##ORIGIN= UXNMR, Bruker Analytische Messtechnik GmbH
##OWNER= pz
$$ XWIN-NMR		Version 3.5
$$ Fri Mar 14 13:59:33 2025 Russian Standard Time (UT+4h)  she@DPX200
##.OBSERVE FREQUENCY= 200.1313
##.OBSERVE NUCLEUS= ^1H
##.DELAY= (6, 6)
##.ACQUISITION MODE= SIMULTANEOUS
##.ACQUISITION SCHEME= undefined
##.AVERAGES= 8
##.DIGITISER RES= 18
##SPECTROMETER/DATA SYSTEM= spect
##.PULSE SEQUENCE= zg30
##.SOLVENT NAME= D2O
##.SHIFT REFERENCE= (INTERNAL, D2O, 0, 14.3821)
##AUDIT TRAIL= $$ (NUMBER, WHEN, WHO, WHERE, WHAT)
$$ ##TITLE= Audit trail, XWIN-NMR		Version 3.5
$$ ##JCAMPDX= 5.01
$$ ##ORIGIN= Bruker BioSpin GmbH
$$ ##OWNER= she
$$ F:/spectra/data/she/nmr/H-C/1/audita.txt
$$ ##AUDIT TRAIL=  $$ (NUMBER, WHEN, WHO, WHERE, WHAT)
(   1,<2025-03-14 13:58:13.93 +0400>,<she>,<DPX200>,
      <created by zg, POWCHK disabled, PULCHK disabled
       configuration hash MD5:
       00 E9 B6 7A A2 85 ED C7 34 08 36 98 17 FE 4E 26
       data hash MD5: 16K
       9B 07 9B 98 64 06 B3 B6 2B 82 03 A3 C7 AB 64 FF>)
$$ ##END=
$$ 
$$ hash MD5
$$ 4E 09 91 8F 8E 93 04 F4 97 48 86 0F F7 59 4F 9B
##$RELAX= 
##$RELAX= 
##$RELAX= 
##$RELAX= 
##$RELAX= 
##$RELAX= 
$$ Bruker specific parameters
$$ --------------------------
##$DU= <F:/spectra>
##$EXPNO= 1
##$NAME= <H-C>
##$PROCNO= 1
##$TYPE= <nmr>
##$USER= <she>
##$AMP= (0..31)
100 100 100 100 100 100 100 100 100 100 100 100 100 100 100 100 100 100 
100 100 100 100 100 100 100 100 100 100 100 100 100 100 
##$AQSEQ= 0
##$AQ_mod= 1
##$AUNM= <au_zg>
##$AUTOPOS= <>
##$BF1= 200.13
##$BF2= 200.13
##$BF3= 200.13
##$BF4= 200.13
##$BF5= 200.13
##$BF6= 200.13
##$BF7= 200.13
##$BF8= 200.13
##$BYTORDA= 1
##$CFDGTYP= 0
##$CFRGTYP= 5
##$CHEMSTR= <none>
##$CNST= (0..31)
1 1 145 1 1 1 1 1 1 1 1 1 1 1 1 1 1 1 1 1 1 1 1 1 1 1 1 1 1 1 1 1 
##$CPDPRG= <>
##$CPDPRG1= <>
##$CPDPRG2= <>
##$CPDPRG3= <>
##$CPDPRG4= <mlev>
##$CPDPRG5= <mlev>
##$CPDPRG6= <mlev>
##$CPDPRG7= <mlev>
##$CPDPRG8= <mlev>
##$CPDPRGB= <>
##$CPDPRGT= <>
##$D= (0..31)
0 0.7 0 0 0 0 0 0 0 0 0 0.03 0 0 0 0 0 0 0 0 0 0 0 0 0 0 0 0 0 0 0 0 
##$DATE= 1741946293
##$DBL= (0..7)
120 120 120 120 120 120 120 120 
##$DBP= (0..7)
150 150 150 150 150 150 150 150 
##$DBP07= 0
##$DBPNAM0= <>
##$DBPNAM1= <>
##$DBPNAM2= <>
##$DBPNAM3= <>
##$DBPNAM4= <>
##$DBPNAM5= <>
##$DBPNAM6= <>
##$DBPNAM7= <>
##$DBPOAL= (0..7)
0.5 0.5 0.5 0.5 0.5 0.5 0.5 0.5 
##$DBPOFFS= (0..7)
0 0 0 0 0 0 0 0 
##$DE= 6
##$DECBNUC= <off>
##$DECIM= 32
##$DECNUC= <off>
##$DECSTAT= 4
##$DIGMOD= 1
##$DIGTYP= 9
##$DL= (0..7)
0 120 120 120 120 120 120 120 
##$DP= (0..7)
150 150 150 150 150 150 150 150 
##$DP07= 0
##$DPNAME0= <>
##$DPNAME1= <>
##$DPNAME2= <>
##$DPNAME3= <>
##$DPNAME4= <>
##$DPNAME5= <>
##$DPNAME6= <>
##$DPNAME7= <>
##$DPOAL= (0..7)
0.5 0.5 0.5 0.5 0.5 0.5 0.5 0.5 
##$DPOFFS= (0..7)
0 0 0 0 0 0 0 0 
##$DQDMODE= 0
##$DR= 18
##$DS= 0
##$DSLIST= <SSSSSSSSSSSSSSS>
##$DSPFIRM= 0
$$ [...]
##$SUBNAM0= <"">
##$SUBNAM1= <"">
##$SUBNAM2= <"">
##$SUBNAM3= <"">
##$SUBNAM4= <"">
##$SUBNAM5= <"">
##$SUBNAM6= <"">
##$SUBNAM7= <"">
##$SUBNAM8= <"">
##$SUBNAM9= <"">
##$SW= 18.0517328524113
##$SWIBOX= (0..15)
0 0 2 0 0 0 0 0 0 0 0 0 0 0 0 0 
##$SW_h= 3612.71676300578
##$TD= 16384
##$TD0= 1
##$TE= 0
##$TE2= 300
##$TE3= 300
##$TEG= 300
##$TL= (0..7)
0 120 120 120 120 120 120 120 
##$TP= (0..7)
150 150 150 150 150 150 150 150 
##$TP07= 0
##$TPNAME0= <>
##$TPNAME1= <>
##$TPNAME2= <>
##$TPNAME3= <>
##$TPNAME4= <>
##$TPNAME5= <>
##$TPNAME6= <>
##$TPNAME7= <>
##$TPOAL= (0..7)
0.5 0.5 0.5 0.5 0.5 0.5 0.5 0.5 
##$TPOFFS= (0..7)
0 0 0 0 0 0 0 0 
##$TUNHIN= 0
##$TUNHOUT= 0
##$TUNXOUT= 0
##$USERA1= <user>
##$USERA2= <user>
##$USERA3= <user>
##$USERA4= <user>
##$USERA5= <user>
##$V9= 5
##$VALIST= <valist>
##$VCLIST= <CCCCCCCCCCCCCCC>
##$VD= 0
##$VDLIST= <DDDDDDDDDDDDDDD>
##$VPLIST= <PPPPPPPPPPPPPPP>
##$VTLIST= <TTTTTTTTTTTTTTT>
##$WBST= 1024
##$WBSW= 4
##$XGAIN= (0..3)
0 0 0 0 
##$XL= 0
##$YL= 0
##$YMAX_a= 528641
##$YMIN_a= -624435
##$ZGOPTNS= <>
##$ZL1= 120
##$ZL2= 120
##$ZL3= 120
##$ZL4= 120
##$ABSF1= 10
##$ABSF2= 0
##$ABSG= 5
##$ABSL= 3
##$ALPHA= 0
##$AQORDER= 0
##$ASSFAC= 0
##$ASSFACI= 0
##$ASSFACX= 0
##$ASSWID= 0
##$AUNMP= <proc_1d>
##$AZFE= 0.1
##$AZFW= 0.1
##$BCFW= 1
##$BC_mod= 2
##$BYTORDP= 1
##$COROFFS= 0
##$CY= -3
##$DATMOD= 1
##$DC= 2
##$DFILT= <>
##$DTYPP= 0
##$F1P= 0
##$F2P= 0
##$FCOR= 0.5
##$FTSIZE= 0
##$FT_mod= 4
##$GAMMA= 1
##$GB= 0.15
##$INTBC= 1
##$INTSCL= 1
##$ISEN= 128
##$LB= 0.25
##$LEV0= 0
##$LPBIN= 0
##$MAXI= 10000
##$MC2= 0
##$MEAN= 0
##$ME_mod= 0
##$MI= 1.114404
##$NCOEF= 0
##$NC_proc= 0
##$NLEV= 6
##$NOISF1= 3.799351
##$NOISF2= 2.8
##$NSP= 1
##$NTH_PI= 0
##$NZP= 0
##$OFFSET= 14.38212
##$PC= 1
##$PHC0= -471.7941
##$PHC1= 8.19221
##$PH_mod= 1
##$PKNL= yes
##$PPARMOD= 0
##$PSCAL= 0
##$PSIGN= 0
##$REVERSE= no
##$SF= 200.129724274929
##$SI= 16384
##$SIGF1= 3
##$SIGF2= 2
##$SINO= 400
##$SIOLD= 16384
##$SREGLST= <1H.CDCl3>
##$SSB= 0
##$STSI= 0
##$STSR= 0
##$SW_p= 3205.1282051282
##$SYMM= 0
##$S_DEV= 0
##$TDeff= 0
##$TDoff= 0
##$TI= <>
##$TILT= no
##$TM1= 0
##$TM2= 0
##$TOPLEV= 0
##$USERP1= <user>
##$USERP2= <user>
##$USERP3= <user>
##$USERP4= <user>
##$USERP5= <user>
##$WDW= 1
##$XDIM= 8192
##$YMAX_p= 0
##$YMIN_p= 0
$$ End of Bruker specific parameters
$$ ---------------------------------
##NTUPLES= NMR FID
##VAR_NAME=  TIME,          FID/REAL,        FID/IMAG
##SYMBOL=    X,             R,               I
##VAR_TYPE=  INDEPENDENT,   DEPENDENT,       DEPENDENT
##VAR_FORM=  AFFN,          ASDF,            ASDF
##VAR_DIM=   8192,          8192,            8192
##UNITS=     SECONDS,       ARBITRARY UNITS, ARBITRARY UNITS
##FACTOR=    0.0002768,     1,               1
##FIRST=     0,             0,               0
##LAST=      2.2672688,     0,               0
##MIN=       0,             -624435,         0
##MAX=       2.2672688,     528641,          0
$$ Real data points
##PAGE= N=1
##DATA TABLE= (X++(R..R)), XYDATA
$$ [...]
$$ plain form
2071 0 955 1274 -360 -1385 -111 -370 -962 969 1274 -353 166 884 -219 -526 656 -220 -1617 -134
2089 -134 293 -155 696 1768 -143 -898 -265 -909 -1490 702 1149 -18 659 1334 -381 -634 679 -215
2107 -215 -1391 478 348 -793 537 1586 260 -65 839 -816 -1937 -174 365 -118 1435 2107 -275
2124 -275 -595 65 -1314 -1496 322 504 -561 793 1279 79 -22 1070 -442 -1520 -489 -293 -830
2141 -830 715 1993 477 -76 420 -1266 -1742 -145 115 -217 922 1684 -137 -242 867 -260 -1235
2158 -1235 -168 -287 -1164 476 1589 522 734 934 -497 -1716 -484 -453 -713 1275 1675 -55 236
2175 236 755 -569 -962 -93 19 -1160 -8 937 7 721 1432 -326 -1255 -388 -1076 -1461 618 1380
2193 1380 508 914 1185 -599 -1281 -364 -564 -1147 194 848 51 716 1171 -149 -676 -386 -1114 -1614 -84
$$ packed form
2071@R55L19j634j025J274k59n92J931L05j627N19P18j103l07J182q76j397J483
2089a34M27m48Q51J072j911p55O33o44n81K192M47j167O77O75j715k53J313q94
2107b15j176J869j30j141J330J049j326l25R04j655j121J763N39m83J553O72k382
2124b75l20O60j379j82J818J82j065J354M86j200j01J092j512j078J031J96n37
2141h30J545J278j516n53M96j686m76J597K60l32J139P62j821j05J109j127r75
2158a235J067j19q77J640J113j067K12K00j431j219J232L1k60J988M00j730K91
2175B36N19j324l93Q69J12j179J152R45r30P14P11j758r29Q67o88l85K079P62
2193A380q72M06K71j784o82R17k00n83J341O54p97O65M55j320n27K90p28n00J530
$$ plain form
2212 -84 798 128 1053 1725 -139 -878 -416 -684 -1491 -22 968 374 976 1338 102 -281 36 -838 -1402
2231 -1402 -246 395 27 1019 1764 398 -462 -332 -1067 -1302 -472 395 666 1171 1543 502 -54 -130 -909
2250 -909 -1325 -475 -212 164 1080 1258 749 356 -17 -692 -1625 -609 -262 -23 1010 1616 741 266 -163
2269 -163 -714 -1258 -866 -274 -191 936 1454 827 251 453 -582 -1402 -1010 -420 -285 652 1524 917 518 73
2289 73 -361 -1175 -869 -769 -670 556 1183 942 522 391 -397 -920 -957 -821 -416 325 809 902 803 449 -276
2310 -276 -1082 -952 -822 -610 45 814 830 1285 882 -373 -631 -1084 -1020 -563 9 629 970 1271 739 -165
2330 -165 -817 -1341 -1302 -585 -63 398 878 1293 906 270 -462 -883 -1253 -944 -427 284 690 990 1017 350 -355
2351 -355 -806 -1003 -779 -329 402 962 1263 1151 502 -445 -912 -1065 -1201 -195 -262 811 970 1027 536 -231
$$ packed form
2212h4Q82o70R25O72j864p39M62k68q07J469R90n94O02L62j236l83L17q74n64
2231a402J156O41l68R92P45j366q60J30p35k35Q30Q67K71N05L72j041n56p6p79
2250i09m16Q50K63L76R16J78n09l93l73o75r33J016L47K39J033O06q75m75m29
2269a63n51n44L92N92Q3J127N18o27n76K02j035q20L92N90J35R37Q72o07l99m45
2289G3m34q14L06J00R9J226O27k41m20j31p88n23l7J36M05P41M84R3r9l54p25
2310b76q06J30J30K12O55P69J6M55m03j255k58m53O4M57N72O20L41L01n32r04
2330a65o52n24L9P17N22M61M80M15l87o36p32m21l70L09N17P11M06L00K7o67p05
2351c55m51j97K24M50P31N60L01j12o49r47m67j53j36J006o7J073J59N7m91p67
$$ plain form
2371 -231 -747 -815 -961 -704 -78 524 1004 1229 902 253 -480 -1447 -1132 -421 -300 304 1271 1177 1021 563 -85
2392 -85 -1158 -1468 -893 -400 262 879 1046 731 549 -87 -878 -1089 -1116 -571 -270 722 1323 864 938 337 -378
2413 -378 -930 -883 -931 -217 674 1491 859 715 194 -789 -847 -549 -764 -343 567 1247 559 829 382 -441 -864
2434 -864 -776 -1206 -738 621 824 908 1163 991 -495 -898 -785 -1195 -635 745 648 439 924 653 -279 -567
2454 -567 -589 -1358 -714 332 372 869 1301 842 -211 -378 -787 -1660 -1122 122 439 810 1302 881 -296
2473 -296 -456 -455 -1557 -1018 207 311 384 1316 1104 128 94 -436 -1527 -1329 -120 114 -119 1696 1440 -93
2493 -93 -74 -179 -1722 -1136 135 -89 89 1336 1152 100 409 -78 -1177 -1244 -317 -685 -483 1778 1326
2512 1326 317 593 10 -1708 -1297 62 -434 159 1564 926 -207 580 310 -979 -746 -178 -689 -742
$$ packed form
2371b31n16o8j46K57O26O02M80K25l27o49p33r67L15P11J21O04R67r4j56m58o48
2392h5j073l10N75M93O62O17J67l15j82o36p91k11k7N45L01R92O01m59P4o01p15
2413c78n52M7m8P14Q91Q17o32j44n21r83n8K98k15M21R10O80o88K70m47q23m23
2434h64Q8m30M68J359K03Q4K55j72j486m03J13m10N60J380r7k09M85k71r32k88
2454e67k2p69O44J046M0M97M32m59j053j67m09q73N38J244L17L71M92m21j177
2473b96j60Jj102N39J225J04P3R32k12r76l4n30j091J98J209K34k33J815k56j533
2493i3J9j05j543N86J271k24J78J247j84j052L09m87j099o7R27l68K02K261m52
2512A326j009K76n83j718M11J359m96N93J405o38j133P87k70j289K33N68n11n3
$$ plain form
2530 -742 820 1232 422 924 462 -1693 -1295 -256 -1077 -574 1465 1396 65 879 372 -1387 -954 -114
2548 -114 -727 -667 879 626 85 1042 1091 -898 -718 -514 -1347 -1067 1330 1097 389 1569 786 -1361 -1117
2567 -1117 -255 -1128 -235 1226 434 -38 1086 1154 -786 -221 158 -1344 -1148 450 47 250 1658 1189
2585 1189 -588 -797 -546 -1394 -1128 1140 780 108 1356 584 -964 -39 556 -1338 -982 341 -112 -230
2603 -230 1376 1459 -490 259 42 -2078 -1436 464 330 265 1701 917 -897 71 21 -1372 -802 711
2621 711 -340 -398 1128 973 -367 650 301 -1370 -1338 -24 -262 -266 1470 1302 2 144 -219 -1438
2639 -1438 -1097 391 -46 -26 1182 699 -115 397 604 -994 -761 -360 -670 -616 1206 1067 176 762 259
2658 259 -1204 -990 -164 -430 -249 1378 954 -56 553 418 -1093 -554 -41 -929 -540 785 743 97 915
$$ packed form
2530g42J562M12q10N02m62k155L98J039q21N03K039o9j331Q14n07j759M33Q40
2548a14o13O0J546k53n41R57M9j989J80K04q33K80K397k33p08J180p83k147K44
2567a117Q62q73Q93J461p92m72J124O8j940N65L79j502J96J598m03K03J408m69
2585A189j777k09K51q48K66K268l60o72J248p72j548R25N95j894L56J323m53j18
2603b30J606Q3j949P49k17k120O42J900j34o5J436p84j814R68n0j393N70J513
2621G11j051n8J526j55j340J017l49j671L2J314k38mJ736j68j300J42l63j219
2639a438L41J488m37K0J208m83q14N12K07j598K33M01l10N4J822j39q91N86n03
2658B59j463K14Q26k66J81J627m24j010O09j35j511N39N13q88L89J325m2o46Q18
$$ plain form
2677 915 793 -1140 -848 -487 -956 -795 989 680 395 740 549 -690 -564 -15 -890 -481 662 442 122
2696 122 985 642 -511 -587 -382 -1056 -835 536 626 362 942 833 -428 -494 139 -706 -719 651 383 214
2716 214 875 946 -415 -406 -338 -794 -672 227 290 19 929 961 -127 -240 -287 -1091 -607 218 256 303 868 660
2738 660 -206 -379 -54 -1080 -805 -196 4 15 595 586 101 191 89 -749 -682 97 201 452 854 660 -172
2759 -172 124 -91 -627 -471 -48 289 12 654 743 136 349 -231 -773 -816 -372 -157 -22 677 914 687 333
2780 333 -20 -880 -673 -594 -129 196 472 720 276 402 159 -775 -662 -542 -161 -330 471 570 362 179 264
2801 264 -275 -580 -505 -348 -178 438 535 233 316 234 -288 -639 -668 -270 -37 263 293 477 494 372 -337 -553
2823 -553 -201 -585 -157 328 502 575 332 311 150 -404 -625 -518 -266 -39 407 607 447 322 90 -184 -498
$$ packed form
2677I15j22j933K92L61m69J61J784l09k85L45j91j239J26N49q75M09J143k20l20
2696A22Q63l43j153p6K05o74K21J371R0k64N80j09j261o6O33q45j3J370k68j69
2716B14O61P1j361RO8m56J22Q99O3k71R10L2j088j13m7q04M84Q25L8M7N65k08
2738F60q66j73L25j026K75O09K00J1N80rm85R0j02q38O7P79J04K51M02j94q32
2759a72K96k15n36J56M23L37k77O42Q9o07K13n80n42m3M44K15J35O99K37k27l54
2780C33l53q60K07P9M65L25K76K48m44J26k43r34J13J20L81j69Q01R9k08j83Q5
2801B64n39l05P5J57J70O16R7l02Q3q2n22l51k9L98K33L00L0J84J7j22p09k16
2823e53L52l84M28M85J74P3k43k1j61n54k21J07K52K27M46K00j60j25k32k74l14
$$ plain form
2844 -498 -586 -227 20 257 269 392 318 10 -98 -190 -632 -477 -115 413 -13 746 533 -126 -118 -365 -578 -511
2866 -511 -192 308 155 485 138 178 -46 -650 -496 -283 -424 -80 138 596 460 313 307 -235 -269 -276 -718 -44
2888 -44 479 443 479 516 -89 -434 -512 -386 -278 -261 -87 582 300 636 11 -201 -273 -126 -137 -659 69 906 328
2911 328 364 149 -209 -167 -257 -518 -168 320 473 342 534 667 -13 -453 -597 -429 -602 164 634 460 487
2932 487 736 -329 -405 -167 -265 -547 54 441 309 472 292 232 -315 -101 -242 -396 -100 216 124 574 1110
2953 1110 275 -85 -297 -574 -917 -137 370 153 599 692 422 -176 213 -364 -689 225 108 -273 169 546
2973 546 263 256 250 -244 -738 -376 24 37 689 802 265 -376 19 -274 -751 49 234 47 261 514 68 -48
2995 -48 458 -181 -586 -415 -147 -372 544 911 96 77 248 -409 -730 -365 -93 -561 588 583 78 -102 661
$$ packed form
2844d98q8L59K47K37J2J23p4l08j08r2m42J55L62N28m26P59k13o59Qk47k13O7
2866e11L19N00j53L30l47M0k24o04J54K13j41L44K18M58j36j47on42l4pm42O74
2888d4N23l6L6L7o05l45p8J26J08J7J74O69k82L36o25k12p2J47j1n22P28Q37n78
2911C28L6k15l58M2r0k61L50M88J53j31J92J33o80m40j44J68j73P66M70j74K7
2932D87K49j065p6K38r8k82O01L87j32J63j80o0n47K14j41j54K96L16r2M50N36
2953A110q35l60k12k77l43P80N07k17M46R3k70n98L89n77l25R14j17l81M42L77
2973E46k83pom94m94L62M00J3O52J13n37o41L95k93m77Q00J85j87K14K53m46j16
2995d8N06o39m05J71K68k25R16L67q15j9J71o57l21L65K72m68J149nn05j80P63
$$ plain form
3016 661 -197 -528 61 -197 -273 -199 578 43 257 378 -91 -435 44 -499 -541 662 564 27 22 514 -119 -640
3038 -640 90 -391 -610 39 337 -86 424 900 -166 -229 -243 -487 -591 41 720 -81 535 711 -472 -480 260
3059 260 -445 -557 183 499 -410 111 638 -56 -280 409 -266 -830 -147 409 46 376 926 -121 -522 -80
3079 -80 -163 -657 144 305 -362 166 451 -297 -488 385 -512 -840 -308 -10 -601 401 935 156 -349 -3
3099 -3 -219 -1051 29 280 -86 60 781 268 -106 112 -294 -723 -119 71 -792 162 849 200 230 469 -333
3120 -333 -632 -73 -186 -281 131 740 123 114 339 -186 -649 -86 104 -519 1 634 144 73 553 -175 -676
3141 -676 -235 -244 -431 353 765 379 353 251 8 -439 -95 -249 -460 314 349 156 59 658 99 -161 -288 -390
3163 -390 -549 -79 503 194 337 727 -137 -340 -154 -486 -337 -57 419 71 465 673 97 -283 -83 -94
$$ packed form
3016F61q58l31N89k58p6P4P77n35K14J21m69l44M79n43m2J203r8n37nM92o33n21
3038f40P30m81k19O49K98m23N10M76j066o3j4k44j04O32O79q01O16J76j183qP40
3059B60p05j12P40L16r09N21N27o94k24O89o75n64O83N56l63L30N50j047m01M42
3079h0q3m94Q01J61o67N28K85p48j91Q73q97l28N32K98n91J002N34p79n05L46
3099ck16q32J080K51l66J46P21n13l74K18m06m29O04J90q63R54O87o49L0K39q02
3120c33k99N59j13r5M12O09o17rK25n25m63N63J90o23N20O33m90p1M80p28n01
3141f76M41rj87P84M12l86k6j02k43m47L44j54k11P74L5j93r7N99n59k60j27j02
3163c90j59M70N82l09J43L90q64k03J86l32J49K80M76l48L94K08n76l80K00j1
$$ plain form
3183 -94 -441 51 467 -173 505 743 297 279 89 -260 -592 -254 321 159 343 565 403 -338 24 -365 -489
3204 -489 -74 265 -236 199 637 117 -198 340 -235 -580 -384 118 71 310 584 423 69 34 -163 -656 -321
3225 -321 131 -54 91 576 380 -62 334 -27 -785 -182 11 5 85 270 528 521 245 46 -588 -431 -223 -112
3247 -112 188 519 227 164 276 104 -230 -480 -185 -361 -92 402 487 91 671 83 -370 -412 -188 -157 -4
3268 -4 236 311 436 464 -251 -349 -123 -252 -321 -123 41 386 45 445 156 33 -650 -388 -341 -266 239 240 217 -6
3292 -6 -18 -143 -402 -216 -245 -298 -52 148 179 177 97 -88 -66 -224 -568 -310 -157 224 238 443 183 -104 14 -343
3316 -343 -527 -419 345 90 419 212 322 -81 -114 -314 -437 -291 -45 118 158 137 325 489 -36 66 -132
3337 -132 -234 -138 -57 33 228 266 256 0 -82 -413 -333 -26 -113 239 467 265 551 -59 -351 -199 -421 -113 -175
$$ packed form
3183i4l47M92M16o40O78K38m46j8j90l49l32L38N75j62J84K22j62p41L62l89j24
3204d89M15L39n01M35M38n20l15N38n75l45J96N02m7K39K74j61l54l5j97m93L35
3225c21M52j85J45M85j96m42L96l61p58O03J93oQ0J85K58pk76j99o34J57K08J11
3247a12L00L31k92o3J12j72l34k50K95j76K69M94Q5l96N80n88m53m2K24L1J53
3268dK40P5J25K8p15r8K26j29o9J98J64L45l41M00k89j23o83K62M7P5N05Jk3k23
3292fj2j25k59J86k9n3K46K00L1kq0j85K2j58l44K58J53L81J4K05k60k87J18l57
3316c43j84J08P64k55L29k07J10m03l3k00j23J46K46J63M0k1J88J64n25J02j98
3337a32j02R6Q1R0J95L8j0k56q2l31Q0L07q7L52K28k02K86o10k92J52k22L08o2
$$ plain form
3360 -175 98 219 203 214 -223 -358 -158 -150 -168 -253 125 100 206 121 64 -24 -245 -496 -357 -22 12 371 554 303
3384 303 -63 -40 92 -308 -316 -331 239 383 83 256 532 0 -361 -492 -590 -264 -101 299 250 492 329 106
3406 106 37 -127 -316 -410 -273 42 247 27 180 61 -196 -214 -68 -480 -96 190 -5 518 390 4 -13
3427 -13 -261 -455 -234 -310 -30 34 254 553 355 -77 -107 -116 -407 -174 -279 111 115 239 -6 119 -83 -260 -557
3450 -557 -260 -194 -123 35 581 259 -112 128 -295 -200 -252 -168 148 144 331 67 204 96 -91 -282 -231 -137 46
3473 46 356 608 623 275 96 -129 -622 -309 -245 -56 35 159 302 438 266 -132 -369 -149 -51 -174 165 477
3495 477 320 501 350 15 -272 -88 -354 5 -27 184 223 -120 300 141 -84 -28 -338 -162 1 0 517 336
3517 336 171 190 -195 -253 -433 -247 -217 401 234 285 180 47 -87 -324 -41 -513 -40 287 58 377 149
$$ packed form
3360a75K73J21j6J1m37j35K00Qj8q5L78k5J06q5n7q8k21k51J39L35L4L59J83k51
3384C03l66K3J32m00qj5N70J44l00J73K76n32l61j31r8L26J63M00m9K42j63k23
3406A06o9j64j89r4J37L15K05k20J53j19k57j8J46m12L84K86j95N23j28l86j7
3427a3k48j94K21p6K80O4K20K99j98m32l0rk91K33j05L90MJ24k45J25k02j77k97
3450e57K97O6P1J58N46l22l71K40m23R5n2Q4L16mJ87k64J37j08j87j91N1R4J83
3473D6L10K52J5l48j79k25m93L13O4J89R1J24J43J36j72l98k37K20R8j23L39L12
3495D77j57J81j51l35k87J84k66L59l2K11L9l43M20j59k25N6l10J76J63jN17j81
3517C36j65J9l85n8j80J86L0O18j67N1j05j33j34k37K83m72M73L27k29L19k28
$$ plain form
3538 149 268 -80 39 -381 -293 -237 146 422 276 423 192 -133 -162 -339 -476 -124 -9 124 13 354 85
3559 85 69 -110 -126 -556 -169 -27 116 147 410 322 -155 -61 -161 -600 -301 160 27 143 457 335 56 165
3581 165 56 -424 -545 -62 -229 322 599 570 414 111 -150 -557 -394 -162 -1 303 571 205 127 81 127
3602 127 -447 -260 -61 -280 20 190 455 -9 205 214 -337 -288 -94 -156 -303 425 239 268 161 219 -363 -382
3624 -382 -84 -206 -57 239 162 -5 302 167 -238 -292 -291 -542 -160 241 302 232 272 129 -392 -326 -205 -34 4
3647 4 336 532 117 232 53 -287 -288 -81 -362 28 156 535 280 322 451 -109 -187 -204 -349 -105 235 185 40
3670 40 421 8 -178 -103 -156 -380 -1 11 122 -92 -28 496 59 -15 34 -171 -252 -117 222 -22 190 177 27
3693 27 -56 -79 -424 -408 114 283 37 375 159 5 288 -69 -243 -155 -112 267 280 40 104 190 -130 -120 -334
$$ packed form
3538A49J19l48J19m20Q8N6L83K76j46J47k31l25k9j77j37L52J15J33j11L41k69
3559H5j6j79j6m30L87J42J43L1K63q8m77R4j00m39K99M61j33J16L14j22k79J09
3581A65j09m80j21M83j67N51K77k9j56l03k61m07J63K32J61L04K68l66p8m6M6
3602A27n74J87J99k19L00J70K65m64K14Rn51M9J94o2j47P28j86K9j07N8n82j9
3624c82K98j22J49K96p7j67L07j35m05n4Jk51L82M01O1p0M0j43n21O6J21J71L8
3647DL32J96m15J15j79l40jK07k81L90J28L79k55M2J29n60p8j7j45K44L40n0j45
3670D0L81m13j86P5n3k24L79J2J11k14O4N24m37p4M9k05q1J35L39k44K12j3j50
3693B7q3k3l45J6N22J69k46L38k16j54K83l57j74Q8M3L79J3k40O4Q6l20J0k14
$$ plain form
3716 -334 -569 3 176 -25 192 1 8 193 7 -92 -94 -96 110 36 261 534 166 129 287 -39 -426 -223 95
3739 95 0 500 306 -49 168 -15 -485 -387 281 -26 230 119 -172 412 152 191 -186 -182 -279 -167 -237 317 272
3762 272 400 219 232 -332 -441 71 -26 -245 -45 423 113 189 -30 -45 -68 -78 -257 -119 426 171 261 275 110
3785 110 -269 -56 -313 -126 -47 48 22 132 284 -116 -224 -244 -69 -344 -198 166 -72 95 26 300 -134 -13
3807 -13 252 -229 -170 -5 -15 91 218 170 15 -118 -63 -361 -10 214 269 208 317 159 22 60 -86 -150 -185
3830 -185 -190 105 320 201 195 210 -72 -185 -244 -382 -185 361 134 183 213 -208 46 -87 -358 -546 16 50 109
3853 109 297 127 175 -152 -129 -27 -333 -320 -139 -53 43 121 246 162 148 66 18 -228 197 127 106 158 -188 27
3877 27 104 -222 -179 -9 -149 -334 380 153 -142 131 -303 -50 -66 -41 74 -86 33 130 45 14 -125 -361 -173
$$ packed form
3716c34k35N72J73k01K17j91PJ85j86r9kkK06p4K25K73l68l7J58l26l87K03L18
3739I5r5N00j94l55K17j83m70R8O68l07K56j11k91N84k60L9l77Mr7J12p0N54m5
3762B72J28j81J3n64j09N12r7k19K00M68l10P6k19j5k3j0j79J38N45k55R0J4j65
3785A10l79K13k57J87P9R5k6J10J52m00j08k0J75k75J46L64k38J67o9K74m34J21
3807a3K65m81N9J65j0J06J27m8j55j33N5k98L51K24N5o1J09j58j37L8j46o4l5
3830a85nK95K15j19oJ5k82j13n9j38J97N46k27M9L0m21K54j33k71j88N62L4N9
3853A09J88j70M8l27K3J02l06J3J81Q6R6P8J25q4j4q2m8k46M25p0k1N2l46K15
3877B7P7l26M3J70j40j85P14k27k95K73m34K53j6K5J15j60J19R7q5l1j39k36J88
$$ plain form
3900 -173 -166 29 -20 288 138 113 180 -93 -162 -214 89 -275 -262 24 -251 -10 167 -173 61 -209 -94 -90 -141 -113
3924 -113 178 194 117 -92 96 -60 -14 147 45 -24 -107 407 166 129 -70 -66 -57 -103 -14 6 37 -41 -101 93 79 -118
3950 -118 277 -214 55 25 -278 318 294 -30 -10 -168 -54 -344 -32 113 93 69 385 335 -142 -21 45 -370
3972 -370 -46 298 63 -278 265 7 -39 213 9 -128 67 437 -71 29 -19 94 -132 71 -41 -406 61
3993 61 142 -27 -151 395 255 -338 -215 -167 -135 -136 215 -110 -250 139 69 -3 141 99 -255 -61 30 -473 22
4016 22 361 76 -47 -30 -158 -253 120 53 -228 -97 -72 -111 -537 33 -21 -513 106 131 -186 83 533 -4 153
4039 153 135 -174 -441 43 170 -160 -28 276 -80 -397 136 -3 -315 -58 329 -192 -230 330 -135 161 376
4060 376 361 -228 111 -136 -341 -103 590 66 -109 379 28 -401 211 234 -118 -126 481 -392 -298 168 337 -252
$$ packed form
3900a73PJ95m9L08j50k5O7k73o9n2L03l64J3K86k75K41J77l40K34k70J15Mn1K8
3924a13K91J6p7k09J88j56M6J61j02o9q3N14k41l7j99MRm6Q9K0L1p8o0J94j4j97
3950a18L95m91K69l0l03N96k4l24K0j58J14k90L12J45k0k4L16n0m77J21O6m15
3972c70L24L44k35l41N43k58m6K52k04j37J95L70n08J00m8J13k26K03j12l65M67
3993F1Q1j69j24N46j40n93J23M8L2jL51l25j40L89p0p2J44m2l54J94R1n03M95
4016B2L39k85j23J7j28r5L73o7k81J31K5l9m26N70n4m92O19K5l17K69M50n37J57
4039A53j8l09k67M84J27l30J32L04l56l17N33j39l12K57L87n21l8N60m65K96K15
4060C76j5n89L39k47k05K38O93n24j75M88l51m29O12K3l52qO07q73R4M66J69n89
$$ plain form
4082 -252 178 272 -539 -93 92 -75 35 214 -264 -489 17 -12 -438 45 256 -171 -24 303 27 -134 160
4103 160 75 -583 -127 219 -215 165 375 172 -427 241 239 -357 -94 405 66 -313 293 -304 -185 146 244
4124 244 42 -30 224 -146 -131 120 -159 -129 394 142 -460 -163 161 -115 166 284 128 -87 -54 6 -272 101
4146 101 210 19 94 156 -202 -37 182 -42 -257 -78 166 -95 -12 238 -7 -26 -58 -97 -374 -248 168 23
4168 23 256 320 -3 -323 111 -104 -364 126 266 -221 -312 195 -161 115 288 -31 -298 148 164 168 55 313
4190 313 -268 -59 -16 -338 -187 3 340 -16 -66 263 123 -203 185 -58 -233 -6 -115 24 -170 17 107
4211 107 92 -15 29 -226 -52 7 60 26 230 103 55 8 -94 -183 -1 226 -143 -236 412 -85 79 368 -259
4234 -259 -365 55 235 -153 307 173 43 -132 238 -117 -189 -35 10 -236 -189 247 -53 185 52 -249 -322
$$ packed form
4082b52M30R4q11M46J85j67J10J79m78k25N06k9m26M83K11m27J47L27k76j61K94
4103A60q5o58M56L46m34L80K10k03n99O68kn96K63M99l39l79O06n97J19L31R8
4124B44k02p2K54l70J5K51k79L0N23k52o02K97L24k76K81J18j56k15L3O0k78L73
4146A01J09j91P5O2l58J65K19k24k15J79K44k61Q3K50k45j9l2l9k77J26M16j45
4168B3K33O4l23l20M34k15k60M90J40m87r1N07l56K76J73l19k67M46J6Mj13K58
4190C13n81K09M3l22J51J90L37l56n0L29j40l26L88k43j75K27j09J39j94J87R0
4211A07j5j07M4k55J74N9N3l4K04j27m8m7j02q9J82K27l69r3O48m97J64K89o27
4234b59j06M20J80l88M60j34j30j75L70l55p2J54M5k46M7M36l00K38j33l01p3
$$ plain form
4255 -322 128 -1 -206 -82 132 -121 283 156 -314 -297 -13 -185 -225 3 25 -73 -19 194 -248 93 49 -317
4277 -317 -208 116 321 182 -30 149 -16 -262 -4 -55 -288 10 -76 258 -66 26 -264 -60 12 199 -255
4298 -255 -123 265 245 213 119 -106 -171 -44 -26 -32 148 51 158 -36 204 119 -21 -107 -251 -43 9 164 211 415
4322 415 6 49 41 248 -22 -10 -78 59 144 322 119 32 137 -72 -27 90 -62 90 90 204 157 -54 367 -3
4346 -3 -110 36 -109 44 31 208 291 320 105 -140 -191 -161 26 57 244 122 358 -207 130 131 -210 65 -121
4369 -121 -37 176 72 198 -268 78 32 20 -276 128 168 -85 -343 -38 -100 59 72 32 -227 75 38 -96 142
4392 142 106 175 226 164 30 -33 140 -104 -299 -42 88 53 39 262 285 -110 217 -20 -227 135 48 -93 74
4415 74 115 -311 -63 -69 68 -113 23 129 -131 122 -175 19 -248 -3 -147 -438 -133 -71 85 269 355 -116
$$ packed form
4255c22M50j29k05J24K14k53M04j27m70J7K84j72m0K28K2r8N4K13m42L41m4l66
4277c17J09L24K05j39k12J79j65k46K58n1k33K98q6L34l24R2k90K04P2J87m54
4298b55J32L88k0l2r4k25o5J27J8oJ80r7J07j94K40q5j40q6j44K08N2J55M7K04
4322D15m09M3qK07k70J2o8J37Q5J78k03q7J05k09M5J17j52J52%J14m7k11M21l70
4346cj07J46j45J53j3J77Q3K9k15k45n1L0J87L1J87j22K36n65L37Jl41K75j86
4369a21Q4K13j04J26m66L46m6j2k96M04M0k53k58L05o2J59J3m0k59L02l7j34K38
4392A42l6O9N1o2j34o3J73k44j95K57J30l5j4K23K3l95L27k37k07L62q7j41J67
4415G4M1m26K48oJ37j81J36J06k60K53k97J94k67K45j44k91L05O2J56J84Q6m71
$$ plain form
4437 -116 381 99 -172 54 5 89 -100 170 280 -139 -37 -29 -358 -43 -66 69 260 24 398 -150 218 -79
4459 -79 -200 -167 -113 -19 -108 65 218 99 -184 -72 -208 -302 116 137 119 312 -65 -227 16 244 -129 -155 -31
4482 -31 75 -1 274 455 -48 14 103 -482 -190 -87 -257 -274 192 36 39 -137 40 -326 80 157 -155 -184 214
4505 214 90 19 130 106 -49 -397 -207 -257 -50 325 383 15 212 310 -322 -274 126 -96 -438 120 158 29
4527 29 -41 129 11 -68 107 -291 -159 207 487 -136 364 -151 -582 -319 -49 -66 -57 205 103 126 95 251 -175
4550 -175 -211 100 -87 -580 113 40 -108 264 238 -95 -97 175 -528 -434 291 73 248 536 119 -118 -116 226 -140
4573 -140 -258 298 -258 -202 55 280 0 60 251 -301 -268 -88 -405 2 271 152 -106 23 7 -396 -142
4594 -142 229 83 -65 93 91 20 198 289 -290 -140 -83 -166 -184 368 479 -75 -31 71 -218 -110 80 -63 -154
$$ packed form
4437a16M97k82k71K26m9Q4j89K70J10m19J02Ql29L15k3J35J91k36L74n48L68k97
4459g9j21L3N4R4q9J73J53j19k83J12j36r4M18K1j8J93l77j62K43K28l73k6J24
4482c1J06p6K75J81n03O2Q9n85K92J03j70j7M66j56Lj76J77l66M06P7l12k9L98
4505B14j24p1J11k4j55l48J90n0K07L75N8l68J97R8o32M8M00k22l42N58L8j29
4527B9p0J70j18p9J75l98J32L66K80o23N00n15m31K63K70j7RK62j02K3l1J56m26
4550a75l6L11j87m93O93p3j48L72k6l33kK72p03R4P25k18J75K88m17k37KL42l66
4573a40j18N56n56N6K57K25k80O0J91n52L3J80l17M07K69j19k58J29j6m03K54
4594a42L71j46j48J58kp1J78R1n79J50N7q3j8N52J11n54M4J02k89J08J90j43r1
$$ plain form
4617 -154 320 74 -324 179 198 106 -78 320 -98 -239 272 184 57 152 27 -497 -461 287 -245 111 251 88
4639 88 -120 125 207 -167 -207 275 -110 -416 75 8 -131 341 192 -152 -180 -69 -494 -189 300 404 130 398
4661 398 53 -229 -141 108 -17 -411 117 -33 -59 186 329 97 134 -30 -396 -240 290 37 -56 230 491
4682 491 -148 -94 86 -471 -207 254 -214 -96 132 275 -38 133 289 -253 -335 -56 -187 113 354 212 18
4703 18 -12 104 -363 -138 6 -55 82 302 323 -50 32 103 -316 -148 235 105 -205 298 316 -31 162 4
4725 4 -179 -167 159 -116 -199 20 143 -200 66 -45 -350 -170 7 8 -74 138 183 -10 293 26 -303 127 145
4748 145 -268 30 166 -23 -19 28 118 -185 -372 244 -160 -88 241 -66 26 395 0 112 -181 -19 -215 -181
4770 -181 23 -23 67 -45 76 163 -182 -41 -334 -219 165 130 264 167 153 242 -157 -303 -105 -420 -143 -35
$$ packed form
4617a54M74k46l98N03J9r2j84L98m18j41N11q8j27R5j25n24L6P48n32L56J40j63
4639H8k08K45Q2l74m0M82l85l06M91o7j39M72j49l44k8J11m25L05M89J04k74K68
4661C98l45k82Q8K49j25l94N28j50k6K45J43k32L7j64l66J56N30k53r3K86K61
4682D91o39N4J80n57K64M61m68J18K28J43l13J71J56n42q2K79j31L00K41j42j94
4703A8l0J16m67K25J44o1J37K20K1l73Q2P1m19J68L83j30l10N03J8l47J93j58
4725Dj83J2L26k75q3K19J23l43K66j11l05J80J77Jq2K12M5j93L03k67l29M30J8
4748A45m13K98J36j89MM7R0l03j87O16m04P2L29l07R2L69l95J12k93J62j96L4
4770a81K04m6R0j12J21Q7l45J41k93J15L84l5J34r7j4Q9l99j46J98l15K77J08
$$ plain form
4792 -35 153 150 298 -122 -61 -40 -291 -144 -89 46 59 209 330 336 -23 -65 -163 82 -163 9 74 362 281 -49
4816 -49 174 95 -267 -182 -13 -19 -38 88 160 367 -222 -73 36 84 -163 9 155 427 -50 -43 205 -44 -38 -534
4840 -534 82 -345 -8 74 187 225 163 271 134 -47 -239 -198 -91 63 277 16 -155 84 139 -511 -379 -186
4862 -186 -286 182 -16 222 368 -261 81 162 -115 -220 -175 63 126 192 260 101 84 -77 -93 -321 -413 -302 -21
4885 -21 141 75 -34 114 106 100 4 110 -36 151 194 -98 -18 75 67 70 104 -175 -18 -55 289 516 329 39 -60 -26
4911 -26 -312 -321 -24 234 -83 145 123 261 206 -116 -196 -88 -174 13 283 209 331 12 -45 -237 -77 -18 22 -240
4935 -240 -156 31 227 104 80 -72 -363 -33 -185 -161 -169 74 -206 230 -90 -134 -268 -43 -80 180 -38 -44 -11
4958 -11 -168 101 -109 -164 205 -130 -325 -154 92 163 -139 -2 -6 -200 -340 21 -465 -168 175 29 -112 671
$$ packed form
4792c5J88lJ48m20O1K1k51J47N5J35J3J50J21Ol59m2r8K45k45J72O5K88q1l30
4816d9K23p9l62Q5J69oj9J26P2K07n89J49J09M8k47J72J46K72m77PK48k49Om96
4840e34O16m27L37Q2J13L8o2J08j37j81j92M1J07J54K14k61j71K39N5o50J32J93
4862a86j00M68j98K38J46o29L42Q1k77j05M5K38O3O6O8j59j7j61j6k28r2J11K81
4885b1J62o6j09J48qor6J06j46J87M3k92Q0R3qLL4k79J57l7L44K27j87k90r9L4
4911b6k86rK97K58l17K28k2J38n5l22q0J08q6J87K70p4J22l19n7j92J60N9M0k62
4935b40Q4J87J96j23k4j52k91L30j52K4qK43k80M36l20m4j34K25l7K60k18oL3
4958a1j57K69k10n5L69l35j95J71K46P1l02J37mj94j40L61m86K97L43j46j41P83
$$ plain form
4980 671 106 209 -91 -327 -342 -249 247 170 306 194 477 151 -174 -121 -136 -249 283 107 78 256 239 -168
5002 -168 -10 -9 -316 -272 -169 -40 -12 156 345 21 397 89 -384 -22 44 -179 -157 427 294 9 -125 -88
5024 -88 -409 -275 22 -23 314 387 298 58 52 -32 -548 -134 121 -194 -201 215 261 143 115 18 -185 -67 209 -55
5048 -55 -10 206 259 261 -143 133 -267 19 205 25 40 315 162 119 110 66 -26 39 -68 -493 -220 68 209 -2
5072 -2 445 124 -409 -257 -252 -174 -227 209 292 -214 216 158 -74 -162 39 -65 -51 305 108 -176 161 191 -271 -171
5096 -171 126 -382 378 328 -178 13 222 55 -300 -84 -155 -148 -259 -253 -31 231 326 174 -78 50 -204 -570
5118 -570 -84 -46 50 310 380 21 -407 -162 -161 -112 -129 155 -3 -34 427 140 -364 101 -77 -286 -198 -40 -76
5141 -76 -27 397 403 13 139 -281 -437 -198 39 -26 265 375 262 -32 294 27 -199 -123 -176 -18 -330 219
$$ packed form
4980F71n65J03l00k36j5R3M96p7J36j12K83l26l25N3j5j13N32j76k9J78j7m07
5002a68J58Jl07M4J03J29K8J68J89l24L76l08m73L62O6k23K2N84j33k85j34L7
5024h8l21J34K97m5L37P3q9k40oq4n16M14K55l15pM16M6j18k8r7k03J18K76k64
5048e5M5K16N3Km04K76m00K86J86j80J5K75j53m3rm4r2O5j07m25K73K88J41k11
5072bM47l21n33J52NP8n3M36Q3n06M30n8k32q8K01j04J4L56j97k84L37L0m62J00
5096a71K97n08P60n0n06J91K09j67l55K16p1Pj11OK22K62R5j52k52J28k54l66
5118e70M86L8R6K60P0l59m28K45JM9j7K84j58l1M61k87n04M65j78k09Q8J58l6
5141g6M9M24Ol90J26m20j56K39K37o5K91J10j13k94L26k67k26P6n3J58l12N49
$$ plain form
5163 219 311 154 3 208 -176 -430 -277 -207 109 163 140 -3 138 29 -201 -77 -403 56 -84 272 241 119
5185 119 442 145 -242 -281 33 -394 -399 196 207 96 180 -63 -129 135 -233 -314 115 196 70 -231 265 43 -204
5208 -204 -10 -177 -340 -271 172 145 83 269 208 -464 -293 -265 -280 -301 -248 -85 91 569 186 -64 -126 0 -221
5231 -221 -153 -20 112 -205 105 356 169 101 -164 -265 -206 -43 -75 5 256 -129 76 49 -62 -500 -80 216
5253 216 -80 6 110 270 97 224 -114 -500 -138 145 -138 79 93 55 -42 -251 68 -322 -90 -228 -33
5274 -33 302 74 424 38 40 103 -86 -520 -59 -53 146 216 -88 19 79 136 -148 -48 -214 188 206 187 57 183
5298 183 265 173 -265 -113 -300 -208 -42 261 -18 184 206 58 -41 -105 3 -277 -174 196 380 135 307 -398
5320 -398 64 -209 -95 -160 -239 111 -43 104 -140 110 -204 -143 -131 -189 -56 92 65 242 235 173 212 -185 -304
$$ packed form
5163B19R2j57j51K05l84k54J53P0L16N4k3j43J41j09k30J24l26M59j40L56l1j22
5185A19L23k97l87l9L14m27nN95J1j11Q4k43o6K64l68q1M29Q1j26l01M96k22k47
5208b04J94j67j63O9M43k7o2J86o1o72J71K8j5k1N3J63J76M78l83k50o2J26k21
5231b21O8J33J32l17L10K51j87o8k65j01N9J63l2Q0K51l85K05k7j11m38M20K96
5253B16k96Q6J04J60j73J27l38l86L62K83k83K17J4l8r7k09L19l90K32j38J95
5274c3L35k28L50l86KO3j89m34M61OJ99P0l04J07O0N7k84J00j66M02J8j9j30J26
5298A83Q2r2m38J52j87R2J66L03k79K02K2j48r9o4J08k80J03L70J84k45J72p05
5320c98M62k73J14o5p9L50j54J47k44K50l14O1J2n8J33J48k7J77po2L9l97j19
$$ plain form
5343 -304 -229 18 -134 -127 79 61 242 86 -160 -225 -494 -71 -213 215 331 250 145 232 -178 -60 44 -62
5365 -62 112 229 540 366 223 230 -232 23 -277 -144 -103 -47 -27 -34 94 -176 -92 -217 -238 -197 -156 -188 79 53 171
5390 171 331 109 4 58 -142 37 -141 225 294 50 221 -24 216 -114 -165 -217 -160 389 296 -84 179 57
5412 57 -371 9 -40 -154 -263 123 150 249 68 382 -56 16 -185 -261 -280 213 -151 162 233 135 -36 -47 -109 -322
5436 -322 -325 37 203 -9 13 51 -69 138 -98 6 -326 -485 141 244 360 187 197 -253 127 -133 -150 -74
5458 -74 17 -68 27 8 -126 -84 51 -151 -318 -57 129 -82 236 391 296 56 -112 -47 -200 67 8 31 52 326
5482 326 334 87 64 -32 -114 -240 -101 9 351 317 120 252 3 -288 -163 -294 -108 141 81 276 271 -17 152
5505 152 -58 -351 -234 -233 -289 -138 397 -50 282 94 -1 -308 -147 -236 -139 75 3 251 -175 72 -14 80 -52
$$ packed form
5343c04P5K47j52PK06j8J81j56k46o5k69M23j42M28J16q1j05Q7m10J18J04j06
5365f2J74J17L11j74j43Pm62K55l00J33M1N6K0pJ28k70Q4j25k1M1M1l2K67k6J18
5390A71J60k22j05N4k00J79j78L66O9k44J71k45K40l30n1n2N7N49r3l80K63j22
5412E7m28L80m9j14j09L86K7R9j81L14m38P2k01p6j9M93l64L13P1r8j71j1o2k13
5436c22lL62J66k12K2L8j20K07k36J04l32j59O26J03J16j73J0m50L80k60j7P6
5458g4R1q5R5j9j34M2J35k02j67K61J86k11L18J55r5k40j68O5j53K67n9K3K1K74
5482C26Qk47k3r6q2j26J39J10L42l4j97J32k49k91J25j31J86K49o0J95nk88J69
5505A52k10k93J17Jn6J51N35m47L32j88r5l07J61q9R7K14p2K48m26K47q6R4j32
$$ plain form
5528 -52 -166 -275 168 99 53 24 422 -267 85 -295 -306 -44 122 33 84 100 158 191 -148 60 47 -351 183 250
5552 250 127 160 553 94 -93 -106 -31 -137 3 74 66 82 380 172 73 96 -12 159 60 187 -197 -15 509
5575 509 77 -235 -105 -74 -195 -207 329 -24 244 414 193 -201 197 20 -12 215 51 174 313 117 28
5596 28 -20 -88 -252 -386 -5 -216 22 191 411 123 185 -27 -200 -272 77 -312 168 380 257 147 -95 207
5618 207 -275 -338 142 54 -78 -42 176 234 342 217 -176 -156 51 113 116 276 426 443 128 137 -53 -39 -70 -82 -364
5643 -364 -124 63 49 -91 114 -28 210 -83 -183 -24 95 -6 -81 180 44 -141 -271 -306 90 -29 55
5664 55 173 21 77 329 -139 -65 -23 -251 -266 -55 203 73 247 263 174 -112 43 -154 -17 131 213 196 229
5687 229 351 59 96 -7 -255 -91 -30 50 -14 207 -34 108 -18 -24 75 -302 -82 64 106 243 156 -68 18
$$ packed form
5528e2j14j09M43o9m6k9L98o89L52l80j1K62J66q9N1J6N8L3l39K08j3l98N34O7
5552B50j23L3L93m59j87j3P5j06J40P1qJ6K98k08r9K3j08J71r9J27l84J82N24
5575E09m32l12J30L1j21j2N36l53K68J70k21l94L98j77l2K27j64J23J39j96q9
5596B8m8o8j64j34L81k11K38J69K20k88O2k12j73p2L49l89M80K12j23j10k42L02
5618B07m82o3M80q8j32L6K18N8J08j25l93K0K07O2LJ60J50J7l15Rj90J4l1j2k82
5643c64K40J87j4j40K05j42K38k93j00J59J19j01p5K61j36j85j30l5L96j19Q4
5664E5J18j52N6K52m68P4M2k28j5K11K58j30J74J6q9k86J55j97J37J48Q2j7L3
5687B29J22k92L7j03k48J64O1Q0o4K21k41J42j26oR9l77K20J46M2J37q7k24Q6
$$ plain form
5710 18 -36 -316 -247 -77 -45 64 -43 -85 150 -153 99 25 -171 -365 154 139 198 231 -264 -75 -65 -16 -89 -353
5734 -353 57 49 275 657 -5 -79 -293 108 -207 -137 81 38 112 24 193 30 237 -300 -121 -199 232 -227 88
5757 88 88 77 -57 -241 -95 211 -298 -21 -113 -94 320 -88 279 73 -104 11 269 112 36 -64 112 325
5779 325 138 -36 -119 154 103 -256 144 365 -204 -44 24 290 368 11 14 -348 -31 -10 -218 285 178 -73
5801 -73 33 -121 -360 -59 159 -92 111 -26 29 20 -17 18 16 -312 -55 111 -34 76 166 91 288 -75 -247
5824 -247 -284 -143 68 -30 -101 -58 323 -69 -35 51 15 -366 -177 161 45 89 250 110 95 -12 -165 147 173
5847 173 -67 295 106 -25 -105 -1 -100 -44 -126 -94 96 45 56 -35 85 -77 67 -30 -39 -58 170 241 101 537
5871 537 92 -60 -35 -40 111 210 -11 46 88 199 -27 -72 286 -114 -238 2 -173 52 -23 388 169 -118 108
$$ packed form
5710A8n4k80O9J70L2J09j07m2K35l03K52p4j96j94N19j5N9L3m95J89J0M9p3k64
5734c53M10qK26L82o62p4k14M01l15P0K18m3P4q8J69j63K07n37J79p8M31m59L15
5757H8%j1j34j84J46L06n09K77r2J9M14m08L67k06j77J15K58j57p6j00J76K13
5779C25j87j74q3K73n1l59M00K21n69J60O8K66P8l57Ll62L17K1k08N03j07k51
5801g3J06j54k39L01K18k51K03j37N5rl7L5kl28K57J66j45J10R0p5J97l63j72
5824b47l7J41K11r8p1M3L81l92L4Q6l6l81J89L38j16M4J61j40j5j07j53L12K6
5847A73k40L62j89j31q0J04r9N6q2L2J90n1J1r1J20j62J44r7rj9K28P1j40M36
5871E37m45j52K5nJ51R9k21N7M2J11k26m5L58m00j24K40j75K25p5M11k19k87K26
$$ plain form
5894 108 202 -127 -82 -242 -243 90 17 39 -91 -84 111 9 -23 187 -181 -7 171 256 10 4 -80 121 -224 112
5918 112 -183 202 287 -57 11 417 -36 17 -42 15 192 -141 136 91 129 46 63 15 -79 -24 -318 156 -25 -109
5942 -109 -106 214 226 69 80 -82 -35 99 113 444 40 -98 120 -96 41 -56 -89 11 -54 84 184 -107 -225
5965 -225 -237 148 -208 -67 11 6 -56 31 168 198 -19 -167 -156 -96 -79 136 278 9 -150 -14 -153 -214 20 -355
5989 -355 -249 137 112 169 240 72 -42 -194 8 -79 -224 -261 -43 184 -241 219 105 -308 -24 -42 -95 193
6011 193 114 245 -134 81 58 16 118 -104 -11 34 121 296 -148 63 -25 -75 -80 -245 120 -148 89 186 32 82
6035 82 197 199 -23 156 -277 -234 -88 -42 285 221 100 -17 -141 187 -398 -272 280 178 29 -6 123 -125
6057 -125 55 -174 -100 93 241 46 165 165 91 -257 -68 -121 -130 -289 96 -236 -403 187 154 242 -102 54 -53
$$ packed form
5894A08R4l29M5j60jL33p3K2j30PJ95j02l2K10l68J74J78Q5k46oq4K01l45L36
5918A12k95L85Q5l44O8M06m53N3n9N7J77l33K77m5L8q3J7m8r4N5k94M74j81q4
5942a09LL20J2j57J1j62M7J34J4L31m04j38K18k16J37r7l3J00o5J38J00k91j18
5965b25j2L85l56J41P8no2Q7J37L0k17j48J1O0J7K15J42k69j59J36j39o1K34l75
5989c55J06L86k5N7P1j68j14j52K02q7j45l7K18K27m25M60j14m13K84j8n3K88
6011A93p9J31l79K15k3m2J02k22R3M5Q7J75m44K11q8n0nj65L65k68K37R7j54N0
6035H2J15Kk22J79m33M3J46M6L27o4j21j17j24L28n85J26N52j02j49l5J29k48
6057a25J80k29P4J93J48j95J19%p4l48J89n3rj59L85l32j67N90l3Q8l44J56j07
$$ plain form
6080 -53 -249 -7 337 73 140 285 -172 -253 406 -95 137 35 38 -86 -70 -158 202 183 -145 -133 -7 -57 -307
6103 -307 275 242 115 290 34 -96 -128 170 -217 -295 127 60 -10 19 -110 20 260 -155 148 -249 -34 -18
6125 -18 27 39 81 -181 -90 28 385 26 -135 74 -41 -133 -237 -94 -47 47 87 220 -26 -236 -27 -29 273 173
6149 173 -2 140 182 -94 197 263 -37 -13 151 63 100 19 65 -112 -150 -223 -170 84 24 15 -111 -181 196 21 59
6174 59 -191 340 24 10 22 -163 53 140 29 87 -6 -128 -155 7 -101 170 -106 -163 -102 -124 -164 -12 98 32
6198 32 -311 49 33 236 42 -143 216 -257 201 -368 -62 -170 -55 28 -2 -16 125 -2 120 -270 115 -124
6220 -124 143 -24 94 -162 78 96 18 369 125 31 -76 468 23 169 -88 12 -8 107 263 -104 49
6241 49 46 -60 -92 -360 149 185 -108 -109 94 -176 68 106 234 -49 -102 -53 -170 -49 173 117 -189 186 116 152
$$ packed form
6080e3j96K42L44k64O7J45m57q1O59n01K32j02Lj24J6q8L60j9l28J2J26n0k50
6103c07N82l3j27J75k56j30l2K98l87p8M22o7p0K9j29J30K40m15L03l97K15J6
6125a8M5J2M2k62R1J18L57l59j61K09j15r2j04J43M7R4M0J33k46k10K09kL02j00
6149A73j75J42M2k76K91O6l00K4J64q8L7q1M6j77l8p3N3K54o0rj26p0L77j75L8
6174E9k50N31l16j4J2j85K16Q7j11N8r3j22k7J62j08K71k76n7O1k2m0J52J10o6
6198C2l43L60j6K03j94j85L59m73M58n69L06j08J15Q3l0j4J41j27J22l90L85k39
6220a24K67j67J18k56K40J8p8L51k44r4j07N44m45J46k57J00k0J15J56l67J53
6241D9lj06l2k68N09L6k93jK03k70K44L8J28k83n3M9j17J21K22n6l06L75p0L6
$$ plain form
6265 152 8 207 -57 -2 81 -73 -91 177 -79 -16 30 -390 -183 -136 -290 -63 -105 33 0 -55 -26 117 116 69
6289 69 -97 -104 30 9 150 202 77 244 -40 -286 -242 -23 80 143 -203 -6 -72 98 -123 -299 248 87 144
6312 144 240 -188 -166 -75 -18 -428 176 -67 -19 50 -84 142 36 227 98 68 -130 -201 140 18 -104 144 174
6335 174 137 -227 -74 -106 -222 -65 -67 79 -11 16 -26 136 170 81 339 152 93 -20 -116 -17 159 54 -60 179
6359 179 187 -46 -13 -8 -148 -156 42 53 -147 -184 141 80 219 -90 -56 127 -150 73 276 -26 -61 -158 -286 129
6383 129 21 -67 -243 -33 -64 -15 -49 -27 -132 154 -59 1 -39 106 -32 5 308 -203 33 22 -5 -14 -7 81 -139
6408 -139 128 138 -201 93 -145 -133 404 107 78 -92 28 -106 -145 -55 97 10 21 175 44 -42 -10 69 -189
6431 -189 40 -61 -201 96 52 72 -70 -194 156 185 -48 -196 98 -199 -74 107 268 -117 -151 -109 58 -260
$$ packed form
6265A52j44J99k64N5Q3j54j8K68k56O3M6m20K07M7j54K27m2J38l3n5K9J43jm7
6289F9j66pJ34k1J41N2j25J67k84k46M4K19J03O3l46J97o6J70k21j76N47j61N7
6312A44R6m28K2R1N7m10O04k43M8O9j34K26j06J91j29l0j98p1L41j22j22K48L0
6335A74l7l64J53l2j16J57kJ46r0K7m2J62L4q9K58j87n9j13r6R9J76j05j14K39
6359A79Qk33L3Nj40qJ98J1k00l7L25o1J39l09L4J83k77K23K03l02l5r7j28M15
6383A29j08q8j76K10l1M9l4K2j05K86k13O0m0J45j38L7L03n11K36j1k7rPQ8k20
6408a39K67J0l39K94k38J2N37k97k9j70J20j34l9R0J52q7J1J54j31q6L2P9k58
6431a89K29j01j40K97m4K0j42j24L50K9k33j48K94k97J25J81J61l85l4M2J67l18
$$ plain form
6453 -260 -17 6 44 160 135 131 101 -14 77 -6 78 124 23 33 58 -114 20 60 312 -33 -124 247 -109 7 -137
6478 -137 278 311 -49 56 -28 -163 47 129 -94 28 22 45 123 -59 -140 -266 33 120 -274 63 167 -139 -4
6501 -4 61 111 224 251 206 23 -127 -53 -25 -95 -12 -142 -10 -44 161 -87 120 176 -185 369 -222 -221 -140 -104 -74 -84
6527 -84 -28 -12 -171 28 125 -118 -92 -293 -1 -18 -137 95 -57 22 101 174 -45 -26 -236 65 -202 179 -149
6550 -149 -23 -104 -104 -85 -68 147 -257 -50 60 215 182 166 -18 69 74 -63 134 -134 62 -108 267 319 -74 -4
6574 -4 104 -370 -68 237 -141 266 273 59 268 -40 -87 157 -129 -297 -6 50 72 101 139 -40 1 -230 8
6597 8 -23 92 36 102 -22 73 39 11 -154 -135 1 -26 -23 48 -382 -226 -83 155 -168 132 35 -230 3 81 15
6622 15 209 186 -18 3 -149 150 -263 125 141 187 75 16 -260 -103 -113 87 118 197 162 -20 -51 -64 -6 167
$$ packed form
6453b60K43K3L8J16k5ml0j15R1q3Q4M6j01J0K5j72J34M0K52l45r1L71l56J16j44
6478a37M15L3l60J05q4j35K10Q2k23J22oK3P8j82q1j26K99Q7l94L37J04l06J35
6501dO5N0J13K7m5j83j50P4K8p0Q3j30J32l4K05k48K07N6l61N54n91JQ1L6L0j0
6527h4N6J6j59J99R7k43K6k01K92j7j19K32j52P9P9P3k19J9k10L01k67L81l28
6550a49J26q1%J9J7K15m04K07J10J55l3j6j84Q7Nj37J97k68J96j70L75N2l93P0
6574dJ08m74L02L05l78M07Pk14K09l08m7K44k86j68K91N6K2K9L8j79M1k31K38
6597Hl1J15n6O6j24R5l4k8j65J9J36k7LP1m30J56J43K38l23L00r7k65K33P8o6
6622A5J94k3k04K1j52K99m13L88J6M6j12n9k76J57j0K00L1P9l5j82l1j3N8J73
$$ plain form
6646 167 86 77 -125 -303 27 11 178 55 55 -292 93 -47 28 -125 -85 -75 -159 181 253 -355 -17 83 -283 -329
6670 -329 180 -89 401 216 -193 30 41 5 -138 -113 -78 -61 234 139 163 3 -94 -57 -271 -182 -69 185 -25
6693 -25 141 -440 -94 -194 -223 -119 -55 187 -26 -119 77 -9 215 180 -166 -104 -133 113 72 -190 156 -50 -84
6716 -84 123 -228 -174 -104 159 -161 43 50 70 65 414 111 38 -56 -9 -61 -257 123 219 69 139 66 -11 69 -397 23
6742 23 -31 166 203 -214 204 20 -111 29 -294 -210 -92 302 -69 35 78 -300 -100 -164 -169 142 222 -106 44
6765 44 258 85 46 -169 123 -37 10 11 -46 343 -359 283 150 130 -107 -201 -36 5 -109 111 36 16 234 -109
6789 -109 124 -71 -46 -23 -26 -60 120 172 132 107 106 76 146 252 -144 173 300 -102 -31 -99 24 -39 -147 -80 -307
6814 -307 258 13 316 83 32 201 -57 -161 -50 25 89 -104 303 -37 51 104 -23 21 6 88 68 352 187
$$ packed form
6646A67q1rk02j78L30j6J67j23%l47L85j40P5j53M0J0q4L40P2o08L38J00l66m6
6670c29N09k69M90j85m09K23J1l6j43K5L5J7K95r5K4j60r7L7k14Q9J13K54k10
6693b5J66n81L46j00k9J04O4K42k13r3J96q6K24l5l46O2k9K46m1k62L46k06l4
6716h4K07l51N4P0K63l20K04PK0nL49l03p3r4M7n2j96L80R6j50P0p3p7Q0m66M20
6742B3n4J97L7m17M18j84j31J40l23Q4J18L94l71J04M3l78K00o4nL11Q0l28J50
6765D4K14j73l9k15K92j60M7Jn7L89p02O42j33k0k37r4J65M1j14K20p5k0K18l43
6789a09K33j95K5K3ll4J80N2m0k5jl0P0J06l96L17J27m02P1o8J23o3j08O7k27
6814c07N65k45L03k33n1J69k58j04J11P5O4j93M07l40Q8N3j27M4j5Q2k0K84j65
$$ plain form
6837 187 82 53 55 -110 46 122 -321 -51 -74 2 -174 -120 -272 81 -120 13 -17 59 -14 106 -152 142 293
6860 293 -55 -8 -64 -80 -14 149 200 88 17 242 239 0 -141 -252 -66 58 111 45 200 337 -91 57 94 -27
6884 -27 112 -9 -44 213 108 -38 101 -69 -139 -139 -98 86 7 308 225 -76 -110 103 -185 95 -41 -74 66
6907 66 152 -280 349 116 47 -112 -149 -78 126 -32 -10 -107 130 4 -269 -16 181 59 -215 2 -57 77 -136
6930 -136 200 -77 31 -206 62 138 80 -4 9 -83 268 72 -94 10 -447 178 13 -112 -76 -15 63 68 -73
6953 -73 -191 -225 -393 -73 18 -253 -28 55 -120 -34 -41 55 -53 -43 170 260 -175 179 1 81 11 -76 -193 -61
6977 -61 -152 61 23 -115 24 -250 101 -138 -282 -259 -264 -202 229 -24 74 219 -201 -49 -26 -37 35 -159 24 79
7001 79 -142 126 17 39 -180 -95 -266 213 131 -187 130 -235 63 -66 106 125 -403 -64 191 192 -42 304
$$ packed form
6837A87j05k9Kj65J56P6m43K70k3P6j76N4j52L53k01J33l0P6p3J20k58K94J51
6860B93l48M7n6j6O6J63N1j12p1K25lk39j41j11J86J24N3o6J55J37m28J48L7j21
6884b7J39j21l5K57j05j46J39j70p0%M1J84p9L01q3l01l4K13k88K80j36l3J40
6907F6Q6m32O29k33o9j59l7P1K04j58K2r7K37j26k73K53J97j22k74K17n9J34k13
6930a36L36k77J08k37K68P6n8q4J3r2L51j96j66J04m57O25j65j25L6O1P8Nj41
6953g3j18l4j68L20R1k71K25Q3j75Q6pR6j08J0K13R0m35L54j78Q0p0q7j17J32
6977f1r1K13l8j38J39k74L51k39j44K3nO2M31k53R8J45m20J52K3j1P2j94J83N5
7001G9k21K68j09K2k19Q5j71M79q2l18L17l65K98j29J72J9n28L39K55Jk34L46
$$ plain form
7023 304 34 108 -44 168 90 -302 -67 -85 -331 88 321 -328 106 -97 237 -153 210 84 202 -158 -193
7044 -193 78 -88 186 -82 40 -343 18 118 301 -60 -161 105 -97 110 -12 63 11 92 126 48 -187 -179
7066 -179 -224 -294 39 258 52 62 49 22 -293 -201 -134 116 -25 -232 -35 70 247 -9 -200 47 -17 -285 2
7089 2 124 71 207 246 11 -191 437 -153 -245 350 -242 28 -160 -16 -214 -77 139 -92 102 -86 62 -170
7111 -170 -31 22 -2 300 251 280 -46 -206 267 -185 100 -180 -89 -91 -206 -129 62 35 -65 -88 -5 -96 -24 107
7135 107 15 -12 -48 52 -36 -100 365 189 -260 29 -84 -92 -93 -4 194 -63 -27 -11 -69 -35 9 -203 -53 -51 -145 37
7161 37 -36 143 -99 83 77 184 -104 74 267 -227 70 -210 158 59 154 139 291 -90 -48 -5 10 -24 76 -40
7185 -40 -11 55 -63 33 135 -163 268 392 -258 -25 -1 85 235 31 14 -85 9 -178 -42 -38 186 37 -1 -313
$$ packed form
7023C04k70P4j52K12p8l92K35j8k46M19K33o49M34k03L34l90L63j26J18l60l5
7044a93K71j66K74k68J22l83L61J00J83l61j01K66k02K07j22P5n2Q1L4p8k35Q
7066a79m5p0L33K19k06J0j3k7l15R2O7K50j41k07J97J05J77k56j91K47o4k68K87
7089BJ22n3J36L9k35k02O28n90r2N95n92K70j88J44j98J37K16k31J94j88J48k32
7111a70J39N3k4L02m9K9l26j60M73m52K85k80R1kj15P7J91k7j00k3Q3r1P2J31
7135A07r2k7l6J00q8o4M65j76m49K89j13qjQ9J98k57L6J6n8L4M4k12J50Kr4J82
7161C7p3J79k42J82oJ07k88J78J93m94K97k80L68r9R5j5J52l81M2M3J5l4J00j16
7185d0K9O6j18R6J02k98M31J24o50K33K4Q6J50k04j7r9R4j87J36MK24j49l8l12
$$ plain form
7209 -313 -150 115 -251 20 -221 -136 -39 287 -157 142 9 -55 -108 -42 -316 31 -98 15 28 101 -180 -334
7231 -334 72 19 35 -183 100 -68 47 -53 63 8 -52 -215 -143 61 84 52 25 -16 101 -40 143 -2 171
7254 171 163 -28 36 -91 -73 67 97 110 -140 -182 -1 172 45 -4 128 135 136 26 -116 -114 -63 -262 -11 223 -188
7279 -188 53 155 -44 62 -84 -78 -36 -56 55 -188 -57 -287 -163 128 -175 -72 -124 47 -102 68 -83 85
7301 85 -75 -239 33 -167 -42 196 -302 -195 37 11 -292 284 -259 -55 37 -10 45 67 -72 174 -20 -77
7323 -77 -181 200 -30 -83 134 69 -97 30 422 94 100 25 -6 -76 -193 -125 150 87 -90 -152 110 -159 12 -179
7347 -179 43 116 -46 136 -182 59 -15 -329 -240 -162 -128 186 -127 115 63 -88 27 -10 24 214 -161 63 277
7370 277 237 -154 -250 85 -30 38 -47 -53 -93 -86 -11 175 -25 -187 -36 -53 99 -99 -247 -86 -16 -19 145 25 -137
$$ packed form
7209c13J63K65l66K71k41Q5R7L26m44K99j33o4n3O6k74L47j29J13J3P3k81j54
7231c34M06n3J6k18K83j68J15j00J16n5o0j63P2K04K3l2k7m1J17j41J83j45J73
7254A71qj91O4j27J8J40L0J3k50m2J81J73j27m9J32PJj10j42KN1j99K51K34m11
7279a88K41J02j99J06j46OM2k0J11k43J31k30J24K91l03J03n2J71j49J70j51J68
7301H5j60j64K72k00J25K38m98J07K32k6l03N76n43K04R2m7N5K2j39K46j94n7
7323g7j04L81k30n3K17o5j66J27L92l28Op5l1p0j17O8K75o3j77o2K62k69J71j91
7347a79K22P3j62J82l18K41p4l14Q9P8L4L14l13K42n2j51J15l7L4J90l75K24K14
7370B77m0l91r6L35j15O8q5om0PP5J86k00j62J51j7J52j98j48J61P0lJ64j20j62
$$ plain form
7395 -137 -18 24 -123 -74 -14 -146 -54 -28 113 -214 110 9 123 -49 120 75 -59 110 -472 36 9 -112
7417 -112 24 -77 -57 71 -121 212 -197 38 -169 -29 -95 35 -113 3 -169 -65 102 -81 -156 -28 235
7438 235 67 174 44 -260 -39 307 111 188 181 -54 248 15 -175 -282 70 -31 -53 67 45 54 52 63 -56
7461 -56 -17 67 262 -26 -90 123 118 -70 -145 -19 -368 -75 -60 249 217 191 -178 60 -121 -29 50 197 -65 71
7485 71 13 -78 185 -6 210 -95 -87 -360 -14 -49 61 -100 -213 26 -178 -140 -355 -23 82 42 108 140 -101
7508 -101 63 -47 204 -37 -86 102 216 85 -70 206 319 -82 -76 -291 -83 126 77 25 43 -111 113 -223
7530 -223 -356 -181 -142 -221 -185 -174 55 -101 306 -313 -134 204 -221 246 10 38 -30 71 -83 86 86 220 -171
7553 -171 74 -216 68 222 99 138 66 144 120 79 36 85 -8 -86 291 -330 157 -116 -68 55 100 -78 173 -121
$$ packed form
7395a37J19M2j47M9O0j32R2K6J41l27L24j01J14j72J69m5j34J69n82N08k7j21
7417a12J36j01K0J28j92L33m09K35k07J40o6J30j48J16j72J04J67j83p5J28K63
7438B35j68J07j30l04K21L46j96P7pk35L02k33j90j07L52j01k2J20k2RkJ1j19
7461e6L9Q4J95k88o4K13nj88p5J26l49K93J5L09l2k6l69K38j81R2P9J47k62J36
7485G1n8r1K63j91K16l05Qk73L46l5J10j61j13K39k04L8k15L32J05m0O6L2k41
7508a01J64j10K51k41m9J88J14j31j55K76J13m01Ok15K08K09m9n2J8j54K24l36
7530b23j33J75L9p9L6J1K29j56M07o19J79L38m25M67k36K8o8J01j54J69%J34l91
7553a71K45k90K84J54j23L9p2P8k4m1m3M9r3p8L77o21M87k73M8J23M5j78K51k94
$$ plain form
7577 -121 198 63 -43 -6 -144 168 -86 280 203 293 87 99 -229 -35 90 68 20 13 -124 80 39 -51 -89 -94
7601 -94 -6 -213 -22 154 145 -102 72 55 -263 -127 -153 94 66 23 368 -22 204 150 227 -28 -42 222 -146 212
7625 212 -26 191 -76 -10 234 297 -265 -106 36 -61 129 32 83 -261 -4 117 -227 113 -13 80 60 -200
7647 -200 36 104 12 172 117 79 22 147 1 21 -17 -217 -114 91 419 33 -201 -68 -173 -25 44 -141 98
7670 98 188 68 76 -94 -172 36 -290 -86 -216 -106 283 185 40 -1 -332 156 99 79 -24 176 134 171 -35 -230
7694 -230 64 -193 -103 182 -33 322 -34 66 207 202 -189 -327 -255 -167 -12 22 71 -77 -60 -105 -71 -262 214
7717 214 -65 -28 24 -134 176 104 -311 -107 -69 132 4 192 -16 -76 -101 282 -355 -225 245 112 102 -75
7739 -75 90 18 -41 -165 27 -28 -40 -229 66 71 -142 158 -7 176 139 -250 -16 -79 -258 -263 -80 225 116 143
$$ packed form
7577a21L19j35j06L7j38L12k54L66p7R0k06J2l28J94J25k2m8pj37K04m1r0l8n
7601i4Q8k07J91J76rk47J74j7l18J36k6K47k8m3L45l90K26n4P7k55j4K64l68L58
7625B12k38K17k67O6K44O3n62J59J42r7J90r7N1l44K57J21l44L40j26R3k0k60
7647b00K36O8r2J60n5l8n7J25j46K0l8k00J03K05L28l86k34J33j05J48O9j85K39
7670I8R0j20Qj70p8K08l26K04j30J10L89r8j45m1l31M88n7k0j03K00m2L7k06j95
7694b30K94k57R0K85k15L55l56J00J41nl91j38P2Q8J55L4M9j48J7m5L4j91M76
7717B14k79L7N2j58L10p2m15K04L8K01j28J88k08o0k5L83o37J30M70j33j0j77
7739g5J65p2n9j24J92n5j2j89K95Nk13L00j65J83l7l89K34o3j79nJ83L05j09K7
$$ plain form
7763 143 -182 -42 39 -113 144 32 -82 49 373 140 -30 25 2 -167 43 72 47 212 -3 16 116 293
7785 293 -112 -4 180 -368 88 125 97 142 4 27 182 101 61 9 -160 -89 -172 142 -32 -195 -10 -281 43
7808 43 69 210 34 -15 -190 43 -82 34 -114 -31 -55 -50 -76 114 -94 124 82 -107 10 60 -133 -25 10 -32
7832 -32 216 97 46 124 2 -80 -61 -43 37 -96 248 372 203 -159 3 68 -203 -38 -243 197 -86 -39 9
7855 9 -5 -190 188 -5 49 390 157 158 442 -21 -158 50 -193 11 -45 45 94 -79 -98 233 166 0 -84 18
7879 18 -15 -114 -149 82 139 -42 375 -22 88 254 -136 -223 30 84 -43 47 124 135 -93 48 104 305 0 -32
7903 -32 -148 40 43 -8 299 66 87 254 -173 -149 203 -31 210 -82 -131 -133 -142 31 138 -79 -245 -33 -64 2
7927 2 -15 -211 -90 -39 119 -22 -140 -122 96 100 54 -180 18 -128 172 -169 140 64 169 -306 124 -199 -137
$$ packed form
7763A43l25J40Q1j52K57j12j14J31L24k33j70N5k3j69K10K9k5J65k15J9J00J77
7785B93m05J08J84n48M56L7k8M5j38K3J55q1m0n2j69P1q3L14j74j63J85k71L24
7808D3K6J41j76m9j75K33j25J16j48Q3k4Nk6J90k08K18m2j89J17N0j93J08L5m2
7832c2K48j19n1P8j22q2J9J8Q0j33L44J24j69l62J62O5k71J65k05M40k83M7M8
7855Ij4j85L78j93N4L41k33JK84m63j37K08k43K04n6R0M9j73j9L31o7j66q4J02
7879A8l3r9l5K31N7j81M17l97J10J66l90q7K53N4j27R0P7J1k28J41N6K01l05l2
7903c2j16J88Ln1L07k33K1J67m27K4L52k34K41k92m9krJ73J07k17j66K12l1O6
7927Bj7j96J21N1J58j41j18J8K18Mm6k34J98j46L00l41L09p6J05m75M30l23O2
$$ plain form
7950 -137 -38 93 40 -84 -16 241 266 204 -350 -72 -89 -144 -88 -430 131 206 -14 328 -42 -77 -190 91 103 33
7974 33 214 -17 375 -30 -100 -324 -294 40 -205 138 -128 -30 8 73 35 -40 154 47 78 -338 -57 182 231
7997 231 -247 107 -9 49 -97 -380 -46 -173 -102 138 24 -315 40 102 -10 -2 -59 11 236 -91 -314 188
8019 188 -92 -142 -218 -268 76 -100 168 -78 182 119 48 -106 -119 -16 85 120 58 -201 -36 -149 -53 22 -178
8042 -178 -338 -271 14 -108 117 213 168 -38 290 -33 264 8 -29 -164 -70 37 20 156 139 89 -245 -137 5
8065 5 -147 -177 -183 18 -185 57 123 152 -24 -173 11 30 -31 -2 255 22 26 3 -174 147 199 27 138 -99 187
8090 187 130 114 -102 -159 -167 197 -122 27 91 -101 389 21 223 53 264 -301 17 -106 257 116 76 246
8112 246 134 -158 140 212 -5 -199 -15 -36 74 156 115 19 -55 299 79 -83 -138 95 63 132 427 19 208
$$ packed form
7950a37R9J31n3j24O8K57K5o2n54K78j7n5N6l42N61P5k20L42l70l5j13K81J2p0
7974C3J81k31L92m05p0k24L0L34k45L43k66R8L8O5l8p5J94j07L1m16K81K39M9
7997B31m78L54j16N8j46k83L34j27P1K40j14l39L55O2j12Qn7P0K25l27k23N02
8019A88k80n0p6n0L44j76K68k46K60o3p1j54j3J03J01L5o2k59J65j13R6P5k00
8042a78j60O7K85j22K25R6m5k06L28l23K97k56l7j35R4J07j7J36j7n0l34J08J42
8065Ej52l0oK01k03K42O6K9j76j49J84J9o1K9K57k33Mk3j77L21N2j72J11k37K86
8090A87n7j6k16n7qL64l19J49O4j92M90l68K02j70K11n65L18j23L63j41m0J70
8112B46j12k92K98P2k17j94J84k1J10Q2m1r6p4L54k20j62n5K33l2O9K95m08J89
$$ plain form
8135 208 -243 -14 -113 221 126 135 -204 -7 -265 187 -32 78 28 83 -73 -1 -51 -11 46 232 -128 -348 -208
8158 -208 -185 -139 479 -44 106 259 171 -26 -65 98 -256 -85 15 -528 147 -123 -298 -169 -115 131 -133 -33
8180 -33 23 84 -284 -155 16 94 -78 69 -97 -203 154
$$ packed form
8135B08m51K29r9L34r5Rl39J97k58M52k19J10n0N5j56P2n0M0N7J86l60k20J40
8158b08K3M6O18n23J50J53q8j97l9J63l54J71J00n43O75k70j75J29N4K46k64J00
8180c3N6O1l68J29J71P8j72J47j66j06L57
8191A54
$$ Imaginary data points
##PAGE= N=2
##DATA TABLE= (X++(I..I)), XYDATA
$$ plain form
0 0 0 0 0 0 0 0 0 -8 8 -8 8 -8 16 -16 24 -32 40 -48 56 -69 80 -97 118 -137 161 -185 217 -254 294 -335
30 -335 383 -439 496 -562 635 -712 803 -902 1009 -1123 1249 -1391 1543 -1708 1889 -2087
46 -2087 2304 -2540 2799 -3084 3397 -3743 4124 -4552 5027 -5564 6176 -6877 7691 -8650
60 -8650 9796 -11202 12968 -15263 18381 -22875 29959 -42818 73617 -307479 -72398 412856
72 412856 -171449 67765 442432 14062 -266397 128911 -39339 -266705 107500 162664
82 162664 -237229 12954 274924 -38626 7863 302660 -178536 -488750 14947 83747
92 83747 -291177 119472 528641 73982 -145063 120949 -126824 -333789 98518 161765
102 161765 -194645 43472 294136 -79253 -127545 211575 -14742 -279363 3444 -14686
$$ packed form
0@%%%%%%%qJ6j6J6j6K4l2M0n6P2q8J04j25J49j77K15k55K98l46M02m71N48o29
30c35P18q22R35j058J197j347J515j705J911k132K372k640K934l251L597l976
46b087M391m844N339n883O481p140P867q676R579j0591J1740j3053J4568j6341
60h650J8446k0998K4170k8231L3644m1256N2834p2777J16435l81096K35081M85254
72D12856n84305K39214L74667m28370k80459L95308j68250k27366L74205N5164
82A62664l99893K50183K61970l13550M6489K94797m81196l10214N03697O8800
92H3747l74924M10649M09169m54659k19045K66012k47773k06965M32307O3247
102A61765l56410K38117K50664l73389m8292L39120k26317k64621K82807j8130
$$ plain form
112 -14686 -292431 58968 394917 79148 -1616 214987 -89251 -340830 -9680 34883
122 34883 -188942 128477 335623 -93461 -158241 188674 -10728 -271342 25893 70944
132 70944 -216601 -9697 249971 18708 19052 266380 15565 -257471 -50932 -43729 -217966
143 -217966 66634 265564 -24734 -32075 190867 -68850 -274276 28665 72528 -162385
153 -162385 20780 199699 -29521 -9711 224237 31665 -165270 12427 -31713 -239553
163 -239553 -32450 161634 -2141 39821 203587 -29870 -203097 3016 2287 -155337 37271
174 37271 180015 -12862 -2973 161094 4963 -116903 41917 -10402 -194754 -53474 81023
185 81023 -36492 24857 186372 37487 -100047 10533 -28838 -157052 -7000 121444
$$ packed form
112a4686k77745L51399L35949l15769q0764K16603l04238k51579L31150M4563
122C4883k23825L17419K07146m29084o4780L46915j99402k60614K97235M5051
132G0944k87545K06904K59668k31263L44K47328k50815k73036K06539P203j74237
143b17966K84600J98930k90298p341K22942k59717k05426L02941M3863k34913
153a62385J83165J78919k29220J9810K33948j92572j96935J77697m4140k07840
163b39553K07103J94084j63775M1962J63766k33457j73227K06113p29j57624J92608
174C7271J42744j92877R889J64067j56131j21866J58820n2319j84352J41280J34497
185H1023j17515O1349J61515j48885j37534J10580l9371j28214J50052J28444
$$ plain form
195 121444 7737 26061 137524 11601 -89832 18515 -13560 -141533 -43834 43844 -51153
206 -51153 -1761 142927 60344 -35230 41534 -3731 -135592 -51347 53934 -7998 23263
217 23263 127447 42795 -50841 8531 -21208 -119456 -48745 20467 -44203 -2941 107521 53238
229 53238 -2537 61575 13934 -102054 -51134 10739 -42796 500 105842 53841 -14116 28884
241 28884 -7792 -104831 -65418 -5021 -37925 -6214 81023 63066 27069 52033 14926 -58103
253 -58103 -43625 -27575 -55249 -6191 65164 39173 19257 52428 3730 -81329 -60124 -23819
265 -23819 -50667 -20584 65013 71785 38512 48901 32804 -31122 -55076 -45574 -47620 -23214 23718
278 23718 39073 42884 49037 11984 -39688 -45433 -44091 -57364 -22008 41582 54277 48442 64675
$$ packed form
195A21444j13707J8324J11463j25923j01433J08347l2075j27973R7699Q7678r4997
206e1153M9392J44688q2583r5574P6764m5265j31861Q4245J05281o1932L1261
217B3263J04184q4652r3636N9372k9739r8248P0711O9212o4670M1262J10462n4283
229E3238n5775O4112m7641j15988N0920O1873n3535M3296J05342n2001o7957M3000
241B8884l6676r7039L9413O0397l2904L1711Q7237j7957l5997K4964l7107p3029
253e8103J4478J6050k7674M9058P1355k5991j9916L3171m8698q5059K1205L6305
265b3819k6848L0083Q5597O772l3273J0389j6097o3926k3954R502k046K4406M6932
278B3718J5355L811O153l7053n1672n745J342j3273L5356O3590J2695n835J6233
$$ plain form
291 64675 42135 -22801 -47811 -43753 -57813 -46865 8359 41686 39459 42863 34778 -6968 -43556
304 -43556 -51002 -45764 -27173 6575 39271 62060 65074 36821 -2254 -27314 -50296 -68361 -49567
317 -49567 -4158 24292 35761 48881 46111 10593 -30106 -45290 -41432 -34998 -14422 27486 60409
330 60409 56956 36401 17825 -13977 -52346 -63648 -47414 -23384 7058 36918 48482 45303
342 45303 28606 -9905 -41090 -39339 -33199 -28074 9469 52127 50570 34126 29078 -1344 -46618
355 -46618 -55413 -44422 -37667 -6041 34623 41159 40812 44588 8214 -36251 -32423 -27048 -41657 -9551
369 -9551 44735 41525 25863 39772 13780 -42723 -46697 -33769 -46281 -20269 32242 33969 29581
382 29581 52233 25187 -28615 -22532 -16811 -51335 -27409 34598 27567 15739 50896 27389 -38977
$$ packed form
291F4675k2540o4936k5010M058j4060J0948N5224L3327k227L404q085m1746l6588
304d3556p446N238J8591L3748L2696K2789L014k8253l9075k5060k2982j8065J8794
317d9567M5409K8450J1469J3120k770l5518m0699j5184L858O434K0576M1908L2923
330F0409l453k0555j8576l1802l8369j1302J6234K4030L0442K9860J1564l179
342D5303j6697l8511l1185J751O140N125L7543M2658j557j6444n048l0422m5274
355d6618q795J0991O755L1626M0664O536l47L776l6374m4465L828N375j4609L2106
369i551N4286l210j5662J3909k5992n6503l974J2928j2512K6012N2511J727m388
382B9581K2652k7046n3802O083N721l4524K3926O2007p031j1828L5157k3507o6366
$$ plain form
395 -38977 -34421 -21163 -55527 -30542 33905 25495 14677 56671 35587 -26041 -10693 -1501 -54670
408 -54670 -37908 25631 8698 -765 57141 40372 -29958 -16939 -7292 -63278 -43049 30931
420 30931 16649 5995 63134 42788 -27804 -5940 9268 -52674 -38627 24510 -5491 -19891
432 -19891 50918 43154 -22442 4996 15859 -61593 -54051 20125 200 -6947 70459 55478 -24887
445 -24887 -1032 15037 -58546 -43943 29812 -6885 -30038 44503 34967 -28593 19783 39581
457 39581 -50834 -47103 19816 -25672 -35471 68453 62960 -17734 20367 31622 -70704 -60796
469 -60796 27437 -9021 -32146 51123 36195 -35443 17170 40500 -42317 -24933 33433 -38400
481 -38400 -55014 52339 44122 -20617 47618 59508 -64224 -64780 15163 -31766 -44990 60171
$$ packed form
395c8977M556J3258l4364K4985O4447q410j0818M1994k1084o1628J5348R192n3169
408e4670J6762O3539j6933r463N7906j6769p0330J3019R647n5986K0229P3980
420C0931j4282j0654N7139k0346p0592K1864J5208o1942J4047O3137l0001j4400
432a9891P0809p764o5596K7438J0863p7452P542P4176j9925p147P7406j4981q0365
445b4887K3855J6069p3583J4603P3755l6697k3153P4541r536o3560M8376J9798
457C9581r0415L731O6919m5488r799J03924n493q0694L8101J1255j02326R908
469f0796Q8233l6458k3125Q3269j4928p1638N2613K3330q2817J7384N8366p1833
481c8400j6614J07353q217o4739O8235J1890j23732n56P9943m6929j3224J05161
$$ plain form
493 60171 51980 -26676 17459 33353 -47598 -21342 41484 -27714 -47618 39899 14919 -37534
505 -37534 52100 72475 -41337 -38378 16816 -57296 -68588 48607 48228 -12079 45675 45146 -60792
518 -60792 -35828 37377 -27100 -41812 50002 18398 -50002 29175 59888 -29002 -12847 37222
530 37222 -47359 -76573 17235 19214 -10116 65537 61742 -43753 -24133 22087 -57241 -52522
542 -52522 62936 33392 -43814 25393 46518 -41622 -13540 50994 -26024 -61822 13108 -408
554 -408 -34792 46806 66732 -9403 6633 20860 -73073 -64888 44937 18585 -31096 50075
566 50075 53963 -48047 -22869 35973 -29761 -39405 36982 -943 -52372 26318 52718 -8408
578 -8408 19283 41093 -48041 -58766 13396 -15293 -34523 60198 65655 -26353 -13082 19216
$$ packed form
493F0171q191p8656M4135J5894q0951K6256O2826o9198j9904Q7517k4980n2453
505c7534Q9634K0375j13812K959N5194p4112j1292J17195l79o0307N7754n29j05938
518f0792K4964P3205o4477j4712R1814l1604o8400P9177L0713q8890J6155N0069
530C7222q4581k9214R3808J979k9330P5653l795j05495J9620M6220p9328M719
542e2522J15458k9544p7206O9207K1125q8140K8082O4534p7018l5798P4930j3516
554d08l4384Q1598J9926p6135J6036J4227r3933Q185J09825k6352m9681Q1171
566E0075L888j02010K5178N8842o5734r644P6387l7925n1429P8690K6400o1126
578h408K7691K1810q9134j0725P2162k8689j9230R4721N457r2008J3271L2298
$$ plain form
590 19216 -43059 -37528 35061 2840 -33004 32458 32531 -30670 10701 50906 -19345 -38193 6842
603 6842 -29404 -46694 38560 54533 -7576 13568 32079 -41755 -51810 10713 -1873 -15950
615 -15950 41225 30731 -30115 3491 36363 -20815 -25874 20350 -16006 -45440 14031 25656
627 25656 -9851 29245 48434 -25474 -43245 1384 -18152 -28465 33345 36773 -9521 11830
639 11830 23738 -31201 -26122 22423 -6319 -32357 10898 12578 -16949 20658 41220 -9763
651 -9763 -17711 8594 -25967 -40904 14611 27696 508 22656 27178 -23522 -24612 8311 -13905
664 -13905 -24376 16191 14531 -14180 10309 26252 -5835 -3785 14780 -18704 -34304 3087
676 3087 8732 -5931 22676 32670 -6969 -14068 1503 -20596 -26314 9992 13428 -6039 11855
$$ packed form
590A9216o2275N531P2589l2221l5844O5462P3o3201M1371M0205p0251j8848M5035
603F842l6246j7290Q5254J5973o2109K1144J8511p3834j0055O2523j2586j4077
615a5950N7175j0494o0846L3606L2872n7178n059M6224l6356k9434N9471J1625
627B5656l5507L9096J9189p3908j7771M4629j9536j0313O1810L428m6294K1351
639A1830J1908n4939N079M8545k8742k6038M3255J680k9527L7607K0562n0983
651i763p948K6305l4561j4937N5515J3085k7188K2148M522n0700j090L2923k2216
664a3905j0471M0567j660k8711K4489J5943l2087K050J8565l3484j5600L7391
676C087N645j4663K8607R994l9639p099J5571k2099n718L6306L436j9467J7894
$$ plain form
689 11855 20827 -5329 -4659 10688 -10106 -21168 57 -1178 -10484 14191 26613 2530 -1264
702 -1264 5905 -17545 -26899 -842 5004 -4438 13956 22578 -191 -4235 6607 -7365 -17952
715 -17952 -2534 -69 -8690 6056 17382 5489 4188 8244 -8925 -19222 -6665 -4706 -7439
728 -7439 11123 19769 4994 2531 7541 -7990 -17655 -4015 -1742 -8789 3409 14530 5864 3559
742 3559 8517 -2267 -12752 -7874 -7100 -8605 4178 13053 7994 7918 8523 -4264 -12916 -6986 -6717
757 -6717 -9258 1597 10760 6801 5818 8995 47 -9151 -7177 -6702 -9016 -1140 8533 7926 7841 9231
773 9231 2022 -7506 -8556 -7982 -8406 -2698 5804 7646 8276 8111 2536 -4649 -6130 -7441 -9515 -3310
789 -3310 5147 5360 6806 10295 5328 -4238 -6735 -6607 -9067 -6374 2016 6684 7498 8171 5517 -149
$$ packed form
689A1855Q972k6156O70J5347k0794j1062K1225j235r306K4675J2422k4083l794
702a264P169k3450r354K6057N846r442J8394Q622k2769m044J0842j3972j0587
715a7952J5418K465q621J4746J1326j1893j301M056j7169j0297J2557J959k733
728g439J8562Q646j4775k463N010j5531r665J3640K273p047J2198J1121q666k305
742C559M958j0784j0485M878P74j505J2783Q875n059p6O05j2787q652N930K69
757f717k541J0855R163l959r83L177q948r198J974M75k314P876R673o07q5J390
773I231p209r528j050N74m24N708Q502J842O30j65n575p185j481j311k074O205
789c310Q457K13J446L489m967r566k497J28k460K693Q390M668Q14O73k654n666
$$ plain form
805 -149 -4484 -7428 -8981 -5120 537 3439 6800 9435 6341 -230 -3778 -6235 -8853 -7394 -1499
820 -1499 3410 6383 7790 6853 2999 -1911 -6700 -8025 -6083 -3270 947 5782 7938 6778 3313
835 3313 -1000 -5212 -7369 -7122 -4648 732 5443 6461 6951 5958 97 -5359 -6350 -6280 -5996 -1217 4390
852 4390 5950 6214 6608 1136 -4042 -4910 -6164 -7264 -1740 4193 4564 5814 7996 2494 -4271 -3876
868 -3876 -4941 -8265 -3586 3296 2928 4646 8621 3792 -3003 -2283 -4433 -9280 -4253 2790 2196 4167
884 4167 9666 4600 -3009 -1520 -3063 -9674 -4524 2907 620 1946 9317 4645 -2010 629 -1307
899 -1307 -10405 -6016 1584 -1378 1612 10984 6362 -2169 1382 -1467 -11127 -5626 3038 -1553 120
914 120 10301 5096 -2864 3191 1320 -9630 -5134 1584 -4960 -2136 10604 6620 -854 5220 1668
$$ packed form
805a49m335k944j553L861N657K902L361K635l094o571l548k457k618J459N895
820a499M909K973J407r37l854m910m789j325J942K813M217M835K156j160l465
835C313m313m212k157K47K474N380M711J018M90r93n861n456r91P0K84M779N607
852D390J560K64L94n472n178q68j254j100N524N933L71J250K182n502o765L95
868c876j065l324M679O882l68J718L975m829o795P20k150m847N027P043n94J971
884D167N499n066p609J489j543o611N150P431k287J326P371m672o655K639j936
899a307r098M389P600k962K990R372m622q531L551k849r660N501Q664m591J673
914A20J0181n205p960O055j871j0950M496O718o544K824J2740l984p474O074l552
$$ plain form
929 1668 -11634 -6719 1445 -4605 -928 11639 5746 -3120 4390 2266 -9620 -4116 3429 -6391
943 -6391 -4848 8675 4434 -1922 8619 5806 -9394 -6042 313 -8869 -4463 11635 6377 -1681
957 -1681 7290 3166 -11525 -4383 4303 -6570 -4689 8979 1831 -4839 8347 7307 -7170 -1681
971 -1681 2542 -11430 -8642 8363 3838 -612 11982 6682 -11176 -4719 2220 -9202 -4594 11008
985 11008 2387 -5338 7516 5095 -7391 1185 6080 -9449 -8628 5199 -1770 -3582 13185 10669
999 10669 -6154 -1347 1508 -13807 -8016 9407 3104 -2318 10034 4927 -9729 -577 6214 -7188
1013 -7188 -5033 6348 -4025 -8156 9237 9198 -2853 4901 4882 -13277 -10709 4090 -1823 -2108 13981
1028 13981 8279 -8296 -655 3213 -9785 -4190 9060 -1911 -7599 6488 4126 -5175 6810
$$ packed form
929A668j3302M915Q164o050L677J2567n893q866P510k124j1886N504P545r820
943f391J543J3523m241o356J0541k813j5200L352O355r182M406J6098n258q058
957a681Q971m124j4691P142Q686j0873J881J3668p148o670J3186j040j4477N489
971a681M223j3972K788J7005m525m450J2594n300j7858O457O939j1422M608J5602
985A1008q621p725J2854k421j2486Q576M895j5529Q21J3827o969j812J6767k516
999A0669j6823M807K855j5315N791J7423o303n422J2352n107j4656R152O791j3402
1013g188K155J1381j0373m131J7393l9j2051P754j9j8159K568J4799n913k85J6089
1028A3981n702j6575P641L868j2998N595J3250j0971n688J4087k362r301J1985
$$ plain form
1041 6810 9561 -8089 -8015 1274 -8013 -6744 12312 10167 -2431 4197 3358 -13266 -7362 6677
1055 6677 -1320 -3660 9135 2994 -7883 3857 7692 -5347 -2246 4335 -8593 -10653 6372
1068 6372 5866 -677 9918 7948 -10321 -8369 1142 -6251 -3772 11525 6206 -5076 3192 4222
1082 4222 -7650 -967 6286 -5100 -7926 3733 -137 -3918 9539 10578 -3997 -3535 -136 -10421
1096 -10421 -7963 7619 5768 -320 7471 4470 -8556 -4261 3631 -4100 -4021 5220 -778 -5665 5333
1111 5333 7515 -1727 1665 3856 -8297 -9847 1483 891 -565 9575 7972 -4633 -3369 12
1125 12 -7005 -4805 5416 1696 -3047 4166 3931 -3208 2027 5588 -4636 -6634 398 -2904 -3993
1140 -3993 6922 8284 93 1459 1022 -8060 -7152 1795 518 -434 6394 4048 -2791 675 2673
$$ packed form
1041F810K751j7650P4R289r287J269J9056k145j2598O628q39j6624N904J4039
1055F677p997k340J2795o141j0877J1740L835j3039L101O581j2928k060J7025
1068F372n06o543J0595j970j8269J952R511p393K479J5297n319j1282Q268J030
1082D222j1872O683P253j1386k826J1659l870l781J3457J039j4575M62L399j0285
1096a0421K458J5582j851o088P791l001j3026M295P892p731P9R241n998m887J0998
1111E333K182r242L392K191j2153j550J1330n92j456J0140j603j2605J264L381
1125A2p017K200J0221l720m743P213k35p139N235L561j0224j998P032l302j089
1140c993J0915J362q191J366m37r082R08Q947j277r52O828k346o839L466J998
$$ plain form
1155 2673 -3643 -2900 1514 -3621 -4830 3422 4556 725 4180 4461 -5043 -6917 -1845 -2543 -2228 5600
1171 5600 6344 111 1277 1804 -3789 -3535 309 -2135 -2607 1742 1894 25 4457 4346 -1812 -3297
1187 -3297 -1535 -4912 -4174 3318 4539 1894 4127 3567 -3321 -4679 -1541 -2529 -2937 1045 2142 1140
1203 1140 2693 2918 -65 -764 -1457 -4484 -3817 41 1119 1856 5312 4552 -1475 -2655 -1371 -4229
1219 -4229 -4416 519 2842 1318 2826 3580 1009 -1013 -1267 -2773 -3639 -1860 246 1551 4253 3965
1235 3965 1726 147 -1479 -4469 -4740 -946 199 859 3668 4631 1977 22 -818 -2764 -3889 -2003
1251 -2003 -204 626 2549 4073 2903 807 -1001 -2718 -3648 -3408 -1461 824 3137 3689 3425 2247
1267 2247 -506 -2892 -3458 -2666 -1776 -579 2422 3940 2620 1555 433 -1476 -3982 -3781 -2103 -368
$$ packed form
1155B673o316P43M414n135j209Q252J134l831L455K81r504j874N072o98L15P828
1171E600P44o233J166N27n593K54L844k444m72M349J52j869M432j11o158j485
1187c297J762l377P38P492J221k645K233n60o888j358L138r88m08L982J097j002
1203A140J553K25k983o99o93l027O67L858J078P37L456p60o027j180J284k858
1219d229j87M935K323j524J508P54k571k022k54j506q66J779K106J305K702k88
1235C965k239j579j626k990k71L794J145O60K809R63k654j955q40j946j125J886
1251b003J799Q30J923J524j170k096j808j717r30K40J947K285K313N52k64j178
1267B247k753k386n66P92Q90J197L001J518j320j065j122j909k506K01J678J735
$$ plain form
1283 -368 1250 3457 4106 2923 261 -1419 -2970 -3442 -3017 -947 1503 3092 3075 2596 1307 -953 -3500
1300 -3500 -3687 -2932 -1285 714 2863 4151 3274 1505 -681 -2271 -3946 -3367 -2063 219 2293 2866
1316 2866 3274 2256 -66 -2205 -3339 -3054 -2285 -267 2060 3454 3611 2216 687 -1395 -3187 -3677
1332 -3677 -2432 -497 1311 2570 3324 2874 1019 -1446 -2418 -3292 -2732 -1284 892 2625 3614 2852 1560
1349 1560 -486 -2431 -3698 -2985 -1510 -91 2069 3408 3292 1596 -216 -1509 -2995 -3134 -1797 -418
1365 -418 1928 2876 3172 1873 508 -1645 -3394 -3140 -2025 -1328 1050 3271 2804 2069 1471 -358 -2729
1382 -2729 -3058 -2005 -1138 281 2409 3102 2438 1439 -481 -2381 -2898 -2851 -1986 153 2389 2642 2265 2591
1400 2591 341 -2440 -2499 -1801 -2336 -642 2607 2679 1798 2079 1107 -2051 -2645 -2096 -2474 -1001 1471 2153
$$ packed form
1283c68J618K207O49j183k662j680j551m72M25K070K450J589j7m79j289k260k547
1300c500j87P55J647J999K149J288q77j769k186j590j675N79J304K282K074N73
1316B866M08j018k322k139j134K85P69K018K327J394J57j395j529k082j792m90
1332c677J245J935J808J259P54m50j855k465r72q74N60J448K176J733R89p62j292
1349A560k046j945j267P13J475J419K160J339j16j696j812j293j486j39J337J379
1365d18K346R48K96j299j365k153j749K54J115O97K378K221m67p35n98j829k371
1382b729l29J053Q67J419K128O93o64r99j920j900n17M7Q65K139K236K53l77L26
1400B591k250k781n9O98n35J694L249P2q81K81r72l158n94N49l78J473K472O82
$$ plain form
1418 2153 2642 2781 1292 -1342 -1550 -2060 -3044 -1123 1616 1291 1369 2905 1419 -1454 -1616 -1301 -3280
1435 -3280 -2540 1048 1496 1705 3416 2827 -354 -1656 -2107 -3433 -1847 601 925 1281 3270 1665 -979
1452 -979 -595 -1138 -2896 -2039 269 207 907 3744 2660 19 205 -962 -4014 -3243 -106 198 1038 4036
1470 4036 2646 -310 -577 -1092 -2905 -2233 -86 72 682 2941 2106 511 1529 220 -3555 -3147 -646
1487 -646 -1643 -244 3620 3505 540 615 -306 -3494 -2907 -209 -557 427 2773 1812 497 1701 205
1504 205 -3049 -2283 -766 -2500 -1336 2577 2946 1436 2276 977 -3058 -2841 -1419 -1741 -116 3457
1520 3457 2556 668 1404 476 -2798 -1756 -262 -2460 -1681 1908 1742 926 2864 2128 -1748 -1814 -1613
1537 -1613 -3088 -1471 2550 2221 1614 2598 696 -2834 -2361 -705 -2099 -1304 2150 1267 310 2179 2039
$$ packed form
1418B153M89J39j489k634k08n10r84J921K739l25P8J536j486k873j62L15j979
1435c280P40L588M48K09J711n89l181j302m51j326J586K448L24L56J989j605k644
1452i79L84n43j758Q57K308o2P00K837j084k641J86j167l052P71L137L04Q40K998
1470D036j390k956k67n15j813O72K147J58O10K259q35j595J018j309l775M08K501
1487f46r97J399L864j15k965P5r21l188N87K698l48R84K346r61j315J204j496
1504B05l254P66J517j734J164L913L69j510Q40j299m035K17J422l22J625L573
1520C457r01j888P36r28l274J042J494k198P79L589j66q16J938p36l876o6K01
1537a613j475J617M021l29o07R84j902l530M73J656j394P95L454q83r57J869j40
$$ plain form
1554 2039 -929 -794 -736 -2996 -2124 1002 1257 1601 3583 2028 -1789 -1859 -1831 -3358 -1374 1865 1396 1013
1572 1013 2340 1349 -1119 -297 -296 -2375 -2042 353 -120 442 2977 2473 -185 -670 -1315 -3448 -2300 711
1590 711 772 990 3208 1809 -816 -479 -573 -2079 -1387 413 -430 -139 2168 1963 176 576 -342 -2861
1608 -2861 -2316 -394 -186 936 3395 2487 101 134 -830 -2832 -1961 98 -57 80 2002 1375 330
1625 330 761 121 -1712 -1628 -571 -1146 45 2523 1894 1136 1358 -46 -2555 -2016 -534 -1011 31 1917
1643 1917 1442 171 456 104 -1449 -1260 -260 -916 -702 1162 1526 1088 1837 619 -1720 -1983 -1281 -1611
1661 -1611 -417 1617 1408 968 1392 176 -1465 -1035 -216 -961 -584 656 903 583 1483 1046 -393 -1063
1679 -1063 -1058 -1772 -1095 680 504 1138 1837 391 -826 -438 -455 -1409 -874 753 438 584 1474 1182 -334
$$ packed form
1554B039k968J35N8k260Q72L126K55L44J982j555l817p0K8j527J984L239m69l83
1572A013J327r91k468Q22Jk079L33K395m73N62K535n04k658m85o45k133J148L011
1590G11O1K18K218j399k625L37r4j506O92J800q43K91K307k05j787M00r18k519
1608b861N45J922K08J122K459r08k386L3r64k002Q71K059j55J37J922o27j045
1625C30M31o40j833Q4J057n75J191K478o29p58K22j404k509N39J482m77J042J886
1643A917m75j271K85l52j553J89J000o56K14J864L64m38P49j218k339k63P02l30
1661a611J194K034k09m40M24j216j641M30Q19p45L77J240K47l20R00m37j439o70
1679a063Np14O77J775j76O34O99j446j217L88j7r54N35J627l15J46Q90k92j516
$$ plain form
1698 -334 -557 -287 -1309 -1618 -404 211 592 1536 1015 160 -227 -594 -1704 -1084 -74 403 402 1398 962
1717 962 47 -339 -302 -958 -1306 -356 -6 593 1178 1145 427 582 -439 -1382 -1185 -139 -169 452 897 904 302
1738 302 -32 -423 -886 -790 -715 -257 189 870 1086 856 754 -25 -749 -1045 -617 -419 -473 857 1220 677 216
1759 216 -48 -720 -749 -948 -671 88 676 722 753 839 199 -486 -928 -647 -943 -640 31 1099 810 475 333
1780 333 -422 -628 -999 -500 -175 348 953 856 1087 505 -335 -483 -720 -883 -453 78 815 780 544 683 91
1801 91 -403 -861 -571 -590 256 152 639 903 630 163 -317 -662 -654 -495 -238 105 250 789 424 128 -221
1822 -221 -460 -518 -584 -334 -20 793 729 468 200 -176 -339 -838 -759 161 125 119 804 601 440 2 -238 -433
1844 -433 -305 -413 106 577 419 521 482 262 -81 -626 -472 -161 -212 -90 633 264 463 35 36 50 -357 -408
$$ packed form
1698c34k23K70j022l09J214O15L81R44n21q55l87l67j110O20J010M77jR96m36
1717I62r15l86L7o56l48R50L50N99N85l3p18J55j021r43J97J046l0O21M45Po02
1738C02l34l91m63R6P5M58M46O81K16k30j02p79p24k96M28J98n4J330L63n43m61
1759B16k64o72k9j99K77P59N88M6L1Q6o40o85m42K81k96L03O71J068k89l35j42
1780C33p55k06l71M99L25N23O05r7K31n82q40j48k37j63M30N31P37l5k36J39n92
1801I1m94m58K90j9Q46j04M87K64k73m67m80l45QJ59K57L43J45N39l65k96l49
1822b21k39n8o6K50L14Q13o4k61k68l76j63m99P9R20l6oO85k03j61m38k40j95
1844d33J28j08N19M71j58J02l9k20l43n45J54L11n1J22P23l69J99m28JJ4m07n1
$$ plain form
1866 -408 -205 -139 44 209 254 138 10 -613 -420 -511 -206 -129 91 438 215 645 6 -304 -252 -198 -50 -54 136
1889 136 175 307 213 269 -27 -374 -155 154 -7 96 309 -109 166 149 -71 72 -102 -391 -415 -68 70 -212
1911 -212 251 74 -453 -378 -10 -9 -320 -23 273 -312 255 141 27 8 12 -207 -271 -54 -482 -266 135 164 -81
1934 -81 161 204 -561 -178 -105 -11 -335 264 324 -269 45 352 69 -12 -331 -284 -209 87 89 -287 211 635 165
1957 165 -31 225 -288 -377 222 330 -414 462 397 42 58 680 -248 -751 102 -171 -218 377 526 99 257
1978 257 227 -609 -735 300 164 171 344 544 -396 -264 382 -249 -737 -6 -292 -673 -55 655 347 483 811
1999 811 -274 -971 -192 -259 -471 651 993 5 2 253 -145 -1128 470 108 -1005 -234 270 -100 348 1216
2019 1216 190 -504 -150 -912 -1133 447 995 35 584 715 -310 -791 248 -156 -628 369 256 -460
$$ packed form
1866d08K03O6J83J65M5j16j28o23J93r1L05P7K20L47k23M30o39l10N2N4J48mJ90
1889A36L9J32r4N6k96l47K19L09j61J03K13m18K75j7k20J43j74k89k4L47J38k82
1911b12M63j77n27P5L68Jl11K97K96n85N67j14j14j9Mk19o4K17m28K16M01K9k45
1934h1K42M3p65L83P3R4l24N99O0n93L14L07k83q1l19M7P5K96Kl76M98M24m70
1957A65j96K56n13q9N99J08p44Q76o5l55J6O22r28n03Q53k73m7N95J49m27J58
1978B57l0q36j26J035j36PJ73K00r40J32O46o31m88P31k86l81O18P10l08J36L28
1999H11j085o97P79o7k12J122L42r88lK51l98r83J598l62j113P71N04l70M48Q68
2019A216j026o94L54p62k21J580N48r60N49J31j025m81J039m04m72R97j13p16
$$ plain form
2037 -460 167 971 7 -272 250 -368 -1263 28 468 -103 924 1596 42 -849 -112 -673 -1199 718 820
2056 820 -443 496 905 -391 -540 992 175 -1317 -418 164 -874 679 1976 138 -324 299 -910
2073 -910 -1990 -173 428 -215 1118 1186 -565 -559 493 -354 -1260 119 16 -1064 240 1169 299 321 1311
2092 1311 -836 -1645 -289 -302 -914 898 1730 47 96 506 -1050 -1286 227 225 -695 407 1076 -384
2110 -384 234 1504 210 -1033 -89 -605 -1622 519 1355 509 373 1002 -531 -1694 -69 -277 -665
2127 -665 780 1211 -191 268 1072 -108 -977 250 -452 -1450 -132 676 -15 891 1681 -333 -1413 -701
2145 -701 -1059 -1568 534 1381 60 758 1425 -649 -922 204 -421 -1060 277 631 -213 790 1903 416
2163 416 -301 51 -1016 -1750 -60 877 179 1016 1347 -35 -704 -23 -939 -1253 310 465 -348 289 1426
$$ packed form
2037d60O27Q04r64k79N22o18q95J291M40n71J027O72j554q91P37n61n26J917J02
2056H20j263R39M09j296j49J532q17j492Q99N82j038J553J297j838m62O23j209
2073i10j080J817O01o43J333O8j751OJ052q47r06J379j03j080J304R29q70K2R90
2092A311k147q09J356j3o12J812Q32j683M9M10j556k36J513kr20J102O69j460
2110c84O18J270j294j243R44n16j017K141Q36q46j36O29j533j163J625k08l88
2127f65J445M31j402M59Q04j180q69J227p02r98J318Q08o91R06P90k014j080P12
2145g01l58n09K102Q47j321O98O67k074k73J126o25o39J337L54q44J003J113j487
2163D16p17L52j067p34J690R37o98Q37L31j382o69O81r16l14J563J55q13O37J137
$$ plain form
2182 1426 303 0 329 -862 -1648 -452 47 -415 1313 1592 165 -88 216 -1044 -1656 -388 280
2199 280 -320 853 1188 358 132 400 -847 -1416 -533 -427 -712 663 1579 656 291 694 -694 -1785
2217 -1785 -759 -273 -691 778 1386 539 280 509 -345 -946 -577 -858 -921 540 1215 352 636 814 -523
2236 -523 -1299 -805 -795 -792 294 1231 784 652 765 -271 -745 -583 -841 -924 454 941 866 1016 544 -209 -1035
2257 -1035 -876 -979 -1022 265 828 585 988 1242 181 -770 -951 -979 -1032 -59 784 727 858 1083 125 -486
2277 -486 -731 -1070 -850 -297 543 908 1300 1155 525 -268 -780 -1004 -1011 -487 385 810 1277 1365 473 -324 -785
2298 -785 -1013 -1175 -525 84 504 1029 1382 837 149 -301 -1061 -1043 -783 -81 571 1001 1202 801 -2 -544
2318 -544 -1187 -1063 -792 2 170 813 1318 1051 349 -98 -1058 -1157 -823 -292 217 913 1291 887 479 -218
$$ packed form
2182A426j123l03L29j191p86J196M99m62J728K79j427k53L04j260o12J268O68
2199B80o00J173L35q30k26K68j247n69Q83J06k85J375R16r23l65M03j388j091
2217a785J026M86m18J469O08q47k59K29q54o01L69k81o3J461O75q63K84J78j337
2236e23p76M94J0LJ086R37m47j32J13j036m74J62k58q3J378M87p5J50m72p53q26
2257a035J59j03m3J287N63k43M03K54j061r51j81k8n3R73Q43n7J31K25r58o11
2277d86k45l39K20N53Q40L65L92j45o30p93n12k24pN24Q72M25M67Q8q92p97m61
2298g85k28j62O50O09M20N25L53n45o88m50p60J8K60P02O52M30K01m01q03n42
2318e44o43J24K71P94J68O43N05k67p02m47r60r9L34N31N09O96L78m04m08o97
$$ plain form
2338 -218 -636 -1088 -1205 -602 27 586 1079 815 645 5 -701 -927 -1241 -577 -127 414 924 1205 736 235
2358 235 -287 -1014 -922 -752 -224 670 1032 1041 974 336 -652 -1043 -889 -1205 -318 637 1100 913 1060 423 -314
2379 -314 -963 -1140 -1099 -864 376 727 1153 1058 656 -107 -656 -843 -1214 -694 -234 510 872 1007 730 -215
2399 -215 -846 -978 -1142 -925 102 288 611 1283 821 19 -547 -523 -1399 -888 -492 344 647 1337 1130 268
2419 268 -230 -990 -1574 -1177 -124 -50 532 1275 1218 49 105 -281 -1350 -1219 -280 -279 472 947 1057 730 235
2440 235 -108 -1563 -1287 -705 -274 225 1217 1250 488 513 -214 -1326 -1054 -338 20 -45 1122 912 661 514
2460 514 299 -867 -1316 -608 -725 134 1174 1227 595 961 -22 -1352 -1109 -576 -727 -272 1026 1065 440
2479 440 682 332 -906 -1012 -518 -1161 -648 1023 909 784 1565 335 -1257 -1390 -725 -1134 -167 1108
$$ packed form
2338b18m18m52j17O03O29N59M93k64j70o40p06k26l14O64M50N41N10K81m69n01
2358B35n22p27R2J70N28Q94L62Ro7o38r88l91J54l16Q87R55M63j87J47o37p37
2379c14o49j77M1K35J240L51M26r5m02p63n49j87l71N20M60P44L62J35k77r45
2399b15o31j32j64K17J027J86L23O72m62q02n66K4q76N11L96Q36L03O90k07q62
2419B68m98p60n84L97J053P4N82P43n7j169N6l86j069J31R39JP51M75J10l27m95
2440B35l43j455K76N82M31M99R92L3p62K5p27j112K72P16L58o5J167k10k51j47
2460E14k15j166m49P08j17Q59J040N3o32L66r83j330K43N33j51M55J298L9o25
2479D40K42l50j238j06M94o43N13J671j14j25P81j230j592j33O65m09R67J275
$$ plain form
2497 1108 829 332 793 644 -779 -595 -38 -1373 -858 634 449 127 1706 1011 -614 -766 -683 -1680
2515 -1680 -854 1067 964 452 1436 844 -993 -691 -276 -1208 -909 543 90 132 1353 892 -5 138 -251
2534 -251 -1855 -1111 372 373 724 1723 904 -706 -680 -495 -1622 -1158 504 519 -86 1334 991 -606 239
2553 239 256 -1378 -1152 -101 -468 -208 2005 1445 -85 -31 131 -1820 -1353 507 55 231 1486 813
2571 813 -429 157 380 -1095 -882 -12 -864 -524 1055 1135 213 951 128 -1771 -1397 -187 -925 -255 1869
2590 1869 1211 -59 357 84 -1470 -975 306 -661 -534 1047 910 -136 1175 817 -1111 -819 -340
2607 -340 -1447 -414 1385 1135 326 1074 176 -1472 -780 225 -798 -329 1239 733 -498 1194 737
2624 737 -947 -540 -215 -1418 -1324 838 740 434 1436 1092 -957 -915 -537 -949 -644 1230 854 31 702
$$ packed form
2497A108k79m97M61j49j423J84N57j335N15J492j85l22J579o95j625j52Q3r97
2515a680Q26J921j03n12R84n92j837L02M15r32K99J452m53M2J221m61q97J43l89
2534b51j604P44J483JL51R99q19j610K6J85j127M64J662J5o05J420l43j597Q45
2553B39J7j634K26J051l67K60K213n60j530N4J62j951M67J860m52J76J255o73
2571H13j242N86K23j475K13Q70q52L40J579Q0r22P38q23j899L74J210p38O70K124
2590A869o58j270M16k73j554M95J281r67J27J581j37j046J311l58j928K92M79
2607c40j107J033J799k50q09P48q98j648O92J005j023M69J568n06j231J692m57
2624G37j684M07L25j203R4K162r8l06J002l44k049M2L78m12L05J874l76q23O71
$$ plain form
2643 702 709 -690 -449 323 -1072 -876 452 282 116 1397 1324 -706 -454 -194 -1406 -1105 647 347 257
2662 257 1504 825 -787 -348 -145 -1019 -1050 437 199 -257 1033 777 -268 112 -27 -1357 -985 1
2680 1 -277 196 1307 937 -313 -65 -90 -1303 -823 159 86 54 1096 838 -40 205 136 -1472 -976 -282
2700 -282 -146 -34 1086 878 96 351 13 -1050 -984 -93 -220 5 946 732 220 -9 88 -749 -633 -27
2720 -27 -438 -375 691 602 369 704 375 -922 -768 -167 -573 -408 673 769 335 701 201 -691 -681 -256 -471
2741 -471 -254 944 565 199 511 272 -599 -401 -414 -617 -468 390 694 263 494 408 -554 -797 -182 -353
2761 -353 -338 0 404 295 622 523 -303 -498 -415 -648 -419 156 302 570 546 455 -32 -483 -295 -647 -428 210
2783 210 153 252 414 553 203 -466 -240 -786 -383 -22 262 393 538 409 223 -98 -421 -647 -364 -101 57
$$ packed form
2643G02Pj399K41P72j395J96J328j70j66J281p3k030K52K60j212L01J752l00r0
2662B57J247o79j612M39K03q74l1J487k38m56J290k56j045L80j39j330L72R86
2680Ak78M73J111l70j250K48k5j213M80R82p3l2J042k58q78K45o9j608M96O94
2700b82J36J12J120k08p82K55l38j063O6Q91j27K25R41k14n12k29R7q37J16O06
2720b7m11O3J066q9k33L35l29j297J54O01m06J65J081R6m34L66n00q92J0M25k15
2741d71K17J198l79l66L12k39q71J98j3k03J49Q58L04m31K31q6r62k43O15j71
2761c53J5L38M04j09L27r9q26j95Q3k33K29N75J46K68k4r1m87m51J88l52K19O38
2783B10n7R9J62J39l50o69K26n46M03L61K84J31J45j29j86l21l23k26K83K63J58
$$ plain form
2804 57 479 656 894 70 74 -496 -448 -638 -219 95 82 866 633 243 159 14 -750 -578 -200 -17 68 514
2826 514 440 235 208 -90 -219 -651 -457 -198 219 166 625 426 192 -130 -515 -581 -537 -202 88 405 497 320
2848 320 301 -232 -272 -521 -472 -152 -77 361 492 410 413 -210 -304 -524 -262 -306 62 261 628 437 377 -63 -294
2871 -294 -411 -681 -248 24 321 223 719 237 151 -425 -64 -618 -370 -58 198 328 436 529 356 -244 -189
2892 -189 -452 -444 -234 -74 17 412 410 294 -27 -372 -384 -561 -115 -1 259 631 593 396 153 -304 -555 -493 -198
2915 -198 12 45 491 358 175 13 -53 -147 -607 -340 -219 41 191 547 159 193 -28 -476 -610 -494 -18
2936 -18 -43 100 960 260 69 301 -82 -650 -86 -292 -355 281 619 75 54 213 -226 -597 -683 -455 -428 483
2958 483 431 346 9 293 -435 -399 -299 -199 -666 102 669 30 321 728 -170 -655 -85 -344 -584 181 470
$$ packed form
2804E7M22J77K38q24Mn70M8j90M19L14j3P84k33l90q4j45p64J72L78J83Q5M46
2826E14p4k05k7k98j29m32J94K59M17n3M59j99k34l22l85o6M4L35K90L17R2j77
2848C20j9n33m0k49M9L20P5M38J31q2Lo23r4k20K62m4L68J99L67j91o0m40k31
2871b94j17k70M33K72K97r8M96m82q6n76L61n54K48L12K56J30J08R3j73o00N5
2892a89k63QK10J60R1L95kj16l21l45j2j77M46J14K60L72l8j97k43m57k51O2K95
2915a98K10L3M46j33j83j62o6r4m60K67J21K60J50L56l88L4k21m48j34J16M76
2936a8k5J43Q60p00j91K32l83n68N64k06o3O36L38n44k1J59m39l71q6K28K7R11
2958D83n2q5l37K84p28L6J00J00m67P68N67o39K91M07q98m85N70k59k40P65K89
$$ plain form
2979 470 219 604 613 -426 -726 -147 -175 -814 22 210 -11 73 353 178 -262 -88 -352 -762 62 431 -84
3000 -84 418 986 -42 -485 187 -443 -1089 82 425 215 227 588 -43 -239 174 -164 -805 -89 237 -200
3020 -200 154 768 223 -52 320 -479 -797 130 213 62 492 716 -111 -59 52 -539 -816 -72 114 -416 188
3041 188 648 87 196 470 -237 -919 -329 173 -707 448 932 177 232 640 -372 -835 97 -156 -369 165
3061 165 905 -141 -193 695 116 -775 -17 -134 -759 355 624 124 180 423 -313 -797 -112 -174 -666 173
3081 173 818 -142 119 409 -163 -414 381 -227 -885 106 520 145 247 920 -8 -482 -25 -512 -702 189
3101 189 742 188 189 611 224 -415 50 -6 -459 -205 569 -193 -160 837 181 -516 -56 -427 -861 161 301
3122 301 3 377 849 -159 -557 -124 -587 -695 285 310 -65 193 712 197 -214 277 -237 -586 -142 93
$$ packed form
2979D70k51L85Rj039l00N79k8o39Q36J88k21Q4K80j75m40J74k64m10Q24L69n15
3000h4N02N68j028m43O72o30o46J171L43k10J2L61o31j96M13l38o41P16L26m37
3020b00L54O14n45k75L72p99l18R27Q3j51M30K24q27N2J11n91k77P44J86n30O04
3041A88M60n61J09K74p07o82N90N02q80J155M84p55N5M08j012m63R32k53k13N34
3061A65P40j046n2Q88n79q91P58j17o25J114K69n00N6K43p36m84O85o2m92Q39
3081A73O45r60K61K90n72k51P95o08o58R91M14l75J02O73r28m74M57m87j90Q91
3101A89N53n54JM22l87o39M65n6m53K54P74p62L3R97o56o97M60l71m34J022J40
3122C01k98L74M72j008l98M33m63j08R80K5l75K58N19n15m11M91n14l49M44K35
$$ plain form
3142 93 -251 469 1165 208 -267 61 -502 -669 -26 346 -21 243 901 1 -227 452 -232 -526 -282 -58
3162 -58 -391 160 543 278 276 314 -311 -971 -191 71 -346 385 633 330 239 219 -61 -446 -126 -232 -198 97
3184 97 602 332 456 311 22 -535 -336 -17 -256 37 913 249 270 251 76 -472 -44 -297 -555 -236 533
3205 533 209 215 326 -54 -371 -143 -314 -540 57 159 105 38 345 -42 -234 -369 -419 -484 149 238 133 153 244
3228 244 284 -268 -68 -218 -505 -181 112 70 173 349 0 -151 -218 -279 -304 -157 287 171 189 399 95 -13
3250 -13 111 -310 -287 -233 40 -123 334 508 274 -156 -133 -320 -415 -390 -332 385 373 430 351 141 114 -219 -451 -450
3274 -450 -222 96 272 253 44 -38 33 -33 -314 -213 32 -156 69 369 164 380 -4 -57 -246 -327 -265 -155
3296 -155 81 320 306 93 199 -62 -260 -371 -122 49 315 448 242 611 163 44 -304 -463 -387 -103 -3
$$ packed form
3142I3l44P20O96r57m75L28n63j67O43L72l67K64O58r00k28O79o84k94K44K24
3162e8l33N51L83k65kL8o25o60P80K62m17P31K48l03r1k0k80l85L20j06L4K95
3184I7N05k70J24j45k89n57J99L19k39K93Q76o64K1j9j75n48M28k53k58L19P69
3205E33l24OJ11l80l17K28j71k26N97J02n4o7L07l87j92j35n0o5O33Q9j05K0R1
3228B44M0n52K00j50k87L24K93m2J03J76l49j51o7o1k5J47M44j16J8K10l04j08
3250a3J24m21K3N4K73j63M57J74k34m30K3j87r5K5N8P17j2N7p9k10k7l33k32J
3274d50K28L18J76j9k09q2P1o6k81J01K45j88K25L00k05K16l84n3j89q1O2J10
3296a55K36K39j4k13J06k61j98j11K49J71K66J33k06L69m48j19l48j59P6K84J00
$$ plain form
3317 -3 230 208 296 136 -27 -272 -242 -202 -116 -243 -4 137 206 184 -165 -212 -306 -143 -271 -127 239 136 239 342
3341 342 131 -65 -476 -601 -640 -170 125 314 283 524 -179 -91 -418 -376 -202 -86 85 149 401 199 103 -150
3363 -150 -184 -376 -272 -398 -252 172 248 423 196 177 -204 -497 -393 -208 17 -83 237 397 346 228 146 -100
3385 -100 -319 -389 127 -14 295 269 532 46 -34 -135 -301 -456 -285 59 91 142 265 299 103 -171 -458 -377
3407 -377 -134 58 278 457 296 318 65 -259 -511 -112 -244 -141 -13 270 433 335 203 -84 -217 -546 -573
3428 -573 -118 -23 210 236 308 221 -41 -349 -353 -142 -42 72 152 299 256 297 -24 -383 -285 -318 -216 269 -110 135
3452 135 376 358 -123 -337 -202 -221 -177 -4 -191 142 413 578 153 -172 215 -287 -288 -133 141 78 520 371
3474 371 63 -100 -26 -386 -292 136 -52 86 395 411 -37 187 -172 -437 -544 -97 -74 -84 273 477 104 1
$$ packed form
3317cK33k2Q8j60j63k45L0M0Q6j27K39J41O9k2l49m7r4J63j28J44L66j03J03J03
3341C42k11j96m11j25l9M70K95J89l1K41p03Q8l27M2J74J16J71O4K52k02r6k53
3363a50l4j92J04j26J46M24P6J75k27j9l81k93J04J85K25j00L20J60n1j18q2k46
3385a00k19p0N16j41L09k6K63m86q0j01j66j55J71L44L2N1J23L4j96k74k87Q1
3407c77K43J92K20J79j61K2k53l24k52L99j32J03J28K83J63r8j32k87j33l29k7
3428e73M55R5K33K6P2q7k62l08mK11J00J14Q0J47m3M1l21l59R8l3J02M85l79K45
3452A35K41j8m81k14J35j9M4J73j87L33K71J65m25l25L87n02jJ55K74o3M42j49
3474C71l08j63P4l60R4M28j88J38L09J6m48K24l59k65j07M47K3j0L57K04l73j03
$$ plain form
3496 1 -8 -565 -113 -381 -36 259 237 521 248 -30 40 -154 -242 20 43 45 249 897 290 324 -8 -330 -145 -456
3520 -456 -103 -88 246 188 351 -1 -123 -128 -227 -338 31 149 258 610 255 23 340 -247 -347 -339 -349 97 -136
3543 -136 662 363 345 442 -199 -282 -148 -506 -210 36 409 413 144 108 -218 -318 -550 -51 -179 139 76 249
3565 249 354 281 248 -368 -474 -333 -218 -62 302 186 300 364 13 -482 -295 -89 -411 -50 305 130 -72
3586 -72 451 447 -302 -282 -317 -289 -141 510 282 48 199 105 -235 -248 -7 -188 -35 220 86 49 339 275 -335
3609 -335 -162 -111 -255 -306 173 209 405 398 210 98 -101 -192 -535 -320 72 180 197 197 216 -106 -49 -123 -508 -217
3633 -217 -139 25 264 488 112 17 -178 -26 -562 -141 -118 -172 96 571 239 -22 -67 69 -374 -398 77 66
3655 66 77 292 569 -59 180 -48 -624 -373 -236 140 136 206 444 -33 -264 110 -206 -320 81 -251 37 373
$$ packed form
3496Arn57M52k68L45K95k2K84k73k78P0j94q8K62K3KK04O48o07L4l32l22J85l11
3520d56L53J5L34n8J63l52j22nr9j11L69J18J09L52l55k32L17n87j00Qj0M46k33
3543a36P98k99j8R7o41q3J34l58K96K46L73Mk69l6l26j00k32M99j28L18o3J73
3565B49J05p3l3o16j06J41J15J56L64j16J14O4l51m95J87K06l22L61L55j75k02
3586g2N23mp49K0l5K8J48O51k28k34J51r4l40j3K41j81J53K55j34l7K90o4o10
3609c35J73N1j44n1M79L6J96pj88j12j99r1l43K15L92J08J7%J9l22N7p4l85K91
3633b17P8J64K39K24l76r5j95J52n36M21K3n4K68M75l32k61m5J36m43k4M75j1
3655F6J1K15K77o28K39k28n76K51J37L76mP0K38m77k31L74l16j14M01l32K88L36
$$ plain form
3677 373 300 114 -35 57 -477 -195 -93 -293 -262 178 365 157 344 18 -427 -399 222 -311 87 -44 8 123
3699 123 261 80 -340 -275 138 -188 -323 408 109 -79 148 97 -50 -394 -215 -222 -287 498 118 -76 191 246
3721 246 -190 -199 16 84 217 174 339 -9 123 35 -249 -159 -181 -203 -166 -139 257 89 356 414 -180 -423 -169 -315
3745 -315 -115 46 254 77 101 498 119 -13 -78 -107 -259 39 -94 98 248 375 54 -21 -38 -376 -337 -49
3767 -49 66 142 295 188 2 -33 -272 -273 -304 -129 183 201 494 80 -99 70 -66 -209 -70 -86 393 -86 70
3790 70 53 156 -25 -135 91 25 -113 -34 212 -157 280 -63 238 -195 -18 -267 -159 102 -233 220 360
3811 360 108 174 121 -290 -191 -170 -75 -19 346 232 41 4 316 -167 -73 -128 112 131 81 264 117 167 54 40
3835 40 -95 47 -93 60 347 122 -10 151 289 -141 -170 -193 4 -38 -8 197 -88 -29 -58 -68 -159 -96 -138 6
$$ packed form
3677C73p3j86j49R2n34K82J02k00L1M40J87k08J87l26m45K8O21n33L98j31N2J15
3699A23J38j81m20O5M13l26j35P31k99j88K27n1j47l44J79po5P85l80j94K67N5
3721B46m36rK15O8J33m3J65l48J32q8k84R0k2k2L7K7L96j68K67N8n94k43K54j46
3745c15K00J61K08j77K4L97l79j32o5k9j52K98j33J92J50J27l21p5j7l38L9K88
3767d9J15P6J53j07j86l5k39jl1J75L12J8K93m14j79J69j36j43J39j6M79m79J56
3790G0j7J03j81j10K26o6j38P9K46l69M37l43L01m33J77k49J08K61l35M53J40
3811C60k52O6n3m11R9K1R5N6L65j14j91l7L12m83R4n5K40J9n0J83j47N0j13j4
3835D0j35J42j40J53K87k25j32J61J38m30k9k3J97m2L0K05k85N9k9j0r1O3m2J44
$$ plain form
3859 6 253 207 152 84 158 22 -310 155 -350 -461 102 19 -182 317 211 -139 -200 -99 -376 55 120 -104 120
3882 120 68 275 170 59 78 -223 -132 54 -13 -181 129 210 -216 -23 -14 -225 -211 -7 -19 39 -27 326 -41 -32
3906 -32 -1 11 -29 45 -91 59 143 117 -92 -134 -245 -68 -135 -117 -169 133 220 250 -103 44 102 -270 45 33 273
3931 273 -136 67 224 11 -22 114 -214 -244 215 -153 27 275 83 172 -48 104 -133 13 111 -64 203
3952 203 263 -199 -156 191 84 -336 -39 -3 -160 -9 0 -117 231 160 135 -136 4 -250 -120 47 -1 277 -265
3975 -265 -157 248 -15 86 87 142 -131 76 -48 -63 391 329 -302 -136 -16 -244 -266 219 -7 148 333 25
3997 25 -206 -95 30 -45 -46 309 -326 -183 185 138 -30 -254 -210 -399 -129 258 51 31 303 44 -364 -139
4019 -139 147 -73 -2 366 239 -101 225 -34 -414 106 48 -427 76 21 -294 -173 566 272 -137 -111 -25 -576
$$ packed form
3859FK47m6n5o8P4j36l32M65n05j11N63q3k01M99j06l50o1J01k77M31O5k24K24
3882A20n2K07j05j11J9l01R1J86o7j68L10Q1m26J93Rk11J4K04j2N8o6L53l67R
3906c2L1J2m0P4j36J50Q4k6k09m2j11J77o7J8n2L02Q7L0l53J47N8l72L15j2K40
3931B73m09K03J57k13l3J36l28l0M59l68J80K48j92Q9k20J52k37J46R8j75K67
3952B03O0m62M3L47j07m20K97L6j57J51Rj17L48p1k5k71J40k54J30J67m8K78n42
3975b65J08M05k63J01JN5k73K07j24j5M54o2o31J66J20k28k2M85k26J55J85l08
3997B5k31J11J25p5jL55o35J43L68m7j68k24M4j89K70L87k07k0K72k59m08K25
4019a39K86k20P1L68j27l40L26k59l80N20n8m75N03n5l15J21P39k94m09K6Q6n51
$$ plain form
4041 -576 -268 -11 148 -97 217 -12 -334 171 75 -244 -38 122 -42 -194 302 -27 -193 258 -274 -185 -308
4062 -308 324 -208 -36 516 163 -271 369 -13 -306 344 449 -421 -74 170 -95 -216 62 141 -156 31
4082 31 126 -433 300 441 5 -232 118 88 -376 73 361 -79 5 541 -62 -220 -17 84 -212 136 228 -321
4104 -321 -364 256 -221 -193 560 61 -478 -80 199 -438 23 438 -56 170 124 65 -257 227 250 -160 157 284
4126 284 -302 -235 338 -173 -417 270 49 -305 99 763 81 78 137 -457 -230 218 199 48 170 106 50 -125
4148 -125 248 -357 -216 36 316 -278 247 541 -173 19 432 116 -205 384 23 -289 -72 297 -12 -188
4168 -188 159 -191 -332 -130 68 -187 35 202 -171 -23 320 203 8 186 -41 -118 -85 252 -185 136 120
4189 120 -125 -208 231 58 266 165 263 -166 -28 464 -251 -168 203 11 -138 -15 219 -33 227 490 -82
$$ packed form
4041e76L08K57J59k45L14k29l22N05r6l19K06J60j64j52M96l29j66M51n32Q9j23
4062c08O32n32J72N52l53m34O40l82k93O50J05q70L47K44k65j21K78P9k97J87
4082C1R5n59P33J41m36k37L50l0m64M49K88m40Q4N36o03j58K03J01k96L48R2n49
4104c21m3O20m77K8P53m99n39L98K79o37M61M15m94K26m6n9l22M84K3m10L17J27
4126B84n86O7N73n11k44O87k21l54M04O64o82lN9n94K27M48j9j51J22o4n6j75
4148a25L73o05J41K52K80n94N25K94p14J92M13l16l21N89l61l12K17L69l09j76
4168a88L47l50j41K02J98k55K22J67l73J48L43j17j95J78k27p7L3L37m37L21j6
4189A20k45q3M39j73K08j01R8m29J38M92p15Q3L71j92j49J23K34k52K60K63n72
$$ plain form
4210 -82 -103 -72 -218 -328 140 41 227 178 -186 -65 -151 193 -44 -220 26 -2 -122 67 281 -199 -104 2 -11
4233 -11 -186 112 261 53 79 197 -103 -348 63 -219 -178 196 491 34 -141 301 -150 -292 104 -131 -127 76
4255 76 304 -7 206 638 151 -252 -32 43 -82 6 126 -10 49 159 5 -333 200 33 59 47 -87 -27
4277 -27 81 210 -106 110 -26 -137 -68 24 -7 -133 -148 194 11 -24 30 183 1 262 -84 -67 257 248 -118
4300 -118 97 -30 -145 -226 -119 151 202 -3 366 70 -8 56 21 -119 -259 -11 19 311 157 103 272 -27
4322 -27 32 -230 107 12 -279 235 32 314 -124 239 146 -39 -246 37 109 -24 375 194 -47 -84 28 -218
4344 -218 -16 99 -122 -269 38 -46 -79 -204 -183 118 -156 -246 -373 32 37 192 329 72 -48 -74 -410 28
4366 28 -43 -26 162 96 163 373 -241 135 -187 -70 -139 -91 87 -214 140 280 -206 -218 42 -99 -29 -80 -76 -99
$$ packed form
4210h2k1L1j46j10M68r9J86m9l64J21q6L44k37j76K46k8j20J89K14m80R5J06j3
4233a1j75K98J49k08K6J18l00k45M11k82M1L74K95m57j75M42m51j42L96k35MK03
4255G6K28l11K13M32m87m03K20P5j25Q8J20j36N9J10j54l38N33j67K6j2j34O0
4277b7J08J29l16K16j36j11O9R2l1j26j5L42j83l5N4J53j82K61l46J7L24rl66
4300a18K15j27j15q1J07K70N1k05L69k96p8O4l5j40j40K48L0K92j54n4J69k99
4322b7N9k62L37r5k91N14k03K82m38L63r3j85k07K83P2j33L99j81k41l7J12k46
4344b18K02J15k21j47L07q4l3j25K1L01k74r0j27M05NJ55J37k57j20k6l36M38
4366B8p1J7J88o6O7K10o14L76l22J17o9M8J78l01L54J40m86j2K60j41P0n1Mk3
$$ plain form
4390 -99 285 441 -44 -127 -135 -388 -85 123 122 112 353 115 146 -60 40 39 64 45 -104 -389 47 115 -162 277
4414 277 74 73 -239 26 -119 42 199 45 226 -213 186 -198 -57 105 -159 86 403 104 45 -95 174
4435 174 -366 -298 -157 -145 -169 208 69 43 30 2 -46 -204 -81 76 -53 29 32 17 138 -221 250 -311 130 -285
4459 -285 -381 302 45 22 -87 187 -180 -166 -340 -228 -139 -20 26 77 393 84 -169 -62 62 39 -540 -15
4481 -15 208 -150 170 130 202 -196 -65 -200 -262 139 -22 9 346 509 -182 -236 -10 -194 -252 340 -183 -278 193
4504 193 97 115 37 246 -296 -62 157 -42 -206 214 442 92 37 -151 -70 -97 321 111 -79 261 299 139
4526 139 -150 -41 -368 -138 211 -250 -137 87 255 -233 -20 -56 -411 -342 50 216 -306 46 -83 -164 -264
4547 -264 98 -259 -488 84 -304 -588 199 62 283 287 377 -292 -195 -185 -466 -117 431 396 -47 -18 -82 -426 -351
$$ packed form
4390i9L84J56m85q3qk53L03K08jj0K41k38L1k06J00jK5j9j49k85M36O8k77M39
4414B77k03jl12K65j45J61J57j54J81m39L99l84J41J62k64K45L17k99n9j40K69
4435A74n40O8J41J2k4L77j39k6j3k8m8j58J23J57j29Q2Lj5J21l59M71n61M41m15
4459b85r6O83k57k3j09K74l67J4j74J12Q9J19M6N1L16l09k53J07J24k3n79N25
4481a5K23l58L20m0P2l98J31j35o2M01j61L1L37J63o91n4K26j84n8N92n23r5M71
4504A93r6J8p8K09n42K34K19j99j64M20K28l50n5j88Q1k7M18k10j90L40L8j60
4526A39k89J09l27K30L49m61J13K24J68m88K13l6l55O9L92J66n22L52j29q1j00
4547b64L62l57k29N72l88k84P87j37K21MR0o69R7J0k81L49N48l5m43K9o4l44P5
$$ plain form
4570 -351 6 -90 -59 125 59 -295 4 548 -173 -104 -16 -268 -115 339 286 201 53 420 -305 -193 38 -246
4592 -246 -111 577 336 -300 262 225 -213 61 50 -399 -311 323 59 -91 477 394 -227 -196 -145 -252 -376 355
4614 355 361 51 -12 422 -208 -138 196 -314 -182 293 -182 -173 160 -12 30 -148 183 -413 -57 116 -87 72
4636 72 226 251 -161 -11 76 -171 -102 101 151 -183 281 149 -63 7 183 -111 -256 -99 39 46 554 421 -27
4659 -27 102 164 -196 -150 302 96 25 373 178 -381 14 229 -159 -207 -163 -136 -117 267 388 -44 307 26 -233
4682 -233 8 50 -43 -142 183 106 -244 292 208 -56 -34 -96 -193 -69 227 302 152 225 -3 -296 -131 -197 -560 -171
4706 -171 266 -45 -192 245 122 -117 -52 -220 181 -228 -4 52 152 320 318 -175 40 71 -299 -1 152 96
4728 96 -46 241 497 -98 -74 -67 -531 24 201 -186 -40 178 71 -89 19 142 -425 57 161 82 28 239
$$ packed form
4570c51L57r6L1J84o6l54K99N44p21O9Q8k52J53M54n3q5j48L67p25J12K31k84
4592b46J35O88k41o36N62l7m38K74j1m49Q8O34k64j50N68q3o21L1N1j07j24P31
4614C55Ol10o3M34o30P0L34n10J32M75m75RL33j72M2j78L31n96L56J73k03J59
4636G2J54K5m12J50Q7k47O9K03N0l34M64j32k12P0J76k94j45J57J38PN08j33m48
4659b7J29O2l60M6M52k06p1L48j95n59L95K15l88m8M4K7J9L84J21m32L51k81k59
4682b33K41M2r3r9L25p7l50N36q4k64K2o2r7J24K96P5j50P3k28k93J65o6l63L89
4706a71M37l11j47M37j23k39O5j68M01m09K24N6J00J68km93K15L1l70K98J53n6
4728I6j42K87K56n95K4Pm64N55J77l87J46K18j07j60J08J23n67M82J04p9n4K11
$$ plain form
4750 239 206 -103 -194 -228 -258 -205 28 -168 -166 224 -45 -83 107 10 -245 -77 159 -292 -76 204 56 -167 363
4773 363 73 -163 77 74 35 -41 -146 48 17 248 198 -52 -319 -83 -155 -191 129 17 -140 23 251 -256 -225
4796 -225 -147 -396 -25 126 204 251 327 47 21 13 -24 -83 54 95 -44 -76 440 -103 88 -299 -79 32 -163 76
4820 76 349 82 271 -180 -63 42 -310 -120 -184 125 -255 129 22 134 154 -178 -395 -188 -412 95 155
4841 155 -9 273 194 189 63 89 -55 -103 -284 -95 208 247 523 357 103 137 -364 -80 -63 38 -81 149 144
4864 144 101 -330 -54 158 -201 30 -87 129 -44 149 235 262 70 96 187 48 203 -63 158 102 -45 293
4886 293 298 -50 -28 -263 29 -167 197 221 256 54 107 -31 20 -44 -99 -301 -72 109 40 460 257 -348 -293 1
4910 1 -221 -295 123 -159 2 98 -79 97 -13 -127 -200 -200 47 196 50 -2 -23 -196 -23 -119 -426 -171 230
$$ packed form
4750B39l3l09r1l4l0N3K33j96KL90k69l8J90r7k55J68K36m51K16K80j48k23N30
4773C63k90k36K40ll9p6j05J94l1K31n0k50k67K36p2l6L20j12j57J63K28n07L1
4796b25P8k49L71J51P8M7P6k80k6ql7n9J37M1j39l2N16n43J91l87K20J11j95K39
4820G6K73k67J89m51J17J05l52J90o4L09l80L84j07J12K0l32k17K07k24N07O0
4841A55j64K82p9nj26K6j44m8j81J89L03L9K76j66k54L4n01K84J7J01j19K30n
4864A44m3m31K76K12l59K31j17K16j73J93Q6K7j92K6R1j39J55k66K21n6j47L38
4886B93Nl48K2k35K92j96L64K4L5k02N3j38N1o4n5k02K29J81o9M20k03o05N5K94
4910Ak22p4M18k82J61R6j77J76j10j14p3%K47J49j46n2k1j73J73r6l07K55M01
$$ plain form
4933 230 -86 205 383 399 -52 -92 -93 -361 103 109 -151 136 328 -119 63 -234 50 -21 -151 72 99 130 332
4956 332 187 207 -213 -66 -364 -215 -225 141 -123 203 258 222 150 -5 -392 -241 -136 263 -72 229 135 121
4978 121 135 -184 -172 -225 91 244 28 -11 172 97 222 67 -386 -271 104 -347 32 197 353 -4 -15 128
5000 128 -209 -219 -15 -145 -103 24 193 215 174 -33 -218 -328 -171 -124 -342 72 229 25 259 41 -192 -206
5022 -206 -349 -325 -160 387 51 -59 421 15 -400 -116 -131 -160 -391 270 -350 229 189 208 -364 4 -58 -235
5044 -235 -232 243 -60 255 -1 -64 108 224 -37 -314 23 185 329 127 421 157 -277 489 -90 -151 -38
5065 -38 -49 187 -88 586 405 137 148 -23 -328 -405 116 216 134 354 324 -340 -144 28 -346 -304 -72 1 -22
5088 -22 337 52 17 293 220 -551 -269 -226 23 73 869 164 -109 -30 239 -548 -155 -99 -19 88 73 223 -34
$$ packed form
4933B30l16K91J78J6m51m0jk68M64Ok60K87J92m47J82k97K84p1j30K23K7L1K02
4956C32j45K0m20J47k98J49j0L66k64L26N5l6p2j55l87J51J05L99l35L01r4j4
4978A21J4l19J2n3L16J53k16l9J83p5J25j55m53J15L75m51L79J65J56l57j1J43
5000A28l37j0K04j30M2J27J69K2m1k07j85j10J57M7k18M14J57k04K34k18k33j4
5022b06j43K4J65N47l36j10M80m06m15K84j5k9k31O61o20N79m0J9n72L68o2j77
5044b35LM75l03L15k56o3J72J16k61k77L37J62J44k02K94k64m34P66n79o1J13
5065c8j1K36k75O74j81k68J1j71l05p7N21J00q2K20l0o64J96J72l74M2K32P3k3
5088b2L59k85l5K76p3p71K82M3K49N0P96p05k73P9K69p87L93N6Q0J07j5J50k57
$$ plain form
5111 -34 75 -214 -37 -324 -298 -325 -9 282 223 -43 96 -216 -240 -214 -115 -110 -222 110 180 -149 369 21 -351
5134 -351 -114 39 -587 74 183 -9 144 444 114 -392 -25 -243 -529 -186 420 259 27 205 -94 -98 -149
5155 -149 -47 -152 -267 79 146 99 388 15 -2 -59 -19 -218 18 99 254 -39 113 164 -61 -165 287 -401
5177 -401 -26 338 -100 18 141 -360 25 208 -20 -428 -435 -38 165 -48 235 -38 259 -163 -200 -533 -121
5198 -121 147 -112 55 188 24 88 316 -136 -121 17 -68 -252 78 483 129 -77 37 -495 -318 -72 -150
5219 -150 -71 -83 267 413 172 226 -201 -201 50 -68 -209 59 241 -9 97 258 7 -218 -133 -224 -231 -151 486
5242 486 91 85 264 90 -333 -144 -352 -94 18 213 -119 282 434 48 47 276 -399 -236 -177 211 445 342
5264 342 259 43 40 -213 -233 -167 -331 261 56 268 118 51 10 -276 -162 -91 -32 29 60 135 574 244 -118 -9
$$ packed form
5111c4J09k89J77k87K6k7L16K91n9k66J39l12k4K6R9Nj12L32P0l29N18l48l72
5134c51K37J53o26O61J09j92J53L00l30n06L67k18k86L43O06j61k32J78k99mn1
5155a49J02j05j15L46O7m7K89l73j7n7M0j99K36Q1J55k93J52N1k25j04M52o88
5177d01L75L64m38J18J23n01L85J83k28m08pL97K03k13K83k73K97m22l7l33M12
5198a21K68k59J67J33j64O4K28m52J5J38q5j84L30M05l54k06J14n32J77K46p8
5219a50P9j2L50J46k41N4m27%K51j18j41K68J82k50J06J61k51k25Q5r1pQ0O37
5242D86l95oJ79j74m23J89k08K58J12J95l32M01J52l86jK29o75J63N9L88K34j03
5264C42q3k16lk53k0O6j64N92k05K12j50o7m1k86J14P1N9O1L1P5M39l30l62J09
$$ [...]
8191F
##END NTUPLES=NMR FID
##END=
