##TITLE=1H_DE-84_ext1.2
 200.13MHz,D2O,
 8 sc
 
 13.3.2025
##JCAMPDX= 6.0         $$ Bruker NMR JCAMP-DX V2.0
##DATA TYPE= NMR FID
##DATA CLASS= NTUPLES
##ORIGIN= UXNMR, Bruker Analytische Messtechnik GmbH
##OWNER= pz
$$ XWIN-NMR		Version 3.5
$$ Thu Mar 13 16:01:31 2025 Russian Standard Time (UT+4h)  she@DPX200
##.OBSERVE FREQUENCY= 200.1313
##.OBSERVE NUCLEUS= ^1H
##.DELAY= (6, 6)
##.ACQUISITION MODE= SIMULTANEOUS
##.ACQUISITION SCHEME= undefined
##.AVERAGES= 8
##.DIGITISER RES= 18
##SPECTROMETER/DATA SYSTEM= spect
##.PULSE SEQUENCE= zg30
##.SOLVENT NAME= D2O
##.SHIFT REFERENCE= (INTERNAL, D2O, 0, 14.3821)
##AUDIT TRAIL= $$ (NUMBER, WHEN, WHO, WHERE, WHAT)
$$ ##TITLE= Audit trail, XWIN-NMR		Version 3.5
$$ ##JCAMPDX= 5.01
$$ ##ORIGIN= Bruker BioSpin GmbH
$$ ##OWNER= she
$$ F:/spectra/data/she/nmr/H-C/1/audita.txt
$$ ##AUDIT TRAIL=  $$ (NUMBER, WHEN, WHO, WHERE, WHAT)
(   1,<2025-03-13 16:00:05.21 +0400>,<she>,<DPX200>,
      <created by zg, POWCHK disabled, PULCHK disabled
       configuration hash MD5:
       00 E9 B6 7A A2 85 ED C7 34 08 36 98 17 FE 4E 26
       data hash MD5: 16K
       BE CE 5E 0F 9B 96 52 E9 3C C0 E7 96 1F 27 B0 5D>)
$$ ##END=
$$ 
$$ hash MD5
$$ 97 A1 2E A4 E9 FA 0E 60 83 74 21 83 EC 0B 18 3F
##$RELAX= 
##$RELAX= 
##$RELAX= 
##$RELAX= 
##$RELAX= 
##$RELAX= 
$$ Bruker specific parameters
$$ --------------------------
##$DU= <F:/spectra>
##$EXPNO= 1
##$NAME= <H-C>
##$PROCNO= 1
##$TYPE= <nmr>
##$USER= <she>
##$AMP= (0..31)
100 100 100 100 100 100 100 100 100 100 100 100 100 100 100 100 100 100 
100 100 100 100 100 100 100 100 100 100 100 100 100 100 
##$AQSEQ= 0
##$AQ_mod= 1
##$AUNM= <au_zg>
##$AUTOPOS= <>
##$BF1= 200.13
##$BF2= 200.13
##$BF3= 200.13
##$BF4= 200.13
##$BF5= 200.13
##$BF6= 200.13
##$BF7= 200.13
##$BF8= 200.13
##$BYTORDA= 1
##$CFDGTYP= 0
##$CFRGTYP= 5
##$CHEMSTR= <none>
##$CNST= (0..31)
1 1 145 1 1 1 1 1 1 1 1 1 1 1 1 1 1 1 1 1 1 1 1 1 1 1 1 1 1 1 1 1 
##$CPDPRG= <>
##$CPDPRG1= <>
##$CPDPRG2= <>
##$CPDPRG3= <>
##$CPDPRG4= <mlev>
##$CPDPRG5= <mlev>
##$CPDPRG6= <mlev>
##$CPDPRG7= <mlev>
##$CPDPRG8= <mlev>
##$CPDPRGB= <>
##$CPDPRGT= <>
##$D= (0..31)
0 0.7 0 0 0 0 0 0 0 0 0 0.03 0 0 0 0 0 0 0 0 0 0 0 0 0 0 0 0 0 0 0 0 
##$DATE= 1741867204
##$DBL= (0..7)
120 120 120 120 120 120 120 120 
##$DBP= (0..7)
150 150 150 150 150 150 150 150 
##$DBP07= 0
##$DBPNAM0= <>
##$DBPNAM1= <>
##$DBPNAM2= <>
##$DBPNAM3= <>
##$DBPNAM4= <>
##$DBPNAM5= <>
##$DBPNAM6= <>
##$DBPNAM7= <>
##$DBPOAL= (0..7)
0.5 0.5 0.5 0.5 0.5 0.5 0.5 0.5 
##$DBPOFFS= (0..7)
0 0 0 0 0 0 0 0 
##$DE= 6
##$DECBNUC= <off>
##$DECIM= 32
##$DECNUC= <off>
##$DECSTAT= 4
##$DIGMOD= 1
##$DIGTYP= 9
##$DL= (0..7)
0 120 120 120 120 120 120 120 
##$DP= (0..7)
150 150 150 150 150 150 150 150 
##$DP07= 0
##$DPNAME0= <>
##$DPNAME1= <>
##$DPNAME2= <>
##$DPNAME3= <>
##$DPNAME4= <>
##$DPNAME5= <>
##$DPNAME6= <>
##$DPNAME7= <>
##$DPOAL= (0..7)
0.5 0.5 0.5 0.5 0.5 0.5 0.5 0.5 
##$DPOFFS= (0..7)
0 0 0 0 0 0 0 0 
##$DQDMODE= 0
##$DR= 18
##$DS= 0
##$DSLIST= <SSSSSSSSSSSSSSS>
$$ [...]
##$SUBNAM0= <"">
##$SUBNAM1= <"">
##$SUBNAM2= <"">
##$SUBNAM3= <"">
##$SUBNAM4= <"">
##$SUBNAM5= <"">
##$SUBNAM6= <"">
##$SUBNAM7= <"">
##$SUBNAM8= <"">
##$SUBNAM9= <"">
##$SW= 18.0517328524113
##$SWIBOX= (0..15)
0 0 2 0 0 0 0 0 0 0 0 0 0 0 0 0 
##$SW_h= 3612.71676300578
##$TD= 16384
##$TD0= 1
##$TE= 0
##$TE2= 300
##$TE3= 300
##$TEG= 300
##$TL= (0..7)
0 120 120 120 120 120 120 120 
##$TP= (0..7)
150 150 150 150 150 150 150 150 
##$TP07= 0
##$TPNAME0= <>
##$TPNAME1= <>
##$TPNAME2= <>
##$TPNAME3= <>
##$TPNAME4= <>
##$TPNAME5= <>
##$TPNAME6= <>
##$TPNAME7= <>
##$TPOAL= (0..7)
0.5 0.5 0.5 0.5 0.5 0.5 0.5 0.5 
##$TPOFFS= (0..7)
0 0 0 0 0 0 0 0 
##$TUNHIN= 0
##$TUNHOUT= 0
##$TUNXOUT= 0
##$USERA1= <user>
##$USERA2= <user>
##$USERA3= <user>
##$USERA4= <user>
##$USERA5= <user>
##$V9= 5
##$VALIST= <valist>
##$VCLIST= <CCCCCCCCCCCCCCC>
##$VD= 0
##$VDLIST= <DDDDDDDDDDDDDDD>
##$VPLIST= <PPPPPPPPPPPPPPP>
##$VTLIST= <TTTTTTTTTTTTTTT>
##$WBST= 1024
##$WBSW= 4
##$XGAIN= (0..3)
0 0 0 0 
##$XL= 0
##$YL= 0
##$YMAX_a= 458088
##$YMIN_a= -531811
##$ZGOPTNS= <>
##$ZL1= 120
##$ZL2= 120
##$ZL3= 120
##$ZL4= 120
##$ABSF1= 10
##$ABSF2= 0
##$ABSG= 5
##$ABSL= 3
##$ALPHA= 0
##$AQORDER= 0
##$ASSFAC= 0
##$ASSFACI= 0
##$ASSFACX= 0
##$ASSWID= 0
##$AUNMP= <proc_1d>
##$AZFE= 0.1
##$AZFW= 0.1
##$BCFW= 1
##$BC_mod= 2
##$BYTORDP= 1
##$COROFFS= 0
##$CY= -3
##$DATMOD= 1
##$DC= 2
##$DFILT= <>
##$DTYPP= 0
##$F1P= 0
##$F2P= 0
##$FCOR= 0.5
##$FTSIZE= 0
##$FT_mod= 4
##$GAMMA= 1
##$GB= 0.15
##$INTBC= 1
##$INTSCL= 1
##$ISEN= 128
##$LB= 0.25
##$LEV0= 0
##$LPBIN= 0
##$MAXI= 10000
##$MC2= 0
##$MEAN= 0
##$ME_mod= 0
##$MI= 1.114404
##$NCOEF= 0
##$NC_proc= 0
##$NLEV= 6
##$NOISF1= 3.799351
##$NOISF2= 2.8
##$NSP= 1
##$NTH_PI= 0
##$NZP= 0
##$OFFSET= 14.38212
##$PC= 1
##$PHC0= -473.7038
##$PHC1= 11.79221
##$PH_mod= 1
##$PKNL= yes
##$PPARMOD= 0
##$PSCAL= 0
##$PSIGN= 0
##$REVERSE= no
##$SF= 200.129724274929
##$SI= 16384
##$SIGF1= 3
##$SIGF2= 2
##$SINO= 400
##$SIOLD= 16384
##$SREGLST= <1H.CDCl3>
##$SSB= 0
##$STSI= 0
##$STSR= 0
##$SW_p= 3205.1282051282
##$SYMM= 0
##$S_DEV= 0
##$TDeff= 0
##$TDoff= 0
##$TI= <>
##$TILT= no
##$TM1= 0
##$TM2= 0
##$TOPLEV= 0
##$USERP1= <user>
##$USERP2= <user>
##$USERP3= <user>
##$USERP4= <user>
##$USERP5= <user>
##$WDW= 1
##$XDIM= 8192
##$YMAX_p= 0
##$YMIN_p= 0
$$ End of Bruker specific parameters
$$ ---------------------------------
##NTUPLES= NMR FID
##VAR_NAME=  TIME,          FID/REAL,        FID/IMAG
##SYMBOL=    X,             R,               I
##VAR_TYPE=  INDEPENDENT,   DEPENDENT,       DEPENDENT
##VAR_FORM=  AFFN,          ASDF,            ASDF
##VAR_DIM=   8192,          8192,            8192
##UNITS=     SECONDS,       ARBITRARY UNITS, ARBITRARY UNITS
##FACTOR=    0.0002768,     1,               1
##FIRST=     0,             0,               0
##LAST=      2.2672688,     0,               0
##MIN=       0,             -531811,         0
##MAX=       2.2672688,     458088,          0
$$ Real data points
##PAGE= N=1
##DATA TABLE= (X++(R..R)), XYDATA
0@%%%%%%%%%%%nNqJ6j6J6j8K6l2L5m3N1n9O9p9R2j06J19j36J58j82K05k29K56
35A35k87L25l63M01m46M95n51O11o73P43q20R06r98J097j207J330j468J619j788
54i39J979k198K449k737L077l486L987m614N422o505Q036j0357J4234k1785M1415
69B7978j80212l79577N61428J12895m03901K76596L30832l89447r9779K93425
79A50238k09001j72319L87145K964l45836J80522J53301k95967J57071L58322
89C66440l66969k85390L81717n4902m40512K99886M23906k80901r3560K74493
99B24208k55622k77468L68357R6328l41546J82778K82796l32461j15917L41850
109A73303j01043k37907K61558Q304m05236J22941L44998j77773m6360L18582
$$ plain form
0 0 0 0 0 0 0 0 0 0 0 0 0 -5 0 -8 8 -8 8 -10 16 -16 19 -24 27 -32 37 -42 50 -56 63 -73 85 -97 108 -121 135
35 135 -152 173 -190 211 -235 260 -291 320 -353 390 -430 476 -522 575 -632 698 -770 849 -939
54 -939 1040 -1158 1291 -1446 1631 -1855 2132 -2482 2940 -3565 4471 -5886 8348 -13437 27978
69 27978 -152234 -531811 29617 142512 -261389 15207 346039 -43408 -143187 150238
79 150238 -58763 -231082 156063 159027 -186809 -6287 147014 -148953 8118 366440
89 366440 -529 -285919 95798 40896 -399616 -99730 324176 43275 -50285 224208
99 224208 -31414 -308882 59475 155803 -185743 -2965 279831 -52630 -168547 173303
109 173303 72260 -165647 95911 104215 -301021 -178080 166918 -10855 -57215 261367
119B61367j38859l06188J87436L1317k92962K19172L49838k81647j71991L12454
129A69937q2082l17580K17591J60361l08999J7557K77209j71629j18543L25499
139A69321L0272k68851Q1931N7632k70670N4091K92245j15070r0481K69272o1215
150A48477l36053J02455J59366k18753J2300K71405j12980j58828K36311N1277
160A54977k35600Q3475J37621k34083p3382K19093m6359r0992K34974M2143k63246
171g1379J3383J06320j98550l9288K57708m590j25303J65461M8576k21461K7818
182d1305J44850j56406q1313J82091j9932j24064J58695R5193j75116j0582R6844
193F8955j61271r9642J80440M3986q3247J36298Q8130j69014m3080R1286j05085
$$ plain form
119 261367 122508 -183680 3756 35073 -257889 -38717 311121 29474 -142517 169937
129 169937 87855 -229725 -12134 148227 -160772 -143215 133994 -37635 -156178 169321
139 169321 199593 -69258 12673 70305 -200365 -146274 145971 30901 -59580 209692 148477
150 148477 -187576 -85121 74245 -144508 -132208 139197 26217 -132611 103700 154977
160 154977 -80623 2852 140473 -93610 -166992 52101 5742 -85250 149724 191867 -71379
171 -71379 -57996 48324 -150226 -189514 68194 63604 -61699 103762 152338 -69123 -41305
182 -41305 103545 -52861 -134174 47917 27985 -96079 62616 157809 -17307 -27889 68955
193 68955 -92316 -191958 -11518 32468 -50779 85519 173649 4635 -38445 52841 -52244
204e2244p9718J47428L1222j00606R0162Q7706j27836l2903R1689r5035j07252
215a47387J11971M9509p0829R3948J14042r8170o3350N8588p5273j01112R1301
226c6762O4604n6937N5955Q5394q3750n9921N3606m9968q5209O7666N3239m4852
238c6935N4095R2699n4391m8869M3984n4150r7923N0316N8896m1783L6600R3492
250I6031l9176p2233K3681j7719p8551J7910O3141l288K0084O2295r189l6272
262B6714N152l4593n9720J7180L0285j9125L1744P0275j7689m9151J6278j4308
274C042p3022k85N5617L048O176N9071J7865l8204j3932r670m3255j9151K1247
287c1453J1525J5189L6253J0578j7520p254k0145l9620o377J9002N471J9672M5618
$$ plain form
204 -52244 -131962 15466 46688 -53918 36244 123950 -3886 -36789 54900 -40135 -147387
215 -147387 -35416 14093 -56736 37212 151254 53084 -10266 48322 -26951 -128063 -36762
226 -36762 27842 -29095 26860 112254 28504 -31417 22189 -27779 -112988 -45322 7917 -36935
238 -36935 17160 109859 55468 6599 50583 -3567 -101490 -51174 7722 -34061 2539 96031
250 96031 56855 -15378 8303 -9416 -87967 -70057 -6916 -10204 9880 72175 62986 26714
262 26714 31866 -2727 -62447 -45267 -14982 -34107 -2363 67912 50223 1072 17350 3042
274 3042 -69980 -70265 -14648 -11600 -5424 53647 71512 33308 19376 9706 -33549 -52700 -31453
287 -31453 -19928 -4739 31514 42092 24572 17318 -2827 -42447 -48824 -29822 -24351 -4679 40939
300D0939J3891k0865n067r017m2417k5631J6997J2530K660K6111K8245m569k0713
313A3094j3909j4911j9353o440J4841K5855K2571J2047O087j812k0057k9748j7297
326b9032k912K869J0219K0177K1046R294j0588j5983j0111j5247j7824O282K6325
339e485J5787Q610J9028M697k3967k0826j0663j7240n927J6605J3310J1190K1558
352B6677L203k1904q129k118k6625j0774K9878J5980l069K5059K0093k5061k1964
365A246p15k1969k0590J8178J6712m46K3821J9634k2900j2254R973k6097k7504
378d2911K7884J9020j4430K3892L7398k2374k5773J1390k1982m0671J7426K5313
390e818j2056K1277M0011k1461k4925J9286j8419m2112K3710K9391k5574J3345
$$ plain form
300 40939 54830 33965 28898 19881 -22536 -48167 -31170 -18640 -15980 10131 38376 33807 13094
313 13094 -815 -15726 -35079 -41519 -26678 -823 21748 33795 39882 38070 18013 -11735 -29032
326 -29032 -31944 -29075 -18856 1321 22367 31661 21073 5090 -5021 -20268 -38092 -31810 -5485
339 -5485 10302 18912 37940 42637 18670 -2156 -12819 -30059 -35986 -19381 -6071 5119 26677
352 26677 29880 7976 -153 -2271 -28896 -39670 -9792 6188 3119 28178 48271 23210 1246
365 1246 531 -21438 -42028 -23850 -7138 -7584 16237 35871 12971 717 10690 -15407 -42911
378 -42911 -15027 3993 -10437 13455 50853 28479 2706 14096 -7886 -48557 -31131 -5818
390 -5818 -17874 3403 43414 21953 -2972 16314 -2105 -44217 -20507 8884 -16690 -3345
402c345N1839j7436l2709K5227j1570n8898R388L2938k4056J2364O1692r573l7844
415a983K3377q241o0159J2982M4695k5142J190O0850j2151m6632L1032O312o5544
428c9414J169M2339l3198r243P1574P764m3439L1206R149p7072j0052N3369k2190
441a8038r547P4626M801o0367K2020J7064p1364n413O1228k9833l0609O9763J3660
454C7991n5395L8636L8261p9800k7633N7762l0002l7631Q4067L8577o1258J3103
466A6678K9122p9914l0723O7281j1929l3570P2451K0733p2033K4747N1231p0267
478a6193k7408P2722l0713o9089P2792N3426o2876J7583O1970p4193o4814N5469
490a1324m350m5407P5616N3272o6959Q65M8595o9270m2309Q1897j693p1467N4779
$$ plain form
402 -3345 48494 31058 -1651 23576 12006 -46892 -37504 -4566 -28622 -16258 45434 35861 -1983
415 -1983 21394 13153 -47006 -34024 10671 -14471 -13281 47569 35418 -11214 19818 26130 -39414
428 -39414 -38245 4094 -29104 -38347 33227 40991 -2448 28758 37907 -39165 -49217 4152 -18038
441 -18038 -27585 47041 51842 -8525 13495 30559 -40805 -46218 15010 -14823 -45432 24331 37991
454 37991 -17404 21232 59493 -20307 -47940 9822 -20180 -57811 26256 64833 3575 16678
466 16678 45800 -34114 -64837 2444 -9485 -43055 29396 50129 -21904 2843 54074 -16193
478 -16193 -43601 29121 -1592 -70681 2111 55537 -7339 10244 72214 -1979 -66793 -11324
490 -11324 -15674 -61081 14535 67807 848 1713 50308 -18962 -61271 20626 18933 -52534 2245
503B245M8140p3732Q434Q2822n1153o3794N5383j2655p7745O2901P8019n3913
515D952L101O9007p2170q1675P1823K1212p1133N2071P5401p2005l1633O9881
527C8832k8327n5731O0876O853q2617L2313O4010n3259O389R2240m5039q7959
539e1419N3094P567r0861M8954J09179n2601m7222O9474k4031q5331M6735M3342
551B6880o1190J8098O1360n8153k5764Q6375q576o8110M6336J2113r7749J6610
563e1770R4039l8432k7464R1842j3398j08102K1806M4257n9127J8131Q4723m2248
575A4257m6551O8673n764p8570M6243N1519p7400j5412O8401l5214l3539R0084
587D6727J6042q6734J2985L5077p3294r215Q6437q385l2709O2551p442r1597K6066
$$ plain form
503 2245 50385 -23347 -14913 67909 16756 -47038 8345 -4310 -82055 -19154 58865 4952
515 4952 8053 77060 4890 -76785 -4962 16250 -54883 -2812 72589 584 -31049 38832
527 38832 10505 -45226 15650 22503 -60114 -27801 36209 -17050 -10661 81579 36540 -51419
539 -51419 1675 9242 -81619 -32665 76514 23913 -23309 46165 22134 -63197 -16462 26880
551 26880 -34310 -16212 45148 -13005 -38769 47606 39030 -29080 17256 29369 -68380 -51770
563 -51770 42269 3837 -23627 68215 54817 -53285 -31479 12778 -46349 -28218 56505 14257
575 14257 -32294 36379 30615 -47955 -1712 49807 -27593 -43005 25396 -9818 -43357 46727
587 46727 62769 -23965 -10980 24097 -49197 -58412 28025 19640 -13069 49482 42040 -49557 -23491
600b3491N9928n7944j6923P3804k2503n6582N7718K6996o2335K1029M7685p0637
612b3255l8682O6747J460l2068O2522K2353p4556Q02L8956n8546k0556Q1850L153
625C0180n5966L8291K4070o2451R529N5201m5638l5838N6491n077n1364M7985
637E413M5767m7908m860L4804n2737l9101O0377J4295l9948L9433L5438n7883
649f910j6003M1347k7934k8444N1989N576n0472K6734M0954l8785o862M3342k9814
662D718m4264L3238R486l5826L3594M6457l7224k0644L0067k4442l7835L7553
674e122J9922l2180J9397L3966l5412j6686L8429j3461l7322K4963J1984l6335
686b7857J5659M2663j9928j5430L0086j5239m3418J7378K0207k2581J4536L6350
$$ plain form
600 -23491 36437 -21507 -38430 35374 12871 -43711 14007 41003 -21332 -303 47382 -23255
612 -23255 -61937 4810 6270 -25798 36724 59077 -15479 -14677 24279 -34267 -54823 27027 30180
625 30180 -25786 12505 36575 -25876 -16347 38854 -6784 -42622 13869 8792 -42572 5413
637 5413 51180 3272 -1588 33216 -19521 -58622 1755 16050 -23898 15535 50973 -6910
649 -6910 -22913 18434 -9500 -37944 14045 19621 -30851 -4117 36837 -1948 -8810 34532 4718
662 4718 -39546 -6308 3178 -32648 946 47403 10179 -10465 19602 -4840 -42675 -5122
674 -5122 14800 -17380 2017 35983 571 -16115 22314 8853 -28469 -3506 8478 -27857
686 -27857 -12198 30465 10537 -4893 25193 9954 -33464 -16086 4121 -18460 -3924 32426
698C2426j9051k0639K2241r016l2245J6923J7915k4274M479L1751j2491j4113
710f094K5326m315l4996P627J4592k0911M471L5451l940j7350J5698l712l1417
723a9570K768J7779j2920Q71K6422k665j4438J3208M50k4152J595J1809j4878
736a3721m52K5584Q65j1454J3663Q57k5843m244J1905r668j862K3406M958j1043
750B951O640L146j9164n624Q757n835l105J6475O090o166O309K065j4936p317
764i714M582n914k447J5535P441m414N460K672j4429q213M813m150l983J2286
778d75R856l299J503M209r220r884K81j792k174Q021Q063J121L580J625q561p606
794d752o24l323l167Q080Q985N68K043L264n835r148k681j696j836M361P410M125
$$ plain form
698 32426 13375 -7264 14977 5961 -26284 -9361 8554 -15720 -11241 20510 8019 -6094
710 -6094 19232 14917 -20079 -12452 2140 -18771 -14300 21151 17211 -139 15559 11847 -19570
723 -19570 -16802 977 -11943 -11072 15350 12685 -1753 11455 11905 -12247 -10652 1157 -13721
736 -13721 -14173 11411 12276 822 14485 15342 -10501 -14745 -2840 -12508 -14370 9036 13994 2951
750 2951 9591 12737 -6427 -12051 -3294 -9129 -12234 4241 10331 4165 10474 12539 -2397 -9714
764 -9714 -5132 -11046 -13493 2042 9483 5069 10529 13201 -1228 -9441 -4628 -8778 -12761 -475
778 -475 9381 6082 7585 11794 2574 -7310 -7029 -8821 -10995 -2974 5089 6210 9790 11415 2854 -4752
794 -4752 -5376 -8699 -11866 -3786 5199 5767 7810 11074 5239 -3909 -6590 -8286 -10122 -5761 1649 5774
810E774L023J090m483o514l760l233j876M134O544M294K848J649k450o586n718
825e264k924j090K863M881N374M245J253k981m495n187m310j452K284M481N643
840C321L974J190j422l778n913n277k27J502K309N744N955P46k144j651m627o693
856f991j690K334J930M462O583J671j938j016n149o986j461K187N33L791Q127
871F387J479k706P44l091q563k444L036m81K079Q960K949l009M36j500r248l260
887h232L332q97J269R858L182m388J347Kr552l860M458j768j256R486M795m824
903B952K745K181j0528n878M528j955k378J0831O527m782J122K858j0722o731
917i230O352p47m664J0005O580o930J548O495r420p678O246k012p674R429R745
$$ plain form
810 5774 8797 9887 5404 -1110 -4870 -8103 -9979 -5845 699 4993 7841 9490 7040 454 -5264
825 -5264 -8188 -9278 -6415 -1534 3840 8085 9338 6357 1862 -3325 -7635 -9087 -6803 -2322 3321
840 3321 7295 8485 7063 3285 -2628 -7905 -8132 -6630 -4321 1423 7378 8124 5980 4329 -298 -6991
856 -6991 -8681 -6347 -4417 45 6628 8299 6361 5345 196 -6790 -8251 -6064 -5531 -1740 6387
871 6387 7866 5160 5904 2813 -5750 -8194 -5158 -5639 -3560 5400 8349 5340 5776 4276 -4972 -8232
887 -8232 -4900 -5797 -4528 5330 8512 4124 5471 5473 -4079 -7939 -3481 -5249 -6505 2981 7776 2952
903 2952 5697 7878 -2650 -8528 -4000 -5955 -8333 2498 9025 4243 5365 8223 -2499 -9230
917 -9230 -2878 -3625 -8289 1716 8296 1366 2914 9409 -11 -7689 -1443 -3455 -11129 -1700 8045
932H045n217J247P583j0059j1114N823L21p389J0079J0881p377j362P965q331
946A095r880Q097R28j0665O481J1086p207K40J2073o280j2637N234l03j1963P688
961f013J5030n664j654J0865q006j5282P104M686j1006N745J3581q284m954J3493
975I641l561j3053P607L557j5493J384J4801m355k432J5392k835j7627L804L614
989D44j3270M016J8750n338p082J2097k924j6323P305Q909j4212q72J4754o334
1003h0p455J6106L442j5144L453M815j6657k532J8212j204n951J4913M35j9380
1017g027J711R025j2526j77J7768m539j2059J2670M289j4550M422J1199j5304
1030e098p592J4803k438q218J6685P984j7131j353P333j4539n202J8778J522j0059
$$ plain form
932 8045 2828 4075 11658 1599 -9515 -3692 -3371 -10760 -681 10200 2823 1461 9426 1095
946 1095 -8785 -688 240 -10425 -3944 7142 -65 175 12248 5968 -6669 -1435 -1738 -13701 -6013
961 -6013 9017 3353 1699 12564 4558 -10724 -3620 1066 -9940 -4195 9386 1102 -3852 9641
975 9641 6080 -6973 634 4191 -11302 -9918 4883 528 -1904 13488 10653 -6974 -3170 444
989 444 -12826 -8810 9940 4602 -2480 9617 6693 -9630 -2325 6584 -7628 -8500 6254 -80
1003 -80 -7535 8571 12013 -3131 322 5137 -11520 -14052 4160 2956 -2995 11918 12353 -7027
1017 -7027 -5316 3709 -8817 -8994 8774 4235 -7824 4846 9135 -5415 -993 10206 -5098
1030 -5098 -12690 2113 -325 -8543 8142 16126 -1005 -2358 4975 -9564 -14766 4012 5534 -4525
1044d525J1533M607j8338O95J3631j0441o446J4013k361j2882J1711J0527j2051
1057c27N39J0282j4150j1614J3533L125q258J2810R931j6326m705R833r657p094
1071a2078J5714K937j2981P677P841j2332m73J3319p978j1756J0142M93j1718
1084a1193J0560J3967j0344l790Q687j0168j2343J2080O215q607P767R710j2958
1097d17n602J1194m525r190J0007L219j2477M349J1373p238k523J1611o122j3804
1111a0145N979M598q623P640J2321p649o875P758m797j1045Q784O730q602K424
1125a502R423q173m053J0552j638j0594M994L149r675K408J2136l562l571P808
1139G702m270j2479M533O042o778L101J0503m993o505O890j310q736M826N430
$$ plain form
1044 -4525 7008 11615 -6723 -6028 7603 -2838 -9284 4729 2368 -10514 1197 11724 -327
1057 -327 212 10494 -3656 -15270 -1737 1388 -6870 5940 15871 -455 -5160 4673 -4984 -12078
1071 -12078 3636 6573 -6408 1269 9110 -3222 -3695 9624 1646 -10110 32 525 -11193
1084 -11193 -633 13334 2990 -800 7887 -2281 -14624 -2544 3671 -4936 2831 12541 -417
1097 -417 -6019 5175 650 -8540 1467 4686 -7791 -3442 7931 693 -1830 9781 3659 -10145
1111 -10145 -4166 432 -8191 -551 11770 4121 -2754 5004 207 -10838 -2054 4676 -3926 -1502
1125 -1502 7921 -252 -4305 6247 4609 -5985 -991 2158 -7517 -5109 7027 3465 -106 7702
1139 7702 3432 -9047 -4514 1528 -5250 -2149 8354 3361 -3144 3746 2436 -6300 -1474 3956
1153C956p914o78Q897k593l840P757k88r850J527K975o269J674R925j066m831
1168f18N531j263r482K129N549m843m04P742j383n554N492J529o785K60L486n032
1184c646j554O678P54k200M779J98p564n92L049l896K3P387j41m400L840R41o570
1201b914J75M214l476k436N228J078k719L217K022m365j421J444l081j270M431
1216A27J699j644K673J054n003q08K468l355j037M964P72k516K491J848l674j278
1232a219J835k188k481L072K332j267J688J754k421k028K16j499r80K722J273
1247H09m19J719Q10k358j124J220k334j776K835J087r57J398K337j985j851L35
1263b54o31j730Q22J888L54Q24J321j142j049m75j250j219J470O44K59J172J498
$$ plain form
1153 3956 -3958 -4636 4261 1668 -2172 5585 5297 -4553 -3026 -51 -6320 -4646 5279 4213 -618
1168 -618 4913 3650 -5832 -3703 1846 -2997 -3401 4341 2958 -2596 2896 4425 -2360 -2100 1386 -3646
1184 -3646 -5200 1478 2232 32 4811 5009 -2555 -3147 -98 -3994 -3971 3416 3275 -1125 2715 3656 -2914
1201 -2914 -2739 1475 -2001 -4437 791 1869 -850 2367 4389 24 -1397 47 -3034 -4304 127
1216 127 1826 182 2855 3909 -1094 -1902 566 -2789 -3826 1138 1910 -606 1885 3733 59 -1219
1232 -1219 616 -1572 -4053 -981 1351 84 1772 3526 1105 -923 -707 -2206 -3186 -464 809
1247 809 390 2109 2919 561 -563 657 -1677 -3453 -618 469 -488 910 3247 1262 -589 -254
1263 -254 -885 -2615 -1793 95 449 1273 2594 1452 403 -72 -1322 -2541 -1071 -427 -168 1004 2502
1280B502j067j360P5q36j827P22J673P4R50J215r4r75r00p46j470M33O90M01J174
1299F34J348o83n57n44p23j134K5N84P04J115O81L72n71p02j172r61k57M13P89
1318f39Q78J297J17o72m28j094p83o11P85O59R65P58L31k71o95p83j120q8K53
1337a141J91J196P28K82J01q28q02q22m12K94M73Q11J035P9L39k63j145q66m15
1356a165l75K51J033J112M84j23j51j307p21j14j19L7R30J277K72rK43j279r55
1375f79l29n69J82R28R23K61P34j97o08j279j1n19j49J148R33j04L35N48j131
1394D17p75k50m87n21J175Q02J07L29Q85p13j281l53m6q18Q13J380K10j06O41
1413A409p91j065Q5l65r36R68J223m96N57J029n81j543N09m99j254O33J747n03
$$ plain form
1280 2502 1435 75 150 -686 -2513 -1791 -118 -44 906 2121 2027 1052 152 -594 -2064 -1631 -941 -540 634
1299 634 1982 1299 742 198 -525 -1659 -1634 -1050 -346 769 1450 1822 1251 549 -623 -1584 -1841 -1428 -639
1318 -639 239 1536 1653 981 553 -541 -1324 -1935 -1150 -491 474 1232 1563 1292 597 -186 -1306 -1394 -1141
1337 -1141 -950 246 974 1256 1357 529 -273 -1095 -1507 -1213 -740 71 1106 1185 1524 1261 116 -750 -1165
1356 -1165 -1540 -1289 -256 856 1340 1217 1066 -241 -962 -1076 -1195 -1158 -228 1049 1321 1312 1555 276 -679
1375 -679 -1008 -1577 -1395 -467 456 717 1451 1254 646 -633 -644 -1163 -1312 -164 769 665 1000 1548 417
1394 417 -358 -608 -1095 -1616 -441 361 468 797 1682 969 -312 -665 -711 -1529 -716 664 874 768 1409
1413 1409 618 -447 -362 -727 -1663 -695 528 32 589 1618 1037 -506 3 -496 -1750 -1117 630 127
1431A27J68J851p14k156n5K1r72N79J484R5l40R71k95j000L00l3j260M26J076
1450B73o98J97K382q73j847M54M27k359J37K532k00m99J478L4k091K28Q24j517
1468a118M62J525j119m30J959k36j803J068M20k602K62J751o8o47K222N04k436
1485b86k12N29j558K19K472o22r57J544r1k472J176J827k335n51K004j126j384
1502a823K554R22j568J78P10k350o53K202j39o27K550j00l103N93J260j441m75
1519a310K473o60j909J804R77j556L69J640k233j423J772o01r83K631J317k299
1535Ik40R96k329q31L214j2j679J927O15k992O44K246j250j262J871j043j700
1552a816J837J418j360L30J810k748j846K070N27j332K002J641k653r92K190j784
$$ plain form
1431 127 295 2146 1432 -724 -779 -758 -1730 -1151 333 428 88 1059 764 -236 64 31 -1229 -803 273
1450 273 -425 -228 2154 1281 -566 -112 315 -2044 -1907 625 425 -74 1404 1438 -653 -425 399 -1118
1468 -1118 -656 869 -250 -680 1279 1043 -760 308 728 -1874 -1612 139 71 -576 1646 2150 -286
1485 -286 -498 31 -1527 -1308 1164 542 -415 1129 1038 -1434 -258 1569 -766 -1317 687 -439 -1823
1502 -1823 731 1653 85 263 973 -1377 -2030 172 33 -594 1956 1856 -1247 -654 606 -835 -1310
1519 -1310 1163 503 -1406 398 1375 -181 188 1828 -405 -1828 -56 -657 -1640 991 2308 9
1535 9 -231 765 -1564 -2395 819 807 -872 1055 1670 -1322 -678 1568 318 -944 927 -116 -1816
1552 -1816 21 1439 79 409 2219 -529 -2375 -305 222 -1110 892 2533 -120 -1112 1078 -706
1568g06j112K721N12k702J151R90j774M15K568j469k516J959k83k033K411K048
1584B180j583o60J538k076j852K557Q62k063J507J449k663m94K377r14j431J907
1600F41K30k512P51K042j634O95J977j722k422J673K33j998J883K189j719j039
1616g32K043j358k075K442R82k399R05J562j790o96K667n53j983J163J18k186
1632a890M91K833j164k56J833j553k452J436R23j298Q90K116j528j036J225k16
1648C54j522J373Q05k381J51J783p73k06K091m47k042K63K94j663Q39K416j123
1665B12j92J163r17j854J153J142j506j4J807r34j153K135K7j566L87M41j352
1682a021l81J625K26l73J416n90j612K39M09j214M95J657n38q43J315j29j772
$$ plain form
1568 -706 -1818 903 1415 -1287 -136 854 -920 -505 2063 594 -1922 37 -246 -2279 132 2180
1584 2180 597 -63 1475 -601 -2453 104 966 -1097 410 1859 -804 -1298 1079 165 -1266 641
1600 641 871 -1641 -890 1152 -482 213 2190 468 -1954 -281 -48 -2046 -163 2026 307 -732
1616 -732 1311 -47 -2122 320 1302 -1097 -192 1370 -420 -1116 1551 998 -985 178 296 -1890
1632 -1890 -1399 1434 270 14 1847 294 -2158 -722 201 -1097 -207 1909 381 -655 570 354
1648 354 -1168 205 1010 -1371 -1220 563 -210 -416 1675 1228 -814 -551 -257 -1920 -1081 1335 212
1665 212 20 1183 266 -1588 -435 707 -799 -813 994 60 -1093 1042 1069 -497 -110 331 -1021
1682 -1021 -1402 223 449 76 1492 902 -710 -471 -62 -1276 -781 876 338 -505 810 681 -1091
1699a091J071P26j377l57J388k28n31J515q3j366L38J47j220k31J292K35L14M77
1717A019j08j360O4L39p52o5J514m89m84J205P3j377K43M36j027q91J400P56l96
1736A00O66L88q41l99k16m29J70P87j65r4J183m33j046J38M27j064m35R83K50
1755c0k6M80Q56r81l36l43l62J52R8K63J66P16O59r93l20J36o79k43O21O4J16
1776A4L71L89j49m19k26n27K90l35K22K80Q41P1o73L9J8j091k26M59L07K75K02
1797A32Q58j40p27m0j96m23k53M50L03M75L87m6m24l40m71k53j7N51K0M13M15
1818F74r3j34m20j94k31j70J41L08M09J8J57k81j43p65J35q9J32J50O60J98J64
1839F26j20l67P2n46l2j18K52K28M64l5k03k31k8l37l09L02j76N97K97O5K37l91
$$ plain form
1699 -1091 -20 706 -671 -1028 360 132 -399 1116 1033 -333 5 152 -1068 -1299 -7 228 542 1019
1717 1019 911 -449 -385 -46 -798 -863 651 162 -322 883 956 -421 -178 258 -769 -1660 -260 496 100
1736 100 766 1154 313 -86 -302 -731 -561 226 61 -33 1150 717 -329 -191 236 -828 -1263 -280 -30
1755 -30 -56 424 1280 299 -37 -380 -742 -590 -492 -229 -63 653 1312 319 -1 135 -544 -787 -166 -102 14
1776 14 385 774 625 206 -20 -547 -257 -592 -370 -90 751 822 149 188 206 -885 -1111 -652 -345 -70 132
1797 132 990 850 123 83 -113 -536 -789 -339 -36 439 826 780 356 16 -455 -708 -725 -174 -154 259 674
1818 674 581 447 27 -167 -398 -568 -427 -119 290 308 465 184 41 -724 -589 -678 -546 -396 264 462 626
1839 626 506 139 211 -335 -367 -485 -233 -5 459 424 221 -10 -38 -375 -684 -382 -558 39 336 401 638 247
1861B47j52o29M1J23n9L90K98R2J68k5k84n86Q7J6l79N62M31J01M5o7J49m40n27
1884c98n2o2K50K00K98J90J12m81k23J71l43l87R5R38M4k31J053k85j044p7K40
1905Ho47L2R09K89n01N58m67l75l8J7n03L13M33j12L96P19k06r84L93l14j398
1926a478K69J532k24k08R60O7j158l91P61o33p9O82N29o67P18J99r71K20O28j837
1946a081l25J222k11j96J651K37j249j97L09j253m34J585L25l67Q22K80j209j25
1964b16L83o63m64J015k37o47J212J012j011p3O78j650j194J584J62m46J723N23
1982A691j633k45M35j440j02J617l1j098J342N12j152oJ209j269j138J186R2j289
2000a319J688J519j095k53N20j902j136J497K34j20J010J175k235m83J319r26
$$ plain form
1861 247 95 -534 -493 -370 -429 -39 259 351 519 494 210 -376 -289 -273 -652 -90 341 442 487 420 569 129 -398
1884 -398 -450 -512 -262 -62 236 426 538 57 -166 5 -338 -725 -630 308 352 121 1174 889 -155 -232 8
1905 8 -639 -607 302 591 90 648 181 -194 -232 -215 -718 -405 28 -84 312 1031 825 -159 234 -80 -1478
1926 -1478 -1209 323 99 -109 851 918 -240 -631 130 -503 -582 100 629 -38 680 879 -92 128 756 -1081
1946 -1081 -1406 -184 -395 -591 1060 1297 48 -149 160 -1093 -1527 58 383 16 838 1118 -91 -216
1964 -216 167 -496 -960 55 -182 -829 383 1395 384 311 989 -661 -1855 -271 -109 -555 1168 1691
1982 1691 58 -187 248 -1192 -1294 323 292 -806 536 1048 -104 -110 1099 -170 -1308 -122 -30 -1319
2000 -1319 369 1888 793 540 1060 -842 -1978 -481 -247 -367 643 1818 -417 -900 419 -507
2016e07q27J818n2j687Q81J500j095L97J570j501k255P18N35q46J437K348j574
2033H60p30Q56j638j538K245J039j600Q01J228j877j18J618o33j569J031J59k326
2050b192J435K157p55m15J950j692k673Q93R53p07J472J711j563j060J048p78
2066b16j566K136M36j876K88J491r78J44J874k63k240L21J90j845Q65K912n08
2083A165r22J463j718k355J319J560j295N86J781j595j201K118j37j412J224L38
2099I19k563j55K157l55l4K063k85k886K30M44j436O29L075r36j285J194J9k075
2117a280J060J231j501l12J536j031q15K523L13j772K41k2k181p7K576k6l34J744
2135A873k29k631LQ88r02K37K005n46j397J281L74j381N48J140k003o63J563o25
$$ plain form
2016 -507 -1334 484 432 -1255 -374 1126 31 428 1998 497 -1758 -1040 -505 -1351 86 2434 860
2033 860 130 986 -652 -2190 55 1094 -506 295 1523 -354 -472 1146 513 -1056 -25 134 -2192
2050 -2192 -757 1400 645 230 2180 488 -2185 -1292 -339 -1046 426 2137 574 -486 562 -216
2066 -216 -1782 354 790 -1086 -798 693 -285 -141 1733 1470 -770 -449 -259 -2104 -1239 1673 1165
2083 1165 243 1706 -12 -2367 -1048 512 -783 -197 1584 -11 -1212 906 769 -643 581 919
2099 919 -1644 -1799 358 3 -31 2032 1747 -1139 -909 -465 -1901 -1272 1803 867 -418 776 795 -1280
2117 -1280 -220 1011 -490 -802 734 -297 -1112 1411 1724 -48 193 171 -2010 -2087 489 463 129 1873
2135 1873 1644 -987 -984 -96 -998 -761 1244 698 -699 582 956 -425 123 1263 -740 -1403 160 -465
2153d65k91K330M63j852m01L07j743j9K024K07m35J064j77j804m0J270p92o60
2171a014J604o99o57J066J119j065j74Q78j957r04J604j38J95J421M18j778l61
2188d42N19r64k92J276R3m61O98K94r18M20Q23j301r99J037J77q87J440J089q92
2207G10l99K5p09j275J328J93J3Q76K87p43r2K21q51m30Q64m74m41J026P52Nm68
2228D18K89p78p91Q8j41N57J028K17m43R3K71j189o79O92K86n63Q21N30k51l07
2248A48M33p69l55K4k32M8N14O98R5L36k39r92p40M48R0k94Q30N87l7j86K48m16
2270B39r03o6k03K83N42O21j05K49J87p47l64l32j47m5P69M33PK25J51m65p89
2291d60p3jk17L27O53L56M6P0n15m37k26n25pO53M82o0P08J51o14n08rn34OJ36
$$ plain form
2153 -465 -756 1574 2037 185 -216 91 -1652 -1671 353 560 125 1189 1012 -792 -832 438 -354 -1014
2171 -1014 590 -109 -766 300 1419 354 180 1058 -899 -1803 -199 -337 -142 1279 1697 -81 -442
2188 -442 77 -887 -1179 97 190 -271 427 721 -197 223 1046 -255 -1254 -217 -40 -927 513 1602 710
2207 710 311 336 -373 -1648 -320 -127 -114 762 1049 306 214 435 -416 -846 18 -456 -897 129 881 886 418
2228 418 707 -71 -862 -774 -915 -358 670 887 444 537 808 -381 -1060 -368 -82 -645 176 706 455 148
2248 148 581 -188 -543 -519 -751 -703 -189 509 604 940 701 -291 -1031 -583 -493 -787 43 630 593 407 655 239
2270 239 -664 -730 -933 -650 -108 513 408 657 844 97 -267 -599 -746 -791 -22 411 418 643 794 329 -460
2291 -460 -533 -534 -751 -424 229 585 631 701 186 -251 -477 -1002 -1009 -356 126 66 774 925 311 -197 -206 -740 -734 -598
2315e98M75O98j2J96k65n39k24m53k8K10O67J22L11K16l35n72j6n31p4j32N23
2336c61L38N39L37q0p62o4n13l35N15K43Q5M66L55P3m99m66p2m63l8L66L96K11
2358B71L92pk69m93r3k10l26M58L63K96M38J58n57o81j06m53j52M02N31p6N50
2379D36K28j54n02k61j82o41N80M24J22M15O04m85m73j05k06p29J58Q10k76R03
2399F66N59p85j95k56l61o36M42P07j66L19M58l15l38J00n80m60J49O24k88O19
2419B63P48n77j71K06o20j203M83J045n52M58Q45j6r62J44l68p38K41P14l77M07
2439c0P88k84j59J37m8j453R7O80k53J28J500R9p62J64m33j351L61O62J48j38
2459a47J057l42n34N01l78q36j25Q57q11j42J497J19m00L93m0j601k8P28l97K40
$$ plain form
2315 -598 -123 575 563 759 494 -45 -269 -722 -750 -540 127 249 560 776 441 -131 -147 -678 -752 -884 -361
2336 -361 -23 516 853 773 11 -53 -566 -901 -386 -143 -58 408 763 836 337 -129 -201 -664 -702 -336 60 271
2358 271 663 656 387 -106 -199 -409 -735 -277 86 382 820 978 421 -260 -366 -819 -971 -569 -38 -114 436
2379 436 664 510 8 -253 -435 -1076 -496 -72 50 465 1069 584 111 6 -200 -929 -771 39 -237 666
2399 666 1225 440 245 -11 -372 -1008 -566 141 -25 294 752 437 99 199 -381 -841 -692 -68 -356 263
2419 263 1011 434 263 469 -151 -1354 -871 174 -378 80 925 909 -53 91 -277 -1015 -774 -60 -437 -30
2439 -30 758 474 315 452 404 -1049 -952 -272 -525 -397 1103 1202 440 604 171 -1180 -819 -157 -9 -147
2459 -147 910 568 34 535 157 -679 -804 53 -758 -900 597 716 316 709 669 -932 -960 -232 -629 -389
2479c89J307J83j107M87p7j507K87Q34l88j65R60K43p84P18L80j308q4K57r15
2498a068R2J571L21m14M93m6j910k66Q81N4k34J388k00o22L01L21j250R1J069
2517E72j232n70J051O64o16J093M03j755l57O70p41l31J547O18p55O73q1j601
2535g48k73J188l71m85J232Q7j074O54J074r40l17M22j240q51J323R11j49P22
2553A165M10j732p85Q61p65j44J382J49r04L15P15q03n61J088n28r52O81L91l06
2572c23O59J029p57q62O7q84n26J247Q90m03N70P61j589p85N26O6l94R89N1o52
2592c20J33J068o11k35O44p17j354P87N91p60J489R35q84r54K7o29m35R50J083
2611H08k97k02O43r94l57P58o8j269O26L83p50M89J184j86o13L42q12j070K76
$$ plain form
2479 -389 918 1101 -6 481 404 -1103 -816 18 -370 -535 425 668 -116 602 982 -326 -410 -153 -1068
2498 -1068 -976 595 916 502 995 949 -961 -1227 -346 -292 -526 862 662 40 341 662 -588 -497 572
2517 572 -660 -1230 -179 485 -131 962 1365 -390 -747 -77 -818 -1149 398 1016 261 934 853 -748
2535 -748 -1021 167 -204 -689 543 630 -444 210 1284 344 27 449 -791 -1642 -319 592 443 1165
2553 1165 1575 -157 -942 -81 -846 -990 392 541 -363 -48 667 -136 -697 391 -137 -1089 -408 -17 -323
2572 -323 336 1365 608 -254 -187 -1071 -1597 -350 540 137 707 1468 -121 -906 -380 -314 -708 281 332 -320
2592 -320 -187 881 270 35 679 -38 -1392 -605 -14 -774 715 1650 766 -188 -161 -790 -1225 -275 808
2611 808 511 309 952 -42 -399 359 291 -978 -352 31 -719 -230 954 768 155 497 -315 -1385 -1109
2630a109R62j35N20J078r98o74O07l71o29J57P02l94R2J036p11k05J013o43p64
2649d66m92N93m52Q50J157l53m48J41p00r06N07M68q5M17N71k81n58O58m18o23
2669d20RK70n66N6J074R3l2K54k77j235J97J67l43Q78M68J16k36m7l79o18L16
2690b55q9Kl0Q77m27K57O5P4p62l77L67m41L37M57K77L82J54q00o14o7K89k60
2712e84M04M72PO3K18j78q85K46L8l44J69N36j31N51J90m81l84l28Q8l25K60N43
2734A45L45o8rj96l78L4j36l20N98K9K02J9M34L9p48k98k73Lq2O03K82K29k88
2757A66L14l39n01J91m53J27O97r8K20J97j50o20K44k45k1r5P5L64K09L65m5k44
2779C58o24k65L6J14M08n4j35O92m06k6n2j76m31J29P5J39L30K26N6k87j2k96
$$ plain form
2630 -1109 -147 -282 238 1316 318 -356 251 -120 -749 -592 110 -284 -192 844 133 -72 941 298 -466
2649 -466 -958 -365 -817 33 1190 837 389 530 -170 -1076 -569 -101 -186 231 802 521 -37 621 203 -420
2669 -420 -411 -141 -707 -651 423 516 484 738 461 -774 -577 -410 -753 125 593 709 473 426 47 -571 -255
2690 -255 -344 -342 -372 505 78 335 400 474 -288 -665 -298 -739 -402 55 332 714 868 68 -546 -613 -324 -584
2712 -584 -180 292 299 362 580 402 -483 -237 -199 -543 -374 162 31 582 772 291 -93 -421 -333 -658 -398 145
2734 145 490 422 413 217 -161 -127 -263 -583 15 44 246 265 699 738 -10 -308 -581 -578 -660 -57 225 454 166
2757 166 480 141 -360 -169 -622 -495 202 104 324 521 371 -249 -5 -250 -271 -366 -291 73 282 647 602 358
2779 358 -266 -531 -495 -381 27 -27 -162 530 124 98 46 -130 -561 -432 -357 -218 112 338 394 107 95 -201
2801b01l55K37K37o4K19J96K13k80o0k58m57J0M35m4L50K31J10q8k75m27k24K16
2823b79K34q4J12J74N53o1l71o2m32k07j36M41oN72J04k29k4n13j11k18J70J0
2845c63M97K27N5r6j30j97q3l03M5K9J32N09k8Q1l07J75p2m86LQ7K64K6K48J08
2869D21J71n04Mn26L36m07N37j8K85J14k07J9J0l87o70K21L87J34O0K28M9O0k52
2892F5l61k03K37K14J42K76O5k3o2j8p00k74N78j32K04L06m5P3l10J01l12k59
2914d38J30K5O7L47M38k39j93lm78o6k6J06K59L87J42j93k0j63k83k05L32n15
2936e89M65M23j8k8R3K61n08l64k01N2K07L40k5L35j36O2m07m06P2K56k02J2O86
2959C80K00m66K2j23k15M09o39j70M41L54k55L59j4k74j43j6k27QM89L49k26j24
$$ plain form
2801 -201 -556 -319 -82 -146 73 269 482 202 142 -116 -573 -563 -128 -172 178 409 519 431 156 -271 -495 -279
2823 -279 -45 -129 -17 157 710 649 278 216 -216 -423 -559 -118 -124 448 552 323 299 -214 -325 -543 -373 -363
2845 -363 134 361 416 320 190 -7 -90 -393 -348 -319 -187 322 294 375 68 243 171 -315 -312 -225 39 65 313 421
2869 421 592 88 92 -434 -98 -505 32 14 299 413 206 225 235 -152 -822 -601 -214 -80 -20 208 257 317 65
2892 65 -296 -499 -262 -48 94 370 435 412 350 332 -368 -642 -64 -196 8 314 269 342 32 133 -179 -438
2914 -438 -308 -283 -216 131 569 330 137 134 -344 -410 -436 -330 -71 316 458 265 245 82 -201 -406 -74 -589
2936 -589 -124 299 281 253 346 607 99 -265 -466 -414 -207 133 108 443 307 369 -38 -444 -372 -116 -318 -306 380
2959 380 580 114 136 13 -202 207 -432 -602 -161 193 -62 297 283 9 -134 -150 -377 -369 120 469 243 119
2981A19J97j68o17K21K38l01K54L65p4k48P22l62n62J39k01l59N39M27jJ10J45
3002E83j90p67J5m0j72K74M65ok18M2o0j36J57p8l8n0K29J99k33L11k66n4N9m78
3026d52J48LL87L62l04N19n09l85O7K97p07N82J9j57K76K73o6m64kl84o1L59L6
3049a63j1M19QK1j70k10n8Ol03M55j42l6L27K22n87K70j7k46l5j01L22k62O43
3072C52j9q1K7l63o78N09K80r9K21J60N7j84l62k26K17j00J07K30j94M40N4l52
3094dr6N1p6n40N82J49m40L09J1Q1K02j30k83K5n5K31j02K96J76k97oN4j81k51
3118b94J48M9K47J32n9J07k55r8r9j03N7P8j32M10L14l26k28K38l78q2q5L12m1
3141h8J66L85l27q7k52N3k30M30J8j64L08j42nK03j93j28j77k23K48J3J38L58
$$ plain form
2981 119 316 148 -469 -248 -10 -311 -57 308 234 -14 708 346 -216 -77 -278 -637 -98 329 328 438 583
3002 583 393 -374 -359 -399 -571 -297 168 162 -56 -14 -74 -210 -53 -131 -169 -219 10 209 -24 287 21 -33 26 -452
3026 -452 -304 -301 86 448 144 663 154 -231 -164 133 -574 8 27 -130 146 419 353 -111 -113 -497 -558 -199 -163
3049 -163 -174 245 253 274 104 -106 -164 -158 -461 -6 -148 -184 143 365 -222 48 31 -215 -250 -351 -29 -291 352
3072 352 333 252 279 -84 -762 -253 27 -72 149 309 366 182 -180 -406 -189 -289 -182 48 -146 294 348 -4
3094 -4 -100 -49 -125 -665 -83 66 -374 -65 -54 27 229 99 -184 -159 -214 17 -85 211 387 90 84 138 -43 -294
3118 -294 -146 -97 150 282 223 330 75 -23 -122 -225 -168 -90 -222 188 502 176 -52 186 -192 -274 -359 -47 -88
3141 -88 78 463 136 49 -203 -150 -380 50 68 -96 212 70 65 268 75 -53 -230 -453 -205 -192 -54 304
3163C04n1o2J00m07r7J40N3j08J40O5L97j12k38l3k86j28LL55k34J08J98j28r5
3186a16M19m88n9O2L40j6k38K86K9K8k46Q2m09Q7J15K22L27p7j66m6N8j64k4k78
3210b72O9J48J10L57m16K07k00J96m57K01Lj3O48n83J67P1k05o8k9p6p8j9M33
3233A94j5J89m17K42l27k36K96Q0Jl24M80J14l27m4L2Q5m12M65m28L15K21K5n
3256B04l07P5Q8k11j82L50j14L24j44K14j53k18j11j71L59j51J17L35l35L14j18
3277A65j88o5j46J57k20J96J64J23k46M17j28l88K08m02M11k8k6j1J84k91K35
3298A21L01n39p8JK57j71M59l39n5K43l77j04K47l97J41L64l23L10J64J61m36
3319e0n6J0j14J51J5L25m4rk6k16rO9k79J71J39J09k05LM04m61N0k0j8l2R0J65
$$ plain form
3163 304 253 191 291 -116 -213 -73 -20 -128 12 77 474 362 124 91 -195 -323 -320 35 -199 -91 107 -21 -116
3186 -116 303 -185 -244 -182 158 142 -96 190 219 247 1 83 -326 -239 -124 98 425 348 182 136 194 30 6 -272
3210 -272 -203 -55 55 412 -4 203 3 199 -258 -57 -54 -67 581 -2 165 236 31 -37 -66 -142 -220 -239 194
3233 194 179 368 -49 193 -134 -370 -74 6 7 -317 163 277 -50 -94 -62 23 -389 76 -352 -37 184 209 204
3256 204 -103 -28 60 -151 -333 17 -97 227 83 297 144 -74 -185 -356 3 -148 -31 304 -31 283 165
3277 165 -23 -88 -234 -77 -297 -101 63 186 -60 357 229 -159 49 -353 58 30 4 -7 177 -114 121
3298 121 422 -117 -195 -194 63 -108 351 12 -43 200 -177 -281 -34 -431 -290 74 -249 61 225 386 -50
3319 -50 -106 -96 -210 -59 -44 281 237 228 202 -14 -23 46 -233 -62 77 186 -19 -16 388 -73 -23 -43 -61 -93 -3 162
3345A62k27J49N9k55n2O4J34k13L36M3M7j69j11k12J69l47K14K72j00K29Kl42
3367a48J79j87M3j13J13m8L9J72kj35K36q6m32K61k16J25K2K51m7J8O1k7J39n46
3391c28R6L36k39k7L22j28j66K92k38j18P2j37n0J59Q3J11L96o15J62j43n7P9
3413a38j2J77N3j47L21j47k62o6K03k05k0K47P2k36K38Jj94j15J67k83j34L27
3435a53J88J84j00L0l30K31k19K08l01n1K64P7j12L06n6m78L75j33k05L76P2j45
3457B8L1Q0j48J2l9O0k65M17J91k66M5R0k01j36K32l18p1O49k21j96l1K25m21
3480b53L65k1J2l34L20m5r2o0J59j44L32k11k52J48o1K18j69R0k9L00l56J82j25
3503b6j41K59k11R3J06O2r1J04j4j88k51K13N9J26k1J2j55J07j34N0J25k69J45
$$ plain form
3345 162 -65 84 143 -112 -164 -100 34 -179 157 200 247 78 -33 -245 -76 -423 -209 63 -37 192 194 -148
3367 -148 31 -156 -113 -226 -113 -161 -122 50 48 -87 149 63 -369 -108 -324 -199 -177 74 27 45 106 79 218 -328
3391 -328 -232 104 -135 -162 160 32 -134 158 -80 -198 -126 -263 -313 -154 -71 40 436 -179 -17 -160 -217 -138
3413 -138 -150 27 80 -67 254 107 -155 -221 -18 -223 -243 4 76 -160 78 79 -115 -230 -63 -346 -480 -153
3435 -153 35 219 119 149 -181 50 -169 39 -262 -313 -49 28 -84 222 166 -312 63 -70 -275 101 173 28
3457 28 59 139 -9 3 -36 24 -241 176 367 101 146 236 35 -101 131 -187 -258 391 170 -26 -57 168 -253
3480 -253 112 91 103 -231 89 44 -48 -108 51 -93 239 28 -224 -76 -137 81 -88 2 -27 273 -83 99 -26
3503 -26 -167 92 -119 -26 80 142 51 155 141 -47 -298 -85 -26 100 79 91 -64 43 -91 -41 84 -185 -40
3526d0j58J24L28l57J81L6J3l82K50j27K2j27L58k36L32j56k39q5J80L64j74J06
3548B13o1Jk32K1p4j60L03l8j33K66k37L31l99N35j31p11L60J51p7J74kQ5l08
3571a23K0K84m40J44r5K96J17p0j8l26L74R5m28Q1r5J17j53M14M1r4J18k92j82
3594b15R2O1k48L11K52J8m88L21Qk28K40j46k30R6M01m5k63N4L24n48L29j80J02
3617A8M9J1J90m3k70qJ0K2K5k20K71p4P3k19K49J81n38j37M02m18J8N83M6k37
3641a6J72o4m35K51k73M07J03j26K54r0n34O18l77r0J41J35m37L49L0J3K55j23
3663A63j75m5j0j18Q4m4N26k98K03j61j16j71J23j38J19N6j91Q3l7J35k60M06
3685A34j03j01j19M20l02K97q8J02k98K12l62J02J72P7J6Q3j63j74J88k67J95
$$ plain form
3526 -40 -198 -74 254 -103 78 114 127 -255 -5 -132 -110 -237 121 -115 217 61 -178 -263 -83 281 107 213
3548 213 152 153 -79 -58 -132 -292 11 -27 -160 106 -131 200 -199 336 205 -506 -146 5 -72 102 100 185 -123
3571 -123 -103 181 -259 -115 -210 86 203 133 115 -211 163 258 -170 -89 -184 -67 -220 194 235 141 259 -33 -215
3594 -215 -123 -62 -310 1 253 271 -217 104 112 -116 124 -22 -252 -156 245 200 -63 -9 315 -233 96 -84 18
3617 18 67 78 268 225 -45 -53 -43 -21 4 -216 55 -19 54 -165 84 265 -273 -410 -8 -426 -408 175 221 -16
3641 -16 156 92 -343 -92 -365 42 145 19 273 183 -351 267 -110 -200 -59 76 -361 -12 18 31 286 163
3663 163 -12 -57 -67 -185 -101 -145 381 83 286 125 9 -162 -39 -177 -58 -2 -193 -110 -147 -12 -272 134
3685 134 31 -70 -189 231 -71 226 138 240 -58 154 -208 -106 66 143 159 242 79 -95 93 -174 21
3706B1k30L90l03K4n5M20l59J76J03m9k93K16p5p1j3K50O4j51j17q5n7J50j58
3729b02K48J99l79K25n6m5Q9n2k91J97K99k03q4L07k41k79j76O96j91o8J76r2
3751G7l2k12J91j88J53j24j86L03K8k23L46J5j2m8j9j2j55P9N5O9R6j73K27l50
3775i5J37j85q8J58p8L4M14m55J91K6J11k14L5J08k17K03l45L11j12n0J13L97
3797C99o20M2K99m0o5K67j0l36O7K15k11M6l0q2K97j35Om01K66j88J41L1J41j26
3821b7J3J7Q3p2O2j50Jj54L32o2K36l25j29M82l72j04L21J1m05K24L03r0k43J56
3845A08l20R3N0j30k47N97k58Q5P3J28k02q7M23n87L09l9k07K68jL6j77k6j3j94
3869c18J71J91j04K40j07J04j75J02j63M8o5r2k18L35J04L4r5j49R0k65O4J86
$$ plain form
3706 21 -209 181 -122 -98 -153 267 -92 84 187 138 -155 61 -14 -85 -98 152 216 65 -52 -137 -194 -44 -202
3729 -202 46 245 -134 91 35 -10 79 27 -264 -67 232 29 -55 252 11 -268 -444 252 61 -7 169 77
3751 77 45 -167 24 -164 -11 -135 -321 -18 10 -213 133 148 136 88 69 57 -98 -19 36 105 201 28 255 -95
3775 -95 42 -143 -231 -73 -151 -117 297 -158 33 59 170 -44 -9 99 -118 85 -260 51 -61 -111 2 399
3797 399 -221 -179 120 80 15 282 272 -64 3 218 7 53 23 -59 238 103 109 -292 -26 -214 -73 -42 99 -27
3821 -27 -14 3 86 14 76 -74 -73 -227 105 43 279 -46 -175 307 -65 -169 152 163 -242 -18 285 195 -48 108
3845 108 -212 -119 -69 -199 -446 151 -107 -22 51 179 -23 -110 313 -274 35 -4 -211 57 56 92 -85 -111 -124 -318
3869 -318 -147 44 -60 180 73 177 2 104 -59 -11 -76 -168 -386 -51 53 87 -8 -157 -67 -332 -268 -82
3891h2J81j00K10j86K50l88j9k8N6L66o25K71J1P4m5J18j19J60j21k0J78o8j40
3914f6K18J27j16j07k49k9L64%o0m12K83k4M3K92k84j87j5K52J72l67J71M49l70
3937H5N2l38M39m28K09q3k4L10k64L23m41J18j21J23R0k74L28L00m94P5J61j78
3959c2o9Lj0M5J74k06J66N1r7k6PK09k40P6k72L85p0j20L5K52m37K76k65j47K24
3984h8K59k77M17L5m73J92k34K13k74O01l26J36o5n3k52L26k32J7J32R7J89o19
4006b79J41J45l91J63L51m76M16q7l1J29K42k6j64l25KpJ70m5R5Q5j29L61n11
4029a71J98k58J04R7k59L50l7l38N06j69j59J74n1k48J62L85j29p8j29k7M13p32
4051c96K04j09L40nLj4K06k47P2J49o4j74j46K27j68L89k35J86j54n5k60j51O83
$$ plain form
3891 -82 99 -1 209 23 273 -115 -134 -162 -106 260 -365 -94 -83 -9 -54 64 -55 105 -16 -36 142 74 -66
3914 -66 152 279 163 56 -193 -222 142 142 82 -330 -47 -71 -28 264 -20 -207 -222 30 202 -165 6 455 85
3937 85 137 -201 238 -190 19 -64 -88 222 -42 281 -160 -42 -163 -40 50 -224 104 404 -90 -15 146 -32
3959 -32 -101 -98 -108 -63 111 -95 71 122 25 -1 6 215 -25 51 -221 164 94 -26 9 261 -176 100 -165 -312 -88
3984 -88 171 -106 311 346 -127 65 -169 44 -230 371 45 181 116 63 -189 137 -95 -78 54 151 340 -279
4006 -279 -138 7 -384 -221 130 -346 70 -17 -48 81 323 297 133 -192 -190 -197 -27 -72 23 108 -21 340 -171
4029 -171 27 -231 -127 -30 -289 61 24 -314 192 23 -136 38 -13 -261 -99 286 157 79 -50 -77 336 -396
4051 -396 -192 -301 39 34 37 23 229 -18 54 203 139 -35 -181 46 -122 267 32 218 64 9 -251 -402 281
4074B81n3N6l51L37k07k32J52j74J15R2O0j65J05J85J57k48o4J02o66M03L6J54
4096G5j4K24k86K7R2p8j97L25N0j47L3L6R8l65J74K27n01J17k3K6J97nO9l06N7
4121i5n1K08j19r7K59j27J78M7J45m49K98l03q6K14K5J42j40k91J43q6J39L30
4143B84l99l7K73l74K51o2L5j2n3l71N58j72J91k7k0l7j10J67j6o2l4J13l90L98
4167I4l9rm1O1K19m55K32k06J5J10J89J29n9j99K1p6k00L03k66P9K53k14j82K02
4191c9J13j86J5J40j95K13L3j68J28J72m21L40q2j31K6j32K47Nj32J91k02K9j89
4214b25J18k45L50m4K18p8R6r1n2j05j14P3r7L7K26j36J68k43J54j32J76p7QJ33
4238A18J52l40K04J10m42M68j45k07M1j25O0J63j40J64l9m43J29PJ49K63j78K41
$$ plain form
4074 281 228 284 -67 270 63 -169 -17 -191 -76 16 76 -89 16 201 358 110 46 148 -518 -115 -79 75
4096 75 61 285 -1 26 118 40 -157 168 218 71 104 140 238 -127 47 274 -227 -110 -133 -107 90 85 154 -152 -95
4121 -95 -146 62 -57 -154 105 -22 156 203 348 -101 197 -106 -192 22 47 189 49 -242 -99 -185 -46 284
4143 284 -115 -152 121 -253 -2 -64 -29 -41 -94 -465 93 -79 112 85 65 28 -82 85 69 7 -27 86 -304 94
4167 94 55 46 5 66 285 -170 62 -144 -129 -19 170 299 240 41 62 -14 -214 89 -177 -98 155 -59 -241 -39
4191 -39 74 -112 -97 43 -152 61 94 -74 54 226 -195 145 63 -68 -42 -174 73 78 -54 137 -65 -36 -225
4214 -225 -107 -352 -2 -46 172 94 190 99 47 -58 -172 -99 -196 -159 67 -69 99 -144 10 -122 54 -23 -15 118
4238 118 270 -70 134 244 -198 270 125 -82 -41 -166 -106 57 -83 81 42 -401 -272 -265 -116 147 -31 210
4260B10l10M24l13r4K03l12M0l32L95o2K80J33k61j14J28r0k12R2m9M28j4j5m7
4283A08j42n7N4l01K09J07L0j63O57n43k10K57l0l91M15l0J38n8K02j84Ok13q8
4306b27N7j21J36K0J92J7k47L4J57K05l82m6M60k27j13J25J28p1J69k86j08J15
4328a3j03L59j38l7o2O0l2P4o5l14Q5L28j6j26j44l1L12l3j93j54JJ08K9K1L9
4353d5N5L8Rl61J82O9j70J64J50J22q0k31Qj25L10J16M2k31J82m1j13l1j17N4
4377d4k65K13k20L38k78j42O17o4k57k04K46r9J54M9J02j48K9m3M2j22R7p2K02
4400A31j56J20p4J59Mj24m4k5j34Q9n2L27l6J79l18P7k17Q4J95l03M2K21L91n43
4424gR7j03l5k33L64q1J25j83L21l28L49j86j07l81K17J11J2l7L6K27j31R2j75
$$ plain form
4260 210 -100 324 11 -83 120 -192 -152 -484 -89 -151 129 262 1 -113 15 -75 -287 -195 -244 184 170 155 108
4283 108 -34 -91 -37 -338 -129 -22 8 -155 502 -41 -251 6 -24 -415 0 -30 108 50 252 68 74 -139 -227
4306 -227 -170 -291 -155 -135 57 74 -173 -139 18 223 -159 -205 255 28 -85 40 168 97 266 -20 -128 -13
4328 -13 -116 243 105 68 6 66 34 108 43 -271 -186 142 126 0 -144 -175 137 104 -89 -243 -242 -134 -105 -84 -45
4353 -45 10 48 57 -304 -122 -53 -223 -59 91 213 133 -98 -90 -215 95 211 253 22 204 163 50 19 -98 -44
4377 -44 -309 -96 -316 22 -256 -398 219 155 -102 -306 -60 -159 -5 44 146 -2 27 -16 26 -96 1 -71 131
4400 131 -25 95 21 180 184 60 16 -9 -143 -54 -106 221 185 364 46 123 -94 -10 185 -118 -76 145 536 -7
4424 -7 90 -13 -48 -281 83 2 127 -56 265 -63 286 100 -7 -388 -171 -60 -48 -85 -49 178 47 139 -36
4447c6NJ9j07k54L61O4k78L45j61m3j55k6J92k12L20M3j25K51K03m26J06j24r7
4470a35j9M42j46k39J96Jj83q8Q0j22mj5R1K08j76K02J80l75R1k18J1P2M47J88
4494D89k74J0l01Nj74M6j1P1K76j95K84O8m52K84L8j65l97J41N07m12o9O40j81
4517B28k02j7Q7l51M34j29j78K61K09n04m3M07m33M1M34k49qj34N93m04j44L88
4539B86m20o2j15K00rK00R8r9k67K51j53O4l5P6J85j66N3l7j97J75J45j8j87p1
4563a03j08J85L86o0m02K47j56j59q0J57R0J87Pj67oj34j0k9R7n4r1M0J85r8M8
4588b8O3k1j04k02L85l26K90k6J85l19J2J84l21QL93o8k74J40j30j15L25J90n68
4611c27L03J61l61l48P01j08k42J09J25j06j56K20LO0K13k33m5N8J40k72j58M07
$$ plain form
4447 -36 -31 -12 -119 -373 -12 52 -226 119 -42 -85 -240 -266 -74 -286 34 77 -48 203 406 -20 86 -38 -135
4470 -135 -154 288 142 -97 99 100 -83 -171 -91 -213 -217 -232 -141 67 -109 93 273 -102 -11 -229 -218 -146 301 489
4494 489 215 225 -76 -71 -245 -199 -210 -139 137 -58 226 294 -158 126 164 -1 -398 -257 250 -162 -231 409 228
4517 228 26 9 96 -255 179 50 -128 133 342 -162 -205 202 -231 -190 244 -5 -13 -147 446 42 -102 286
4539 286 -134 -196 -311 -111 -120 80 178 79 -188 63 -90 -26 -61 15 200 34 87 50 -147 28 173 155 -32 -103
4563 -103 -211 -26 360 300 -102 145 -11 -170 -250 -93 -3 184 191 24 18 -116 -126 -155 -58 -112 -203 -163 22 -76 -28
4588 -28 35 14 -90 -292 93 -233 57 31 216 -103 -91 93 -228 -220 173 105 -169 -29 -159 -274 51 241 -327
4611 -327 -24 137 -224 -572 129 21 -221 -112 13 -93 -249 -29 -26 34 247 14 -31 27 167 -105 -263 144
4633A44j95j88P9N37m76P6M05k49l85K86j67k75L37k8R1j20L39n2k59K02k69J45
4655b2n0L89m17L30k49K03r7O6l10k89O07k30K96k17L59m30P6k95K41k14M12k52
4677i3j20J33L02k35k32O66l77j63P3L8j22J90J28l22O6L71n12j56J85J82M6O6
4699A14p4O5k77K28k89J87J08K9k45J67J83k15l2K39l40Q8k8K73o7k48M00k86
4721b0J45m34M00j43L3K0J4J3N8L8k46K42K1l09L16Ml36K6L27Jj77M56k78j56
4745A5k85J00K36k49L67P5l52K5R9k99J88J88l14K19N7rJ17k06j57p9q7L31J52
4768A32k43L69l7j62l17L78j50j97jJ76J5N2J03p2K58k61j82Q0l3J58P7K6J53
4791C22l02M14m17k3K65m56J51n5K56j6M0R6l75j65K78j04k9k11L57J98o3j11
$$ plain form
4633 144 -51 -239 -160 377 -99 -23 382 133 -252 34 -133 -408 -71 -99 -8 -128 211 159 -100 102 -167 -22
4655 -22 -72 317 -100 230 -19 184 87 153 -157 -446 161 -69 227 10 369 -61 15 -280 -39 -253 159 -93
4677 -93 -213 -80 222 -13 -245 421 44 -119 -46 -8 -130 60 188 -134 -68 303 -209 -365 -180 2 48 114
4699 114 40 105 -172 56 -233 -46 62 91 -154 13 196 -19 -51 188 -152 -64 -92 181 114 -134 266 -20
4721 -20 125 -309 91 -52 -19 1 15 28 86 124 -122 120 141 -168 148 152 -184 -158 169 170 -7 449 171 15
4745 15 -270 -170 66 -183 184 259 -93 -68 31 -268 -80 108 -206 13 70 61 178 -28 -185 -264 -351 -20 132
4768 132 -111 258 221 59 -258 120 -30 -227 -228 -52 -37 15 118 46 304 43 -139 -59 -92 66 143 169 322
4791 322 20 434 17 -6 259 -197 -46 -101 155 139 179 275 -100 -265 13 -91 -120 -331 26 224 161 50
4813E0Q9n38K53L1j26J28N4O7J71j02LJr7K0P4k24J61o4K66k27J02m2m03J49j7
4838b21m5J49M05l38k23M62j47P6m71L29p4K69j39k26M18O0J0l83J34N5j06j4
4860b0J23R4J77j81m00P3k1j06J94K06j71J68K3J22l05J34j81L8l8n3L02j87J43
4883A34o3o0k99M57l16J9j69r8M30l4P9n9l3k5k1j99M01l64K83Q4K33l38l9p3
4907g0kJ02%N1k4Q3J40k69M0j27k36L64k09P8j53M52p8m9J9N6j55m13M36l5k0
4932a9n8L78l60J0M63m85K2J73l15K67K28j02J2l17L76o10L2m0K97QJ42n2o2q
4956b0L01j32l02J81l94Q0J49L53k22J41Q7n11K38P8p0M9m9L2K16q2l0j68J87
4979A12j62r4O3L21k95K03k29K3k84L03j38J74P1k57K47k73K57K76k52p6k9J93
$$ plain form
4813 50 139 -399 -146 -115 -241 -113 -59 8 179 77 80 81 -16 4 78 -146 15 -49 217 -10 92 50 -353 -204 -221
4838 -221 -266 -117 288 -50 -273 189 42 118 -353 -24 -98 171 32 -194 224 284 294 -89 45 100 -6 -20
4860 -20 103 197 374 193 -207 -134 -155 -261 -67 139 -32 136 159 281 -24 110 -71 -33 -71 -124 178 -9 134
4883 134 71 11 -288 169 -147 -128 -297 -395 35 1 80 21 -12 -37 -58 -257 144 -220 63 147 380 42 3 -70
4907 -70 -72 30 30 81 57 140 280 11 51 -76 -312 52 -157 -79 -232 220 142 93 112 168 13 -400 36 1 -19
4932 -19 -77 301 -59 -49 414 -71 -49 124 -191 76 304 202 214 -103 273 -337 -305 -345 -48 -40 102 50 -12 -20
4956 -20 281 149 -153 28 -366 -286 -137 216 -6 135 222 -289 -51 27 -43 6 -43 -11 205 123 93 -75 112
4979 112 -50 -144 -81 240 -55 148 -81 -58 -342 -39 -177 -3 68 -189 58 -215 42 318 66 -10 -39 154
5001A54m16P7K36n5k7K46j99j47j02K17k45J28L33L1k28K45k54k70r9L65k8o0
5023i8K08k39l3M54k77m9L2J9j77j0J50N0K17n7Q0k78j63l6M7K04N7p9R9m6J49
5048B24m60j2P41n02j83K62K22l95L13J20j42j12oK5m20K36L16j6l1K9m12J13
5070i0J76k81K4J03k41L75O2K3k85K8P8m9R7J3j05J15J57k5m58J63K74o00K84
5093a62K7K40o6O6j28R6r4L11n60J63M34k23j19R1L4j12N6K52l23k12J95M6j65
5116a53K21J16j53j52J34j16j23J95n5K07J1J25l47O2L8K22o03L50Rl8j31K37
5138E6j46K59l64O3j2P4J06p7K12Q5k16l86O10n23r1K91K38m42J4L38j15J8n1
5161e9O2K6OQ3j46l1L49p7k36L11j00n22J25M20k62k03L28j48J20J87l22M5k46
$$ plain form
5001 154 -262 -185 51 -4 -31 215 16 -131 -233 -16 -261 -133 200 231 3 248 -6 -276 -375 -10 -38 -98
5023 -98 110 -129 -162 292 15 -34 -2 17 -160 -170 -20 30 247 190 270 -8 -171 -207 -160 44 101 22 121 75 224
5048 224 -236 -248 493 -9 -192 70 292 -103 210 330 188 76 70 95 -325 -89 227 211 180 209 -203 -90
5070 -90 86 -195 -171 -68 -309 66 128 151 -134 -106 -28 -77 20 33 -72 43 200 175 -283 -120 154 -446 -162
5093 -162 -135 105 39 105 -23 73 -21 290 -270 -107 327 104 -15 76 110 -2 54 306 -17 -229 -34 12 -153
5116 -153 68 184 31 -121 13 -103 -226 -31 -86 121 132 257 -90 -28 10 232 -371 -21 -12 -50 -181 56
5138 56 -90 169 -195 -132 -144 -70 36 -41 171 256 40 -346 264 -259 -350 -59 179 -263 -249 89 -26 -8 -59
5161 -59 3 29 35 118 -28 -59 290 213 -23 288 188 -334 -209 211 -51 -254 74 -74 46 233 -89 -44 -290
5184b90K62l09K44L21l04M05p9j49k51J48j29M0P9K05r1O2k97L74k12k1k89L46
5206F5l01J90J69M8j67L40n49l0J23k37N6M16q1m7M6o3R9Ml04k7J97R4N9M5L3
5231A78N7j64l33J80j81L64R3J01l45O5J45q2j53Ln5k01J86J04J86o8K1O3k4k35
5255i5O4M1K09k24m1K8J39q9j61n5P7Rj49K44l3j9r9K0K76j69j68j47P1J27K4
5280a20L73O7k15k4j23k84R0Q3K23O6l73L28j07J42p8k35j36K93J71K5k55r8M35
5303B48k06k19j9J25j72L14j17J94k15m0J8J79j68L23m21Q9J22n5J38q3n0l05
5325c20K91l9j8P1j24L20q6K13l47J87rk84j02J25J12O9j92M1J87l01K25K5j14
5348g0pJ00k94N48l56J32o7j16k5O5L9J2L09j2J71n24p2k1K05k50r0L30J52n6
$$ plain form
5184 -290 -28 -337 -93 228 -76 329 250 101 -150 -2 -131 -91 -12 193 102 164 -133 241 29 8 -281 65
5206 65 -236 -46 123 171 4 344 -205 -235 -112 -349 -293 123 42 -5 41 -22 77 81 -223 -250 -53 41 100 145 178
5231 178 235 71 -262 -82 -263 101 194 295 -50 15 160 78 -75 -72 -127 -328 -142 -38 148 80 101 164 140 -95
5255 -95 -31 10 219 -5 -46 -18 121 32 -129 -184 -107 -98 -247 -3 -36 -55 -154 -134 142 -27 -195 -342 -271 -144 -120
5280 -120 253 320 105 81 -42 -326 -236 -153 70 136 -237 91 -16 126 48 -187 -323 -30 141 166 -89 -187 248
5303 248 42 -177 -196 -71 -243 71 -46 148 -67 -107 -89 90 -78 245 -176 -87 35 -20 118 35 -15 -320
5325 -320 -29 -68 -86 -15 -139 181 95 308 -39 148 139 -145 -247 -122 -10 59 -133 -92 95 -206 19 44 -70
5348 -70 -77 23 -271 277 -79 53 -14 -130 -155 -90 -51 -39 270 258 429 -95 -167 -188 17 -233 -323 7 159 103
5372A03N2M6k48K17m6j89j26N4j5P6R3J36j68J23k04K36k77J44M0p3j15K81l5
5395A05M7l62Q7K15j75J49m5J93j00m1k81K28j14K6j35J06K40N3j93L28k13q8
5417C0k64J76j33pJ49O4K54l42L44k09nJ41k46K43k65l5N5l9o7l6L1R0L01l25
5441i5K81k89K55k3j54k2l3K31k50j4J76l2K25r4N0p9j86j83K63M0l76N25j95
5464B1j97K69j14J30k44k8r8M39l11J01J56j32km0Q8K6j84Q1P6j05K21k7Q6l36
5488a24m7L7p3L40J71k27r5J59l94j21N35k59J53J64l28J88R6P0r5l39L9J61N0
5511F1p0k03K79P4j8j42P1k39J53J5J22l4k16M27J6k81l9J92q7j31j25M2J29J35
5535A31l40L77j69m2O3r3J88j31K7J0oL2m9l0q3J32j42K08n6J49k80J93j8j68
$$ plain form
5372 103 155 201 -47 170 124 -65 -191 -137 -152 -76 17 153 -15 108 -96 140 -137 7 47 -26 -141 140 105
5395 105 152 -210 -123 92 -83 66 21 214 114 73 -208 20 -94 -68 -203 -97 143 196 3 331 118 30
5417 30 -234 -58 -191 -198 -49 15 269 -73 271 62 57 198 -48 195 -70 -105 -50 -89 -156 -192 -161 -71 230 -95
5441 -95 186 -103 152 129 -25 -47 -80 151 -99 -113 63 31 256 162 212 133 -53 -236 27 67 -309 216 21
5464 21 -176 93 -21 109 -135 -163 -261 178 -133 -32 124 -8 -10 -50 38 64 -120 -39 37 -68 153 126 212 -124
5488 -124 -171 -134 -207 133 304 77 -18 141 -253 -374 161 -98 55 219 -109 79 175 245 150 -189 -150 11 61
5511 61 -9 -212 67 141 123 -19 52 -187 -34 -19 103 69 -147 280 296 15 -24 168 81 -50 -175 -133 -4 131
5535 131 -209 168 -1 -43 20 -73 115 -16 11 21 15 47 -2 -32 -115 17 -125 83 27 176 -104 89 71 -97
5559i7K57k21O1J38r3r0K07J6k68R0J91m13P6K1K96k8m3l5K8k32N5J25q4M9m8
5584d2l00L18k27K66Q4k51J05O7J86k51p3K37l23JK30q0lJ73j14KL06l44J18J4
5608I9j36j49J73O0N7J1k70K25q3K03j41r9k33M59l18J82J07j42K35k38m2j09
5630a49J97J03l16j14L47J37l42K12O4l06P8K66j03r0lO5p5o3K70k91k6P1j43
5653b11j03L07j67J73J36k7j01m3K86k20l98M20k05L68J49n8j63j7j65K61m16
5674a94N3Q7k4J40O8N4n3O5k26K2K9p2K37j60J82k35m0J46o3j42K93j17q1N2J9
5699D0j41J42J60k12p6J89m2k90L62k09K0K32O5j46k95L46l1j64R3J43j84k42
5721b40K96m5j38L7j74R7J85j6P2J26k65O8k48J0L71Nl65K79J34k37j1J51J09
$$ plain form
5559 -97 160 -61 0 138 45 -45 162 178 -90 0 191 -222 -146 -125 171 143 100 65 93 -139 -84 41 -43 6 -42
5584 -42 -342 -24 -251 15 99 -152 -47 20 206 -45 -118 119 -204 -203 27 -53 -56 117 3 5 311 -33 85 99
5608 99 -37 -186 -13 47 104 115 -155 70 -13 190 49 -50 -283 176 -142 40 147 5 240 2 -40 -149
5630 -149 48 151 -165 -279 68 205 -137 75 139 -167 -89 177 74 -16 -19 46 -29 -92 178 -113 -139 -68 -211
5653 -211 -314 -7 -174 -1 135 108 7 -36 250 30 -368 52 -153 215 364 306 143 126 -39 222 -194
5674 -194 -141 -54 -78 62 130 184 131 196 -30 -8 21 -51 186 26 208 -27 -67 79 16 -126 167 50 -31 21 40
5699 40 -101 41 201 -11 -87 102 60 -230 132 -77 -57 175 240 94 -201 145 114 -50 43 186 2 -240
5721 -240 56 11 -127 -90 -264 -167 18 2 74 200 -65 3 -245 -235 136 141 -224 55 189 -48 -59 92 201
5744B01k91L33n6j81J10L0j11k9J14k82n3J46J35K88m03QK5OJ10m65L74Q3k08
5767a16P2M20m95l5R5M8K18l01q0O8q0M94k43j50r1N0J54j17J34RJ09l28J39j2
5791c8R9k20L07l8k79QL15j27O7J25k55kK7K01l26J32n1R8J47J5j22q0J2k5o5
5816g5K29k12O6K03j21K04m14R0K31k79K37k51JK75j79k20P8j07K29j18N7k19
5838b95M45j75M8P9o2k17L10k94K46k25p8K85K09n05J13J59o0Q0k98q4K54o4L2
5861i7M22o08L11o6K4m9K09j22K8n5m7J43lj00n5r7R8p5M9P1K01O9j97j60lKk3
5888a30K46p2J40k02R8r2J18j34j53j7K32k32J08J48m3J18j49j72%M49l51K8r7
5911a59L79k34K12j63N8j64J40n5j6J51j89J07j04J69m16K30n5L84l71K70j54
$$ plain form
5744 201 -90 243 187 6 116 146 35 6 120 -162 -215 -69 66 354 -49 -41 -16 -10 100 -365 9 92 -116
5767 -116 -44 376 -119 -154 -59 -11 207 -94 -174 -106 -186 308 65 -85 -176 -126 28 -89 45 54 163 -165 -26 -38
5791 -38 61 -159 148 110 -169 -161 154 27 94 219 -36 -38 -11 190 -136 -4 -55 43 190 205 83 3 15 -10 -75
5816 -75 154 -58 8 211 90 294 -120 -30 201 -78 159 -92 -91 184 5 -215 -137 -244 -15 -133 -76 -295
5838 -295 150 -25 23 102 40 -177 133 -161 85 -140 -218 67 276 -229 -116 43 -17 63 -235 -319 -65 -129 -97
5861 -97 325 -283 28 -38 -14 -63 146 24 52 -3 -50 93 90 -10 -65 -162 -64 -139 -90 -19 182 251 54 -106 -109 -107 -130
5888 -130 116 44 184 -18 80 -12 106 -28 -181 -198 34 -198 -90 58 15 133 -16 -188 -188 261 -90 -62 -159
5911 -159 220 -14 198 35 93 -71 69 14 -2 149 -40 67 -37 132 -284 -54 -109 275 -96 174 20
5932B0j47J31J09j31k47K80j4J79l66J76J72pk39j0O1j31k84K80L33k82L80l03
5954d0J9j27j60K01o0L39j98O2J13o2n8M2j6J32l60j15J50K39K4k20J74r7O2k37
5978a93L45k96J8K53q7l1m1j9l05J36L39r1o5j22J53Q9k05J16p1j9K9J67j98K02
6002A04o0R3j40M54l45k39n8L70j0j47%j63N8K49l07nJ62N3K0k16J15J13k29K24
6026I6R0m11J06P5J68j92J35K50k65n7L10m64K85j93J72p0j36l3K2J89j33M0l0
6049d6o0J7k08L06J65o9m5l13J18J5j69L17q5l37L46j50L21l77K69lK41j16j63
6072b6k10K65R7j6p3j39K29j94J34n3J19J60j14m0k29J94o8J76J69m16J63J13
6094B41l26K41k01j68J37J57k24m8J75j19K10j87J15O1p1k22J39J27k79J98J45
$$ plain form
5932 20 -127 4 113 -18 -265 15 1 180 -186 -10 162 155 -84 -94 -33 -164 -448 -168 165 -117 263 -40
5954 -40 -21 -148 -308 -107 -167 172 -26 36 149 87 29 71 55 187 -173 -288 -138 101 125 -95 79 -18 44 -193
5978 -193 152 -144 -126 127 40 9 -32 -51 -356 -220 119 28 -37 -159 -6 83 -122 -6 -77 -96 -67 100 -98 104
6002 104 44 137 -3 451 106 -133 -191 179 169 22 22 -141 -83 166 -141 -146 16 69 89 -127 -12 101 -128 96
6026 96 186 -225 -119 -44 124 -68 67 317 52 -5 305 -159 126 -67 105 35 -101 -134 -112 77 -56 -16 -46
6049 -46 -106 -89 -297 9 174 105 60 -253 -135 -120 -289 28 -57 -394 -48 -198 123 -254 15 12 253 137 -26
6072 -26 -236 29 126 110 37 -102 127 -67 67 14 133 293 179 139 -90 104 36 212 381 -35 128 241
6094 241 -85 156 -45 -213 -76 81 -143 -191 -16 -135 75 -112 3 64 -7 -229 -90 37 -242 -44 101
6115A01l48K32m5N4jq4j28L99k1j28p1r3K98j52n4K72m26q0L10J95l88J44J43
6138A29n5J6j20k27J89O1n9R1k27L39j87M9Mj10J06l69L08K84j49j04k28K55O0
6161E6J46q4J83l15n2Q2J11Lp9M7j95j02j0K34k34L23k49m3K19j99J75k64K57
6184A0J25l52L33k57K4L81j2l21k1J77O0J39k30R5k85K58%m6j17j13K40Q7k21
6207d6Q0KR3M9k1k87lJ87o1J6J74j96j81L17j62k8J80P8k32Q5j47lK36j01j01
6232g2L4K37j70R6j22j51R7Q3j17N8Q5k88J15K47n4k98J35J46npj23k1j4k07M00
6257H4j81Q3J69k25l4j69M61j44k9J9k06L66l61N4R6r0L15k01L3k66R4K07l5p8
6281c8L70l01K69l67P4J46k47l2K82J45k65j72k7J44n0K69p0j15K57k35J02O8
$$ plain form
6115 101 -247 -15 -60 -6 -7 -91 -219 180 159 31 -40 -133 165 13 -41 231 -195 -275 35 230 -158 -14 129
6138 129 74 90 -30 -257 -68 -7 -66 25 -202 137 -50 -1 3 -107 -1 -370 -62 222 73 -31 -259 -4 56
6161 56 202 118 301 -14 -66 16 127 130 51 98 -97 -199 -209 25 -209 114 -135 -178 41 -158 17 -247 10
6184 10 135 -217 116 -141 -117 264 252 -69 -90 87 147 286 56 151 -134 124 124 78 -39 -152 88 175 -46
6207 -46 34 36 129 178 157 -130 -133 54 -7 9 183 -13 -194 123 -39 -67 113 191 -41 44 -103 -106 130 29 -72
6232 -72 -38 199 29 125 3 -148 -51 32 -85 -27 58 -230 -115 132 78 -220 -85 61 56 49 -74 -95 -109 -316 84
6257 84 -97 -14 155 -70 -104 -273 188 44 15 34 -172 194 -167 -113 -17 -107 208 7 40 -226 -132 75 40 -38
6281 -38 332 31 300 -67 7 153 -94 -126 156 301 36 -136 -163 -19 -69 200 130 15 272 37 139 207
6303B07m04J74j54L99l4j9nj54j34K09m3p7M5J48j76O6r7N2j60J56k19J90K22
6326A92l43K40k95L36j50l7K22m16K16L0J00J89m51J88r3J02K1j10K05r7k20m3
6348b14M35p6j84J21N0j24J20l2j6j92K06J32l2k76J2k3P0M1K27l48n3O7J83k38
6372a44K70l05M2J20ok36M35m3j43L2L88k79l26J86N0N1p7j49Q4J18qj07j24o2
6396b33Q7J3J18J09k6k26L62k69l90M02J5J15j73L07n5k37Q8o4j52J3j07J55J27
6419b1K54m24J48m6J99j12r2j80M54j40j5J47k71K66J29l22o2j24M05p0k9J74
6441B68k84Jk38L50k47J50R0l18J64j07J46j78K92K7k55K18j40N6N2k3K4j53Q4
6464b1J0j14K75j61R0n3P4r6J1P8q5j41J65j67L53m38K6L95l01J11N9j70J38j72
$$ plain form
6303 207 -197 -23 -177 222 188 169 164 10 -124 85 42 -35 10 158 -18 48 -49 3 -157 -1 -220 -30 192
6326 192 -151 89 -206 130 -20 -57 165 -251 -35 -5 95 284 -167 21 -72 30 51 -59 146 49 -171 -214
6348 -214 221 145 -39 82 132 8 128 96 80 -112 94 226 194 -82 -70 -93 -23 18 245 -103 -156 -89 94 -144
6372 -144 126 -179 -137 -17 -23 -259 176 133 -10 22 410 131 -195 -9 41 92 15 -134 -50 68 60 -47 -171 -233
6396 -233 -146 -133 -15 94 68 -158 204 -65 -455 -53 -38 77 -96 211 156 -81 7 -57 -209 -196 -303 -148 -21
6419 -21 233 -191 -43 -89 110 -2 -94 -274 180 40 25 172 -99 167 296 -26 -88 -212 193 123 94 268
6441 268 -16 -15 -253 97 -150 0 90 -228 -64 -171 -25 -203 89 116 -139 79 -61 -5 47 24 48 -105 -21
6464 -21 -11 -125 150 -11 79 26 100 4 15 93 8 -133 32 -135 218 -220 -194 201 -100 11 70 -100 38 -134
6488a34J97j84J61j80J16M3j93K82j53J60j13K94o6j41J21j6k81K54J21k53pj56
6510a28NK91k00q5L81m56K44k23L5K81k29m9J1R7Q5k19J03J0J9K39j59m1o0J84
6534A36k71l8J63n2J58j58M8l7P6K70k53J89j27l90N34k67O9K4j23m3Q6M0LN3
6558I0j43N2j09J00J08j10r5K3j11O9J64o6l7L50m20R0p5K58q9p0K8K10l39Q0
6582d2j5K69m37J98J58k73Q0R2O7K6L78m19m4l42M82j95j40K59J30j17j91J0K57
6605A91l95K77k4o5J24j18J82k31L44Pl26K54k14J18k7j65N6J62j02k1n7%P1J3
6629E4l3R6j95K8K47k43J24j38R9O1j44N4M5q4J00L26k95J4k37J63J26j40l31
6652c03M46k80K50l26J89L44l40L3l7p7J44j50n2K12j20J63k36n3J37N6J72j62
$$ plain form
6488 -134 63 -121 40 -140 -24 19 -174 108 -45 115 2 296 230 89 210 194 -87 167 288 35 28 -128
6510 -128 -123 168 -32 -117 264 -192 52 -171 -136 145 -84 -133 -122 -25 60 -159 -56 -46 -27 212 53 12 -48 136
6534 136 -135 -173 -10 -62 96 -62 -14 -51 25 295 42 231 104 -286 248 -19 50 74 -49 -92 -6 34 37 90
6558 90 -53 -1 -110 -10 98 -12 -107 -84 -195 -126 38 -28 -65 285 -135 -45 -120 138 49 -21 7 217 -122 -42
6582 -42 -57 212 -225 -27 131 -142 -62 30 97 123 501 82 38 -304 178 -17 -157 102 232 115 -76 -66 191
6605 191 -204 73 49 -16 108 -10 172 -59 285 292 -34 220 6 124 97 -68 -12 150 48 27 -30 -30 41 54
6629 54 21 117 -78 -50 197 -46 78 -60 39 100 -44 10 55 -29 71 397 102 116 -121 42 168 28 -303
6652 -303 143 -137 113 -213 -24 320 -20 13 -24 -101 43 -107 -159 53 -67 96 -140 -193 -56 0 172 10
6674A0P7k15K86l98J04K27Q2m77L60o6J26j42j69K89k22L20k35k37R3J9k13M88
6696A07Q4l74k3L54p6j40oM81J2k50o2l6j51J05k01J73j02J7J27j40k60N81m70
6719b50K25n8k2J38l74K30j2J07j69j5K53jj23o5j3K38j43q8K08j54Q5k5J30m40
6743c38M22r7J42o5l06L17P5l51J21K96j86L4l12M68m82M07l17J10K19j13j57
6764a13J9K00j28J35j09p8J49m3l22J91J57J11j47J62O1m05Q3K69q5l25J95K46
6786B23J2m45J32j25K79N3k7q7OJ9M5o6J70j78P0P9k45j27R4j09L09j50K66k66
6810f8p1N2J91o5j01R3j0j7J11j17J19L0j40O0j42J21M9m90K63K05m0J09j69L60
6834C33l57j42J7J18k01L75o44M46q1j83M00j8j66j31K81J4J36l42R5o8J29j3
$$ plain form
6674 10 87 -128 158 -240 -136 91 173 -304 56 -10 116 -26 -195 94 -128 192 -43 -280 -187 -168 -381 107
6696 107 191 -183 -206 148 72 -68 -74 407 419 169 107 71 -80 25 -176 -3 -105 -88 39 -101 -361 220 -250
6719 -250 -25 -83 -105 33 -341 -111 -123 -16 -185 -200 53 52 -71 -136 -149 89 -54 -142 66 -88 -3 -28 102 -338
6743 -338 84 -13 129 64 -242 75 150 -201 -80 216 30 64 -248 220 -262 145 -172 -62 157 44 -113
6764 -113 -94 106 -22 113 4 -74 75 32 -290 -99 58 169 22 184 245 -160 -77 192 107 -218 -23 223
6786 223 235 -210 -78 -203 76 129 102 15 21 40 85 19 189 11 81 160 -85 -212 -118 -227 82 -68 198 -68
6810 -68 -139 -87 104 39 -62 31 21 4 115 -2 117 147 7 67 -75 46 95 -395 -132 73 33 142 -27 333
6834 333 -24 -166 -149 -31 -232 143 -501 -55 -136 -319 81 63 -103 -234 47 61 197 -145 -50 -118 11 -2
6856bJ37l32J40J04L7K70l32Q1K4k34j28L26J60j79k64M34j20j52j07J22J2J94
6878A91m79P3M18j97j53j93L52J26M35q23M03j45j76J05LM8m6j55MJ34o9K3K79
6901A58j62l6j61L95p5j93K25l29J83j64J61k3J39k64Q2l2j6k12K87K12l07L08
6923A76l06J54k39J11J54P2Nj66K76k74l04M19M8j22j07m5R8J56j4l45M51l04
6945a06m6j10M1K22j86L59l03jK7L04j67k31O25l59j12K6J77k26n1j1P5k10K24
6968c9j96L22P2n0l03J66j54L71J1j05o8l2j73L12q8O4L2M0p9j14K19l90J57R3
6992F8M0k19J08K34m06J2J46L14j81L6l0J24j11p9j43K69n6j4p1j80J14N2j9%
7016HJ15k13J38K17j50q1L7j50Q4r6j82K30J59j51K35j06r1j13K69j40k16J87
$$ plain form
6856 -2 135 -197 -57 47 84 354 22 103 127 -107 -235 91 251 72 -192 242 122 -30 -137 -15 -3 191
6878 191 -288 -215 203 6 -147 -340 12 138 573 -250 153 8 -168 -63 -60 -12 -58 -213 -209 -75 -144 -121 158
6901 158 -4 -40 -201 194 119 -74 151 -178 5 -159 2 -21 118 -146 -64 -96 -112 -324 -37 175 -132 176
6923 176 -130 24 -215 -104 50 122 127 -39 237 -37 -341 78 126 4 -103 -148 -50 106 92 -253 198 -106
6945 -106 -152 -262 -221 1 -185 174 -129 -130 -103 201 34 -197 428 69 -43 -17 160 -66 -117 -128 -53 -263 -39
6968 -39 -235 87 159 109 -194 -28 -182 189 200 95 27 -5 -178 134 46 110 142 182 103 -11 208 -182 -25 68
6992 68 108 -111 -3 231 -175 -163 -17 297 116 152 122 246 135 56 -87 182 126 112 41 -139 -25 27 8 8
7016 8 123 -90 48 265 115 34 71 -79 5 -91 -273 -43 116 -35 200 94 3 -110 159 19 -197 -10
7038a0K13m2j5L31l31j15k76r8N57k31p4K26j25o8J10j5K66k94k0L8J64O2M7l21
7062b1J50q1N1k55L22l16K50J04j27j46J14Q8K26o52L33k1n2K28l22KJ80k78K43
7085B0pj73J3K45N8k55J53R4m8j77Q3l09M72k44K77m7m7j06m2J11j85K78l02J49
7109A1r8L51j94J2L8k00j78N2O1P9j81L55j67Jk16M05K12k93J74K8n31J05K53
7132G9m69N04j5j93n0M74l7m96J95K31m33K08P8j34R6J4K3k30Q2J43j0l8j92J94
7156B4o1p9L76l16J78Q4k22K4k66L01O6n7M6k52K28q7J22K06l93O5j95l5K39N1
7180D7K53k06l21J03L24l62l2j11M19m78L29J03j39O5j23L86l79m5K42j02O9o5
7202b3m1Q8r8P1n0j02K82m3K0K04l01l17N82l13R1p5M5J8J55K50m45o9P5J3k47
$$ plain form
7038 -10 203 161 146 477 146 31 -245 -343 214 -17 -91 135 10 -58 52 37 303 9 -11 27 191 253 300 -21
7062 -21 129 48 99 -156 166 -150 100 204 77 -69 45 133 359 -293 40 19 -33 195 -127 -125 55 -223 20
7085 20 13 -160 -147 98 156 -99 54 148 100 -77 6 -303 169 -75 202 155 108 2 -40 71 -114 164 -138 11
7109 11 -87 264 70 82 120 -80 -258 -206 -145 -66 -247 108 -59 -58 -274 131 343 50 224 252 -279 -174 79
7132 79 -390 114 99 -94 -144 330 293 -203 -8 223 -210 -2 76 -58 38 52 75 -155 -73 70 60 22 -170 24
7156 24 -37 -116 260 -56 122 206 -16 8 -258 43 109 52 98 -154 74 -13 109 315 -78 -13 -208 -243 -4 47
7180 47 300 94 -227 -124 200 -162 -194 -305 114 -364 -35 68 -71 -6 -129 257 -122 -167 75 -27 42 -23
7202 -23 -64 24 -74 -3 -53 -155 127 84 104 308 7 -310 272 -41 50 -25 20 38 193 443 -2 -71 4 17 -230
7227b30L19r2l05L55j6K5l11M81j89j58J73j08L1J52Kk34O0o2N1J64j35J8p4J13
7251C0n2J4M13k04mj30j31o8K49P1j0j41J72k75K28j35j28l6L3K10q0k39L6J31
7275d6n9R6p4K47k7k13Q8M8Jo5p8M9M1Qj68L4J85k6J4n7k50J85Q3m6l70L26KK24
7303A52n9K09l8l28O5J23j74Q7j12K90l84K78j21j6K7j2j26K53J21m22L43m19
7325b63K84j61L51L0Kl57k3O7K06M6l52P2J12j50o8J67m6J9N1qP3Q2m2m1p3j45
7351a67p7M57l70K52j48k8J36j19k11L26k25O1j8L04K1L5k37J36m11L61j11p5
7373a08q3J83R0j6k75K43J91k76K70N0l59J06K4j06r9K87J5l23L63k86P9o0M10
7396C20m29L93k01l67L61J74j33l2J06j27r6J14J31l48J13J05Q4N9k17j36J8L03
$$ plain form
7227 -230 89 -3 -308 47 31 56 -255 226 37 -121 52 -56 -25 127 129 -105 -45 -107 -56 108 -27 -9 -83 30
7251 30 -22 -8 405 201 197 67 -64 -132 117 188 178 37 209 -66 162 27 -101 -137 -104 106 26 -213 -177 -46
7275 -46 -105 -9 -83 164 137 -76 12 60 61 -4 -82 -33 8 16 -152 -118 67 41 55 -2 -252 -67 16 -30 -400 -74 -72 152
7303 152 93 302 264 -64 1 124 -50 37 -75 215 -169 109 -12 -28 -1 -13 -139 114 235 -187 156 -263
7325 -263 21 -140 211 241 243 -114 -137 -70 136 182 -170 -98 14 -136 -204 -37 -83 -64 -13 -21 52 134 92 51 -22 -167
7351 -167 -244 213 -157 95 -53 -81 55 -64 -275 51 -174 -113 -131 173 194 229 -8 128 -283 78 -33 -108
7373 -108 -191 -8 82 66 -209 34 225 -51 219 269 -90 16 40 -66 -165 122 137 -186 177 -109 -30 -90 320
7396 320 -109 284 83 -284 77 251 118 86 192 65 -31 83 214 -134 -21 84 168 227 10 -126 -108 195
7418A95l80l7K75K3l4k7j7j08M4L75k27r6j62J15L0L4j69q9N69l93K01k06M6j95
7442b33L09J48o25M62L4m95M42o4l4l8J59j03J69J93o79M94p0J24m01L79k13J17
7464G5k4jK42k66n2k23L32j81J35N1k40Q8K34k80Q3Q5k04J01j6J5j95J35M2J93
7488A29j19O9Q7l56J01j23P3K74k11L0J85j29J94q7l15L94m53J56k9L74m24M1
7510a39o4J51o2Q3j00L5p4P0J47J76l04J57p4l41M96l35L17K8k10L71o13K33j
7533e3k94M06k1rp3K08N7j03m0K0r5n9J55j22J21M3k31N7J77o4k34L21N8l86K1
7558a40K10k22L64j55kJ31l73L18k03L29k91k3n4N2L52l75r0L79k97o4J71r9M54
7581C72l37q7m2M7J19J06o42M86j10p2K35j1Q7k00K8j3j03J77n8j66J78r3M65
$$ plain form
7418 195 -185 -222 53 76 42 15 -2 -110 -66 309 82 -14 -176 -61 -31 3 -166 -255 314 -79 122 -84 -38 -233
7442 -233 76 224 -401 61 95 -400 42 -22 -56 -94 65 -38 131 324 -355 139 69 193 -208 171 -42 75
7464 75 51 50 292 26 -26 -249 83 -98 37 88 -152 -64 170 -110 -27 58 -146 -45 -61 -46 -241 -106 -64 129
7488 129 10 79 166 -190 -89 -212 -139 135 -76 -46 139 10 204 117 -198 196 -257 -101 -130 244 -180 -139
7510 -139 -203 -52 -114 -31 -131 -96 -170 -100 47 223 -81 76 2 -339 157 -178 139 167 -43 328 -285 -52 -53
7533 -53 -347 59 38 29 -44 164 221 118 78 98 3 -56 99 -23 98 141 -90 -33 144 80 -154 167 225 -161 -140
7558 -140 70 -152 212 57 55 186 -187 131 -72 257 -34 -57 -111 -59 293 -82 -172 207 -90 -154 17 -82 372
7581 372 35 -52 -94 -47 72 178 -464 22 -88 -160 75 64 151 -49 -21 -34 -137 40 -18 -184 -6 -99 366
7604C66m88M2k32N16k40J57m28K88j75L71m82J41K47m6k05n3K50k24K21j53K18
7625I1n5j84O2q1Q5L83j68j59J42j07j04j7M60k41n6K42m76J89j04p4O8L0J37
7648F3j17K97l26J66k43Q2l1R1o1K3j12M1L48k88P9K65j54q5Q2j77L31k43r7P8
7672A2j46r7O1L59q0k80O3Q9l6j76J86L23l68p9J60j70J84o3J10j15j11M68l09
7695a5k42K34j88K13j81J45j1K15j70O9j66M5L27m10J17j93K45j94J61mJ8L5j81
7718a31rJ89l2M4j0J04n99O69q6j49J49l40M51l65m5K00j82N0R8q6j26M78l54
7741h2K5j55NK71p7k9j11K10k02j63K09J81m4m8L9K90m86J21R9Q4k48P1J13m22
7765c49M0J66K87k46J05q5J99J05N7j08j97j36K57M4k72J72qk77L97j8K1K81l79
$$ plain form
7604 366 -122 -80 -312 204 -36 121 -307 -19 -194 177 -305 -164 83 37 -168 -221 29 -195 26 -127 91
7625 91 36 -148 -86 -167 -82 301 133 -26 116 9 -95 -112 348 107 51 293 -183 6 -98 -172 -104 -74 63
7648 63 -54 243 -83 83 -160 -78 -109 -18 -79 -56 -168 -127 221 -67 12 277 123 38 120 -57 274 31 -66 12
7672 12 -134 -231 -170 189 109 -171 -108 -19 -55 -231 -45 278 -90 -169 -9 -179 5 -58 52 -63 -174 294 -15
7695 -15 -257 -23 -211 2 -179 -34 -45 170 0 69 -97 -52 275 -135 -18 -211 34 -160 1 -3 15 50 -131
7718 -131 -140 49 17 61 51 155 -444 225 139 -10 139 -201 250 -115 -160 40 -142 -92 6 -80 -206 272 -82
7741 -82 -57 -212 -207 64 -13 -42 -153 57 -145 -308 -99 82 38 -10 29 319 -167 -46 53 137 -111 -40 73 -349
7765 -349 -309 -143 144 -102 3 -82 117 222 279 171 -26 -162 95 139 -133 39 31 -246 151 133 154 435 56
7788E6j61L19J42k77p3o4K84j64j15k0p3P4R2LPL4j16k9K51k73R6N4L06j85p7
7813I1lk64N9j73K95k45J17L40k48j18J22K27p5p3K13m23j2j3J90j14N6K45l6
7836A58J47j88k1p4K8Q3j96j78J68J67j58nj19K07J40k55K3p4P7q4J19j58K18
7859B5j0K64m92j32N51k86p3J03J64k52K56j30p3P5LJ64j52j60K52j84J82J38
7881B33Mj52pn9NJ70r2l05J40K94m00J57J29j54rq5J87k01J41J1R2r3J88k14L24
7906C04j88j57j29N67m71NL02k69L01n23L68j60J04K05o6l23J72O8O2k77p8J14
7928f9l6m3K01K74m03N4J95l04Q0j22J33Q6l7q7n7K9Q8M9l18K74o6L9r4L69k14
7953B1K35l46N1J20Lk72J69j84K17K18l95J64j32K17J12k26k67K38p8j3p8K47
$$ plain form
7788 56 -105 214 356 79 6 -58 226 62 -53 -73 -146 -72 20 23 30 64 -52 -81 170 -103 -7 47 353 168 91
7813 91 88 -176 -117 -290 5 -240 -123 217 -31 -149 -27 200 125 52 265 -158 -170 -183 7 -107 -51 194 158
7836 158 305 117 96 22 50 133 -63 -241 -73 94 -64 -69 -188 19 159 -96 -73 -147 -70 -154 -35 -193 25
7859 25 15 279 -213 -345 206 -80 -153 -50 114 -138 118 -12 -85 -10 -7 157 5 -155 97 -87 95 233
7881 233 237 85 78 19 24 194 102 -203 -63 231 -169 -12 117 -37 -46 -131 56 -145 -4 7 99 6 194 -20 304
7906 304 116 -41 -170 397 -74 -69 233 -36 265 -258 110 -50 54 259 193 -130 42 110 172 -105 -183 -69
7928 -69 -105 -148 53 327 -76 -22 173 -131 -51 -173 -40 46 9 -78 -135 -106 -18 31 -287 -13 -79 -40 -134 235 21
7953 21 256 -90 -39 81 84 -188 -19 -203 14 232 -163 1 -131 86 198 -28 -295 -57 -135 -148 -226 21
7975B1k31j75M67R4k89M11k74k03p6l02K98L36q0m6m8J13J92r9j17K22m80K98
7997C2k01m1K36n8M2J98k19j19O0K05j50k65J96Q3rJ26j5j37J88m55K57n6J90
8020H8j8l28L21l3r7J62j56j45J42P3Qp4q1J28j19J53q5K35k48J70k39K51jj40
8044c3J62m0M5j03o1J37j0j92K25o5k78m9K8J07M31m41l2L25k71J54N9q9k10K29
8068B8K6j0r4J83k03K9j50J19P6j81mK34J74j84m2j99L09j89q8K55J85m05k4L06
8092A51j90K42k41K97m96j5L05j29J51k47N2k1K23j08n2J17O1J6j40rK2J20p5
8115C4n5J02k37J35j0NK09q4l4l68K62J50k73K0k5j21M77l41m8J25K55l73L77
8138A82j45j06l0J22L3j13J97j99n2j45J95lm9K28j12K2n7L13l0m54N5K60r0p7
$$ plain form
7975 21 -210 -385 82 176 -113 298 24 -179 -255 -557 -259 77 -3 -49 -97 16 208 109 -8 214 -266 32
7997 32 -169 -210 26 -32 10 208 -11 -130 -70 135 -15 -280 -84 -1 -10 116 101 -36 152 -303 -46 -102 88
8020 88 70 -258 63 30 -67 95 -61 -206 -64 9 17 -57 -138 -10 -129 24 -61 174 -74 96 -143 108 107 -33
8044 -33 129 89 134 31 -30 107 97 -95 130 65 -213 -262 -234 -127 304 -137 -169 156 -115 39 98 9 -201 28
8068 28 54 44 -50 133 -70 -41 -191 -72 4 -177 -181 53 227 43 1 -198 111 -78 -166 89 274 -131 -155 151
8092 151 -39 203 -38 259 -237 -252 53 -76 75 -172 -120 -141 82 -26 -78 39 100 116 -24 -33 -11 109 34
8115 34 -21 81 -156 -21 -31 -26 183 99 65 -303 -41 109 -164 -144 -169 -290 187 -154 -202 -77 178 -195 182
8138 182 37 -69 -99 23 56 -57 140 -59 -111 -256 -61 -64 -113 115 3 25 -32 281 251 -203 -148 112 22 -55
8162e5q2jJ20j48J62j57K6K3J82P8ml05J41m5L90q3l59P3R7j00K06q5M3j67ON3
8188Ij4K1J02
$$ plain form
8162 -55 -137 -138 -18 -166 -4 -161 -135 -112 70 148 144 -161 -20 -65 325 242 -117 -44 53 -47 159 74 117 -50 -44 9
8188 9 -5 16 118
8191A18
$$ Imaginary data points
##PAGE= N=2
##DATA TABLE= (X++(I..I)), XYDATA
0@%%%%%%%%JrJ6j6K4l2M0m8N6p2Q8j05J29j57J86k21K57k98L50m06M67n38O16
31C28p03Q02r11J028j159J305j465J641j831K038k267K520k793L089l414L771
47A979m161M587n053N564o132O761p455Q229r099J0086j1213J2516j4040J5848
61H417j8045K0773k4262K8918l5474M5452o2656J00398l31179J99272M32585n12214
73a48015J74239L48094l45266k80561L47976r9115k31249L15050J23933l77012
83a71926J24562K68209k45325l0205L13751l17752l59201L86098J58591l79398
93b52596K39321M71363l10626l09681K43991j24822k94449L46292K33332l39934
103i7809O5588L23672k89066k35465L27339j4420l12535J93745J47569l19856
$$ plain form
0 0 0 0 0 0 0 0 0 0 1 -8 8 -8 16 -16 24 -24 32 -40 48 -57 72 -85 101 -120 137 -161 189 -217 250 -288 328
31 328 -375 427 -484 544 -615 690 -775 866 -965 1073 -1194 1326 -1467 1622 -1792 1979
47 1979 -2182 2405 -2648 2916 -3216 3545 -3910 4319 -4780 5306 -5907 6609 -7431 8417
61 8417 -9628 11145 -13117 15801 -19673 25779 -36877 63521 -267658 -68386 364199 -148015
73 -148015 26224 374318 29052 -251509 96467 -2648 -233897 81153 205086 -171926
83 -171926 -47364 220845 -24480 -54685 259066 -58686 -417887 -31789 126802 -252596
93 -252596 -13275 458088 147462 -162219 81772 -43050 -337499 8793 242125 -97809
103 -97809 -32221 291451 2385 -233080 94259 79839 -232696 -38951 108618 -211238
113b11238R5569M19133j52182k23700K24066q8931l51627J75184K07175k11127
123a17678J28748L44387k79628l08082K72900K2835l30211J74020K74962k49686
133f7433n2412L16594j02902k17730K42586N4667l29064K3905J81976j62977K4547
144h8243L12413r0660k23658J68047j3971l29165R5645K85962j35779n1961K64334
155A92964p4702k42703J63841R5861k51974K0390K03394j55942r9093K45232J3983
166A11251j71563J31662N0268k75011j5353K06589q7907n2396K53820J7443k13778
177d4975P0278P3903k10676n744K02095q5181j10845J78741K6048j68852Q5344
188A0136J07282j79376n5055J47005o9768q9569J90100Q0309j40118M0357P7109
$$ plain form
113 -211238 -115669 303464 151282 -72418 151648 62717 -288910 -113726 93449 -117678
123 -117678 11070 355457 75829 -232253 40647 63482 -266729 -92709 182253 -67433
133 -67433 -119845 196749 93847 -123883 118703 173370 -155694 -131789 50187 -112790 -88243
144 -88243 224170 133510 -90148 77899 63928 -265237 -169592 116370 -19409 -71370 192964
155 192964 118262 -124441 39400 135261 -116713 -96323 107071 -48871 -147964 97268 111251
166 111251 -60312 71350 121618 -153393 -168746 37843 -50064 -102460 151360 168803 -44975
177 -44975 25303 99206 -111470 -117214 84881 -300 -111145 67596 93644 -75208 10136
188 10136 117418 -61958 -117013 29992 -39776 -129345 60755 141064 946 41303 118412
199A18412j70301p1152J39713k5292q2409J35668N4630j36508K4022R4318j15458
210c4357o0712J19146k8161r9698J13129Q5268r3461K4131R3496j05914r7672
221h4805P7730q749q2484Q9793Q8519p6827n249P3187p5660p6211P3071N955p0494
234g2224O3774P5136n5379M410P3935n7712p7948M4310j0108p9348N3063Q3894
246D5803m2346n451P4411l9315q7750K8693K2897n5626K0633P8450n526j4509
258B0364L9834j5649n6344n60r135m3105K3755M9155j1716J0151N4845k1449o4558
271b4412J1039Q728n2682N986P1242J0745j4421L7889P095n5274k6629J526k6700
284d5868r605L6166K4344R129K4480K721l0030j7403j2236k6438L625L4702J5962
$$ plain form
199 118412 -51889 -123041 16672 -8620 -91029 44639 99269 -37239 -13217 81101 -34357
210 -34357 -95069 24077 -4084 -103782 9347 94615 1154 25285 118781 12867 -84805
221 -84805 -7075 -15824 -98308 -8515 80004 3177 -2072 71115 -4545 -80756 -7685 -1730 -72224
234 -72224 -8450 66686 11307 15717 89652 31940 -46008 -1698 -11806 -91154 -38091 45803
246 45803 3457 -1994 72417 33102 -54648 -25955 -3058 -58684 -38051 40399 34873 20364
258 20364 60198 44549 -11795 -12355 -21490 -64595 -40840 8315 -3401 6750 61595 40146 -24412
271 -24412 -13373 -4645 -57327 -51341 19901 30646 16225 54114 61209 5935 -20694 -19168 -45868
284 -45868 -55473 -19307 5037 14166 38646 41367 11337 -6066 -18302 -44740 -41115 -6413 9549
297I549J3082L1798Q33l8457k1619q680l2644j5334L3288K9696O775K0426J9526
310D8239j7772l3489j7837q715p462P732K7857L0130J6731j583j1965j9369k9092
323a6595k8467o193J5736K0132K1738K2612J3328o335k4748k6324j2416n854j251
336c4637K0773L6891J7628k370j548j2872l7094k7678j677K650J1757L2338K3470
349B7631N331M847j2071l4955j8632L179q212M442M2234K6797j0348L023K458
362C5724m0507l5494M708o53k230L4810L2582j649M686L938l5804k8638J0312
375a8215o780j2139L9194L5691j4849K242J9086l6661m5379Q968Q19k0686L2535
388a6174M6510o996q6K1704l1909m4687J4214L310k6659L1646M7338j9597q105
$$ plain form
297 9549 22631 54429 55262 16805 -4814 -13494 -46138 -61472 -28184 1512 8287 28713 48239
310 48239 30467 -3022 -20859 -29574 -37036 -29304 -1447 28683 45414 43831 31866 12497 -16595
323 -16595 -45062 -51255 -35519 -15387 6351 28963 42291 35956 11208 -15116 -27532 -33386 -34637
336 -34637 -13864 23027 40655 38285 36737 23865 -13229 -40907 -42584 -39934 -28177 4161 27631
349 27631 32962 37809 25738 -9217 -27849 -24670 -32882 -28440 13794 40591 30243 33266 35724
362 35724 -4783 -40277 -35569 -36222 -38452 -3642 28940 27291 31977 35915 111 -28527 -18215
375 -18215 -24995 -37134 2060 37751 22902 25144 44230 7569 -37810 -28842 -28023 -48709 -16174
388 -16174 30336 23340 23254 44958 13049 -31638 -17424 -14114 -40773 -9127 38211 18614 10509
401A0509L3835k5326n4441J4721R172m0384J9982N8643q766p953M1763j9353o1457
414b9055R646J3899l9266J8985O4183j4089k2655M0178j5577o4347J6305K6577
426D784m7391L278O4113j1520k3643N3967M358o6861O050K3683n5235n243P5538
439B5878J45k9803M7516R56p8710K696L8409m6237n867P5796p759m6307N1397
452B8110K1005o9410R615M5954o2682l3709P5704L406m5963O0812L7339q1921
464a1740j9544M2736m9389k7453Q3679J6356m9999M3614K5447p9309j355O3447
476C6490m8816m1039P5718j68p2438N5225O4997p1668k1566O0834n1901o7699
488h2031P1092L6861m6692M5498N1732p8528l2726N6948l7312m6318Q1111K3502
$$ plain form
401 10509 44344 19018 -35423 -20702 -11530 -51914 -31932 26711 17945 9992 51755 32402 -29055
414 -29055 -19409 -5510 -44776 -25791 38392 24303 1648 41826 26249 -38098 -21793 4784
426 4784 -42607 -39329 24784 13264 -10379 43588 47946 -18915 -12865 10818 -44417 -49660 25878
439 25878 26023 -3780 43736 44692 -34018 -31322 7087 -39150 -45017 30779 23020 -23287 28110
452 28110 49115 -20295 -10680 35274 -27408 -61117 14587 17993 -27970 32842 70181 -11740
464 -11740 -31284 11452 -37937 -65390 18289 34645 -15354 28260 53707 -25602 -26957 36490
476 36490 -12326 -53365 22353 22185 -50253 4972 69969 -1699 -23265 37569 -14332 -82031
488 -82031 -10939 25922 -20770 24728 76460 -2068 -34794 22154 -15158 -61476 19635 43137
500D3137p9686K9152O2193o7046k1056Q1463l3450p9678N4054K7657o5874M5110
512d024Q6546o0030m2741N8497m4328q1754P6487N7670p0630J8489P6392o6828
524C746n8039P3031Q67o6223M6267L2441p5436J5581Q1562m0671k8856P4315l2100
537B6485j01017M6912N0402p0071K7394J08807n2072q4126N8734P748q2643L8655
549b4792O8938n4653j1297O5893l8640m4274P6478P503q4728K2689L8993p5377
561e3267O039J06989k2600o1808O5055P42j11350J5974Q0688l7684p702P9123
573F0199l0708p0412N5887J9289p9573K5220O6532o5815l4507P9789n498m9362
585b8959O6975K2809r8745p363N9957m4058j6627R1244N491o1674L3113Q130q6078
$$ plain form
500 43137 -36549 -7397 54796 -12250 -33306 48157 14707 -64971 -10917 16740 -49134 -4024
512 -4024 82522 22492 -20249 38248 -6080 -87834 -11347 46323 -24307 -5818 70574 3746
524 3746 -54293 18738 19605 -46618 -351 32090 -43346 -27765 53797 13126 -15730 58585 26485
537 26485 -74532 -27620 22782 -47289 -19895 88912 36840 -47286 11448 19196 -63447 -24792
549 -24792 44146 -10507 -21804 44089 5449 -38825 37653 45156 -39572 -16883 22110 -53267
561 -53267 -47228 59761 37161 -24647 40408 41150 -70200 -54226 26462 -11222 -18924 60199
573 60199 29491 -40921 14966 34255 -45318 -20098 46434 -19381 -53888 25901 20403 -28959
585 -28959 38016 60825 -37920 -45283 14674 -29384 -46011 45233 50724 -10950 22163 30293 -55785
598e5785J4389Q0214m1984l7649P1084j016o7095M3227M2935o5155o777N3419
610B9807n0493m2846P7436K7434m7456L2460K4545p8995j7750N6834k9557k6540
622d5121P9120J5945p0890J6946L8498n5514r746O0567k9570m6915N6025J9312
634B8657n2595L0335N0074n4443l2013L8242k7259l6938O4998L3997m8462J3413
646H006L5750n6025l1014N0098n484l3817M5108K0503n1847J1758M6902l6192
658C746k7969L9058j4340m6253L5253L3212l2000J5511M3065m0691m0527L0774
670a161l511l3548L6612L4478l3523K21L3345l2274k9507L6501L95l9516K1819
683i669K8363k8980M280M2096k0182l2985K2125l138l8989J9603L7499j7361l29
$$ plain form
598 -55785 -41396 38818 -3166 -40815 30269 29253 -37842 5385 48320 -16835 -23612 29807
610 29807 -20686 -63532 13904 41338 -6118 26342 50887 -28108 -45858 10976 -18581 -45121
622 -45121 33999 49944 -20946 -4000 34498 -21016 -30762 29805 235 -46680 9345 28657
634 28657 -23938 6397 56471 2028 -29985 8257 -19002 -55940 9058 43055 -5407 8006
646 8006 43756 -12269 -43283 6815 1331 -32486 12622 33125 -18722 -6964 39938 3746
658 3746 -24223 14835 495 -45758 -10505 22707 -9293 6218 49283 8592 -31935 -1161
670 -1161 -4672 -38220 -1608 32870 -653 -432 32913 639 -28868 7633 8028 -31488 -9669
683 -9669 18694 -10286 -6006 36090 15908 -17077 5048 1910 -37079 -17476 20023 2662 2333
696B333L0540k0517l3892J8598M277k8073J5621K9038j9141n022L0115j0562k5835
709a2520J7320K357l2338O507K8650j1739k575L0787n614k9997O602M367k5867
722b4060M466K8676n297n893K1146k789k3582N983N495k0607J135K0077n711m273
736e234K2536P86k0644L730L701k2446k749K1149n12l619J8667L739j9579j264
750a739M682j5366m849J6486K159m136J3406N305j3386j628K127j3579n658J1460
764d716K535j033J3334N890j1001k744J227j2749o890J1110M214k603J0998P872
778A5444q509n881J239p964q193M936O017O93P458O712l260l792k037q707o247
793a2091M030L353J360P734P792l822m649l30o707p624J277M842K223N348O546
$$ plain form
696 2333 32873 12356 -21536 -2938 1339 -26734 -11113 17925 -1216 -6238 23877 13315 -12520
709 -12520 4800 7157 -25181 -18674 9976 -1763 -4338 26449 20835 -9162 -2560 1807 -24060
722 -24060 -19594 9082 3785 -2108 19038 16249 -7333 -1350 4145 -16462 -15327 4750 -961 -5234
736 -5234 17302 18088 -2556 1174 4875 -17571 -20320 829 317 -3302 15365 19104 -475 -1739
750 -1739 2943 -12423 -17272 -786 1373 -2763 10643 15948 2562 934 3061 -10518 -16176 -4716
764 -4716 -2181 -3214 10120 16010 5009 2265 3492 -9257 -16147 -5037 -823 -3426 7572 15444
778 15444 6935 1054 2293 -5671 -13864 -8928 -2911 -2218 5240 11952 8692 4900 2863 -5844 -12091
793 -12091 -8061 -4708 -3348 4386 12178 8356 3707 3377 -3330 -10954 -9677 -4835 -2612 2736 9282
808I282M46l078l481n943o018k21K382K696N903O499J071l061k989m709o097k591
824i909J909M405M965M807K688k83m010n762m853k167J05L058N347N239K733j72
840H100l276m662m806l417r80M076N529L429L417K297l515o243l412k750k784
855h997K447O437L160K896L490k676o296l135k962l848K308O406L182K208M920
870I540j966o990k388j650n397N20P242K600J365N743L95p416l034j345o201n82
886i564P855L390L15O705J171q681k609M26o914j886Q090K902j319P054L362q180
902B117k774J805p990m844Q497L948j683P708N309q905m515K329p429n469R401
917b495M733l884O530O523r185m177N461p004q358Q806M097n803P360J0380p657
$$ plain form
808 9282 9728 6650 3169 -2774 -8792 -9013 -6631 -3935 1968 8467 9538 6477 3488 -1221 -7318 -9909
824 -9909 -8000 -3595 1370 6177 8865 8582 4572 -1190 -6043 -8210 -8105 -5047 300 5539 8272 8100
840 8100 4824 162 -4644 -8061 -9041 -4965 564 3993 7410 9707 6192 -51 -3463 -6213 -8997
855 -8997 -6550 -113 3047 5943 9433 6757 461 -2674 -5636 -9484 -7176 -770 2412 4620 9540
870 9540 7574 584 -1804 -3454 -8851 -8331 -1089 1511 2876 8619 9014 1598 -1436 -2781 -8982 -9564
886 -9564 -1709 1681 1996 8701 9872 1191 -1418 -992 -7906 -9792 -1702 1200 -119 6935 10297 2117
902 2117 -657 1148 -6842 -11686 -3189 759 -924 6784 12093 3188 -1327 1002 -6427 -11896 -2495
917 -2495 2238 -1646 4884 11407 2222 -1955 3506 -3498 -11856 -3050 1047 -4756 2604 12984 5327
932E327n704M899p910j0364Q491O835m929P012R854r571p407O595n045j0003Q942
947b978O459q454L875J2352p022o171R391n040j4789N712P375p803N910J5290
961A4107o294r941P147m574j5062P920J1474q407K168J3625p802r810J0672n36
975D687j4656N103Q960j1729J35J7620k362r144R743k201j8780K447J1992p763
989e948J971J7953m445j4021P533Q66j5597N082J3645j0519m234J5726k371j1311
1003e670J1559N351j7717j274R716j0151k821K0348K079j2847P582J817j9411
1016a1439k84J5156o448l423J7165k179j5926Q398Q337j5325l39J3368j0826r258
1030a3023J6482M060j1063J0193P626j9129o519J1855o365n299J9152M740j5007
$$ plain form
932 5327 -377 4522 -3388 -13752 -5261 1574 -3355 3657 13511 3940 -3467 3128 -1917 -11920 -2978
947 -2978 3481 -4973 -1098 11254 4232 -1939 7452 2412 -12377 -6665 710 -7093 -1183 14107
961 14107 7813 -2128 5019 445 -14617 -6697 4777 -3630 -1462 12163 4361 -5449 5223 4687
975 4687 -9969 -4866 4094 -7635 -7500 10120 7758 -1386 8357 6156 -12624 -10177 1815 -5948
989 -5948 -3977 13976 9531 -4490 3043 3909 -11688 -6606 7039 -3480 -7714 8012 5641 -5670
1003 -5670 5889 11240 -6477 -7751 1965 -8186 -11007 9341 11420 -1427 6155 7972 -11439
1016 -11439 -11723 3433 -3015 -6438 10727 8548 -7378 1020 9357 -5968 -6307 7061 -3765 -13023
1030 -13023 3459 7519 -3544 6649 14275 -4854 -11373 482 -5883 -11182 7970 12710 -2297
1043b297M425O258j6512k221J6103m684j0273J3121K741j3857P693J2303j3015
1056b15o494J1256q415j1155J5461R137j0496N813Q300j6635q792J2846k112q167
1070i668J4301O283j4704J627J0761j0697n293J3810m602j3285R568P343j0667
1083e223O528J3435j1589j0710Q618l877j0778J2616J1295j0286J216Q887j1651
1096a519q741J2055R18j0936Q384O669j1461J102J2950o337p578Q974k602j3839
1110a1961O645J0199o400K538J1387q429j1762P485L9r813Q243J0131q466k174
1124b338R560n683p594R063J223j1620L166P565o867M28J2236k741r320N018j006
1139A090j1516M661J0481m390r51R234m708r834N488K806q638L466P792o106l081
$$ plain form
1043 -2297 2128 8386 -8126 -10347 5756 1072 -9201 3920 6661 -7196 497 12800 -215
1056 -215 -6709 4547 -3868 -15023 438 9575 -921 4892 13192 -3443 -12235 611 -1501 -9668
1070 -9668 4633 10916 -3788 -2161 8600 -2097 -7390 6420 1818 -11467 -1899 5444 -5223
1083 -5223 1305 14740 3151 -7559 1059 -2818 -13596 -980 10315 29 1245 10132 -1519
1096 -1519 -10260 1795 2713 -8223 161 6830 -4631 -3529 9421 3084 -4494 4480 1878 -11961
1110 -11961 -5316 4883 -1517 1021 12408 3979 -7783 -298 -259 -10072 -1829 8302 -164 -2338
1124 -2338 7222 1539 -6055 3008 4231 -7389 -4223 3342 -3525 -3097 9139 6398 -2922 2096 1090
1139 1090 -10426 -5765 4716 326 -625 8609 3901 -5933 -445 2361 -6277 -2811 4981 -1125 -4206
1154d206R420j019o376M632J250j0184O70P051k960k92R767j393q629K988O26
1169A345q197J807Q560l012k832O933m89p132L274L127o717j000N442k664j838
1184c393P109J463n005K068M65p705k93N736j781p71P185k55o006J413J832n958
1200c896o23N993j606k698N100K292m222P77J833m962k028K868m11q46M723K056
1216D350l461N00L93m732j065L894j012j057M444J386l449O18J629l645k224K778
1232f53k78j794L375K775k052l77J024k711k884J591M63o2K508J885j349L02M1
1249A804k747j661J580l89p52K872J667j579J33J629k354k879Q94Q93r74J667
1265a96K425q9q53L21j923j334k50K73L6J798J307m92M84O13j908j888K65M44
$$ plain form
1154 -4206 5214 4195 -2181 2451 3701 -6483 -5813 1238 -1722 -2014 7753 6360 -2269 719 1345
1169 1345 -6852 -5045 3515 503 -2329 4604 4115 -3017 257 3384 -3333 -4333 1109 -1555 -3393
1184 -3393 3716 5179 174 2242 2707 -4998 -5291 445 -1336 -2107 5078 4823 -1183 230 2062 -3896
1200 -3896 -4519 1474 -132 -2830 2270 4562 340 1117 2950 -2012 -4040 -1172 -1583 -2429 2294 4350
1216 4350 889 1389 1782 -2950 -4015 -121 -1133 -2190 2254 3640 191 809 2438 -1207 -3431 -653
1232 -653 -931 -2725 650 3425 1373 996 2020 -691 -3575 -1984 -1521 -1583 925 2810 1461 1763 1804
1249 1804 -943 -2604 -1024 -1413 -2165 707 2374 795 928 2557 203 -2676 -1782 -889 -1863 -196
1265 -196 2229 2140 1287 1608 -315 -1649 -1899 -1626 -1590 208 1515 1023 1507 2120 212 -1676 -1411 -967
1283i67m44P05K142Q4J65q3j207j392m71j0k19R01J699K69R0J59n56j662n14P1
1303a240j92R86J422P19j21j04p61j048n78o57R2R15Q98N70M93O7k63j438m66
1322g06l87l09O63J124O70K96J55o61r81o74o10o7O21N82P93O78N20j154m66n78
1342d91o94j89N89P90N97M62L80n37o48p45o42l35K98P26N05R58L41n09m21o72
1362b37r05K4M73K43M04P21P51m84o86l74n38q09L14M31M71Q69L32J97o23l21
1382B53p19r34L92L40M61P09J113p78m09L1j194o80M87M53j47R26J258o44m32
1401D86J8m00j303K7J020m17O33J144l03l44m8r81p20L09N54n38Q65J197o83k47
1421B69Q47p34j245K23O50q45N9J908k23p98Q51l92k216J38J247l78K58J726j64
$$ plain form
1283 -967 -1411 -706 1436 1520 1685 1602 395 -997 -1468 -1478 -1697 -796 903 1172 1262 1421 865 -797 -1311 -1240
1303 -1240 -1432 -446 976 1695 1574 1470 709 -339 -917 -1574 -1482 -567 331 901 1394 1461 1198 -240 -706
1322 -706 -1093 -1402 -739 385 1055 1351 1506 845 -136 -810 -1420 -1487 -866 -284 509 1187 1707 553 87 -491
1342 -491 -1185 -1374 -785 5 602 1064 1444 907 259 -486 -1128 -1463 -1165 -439 66 1024 1365 856 435 -237
1362 -237 -1142 -1118 -645 -402 2 723 1474 990 304 -70 -608 -1417 -1103 -672 -201 668 1000 1197 574 253
1382 253 -466 -1400 -1008 -668 -207 502 1615 837 428 459 -735 -1415 -928 -475 -622 304 1562 918 486
1401 486 504 104 -1199 -1172 -152 -569 64 1208 905 561 513 -468 -1188 -879 -325 -863 2 1199 516 269
1421 269 1116 382 -863 -640 10 -835 -776 1132 909 111 962 570 -1646 -1508 -261 -639 -381 1345 1181
1440A181j184N20j3j413L60O98j225M71J626o66l21J312k82k282k2J048j147j59
1458a498K979L38j836Q56J66k077j90J551q89l30J822n23p48J294M74k163J61
1475f13J240k311O7K484L85j427J689L78l003j95J152r12k23K638R3j978J094
1492E58M92k493Q28J687j511j171K262K85j827J862J444k416r83R46j622o25L136
1509H52L85j136R82L65k935%K164j421l82K370k36j992J054J775k023l25J660
1526A157j933j235K014P63j296J758J220k891j056J490j230j109L480Q30k237
1541b75Q46J002k520q9K306q18j950J719L46k106J501K361j902j126J837j924
1557g92k223K991J520j600J319J471l218j565K336m29j378K236R92k596M18K065
$$ plain form
1440 1181 -3 517 504 -909 -549 149 -1076 -605 1021 355 34 1346 1064 -1218 -1240 -192 -1339 -1498
1458 -1498 1481 1819 -17 839 1005 -1072 -1262 289 -600 -930 892 369 -379 915 1389 -774 -613
1475 -613 627 -1684 -1617 867 1252 -175 1514 1892 -1111 -1306 -154 -1066 -1289 1349 1442 -536 558
1492 558 1050 -1443 -615 1072 -439 -1610 652 937 -890 972 2416 0 -983 -37 -1659 -2284 852
1509 852 1237 101 1083 1448 -1487 -1487 677 -744 -1126 1244 1008 -984 70 1845 -178 -503 1157
1526 1157 -776 -2011 3 766 -530 1228 2448 -443 -1499 -9 -1239 -2348 1132 1962 -275
1541 -275 571 1573 -947 -1036 1270 452 -1498 221 567 -1539 -38 2323 421 -705 1132 -792
1557 -792 -3015 -24 1496 -104 1215 2686 -532 -2097 239 -190 -1568 668 1660 -936 -518 1547
1573A547j691p28K106q61k584J751Q22j357J321K512k445j479J476j163j602K161
1589b14K129k411Q64J147k047j065K310k74j722J871N83k431N92K476j131j324
1605f47J925j217k624J749J264j440J116K194j872k009J740p87j244J946J654
1620A748k049m19K118j417r68K137n12k054O98J200j798R13K328o41j641R90r36
1637c03k163J751J904j199K44J704j798j982J876M39j872J252J013j635n24K346
1653A053l61j199J382l92j834M63J289j016O60J959j144j766J045J87k329J238
1669g65J877j289l13J736r84j341J475P93j807k41J425r55l56J828L6r79L75K3
1687E38k322Q44J139o14L62J398n21j469J108j01j464N47J473j058o48J350J4
$$ plain form
1573 1547 -144 -872 1234 373 -2211 -460 362 -995 326 2838 393 -1086 390 -773 -2375 -214
1589 -214 1915 -496 368 1515 -532 -1597 713 439 -1283 588 1171 -1260 -668 1808 677 -647
1605 -647 1278 61 -2563 -814 450 -990 126 2320 448 -1561 179 -608 -1852 94 1748
1620 1748 -301 -720 1398 -19 -987 1150 638 -1416 -718 482 -1316 -403 1925 1284 -357 633 -303
1637 -303 -2466 -715 1189 -10 234 1938 140 -1842 34 473 -1399 -147 866 -769 -1293 1053
1653 1053 692 -507 875 483 -1351 -888 401 -615 45 2004 860 -906 139 326 -2003 -765
1669 -765 1112 -177 -490 1246 262 -1079 396 1189 -618 -859 566 -389 -745 1083 1119 140 515 538
1687 538 -1784 -940 199 -415 -53 1345 824 -645 463 362 -1102 -555 918 -140 -788 562 576
1704E76r38Q18M22j879j74Q79l00O8J327N16j346P80n06r20L68O43o93n0J360
1723I51m04r97O30L23j295l4J471o30j072J319O52n30l80Q09j117l63L83m3J39
1742a88O76L5p90N28M4r60L6O85n88l21J177M23n64jO03m29p53j30J80j85P02
1763A80Q8k40Q02k19j068k87N67l71m2N67N69l62J24M93k68p58l49L28k32J60
1783c18N23Q3L81J7j066J27J73n59j85P18P08k87K7L31l75o24N6k38j22K35K20
1804a75L37M30q8l86j64l28l06P7N01M05j9N61J93o50k47k46l85N1r0N39K04K29
1826D43J63k16k87n10o0k12N29L3M69K02L37n84j69j87l03k97m5N65J04L26M13
1847G14m19l26r4l39k1o1Q7O97K35M87j08n56k39o22l14K61R4N05P2N82q2m16
$$ plain form
1704 576 -362 456 878 -1001 -1175 -296 -596 -528 799 1315 -31 749 243 -677 -309 334 -359 -409 951
1723 951 547 -450 180 503 -792 -826 645 15 -1057 262 914 384 4 813 -304 -667 -284 -327 -188
1742 -188 488 523 -267 261 305 -655 -619 66 -522 -843 334 757 193 192 795 366 -387 -517 -337 -522 180
1763 180 268 28 830 611 -457 -744 -177 -548 -590 -23 546 184 308 801 533 -225 -574 -246 -478 -318
1783 -318 205 288 669 686 -380 -253 -80 -639 -824 -106 602 315 342 673 298 -326 -270 -508 -630 -395 -175
1804 -175 162 592 504 118 -46 -374 -680 -603 -102 303 284 845 1038 388 141 -105 -490 -439 -529 10 214 443
1826 443 606 390 103 -407 -467 -679 -150 -117 352 554 891 307 138 -49 -352 -649 -694 -129 -25 301 714
1847 714 295 -31 -125 -464 -485 -546 -459 238 473 960 852 296 57 -565 -879 -618 -524 -19 53 635 553 137
1869A37m6n31l65K24P55l40P00L80K96p44o20K49r31j52L05O54N75j84J95o3k57
1890B37m40m90M16J79l67P21P55J55p94M06p07j113q1R79j67O1R34M52o86k55
1910A95r2m89m60O76p5M64N64j22k24J17l89j116K35L44m26M01J594m69o57M97
1930E68J9j469k86R77K20m22J214L02j065K86j75r53J35M95n52L7J133j09m21
1949f6O99O64j975o08J060m36k67J575O65r08j61L90j413l29J091j37n94J071
1967C21L55j258Q93R25j362m44R05r80p72J465J162r65Q07L76j882p11Q60n62
1985h67j87J813J39j210M62Q83j493m42J802o73j505P10R47p38R36J280j527j138
2003h08M02p51r42K461J055j385O10J044k184p96J640j62j177J279N76j708L22
$$ plain form
1869 137 91 -440 -805 -581 174 -166 534 914 1210 466 -154 95 -836 -988 -683 -29 546 362 557 494 237
1890 237 -203 -693 -277 -98 -465 256 1011 1166 372 778 71 -1042 -1123 -144 -311 -250 684 1136 450 195
1910 195 103 -386 -846 -170 -245 219 783 661 437 554 165 -951 -716 -372 -798 -397 1197 728 71 568
1930 568 587 -882 -1168 -191 29 -393 821 1123 58 344 169 -784 -649 -154 -706 -669 464 355 -66
1949 -66 633 1297 -678 -1286 -226 -662 -929 646 1311 403 242 632 -781 -1110 -19 -156 -750 321
1967 321 676 -582 311 1236 -126 -570 335 -645 -1417 48 1210 245 1052 1428 -454 -1165 -305 -867
1985 -867 -1054 759 898 -312 150 1033 -460 -902 900 227 -1278 -568 379 -359 577 1857 330 -808
2003 -808 -406 -1157 -2099 362 1417 32 642 1686 -498 -1294 346 184 -993 286 862 -846 -524
2020e24K001j266o32J263j053j914J226J393j003J280J497k080j325R29m92j227
2036a927J867J696j609j66J275j509j082K377j98k129P66R38j421P46K028k92
2052A360j419O47r66k223J531K011j012M43J809k037j947J718J71j599J400J471
2068A358k195r6K268j156m93J802n04k683L09J567j197M78K813o92k115O31n94
2085d99k103J787J948r44r1J589j519j535J962M18j961M87R46j891r9K586M56
2102A537j464J287m22l056N56J596l85J33K284p71k171P32N22j796R05J717j337
2119a33p07J444l14r96J716N44k235l64Q38r99j97K813N63j578P42m52k342l06
2137a963J973p5m75J854p7k181J094Q83j731K97R75j289q85J716N40m16J270M18
$$ plain form
2020 -524 1477 211 -421 842 -211 -2125 -899 494 -509 771 2268 188 -1137 -208 -700 -1927
2036 -1927 -60 1636 27 -139 1136 -373 -1455 922 724 -1405 -639 299 -1122 -376 1652 1360
2052 1360 -59 588 -378 -2601 -1070 941 -71 372 2181 144 -1803 -85 86 -1513 -113 1358
2068 1358 -837 -933 1335 179 -314 1488 984 -1699 -1390 177 -1020 -542 2271 1579 -536 95 -499
2085 -499 -2602 -815 1133 189 98 1687 168 -1367 595 1013 -948 -461 485 -1406 -1505 1081 1537
2102 1537 73 1360 938 -2118 -1562 34 -351 -218 2066 1295 -876 -144 378 -1418 -513 1204 -133
2119 -133 -840 604 290 -706 1010 1554 -681 -1045 -207 -1206 -1403 1410 1973 395 1137 685 -1657 -1963
2137 -1963 10 -65 -540 1314 1237 -944 150 1033 -698 -401 574 -715 -1600 116 656 240 1510 1928
2155A928k653q93Q51j60l44K437O28j488J5L79k029J25J731l63q11J217j4r68
2173d12M80J135j281n83Q36r37p59J664R50o77L97M67j886r66J134j81J11J314
2191H06L14j147L65K68j006m83J358r96r39J193J103q26P48R50j159j568M44k28
2209h03l36J004J310q52L79J07j104l72O96k99o79R00M26n69M52R78r35q42N68
2228B9n18p74O65Q02J52N40M64j335m73K21o09l35J163O74n90K52P45p71p95N52
2248E9k95p69N04R1K89P74L34n48j16n70o91k56P15O85l9M48L42l53m72m38k9
2269c35m56J11P74k22L34N72k0k52m16m52n46K85K5M44R78J6j76l59j06m18o71
2290h90L12N34n4P77nO1j83n63j84m18j55J5N42O94J79j02O0m2q56m96L4J81K53
$$ plain form
2155 1928 -725 -1618 -767 -927 -1271 1166 1794 306 321 700 -1329 -1204 527 164 -647 570 556 -412
2173 -412 68 1203 -78 -661 175 -762 -1521 143 1093 416 813 1280 -606 -1572 -438 -619 -508 806
2191 806 1120 -27 338 606 -400 -883 475 -521 -1460 -267 836 10 758 1708 549 -1019 -575 -803
2209 -803 -1139 -135 1175 323 702 809 -295 -667 29 -270 -949 -49 377 -192 260 1238 303 -539 29
2228 29 -489 -1263 -598 204 356 896 1360 25 -448 -227 -836 -1171 -8 666 76 328 1073 302 -493 59
2248 59 -236 -1005 -501 -410 -121 653 987 439 323 -247 -938 -1194 -479 206 167 615 957 604 132 -306 -335
2269 -335 -791 -680 94 -128 206 778 758 506 90 -362 -908 -623 -598 -154 824 840 664 305 199 -219 -890
2290 -890 -578 -44 -98 679 674 735 552 -11 -195 -613 -768 -753 -211 483 662 560 620 578 -278 -774 -740 -559 -306
2313c06O00Q3K62m52K5m73m95J14p3J51O91K76L11M4k73o47k51l52M62l32M39
2334a96Q41J70J84p41j00m85n72K79Q8M89M48K72M4k08l39p31j94J02K12L21N69
2355D53J53J08k78m42n21J31j18l26O43M28K91j3J07j75p10k66o6k31M59M35L18
2376C80M89k81m66j04p14L35l22J35O51O07J37k20L2n84m79K9q5l25O98N19L67
2397G99l51N16r42q02M7lj00P65Q00k05k28K98l09p13n3Q4m75N42P96j03K62L27
2419I52n23r88M11l54o01O53R05K43NM20p04q40J1K4n38L99R73m74L05O41n41
2440C79r95N73j94q34L74R99k02J24J048l90j217K78m33o93K73J339J56k52O02
2459I35m53j037O99p5j001L71J009q21L23J118k01p08mk83j169K27J401M8k63
$$ plain form
2313 -306 294 377 639 187 212 -261 -756 -642 -715 -564 127 403 714 758 485 -162 -413 -765 -303 -635 -196
2334 -196 645 815 999 258 158 -327 -899 -620 -532 -43 405 677 721 513 174 -557 -751 -649 -437 -116 453
2355 453 606 714 436 -6 -527 -396 -514 -840 -197 231 522 509 616 441 -269 -535 -601 -832 -373 62 380
2376 380 869 588 122 18 -696 -361 -683 -548 103 710 847 627 659 75 -404 -375 -460 -785 -87 432 799
2397 799 448 964 22 -780 -733 -736 -836 -71 729 524 296 594 285 -428 -481 -397 -872 -330 466 363 625 952
2419 952 429 -559 -148 -502 -1103 -450 455 698 703 1123 419 -421 -410 -386 -924 -525 448 -26 279 920 379
2440 379 -616 -43 -237 -1071 -697 302 100 224 1272 882 -335 -57 -490 -1183 -910 429 585 333 935
2459 935 482 -555 144 69 -932 -561 448 -373 -50 1068 867 159 155 -128 -1297 -1070 331 379 116
2478A16J062k57j461K87J36o72J08J085k20m08J190o08l92J03K77j053m32R99
2496a40L1m05J579O07j654N4N1j307j26J148K52J06P14K6j488K70P92j251M3J239
2516E41q63m60J412M44o04M1Q7j360j135J557L61m97J647K24j620j05L45r20m02
$$ plain form
2478 116 1178 921 -540 -253 -117 -789 -681 404 184 -224 966 358 -34 69 346 -707 -1139 -140
2496 -140 -109 -514 1065 1672 18 72 123 -1184 -1310 -162 90 196 910 936 -552 -282 510 -741 -698 541
2516 541 -322 -782 630 1074 470 511 598 -762 -1897 -340 21 -476 1171 1395 -225 -330 15 -905 -1307
$$ [...]
8191H8
##END NTUPLES=NMR FID
##END=
