##TITLE=1H_DE-83_OR6
 200.13MHz, D2O,
 8 sc
 
 10.3.2025
##JCAMPDX= 6.0         $$ Bruker NMR JCAMP-DX V2.0
##DATA TYPE= NMR FID
##DATA CLASS= NTUPLES
##ORIGIN= UXNMR, Bruker Analytische Messtechnik GmbH
##OWNER= pz
$$ XWIN-NMR		Version 3.5
$$ Mon Mar 10 14:10:57 2025 Russian Standard Time (UT+4h)  she@DPX200
##.OBSERVE FREQUENCY= 200.1313
##.OBSERVE NUCLEUS= ^1H
##.DELAY= (6, 6)
##.ACQUISITION MODE= SIMULTANEOUS
##.ACQUISITION SCHEME= undefined
##.AVERAGES= 8
##.DIGITISER RES= 18
##SPECTROMETER/DATA SYSTEM= spect
##.PULSE SEQUENCE= zg30
##.SOLVENT NAME= CDCl3
##.SHIFT REFERENCE= (INTERNAL, CDCl3, 0, 14.3821)
##AUDIT TRAIL= $$ (NUMBER, WHEN, WHO, WHERE, WHAT)
$$ ##TITLE= Audit trail, XWIN-NMR		Version 3.5
$$ ##JCAMPDX= 5.01
$$ ##ORIGIN= Bruker BioSpin GmbH
$$ ##OWNER= she
$$ F:/spectra/data/she/nmr/H-C/1/audita.txt
$$ ##AUDIT TRAIL=  $$ (NUMBER, WHEN, WHO, WHERE, WHAT)
(   1,<2025-03-10 14:09:52.81 +0400>,<she>,<DPX200>,
      <created by zg, POWCHK disabled, PULCHK disabled
       configuration hash MD5:
       00 E9 B6 7A A2 85 ED C7 34 08 36 98 17 FE 4E 26
       data hash MD5: 16K
       76 00 E2 FD B3 65 6E B1 AC 4E 48 2E E9 C5 0D 67>)
$$ ##END=
$$ 
$$ hash MD5
$$ ED 26 70 D3 DD B7 F5 0F 87 73 D2 0D 22 F2 76 DE
##$RELAX= 
##$RELAX= 
##$RELAX= 
##$RELAX= 
##$RELAX= 
##$RELAX= 
$$ Bruker specific parameters
$$ --------------------------
##$DU= <F:/spectra>
##$EXPNO= 1
##$NAME= <H-C>
##$PROCNO= 1
##$TYPE= <nmr>
##$USER= <she>
##$AMP= (0..31)
100 100 100 100 100 100 100 100 100 100 100 100 100 100 100 100 100 100 
100 100 100 100 100 100 100 100 100 100 100 100 100 100 
##$AQSEQ= 0
##$AQ_mod= 1
##$AUNM= <au_zg>
##$AUTOPOS= <>
##$BF1= 200.13
##$BF2= 200.13
##$BF3= 200.13
##$BF4= 200.13
##$BF5= 200.13
##$BF6= 200.13
##$BF7= 200.13
##$BF8= 200.13
##$BYTORDA= 1
##$CFDGTYP= 0
##$CFRGTYP= 5
##$CHEMSTR= <none>
##$CNST= (0..31)
1 1 145 1 1 1 1 1 1 1 1 1 1 1 1 1 1 1 1 1 1 1 1 1 1 1 1 1 1 1 1 1 
##$CPDPRG= <>
##$CPDPRG1= <>
##$CPDPRG2= <>
##$CPDPRG3= <>
##$CPDPRG4= <mlev>
##$CPDPRG5= <mlev>
##$CPDPRG6= <mlev>
##$CPDPRG7= <mlev>
##$CPDPRG8= <mlev>
##$CPDPRGB= <>
##$CPDPRGT= <>
##$D= (0..31)
0 0.7 0 0 0 0 0 0 0 0 0 0.03 0 0 0 0 0 0 0 0 0 0 0 0 0 0 0 0 0 0 0 0 
##$DATE= 1741601392
##$DBL= (0..7)
120 120 120 120 120 120 120 120 
##$DBP= (0..7)
150 150 150 150 150 150 150 150 
##$DBP07= 0
##$DBPNAM0= <>
##$DBPNAM1= <>
##$DBPNAM2= <>
##$DBPNAM3= <>
##$DBPNAM4= <>
##$DBPNAM5= <>
##$DBPNAM6= <>
##$DBPNAM7= <>
##$DBPOAL= (0..7)
0.5 0.5 0.5 0.5 0.5 0.5 0.5 0.5 
##$DBPOFFS= (0..7)
0 0 0 0 0 0 0 0 
##$DE= 6
##$DECBNUC= <off>
##$DECIM= 32
##$DECNUC= <off>
##$DECSTAT= 4
##$DIGMOD= 1
##$DIGTYP= 9
##$DL= (0..7)
0 120 120 120 120 120 120 120 
##$DP= (0..7)
150 150 150 150 150 150 150 150 
##$DP07= 0
##$DPNAME0= <>
##$DPNAME1= <>
##$DPNAME2= <>
##$DPNAME3= <>
##$DPNAME4= <>
##$DPNAME5= <>
##$DPNAME6= <>
##$DPNAME7= <>
##$DPOAL= (0..7)
0.5 0.5 0.5 0.5 0.5 0.5 0.5 0.5 
##$DPOFFS= (0..7)
0 0 0 0 0 0 0 0 
##$DQDMODE= 0
##$DR= 18
##$DS= 0
##$DSLIST= <SSSSSSSSSSSSSSS>
$$ [...]
##$SUBNAM0= <"">
##$SUBNAM1= <"">
##$SUBNAM2= <"">
##$SUBNAM3= <"">
##$SUBNAM4= <"">
##$SUBNAM5= <"">
##$SUBNAM6= <"">
##$SUBNAM7= <"">
##$SUBNAM8= <"">
##$SUBNAM9= <"">
##$SW= 18.0517328524113
##$SWIBOX= (0..15)
0 0 2 0 0 0 0 0 0 0 0 0 0 0 0 0 
##$SW_h= 3612.71676300578
##$TD= 16384
##$TD0= 1
##$TE= 0
##$TE2= 300
##$TE3= 300
##$TEG= 300
##$TL= (0..7)
0 120 120 120 120 120 120 120 
##$TP= (0..7)
150 150 150 150 150 150 150 150 
##$TP07= 0
##$TPNAME0= <>
##$TPNAME1= <>
##$TPNAME2= <>
##$TPNAME3= <>
##$TPNAME4= <>
##$TPNAME5= <>
##$TPNAME6= <>
##$TPNAME7= <>
##$TPOAL= (0..7)
0.5 0.5 0.5 0.5 0.5 0.5 0.5 0.5 
##$TPOFFS= (0..7)
0 0 0 0 0 0 0 0 
##$TUNHIN= 0
##$TUNHOUT= 0
##$TUNXOUT= 0
##$USERA1= <user>
##$USERA2= <user>
##$USERA3= <user>
##$USERA4= <user>
##$USERA5= <user>
##$V9= 5
##$VALIST= <valist>
##$VCLIST= <CCCCCCCCCCCCCCC>
##$VD= 0
##$VDLIST= <DDDDDDDDDDDDDDD>
##$VPLIST= <PPPPPPPPPPPPPPP>
##$VTLIST= <TTTTTTTTTTTTTTT>
##$WBST= 1024
##$WBSW= 4
##$XGAIN= (0..3)
0 0 0 0 
##$XL= 0
##$YL= 0
##$YMAX_a= 410563
##$YMIN_a= -421272
##$ZGOPTNS= <>
##$ZL1= 120
##$ZL2= 120
##$ZL3= 120
##$ZL4= 120
##$ABSF1= 10
##$ABSF2= 0
##$ABSG= 5
##$ABSL= 3
##$ALPHA= 0
##$AQORDER= 0
##$ASSFAC= 0
##$ASSFACI= 0
##$ASSFACX= 0
##$ASSWID= 0
##$AUNMP= <proc_1d>
##$AZFE= 0.1
##$AZFW= 0.1
##$BCFW= 1
##$BC_mod= 2
##$BYTORDP= 1
##$COROFFS= 0
##$CY= -3
##$DATMOD= 1
##$DC= 2
##$DFILT= <>
##$DTYPP= 0
##$F1P= 0
##$F2P= 0
##$FCOR= 0.5
##$FTSIZE= 0
##$FT_mod= 4
##$GAMMA= 1
##$GB= 0.15
##$INTBC= 1
##$INTSCL= 1
##$ISEN= 128
##$LB= 0.25
##$LEV0= 0
##$LPBIN= 0
##$MAXI= 10000
##$MC2= 0
##$MEAN= 0
##$ME_mod= 0
##$MI= 1.114404
##$NCOEF= 0
##$NC_proc= 0
##$NLEV= 6
##$NOISF1= 3.799351
##$NOISF2= 2.8
##$NSP= 1
##$NTH_PI= 0
##$NZP= 0
##$OFFSET= 14.38212
##$PC= 1
##$PHC0= -469.932
##$PHC1= 12.99222
##$PH_mod= 1
##$PKNL= yes
##$PPARMOD= 0
##$PSCAL= 0
##$PSIGN= 0
##$REVERSE= no
##$SF= 200.129724274929
##$SI= 16384
##$SIGF1= 3
##$SIGF2= 2
##$SINO= 400
##$SIOLD= 16384
##$SREGLST= <1H.CDCl3>
##$SSB= 0
##$STSI= 0
##$STSR= 0
##$SW_p= 3205.1282051282
##$SYMM= 0
##$S_DEV= 0
##$TDeff= 0
##$TDoff= 0
##$TI= <>
##$TILT= no
##$TM1= 0
##$TM2= 0
##$TOPLEV= 0
##$USERP1= <user>
##$USERP2= <user>
##$USERP3= <user>
##$USERP4= <user>
##$USERP5= <user>
##$WDW= 1
##$XDIM= 8192
##$YMAX_p= 0
##$YMIN_p= 0
$$ End of Bruker specific parameters
$$ ---------------------------------
##NTUPLES= NMR FID
##VAR_NAME=  TIME,          FID/REAL,        FID/IMAG
##SYMBOL=    X,             R,               I
##VAR_TYPE=  INDEPENDENT,   DEPENDENT,       DEPENDENT
##VAR_FORM=  AFFN,          ASDF,            ASDF
##VAR_DIM=   8192,          8192,            8192
##UNITS=     SECONDS,       ARBITRARY UNITS, ARBITRARY UNITS
##FACTOR=    0.0002768,     1,               1
##FIRST=     0,             0,               0
##LAST=      2.2672688,     0,               0
##MIN=       0,             -421272,         0
##MAX=       2.2672688,     410563,          0
$$ Real data points
##PAGE= N=1
##DATA TABLE= (X++(R..R)), XYDATA
0@%%%%%%%%%%%%%%%pJ5j6J6j6J8k6L2l2L9m7N3o1P1q1R1j05J17j30J46j66J89
37A00k10K33k59K87l19L54l91M30m74N25n77O34o99P71q51R36j034J145j271J418
57G48j588J788k028K325k698L180l831M757o173Q570j3332K6064j21353l17701
71d21272L31595J93547k16921N9223K33263p9412j12757J541q5444L5283J88716
82A27362q7233j75259J27856Q2106j09356J07281J12316k07908o8000J40628j96816
93a47023j90776L61312K72841k54864j04845J95389p0137k03450M4548Q9489M1083
104C3567P8327r0974j46846J58436J36543j99025o1227J67834j08214j88385J51364
115f8600J21763p1914J36261J34870k44959j68387J58184M666j36851J15139J44831
$$ plain form
0 0 0 0 0 0 0 0 0 0 0 0 0 0 0 0 0 -7 8 -8 8 -8 10 -16 16 -16 23 -24 29 -32 39 -42 49 -56 61 -69 77 -89 100
37 100 -110 123 -136 151 -168 186 -205 225 -249 276 -301 333 -366 405 -446 490 -544 601 -670 748
57 748 -840 948 -1080 1245 -1453 1727 -2104 2653 -3520 5050 -8282 17782 -103571 -421272
71 -421272 -89677 103870 -113051 -53828 179435 100023 -12734 -11193 -96637 -61354 127362
82 127362 40129 -135130 -7274 74832 -34524 72757 185073 -22835 -90835 49793 -147023
93 -147023 -337799 23513 296354 41490 -63355 132034 61897 -141553 -97005 -7516 33567
104 33567 111894 20920 -125926 32510 169053 -29972 -91199 76635 -31579 -219964 -68600
115 -68600 53163 -18751 117510 252380 7421 -160966 -2782 1884 -134967 -19828 125003
126A25003o4831l8324j3095q6328O0701J09758j51434j06716J81020L5952j53543
137a01837J12769J95414j06035j15122L7786r5440r7090J45693Q8722p5193N9021
148D8688P7520j34901q2721P5374j7476l2790Q8279r644p7984J05290Q8462j08502
160A9595j1822R4442j08489j45788P4374O4512l0304Q9073Q1954r6057n3427L5154
172A3217p7563n3413J13969M5319n8697N3622N6299p5804j0336N9601p3580q1411
184h8777M9079K41m6114Q9792Q8886m8369j3500K5514r3041p2442P1748L3681
196c302k4297P1813N6714o4559k5279K7596n9597n3125M2827o6l9645N6770O6906
209E2756j5545O492K0403o4356n4173K0224j1955j1315Q6231N9070m5978j2838
$$ plain form
126 125003 60172 21848 8753 -77575 -16874 92884 -58550 -165266 15754 51706 -101837
137 -101837 10932 206346 100311 -14811 22975 -72465 -169555 -23862 64860 -10333 48688
148 48688 126208 -8693 -91414 -16040 -33516 -66306 21973 12329 -65655 39635 128097 19595
160 19595 7773 102215 -6274 -152062 -77688 -13176 -43480 45593 127547 31490 -21937 13217
172 13217 -64346 -117759 -3790 41529 -17168 36454 92753 16949 6613 66214 -7366 -88777
184 -88777 -39698 -39457 -85571 4221 93107 44738 31238 56752 -36289 -108731 -36983 -3302
196 -3302 -27599 44214 100928 36369 11090 38686 -20911 -74036 -31209 -31275 -70920 -14150 52756
209 52756 37211 43703 64106 -250 -54423 -34199 -46154 -57469 28762 87832 41854 29016
221B9016K1167o0614o3703K0241J2683r473M5005M2501p463J6313J9485m9357
233A5801m6869M087j3961j2848M8574M3431m01J7247L262o4354m8311J1344p456
246e0454j5675M6255N5876Q182L981N878k8136l3209j6362k3322o377L7572L2016
259A6225Q180J9613R677l6786m0374j5849j6877m025L5698L9391J9088K0881R016
272F3858k7742l6930k2301j9394q329J8803K8449K3319K2414N387k2759k8654
284c879k1652k2675p854K2331L3897K7341K3494R241j5733l0002l0645k6261j0534
297e2931J2027K3205K6801K5810J1371j1662k4304k5239k2709j0871R184K6209
309a3109L0964K5433J0887o932k2287l1789k9585j5358M321J8954K7354K6875
$$ plain form
221 29016 50183 -10431 -74134 -53893 -41210 -50683 -5678 36823 29360 45673 65158 15801
233 15801 -31068 -26981 -40942 -53790 -5216 38215 37814 55061 58323 -6031 -54342 -42998 -50454
246 -50454 -66129 -19874 36002 44184 48165 54043 25907 -7302 -23664 -46986 -53363 -15791 16225
259 16225 24405 44018 53695 16909 -23465 -39314 -56191 -60216 -24518 14873 33961 54842 63858
272 63858 36116 -814 -23115 -42509 -50838 -32035 -3586 19733 42147 47534 24775 -3879
284 -3879 -25531 -48206 -56060 -33729 168 27509 51003 60244 44511 14509 -16136 -42397 -52931
297 -52931 -40904 -17699 9102 34912 46283 34621 10317 -14922 -37631 -48502 -39318 -13109
309 -13109 17855 43288 54175 47243 24956 -6833 -36418 -51776 -47455 -28501 -1147 25728
321B5728J6726j051j7958k6390k4307j4140J292J7922K7723K7448J5695k052j7129
334B9507k7008l0259k0898j310J4199K4720K8622K1399L942j0998k1004k6979
346a6067k1416k323J2528K0951K6245K0146N449r830k5095l2346k0567j729M170
359c9884J4638L5094K9488K602r243j0486k3731k6469j0420L983J6284K8877K1458
372C2191L766k65j1555l3728k8582n046K283J2459L3418K5452M098N033m265l4603
386F56k9348J145k20k030K3621K9343Q144L910n943l1186k4045m203j2573l76
400d3105L9960L4060R78P282K161l3909k9317o07j0683m913L4397K3448o182J1987
414B5557J3044l0025k7017O33j6218j2937L4040L0693K397K0887J2850l7819l3378
$$ plain form
321 25728 42454 41403 23445 -2945 -27252 -41392 -40100 -22178 5545 32993 48688 46636 29507
334 29507 2499 -27760 -48658 -49968 -35769 -11049 17573 38972 42914 31916 10912 -16067
346 -16067 -37483 -39806 -27278 -6327 19918 40064 45513 35683 10588 -21758 -42325 -44054 -39884
359 -39884 -25246 9848 39336 41938 32695 22209 -1522 -27991 -38411 -34428 -18144 10733 32191
372 32191 35957 35692 24137 -9591 -38173 -43219 -40936 -28477 4941 30393 34491 39524 35259 656
386 656 -28692 -27547 -27767 -29797 -6176 23167 31311 35221 29278 -1908 -25953 -30156 -42729 -43105
400 -43105 -3145 30915 31893 39175 41336 7427 -21890 -22497 -33180 -38093 -3696 19752 13570 25557
414 25557 38601 8576 -18441 -17808 -34026 -46963 -12923 17770 20167 41054 53904 16085 -17293
427a7293j475j7728r651L8627K4750q271J7381J3735l6094k0090J3815k0149k1501
440d3944L1797J9851r406L1718L1471l6837l3218L925k5800k7532L1921L2280
452F226N477K6132O024m4597j2022J9033l2237k2176M7562J7788k8589K3840L4180
465D6641k7980j2646J4356m3122m1238L7318K5506j3549L5235M0279k9251l1772
477b23p755l1366k88M7087m349k2960N0696K5317o3692j1914M9455k4984n0411
490d5387J9258J1379j4547M2186L8130k8465o442J5463n1011m4466L5213K6609
502b080K770L6512K163m6787J3406K2530o2943k1792P5160R38o8627K6862O3844
515D1956j4182j2120J5845l2612l0857J4221j7333q795P1201L7821m7773j1722
$$ plain form
427 -17293 -18768 -36496 -46147 -7520 17230 8959 26340 40075 3981 -16109 -2294 -22443 -43944
440 -43944 -12147 7704 -1702 30016 61487 24650 -8568 -4643 -30443 -57975 -26054 6226
452 6226 11703 37835 43859 -738 -12760 6273 -25964 -48140 -578 17210 -11379 12461 46641
465 46641 18661 6015 20371 -22751 -63989 -26671 -1165 -14714 20521 60800 31549 -223
477 -223 -7978 -39344 -39632 7455 3106 -19854 30842 56159 -7533 -19447 30008 5024 -45387
490 -45387 -26129 -14750 -29297 12889 51019 22554 16112 31575 -19436 -63902 -28689 -2080
502 -2080 690 37202 39365 -7422 5984 28514 -34429 -56221 18939 19877 -48750 -21888 41956
515 41956 27774 15654 31499 -1113 -31970 -17749 -35082 -43877 27324 65145 17372 5650
527E650J1973m7014j5055M5957j0029k2163N9096J5718o9847J1650P0508l0441
539B6003n9694J5100N327k0783K4948K4673l82L3564J767q2515k7836N4289n209
552a0748k5406N5475K9424m5514J73K2309m2835q286N2211k2975n7657L5188M1652
565B3011k0643R656K9684k6767k4068k704l9309k443P9062K0657m8454K0829L0086
578D8597o1183l3684M4944J510k2852L0415M352l6326K8611M0271l5329j9998
590a0672K3738k7353l6012L2509K5106j703L7323R934o3382j8296L1936k6295
602b3167k3685N6077K5210l8278M454K1358k5547j576K6821k7921k9663K9973
614e944O064k1888L7397L5815l2895k1086O127l5287j7443M6786J6486j8255K7475
$$ plain form
527 5650 17623 -29391 -44446 1511 -8518 -30681 28415 44133 -25714 -14064 56444 26003
539 26003 -33691 -18591 -13264 -34047 -9099 15574 15192 48756 50523 -31992 -59828 -5539 -10748
552 -10748 -36154 19321 48745 3231 3404 25713 -17122 -25408 26803 3828 -53829 -18641 23011
565 23011 2368 12024 41708 14941 -9127 -11831 -51140 -53583 25479 46136 -2318 18511 48597
578 48597 -12586 -46270 -1326 184 -22668 7747 12099 -24227 4384 44655 9326 -10672
590 -10672 13066 -14287 -50299 -17790 7316 5613 42936 52870 -10512 -28808 3128 -23167
602 -23167 -46852 9225 34435 -3843 611 21969 -3578 -5154 21667 -6254 -35917 -5944
614 -5944 120 -21768 15629 51444 18549 -2537 3590 -31697 -49140 -2354 14132 -4123 23352
627B3352J6366m6387j2998K9250j4889j8774K7016k98k3906K6568K5605k3246
639G659k8J6490l7119l1036K6830J1293o581L5337K0167l4263j2496J0455k5871
652a9163j2404L3905N048j9273K0115J4236k4091L310K0560k5258k3731J6839
664i907j518j2072L1194K4443j6265k608L885l2674j8346K4159N892p385K4345
677A3143J2428k2428j359J1489k0736j1073J7539o824j5018K3662J9862j1153
689I532M402R139k4445k0203Q082l128j995K7363J4332j4267Q58N352k2450j1978
703a9406J2959j640p208J8063J0229q643P635R179j9204j4304M766p221o845J8769
717b871J5662k190N531K023j9562j2037M798m607l557J7628J0805n248N179M809
$$ plain form
627 23352 39718 -6669 -19667 9583 -5306 -24080 2936 2638 -21268 5300 30905 7659
639 7659 7631 24121 -12998 -44034 -17204 -5911 -12492 22845 43012 8749 -3747 6708 -19163
652 -19163 -31567 2338 7386 -11887 8228 22464 -1627 1683 22243 -3015 -26746 -9907
664 -9907 -11425 -23497 7697 32140 15875 13267 17152 -15522 -33868 -9709 -3817 -11202 13143
677 13143 25571 3143 1784 13273 -7463 -18536 -997 -7821 -22839 823 20685 9532
689 9532 13934 23073 -1372 -21575 -13493 -16621 -18616 8747 23079 8812 9670 15022 -7428 -19406
703 -19406 -6447 -8087 -15295 2768 12997 4354 11989 21168 1964 -12340 -7574 -14795 -21640 -2871
717 -2871 12791 10601 16132 18155 -1407 -13444 -8646 -13253 -16810 818 11623 6375 11554 16363
731A6363j3257r884J099p657n548J3315J0419Q56Q906M627j3825j0930j663p304
745a4483l493J3133J0574J911N902K833j0680q880k280p564l593R518Q008K692
759C598Q472M811p693q954m450q513l576P866Q172M126Q661M126p537q386n347
774d624o698l691M848O388P050Q595L164n525n522m972q815n190L545P375O055
789A983P193M779k198n681p411q761l848K152N761O641P319N565q55m936p502
804B01p938m479O27L727O434Q219N670j48m804o087p508n531j204L338P239Q129
820E885N224R62k144o022q727o323p11K500N399P210O399K767k320o032p543n555
836i031k794J092N030Q430O902K272j278m643p280p056l263M90M383P890O488
$$ plain form
731 16363 3106 -6778 -5679 -13336 -18884 -5569 4850 5706 14612 19239 5414 -5516 -7179 -14483
745 -14483 -17976 -4843 5731 7642 13544 16377 5697 -3183 -5463 -13027 -16620 -7102 906 3598
759 3598 12070 16881 9188 234 -4216 -12729 -16305 -8439 -267 3859 12520 16646 9109 723 -4624
774 -4624 -11322 -15013 -10165 -3777 3273 11868 15032 9507 3985 -987 -9802 -14992 -11447 -4072 1983
789 1983 9176 13955 11757 6076 -1335 -10096 -13944 -11792 -6031 610 7929 13494 12639 7703 201
804 201 -7737 -12216 -11589 -7862 -1428 6791 12461 12313 7509 1422 -6086 -11617 -12821 -9483 -2244 5885
820 5885 11109 12071 9927 3905 -4822 -11145 -11856 -9356 -3957 3253 9652 12419 10099 4067 -3476 -9031
836 -9031 -11825 -10733 -5703 2727 9629 11901 10623 5980 -1300 -8356 -11619 -11129 -6746 1144 7632
851G632L103J84l229p873p410l383J3L623O785P147L665J110k692p730p206k884
867i145j838R90P539P831L511J950j096p499o750l703k824J45Q204P592K893K904
883A0704j76p435p264l042l429k73P299O554K464M672J636o937o448k684o392
898a0751k089Q381O928J499O286L051q239p713k094n453k144Q393N594M71O803
913H923M082q345n488k23o322n057O398L835J782J0063N784r761n527O50r251
928h457p456Q376Q090J523P113L084q536k577J578j0135o480J0266L463m402P974
943C424Q934m862k005j039j2905o365R326J854k815J4104J0835j0765p534R03
957A090q314m080Q166j75k652J2891N866j2078k41R862j0057j2189M471N98j557
$$ plain form
851 7632 10735 10919 7690 -183 -7593 -10976 -10963 -7340 -555 6592 10257 11367 8675 945 -6261 -9145
867 -9145 -10983 -9993 -2454 5377 8888 10838 9742 2243 -4507 -8210 -11034 -10889 -2685 4907 7800 10704
883 10704 10528 3093 -4171 -7213 -10642 -10915 -3616 2938 5402 10074 11710 4773 -1675 -4359 -10751
898 -10751 -12840 -4459 2469 3968 10254 13305 5066 -2647 -4741 -10194 -12338 -3945 1649 2120 8923
913 8923 13005 4660 -828 -1051 -7373 -12430 -6032 -2197 -415 9648 15432 5671 144 794 -8457
928 -8457 -15913 -7537 553 2076 9189 12273 3737 1160 2738 -7397 -13877 -3611 -148 -4550 3424
943 3424 12358 7496 5491 4452 -8453 -14818 -5492 -3638 -6453 7651 18486 7721 187 1090
957 1090 -7224 -11304 -3138 -3313 -5965 6926 12792 714 473 10335 278 -11911 -7440 -6842 -8399
972h399J3910P383p909L128M051j9500j2238J3564N556m739R445O947p982O01
986C818L535j3369l440J2815n600j3009J2459J4047n458J171N391j2974r189M598
1000e205o673l227K2324J0620j4813j108P862j2310r150R488q36m486J1514J643
1014E643j2014J0267J4013j4650j1825P207n131r717J2603J0676k507Q832L108
1027A6505k2334q512J3841l549q982J5488R132j1642J338P109j0076p88J0176
1040G706j1908j3402J3931P988q162J0315J3040j3208j1110K306j0077m757K0101
1053B763P464j1279P035Q277j7164p553J2956l106q450R329M45q988J1338J2233
1067A5300j1404m053P828j3204j4070J2763R215l685J1624P151j7192o547P923
$$ plain form
972 -8399 5511 12894 4985 8113 12164 -7336 -19574 -6010 -454 -5193 4252 11199 3217 3818
986 3818 7353 -6016 -9456 3359 -2241 -15250 -2791 11256 5798 6969 12360 -614 -9803 -5205
1000 -5205 -11878 -15105 7219 17839 3026 1918 9780 -2530 -11680 -2192 -3028 -7514 4000 5643
1014 5643 -6371 3896 17909 3259 -8566 -1359 -6490 -16207 -3604 7072 4565 13397 16505
1027 16505 -5829 -14341 -500 -4049 -13031 2457 11589 -53 1285 8394 -1682 -2470 7706
1040 7706 -4202 -17604 -3673 4315 -3847 6468 19508 6300 -4810 -2504 -12581 -17338 2763
1053 2763 10227 -1052 5983 14260 -2904 -10457 2499 -607 -9057 272 717 -8271 3067 15300
1067 15300 3896 -157 7671 -5533 -19603 -6840 2375 -1310 10314 17465 273 -6274 1649
1080A649q793o385J6083M799j2027M970R046r033K31R316j1207j1941R249Q42
1094c201o882J4918J3294j1550n929L858j2717q251J4292N471o487R441O126j3925
1108a542k092R742o896p622Q662j424r686R948J1667o726Q68O282j3879j1868
1122a4566Q654K632l788J3053Q844j2022l235M914q918o028J1031M77p930P420
1136E38O201p572L573Q428r709r488N159k734n742J1781J0082n515K38L556j2514
1151c718p746Q730P53m558R003N378p805Q80O266p067m218M868m300p118Q580
1166b072P498l796L714N455r439q449L173k209l060J0473O192n369J683L485q104
1181h25m647N428k417m749N970L883l615M844N405o340n461K030m853m823P536
$$ plain form
1080 1649 -7144 -13529 2554 7353 -4674 296 9342 309 540 9856 -1351 -13292 -4043 -3201
1094 -3201 -10083 4835 18129 6579 650 4508 -8209 -16460 -2168 3303 -3184 6257 12383 -1542
1108 -1542 -3634 6108 -788 -8410 252 -1172 -10858 -910 10757 4031 4899 11181 -2698 -14566
1122 -14566 -5912 -3280 -7068 5985 14829 2807 -428 4486 -4432 -10460 571 1048 -6882 538
1136 538 6739 -833 2740 11168 1459 -8029 -2870 -5604 -11346 435 10517 5002 5240 8796 -3718
1151 -3718 -11464 -2734 -1981 -6539 2464 7842 37 917 7183 116 -4102 766 -3534 -10652 -2072
1166 -2072 5426 1630 5344 10799 1360 -7089 -3916 -6125 -9185 1288 7480 2111 3794 7279 -825
1181 -825 -5472 -44 -2461 -7210 -1240 2643 -972 3872 9277 2937 -2524 -494 -5347 -10170 -2634
1196b634O157j441L542L026p217n405K726k772k879N757L839k851L156M122m825
1211B301l142J670m224m963M670M088j60M275M085m851m393j77l862k892M834
1226b741L506m11L015K835l699k273N17l813l505L432K049m4M281L837k856k708
1242A422n75l976l739K781K240J257M020K974k451k555n75l598l022J998J959
1257a840Q71L283K814j315q85j099m119l235J309J131J283L623L070l99j339j473
1273A680l551k614P06Q36J049L353K910j54j084j239k658k955p62N93J526L212
1289H48K506Q91p37j015k584l131q64N41J239K590K853O68n4r54k929k735j088
1306c955j12P11K687L243J180O11j127k581k535j490o96J037K389K683J213L94
$$ plain form
1196 -2634 3523 2082 5624 8650 1433 -3972 -1246 -4018 -6897 -1140 2699 -152 3004 7126 2301
1211 2301 -841 829 -3395 -8358 -3688 400 240 4515 8600 3749 -644 -821 -4683 -7575 -2741
1226 -2741 765 354 3369 6204 2505 232 749 -3064 -6569 -3137 -1088 -1132 3149 6986 4130 1422
1242 1422 847 -3129 -6868 -4087 -1847 -590 3430 6404 3953 1398 823 -2775 -5797 -3799 -1840
1257 -1840 -969 2314 5128 3813 2928 1829 -2290 -5525 -4216 -3085 -1802 1821 4891 4492 3153 1680
1273 1680 -1871 -4485 -3779 -2943 -1894 1459 4369 4215 3131 1892 -766 -3721 -4483 -3890 -2364 848
1289 848 3354 4245 3508 2493 -91 -3222 -4086 -3545 -2306 284 3137 3805 3751 2797 -132 -2867 -3955
1306 -3955 -4067 -3356 -669 2574 3754 4365 3238 657 -1878 -3368 -4064 -3027 -638 2045 3258 3652
1322C652k69k245k882j883l46M63K386K195K061J008l70k010k443j934j102N25
1338c194J754J914K582Q12l14j957k331j439j504j21J647K579K038J310N0j472
1354B354k204j888j874m24J553K015K135J625N06j683j672k010j717p82J500K297
1370b69J528J670J168j238j579j958k634j138J379K084J048K237J800j108k382
1385F08j262j816j104J149J148J206K344K107j690j699m56k566j805N52J304P40
1401a240L725J854k033r58K66k794l401J074K356Q02K145J380o49o32l87l660
1417b152j892K270m0j139L382L122n07m94j36l200k922J529N09j281L740M000
1433D789j598j907j67j841j880K13m99J89M140J635k976J561L220l818m766J567
$$ plain form
1322 3652 3383 1138 -1744 -3627 -3973 -3510 -1124 1071 3132 4140 3770 1760 -683 -2617 -3719 -3194
1338 -3194 -1440 474 3056 3868 3554 1597 -734 -2173 -3677 -3798 -2151 428 2466 3776 3826 2354
1354 2354 150 -1738 -3612 -4036 -2483 -468 1667 3292 3798 2115 443 -1567 -3284 -4066 -2566 -269
1370 -269 1259 2929 4097 2859 1280 -678 -3312 -4450 -3071 -987 61 2298 4098 2990 608
1385 608 -654 -2470 -3574 -2425 -1277 -71 2273 4380 2690 991 535 -2031 -3836 -3284 -1980 -1240
1401 -1240 2485 4339 2306 1348 1614 -1180 -4581 -3507 -1151 -349 1796 3176 2527 1895 1508 -2152
1417 -2152 -4044 -1774 -1814 -2953 429 3551 3044 2550 2414 -786 -3708 -2179 -1670 -2951 789 4789
1433 4789 3191 1284 1117 -724 -2604 -2391 -2890 -2701 1439 3074 98 1659 4879 1061 -3705 -2138
1449b138L11j874K810M131n32K6J321m677l754J817Q83j053K740K292q30J234
1465B707Q84m440r18L102k957m761M455N054k032K63L426k851m653K22j324o89
1481d512N052K980k620J227K025l767k476J970j499k178L714J003l377L588N533
1496F663m712m388K582j324m374K273M898M47J783J219m905k447K741k582k956
1511e082N469J759l973J990L538l112q66L484l913n412L888K973k505K981N808
1526G027l519m255J27k705k124M837K115l055L546L239n859j220M756k497m623
1541d210L341P74l694M100N350l381j325K160m521n411L459L200j638M415K954
1556E573m731j560K712l658k880N155Q55n002K986M290l430K41M147m165n368
$$ plain form
1449 -2138 -1827 -3701 -891 3240 2708 2734 4055 -622 -4376 -2559 -1676 -2729 11 2303 1473 2707
1465 2707 3591 -849 -1767 1335 -1622 -6383 -1928 3126 1094 1357 4783 1932 -2721 -2499 -3823 -4512
1481 -4512 540 3520 900 2127 4152 385 -2091 -121 -1620 -3798 -84 919 -2458 1130 6663
1496 6663 1951 -2437 145 -1179 -5553 -3280 1618 2065 3848 5067 162 -2285 456 -2126 -5082
1511 -5082 387 2146 -1827 163 3701 589 -277 3207 -706 -6118 -2230 743 -1762 1219 7027
1526 7027 3508 -747 -620 -3325 -5449 -612 1503 -1552 1994 5233 -626 -1846 2910 413 -4210
1541 -4210 -869 -95 -3789 311 5661 2280 955 3115 -1406 -6817 -3358 -158 -1796 2619 5573
1556 5573 842 -718 1994 -1664 -4544 611 1466 -3536 -550 3740 310 551 4698 533 -4835
1571d835K641J90k508N252N430l446j495J778m940l755M874J376k877L703K441
1586C829m338k68M021k772l643L429j211m469L949N245k061Q63K789n310m704
1601d651K592K92k393N521L235m035n83K865l744k480L823m62l644L129K695k615
1617d55J852M187l837m219J613j470l198M112M828k145P06K083m418l541L191
1632g11r7k321L467K472l384J192L209k783j955J837k201m082L271L429j357K035
1648B021L203l702l693J242j247k109L915K870k026Q21K361l365j838K149j423
1663h21k927K314J469j577K800L099k391k164J126k753k973L311K506j175J937
1678A781K465l324j786J413k016j908K403R40j124J802K367j584q02J283k526
$$ plain form
1571 -4835 -2194 -2004 -4512 740 6170 2724 1229 3007 -1933 -5688 -814 562 -2315 1388 3829
1586 3829 -509 -777 3244 472 -3171 258 -953 -5422 -1473 3772 1711 2574 5363 53 -4651
1601 -4651 -2059 -1767 -4160 1361 4596 561 -22 2843 -901 -3381 442 -20 -3664 -535 2160 -455
1617 -455 1397 5584 1747 -2472 -859 -2329 -5527 -1415 3413 1268 1974 4057 -361 -3902 -711
1632 -711 -808 -3129 338 2810 -574 618 3827 1044 -911 926 -1275 -5357 -2086 1343 -14 2021
1648 2021 5224 1522 -2171 -929 -2176 -4285 -370 2500 474 1295 3656 291 -1547 602 -821
1663 -821 -3748 -1434 35 -1542 1258 4357 1966 -198 928 -1825 -4798 -1487 1019 -156 1781
1678 1781 4246 922 -864 549 -1467 -3375 -972 -32 -1156 646 3013 1429 627 1910 -616
1693f16k760J569J147n57K686K413k175j405M82k142k427K594J341j099J807K032
1709B890j457r41R14j618k307J200K23o61K224K372j079p52L01k028k285Q56J227
1726i21l32K242J729j000p25O02j996j774O18O21m53J396J757k45j71nj472k004
1744b133K02M52k17K118J861l81m89mj392j751J00M20m75J571J493k4J22N9j273
1763B59j366l74j21k10J480J790K31J21M49j486j946k2p61K11R84J604M66J34
1781A443J75r54j300o17l52l45J348J258P68N25l55p29j191p36o98k66J118J050
1799A42Q93P13N5r67q08j013q17N2J043J026N81N68N41q95j103p97o70k82J81
1818a557J411R10Q01K14l69j275m24j039n47Q52N11J080J256j42o20n28j055q25
$$ plain form
1693 -616 -3376 -1807 -660 -1217 1469 3882 1707 302 784 -1358 -3785 -1191 150 -949 858 2890
1709 2890 1433 492 1406 -212 -2519 -1319 -1096 -1757 467 2839 1760 1008 1309 -719 -3004 -2148 -921
1726 -921 -1253 989 2718 1718 993 1595 -401 -2175 -1557 -936 -1389 7 1764 1519 1348 1343 -129 -2133
1744 -2133 -1931 -1479 -1696 422 2283 1902 1413 1409 17 -1734 -1634 -1214 -1689 -118 1375 1351 1473 1532 259
1763 259 -1107 -1481 -1602 -1812 -332 1458 1689 1810 2259 773 -1173 -1195 -1956 -1745 -761 843 1309 1443
1781 1443 1618 664 -636 -1253 -1605 -1950 -602 656 1424 1949 1594 865 -326 -1062 -1760 -2026 -908 142
1799 142 1035 1748 1803 836 28 -985 -1802 -1750 -707 319 900 1468 2009 1114 11 -786 -1456 -1738 -1557
1818 -1557 -146 764 1565 1779 1410 135 -289 -1328 -1875 -1023 -512 568 1824 1682 1062 534 -521 -1346
1836a346n83L07J065P32J141L19m3q91o74q66p63L02O97O49O73O31m9q09r05o61
1856a074q65N50P39N57R05Q57p6m40q24r29o59j05L49P01Q73J119j92p03m47n70
1876b34r64m97M22J170Q93N16j83L09l86j694q27K22M49K01P48R32J74N0m69j128
1896b96q97j70O10j25R18J296J89On69j363o83J67l97l86J801J286n77m00Q44
1915A254q54j228l31J61L79L43J035J04M21J73r55j432j12m11j48J313P85o2N77
1934A012O67j604j209O95J37r95M02J567j03L15K8m24o30l3j042q90J428J099
1952D20m09R87J063j285j282J99o68r14J723J277q39K23J109p76j423O82k06j055
1970a174M51L94k93J716R21j542n05N87j306j333J369R75pN74J307j467j231P41
$$ plain form
1836 -1346 -1929 -1622 -557 175 1316 1635 1592 701 27 -839 -1602 -1300 -603 46 719 1350 1301 492 -413 -1074
1856 -1074 -1939 -1389 -650 -93 812 1669 1593 1153 329 -600 -1259 -1364 -1015 -314 559 1678 1486 783 336 -234
1876 -234 -1198 -1695 -1273 -103 790 1306 1123 1432 1046 -648 -1475 -1253 -804 -603 145 1077 1251 1301 832 -296
1896 -296 -1193 -1363 -753 -878 40 1336 1525 1531 962 -401 -1084 -917 -1314 -1700 101 1387 810 410 1254
1915 1254 400 -828 -1159 -998 -619 -276 759 863 1284 1457 502 -930 -1042 -1453 -1601 -288 497 435 1012
1934 1012 1679 75 -1134 -439 -302 -1297 -895 672 569 884 912 488 -142 -175 -1217 -2107 -679 420
1952 420 11 998 2061 776 -506 -307 -975 -1889 -166 1111 272 495 1604 828 -595 87 -119 -1174
1970 -1174 -723 -329 -622 1094 2015 473 -32 555 -751 -2084 -715 260 253 827 2134 667 -564 177
1988A77m94j050O27Q78m43P44R38p09j56P36j786j694J302P88q65J801J502j323
2006I73j070O04j299j250J390R61n40P56Q68j016o20J030o53j455J012m48o53
2023a410J285K062j123j07N87j935j387J278M71p05J911P66j155r71J170r28j359
2040a550J615l0j570R96J549r06N84J200j622j724P93m3j135K052J981j336o02
2057B52Q43j582j156J097N46j017Q25J363j485K43J696j478q29O69m55j457J797
2074a28J133n62J30J213j601j659J141l71n64J390J350j654J15J078q56r41J254
2091D68n41j470J152N59o72J180J045q17j566N47j046r51J648J396n30L58O98
2108A458j496j054J070R3j220Q08O10j053Q55J082o54m91K04o37j281Q47N79K31
$$ plain form
1988 177 -317 -1367 -740 138 -305 439 1377 668 512 1248 -538 -2232 -930 -142 -1007 794 2296 973
2006 973 -97 507 -792 -2042 -652 309 -231 525 1393 377 -243 787 134 -1321 -309 -757 -1410
2023 -1410 -125 1937 814 707 1294 -641 -2028 -750 -279 -984 927 1693 538 -433 737 -191 -1550
2040 -1550 65 35 -1535 -539 1010 104 688 1888 266 -1458 -665 -708 -1843 209 2190 854 252
2057 252 1095 -487 -1643 -546 0 -1017 -192 1171 -314 -71 1625 147 -682 -13 -468 -1925 -128
2074 -128 1005 443 573 1786 185 -1474 -333 -704 -1268 122 1472 -182 -67 1011 155 -786 468
2091 468 -73 -1543 -391 168 -504 676 1721 904 -662 -115 -1161 -2112 -464 932 402 760 1458
2108 1458 -38 -1092 -22 71 -1149 -341 269 -784 71 1153 499 8 212 -425 -1706 -859 -280 -49
2126d9J008P45j256r96O02q42o97J494N44o70Q0J194j230k98J019m11j297L38
2144g22O82m92Q82J365r58n25J81q48j254J114O89l90O82Q55j132m19Q68o45r35
2163a002P47N31q45N90J072n77k66N41o11j351O45J38K11K41J110p66j24J69r32
2182d79n55Q89J5k15K61J001n73o3K74q21n22M24j39l13Q10O71j15n04O55p48
2202d7o42J80M9o4Q14N92p29K75J75o82n81N19Pm70M94O88p3j81O59p07r98O53
2224f9k61j05N49L99q6J6O5l66o13L09j31n53P33N02k27J99L58p31j53o2l32j14
2246f73M62L44R3R3M12n40l92j43J62k71L04L78M5K98j03q1n10k34l3j38L42L38
2268A53K22L6J68l79k05J00n98l4K53K74N25k51J56l81J30l09j31j97K62k7L66
$$ plain form
2126 -49 959 1704 448 -548 54 -788 -1485 9 553 -117 -37 1157 -73 -371 648 237 -1060 -722
2144 -722 -40 -532 350 1715 757 232 413 -435 -1689 -575 114 -276 406 1261 129 -290 578 -67 -1002
2163 -1002 -255 276 -569 21 1093 516 250 791 180 -1171 -526 -388 -177 64 1174 408 284 453 -479
2182 -479 -1034 -145 -130 -345 -84 917 344 281 555 -266 -788 -364 -503 -816 -6 665 550 46 701 -47
2202 -47 -689 -509 -460 -524 290 882 153 428 603 -79 -660 -141 -134 -604 -110 578 505 324 983 276 -722 -69
2224 -69 -330 -435 114 513 427 443 508 142 -471 -162 -293 -846 -113 389 162 361 719 -12 -165 -227 -559 -673
2246 -673 -211 133 226 319 731 191 -201 -344 -182 -453 -149 229 274 572 469 388 -122 -356 -389 -527 -185 153
2268 153 375 411 579 200 -5 95 -503 -537 -284 -10 515 264 420 39 169 -140 -271 -468 -206 -233 133
2289A33J6K60k43j13q3l92J69Q9q5L78L09L8O4k94j89m11Nn6J87J97M14O4j01
2312C56r9k95k77K50j67J31J55J77J02k2k72k25K12k98p3R8K04K67J48n0k58Q0
2334A44j30k66OK09Q8R0L51j4m65M7j77k68j10J80J02L80J68k7k69j6k19k54K18
2357b32J1j69L73L69m1J01l01r8l37k84N43P3l5J99L18l14p0j88k10J13O9l01
2379d11N74J18K65l43qp5k29L20l05j35J73L09n6J15j45m10j24J94r0J13o6N35
2401C19k19J33k2j76k66j26J21j59N40J74k35M36k74q1m89j8j13L81K06K20j80
2422A72L4r6k31L32n55L03J01j32j05L79J32k07k66j16J00J33k60L09m9j38K90
2443A30J11j73j92J24k41K4j2L33l8j64K82o8l80K85j27j34K12L9n2J94J93l42
$$ plain form
2289 133 149 409 166 53 -30 -422 -253 -164 -249 129 438 476 540 246 57 -354 -349 -405 -218 -21 393 457 356
2312 356 257 -38 -315 -65 -232 -101 54 231 333 311 39 -186 26 -272 -345 -247 -43 224 372 322 64 144
2334 144 14 -252 -246 -37 51 141 492 478 13 60 -117 -385 -495 -315 -213 167 335 308 39 23 -196 -450 -232
2357 -232 -221 -390 -17 352 311 412 111 13 -324 -608 -65 8 -27 172 490 176 106 -82 -292 -179 -110 -411
2379 -411 163 281 546 203 195 120 -109 211 -94 -229 -56 253 197 312 167 -243 -367 -173 -263 -150 -216 319
2401 319 100 233 211 35 -231 -357 -236 -395 145 319 84 520 246 165 -324 -342 -455 -74 132 352 172
2422 172 206 110 -121 211 -344 -41 60 -72 -177 202 334 127 -139 -255 -155 -22 -282 27 -22 -160 130
2443 130 241 68 -124 0 -241 -217 -229 104 66 -98 184 116 -264 21 -106 -240 -28 11 -41 153 346 4
2465Dk37K43l69J89M5j3J11n0J69j28L10k68j74q8P8J80k88L70L90n77Q9J03J06
2488A95m94M51k28j43L41r1r3K43j60k91l8L39N9j45J37L09j03j54mj6l08J26
2510f8j56L85m7j10L1K06j57j79p2K52j47J1K8K1Q9J93j34l08l4K30j45PL71l58
2534i1Q7J56J56l49l75N03k2k38K62l5M3j11k45K82n3k76K10J49L28j77p0j02
2556C2J31n54K22l6J81o8P2J45l42M21l45j82K66K02k26J38O1l8L1o0J25j13m14
2579c51L43R4l68N51l56J36R5m06K27k88M92m52j33M13J84m5n9l73J95L10j29
2600H0K44o25pK41P8O6J70j39l1j15k6l25M73J31l04L26l63n5J64j1j03R7N5K69
2624B90l28N02k92j86n2J6j48L71n5j11l9q8k0J65j26K86r2p4j5k61M26j83j66
$$ plain form
2465 4 -233 10 -359 -170 -125 -138 -27 -77 92 -36 274 6 -168 -256 -178 2 -286 84 474 -103 -14 89 195
2488 195 -299 152 -76 -219 122 31 -62 181 21 -270 -308 31 90 -55 82 391 288 134 130 114 -194 -68
2510 -68 -224 161 114 4 35 241 84 -95 -167 85 -62 -51 -23 -2 87 280 146 -162 -196 34 -111 -104 267 -91
2534 -91 -4 152 308 -41 -416 87 65 -173 89 54 97 -14 -259 23 -30 -306 -96 53 381 204 134 32
2556 32 163 -391 -169 -205 -24 -92 -20 125 -217 204 -141 -323 -57 145 -81 57 118 80 111 51 176 63 -351
2579 -351 -8 86 -282 269 -87 49 144 -262 -35 -323 169 -283 -416 -3 181 136 77 -296 -101 209 80
2600 80 324 -301 -308 -67 11 77 247 108 77 -38 -64 -389 84 215 -89 237 -126 -181 -17 -28 -131 -34 21 290
2624 290 -38 464 172 -14 -66 -50 -198 173 118 7 -32 -120 -140 25 -101 185 93 19 4 -257 169 -14 -180
2647a80N3J09O8j05j00O6Q6J14j59O7j57M1M0K29j57K9l3O5j9r6P6R0o7M9o0j64
2673a15k8J70j27J12k0q3LL33l39qJ82J52j09Nl04j0R4K78j66J51k29J47N1k01
2697f1L3J61k18J62K49l87m0L63k54j44L5K4K8o6M8L06j87J81j00l33L45j76O0
2720B9j07o4P0Q3l9K40k28J14J13k21J22l50K50m2rO7Q8o7j52R9m0qj35K67O6
2745A46j45K13l98k3J15l9K82l48M27j12l34J00m0L28l51J67j04l4K39J17j0k14
2767a8J6j95J05J44l09L23J35j70K35k98j82L41k17j27K47K82j77j17j02P3j1
2788b2L1k81j43L27j8O3P4J67p9k5l54P0J88P4k72j37M46p4N3L5k80O1J30rj09
2813h4J36Q2m27J71J87k29K01r7K92n05L62J51j70k8K54n67o9L48j60J68p2L63
$$ plain form
2647 -180 -127 -18 50 -55 -155 -89 -3 111 -48 19 -138 -97 -57 172 15 44 11 76 57 -39 37 127 60 109 49 -115
2673 -115 -143 27 -100 12 -8 -91 -88 245 -94 -102 80 232 123 128 -176 -186 -92 186 20 171 -58 89 140 -61
2697 -61 -28 133 -85 77 326 -61 -101 262 8 -136 -101 -77 -49 -115 -67 239 52 233 133 -200 145 -31 29
2720 29 -78 -142 -72 11 -28 212 -16 98 211 -10 112 -238 12 -30 -39 28 116 49 -103 -4 -44 -52 -187 80 146
2745 146 1 214 -184 -207 -92 -131 151 -197 230 118 -216 -116 -156 172 -179 -12 -116 -150 89 206 196 -18
2767 -18 -2 -197 -92 52 -257 66 201 31 266 -32 -214 127 -90 -217 30 312 135 18 -84 -11 -22
2788 -22 9 -272 -415 -88 -106 -43 31 198 119 94 -260 -190 -2 72 -200 -337 109 35 88 123 -157 -96 34 25 -84
2813 -84 52 134 -293 -122 65 -164 37 -60 232 -273 89 240 70 42 296 -271 -340 8 -152 16 -56 307
2835C07l9k65qL58m88q6J15k42M52o2j99J70M3l14L50P3k33o0Q6J31J6j19N8K3
2859F7k16K88k26j97K50J66j31q9M14j91k42J10j47j35n5P12l65m4K09l08L20
2880A90l35o0N1K7J3L79l39K35j08K06k61j65M6K52l21K12k20K49q0k2m1k82L15
2903e9M2j60J49K86l48J96m9Oq5j86K39k12L77O3k01N5R6l5k88R5J3J58n6J42
2927B38L2M8r7o4m15J68K17k73N7K20O1p2j82P2j32k19K13J36J1q4N70o16P5j89
2951b25L44q7k80K47m4J06O3j92K02j62r3j1J35Ok53J95j23J80J45o6l31J57r2
2974a79K90j90L69j15J92l14n0k65K20k26j5K54M7J34n5m9J39l12j0j05pP9L16
2997A48k37J49L4m7j21kR3j31j06L56J74k08J76j12k0l80J77k49k6M45k54L21
$$ plain form
2835 307 268 3 -5 353 -135 -221 -106 -348 104 42 -157 13 56 -258 92 165 -68 -128 -42 89 105 -14 44 67
2859 67 -149 139 -87 -284 -34 132 1 -88 326 135 -107 3 -144 -279 -334 378 13 -31 178 -130 190
2880 190 -145 -205 -154 -127 -114 265 -74 161 53 259 -2 -167 -121 131 -190 22 -198 51 -29 -51 -92 -374 -59
2903 -59 -17 -177 -28 258 -90 106 57 63 -22 -208 31 -181 196 259 58 113 209 174 -114 -19 -6 152 96 238
2927 238 270 318 221 157 -258 -90 127 -146 -89 131 192 120 -62 10 -122 -341 -128 8 19 -65 505 -111 -36 -225
2951 -225 119 32 -248 -1 -45 61 124 -68 134 -28 -121 -132 3 9 -244 -49 -172 8 153 87 -244 -87 -179
2974 -179 111 -79 290 175 367 53 3 -262 -42 -268 -283 -29 18 152 97 48 187 -125 -135 -240 -247 -168 148
2997 148 -89 60 94 47 -74 -76 17 -114 -220 136 310 102 278 166 146 -234 -57 -306 -332 113 -141 180
3019A80J50j66k73L48j62m28L02p7K44k15O78m64k23m8O6k75L47M35l90k0L70
3040C79l5m44J04L09m11j39J06M1K46k28M36k79k34L55p27M68K27l2j65J64j2
3061A29l50R4o4O8N3Q5J55l45L37m9n2j59K49n56J23K98OO9L05k35l00K69k51
3084a21k65J58L57o8J4P1k1l66N93k53l77K74Q1K4k35O21k23l45R9J44m41j95
3106d74M80R5%K24L70q65K49j42j23J29J15j3k03M32n0l45K37Mn14L78j65RK20
3129D8o5J52M0r6j2o3m92M70k36J3L31O4r6L4p5k88K92J57m25k9N46L7m18J66
3153E5L57n43r9J23j58N73K77l61l16L95K53p90M4K58p6j77M79k46j61L19j00
3174A06o7k50j1J42k79N81j3k8J86l06j71k5NP0j12K52J83m61N44k31p4l83K75
$$ plain form
3019 180 330 164 -109 239 77 -351 -49 -126 118 -97 581 117 -106 -154 -88 -363 -16 419 29 9 379
3040 379 344 -100 4 313 -98 -237 -131 -90 156 -72 364 85 -149 206 -521 -53 174 142 -23 141 129
3061 129 -221 -127 -191 -123 -70 15 170 -175 162 113 61 -98 151 -405 -282 16 22 91 396 161 -139 130 -121
3084 -121 -386 -228 129 61 75 146 125 -241 352 99 -278 -4 77 101 -134 487 264 -81 18 162 -279 -474
3106 -474 6 101 101 325 695 -170 79 -63 -186 -57 58 45 -158 274 224 -121 116 120 -394 -16 -181 -172 48
3129 48 -17 135 175 79 67 4 -488 -18 -254 -241 90 154 58 92 17 -271 21 178 -247 -276 270 307 -111 55
3153 55 412 -131 -230 -107 -265 308 585 224 -92 303 556 -234 -190 68 -8 -185 294 48 -113 206 106
3174 106 39 -211 -222 -80 -359 222 209 181 367 61 -110 -135 -130 -60 -172 80 263 -198 346 115 41 -342 -67
3197f7q1k40M12P5J7L29j31l44O9j29k68J79K53J54k70L43J35n87K5j85n4K29
3219a36J80j04L04J67J1m41p9j51j45J95J20k0J78J18j41O4l46J44m06R5K52Q9
3241e2P4J13r0j8O1j79j49q8J66J55mN25k47l1j14k01j6k03P2K1L04p0N5q0L97
3266D01o28J27k57K51J00L5K66j37j27q2R8j74J22l83R6m1O76M65p96j62p7Mj22
3289c45J28L5K04L13j05m4j71j38j55j14J30p1J78M58l83L24j9j68k45k36K68
3310a56j23N2M88p0K0k75L37l39j60n5K49k42M64P0l7j43J91k03l44J56J2l9M86
3333C39n31M29K30l52R7m66O6J90j68J74J10m1oo0J96k58Q1j46j42L34k13N66
3355D29j69l25n2q2j07L09L1oK23k67L93m8rn89K30l76M63rK2M1P0J43j24k14
$$ plain form
3197 -67 -148 -388 24 99 116 445 314 -30 39 -90 -358 -179 74 228 -42 301 436 -151 -126 -311 -365 -136
3219 -136 44 -60 244 411 422 -19 -98 -249 -394 -199 -79 -99 79 197 56 120 -226 -82 -488 -393 -141 -52
3241 -52 22 135 45 27 88 -91 -240 -328 -162 -7 -11 514 267 236 122 -79 -95 -298 -226 -205 99 29 84 4 401
3266 401 -227 -100 -357 -106 -6 29 295 158 31 -51 47 -127 -5 -388 -292 -333 343 808 12 -150 -227 -223 -345
3289 -345 -217 -182 22 335 230 186 15 -123 -278 -392 -262 -333 -155 303 -80 244 225 57 -188 -424 -156
3310 -156 -279 -227 261 191 211 -64 273 -66 -226 -281 -32 -274 190 260 223 80 271 68 -276 -120 -108 -147 339
3333 339 -192 237 467 115 212 -254 -188 2 -166 8 118 77 71 11 207 -51 30 -116 -258 76 -137 429
3355 429 260 -65 -117 -199 -306 3 34 28 251 -16 377 329 320 -269 -39 -415 48 39 61 102 172 315 191 -23
3379b3j72r3O2K89J0L43o7k41j58Q3j5l53r8M80j06J55n4L13l61M1m0l63K15P7
3403g6P5m7K03O5qk30j74k3n6Q6J44j40L59n1J05q1j93j01j66j03N29j13N42n97
3427e1k00L19q7l70L03j81m3Q7M00j91Q2K63j61o48KN06k12K32L50l2j31j80J03
3450A60l74j31L73k76nM69K6Q2k16L0k35j24J43j52J34J94q4m6K36j00l81J62
3472a15L03l04N0J14J12j92L69m8l05k26K94l51j05R43l98M0j7k16j73L82k08
3493e1j01J61L26k58Ok4K41l61L0o0k60m6M37N0N9K07n1n46K55K33m18k91O82
3516B20Rj57L20J51o24R4k3j17kJ44O7K0J12J13m02L75j24n17K8J88K53o9K61
3539C20k07k59m6K7r4pK72j60k6M69N1m07R0J3n27J08M36k41j4P14m47J9J11j70
$$ plain form
3379 -23 -195 -288 -226 63 73 416 349 108 -50 33 18 -335 -433 47 -59 96 42 355 -6 35 -5 -368 -153 -76
3403 -76 -1 -48 155 220 212 -18 -192 -215 -271 -185 -41 -181 178 127 232 151 -42 -143 -309 -412 117 4 546 -51
3427 -51 -251 68 -19 -389 -86 -267 -310 -223 177 -14 68 331 170 -478 -476 30 -182 50 400 368 237 57 160
3450 160 -214 -345 28 -248 -253 216 242 324 108 138 -97 -221 -78 -230 -96 98 14 -32 204 104 -277 -115
3472 -115 188 -116 -66 48 160 -32 337 289 -16 -242 52 -299 -404 539 141 181 164 -52 -225 157 -51
3493 -51 -152 9 335 77 83 59 300 -61 -31 -91 -351 -397 40 90 149 356 305 -241 14 247 -171 -462 220
3516 220 229 72 392 543 -81 13 -10 -127 -129 15 82 102 214 327 -75 300 176 -341 -313 -125 128 59 320
3539 320 113 -146 -192 -165 -259 -266 6 -154 -180 289 340 -67 23 36 -491 -383 53 -188 -202 512 65 84 195 25
3563B5m12K2O29j62o7NL19l22P4j04j26j36J19J20j84L21k9J0q6L24q10L77J70
3586G7n40L00N29K05n65L85k01l66k80N24j46l05N05p4j11K89K93o95k03K14k36
3607d01J70O28q9l99N14j81n75l7L16l4K40L2R6j22J71j93k48k39K45k13J0M18
3629A09j43K18K24J39o51Q5J01j86j17M01j21n0J96k6l54K6M52o94L41J13j6j71
3651a24K84K46m04L0j63k05q5N17Qj02K29J46l59K1j38n4k58P48l86M9L35k73
3673F2M1j12M5l29O1L17o1K09pm9k3m9k8j98%J7O9J90Q6P6m24R4j15O1j53J99
3699b1k43J83J33J91j73r1N9k07qj23L28o7L70j97j27j16M22m29l1K05l4j57L86
3722B53k11L54q8k67p4m1m2j37M72J11k67j19J0R1j53r3L7j02M47j69L58j42O
$$ plain form
3563 25 -387 -365 264 102 35 40 359 37 111 7 -119 -255 -136 -16 -200 121 92 102 16 340 -470 -93 77
3586 77 -463 -163 366 571 6 391 190 -176 -456 68 -78 -383 122 48 -63 226 519 -176 -379 -165 -401
3607 -401 -231 397 308 -91 423 242 -333 -370 -54 -88 152 184 280 158 329 136 -112 -351 -106 -319 -309 109
3629 109 -34 184 408 547 -104 -19 82 -104 -221 180 59 9 205 179 -175 -149 303 -391 -50 63 47 -124
3651 -124 160 406 2 32 -131 -336 -421 96 104 2 231 377 18 39 -99 -153 -411 337 -49 0 335 62
3673 62 103 -9 36 -293 -232 85 24 233 226 177 154 105 77 -121 -121 -104 -35 155 241 317 -107 -13 -128 -67 -220 -21
3699 -21 -264 -81 52 243 70 -21 38 -169 -177 -300 28 -39 331 134 7 -109 313 -116 -147 58 24 -133 253
3722 253 42 396 308 41 -33 -74 -116 -253 219 330 63 -56 -46 45 -108 -201 -164 -266 181 12 370 228 234
3745B34K4m42P7O8J74k78K36K24j37P6k86Rl7J46l9m4K53j29r7K85q2m56J46k30
3769c05L9J39K47J64k35Q5l1j47J24j53j99n3K65L2L16k73K57m81J07J32k41J92
3791a9p1O9l8N14j49l03p9r5J23k39N28j59p3L5K13l83K77m96M31j04L4J2j05
3814g7M70m74J23l2j68k90O16k50j00J88K20J3j35k25K27%m85J61K26k77K28k7
3836f8RK01j85p6J52k38P1j67N82j04j46J61j3l33K8K17j4k9j64M72l70J03O0
3859A49l91L20p7J39k51K32k39J45n2P5pl74L54r7Q7K7K37j76K32l98k17K97k64
3882b49K41j31J06L6J07K05r1k45k55OK30k67N58j71J33k34L9K67k94k65K53Q6
3904F5l34K89K01k04K13l72M7Ko3L7J9r6N05J41m80J81l63j59R0L49N8j25J83
$$ plain form
3745 234 258 -184 -107 -39 135 -143 93 317 180 256 -30 -21 -58 88 49 5 258 129 32 317 235 -221 -75 -305
3769 -305 -266 -127 120 284 49 134 103 -44 80 -73 -272 -325 -60 -28 288 15 272 -209 -102 30 -211 -19
3791 -19 -90 -21 -59 455 306 3 -76 -171 -48 -287 241 82 9 44 257 -126 151 -345 86 -18 16 28 -77
3814 -77 393 -81 42 10 -158 -448 168 -82 -182 6 226 239 104 -121 106 106 -379 -218 8 -269 -41 -68
3836 -68 -59 142 -43 -119 33 -205 -134 -301 281 177 31 192 179 -154 -126 91 77 48 -116 356 -14 89 149
3859 149 -242 78 1 140 -111 121 -118 27 -25 50 43 -331 23 -74 13 40 277 101 333 -65 -282 15 -249
3882 -249 -8 -139 -33 3 110 315 224 -21 -276 -270 -40 -307 251 80 213 -21 18 285 -9 -274 -21 65
3904 65 -269 20 221 17 230 -142 -95 -93 -156 -119 -100 -196 309 450 -30 151 -212 -371 -281 68 126 1 184
3927A84oo3k66J15K23l85k8M3K76K74m35K98k37R2k7j87J05j32Q6mK81l89L48
3950A66j39J90m10Q3R3K23J9J33k74jp1j47O9j49L16j70%J93K3o4L3q7k02n5J98
3975c0O8m2P8j30L04j7k29Nj42J94k04k8L30J79j66k7j54l61L75k59L37j96K93
3998A78k7l5J60l21j89K71M4m10L41r1L36j17k07R6o4o2J50k8k23K46j55M0N3
4021a4J85l03k66K04J50j68J50j34M43l17K37K3m11J54l4k7N4K09k50K29j52j01
4043a39K63m09J91J36J40p7l48K31J53J3M0k15q6j89M52p7K03k18K71l43k1MM4
4066A9l73L21NR3j55R4j17q7K85j02n9J72j6j79R5K60j06L0Jm42ML55q7J30mp4
4092F3N1l80K43kk66L01K08m31K40L17l02j48L35l05k83o6L11K6K06M55l33l6
$$ plain form
3927 184 178 115 -151 -36 187 -198 -226 -183 93 367 -68 230 -7 85 58 -129 -24 -156 -70 -74 207 -182 166
3950 166 27 217 -193 -110 -17 206 225 358 84 83 12 -135 -66 -215 101 -69 -69 124 147 83 116 29 -173 -228 -30
3975 -30 38 -4 74 -56 248 231 2 7 -135 59 -145 -173 157 336 170 143 -11 -372 3 -256 81 -115 178
3998 178 151 116 276 -45 -234 37 81 -329 12 -79 257 140 -67 29 -35 -97 53 25 -198 48 -107 -67 -14
4021 -14 171 -132 -398 -194 -44 -212 -62 -196 247 -70 167 190 -221 -67 -101 -128 -74 135 -115 114 -38 -139
4043 -139 124 -285 -94 42 182 105 -243 -12 141 154 194 -21 -107 -296 156 79 282 64 335 -8 -29 -25 19
4066 19 -354 -33 -28 65 -90 4 -113 -200 85 -17 -76 96 80 -99 -4 256 150 180 181 -261 -257 98 11 141 137 63
4092 63 114 -266 -23 -25 -291 10 218 -213 27 344 42 -106 229 -76 -359 -425 -114 -88 118 573 240 204
4114B04j92q8l72L50J36j27J11K33l73N2q8K3k42K60q7R3L29M9m73M95j77k51
4136a35K78J99l28R5J6M5K1k95O7q7J25k13L46k20L65J68m37Q6Op0k17L45j87
4159b7k8J24Pk6j04N20k31p11M82k59j00M50jj47J38K40k91j79J82K09m44J81
4181a5J88j72K0O1n9k85N1J64J6J15k6J7J5P4j47R4K45l48kkJ24P4J13l24K10
4206B01k79r6m8q2N14j75j81N01k44R5l90L08p3j74R3J18L38l05p3l3Nk27QO2
4230a37L1J43K38J24k2l11k07K17j11j86N1K85P2j8J09l09j28M1K28k83J68J1
4252Fj38J13K4M9k51K34k10j29L6L85l20L08J59n27M94m00QO2P3K8q1Q4L01o7
4276B41l59K19k43k48K99j81L32j90J96K53m30J12k57j30M93k79j1K60p7j48M23
$$ plain form
4114 204 12 -76 -448 -98 38 -89 22 255 -118 -66 -154 -131 -373 -113 -200 -107 222 271 -202 293 116 -135
4136 -135 143 342 14 109 125 170 191 -104 -37 -124 1 -212 134 -86 279 447 10 96 102 32 -185 160 -27
4159 -27 -55 69 76 50 -54 466 235 -476 6 -253 -353 97 96 -51 87 327 36 -143 39 248 -196 -15
4181 -15 173 1 21 82 23 -262 -211 -47 -31 84 58 75 90 164 17 111 356 8 6 4 128 202 315 -9 201
4206 201 -78 -174 -222 -304 210 35 -146 355 111 206 -184 124 51 -123 -30 88 426 121 48 15 20 -207 -199 -137
4230 -137 -106 37 275 399 377 66 -141 76 -35 -221 -170 115 187 169 278 -31 -159 -118 110 -173 -5 6
4252 6 -132 -19 5 54 -197 37 -173 -302 -266 119 -201 107 266 -261 233 -167 -159 -97 -24 4 -77 7 308 241
4276 241 -118 101 -142 -390 -91 -272 60 -130 66 319 -111 1 -256 -386 107 -172 -183 77 0 -148 275
4297B75j69j87p9J89k92k9J70M37l18K35J0l30l7J08o6l40N83m7m0l60M04o5m59
4320d07K35J00j31R7J07K33m9Q4l21J03J3p1j20Q3L00j55j73J22J58l76J36n1
4342h3j51Q7M2M74k29J03j70k22L0mm6k3L34j21J50k04j16K47l40J01J00Jl5P1
4366dJ26k6l2L5j75m4K7J30R9l08K85o4r9L5M1k9j04J56k88L92m34N45k90l3J70
4391A11l83J75k16qK47K99o7K1K98o00J7j14J38M0N3L03n4k01j35k1Ll59K89K69
4415A05L6k07M5O9o0K15l10K92k4k00m4J10K33J0k32Lj51J31m8M3L0P9q9Q7j48
4440b5n9K24j13o8j01M5J47J57j15R0p6n6k68K20l20Q7L3O08j33L3k23q7m5k02
4464b47Q1J73k3N5Q0m8j39J44l63J39J55k28K82R4l3K12j88L6l92K00o2r4J10
$$ plain form
4297 275 106 -81 -160 29 -263 -292 -122 315 -3 232 242 -88 -125 -17 -83 -423 160 113 73 -287 117 52 -407
4320 -407 -172 -72 -203 -106 1 234 185 269 -52 51 64 -7 -127 -44 256 101 -72 50 208 -168 -32 -83
4342 -83 -234 -147 -105 369 140 243 73 -149 -119 -123 -169 -192 142 21 171 -33 -149 98 -242 -141 -41 -40 -75 -4
4366 -4 122 96 64 99 -76 -120 -93 37 136 -172 113 49 -50 -15 26 -3 -107 49 -239 153 -281 264 -26 -59 111
4391 111 -272 -97 -313 -321 -74 225 158 179 477 -123 -106 -220 -82 -42 11 314 260 59 -76 -97 -94 -453 -164 105
4415 105 141 -66 -21 48 -12 203 -107 185 161 -39 -83 27 260 270 38 41 -110 21 -27 16 46 125 36 123 -25
4440 -25 -84 140 27 -41 -142 -97 50 207 92 182 106 50 -218 2 -318 -231 -198 410 277 310 87 0 -45 -247
4464 -247 -166 7 -16 39 119 71 -68 76 -287 -148 7 -221 61 155 122 334 146 182 -210 -10 -72 -166 -56
4487e6j43Jo4K83N6n5q6J14k2k25K91J08l45J27J6j85J49k3j46l9M36j5j96L30
4511C11k28J5m3O6l46M8K02j86L08o2J42l67J08j84j40J23J73q8L11l4J84k58
4533E5J14l4m52J48j73L67Q5K28k43k38K4J67j86J2j87M61l37M01j59k05N3j4
4555a13J08j15J91j79L92n1k37P4j04k39r7J61K32k26K45K14k56j08P9J46q9l45
4577c17M67q3r8O4M6Mj1pl38J77J18j76%L15J20j00j21j50k7j27L88k67j0J2K43
4602A22o5k08K94l41M0L34m80K22K18j82K62m22J54j65n1L32l93K9M77m50L84
4623A11m1m6j04qn4q6O40m93M53k40J07nm21j5L9J85k99K58l6KL41l45L7j16k2
4648a58J35O8k2k76J26J63P9l13J49n4j47Q4L57Lo9J39j46p8o8l23L17J02J57
$$ plain form
4487 -56 -199 -198 -262 21 77 22 -64 50 28 -197 94 202 -143 -16 0 -185 -36 -59 -205 -244 192 177 -19 311
4511 311 83 98 55 121 -225 -177 25 -161 147 85 227 -140 -32 -216 -356 -233 -60 -148 163 129 313 55
4533 55 169 135 -317 -169 -342 25 110 338 95 -143 -119 48 -138 -126 -313 148 -189 212 53 -152 -99 -113
4555 -113 -5 -120 71 -108 284 233 -4 70 -34 -273 -370 -209 23 -203 42 256 0 -108 -29 117 28 -317
4577 -317 150 67 -31 33 79 83 72 65 -273 -96 22 -154 -154 161 281 181 60 -90 -117 -244 144 -123 -133 -121 122
4602 122 57 -151 143 -198 -158 176 -304 -82 136 -46 216 -206 -52 -217 -268 64 -329 -300 177 -273 111
4623 111 70 24 -80 -88 -142 -228 412 -81 372 132 239 234 -187 -202 -163 22 -277 -19 -55 -53 288 -57 -20 -136 -158
4648 -158 -23 45 23 -253 -127 36 115 -198 -49 -103 -250 -166 191 194 125 264 118 40 -28 -351 -34 68 225
4671B25J00j2k76J09m5j0k21L76k03r6j48J82K45j44j51j53K61l93J69J81J49
4692A45k19K51Q8k85J15l6j72k15J09N8K86k77K20k0l0K37m36J58o5r3L71k22
4714c2P9l4M8k33j88J90J11m0Q7J66o7m2Q5l12K73j16K6k3J83j05Q9J57m53P8
4738g3J01k95K25m1q9J56K92l32j8J39r2j19o8j41L58j98M11k56M1J52l63Q9k01
4761c22Q9J66J24k55L40q2p1j66j1K05J2k30L57k79O8RK95k8k45j10q1L32l49
4784b32K40nJ41j76J16k1j38q2O9L23r6k8k43K06r1J69l66O6P8j1j5J98j21m2
4808f1J04l2%k66J87J05J96l46R3N0J53j71n3p2J09K7j08kL50pn2l32NJ61M1J24
4834B03m4Q6k57j0j63R1K33lk31P1j0J36J49L4k33K20l50j55J3Q8k52M46j71O0
$$ plain form
4671 225 325 313 37 146 101 91 -130 246 43 -53 -201 -19 226 82 -69 -222 39 -354 -185 -4 145
4692 145 -74 177 265 -20 95 59 -113 -328 -219 -161 125 -152 68 48 18 255 -181 -23 -88 -181 190 -32
4714 -32 47 13 61 -172 -360 -170 -59 -99 -12 154 87 45 130 -182 91 -25 1 -22 161 56 145 302 -151 -73
4738 -73 28 -267 -42 -83 -172 -16 276 -56 -74 65 -27 -146 -214 -355 3 -195 216 -40 1 153 -210 -121 -322
4761 -322 -233 -67 57 -198 142 60 -11 -177 -188 17 29 -201 156 -123 -55 -46 249 221 -24 -134 -215 117 -232
4784 -232 8 3 144 -32 84 63 -75 -157 -88 235 139 111 -132 74 -17 152 -214 -148 -70 -81 -96 102 -19 -61
4808 -61 43 11 11 -255 -68 37 233 -113 -20 30 183 12 -41 -113 -4 23 -85 -87 263 256 204 -128 -123 38 79 203
4834 203 159 245 -12 -22 -185 -94 139 136 -95 -24 -34 102 251 285 52 272 -78 -233 -220 -132 -384 62 -109 -49
4858d9J53J1p4k28J6N15m80q9L91k79j21M45k75j30Q7k86L13K27j88L8K94l22
4880c1j1l0m2j88K74r6K84o9pp3J09o0j62j54RM84j31J94k86p6J60o7J05k76L88
4905B48J24k66J28k19K68l22j12k5K60n45L91m9L13l01L61k1m80K89j23p2P0K13
4927A30m10K45K70k93p4J82j36k8l63M37J83l23M39j86l46K90J61k53L9j00K07
4948G1P5K80m92R6k36K63j46k29M82l24L31j24M9l36J40pJ35q7L71m48K20J96
4970B80m74K09q3o7jR4j26K16J28Q9j61K08l69j61R8R7J5R6j78K82j07M4k73J2
4994a32q3K84m14L51j51L79k11L61m17k67M26k24K15q2L8p6J41Q1l42J23M4Lj65
5017a18J08j8J98q9j60R6p0K7k29K21j96J12J01K0j36J51j43J38M9q0M6k40L68
$$ plain form
4858 -49 104 115 41 -187 -171 344 -136 -225 166 -113 -234 211 -64 -194 -107 -393 -80 147 -41 -3 291 -31
4880 -31 -42 -72 -114 -302 -28 -124 160 91 84 11 120 60 -102 -256 -247 237 106 300 14 -62 98 31 136 -140 248
4905 248 372 106 234 15 283 -39 -151 -176 84 -461 -70 -119 194 -107 254 233 -247 42 -81 -153 -83 130
4927 130 -280 -35 235 -58 -132 50 -86 -114 -477 -40 143 -180 259 73 -273 17 178 -75 -36 -136 71
4948 71 146 426 -66 30 -206 57 -89 -318 164 -160 171 47 96 -240 -100 -107 28 -59 312 -136 84 280
4970 280 -194 15 -68 -135 -136 -42 -168 48 176 265 104 312 -57 -218 -120 -23 -8 88 -90 192 85 129 -144 -132
4994 -132 -215 69 -345 6 -145 234 23 384 -33 -300 126 -98 117 35 73 -3 138 219 -123 0 44 47 -118
5017 -118 -10 -28 170 81 -79 17 -53 -26 -255 -34 -230 -118 -17 3 -133 18 -125 13 62 -18 28 -212 156
5040A56R7k39M9j12mo8J29k04J27J11j03J57k05J86K38l28J66k46K98j84q3K57
5062A95k22L80l27Q0O7j00j16R6k13K11k94M59l08m0J77p7j59J90j16L10q2j28
5084a7j64mjJ83o5J81q2lNJ0k29L22k63Qj00L81l0l24K29L5J52n22M14m37P3J45
5110a03N8N8K66q9m99J77M12l11r7j07J4j27J93J37Q0O5p9J82k87K8%J30n7p3
5134b9J77j79J82k52j8j82K79r3rK81k34Q6l67L30M7J22k34K46M9j03j70L14k63
5157b0J73k62L0L1K67k64K24k31J20N8l83L84l45J57k53L28P7k61L03O9j92j24
5179a14m3j08N21l00J62Pl48L37Q0k14Q5j44Qn2j85K41J01K30l00j23J05K8l74
5202d00M57Rm3K49k15k73L26Lk72N9J66j66K9p7L06k48M7q6R2R6J18K00l93L2
$$ plain form
5040 156 253 14 63 -49 -53 -121 8 -196 -69 42 -61 96 -109 77 315 -13 153 -93 205 21 -62 195
5062 195 -27 353 26 106 173 73 -43 53 -160 51 -243 216 -92 -132 45 -32 -191 -1 -117 193 111 -17
5084 -17 -181 -185 -186 -3 -68 113 31 28 33 43 -186 136 -127 -119 -219 162 132 -192 37 72 224 -298 116 -321 -248 -103
5110 -103 -45 13 279 190 -309 -132 280 -31 -128 -235 -221 -348 -155 -18 62 127 48 230 -57 -29 -29 101 44 -29
5134 -29 148 -31 151 -101 -119 -301 -22 -115 -124 157 -77 9 -358 -28 19 141 -93 153 202 99 -71 243 -20
5157 -20 153 -109 -79 -48 219 -45 179 -52 68 126 -257 127 -218 -61 -314 14 91 -170 133 202 10 -114
5179 -114 -157 -265 256 -44 118 125 -223 114 194 -20 65 -79 -71 -123 -308 -67 34 264 -36 -159 -54 -26 -400
5202 -400 57 66 23 272 57 -216 110 113 -159 -100 66 -100 -71 -148 158 -90 -43 -129 -37 59 177 377 -16 16
5226A6J4O3l59J65J52J24o6MROK7k7k28J91o6j6m4J27r0K7J15Q7j82k57pJ74Q6
5253D5j6J03k54lM10k54o5L03m60K00n0j31J85n1J13r8rl5K8J63l28K53j1J73
5277B11l00k12L78J7j34j22oP3O6J93m87L30q1J76l5j10J50m79N38m65M06K1j20
5300HO9j42j26pJ12p1J26K11r4Q7k37J8l90N52j8q9J92k55K93J5l44J52j78J3
5324a03j50L98k06q4J29M0k06J08o0J14j99K7J41K2j78L35m4l61L89P3j79J3j10
5347i1K76Kk54j23M05j77p5J83j74P4J31Lk46L91n60nL99k17r7M7o5J31j3L09
5371B54m6m67J45Q4q0L74p6m79M63k80J33l7j45J68r0qo8K20mK96n04J11P6k14
5395a74K63j00r1L0l3J03K82m03K00m3o1j21L25j10J36j89k47L49j33l03L79Q7
$$ plain form
5226 16 30 93 -266 -101 51 175 109 113 122 128 155 128 -100 91 25 9 -35 92 2 29 144 231 49 -208 -215 -41 45
5253 45 29 132 -122 -125 285 31 -34 269 -191 9 -41 -172 13 -38 75 -23 -32 -67 -39 124 -204 49 38 211
5277 211 -89 -301 77 94 -40 -162 -168 -95 -29 164 -323 7 -74 102 67 -43 107 -372 166 -299 107 128 8
5300 8 77 -65 -191 -198 -86 -157 -31 180 86 173 -64 -46 -436 116 98 9 201 -54 239 254 -90 62 -116 -103
5324 -103 -253 145 -61 -145 -16 24 -182 -74 -134 -20 -219 -192 -51 -29 -207 128 84 -277 112 185 6 19 -91
5347 -91 185 187 -67 -190 215 38 -37 146 -28 46 177 180 -66 325 -235 -240 159 -58 -155 -108 -173 -42 -55 254
5371 254 208 -259 -114 -30 -110 264 188 -291 172 -108 25 -12 -157 11 -79 -87 -155 65 61 357 -147 -36 40 -174
5395 -174 89 -11 -102 -72 -105 -2 280 -123 77 34 -27 -148 177 67 203 14 -233 116 -17 -320 59 146
5417A46j38p8P4o5K26J92k06M9k34L2N8m4j74NO7j88K55N5q6K9k38L47r0q0o4
5442a50K43j25r5j11J30K44K0j6J88o16O26p13J90j17Q4K39j39J5j23K31J48j28
5464B5j26r0R0J32J42j42J1m0p9q2L05k19J16K5l53M35j06Q9j5j74J37k5j51p0
5488a65j04L05j6J30k5k51RK08om48L40J59L24m43P2k00J09n4J70j49P0J8m5K1
5512B9K7j6r8k20L29j97J94p0j1j38L40j33l50J61J99j03J27l0k84K69m03N15
5534A37k26Q5L54m73q3J43J53j00L3j02P7r2J20m45L01J20J13k84L54m25M99o8
5556A91j64k49K15K14k24j29K79j48n5j41J34J0r8K3j15J83O5K75k38J84q9j60
5578c7n5L04k32j72K32M4k0R6k42j2k7J11k04K15r3J36O1j23l2J74j18j64Q8K36
$$ plain form
5417 146 8 -70 4 -61 165 357 151 200 -34 -2 56 12 -162 -157 -90 -278 -23 32 -54 -25 -263 84 -6 -86 -150
5442 -150 93 -32 -127 -238 -108 136 156 140 328 -288 338 -375 -185 -302 -218 21 -118 -103 -226 5 153 25
5464 25 -101 -191 -101 31 173 31 42 2 -77 -159 146 -73 43 68 -285 150 44 133 118 -56 81 56 -95 -165
5488 -165 -269 36 20 150 125 -126 -117 91 85 -363 -23 136 460 17 89 -111 -2 -56 114 -35 35 53 8 29
5512 29 56 40 -58 -278 51 -146 48 -22 -33 -171 169 36 -314 -153 46 -57 70 40 -244 25 -378 137
5534 137 -89 -4 350 -123 -206 -63 90 -10 23 -79 -2 -94 26 -419 -118 2 115 -169 185 -240 259 191
5556 191 27 -222 -7 207 -17 -146 133 -15 -70 -211 -77 -67 -165 -142 -257 -74 -9 266 28 212 123 -37
5578 -37 -92 212 -20 -192 40 84 64 160 -82 -94 -121 -10 -214 1 -92 44 105 -18 -50 124 6 -158 -70 166
5602A66o3k62n0M47j76j14P3J34q4k04J09K48l06K9K62r1k53P0J94l75L64J55
5624B73k76J67J60l13j87j72M25N5j58j5J56Q1n2j14k70J62j11P0L37k20J06p1
5646C3r3L37o79K93o8J49j96K74n3J59j2l43K19r3n1K95o0L5j24kj37M39n05J05
5670g8j10J9L1n4K86n3j13k69M65J79j87j23K30j91p6J4K34J8l02J4k03O5L03
5693I9k14L41j43p6L00j66Rl03K27k11L1M4J36j53K3nJ1N8Nj88j65K7L27l92L82
5718DL90m96n0J30J22j41j56K33R8J33k91j1j52J73O3k56L33M5j86J84k24k7J3
5741f9k05J31J13L30k20J13r3j80J97j14j3k13Q9J96m49M26J7k3L33l64j92K89
5763I9Rn0k8qJ29j99jL8J7j06J27J50r7K42j78j05o0j44J65J65l07l2J20L21k4
$$ plain form
5602 166 103 -159 -209 238 62 -52 21 155 71 -133 -24 224 -82 -53 209 118 -135 -65 129 -246 118 273
5624 273 -3 164 324 11 -176 -348 77 132 -26 -41 115 196 144 30 -240 -78 -189 -119 218 -2 104 33
5646 33 -60 277 -402 -109 -177 -28 -224 50 -3 156 144 -199 20 -73 -124 171 111 146 22 20 -117 322 -183 -78
5670 -78 -188 -169 -138 -192 94 41 -72 -341 124 303 116 -7 223 32 -44 -30 204 222 -80 -66 -269 -204 99
5693 99 -115 226 83 7 307 141 150 -153 74 -137 -106 -62 74 -79 -56 -61 -50 8 13 -175 -340 -313 14 -378 4
5718 4 394 -102 -152 -22 100 -41 -197 36 134 267 -24 -35 -187 -14 49 -207 126 171 -15 169 -55 -82 -69
5741 -69 -274 -143 -30 300 80 193 100 -80 117 3 -10 -223 -134 62 -387 39 56 33 366 2 -190 99
5763 99 108 58 30 22 151 -48 -49 -11 6 -100 27 177 80 322 144 39 -21 -165 0 165 -142 -174 -54 267 243
5788B43k12k4n2O7K54o49L46m6k9Q3j3J64m24L70l34P2L8M2L03j1P2m8p6l16J85
5813EJ84l24K69j07L70j69k77J91l44L9L69k91R6K7L3k12L76k58K50l06r6L37
5835A62l98L20j47K36J09l42J13l14J96K54l66n6N5J05J94l2k01J01j02j65J48
5856a30J55k73J87J74K2J2j19j01j01p3n7L35j32M72l55K37k19l65M76k96J57
5877Fk18L16J04j97k38L48n9k81M0P6J51R8k62Q5J33k00q7K17l48K55j96K59J69
5900A71j35j83K50L6j48j68PJ25p4L72m96L80j89P6k0K2m9O3l01J50J68L7P8k90
5924a18k02L09j07J64j29P7J69k88K87K1j78n6j07j85K19K98J03l02m3M19m42
5945i1j29K4J09j81K54J55K39k86p0J61j58M3N2l10K50k56J60J56k06K06j92J9
$$ plain form
5788 243 31 7 -45 22 276 -373 -27 -73 -102 -19 -32 132 -292 78 -256 -184 -146 -104 199 188 260 212 136 -180 5
5813 5 189 -135 134 27 397 228 -49 142 -202 -163 206 -85 11 38 71 -141 235 -23 227 -79 -175 162
5835 162 -236 84 -63 173 282 -60 53 -261 -65 189 -177 -233 -178 -73 121 89 -112 -11 -113 -278 -130
5856 -130 25 -248 -61 113 135 147 28 -73 -174 -247 -304 31 -101 371 16 253 34 -331 145 -151 6
5877 6 -212 104 208 11 -227 121 62 -219 -179 -103 48 146 -116 -31 102 -98 -185 32 -316 -61 -257 2 171
5900 171 36 -147 103 139 -9 -177 -170 -45 -119 253 -243 137 -52 24 4 26 -23 40 -261 -111 57 94 172 -118
5924 -118 -320 -11 -118 46 -83 -6 163 -125 162 183 5 -51 -158 -343 -124 174 277 -25 -68 351 -91
5945 -91 -220 -196 -87 -268 -14 141 380 94 24 185 27 70 122 -188 62 -194 -34 122 -84 122 -70 -51
5967e1k07J70q5J12j5L19j55j99n5J44l6J61j66P3QJ08j37K74r4k23J42j17JJ22
5991I4K69k77RRk14K08j44j05M9J90k02K72j11K7j76r4L33j92J34n1pL8k59J21
6015g9K63p6n1n6N2k5q5O8j14L07m24K10L17p3l09J86j34J31M5j86N5j5k05j99
6039c97K89K00j47J76j57J35l84K6K56J81k14p9J67K94j39P9k83J62k57J80k31
6060a43j62M63O5j54n0M1j72n9P4r6jNK22j26k55K86L27k15j48R0j63J57l8K3
6084b9j2j15L46o8m1j7j55k19L49j3J83k02p6K3J12k45J78k69L69m93R7K74L5
6107A2K2j56O5o3L67m29L94J76l95lL7j25K03l03K50J8k5p8J51j13j54M6J50k26
6131a79L09j14k01K68K03j66k32J72j78J28k70K99P4Q2J05k33j91M67m64j26k7
$$ plain form
5967 -51 -258 -88 -173 -61 -76 243 88 -111 -166 -22 -58 103 -63 10 18 126 -11 263 169 -54 88 -29 -28 94
5991 94 363 86 95 104 -110 98 -46 -151 -102 88 -114 158 47 74 -102 -196 137 -55 79 28 21 59 -200 -79
6015 -79 184 108 57 1 53 28 -57 11 -103 204 -220 -10 307 234 -75 111 -23 108 153 -33 22 7 -198 -397
6039 -397 -108 92 -55 121 -36 99 -285 -259 -3 178 -36 -115 52 346 207 286 3 165 -92 88 -143
6060 -143 -305 158 223 69 19 60 -112 -171 -97 -193 -194 -189 33 -93 -348 -62 265 50 -98 -8 -171 -14 -52 -29
6084 -29 -41 -156 190 122 81 64 -91 -310 39 26 209 7 -69 -46 66 -179 -1 -270 99 -394 -297 -23 12
6107 12 34 -122 -57 -120 247 -182 212 388 -7 -10 27 -98 105 -198 52 70 45 -33 118 5 -149 -103 47 -179
6131 -179 130 16 -185 83 286 120 -112 60 -118 10 -260 39 113 195 300 67 -124 343 -121 -247 -274
6152b74K80q3j11L12k87K46L6j67r2M2J73j45O0j24J6K05K0k36J77k9q0J87J0
6175A36k70M2K30l57p4K64J36j85q2J07r2L35k88J65k09L0J03r3J26K10j43j22
6197c1Q8Qq9k33J32O2j20K30j38K56j40K4j49M1M2O9J46k82K29l70K71n5k19K11
6221a7j59K0j13N33k54J07m00L22m0O5K0j69J10N8j04r3j3J75j75L61j2k7k60
6244f5L41k82l7M0M7J04k00J39k6j08l7j03L67M4p6O3m22Q4j07O5L50j9l13K8
6268a23J08o8O2j46m2J65J83j10k69M07k06j25P3M1K44Rl10Q3Q3Q8j13q9N0n3
6292e8l3K9P3p2O3K34j87j40k1K12r4qj17J13k47L51K27k89k63L25j15j06R1M8
6316A6K51j17J88k40j87J18j45R9j00L22j52j1j09O8K46l80O2J11k12N7J67K20
$$ plain form
6152 -274 6 -77 -188 124 -163 83 119 -48 -140 -98 75 -70 -10 -134 -118 87 107 -129 48 19 -61 126 136
6175 136 -134 -92 138 -219 -293 -29 107 -78 -160 -53 -145 190 -98 67 -142 -112 -9 -102 24 234 91 -31
6197 -31 57 65 -24 -257 -125 -63 -183 47 -91 165 25 49 -100 -59 -17 52 198 -84 145 -225 46 -9 -228 -17
6221 -17 -176 -156 -269 264 10 117 -283 39 -1 64 84 -85 25 83 -21 -114 -127 48 -127 234 222 195 -65
6244 -65 276 -6 -43 -3 44 148 -52 87 61 -47 -84 -187 180 224 148 211 -211 -127 -234 -169 181 162 -151 -123
6268 -123 -15 -83 -21 -167 -209 -44 139 29 -240 167 -39 -164 -91 -50 194 203 -107 -24 59 147 34 -55 -5 -58
6292 -58 -91 -62 11 -61 2 236 49 -91 -112 100 6 -2 -119 -6 -253 98 325 36 -227 98 -17 -123 -32 16
6316 16 267 150 338 98 -89 29 -116 -17 -117 205 53 42 -67 1 247 -133 -71 40 -172 -115 52 272
6338B72k88K0K72l08q5j8K07l34J24J66N8J0p3k26K3P6J08j17K55j69K43l07K36
6361A45l44J23P6j1j56K96j55J60J1o8k89jQ9J32o8K51j22l4j42J69m3J00p8k73
6385b32M05l54L07k95R1P5Q8j51j16l0M33k15j20L06l5O7j88j18K47j98J20j47
6407f0rL20j60j48N9n7m4o3j71K92KR2M2J89j35l6j70m6J2K93o0J22j11k22Q5
6432A6J8J0j65P1j11O1J78On2J27k54n1K55o08M70l9J1n3K15J21k70j2m8J17j73
6457a60R6K32n6k86K79kj32J79l12j62M29k62o2L21M7j5j57J18l99N54l07j23
6479a80J05K58J44m90l7K38J22k78K0J24J4K8P8j51J94k59J22k4J08k68J28M4
6501D0J84J75l69k9j31J03q0N2J11k1k1J21P4N5j63J18k37M0p4j2J40J5J91j85
$$ plain form
6338 272 -16 4 276 -32 -117 -135 72 -262 -138 28 86 96 23 -203 -180 -104 4 -113 142 -27 216 -91 145
6361 145 -199 -76 0 -11 -167 129 -26 134 145 77 -212 -213 -124 8 -60 191 69 35 -107 62 19 119 41 -232
6385 -232 173 -181 126 -169 -78 -3 85 -66 -182 -212 221 6 -114 192 157 224 36 -82 165 -33 87 -60
6407 -60 -69 251 91 -57 2 -55 -99 -162 -333 -41 -39 53 95 284 149 113 -57 -103 -91 202 142 264 153 -69 16
6432 16 34 44 -121 -50 -161 -100 78 84 32 159 -95 -146 109 -499 -29 -68 -57 -110 105 226 -44 -56 -104 13 -160
6457 -160 -64 168 112 -174 105 103 -29 150 -162 -324 105 -157 -219 102 149 134 -23 95 -304 250 -57 -180
6479 -180 -75 183 327 -163 -200 38 160 -118 -98 26 40 68 146 -5 189 -70 52 28 136 -132 -4 40
6501 40 224 399 30 1 -130 -27 -107 -55 56 35 14 135 209 264 101 219 -18 22 -52 -64 76 91 282 97
6525I7j64QP9q6O3q5K7QL9J82l21N9K4k18L7J16K12j55J82j29n00M97K75m07J04
6550e6K85k21N9j41L30k55Q4j25M8QR6l7J84k25Q4j82K18j23j46M6n1L46j51J16
6574A91k61J29j97K45j47J36l78M24J37j71j31k09K21m3k3J19Q2j30J56j08K0
6595F2L6P4k44r6J28R1j74O0P5p4j14M5M0R6R8j33Q9r8K9J7K23r1n4j07l4l8J40
6622D6j32K49k9o3rJ22l43Q8J56p3K42Q3l74J7J10n7m84J19J78l3J83R3q7l42
6646c40M99k99P4K2O8k65J84J2J12N4j18J05j90J39P0q6j27K86q2j06m2l7O9J51
6670A53j42o1K37l1O3l72K88j73n2n0l8J21J74q4j00K07j82L4Q1J18j15J07j94
6693a1Q1j22J16O7n1k14q1J49j00J26j10K46N0l47K86l39K25mJ00k28J68p7K73
$$ plain form
6525 97 -67 -59 20 -66 -3 -88 -61 -53 -14 168 -153 -94 -70 -288 -251 -135 77 -78 104 -25 -525 -28 247 -160 -56
6550 -56 229 8 67 -74 256 1 85 -40 8 16 112 75 259 34 118 -64 154 31 -115 -69 -120 226 75 191
6574 191 -70 59 -138 107 -40 96 -282 142 279 108 -23 -232 -11 -54 -77 42 124 -6 150 42 62
6595 62 98 172 -72 -168 -40 51 -123 -63 12 -62 -176 -131 -91 5 103 -30 59 -39 -10 7 230 139 85 -22 -56 -94 46
6622 46 -86 163 134 71 62 184 -159 -71 85 12 254 337 -37 -20 90 33 -451 -332 -154 -187 -4 89 2 -340
6646 -340 159 -140 -66 -44 24 -241 -57 -45 67 121 3 108 -82 57 127 41 -86 200 118 12 -30 -67 2 153
6670 153 11 -50 187 156 219 -153 135 -38 -90 -140 -178 -57 117 33 -67 140 -42 -8 73 191 76 183 -11
6693 -11 70 -52 64 131 80 -134 -215 -66 -166 -40 -150 96 146 -201 85 -254 -29 -33 67 -161 7 -70 203
6716B03p9m2k98L80j93l7O1Q1j59K82J11m05J48J15l10N1J13J65oj92j17J33m2
6739c7K48k50k13K31n8Q4lL26k51o2k65J67J00k34M92r0j67P3J12k6j72j41J13
6762b3l2J5j73K05K46l42Jkn5j50J78q3M07O6o3n6l68J23O8m5P6l2Q9k86J21K62
6788A47j47J27m2l91M9K76k13K98j99j58M87m98J95ML1P8o9K1J0m9J45q4j2L3
6812C9Mj98Q7J58J35l63L6L6O9k41J27OL28k67K05l93K55J50k98J39J02j86J52
6835H2J28l51J54Q8j07j75K39Q5j89J00m8o0J48k81K30j9j52Q0j22J69N8o3j07
6858a13J80k88M5L72m44L54O2j53j0mj86L27k4p4j27J85n1j96K92j75L43j32J12
6881B95p11K08L84k80q8J35K35m42R2N60k73k09PN3nO0j7L0M1j62n0K20n5r4J13
$$ plain form
6716 203 124 82 -216 164 -29 -66 -5 76 -83 199 310 -95 53 168 -142 -91 22 187 181 -11 -128 5 -37
6739 -37 211 -39 -252 -21 -79 5 2 328 77 15 -250 -83 17 -217 275 185 18 91 203 177 5 -136 -23
6762 -23 -55 -40 -213 -8 238 -104 -103 -105 -160 -310 -132 -215 192 258 195 139 -229 -106 -38 -83 -7 -39 50 -236 -115 147
6788 147 0 127 85 -306 -257 19 -194 104 -95 -253 234 -264 -69 -65 -34 44 -25 -4 6 -43 102 18 6 39
6812 39 43 -155 -68 90 225 -138 -102 -66 3 -238 -111 -105 223 -44 161 -232 23 173 -125 14 116 -70 82
6835 82 210 -141 13 101 -6 -181 58 143 -46 54 6 -54 94 -187 43 24 -128 -48 -170 -1 57 -6 -113
6858 -113 67 -221 -176 196 -248 106 168 15 5 1 -185 142 118 44 -83 102 51 -145 147 -28 315 183 295
6881 295 -416 -208 176 -104 -192 -57 178 -264 -172 388 115 -94 -87 -34 -39 21 4 34 75 -87 -137 83 28 -66 47
6906D7j10j0j0J44J45k2l48L31l18J38j50L71k49L37lk13k67K78k89R4J07k47
6928b44L95m5j40q2J73k89K93K77n32L25l49J79J57k30%N5M61l75j89J47K1Qj72
6951a56M67m51j4K0K70R4k78J69M0k17MJ63k79J66j25J02J89j78N5Q2m3m0q2K95
6975B53j61j14K98m52L7L21l78L77k74n1J46M6Or3R0k15J6K23j20L37m69M50k88
6998a5J26J94k41j74K81j63NO1K39l02j48L55l12K40N0N2r9k04K21l38K61j01
7020a2o6O1L52n69L77j99J75j48j94J99M6K32k94m23J80J82K78l77L13Nk35J74
7042E7P3J8P8k00j84J37J43Kr4L16k62k47K62j30o5J50k54R6J40n7N5q1k0K58
7066A91k20k5j56L19k00oM3K33l66K09j79L73k75J60p4j94K7j41M00k67L2J1P0
$$ plain form
6906 47 -63 -73 -83 61 206 184 -164 167 -151 -13 -163 208 -41 296 293 80 -187 91 -198 -104 3 -244
6928 -244 151 106 -34 -116 57 -232 61 338 -194 131 -218 -39 118 -112 -112 -57 404 29 -160 -13 8 16 -156
6951 -156 311 -140 -154 -134 136 230 -48 121 161 -56 -52 111 -168 -2 -127 -25 164 -14 41 123 80 40 -42 253
6975 253 92 -22 276 -176 -139 182 -196 181 -93 -144 2 48 54 -39 51 -164 -148 75 -45 292 -177 273 -15
6998 -15 111 305 64 -110 171 8 13 74 313 11 -137 218 -94 146 196 248 149 -55 166 -172 89 -12
7020 -12 -78 -17 335 -234 143 -56 119 -29 -223 -24 22 254 -40 -463 -283 -101 177 -200 113 118 -117 57
7042 57 130 148 226 26 -158 -21 122 124 30 346 84 -163 99 -31 -96 54 -200 -104 36 -21 34 -47 -67 191
7066 191 -29 -54 -210 109 -91 -97 -54 179 -187 22 -157 216 -59 101 27 -167 -140 -281 119 -148 -116 -105 -35
7089c5N8l7k3j08J43m02P05l95J74j77l0K49n7K1k81R1J6j14qK46j92M14j19j02
7113C7J9K24l55L00j81k13N8K94l19K71l3L9p1j01K59k25M5l30M98k06j55J84
7135C9J9j62J4J50j68Po8p7J03Q3J07m55L55M5K01l88J04O4Q5mL07j85j62K9J72
7160B15j32j57j14J87p1R3l2j31J37k7J8p3M6K19j91k13J30J54j38j01K34pm1
7183EJ17j24M5K69l00j40R6mpK20k19L43l00o7n9k7J38k87j4M29m0K03j12k16
7207e1J7m8k10J8J23O0L95Rl57R7J10qj48Q7k76J12N3J63j42n3l8L66l49l32K64
7232a38J98R0Oj30j53K58n21M24K57j90q7k13K16O4j41r1L0L06k14O3J52j43J17
7255A60pn96M13J44o8k27J05M40k16m69L7J20m1r3J54K49jL8M9j18j86L22j90
$$ plain form
7089 -35 23 -14 -37 -145 -2 -404 301 -94 80 -97 -127 122 65 86 -195 -104 -88 -202 -210 36 -156 258 139 37
7113 37 56 280 -75 225 44 -169 -111 183 -136 135 102 141 70 -31 228 3 48 -282 216 10 -145 39
7135 39 58 -104 -90 60 -108 -101 -169 -246 -143 -60 47 -408 -53 -8 193 -195 -91 -27 58 54 361 176 14 43 215
7160 215 83 -74 -188 -1 -72 21 -11 -142 -5 -32 -14 -87 -41 178 -13 -226 -96 58 -80 -181 53 46 5
7183 5 122 -2 43 312 12 -128 -32 -36 -43 177 -42 301 1 -66 -125 -152 -14 -301 -315 114 74 277 165 -51
7207 -51 -34 -82 -292 -274 -151 -91 304 313 -44 53 163 155 7 94 -182 -70 -17 146 4 -49 -87 279 -70 -402 -138
7232 -138 60 150 156 26 -127 131 -390 34 291 101 14 -199 17 81 -60 -151 -121 185 -29 34 186 43 160
7255 160 153 -443 -30 114 46 -181 -76 364 148 -321 -284 -164 -205 -298 -144 105 104 142 191 73 -113 209 19
7278A9k66K79k31L32n7p0J46l42J21K3n2j19J56M5r2J44J20m7l9j16q8j49l6K18
7302a01L13l30J50j10P3J65l02q7Oj6J07K55m6N8N2p7j90J30j82K44j1r3J25j48
7326a5K14k05K41n5p7J05p0K6j07j05K10j62J28k85M02l76J98m1k09L53l16J76
7348C0q0nQ7J6l44L3J72J87n1k09n3L31j91k45L38o6j71K99l78J42K14J4m4j42
7372a16K05o5K87k34r2k11L85j17K6k51O0L58j08j56K30j75lR8k94J91L88j73
7394B33l15J8j65J74j10m0J96j82J41m8J35j86L01l94K59R0Lj28O3J26k06j74
7416b09L63k39M30j99j28k7q3j56M43k99N8R8p4K5k1O2k07M16l45M7K8O0M4J07
7440A94j82m9k05J79j0p8L73j33k72L60o6j86k3K17o1p9k27M65p3l9l41K62j63
$$ plain form
7278 19 -247 32 -199 133 76 6 152 -190 -69 -46 -98 -217 -61 -16 -108 36 156 109 70 -46 -134 -283 -319 -101
7302 -101 212 -118 32 -78 -5 160 -142 -229 -223 -239 -132 123 77 135 187 110 -80 50 -132 112 101 8 133 -15
7326 -15 199 -6 235 180 103 208 138 164 57 -48 162 0 128 -157 245 -131 67 26 -183 170 -146 30
7348 30 -50 -55 32 48 -296 -263 -91 96 45 -164 -217 114 -77 -322 16 -50 -221 78 -300 -158 56 70 26 -116
7372 -116 89 24 311 77 -15 -226 159 42 68 -183 -123 235 127 -29 201 26 23 121 -173 18 406 233
7394 233 -82 -64 -229 -55 -165 -205 -9 -191 -50 -98 37 -149 152 -242 17 107 110 -18 45 171 -35 -209
7416 -209 154 -85 345 146 18 -9 -92 -248 195 -104 -46 52 -22 3 -18 44 -163 253 -92 -45 -17 43 87 194
7440 194 12 -37 -242 -63 -73 -151 222 89 -183 177 111 -75 -98 119 58 -21 -248 217 144 105 -236 26 -137
7463a37K03k2k99K72k6j8J41M0n1k37K32j36k4k1J77k32M14p6k84K7K19j52n3
7486d3L95l58J91j59j27M36l83J66q1l8rNM3j33J80q3J30l32J74j48j05L46J02
7509A69j05j17K1k16L72j31j06J76k18O5PK0L19k39o0jK91l02P2j92L24J77l94
7532f8j93M04k06n4J75o3K33j67o1j38N58n10R5L32m06J95j27K88l86L4n3J76
7554E8j89K0M63l67R8K10j64j55o8L26l4k28L86k01j31K62l54L13k38k7o2k44
7576c26L58j72L23j41L37j24l15J01j22L7j35K70l61K67M1j68P6L27j63j73O9
7597Fn8j4j81K67o3k3K78q3k22K13k58n6L6K35n2K74l68J99j11j7m6j32K53N3
7621A30m58L30O0l3J48j78j10J04m3N4J79k1n5L2j82Q2j34R5j00Q9lJ16L0m2l1
$$ plain form
7463 -137 66 44 -255 17 -9 -27 114 154 103 -134 98 -38 -62 -83 94 -138 276 200 -84 -57 162 10 -43
7486 -43 352 -6 185 26 -101 335 -48 118 37 -1 -10 -5 38 -95 85 2 132 -200 -26 -174 -279 67 169
7509 169 64 -53 -32 -248 124 -7 -113 63 -155 -90 -83 -63 256 17 -43 -44 247 -55 17 -175 149 326 -68
7532 -68 -261 143 -63 -117 58 -5 228 61 0 -138 420 -90 5 337 -69 126 -1 287 -99 -65 -118 58
7554 58 -131 -111 352 -15 83 293 129 -26 -94 232 198 -30 356 155 24 286 -68 245 7 -20 -82 -326
7576 -326 32 -140 183 42 379 255 -60 41 -81 -44 -179 91 -270 -3 38 -130 -54 273 110 -63 6
7597 6 -52 -66 -247 20 -43 -66 212 129 -93 120 -138 -194 -158 77 25 299 -69 130 19 2 -44 -176 77 130
7621 130 -328 2 62 29 177 -1 -111 -7 -50 4 183 162 107 139 -43 39 -95 0 -100 -11 -14 102 132 90 59
7646E9K34K37p50K32l2N6j4rK4M4q8O5k91J52J59o8j50K53k9j79J72j38j88N9
7670a90J3J75j04K09J69l22K42j79j2k65J57K72k01P0j44K02j66q1o7J35L4j70
7692b23M36o0j57l5j76K4L67J41n12J49k72L20j59L6L10j02j99J40k39J87J50
7713A26K67m09K3jQ8O3m27L81r5N7k59L85k72J49o9n9r0K35j35O1j81J25J76L7
7737A76j32M2k43J56J38n3l03K81j22j33K08p8Q2J10m4N2j41j66L53k81K80l23
7759a41J35J28k1j17Q3j69J23j65L72o6M6k60J84q1j14PL8R0j31J12J92k32L29
7782C42m28J84k4r0n1J9q4P6J20N6Ll13M10J8j63p9R3r3J23J62p4j94M3Q9o1p8
7808FN3j37K97k87J86Q6j87K17l71L05j11j22N1J46L0l05R5n9M9m6J39q6M8J0
$$ plain form
7646 59 293 530 -220 12 -20 36 22 13 37 81 -7 58 -233 -81 78 10 -140 113 84 -95 77 -61 -249 -190
7670 -190 -177 -2 -106 103 272 -50 192 13 1 -264 -107 165 -36 34 -110 92 -74 -155 -222 -87 -53 -223
7692 -223 213 153 -4 -39 -215 -191 176 317 -195 -46 -318 2 -157 -121 189 87 -112 28 -211 -24 126
7713 126 393 -16 7 6 94 157 -270 111 16 73 -186 199 -73 76 7 -52 -142 93 -42 19 -162 -37 139 176
7737 176 44 86 -157 -1 137 84 -219 62 -60 -193 15 -63 19 129 85 137 -4 -170 183 -98 182 -141
7759 -141 -6 122 101 -16 67 -102 21 -144 228 162 208 -52 132 51 -63 -56 -18 72 -59 53 245 13 342
7782 342 -86 98 74 -16 -67 -48 -132 -56 64 120 123 -190 220 238 75 -4 89 -4 119 281 207 13 56 145 84 6
7808 6 59 -78 219 -68 118 204 17 234 -137 168 57 -65 -14 132 162 -143 -48 -107 -58 -104 35 -51 -3 7
7832GJ19j50j71M07k34K34k66J19j38m1J64j36r0J45j16P6r5J72k73K64O9N0j32
7855a6m3P8j21K91j51k74K81J43k78N2O5j10J83k36j3L77m1k94P1j11J67Lj62
7878a39k26J20J69j4QJ91k23K7J26J07K6k71K34o5N8l56K23q0K13k02P2J58j88
7901c2j91L31j25j61J76n8Q6l3KJ17J8o4R1m1J01j01j97N1O9M3j59K14q0l5j08
7926h6K59j44l8Mk67J44R7j7K20Rj81R5m62M48l0J51j57Q7j41K4K64j04l19K49
7950A05j30J56j54K09k83J45J88q5J99m00O7J50j33o8J68j60j9L82k08J59j68
7971A20k46J17J38j24j80K9j4L43k88j2L2R9j81O9j33J37o2J20N1k5k9j8R6o0
7995b1K47k13k70K23J57L8J4o60M53j46q6L56j26q9J78J74m7k34Kj18J66N9L8
$$ plain form
7832 7 126 -24 -195 212 -22 212 -54 65 -73 -114 50 -86 -176 -31 -147 -71 -166 6 -267 -3 66 116 -16
7855 -16 -59 19 -102 189 38 -236 45 188 -90 -38 27 -83 100 -136 -149 228 187 -107 -36 -147 20 23 -139
7878 -139 -365 -245 -76 -90 -82 109 -114 -87 39 146 172 -99 135 70 128 -228 -5 -85 128 -74 -2 156 -32
7901 -32 -223 108 -17 -178 -2 -60 26 -7 -5 112 130 66 157 116 217 116 -81 -30 39 82 -77 137 57 22 -86
7926 -86 173 29 -9 -5 -272 -128 -31 -48 172 181 0 95 -367 81 51 202 45 132 -9 15 279 175 -144 105
7950 105 -25 131 -23 186 -97 48 236 151 350 -50 17 167 34 -34 134 -26 -45 337 129 288 120
7971 120 -126 -9 129 5 -175 -146 -160 183 -105 -117 -85 14 -167 -98 -231 -94 -156 -36 15 -10 -39 -57 39 -21
7995 -21 226 13 -257 -34 123 161 175 -485 -32 -178 -264 92 -34 -123 55 229 182 -52 -50 -168 -2 57 95
8018I5j21o3J83J29r8k82L20k92O08n71r8L02k48R9K17l44J51j69J41J12q8n0
8040f7J71j88K01k93M7J45J95K1l40l6Q2q3Q2K69k76J73l71N0K48Oj80J84M1J39
8064B20j97k9K77m28M02k30j00j9J32K9l30L59k18N3j60K54p2k36J97L38m6k32
8086c6N9J67K2N6p5j04j98L00q7o3j3L7O0j38L4J25l73l1J68L4O9k7j31J6K9N2
8112d8K04Q3l22k6K71l6j12J4J44N6j97o0P0q8o6P7m2P8M9j03Q7p8r5j21K36K1
8138dj28J04k89K67q6L22j6o9j64%J23R0k86K54j03n6K31q8n2k02K03J15j37j4
8162A5l6M41n10M5J2k4K26k37J05j01M6p6k9L14k70m7J43M3M4R1k36j07N2J3K22
8187A39n3r9o4M5
$$ plain form
8018 95 -26 -89 94 223 125 -157 163 -129 479 -92 -190 112 -136 -37 180 -164 -13 -182 -41 71 -17 -67
8040 -67 104 -84 117 -176 -129 16 211 232 -108 -144 -62 -145 -63 206 -70 103 -268 -218 30 36 -144 40 81 220
8064 220 23 -6 271 -157 245 15 -85 -104 28 57 -273 86 -132 -79 -239 15 -57 -293 -96 242 196 -36
8086 -36 23 190 212 268 193 89 -109 191 104 41 28 65 125 -13 21 146 -227 -258 -90 -56 13 -14 -145 -129 -100 -48
8112 -48 156 239 -83 -109 162 126 14 28 172 228 31 -29 41 -47 -113 -36 -78 0 49 -54 33 -45 -140 -261 -25 -4
8138 -4 -132 -28 -317 -50 -136 186 170 101 -63 -63 60 150 -136 118 15 -41 190 102 50 -152 51 166 29 15
8162 15 -21 420 -90 -45 -33 -57 169 -68 37 -64 -18 -94 -123 191 -79 -126 17 60 104 195 -41 -148 -96 -83 139
8187 139 86 -13 -77 -32
8191c2
$$ Imaginary data points
##PAGE= N=2
##DATA TABLE= (X++(I..I)), XYDATA
0@%%%%%%%%%qJ6j6J6k4L2l9M7n6P2q8J04j20J44j76K07k39K75l16L68m24M82n54
32b97O34p16Q08r11J025j150J285j435J600j780J977k192K425k680K959l264L599
49A887l964M364m809N302n848O458p142P917q804R828j1028J2456j4188J6344
63H773j9113K2817k8051L6072n0046Q1261k78763Q1444M18425k79117J2861K10969
75B17532p6437k31354L0598k7161J9250J44967l2873j78408J43983J46565j17910
86C8752j3721Q5841k11553j22943J76013k8764j21789L43335K65392l21666k30239
97a41342J86259k7808k17716P5250J77179K0821K1219n6050j25270J08392J27696
108A48630k10760j25902J82726r872j52619J79193J98038j04034r704O6594k47044
$$ plain form
0 0 0 0 0 0 0 0 0 0 0 -8 8 -8 8 -16 16 -23 24 -32 40 -48 56 -64 80 -96 111 -128 147 -169 199 -225 257 -297
32 -297 337 -379 429 -482 543 -607 678 -757 843 -937 1040 -1152 1273 -1407 1552 -1712 1887
49 1887 -2077 2287 -2522 2780 -3068 3390 -3752 4165 -4639 5189 -5839 6617 -7571 8773
63 8773 -10340 12477 -15574 20498 -29548 51713 -227050 -145606 272819 -6298 6563 217532
75 217532 141095 -90259 -59661 -86822 -67572 77395 44522 -133886 10097 156662 38752
86 38752 25031 110872 -100681 -223624 -47611 -76375 -198164 145171 410563 88897 -141342
97 -141342 44917 17109 -200607 -125357 51822 72643 93862 37812 -87458 20934 148630
108 148630 -62130 -188032 -5306 -15178 -167797 11396 209434 105400 95696 162290 -84754
119h4754j90405K05044J10397j15416R5667J63045j02650j14389K898n2248K1632
130f1179J05510r4280r1861K00032J00720j58671L5454J55755j52425j96433N6201
141a01177J3423m3252J65699J28152j06341k7683N0887j34077j03429J09933M9228
152A363l2131Q2678L2676q1594N3185O9469j37443q0252Q6726n4065j09915J24480
164d4823J39866l5324J5878M0546j28143r8072N7200n070k3528J29874P4532q2103
176D0833l008M0196r4396n7429N7560l4864o2619Q5166O6431l0052N4352O2803
188A24973r2918p7996K0987m5727l8234J10262P9857l5221J9533K5803r7323o7219
200g3223L3503j9656l0340P4014M9147k7201L7401N1078n3048n0357K450m5359
$$ plain form
119 -84754 -275159 -70115 40282 -75134 20533 183578 80928 -33461 -30563 -82811 -61179
130 -61179 44331 -49949 -141810 58222 158942 271 35725 191480 39055 -157378 -101177
141 -101177 -87754 -131006 34693 162845 56504 28821 79708 -54369 -157798 -47865 1363
152 1363 -30768 51910 84586 2992 56177 125646 -11797 -92049 -5323 -59388 -169303 -44823
164 -44823 95043 59719 75597 116143 -12000 -110072 -52872 -57942 -81470 48404 122936 40833
176 40833 37825 78021 -16375 -73804 -16244 -51108 -113727 -28561 37870 7818 62170 124973
188 124973 32055 -45941 -24954 -70681 -108915 1347 81204 45983 65516 91319 -6004 -73223
200 -73223 -39720 -59376 -89716 -15702 33445 6244 43645 94723 41675 -8682 -6232 -51591
212e1591l4403O0092M2204n30N6673K8414q8236o0184J6723l0642l5530O1421
224c5589O1207J763K5409K3615m1036l0802p18m3459l4073L8756L2592N570M0349
237D3584K6835l8280l1708j4043n1443k4027N3349M0244M370L8638L6962l0503
249E3978m3255j6533k7862k2040J4261J7824J7903M0270K0845k3409j9877j2517
261d12l8068k6534J9893K7066K1682L9270K5135j5770k3197k0799l6688k8397
273e6819P053J9642J9397K9936K2304k217j3152k0444l2114k0017N772J3924K0744
286e991L4089K5539j395j5187k2990l2375k6625o567R314K1588L0383K2869P437
299D0089n219j7670k8196k2510n171Q168J8429K5831K4088R903p776k1313k7888
$$ plain form
212 -51591 -85994 -25902 16302 15772 72445 100859 12623 -47561 -30838 -61480 -97010 -35589
224 -35589 25618 27381 52790 76405 35369 4567 3849 -39610 -73683 -34927 -2335 3235 43584
237 43584 70419 32139 431 -13612 -65055 -89082 -35733 4511 8881 47519 84481 53978
249 53978 10723 -5810 -33672 -55712 -41451 -23627 -5724 34546 55391 31982 12105 -412
261 -412 -38480 -65014 -45121 -18055 3627 42897 68032 52262 29065 8266 -28422 -56819
273 -56819 -49766 -30124 -10727 19209 41513 39296 26144 5700 -26414 -46431 -40659 -26735 -5991
286 -5991 28098 53637 52242 37055 14065 -18310 -44935 -51502 -42188 -20600 9783 32652 40089
299 40089 34870 17200 -10996 -33506 -38677 -30509 -12080 13751 37839 47742 39966 18653 -9235
312i235k3948j3951J264J7389K7329K5149J3579Q02j2135k2701k3633j3458L41
325c3208J3962K1575K2109J4182N87j4864k4375k4264j5684m097J0265K3977K5640
338A5805J7481O611o978j9531k2548j6142p606M797J9116K2754J5019N106n988
351B7896j8142k2565j9430j1108P334K3466J9738J3803J7215M374k1932k6069
363e420j1383q521o363J1548K0553J7350J3337J41j8237j7618j2217j8006o142
376d0978K0455K3007J4411J8583N713j9819j6286r183k3453j3366K2030J9397
388E11J599J4529J6356j1503j7625j1063k0454r551J7324J2087O955L1528J8701
401D9394k2691j9460n456k5820j7424J9261J3317K092K5572J6189k2329r001P029
$$ plain form
312 -9235 -33183 -47134 -45870 -28481 -1152 23997 37576 38378 26243 3542 -20091 -33549 -33208
325 -33208 -19246 2329 24438 38620 39207 24343 -32 -24296 -39980 -44077 -33812 -9835 15805
338 15805 33286 39897 32919 13388 -9160 -25302 -32908 -28111 -8995 13759 28778 33884 27896
351 27896 9754 -12811 -32241 -43349 -36015 -12549 7189 20992 38207 42581 20649 -5420
363 -5420 -16803 -25324 -31687 -20139 414 17764 31101 31242 13005 -4613 -16830 -34836 -40978
376 -40978 -20523 2484 16895 35478 41191 21372 5086 -4097 -27550 -40916 -18886 511
388 511 2110 16639 32995 21492 3867 -7196 -27650 -37201 -19877 -7790 -835 30693 49394
401 49394 26703 7243 1787 -24033 -41457 -22196 -8879 -6787 18785 34974 12645 3644 10673
414A0673k4160k2688J6848R012k904L0690K5686j6682q450J63l6658k8315J9274
427b7511J1064N37L3937K0636k4604o295Q467l0727j9199K5886J889j5484L0044
440H640K4670k0367N174J8222m1044l9099J8352M624j2640L6485L6796j2014m964
453B2835k732m1697j3007L3258q585j8904M3882K3070l8425L134L1477l0485k8877
466b5056J8662j8460k7793M6946M1346k1723Q031K6295m0225m3523Q458k11O296
479b0957M6058K651l5948K7373K3075o1818k1755N6227q899n2576K5225L6177
491A4833j2771K1315K9777m0190k9708J6238k7525l0918N0535M3390j2910O474
503B8540k483m8131K48L4344l8932k2115P2676J3926p0915J7188P1188k1764m1455
$$ plain form
414 10673 -13487 -36175 -19327 -10315 -13219 17471 43157 26475 18025 18188 -18470 -46785 -27511
427 -27511 -16447 -15910 18027 38663 14059 7764 16231 -14496 -33695 -7809 -5920 -21404 8640
440 8640 33310 12943 18117 36339 -4705 -43804 -25452 -20828 -33468 3017 39813 27799 22835
453 22835 20103 -21594 -34601 -1343 -9928 -28832 15050 38120 -305 2829 34306 3821 -25056
466 -25056 -6394 -24854 -52647 -5701 35645 13922 21953 48248 8023 -35500 -27042 -27253 -20957
479 -20957 25101 27752 -8196 19177 42252 -19566 -41321 14906 6007 -46569 -21344 14833
491 14833 2062 23377 53154 12964 -16744 -506 -28031 -58949 -8414 34976 22066 28540
503 28540 26057 -22074 -21826 12518 -26414 -48529 24147 38073 -32842 -15654 55534 33770 -7685
516g685J0693j8364k8887K6269J2799n531N1487K6325o5820l2813K5216k0813
528b7124j3311N2804P505l2783L7540K0422o7464k816O9651k6771p1594K2209
540c1732L4223j4617J8324L0040j3543Q4n347o6800j9039P3033J8263l4290L5529
553B4128K9209n5918j8579L2171k5280j7477M8490p656n5280L4557N6500k5910
565A8955j5807K3056k6893l5166J0971m472O034O9159J7721o6903n392L3883m7525
578b2379l4712N5888K0155l2250J8283J6691l3367J4033L9084l6930l6808K7196
590e116o070k8930L8538L9211j4457M745J468o0472k1056M7968q59k3213M7926
603A9683K8543m8699j1531K9164j8845j4539K5209j5807k9552L3698K3432k2363
$$ plain form
516 -7685 3008 -15356 -44243 -17974 -5175 -10706 40781 67106 1286 -31527 -6311 -27124
528 -27124 -40435 12369 19874 -12909 24631 45053 -22411 -25227 44424 17653 -53941 -31732
540 -31732 2491 -12126 6198 36238 22695 22779 17432 -49368 -68407 4626 22889 -11401 24128
553 24128 53337 -2581 -21160 11011 -14269 -31746 16744 9088 -46192 -11635 44865 18955
565 18955 3148 26204 -689 -35855 -24884 -29356 -23322 45837 63558 -3345 -8737 25146 -22379
578 -22379 -57091 -1203 18952 -13298 4985 21676 -11691 2342 41426 4496 -32312 -5116
590 -5116 -11186 -40116 -1578 37633 23176 27921 29389 -31083 -52139 -4171 -5030 -28243 19683
603 19683 48226 -473 -12004 17160 -1685 -16224 8985 -6822 -36374 -2676 20756 -1607
615a607J9260K8839m3079l7012J5749q394q627M9533K4740l1066N414J4206m3424
628a5468j9161L7691j202k4155K4680J2800k4195J6571K6658k9037j7919J5532
640B795k3376k4525L8280K8827j1810J5471J2325m1865k3545J9684q353r987L5097
653I018J2836k4883Q827J7651k5621q362J9870j8268k4032K3972J5262r042K1386
666A8614K0243k8359j9649N413k0040j1476L3366J7599j1968J2386R389k7248
678a730j0735J4137j2104j1984K1193N326j3070J9656J9705j9115j1731N688j9913
691a4677j7539J8602J3325r2K0121R818k3626j0871N703j5385r991K0200Q711
704D299p275J3544J0358j3765m149N412j8045j5015J2333O222j732J8490J4411
$$ plain form
615 -1607 17653 46492 3413 -33599 -17850 -26244 -34871 14662 39402 8336 13750 27956 -15468
628 -15468 -34629 3062 1860 -22295 2385 15185 -9010 7561 34219 5182 -12737 2795
640 2795 -20581 -45106 -6826 22001 10191 25662 37987 -3878 -27423 -7739 -16092 -26079 9018
653 9018 21854 -3029 5798 23449 -2172 -10534 9336 -8932 -32964 -8992 6270 -2772 18614
666 18614 38857 10498 -9151 -3738 -23778 -35254 -1888 15711 3743 16129 25518 -1730
678 -1730 -12465 1672 -10432 -22416 -1223 4103 -8967 10689 30394 11279 -452 5236 -14677
691 -14677 -32216 -13614 -289 -381 19740 29558 5932 -4939 764 -14621 -24612 -4412 4299
704 4299 -2976 10568 20926 7161 3012 8424 -9621 -24636 -12303 -6081 -7813 10677 25088
717B5088j1157p625k571j7361r674J3264O492j68J5472R410j2220n196J679j3502
731h069j0608P516L337n60J5186J1577n823k250j326j6141j1598N545L721K339
745g154J4970J0274n175m082k733j3157q498L481J350K541J3061R341k422k60
759A1537j858j2305j0405M22n1L356J2384R464l73K70l000j2038j0064r21J540
774a2042L740R243Q486L458J052l965j0648q131k184j683J271R978J0032L473
788A2080O97l080q179q335m993k010L291Q556Q542M720K019k055p457q510n842
803a0556k864K320P507P357N765L430j070p108q825n558k615R00N379Q424P054
818I540L539j387n815p382o602m032l16N455P918O355M149N79m354p544p064m535
$$ plain form
717 25088 13931 6306 3735 -13626 -23300 -10036 -3544 -3712 11760 21170 8950 3754 5433 -8069
731 -8069 -18677 -11161 -7824 -8384 6802 18379 12556 10306 8980 -7161 -18759 -13214 -9493 -7154
745 -7154 7816 18090 12915 8833 6100 -7057 -15555 -12074 -10724 -8183 4878 14219 11797 11537
759 11537 9679 -2626 -13031 -12609 -12660 -9304 3080 12544 12171 12441 9441 -2597 -12661 -13582 -12042
774 -12042 -8302 941 9427 12885 13937 9972 -676 -8807 -10991 -12674 -11403 -1425 8607 12080
788 12080 12777 9697 1518 -6817 -11810 -13820 -10529 -1973 6569 11289 13308 11253 3796 -4714 -10556
803 -10556 -13420 -11100 -3593 3764 9529 12959 11889 4781 -4044 -9602 -12217 -11317 -5938 2486 9540
818 9540 13079 11692 5877 -1505 -8107 -12139 -12455 -7000 918 7273 11422 12001 7647 103 -6961 -11496
834a1496j28M262O348P013N480J148m577o826o455n301j788L658N958P032O407
849A0735J771l749o064o147o163k713K941O614N925O014K514k525m902o179p176
864i104l605L670M941M644O927M740k106m690n532p223m391K331L658M467Q445
879G172N124k828l905m194q091n384K660L396L593Q287N508k424k769k214q501
894d570n840J528J126K420J0109O668k346j962j157j0124q004L006J857K180R794
909D685N866l316k02n0j0138o740L114J0q60Q536O754p18K971M88j3078p700L921
926f457j910k551J1917J0607k832o56o08j0533n208M103l729k947J2648O781o105
941B520K813O013q201q054Kn961k399J3494P377m738P172O023j4978j2632M776
$$ plain form
834 -11496 -11624 -7362 -1014 5999 11479 12627 8050 1224 -5231 -10532 -12320 -8662 -2704 4328 10735
849 10735 12506 8757 2693 -3454 -9617 -12330 -9389 -2775 3150 9164 11678 9153 4251 -1928 -9104
864 -9104 -12709 -9039 -4098 546 7473 12213 10107 5417 -115 -7338 -11729 -9398 -5740 -1273 7172
879 7172 12296 9468 5563 1369 -6722 -12106 -9446 -6050 -2457 5830 11338 8914 6145 3931 -4570
894 -4570 -10410 -8882 -7756 -5336 4773 11441 9095 7133 5976 -4148 -12152 -9146 -7289 -5109 4685
909 4685 10551 7235 7033 6983 -3155 -9895 -6781 -6771 -7631 905 7659 6941 9912 10400 -2678 -10378 -6457
926 -6457 -8367 -10918 999 11606 8774 8118 7510 -3023 -8231 -4128 -7857 -10804 1844 8625 2520
941 2520 5333 11346 3145 -4909 -4907 -10868 -13267 227 7604 2866 10038 16061 1083 -11549 -6773
956f773q10j815J0762M246m301P135L826j4291m449R370o214j1828R062Q805q81
971A844Q361M599j2647m937L587j2905q020J8849J1728p422L099N511j0819m948
985d120M528q398l470J4642L2j2168J1197J4704j0100p614L519r989q779J0524
999e492L352j284J6838P802k0636q423R448p050q498J2097N842n812P562L508
1013I254j2296L757J1757j4291j4601J0819M393p057J2183J2043p904k679R5j8129
1027a2656p441J9459M719r496J1517R714j5010n132Q385o683n281J0307n166j1607
1041a4371J5246J3046j0580M56R542j4322j4826P278J872j929J8594P668j6595
1054A079j382Q223j4342q607J5852K800j0245P186N686q617N775J0847j3572r940
$$ plain form
956 -6773 -7583 -9398 1364 5610 1309 8444 12270 -2021 -6470 2900 -3314 -15142 -6080 2725 1844
971 1844 10205 14804 2157 -2780 807 -12098 -20118 -1269 10459 3037 6136 11647 828 -4120
985 -4120 408 -7990 -11460 3182 3214 -8954 2243 16947 6847 -767 2752 -7237 -16016 -5492
999 -5492 -2140 -3424 13414 21216 580 -7843 1605 -5445 -13943 -1846 3996 -1816 5746 9254
1013 9254 -3042 715 12472 -1819 -16420 -5601 -1208 -8265 3918 15961 8057 5378 5473 -12656
1027 -12656 -20097 -638 4081 -5415 6102 15816 806 -4326 4059 -2624 -7905 2402 -2764 -14371
1041 -14371 875 13921 3341 3797 13339 -983 -15809 -8531 -6659 -8588 10006 17674 1079
1054 1079 -303 7920 -6422 -15029 823 3623 -6622 564 6250 -2367 3408 14255 683 -9257
1068i257Q337n494j0161J6054J3934p243J300L940j7650r065J3012j07o355J4574
1082E819O854j4693R7J0708q755n293Q967o973j1039J1516Q126o309Q652J0002
1096A7679j5639j2394O505l989n754J6347R378r753J511N539j3258n456J1517
1109B233k551r212R313L631q247P413J1021r444o602M713q960r611J2715R644
1123F056m676O975N402j4395q115P841l750n183J1634M348r304M374P865q385
1137F87k122P627q344j0154P650M814m035R308Q827r528o697K972q421o063J2340
1152a139N794n671N277N569r695l127O124m701o482O849N72n572Q172Q824o444
1167D350k723L302q706q262O435M786j876Q346N234q094l604L419o245m990P196
$$ plain form
1068 -9257 -920 -6414 -16575 -521 13413 6170 7470 11410 -6240 -15305 -2293 -2400 -8755 5819
1082 5819 12673 -2020 -1923 8785 30 -5263 3704 -3269 -14308 -2792 5334 -975 7677 17679
1096 17679 2040 -10354 -3849 -7838 -13592 2755 12133 2380 3891 9430 -3828 -9284 2233
1109 2233 -318 -9530 -217 3414 -4833 2580 13601 4157 -2445 2268 -6692 -16303 -3588 6056
1123 6056 1380 8355 13757 -638 -8753 -912 -4662 -9845 1789 6137 -3167 1207 9072 687
1137 687 -1435 6192 -2152 -12306 -4656 158 -3877 5431 14258 4730 -1967 1005 -7416 -13479 -1139
1152 -1139 4655 -1016 4261 9830 135 -2992 3132 -1569 -8051 -1202 -630 -6202 1970 10794 4350
1167 4350 1627 4929 -3777 -12039 -5604 -818 -2694 5652 10886 2792 -812 2607 -3638 -8628 -1432
1182a432J910m469N014N658m436Q8L915p082o930L925J90k147Q013P252m356j957
1198C156R83p021n670N209J408j858N897M142m003l7K285m849m799K397o47k489
1214e896N940N627j870O46J241o234n711K209j54r81O003M611j828k42J241n115
1230e13l720J526o19j438M594L904j005J578J539m646m718K64j379r83M343M190
1246B917N32J138L41m043l586k8j457o42L715L374K79J634R46l232l077j170j870
1263d229j532L419L340J575J725R78k628l628j361j815q99K784K786J440K028
1278C983Q73k274k771j689k365r17J857K812K119K432R42j464k824k266j999j213
1294d764J306K510K097K184J278j140k134k309k345j506J281K093K280K134J738
$$ plain form
1182 -1432 478 -3991 1023 6681 2245 2333 6248 -834 -7764 -3839 -3649 -5796 2217 9469 5113 3156
1198 3156 4139 -2882 -8552 -3343 -1935 -3793 2104 6246 2243 2206 4491 -358 -5157 -2760 -3407 -5896
1214 -5896 44 5671 3801 4447 5688 -546 -6257 -4048 -4202 -5183 820 5431 3603 3361 4602 -513
1230 -513 -4233 -2707 -3326 -4764 -170 3734 2729 4307 5846 1200 -3518 -3254 -4633 -5616 -1273 2917
1246 2917 3449 4587 4928 885 -2701 -2729 -4186 -4828 -1113 2261 2540 4174 5120 1888 -1189 -2359 -4229
1263 -4229 -5761 -2342 998 2573 4298 5276 2648 -980 -2341 -4156 -5055 -2271 515 1955 3983
1278 3983 4856 2582 -189 -1878 -4243 -5160 -3303 -491 1628 4060 5002 3538 714 -1552 -3551 -4764
1294 -4764 -3458 -948 1149 3333 4611 3471 1337 -972 -3317 -4823 -3542 -1449 831 2965 4703
1309D703p73k098k400k377j305J31J695K835K433J735p21j620k148k919j407J92
1325d044J902J760K864J605K11j075k692k345k492NJ382K174K290J838M86p50
1341C119k101k632j989k70P31J659K801K496J50p38j374l012k480p10P52J743
1357a855K658K215Q99n68j238k719k499n71O89P06K603K836M05j47p61k863k476
1374b686p14j56O42K865L013L25j2k6k687l118j236M68R30K149K486P16N90k41
1392C308k530k718m88j117q7K383L011O11J617K43l605k464R3j480j514L182L827
1409B272N68j2L08k174j735r91j983l61L337K137q96K104K528k954k829n5k713
1426c449j291L040K707k48K135K497l416m092K76r40r18J970J476J029K807R87
$$ plain form
1309 4703 3930 1832 -568 -2945 -4250 -4119 -2424 411 2844 4579 3858 2238 90 -2829 -4236 -4044
1325 -4044 -2142 -382 2482 4087 4298 3223 531 -1814 -4306 -4301 -2919 -745 1545 3383 3869 3119
1341 3119 1018 -1614 -3603 -3873 -3142 -1483 1318 3814 3964 3226 1852 -1160 -3640 -4350 -3598 -1855
1357 -1855 803 3018 3917 3349 2111 -608 -3107 -3678 -2989 -2283 320 3156 3561 3414 2653 -210 -2686
1374 -2686 -3400 -3556 -2914 -49 2964 3289 3277 3251 564 -2554 -3790 -3322 -2392 -243 2243 2959 3549 3308
1392 3308 778 -1940 -2428 -3545 -3632 -1249 1762 2373 3990 4233 628 -1836 -1743 -3223 -4737 -1555 2272
1409 2272 2840 2828 3136 962 -773 -1764 -3747 -4108 -771 1366 470 2574 5102 2148 -681 -736 -3449
1426 -3449 -4740 -1700 1007 759 2894 5391 1975 -2117 -1841 -2781 -3699 -1729 -253 776 3583 4570
1442D570l884r33J840l163m516L059L463p08K059L218k215k939L7l006k991M370
1458a739K787n75J474J929j899j404O8l165j639L927l23l137M786N473l594l240
1474b71J779k246m550J910K172M36M145K404l974j864J515l397l158L801J025
1489b73k168L843J926l338R40L995n216n412L316J856k819L248N826j614j967
1504B143j26m938k338L950N36k328M761K957m334o85L737l300l235L487j536l762
1520e011M495N098l317N2L847m447n614J378O28m44N075K994l885N01K040n056
1536a666k357M914m33m447L376L178l280J723M610m375m327K392j792l585M832
1551a237N590k225Q63J753n653l532L749l89k583N198K219n250R63M581l339k612
$$ plain form
1442 4570 686 -247 1593 -1570 -6086 -3027 436 -272 1787 5005 2790 -149 -112 -3118 -6109 -1739
1458 -1739 1048 473 1947 3876 1977 573 641 -2524 -4163 -236 -559 -3696 1090 6563 2969 -271
1474 -271 1508 -738 -5288 -3378 -1206 -770 3375 5779 1805 -59 1456 -1941 -5099 -1298 -273
1489 -273 -2441 1402 3328 -10 930 4925 -291 -5703 -2387 -531 -3350 -102 5724 4110 2143
1504 2143 2017 -2921 -5259 -1309 -773 -3101 1660 4617 283 -402 3335 35 -3200 287 -1249 -5011
1520 -5011 -516 4582 1265 1317 5164 717 -4897 -3519 -2891 -3335 1740 4734 849 1350 3390 -1666
1536 -1666 -4023 891 458 -3989 -613 2565 -715 1008 5618 1243 -3084 -692 -2484 -6069 -1237
1551 -1237 4353 2128 2991 4744 -909 -4441 -692 -1081 -3664 1534 3753 -1497 -534 4047 708 -1904
1567a904L334k369m589L599L956k154L050L843n296m258J834j794k584N842K902
1582C412l527J208K779m788k084M545j577l956L385J432l209L068N093l567k313
1597i9J651l838m216M595L376j846L061K583n087k880L396j857k635M054J796
1612B054l637J800L399k773o96L100l649m402K893J100j720M052L996l577k525
1627e85J570l280k600M549J679k496K399K736l761j197L339k243l191K296j13
1642h98k537L608L867k219p05K088l840l887K606J639j360L575K229l404j047
1657b85J981k801k257K714N34k751K207L104k036O35K509l069l369J500J6j749
1673c117L396L093j603o27J139l108k533K387K73j058J990J836j387k35K337j992
$$ plain form
1567 -1904 1430 -939 -5528 -1929 2027 -127 2923 6766 1470 -2788 -954 -2748 -5332 510 3412
1582 3412 -115 1093 3872 -916 -3000 1545 -32 -3988 -603 829 -2380 688 5781 2214 -99
1597 -99 1552 -2286 -6502 -1907 1469 -377 2684 5267 180 -2700 696 -1161 -3796 258 2054
1612 2054 -1583 217 3616 843 147 3247 -402 -4804 -1911 -811 -2531 1521 5517 1940 -585
1627 -585 985 -2295 -4895 -346 1333 -1163 1236 3972 211 -986 2353 110 -3081 -785 -898
1642 -898 -3435 173 4040 1821 1116 3204 -636 -4523 -1917 -278 -1638 1937 4166 762 -285
1657 -285 1696 -1105 -3362 -648 -114 -2865 -658 2446 410 1045 3554 485 -2884 -1384 -1368 -3117
1673 -3117 279 3372 1769 1142 2281 -827 -3360 -973 -700 -1758 232 2068 681 446 2783 791
1689G91k493J480r47k048K316K536p14P64J399k888k609J060k3j454K857K113
1705B140j260p8J740k155j635J133j328j057J576J349k18P35J575j428k093N21
1721d83j057j275K143J900m14R65R33j679j806L16q17j233J492J378k28P40J384
1738B259j219j177K72j526j050J385J331k35J236J318j132j647k35p00j176R36
1754a360J123j51J364Q04n12r22l67q04j184Q67Q11L81J111J085o49j127J73j611
1772i68j092O32P11K68J335M69j50j45o04q11j320L15M14M44J103J031jm78q18
1791C35j059p90q7M65L79J166J053N09p60n31q49q82m79M30L56Q99J078K77j57
1810A353n38j157j033l09L08M46R42J097L59J15n06j040o71q43P0L82O64J025
$$ plain form
1689 791 -1702 -222 -1169 -3217 -901 1635 921 1685 3084 196 -2413 -1353 -1376 -2830 27 2140
1705 2140 880 802 2542 387 -1248 -115 -1443 -2500 -924 425 207 942 2517 1089 -1004 -483
1721 -483 -1540 -2815 -672 1228 814 1779 2712 1033 -773 -457 -1274 -2507 -1015 363 135 875 2259
1738 2259 1040 -137 135 -1391 -2441 -1056 275 40 1276 2594 1462 -185 -420 -1120 -2296 -1360
1754 -1360 -237 -388 976 1780 1268 346 -21 -825 -2009 -1142 -331 50 1161 2246 1597 470 643 -968
1772 -968 -2060 -1428 -717 -449 886 1355 1205 1060 456 -355 -1675 -1360 -946 -502 601 1632 1631 1153 335
1791 335 -724 -1514 -1601 -1136 -757 409 1462 1971 1211 680 -169 -1051 -1530 -1100 -744 155 1233 1510 1353
1810 1353 815 -342 -1375 -1684 -1376 -930 12 1109 1468 1583 1077 37 -634 -1477 -1407 -1025 -361 664
1828F64R45k61k63j240q66l40P0K25Q72J012O84K38m92n90r79j135n7K03P72J040
1848E02P90K22k69n95q99r25j77J72O08Q99P45N51K44j346o34o49l60m18Q48R16
1868B25M34M65K47n52r73o86m37j62K45J190P73P75K14p44r18l30r81q22J051
1887i86J087J49N49N54m8j091j76j001n38K80J023N82L75Q28l64q14p36j074l56
1906a757N83M00K82J619R38j021j283L70n24j139L14Q79M08O38R56o77k89k27
1924D70j217j184O85M89M84R43J347j073j12Jj587j221Q89J397j110R42J310M3
1942A496r88l46p52m48M41n17j0J440J408n04j68K77j263j873L36N41p0J483J442
1961A925j004o58O66r08j477L70N67m92J152O56k69L60R39j602j725Q17L2j566
$$ plain form
1828 664 1609 1348 1085 -155 -1021 -1361 -1291 -1066 -194 818 1502 1740 1248 658 -321 -1456 -1513 -1310 -538 502
1848 502 1292 1514 1245 650 -249 -1174 -1351 -1179 -571 328 1073 1624 1868 522 -112 -761 -1121 -1539 -691 225
1868 225 659 1124 1371 819 -154 -840 -1277 -1439 -1194 -4 769 1544 1758 1014 96 -234 -1215 -2037 -986
1887 -986 101 250 799 1353 1305 214 38 -963 -1501 -1221 -198 384 759 1587 1223 409 -327 -1401 -1757
1906 -1757 -1174 -774 -492 1127 2065 1044 -239 131 -393 -1532 -1218 -339 69 707 1663 986 697 470
1924 470 -747 -1931 -1246 -757 -273 670 2017 944 832 833 -754 -1975 -1086 311 -799 143 1453 1496
1942 1496 508 162 -590 -1038 -597 -1114 -1124 316 1724 1220 1052 1329 66 -1807 -1471 -930 -1000 483 1925
1961 1925 921 263 929 21 -1456 -1086 -519 -1011 141 797 528 888 1827 225 -1500 -683 -651 -2217
1979b217J930J793o22J09L04j715j197J032J04q96J416J416q65j91J018j016q61
1996d58L64r40j161J780J551q24O62J513k219j759N42K09p50J298J594r12J96
2013F86J023j563j058R41m80j306R03J177n80R18J556j556j337M79n48j508J730
2030e23J648n67M43O59j403j707J442l25j141J429P15j408J109J503j212j009
2046c47J120j164j917J218J604p94J362J390j924j147M21q66q93J578J216j138
2062b81O45J147j185o28J366j119j295R90N71j344J243J924j091p40L21j297j603
2079b376J414J258n35J066J353j727r14J127r92j108J414M46j202P88J477j131
2095C58j71J168j358j773Q83M44m73J241J744j367o73R20j628j175J553N56q93
$$ plain form
1979 -2217 -287 1506 884 993 1297 -418 -1615 -583 -479 -1375 41 1457 592 401 1419 403 -458
1996 -458 -94 -1034 -2195 -415 1136 312 974 2487 268 -1491 -949 -740 -1490 -192 1402 490 686
2013 686 1709 146 -912 29 -451 -1757 -854 323 -257 661 2217 661 -676 -197 -745 -2253 -523
2030 -523 1125 558 1001 1660 257 -1450 -8 -333 -1474 -45 670 -738 371 1874 662 -347
2046 -347 773 -391 -2308 -1090 514 -280 1082 2472 548 -599 -178 -1044 -1937 -359 857 -281
2062 -281 364 1511 326 -302 1064 -55 -1350 -360 211 -1133 110 2034 943 203 524 -773 -2376
2079 -2376 -962 296 -239 827 2180 453 -461 666 -326 -1434 -20 426 -776 12 1489 358
2095 358 187 1355 -3 -1776 -893 -449 -922 319 2063 696 23 943 -685 -1860 -307 249 -644
2112f44J032R72j218l08J063o57j285M90o1o91J212J454p01o3Q43j795j086J017
2130d26j83l67J448Q22j131l43J097r75r85J064j47j111J030J178p48J23J004
2147A350r89j065K25k11p97J477J104n86l7K87r29q06P18j39k73P11P41q29K2
2166b6J166o52q18J90l98r49J031J035o16O66O53j285p67O02l74k82R96M57o38
2185iK89M73o13m07N21m78o89M44P88l41P46K39o92l38l9m46p34Q03O63j29K30
2206B81Q29r76l44L22m82m84N62M66m11M43M75l61q4m7p00k74K09M99j04L13N10
2227F42n13j53j2k77k77M65Q2rN20rm17k4L74n79j57r9M7J10N15K19J45k35k76
2250H2m34l3j15J95K67L23L42j4n35J35l13l21L14j25J6K65R5K25j70J32k85k41
$$ plain form
2112 -644 388 1360 142 -166 897 240 -1045 -555 -616 -1307 -95 1359 658 595 1438 -357 -1443 -426
2130 -426 -609 -976 472 1294 163 -180 917 -58 -1043 21 -126 -1237 -207 971 223 346 1350
2147 1350 361 -704 -479 -690 -1487 -10 1094 508 471 758 -171 -977 -259 -398 -671 40 781 -48 -26
2166 -26 1140 488 -330 -140 -538 -1487 -456 579 -37 629 1282 -3 -770 -168 -542 -824 172 629 -9
2185 -9 280 753 140 -267 254 -224 -913 -469 319 -22 724 963 271 -67 -106 -552 -1286 -483 180 51 281
2206 281 1110 134 -210 112 -370 -854 -292 174 -237 206 681 320 236 189 -511 -785 -576 -77 -181 132 642
2227 642 129 -24 -36 -313 -590 -125 -43 -52 468 459 42 18 392 -187 -344 -443 -396 -286 229 448 593 358 82
2250 82 -352 -385 -500 -305 -38 285 627 613 78 213 -100 -421 -107 -232 -216 49 144 369 199 331 46 -195
2272a95k21K29JL64J79J71m11M06o32r2O3j65L44L2P6J00o6K8m42j62J78j22k4
2295c61N32J62J31J38l58k79j06k20j1L2M98L03k04O9J52l43m59j74J25N88m11
2316a96J82L21R2o6k40j99k01J72J0j20L12J9K74j60j75q5m26K02k04K52J21K40
2338A25K91k34J11k69l76J21K19N2k05P07k75O6k2l43l84K53N5O9j41L51K41j25
2360B87pl75Oj76o0K59O1R0J3K72j75j65k9n4k58J28L15j61M49k08K19m83K52
2383B00m64k05L48J39n5N08j92R5n48J3L1m9n5l3K72K47k26PL97k16n52J14N9
2406a65K72m5KL57k55j77k74R4j15P0O4K89QO8o5j77L95p47L8L89r9k2J29K19
2430B53l41L07k97r7P4o0M03n02M28j00j47K44J18j84m67L36J91j72K02j56R7
$$ plain form
2272 -195 -416 -187 -186 178 357 528 117 523 -109 -201 -138 -303 41 73 149 249 183 211 -231 -393 -215 -337 -361
2295 -361 171 333 464 602 244 -35 -141 -361 -372 -340 158 461 257 326 478 135 -324 -498 -373 215 -196
2316 -196 -14 307 399 333 93 -106 -307 -135 -125 -245 67 86 360 200 25 -60 -486 -284 -488 -236 -115 125
2338 125 416 182 293 24 -352 -231 -12 40 -165 542 267 333 311 -32 -416 -163 -108 -39 -180 171 412 287
2360 287 280 -95 -89 -265 -325 -66 -5 85 98 370 195 30 1 -53 -311 -183 132 -29 420 212 431 -52 200
2383 200 -264 -469 -121 18 -37 471 279 374 -174 -161 -130 -179 -234 -267 5 252 26 33 430 214 -338 -224 -165
2406 -165 107 62 64 421 166 -11 -285 -191 -306 -236 -172 117 125 193 128 -49 346 -401 -363 26 -73 -95 34 253
2430 253 -88 219 -78 -175 -101 -161 242 -260 168 68 -79 165 283 99 -368 -32 159 -13 189 33 130
2451A30n1j23Rj72j4R0M0J65J72k28L38n38J66k83K38N3k61L18K29k76O2K46l19
2474il63K23l4M0J64k0K37J1J43k08n43K96o5j81L58lJ68j7n05J95p0M84l80k37
2498c16R9K66J2j51K77j02J02l17j10j92M70J03K2q1K84j16m30K26r3o5J54k10
$$ plain form
2451 130 79 -44 -35 -207 -221 -131 -91 74 246 18 356 -182 -16 -299 -61 -8 -269 49 278 2 64 310 -9
2474 -9 -372 -149 -183 -143 21 1 238 249 392 184 -359 -63 -128 -309 49 46 214 197 -308 -113 -183 301 -79 -316
2498 -316 -217 49 61 -90 187 85 187 -130 -240 -432 38 141 163 82 366 250 -180 46 -47 -112 42 -168
$$ [...]
8191g6
##END NTUPLES=NMR FID
##END=
