##TITLE=1H_DE-83H
 200.13MHz, D2O,
 8 sc
 
 14.3.2025
##JCAMPDX= 6.0         $$ Bruker NMR JCAMP-DX V2.0
##DATA TYPE= NMR FID
##DATA CLASS= NTUPLES
##ORIGIN= UXNMR, Bruker Analytische Messtechnik GmbH
##OWNER= pz
$$ XWIN-NMR		Version 3.5
$$ Fri Mar 14 16:04:31 2025 Russian Standard Time (UT+4h)  she@DPX200
##.OBSERVE FREQUENCY= 200.1313
##.OBSERVE NUCLEUS= ^1H
##.DELAY= (6, 6)
##.ACQUISITION MODE= SIMULTANEOUS
##.ACQUISITION SCHEME= undefined
##.AVERAGES= 8
##.DIGITISER RES= 18
##SPECTROMETER/DATA SYSTEM= spect
##.PULSE SEQUENCE= zg30
##.SOLVENT NAME= D2O
##.SHIFT REFERENCE= (INTERNAL, D2O, 0, 14.3821)
##AUDIT TRAIL= $$ (NUMBER, WHEN, WHO, WHERE, WHAT)
$$ ##TITLE= Audit trail, XWIN-NMR		Version 3.5
$$ ##JCAMPDX= 5.01
$$ ##ORIGIN= Bruker BioSpin GmbH
$$ ##OWNER= she
$$ F:/spectra/data/she/nmr/H-C/1/audita.txt
$$ ##AUDIT TRAIL=  $$ (NUMBER, WHEN, WHO, WHERE, WHAT)
(   1,<2025-03-14 16:03:26.35 +0400>,<she>,<DPX200>,
      <created by zg, POWCHK disabled, PULCHK disabled
       configuration hash MD5:
       00 E9 B6 7A A2 85 ED C7 34 08 36 98 17 FE 4E 26
       data hash MD5: 16K
       DE 11 05 77 1A 7E 2E 97 E5 1D EA BC EC 8E D4 1B>)
$$ ##END=
$$ 
$$ hash MD5
$$ 18 4A 9D 04 73 A0 AF A1 C7 41 9D A7 FE 8E D6 38
##$RELAX= 
##$RELAX= 
##$RELAX= 
##$RELAX= 
##$RELAX= 
##$RELAX= 
$$ Bruker specific parameters
$$ --------------------------
##$DU= <F:/spectra>
##$EXPNO= 1
##$NAME= <H-C>
##$PROCNO= 1
##$TYPE= <nmr>
##$USER= <she>
##$AMP= (0..31)
100 100 100 100 100 100 100 100 100 100 100 100 100 100 100 100 100 100 
100 100 100 100 100 100 100 100 100 100 100 100 100 100 
##$AQSEQ= 0
##$AQ_mod= 1
##$AUNM= <au_zg>
##$AUTOPOS= <>
##$BF1= 200.13
##$BF2= 200.13
##$BF3= 200.13
##$BF4= 200.13
##$BF5= 200.13
##$BF6= 200.13
##$BF7= 200.13
##$BF8= 200.13
##$BYTORDA= 1
##$CFDGTYP= 0
##$CFRGTYP= 5
##$CHEMSTR= <none>
##$CNST= (0..31)
1 1 145 1 1 1 1 1 1 1 1 1 1 1 1 1 1 1 1 1 1 1 1 1 1 1 1 1 1 1 1 1 
##$CPDPRG= <>
##$CPDPRG1= <>
##$CPDPRG2= <>
##$CPDPRG3= <>
##$CPDPRG4= <mlev>
##$CPDPRG5= <mlev>
##$CPDPRG6= <mlev>
##$CPDPRG7= <mlev>
##$CPDPRG8= <mlev>
##$CPDPRGB= <>
##$CPDPRGT= <>
##$D= (0..31)
0 0.7 0 0 0 0 0 0 0 0 0 0.03 0 0 0 0 0 0 0 0 0 0 0 0 0 0 0 0 0 0 0 0 
##$DATE= 1741953805
##$DBL= (0..7)
120 120 120 120 120 120 120 120 
##$DBP= (0..7)
150 150 150 150 150 150 150 150 
##$DBP07= 0
##$DBPNAM0= <>
##$DBPNAM1= <>
##$DBPNAM2= <>
##$DBPNAM3= <>
##$DBPNAM4= <>
##$DBPNAM5= <>
##$DBPNAM6= <>
##$DBPNAM7= <>
##$DBPOAL= (0..7)
0.5 0.5 0.5 0.5 0.5 0.5 0.5 0.5 
##$DBPOFFS= (0..7)
0 0 0 0 0 0 0 0 
##$DE= 6
##$DECBNUC= <off>
##$DECIM= 32
##$DECNUC= <off>
##$DECSTAT= 4
##$DIGMOD= 1
##$DIGTYP= 9
##$DL= (0..7)
0 120 120 120 120 120 120 120 
##$DP= (0..7)
150 150 150 150 150 150 150 150 
##$DP07= 0
##$DPNAME0= <>
##$DPNAME1= <>
##$DPNAME2= <>
##$DPNAME3= <>
##$DPNAME4= <>
##$DPNAME5= <>
##$DPNAME6= <>
##$DPNAME7= <>
##$DPOAL= (0..7)
0.5 0.5 0.5 0.5 0.5 0.5 0.5 0.5 
##$DPOFFS= (0..7)
0 0 0 0 0 0 0 0 
##$DQDMODE= 0
##$DR= 18
##$DS= 0
##$DSLIST= <SSSSSSSSSSSSSSS>
##$DSPFIRM= 0
$$ [...]
##$SUBNAM0= <"">
##$SUBNAM1= <"">
##$SUBNAM2= <"">
##$SUBNAM3= <"">
##$SUBNAM4= <"">
##$SUBNAM5= <"">
##$SUBNAM6= <"">
##$SUBNAM7= <"">
##$SUBNAM8= <"">
##$SUBNAM9= <"">
##$SW= 18.0517328524113
##$SWIBOX= (0..15)
0 0 2 0 0 0 0 0 0 0 0 0 0 0 0 0 
##$SW_h= 3612.71676300578
##$TD= 16384
##$TD0= 1
##$TE= 0
##$TE2= 300
##$TE3= 300
##$TEG= 300
##$TL= (0..7)
0 120 120 120 120 120 120 120 
##$TP= (0..7)
150 150 150 150 150 150 150 150 
##$TP07= 0
##$TPNAME0= <>
##$TPNAME1= <>
##$TPNAME2= <>
##$TPNAME3= <>
##$TPNAME4= <>
##$TPNAME5= <>
##$TPNAME6= <>
##$TPNAME7= <>
##$TPOAL= (0..7)
0.5 0.5 0.5 0.5 0.5 0.5 0.5 0.5 
##$TPOFFS= (0..7)
0 0 0 0 0 0 0 0 
##$TUNHIN= 0
##$TUNHOUT= 0
##$TUNXOUT= 0
##$USERA1= <user>
##$USERA2= <user>
##$USERA3= <user>
##$USERA4= <user>
##$USERA5= <user>
##$V9= 5
##$VALIST= <valist>
##$VCLIST= <CCCCCCCCCCCCCCC>
##$VD= 0
##$VDLIST= <DDDDDDDDDDDDDDD>
##$VPLIST= <PPPPPPPPPPPPPPP>
##$VTLIST= <TTTTTTTTTTTTTTT>
##$WBST= 1024
##$WBSW= 4
##$XGAIN= (0..3)
0 0 0 0 
##$XL= 0
##$YL= 0
##$YMAX_a= 194584
##$YMIN_a= -215206
##$ZGOPTNS= <>
##$ZL1= 120
##$ZL2= 120
##$ZL3= 120
##$ZL4= 120
##$ABSF1= 10
##$ABSF2= 0
##$ABSG= 5
##$ABSL= 3
##$ALPHA= 0
##$AQORDER= 0
##$ASSFAC= 0
##$ASSFACI= 0
##$ASSFACX= 0
##$ASSWID= 0
##$AUNMP= <proc_1d>
##$AZFE= 0.1
##$AZFW= 0.1
##$BCFW= 1
##$BC_mod= 2
##$BYTORDP= 1
##$COROFFS= 0
##$CY= -3
##$DATMOD= 1
##$DC= 2
##$DFILT= <>
##$DTYPP= 0
##$F1P= 0
##$F2P= 0
##$FCOR= 0.5
##$FTSIZE= 0
##$FT_mod= 4
##$GAMMA= 1
##$GB= 0.15
##$INTBC= 1
##$INTSCL= 1
##$ISEN= 128
##$LB= 0.25
##$LEV0= 0
##$LPBIN= 0
##$MAXI= 10000
##$MC2= 0
##$MEAN= 0
##$ME_mod= 0
##$MI= 1.114404
##$NCOEF= 0
##$NC_proc= 0
##$NLEV= 6
##$NOISF1= 3.799351
##$NOISF2= 2.8
##$NSP= 1
##$NTH_PI= 0
##$NZP= 0
##$OFFSET= 14.38212
##$PC= 1
##$PHC0= -477.4839
##$PHC1= 16.99221
##$PH_mod= 1
##$PKNL= yes
##$PPARMOD= 0
##$PSCAL= 0
##$PSIGN= 0
##$REVERSE= no
##$SF= 200.129724274929
##$SI= 16384
##$SIGF1= 3
##$SIGF2= 2
##$SINO= 400
##$SIOLD= 16384
##$SREGLST= <1H.CDCl3>
##$SSB= 0
##$STSI= 0
##$STSR= 0
##$SW_p= 3205.1282051282
##$SYMM= 0
##$S_DEV= 0
##$TDeff= 0
##$TDoff= 0
##$TI= <>
##$TILT= no
##$TM1= 0
##$TM2= 0
##$TOPLEV= 0
##$USERP1= <user>
##$USERP2= <user>
##$USERP3= <user>
##$USERP4= <user>
##$USERP5= <user>
##$WDW= 1
##$XDIM= 8192
##$YMAX_p= 0
##$YMIN_p= 0
$$ End of Bruker specific parameters
$$ ---------------------------------
##NTUPLES= NMR FID
##VAR_NAME=  TIME,          FID/REAL,        FID/IMAG
##SYMBOL=    X,             R,               I
##VAR_TYPE=  INDEPENDENT,   DEPENDENT,       DEPENDENT
##VAR_FORM=  AFFN,          ASDF,            ASDF
##VAR_DIM=   8192,          8192,            8192
##UNITS=     SECONDS,       ARBITRARY UNITS, ARBITRARY UNITS
##FACTOR=    0.0002768,     1,               1
##FIRST=     0,             0,               0
##LAST=      2.2672688,     0,               0
##MIN=       0,             -215206,         0
##MAX=       2.2672688,     194584,          0
$$ Real data points
##PAGE= N=1
##DATA TABLE= (X++(R..R)), XYDATA
0 0 0 0 0 0 0 0 0 0 0 0 0 0 0 0 0 0 0 -7 8 -8 8 -8 8 -14 16 -16 20 -24 24 -29 32 -39 44 -48 53 -61 69 -77 86
39 86 -95 105 -119 129 -145 160 -176 195 -215 236 -260 285 -316 348 -385 426 -471 526 -588 660
59 660 -750 856 -989 1164 -1400 1734 -2247 3129 -4933 10094 -58131 -215206 -89204 36697
73 36697 -37537 -104431 33121 162892 95320 -27768 -31383 -6065 -47435 -78759 -34538 15845
85 15845 49194 94627 101665 15672 -55254 -25833 -15171 -107055 -137173 2251 119805 56549
97 56549 -20999 47609 107106 -5971 -132193 -82203 30104 24479 -24905 25705 103412 74410
109 74410 -14679 -52548 -53321 -64556 -60486 -24595 6797 34171 78413 89253 23852 -41198 -28933
122 -28933 -6378 -48607 -75276 1486 88750 67345 -18 3128 28620 -22412 -97023 -83929
134 -83929 -11209 23156 21097 41186 71252 58702 11634 -29025 -49087 -52118 -33170 -4373
146 -4373 15378 30504 49871 47810 3097 -45882 -52464 -36749 -35623 -28568 16273 66115 69830
159 69830 38296 13957 -618 -28714 -57418 -55488 -22743 11085 30695 39524 37751 20255 -8945
172 -8945 -36212 -50415 -44137 -18846 12487 37701 52169 52959 34603 1461 -30802 -49172 -50224
185 -50224 -35850 -8825 19729 38561 41902 30214 5477 -22597 -41128 -41554 -26884 -3294 24797
198 24797 46326 50854 36749 11011 -18685 -43603 -51839 -39897 -18355 5897 31028 46759
210 46759 39210 12711 -12088 -26566 -35604 -37043 -17342 16399 40157 42533 34014 20059 -5032
223 -5032 -35426 -51047 -44214 -23845 308 24230 40664 40527 26130 3922 -20302 -37430 -36359
236 -36359 -18622 3313 20653 35412 41139 26984 -3070 -29101 -38887 -39303 -32688 -11836 19289
249 19289 40009 40728 28539 11687 -9144 -29628 -37193 -27556 -7043 13758 30242 35485 26853
262 26853 7502 -15316 -33313 -40482 -33208 -12401 10996 29623 38491 35400 19722 -4442 -24664
275 -24664 -33037 -29132 -16469 3208 22370 32416 28438 12904 -6583 -24379 -34793 -33009 -18072
288 -18072 3934 23917 35166 34595 22873 3469 -17590 -30908 -31404 -21397 -4199 13552 26823
301 26823 28695 18586 908 -16400 -28095 -30231 -20879 -3089 16633 29844 32717 24902 8523
314 8523 -10738 -25937 -30997 -25118 -10426 7177 21171 26744 21546 8311 -8273 -21911 -27164
327 -27164 -21458 -7920 8895 23308 29532 25488 12291 -4990 -20188 -28177 -25978 -15081 933
340 933 15912 24470 22699 12794 -944 -14500 -23153 -22503 -11466 3652 16324 23719 24287 16179
354 16179 -219 -16169 -24814 -24360 -17127 -5300 9781 21709 23600 15781 3844 -8186 -17436
367 -17436 -20640 -15261 -3160 10327 19491 21930 15506 3925 -8482 -19075 -24071 -20255 -7842
380 -7842 6970 16403 19424 18255 11292 -2622 -15154 -19497 -14696 -6238 2843 12175 19805 17901
394 17901 7468 -5222 -14793 -19246 -18503 -11150 159 12346 19855 19230 11516 1123 -8176 -14990
408 -14990 -17152 -12049 -1230 9577 15210 14935 9840 1212 -8980 -16639 -17838 -12302 -2341 7859
422 7859 15060 17532 14186 5910 -4975 -13668 -15884 -12440 -5519 3314 11344 15063 11593 3986 -4255
437 -4255 -11415 -16002 -13530 -4328 4415 10581 14744 15801 9327 -2638 -11151 -12925 -12211 -9806 -2114
452 -2114 8169 14168 11794 5968 191 -7056 -12522 -12675 -7807 -318 7638 14984 14445 6939 1080
467 1080 -3058 -9666 -17043 -13411 -237 7413 6693 8078 12298 8194 -5951 -14354 -10310 -4687 -3746
482 -3746 -12 9997 15224 11208 3028 -3561 -9404 -11977 -10030 -5945 -1750 6441 15071 12633 1780
497 1780 -3954 -1919 -5038 -14095 -11746 4565 13928 7594 2876 8245 7156 -7273 -17310 -11669
511 -11669 -2448 -384 1243 7939 12877 9487 2459 -4610 -10086 -10245 -4557 -723 -349 5045 14236
526 14236 12465 -1932 -10415 -4870 -2929 -11367 -11823 4138 16042 10285 1591 3595 5600 -4179
540 -4179 -14043 -10915 -948 3473 4496 6481 7951 5592 316 -5955 -11744 -10728 -1700 3566 2515
555 2515 4515 12194 11966 -1092 -11281 -7061 -1607 -5549 -8027 2348 13696 10425 490 -1776
569 -1776 -371 -4866 -10819 -8898 -887 6407 8272 7643 5775 2747 -594 -5653 -10743 -9270 -1261
584 -1261 4757 4801 3905 7368 7390 -1711 -10134 -8836 -2896 -1552 -1731 3827 10713 9742 2497 -3322 -4533
601 -4533 -5712 -7582 -6270 -672 5422 8287 6908 3120 -491 -2841 -5489 -7974 -6051 427 5765
616 5765 6849 5406 4851 2470 -3135 -8308 -8448 -4637 -558 2111 4852 7366 6440 1745 -3080 -5967
632 -5967 -6372 -4802 -1929 1753 5688 7335 5885 1380 -2208 -5133 -6710 -6534 -3294 1536 5194 6759
648 6759 5635 3071 -347 -4532 -6452 -5763 -3229 670 4224 6431 5770 3446 -554 -4254 -6517 -6141
664 -6141 -3769 105 3698 6138 6072 3646 523 -2878 -5227 -6026 -3914 -154 3225 4857 5535 4257
680 4257 1302 -3256 -5690 -5501 -3666 -1238 1843 5235 5978 4403 1533 -1983 -4777 -5497 -4769 -2036
696 -2036 1386 4347 5847 4486 1606 -1310 -3765 -5187 -5085 -2178 1496 4057 5263 4680 2442 -259
712 -259 -3599 -5766 -4919 -2608 397 2932 5124 4908 3061 -228 -3036 -4675 -4384 -3009 18 2795
728 2795 5131 4933 3240 353 -2370 -4569 -4945 -3556 -598 2104 4103 4499 2905 945 -2012 -4095
744 -4095 -4777 -3250 -1128 1850 3557 4159 3620 1442 -1763 -3727 -4265 -3679 -1488 968 3780 4793
760 4793 3734 1646 -960 -2962 -4118 -3664 -1794 759 3149 3946 3646 2127 -555 -3047 -4259 -3575
776 -3575 -2090 167 2356 4132 3883 2418 75 -2463 -3548 -3739 -2489 -545 2042 3703 3953 2634
792 2634 255 -1641 -3180 -3717 -2981 -688 1974 3555 3607 2702 1125 -1235 -3154 -4125 -2867 -1024 1085
809 1085 3002 3426 3058 1165 -1006 -2678 -3445 -3038 -1545 954 2625 3690 3211 1570 -612 -2432
825 -2432 -3530 -3375 -1676 301 2199 3576 2811 1827 -278 -2139 -3513 -3106 -1957 98 2040 2970
841 2970 3586 2060 86 -1788 -2755 -2837 -1969 -801 1397 2912 3199 2243 412 -1148 -2188 -2946 -2411
858 -2411 -983 1348 2513 2955 2522 854 -599 -2546 -3089 -2614 -961 612 2122 2867 2600 1286 -591
875 -591 -2136 -2856 -2386 -1234 221 1987 2906 2804 1763 -137 -1866 -2319 -2465 -1296 -287 1777 2625
892 2625 2656 1525 208 -1197 -2441 -2721 -1717 -276 1132 2182 2801 1864 303 -1045 -2102 -2642 -2129
909 -2129 -627 1063 2330 2254 1747 828 -867 -1945 -2289 -2194 -687 444 1749 2552 2187 1204 -295 -1629
927 -1629 -2475 -1798 -959 258 1592 2242 2435 1341 -531 -2066 -2339 -1970 -1403 -90 1624 2690 2191
944 2191 912 108 -1041 -1904 -2453 -1690 84 1632 1776 1857 1508 690 -752 -2316 -2431 -1543 169 617
962 617 1120 1906 2062 978 -1055 -2153 -1870 -1334 -619 30 1596 2754 1928 780 -926 -1516 -1372 -1784
980 -1784 -1355 -16 1857 2283 1394 677 -81 -740 -2196 -2739 -1496 908 1515 1422 1287 1277 587 -1171 -2358
999 -2358 -1983 -615 -155 418 1572 2116 1904 145 -1477 -1761 -1078 -919 -831 199 2191 2444 1169 -278
1017 -278 -752 -948 -1543 -1880 -884 1148 1761 1511 763 524 -41 -1079 -2203 -1600 -300 620 1217 1217 1642
1036 1642 1467 -123 -1589 -2109 -904 -454 -299 257 1520 2047 958 -333 -853 -1219 -1091 -1134 -426 969
1054 969 1765 1651 429 -84 -555 -1016 -1804 -1425 12 830 1433 922 900 507 -296 -1430 -1883 -985 7
1073 7 97 816 1152 1417 408 -779 -1150 -1403 -1018 -453 174 616 1410 1349 532 -248 -625 -1305 -1261 -1076 170
1094 170 776 1513 1374 436 -4 -642 -1292 -1483 -832 272 654 1011 1047 930 219 -834 -1210 -1275 -818 -151
1114 -151 665 1105 1270 748 432 -771 -880 -992 -913 -831 287 946 1301 1087 390 -224 -950 -1120 -1130 -467
1134 -467 485 860 1156 993 441 -433 -599 -1067 -1030 -844 -128 821 988 1203 622 161 -842 -898 -1097 -932
1154 -932 127 519 755 615 993 327 -406 -1128 -1146 -742 -206 190 770 1014 889 336 -514 -979 -1138 -626
1174 -626 -438 483 935 1109 1046 241 -390 -1004 -804 -832 -546 128 759 1062 766 307 51 -648 -1068 -881 -184
1195 -184 147 661 1034 1087 471 -167 -375 -1043 -453 -452 -233 338 713 989 786 88 -333 -648 -818 -962 -43
1216 -43 287 1001 681 434 168 -263 -858 -848 -618 -238 615 446 801 855 124 -347 -677 -579 -758 -128 353
1237 353 659 959 832 451 -197 -574 -536 -562 -500 14 374 659 588 398 -51 -470 -463 -763 -482 -9 617 834
1259 834 981 440 171 -382 -506 -621 -463 -42 205 799 687 543 361 -328 -536 -582 -502 -41 141 425 520
1280 520 407 -13 -8 -409 -724 -560 -114 83 448 654 557 182 -272 -463 -428 -526 34 77 206 828 564 473
1302 473 -156 -429 -656 -407 -534 -101 439 395 394 275 346 -386 -595 -646 -267 -68 408 482 467 290 255 -264 -624
1325 -624 -590 -377 45 142 573 753 429 235 -198 -353 -623 -532 -151 165 719 445 320 129 -153 -394 -485
1346 -485 -110 -91 -65 558 552 512 108 -204 -322 -668 -291 -112 477 217 139 -53 185 -213 -317 -361 -582 -196
1368 -196 -102 89 428 290 123 198 -553 -595 -316 -372 -72 -30 396 361 -31 -76 -192 -190 -107 -318 105 207 392
1391 392 265 30 2 -78 -745 -240 -314 -132 -23 207 477 327 370 145 -173 -327 -164 -2 184 41 201
1412 201 331 109 -137 -592 -154 -7 -308 358 195 309 305 194 7 -171 -494 -56 -359 -42 217 273 278 24
1434 24 93 -256 -321 -310 -212 60 516 -87 -99 129 240 -51 -341 -155 -277 11 182 8 104 162 -133 -241 -437
1457 -437 -144 -181 22 107 454 154 264 -16 -69 -91 -193 -308 -33 171 247 262 41 -7 98 -251 -370 -193
1479 -193 184 98 263 -153 273 -149 -304 -311 -89 -121 153 52 -214 -26 282 -191 -11 -299 52 -71 -192
1500 -192 -172 256 336 389 101 -156 -27 -257 -198 -221 173 91 54 -101 -97 -298 202 31 -284 -134 63 304 135
1523 135 117 378 118 -549 -175 32 105 -31 -5 137 336 77 183 -10 -283 24 -277 -214 23 327 195
1544 195 149 -51 -70 54 -191 -43 -161 94 132 81 350 18 -22 -127 75 -411 -191 -133 -214 62 -49 269
1566 269 6 85 -247 -247 -53 -30 -97 58 105 358 168 -69 35 7 -131 -231 28 398 261 8 19 -173 -242
1589 -242 -305 -98 -82 49 -125 166 171 -196 -32 -37 -157 -47 -314 -16 -19 247 113 10 -46 -142 -347 114 68 -102
1613 -102 344 314 214 369 16 -164 -267 -59 -387 -135 136 -104 44 -69 33 34 -54 -149 5 208 -233 310
1635 310 198 -171 43 50 305 -444 -105 -453 -90 67 -261 89 -1 -181 -277 -21 -2 295 185 26 10 376
1657 376 -19 -130 107 -63 -216 -47 157 43 131 13 115 -123 -164 46 -47 -53 -62 205 -98 79 -78 -163 -78
1680 -78 -54 -415 131 -180 -27 309 244 83 191 57 116 15 -99 211 45 64 138 -68 -58 -114 -331 113 -353
1703 -353 -39 198 127 -3 261 24 77 41 -34 -29 129 -45 159 311 93 -1 184 -182 -213 -244 213 45 89
1726 89 132 299 196 -84 105 -442 200 -299 97 -215 15 29 143 9 -183 -249 271 -287 22 -70 283 489
1748 489 111 -44 28 -332 119 -31 -21 -5 39 176 -116 30 -63 109 183 -236 -143 381 -44 -22 173 30 93
1771 93 -95 -134 -316 -9 156 179 -151 67 23 252 54 74 -251 -247 78 -113 112 130 140 -196 230 -117 -359
1794 -359 -103 80 150 -9 145 197 336 -108 -369 -8 -68 -225 87 33 274 189 163 -13 -280 53 31 -171
1816 -171 59 -45 169 146 55 -90 -152 81 -74 137 -154 -178 157 174 1 9 -107 -254 -121 -156 0 111 -117
1839 -117 56 225 -24 -53 10 18 60 76 -133 -88 -165 56 286 24 -36 -118 -17 -178 173 131 -31 -42 47 -19 -19
1864 -19 -404 -147 -227 -200 53 -29 332 57 118 -196 -262 193 1 4 64 275 284 56 122 -70 -78 -227 -114 -21 130
1889 130 64 79 23 30 164 87 -23 -268 150 76 -62 -186 201 186 156 29 -144 17 -138 -132 117 214 61 388
1913 388 185 -135 -314 -313 -348 -206 292 -87 213 218 298 107 -119 -302 147 7 242 -226 -24 313 -97 -341
1935 -341 -6 71 -63 139 -78 33 7 182 231 -138 -139 210 153 -202 120 46 177 -119 89 70 117 -18 25
1958 25 2 -246 50 39 65 109 25 77 77 -179 306 -41 102 -146 356 356 -75 -210 -206 -100 -365 12 -71 199 221
1983 221 -57 -120 -197 -55 -132 -391 184 20 13 271 322 364 260 121 -114 -285 -39 -331 -131 -111 -25 179 -242
2006 -242 -35 -43 -20 -34 13 -121 -148 86 101 348 -125 -208 -217 57 -209 -77 260 -56 177 95 5 68 -199 49
2030 49 128 51 -247 -3 281 35 -130 60 -24 -38 -14 1 -298 43 12 141 102 61 -245 -56 -145 49 -198 -204
2054 -204 44 190 162 -113 -125 -37 -124 -85 -36 -229 264 264 198 -254 29 -123 -78 30 -253 229 102 -3 -97 -37
2078 -37 44 -123 -252 -154 -123 9 90 24 -119 -62 41 69 114 -161 -346 -122 100 -108 250 -128 119 -152 -90
2101 -90 -337 -136 -314 -243 174 293 412 -35 -226 -213 -171 -30 -160 52 152 240 -116 -42 88 -54 -151 175
2123 175 -254 64 -165 202 12 36 4 -73 -253 -314 76 -17 -195 420 195 166 -199 85 137 -328 -198 -39
2145 -39 -228 -27 26 -229 -111 25 22 -429 206 -175 -239 168 196 234 -144 -14 -411 -131 -151 -252 14 -32 93
2168 93 -74 -12 -60 -188 -256 -4 -161 -257 -300 149 176 248 -79 12 -58 -39 -141 -124 -61 10 -15 138 6 73 -31
2193 -31 -256 284 -135 110 47 415 59 101 -69 199 157 -20 -16 109 266 217 316 -76 173 -84 322 -67 -121
2216 -121 -101 -186 363 -152 55 -142 -62 20 227 -116 23 141 48 299 188 266 27 268 -118 -32 6 289 78
2239 78 -28 5 45 47 -138 39 -31 133 -44 295 55 169 424 105 -142 -180 -208 -94 359 137 135 -58 -2 -320
2263 -320 17 -274 -150 -135 -206 305 228 95 234 365 50 135 -172 131 -181 23 214 235 272 -7 -178 -32
2285 -32 -375 -202 89 112 -217 151 40 138 134 248 -253 -285 158 -147 307 -11 10 391 -77 -88 -95 -142 -114 -131
2309 -131 17 45 152 506 -111 -192 18 18 -145 -89 161 -112 22 -68 303 -155 -343 -16 -171 -81 117 -5
2331 -5 195 103 83 159 11 -41 -217 -95 -141 286 165 -21 -44 83 101 -140 -513 80 -57 370 93 504 62
2354 62 -135 -179 -271 -252 -72 -287 -53 78 268 63 6 -44 217 -107 -286 -31 -101 -115 -102 103 209 150 128 -138
2378 -138 -328 63 17 225 346 175 234 -217 -65 162 -108 -227 -201 303 87 301 243 19 -41 -194 -50 -37
2400 -37 102 167 389 430 -67 -40 152 -124 -222 51 -289 -6 37 181 181 -276 26 -263 -63 37 46 -184 106
2423 106 -134 215 148 81 -182 -354 -41 -332 -258 25 19 185 119 -271 -205 -224 -257 -45 95 -44 -6 124 139 311
2447 311 -103 76 41 158 -55 71 24 25 327 -19 197 -403 123 -59 -277 98 24 220 -70 297 -66 -319
2469 -319 46 -8 -70 54 92 313 49 99 -59 -145 -239 -223 136 -112 342 54 -44 -168 46 -137 85 -248 -157
2492 -157 -236 20 268 455 -81 146 -257 -149 129 -112 27 147 54 -124 187 115 217 -164 -112 -28 148 0
2514 0 118 220 -10 -290 79 -330 -328 -125 -57 114 -100 126 234 76 -239 -25 -211 -6 -55 121 -66 249
2536 249 195 278 -184 -86 16 -329 128 181 287 167 163 -111 115 -162 -408 -312 -7 138 74 204 230 171 287
2559 287 -29 -393 -242 208 -79 -2 355 123 135 -55 -86 -186 -106 44 -39 204 -163 427 146 -111 -23 -330
2581 -330 54 -31 -274 263 173 191 229 402 -65 -254 -165 -450 -347 -91 207 385 420 105 189 53 -150 -290
2603 -290 -117 -4 111 208 203 244 -12 -70 -13 142 -91 280 130 170 -44 72 94 46 -292 -61 -148 25 110 250
2627 250 272 -17 295 -20 -176 -6 -213 -175 39 27 263 310 179 71 -48 2 -195 -98 137 -328 87 225
2649 225 100 -372 -349 -86 16 -93 58 190 -19 237 225 293 45 -308 -295 -413 -514 -4 104 388 52
2670 52 265 -274 -356 -458 -2 -59 -196 247 175 227 -253 173 10 -411 -173 -121 42 22 358 268 135 59 -151
2693 -151 -239 -115 -22 -162 72 45 213 -50 91 -9 -35 -6 150 7 71 -164 166 -17 -31 219 -160 -197 -85
2716 -85 45 390 410 9 162 -68 158 -370 -262 -196 -230 -192 259 297 -201 -224 -159 3 285 7 -55 -140 133
2739 133 134 74 306 226 -66 -197 -171 0 -138 -26 277 190 293 -92 -282 -182 -127 -59 115 137 83 243 301 -223
2763 -223 -91 67 -265 -247 44 -136 130 227 14 271 -136 -72 -299 -92 50 31 358 -107 385 -104 36
2784 36 -271 -210 -354 126 -35 160 198 251 31 -384 -327 -23 -78 -58 -194 71 308 -21 91 -102 -131 -53 -270
2807 -270 -211 11 -18 137 134 379 373 -14 37 -170 -154 161 17 329 129 40 90 16 -344 -115 -103 -277 -204 246
2831 246 68 -60 -204 79 -59 -429 -81 -185 -215 411 174 137 -4 -5 -103 -243 160 30 199 180 261 76
2853 76 -146 308 -201 -314 17 14 68 -107 97 189 -19 144 -75 178 133 -118 -118 60 227 112 99 -51 157
2876 157 -137 -108 -158 -85 -33 7 131 363 145 161 -259 -122 -212 -34 84 -4 409 314 141 -145 -244 -119 -178 182
2900 182 -14 238 77 -87 270 108 -272 -321 -339 -146 -230 -226 179 -59 -271 -29 -311 122 -128 -83 -116 -225
2922 -225 303 120 202 -18 -24 -117 -138 -207 2 284 -101 185 -52 244 -195 -203 -426 -282 -219 -246 87 -43 123
2945 123 -67 -411 84 0 -231 20 32 248 172 21 -76 -62 -72 -311 -74 -172 24 213 202 51 103 140 -127
2968 -127 -192 10 -91 -40 157 15 236 85 52 -48 -253 -320 -253 16 -32 430 121 123 -77 -159 -360 -53 -156
2991 -156 116 -64 67 -39 151 -306 149 -18 -248 -271 15 243 138 308 347 136 -17 -18 -128 -283 111
3012 111 -24 -184 309 1 -116 -167 92 -184 -288 133 -6 271 -104 -42 206 -31 -70 114 -47 -38 -45 -79 -22
3035 -22 129 -67 257 -240 -191 25 -209 9 62 104 -150 115 -170 297 -177 22 -80 -144 72 -205 212 354
3057 354 119 -100 -43 -32 23 -192 -161 90 68 385 -35 -61 -243 -337 175 91 209 -6 152 293 -170 -114 17
3080 17 -232 -252 -245 155 -90 -11 162 136 -354 -113 -42 -356 174 12 288 -64 65 216 263 80 -121 -27 -112
3103 -112 138 60 200 42 -49 147 130 131 181 62 202 279 267 29 -161 409 -101 -152 -57 -258 -51 -83 268 142
3127 142 -3 -39 -1 -83 -262 132 101 359 -28 256 -276 44 98 302 234 -318 -69 -90 47 106 -58 -46 108
3150 108 -35 -232 -150 -189 -262 323 51 137 270 46 -35 96 -294 -268 -358 -39 -43 109 -56 -37 52 -99 -209 -269
3174 -269 -250 40 47 -77 150 29 27 55 -141 -7 101 109 -31 89 180 -253 97 186 -67 -87 128 67 147 54 224
3199 224 71 136 222 161 29 -45 -81 94 290 199 -180 -36 -100 -130 -25 -113 -62 -129 -7 0 241 113 -62 -52 -134
3224 -134 342 -9 57 239 54 24 37 -160 -97 8 60 -236 24 79 47 -157 29 -265 18 -41 107 -220 -21
3247 -21 144 125 262 -104 -5 -196 -42 139 289 91 74 -114 294 -51 -55 -185 175 -126 -188 -123 101 88 -213
3270 -213 -116 51 5 -57 -153 -44 158 57 -176 406 79 0 -216 57 -82 281 -202 3 240 -109 155 184
3292 184 -91 -258 -122 24 -118 -102 -383 -142 -113 -57 220 -77 -15 -116 35 -189 151 -82 303 186 -69
3313 -69 -48 -174 122 165 -29 -154 214 165 -135 124 -15 313 -123 -180 26 15 73 -63 94 311 27 152
3335 152 -137 61 96 -52 79 -81 69 101 -290 116 72 -287 207 -102 -236 220 -225 55 -69 -208 -248
3356 -248 -122 -14 67 -111 -201 -53 99 -13 185 128 83 11 -121 256 7 143 -88 54 31 -213 -363 153
3378 153 -119 92 -48 134 -175 -26 88 -33 -2 -78 212 -300 133 180 -40 25 56 -102 143 33 -9 189
3400 189 48 66 -115 74 -36 -71 113 -99 -321 -218 145 200 -70 151 180 105 -49 54 -100 75 313 172
3422 172 -99 66 346 -1 150 43 62 233 7 -64 31 -115 -47 -178 89 -266 -225 -54 7 82 106 228 54
3445 54 155 180 -17 -294 -199 40 260 12 5 -138 52 -211 -63 69 64 -26 22 5 265 331 4 54 -71 112
3469 112 -297 113 -30 -31 -5 287 -209 114 -152 314 22 235 111 -137 357 330 218 -145 -52 5 65 47 63
3492 63 57 242 -80 -180 -405 -181 -488 -5 94 61 34 30 29 -445 430 -152 -384 48 -145 -45 -1 39 -204 -83
3516 -83 15 131 -69 -95 11 319 111 -169 133 161 -98 -41 11 -244 -97 -127 28 -126 54 84 -271 -47 126
3539 126 -10 129 -244 -96 -119 151 199 141 74 95 244 -210 -203 -56 21 153 -28 36 8 2 -342 -13 42 178
3563 178 139 26 133 -437 -430 46 85 29 -17 138 167 154 271 5 -62 -13 -134 -237 -221 -44 280 214 -119 130
3587 130 -11 -119 89 71 -2 -122 34 -132 -259 -4 -97 -212 -90 -266 110 -229 142 130 65 -138 -7 172
3609 172 -236 -135 -57 126 101 -87 214 217 -80 -299 151 134 -31 15 65 87 -49 -61 -54 131 -170 -24 -149 139
3633 139 -18 9 -107 -53 -144 163 95 -184 -299 -26 18 -61 -34 -41 122 -39 108 -270 89 101 -253 -200 47 -119
3657 -119 -124 -134 -175 105 39 -293 -74 6 198 393 -82 87 -31 95 99 22 278 122 -148 -21 57 201 -59
3680 -59 -82 120 82 9 -69 97 77 263 69 -109 -223 -219 -200 134 14 -155 -47 415 184 98 92 315 -39 -131
3704 -131 80 190 -185 120 57 65 -100 60 187 38 -221 -108 278 -51 -186 -58 -106 -164 -65 -123 145 -219
3726 -219 -86 133 127 50 145 50 -92 -127 -176 -74 0 -180 -179 10 -86 -103 -36 -181 226 -47 250 219 139 252 -175
3751 -175 -267 -62 64 -93 -312 69 250 262 -254 -88 345 -286 -52 97 11 6 -39 59 -34 -36 -253 128 -72
3774 -72 53 -260 72 173 52 108 -191 -90 354 49 -199 -236 -34 80 -160 74 149 41 -10 153 -186 164
3796 164 20 -180 96 -110 3 97 -85 96 -245 10 4 -38 48 159 83 -130 70 -218 235 128 -150 -44
3818 -44 -119 11 285 -194 -157 4 -269 40 164 -162 58 -81 -230 118 -222 328 -144 1 -22 14 -9 -85
3840 -85 -113 -45 -35 -45 50 71 7 -200 16 -188 116 -7 225 229 -64 145 -35 -62 -106 -262 -431 427 -272 -205
3864 -205 182 -2 -242 2 -141 114 -191 127 -80 35 158 -274 -2 14 223 -37 -121 407 80 211 54
3885 54 -223 195 -20 76 205 11 129 108 -309 -134 -179 47 -22 97 -66 1 95 264 138 99 17 -142 292
3908 292 -123 -30 145 153 -170 -97 152 48 359 83 -51 23 48 113 -109 -37 48 166 295 -35 141 133 -215 -191
3932 -191 -110 334 -87 -119 -145 -201 -62 -197 -115 -153 -151 32 141 -267 -150 -23 -105 -196 -19 -16 -156 -139 -392 187
3956 187 -98 192 -36 115 -53 -37 -96 322 17 183 -10 -161 230 203 160 63 -150 75 56 -25 45 -5 95
3979 95 130 31 -16 -113 169 157 186 180 213 222 -148 310 -74 -351 -95 194 244 -203 72 192 43 241 19 31 -109
4004 -109 -210 -219 17 -229 105 -303 -102 116 -105 -72 85 196 -88 -104 263 98 -239 68 0 -330 20 -9
4026 -9 -106 51 -146 107 52 225 102 100 81 -376 195 168 319 42 141 192 21 -35 252 20 -65 96 16 226
4050 226 -124 -149 -194 143 -354 0 203 246 28 -99 43 -69 -6 -16 46 13 -116 295 -272 -37 -140 42
4072 42 -25 79 -69 -187 -123 -119 13 20 -5 100 -36 -74 29 -141 52 -162 31 -36 114 -74 202 129 26 172
4096 172 -2 -166 137 181 37 -179 -185 -149 -85 10 -94 -76 347 10 63 193 128 130 -96 231 117 -186 70 104
4120 104 -53 -120 -171 -13 -197 125 133 54 23 68 2 -139 -196 -83 96 71 160 213 247 47 205 50 141 -104 -106
4145 -106 109 0 -23 107 6 -8 -58 -2 35 -202 -97 -136 -226 344 248 32 220 -33 -123 -23 73 131 179 176 117
4170 117 -147 -100 -67 -257 156 71 -86 213 446 -24 -33 -196 -29 96 -452 -155 -231 273 76 313 -80 313
4192 313 172 22 49 -88 -249 128 206 236 230 121 58 79 141 -292 -168 -257 -78 -50 37 44 194 16 -105 -244
4216 -244 -32 247 -19 -130 84 75 60 -48 -3 -164 136 -32 383 275 198 -192 -125 -120 72 -12 -180 121 -205
4239 -205 -122 -50 13 52 -171 9 -278 -374 -153 -84 140 59 1 146 56 -84 127 -127 100 81 -249 -247 42 -131
4263 -131 -119 -61 129 59 -331 56 87 236 50 59 375 59 -225 -242 -69 -42 -252 -246 144 -144 46 -75 -258
4286 -258 -33 41 91 191 14 35 276 142 -128 -177 28 57 33 109 -309 151 325 -55 -102 2 -197 -187 15
4309 15 68 -208 -52 169 388 -35 -5 -197 -102 266 220 19 103 -120 65 26 198 59 107 -19 -65 -18 6 -15
4333 -15 -250 -87 -4 30 76 -204 -105 -272 203 204 199 -126 -105 -124 222 156 48 200 98 52 -53 85 -68 127
4357 127 9 -104 -110 -4 -30 -251 40 -150 105 69 30 -136 -395 -224 -231 -14 -99 311 -5 -22 -351 -142 -57
4380 -57 -80 -65 -205 51 251 -21 114 -298 -188 -31 -71 96 4 206 163 -120 -147 121 199 64 -108 -254 -89
4403 -89 -15 34 213 -267 280 -122 147 150 -49 -112 -138 25 85 31 -61 -63 -49 -280 -194 -237 -52 198 -16 -116 39
4428 39 -217 95 -371 -16 15 -20 -23 132 14 -123 -342 95 -65 -31 105 123 41 -104 233 -127 293 -25 18
4451 18 -269 22 39 243 66 127 69 -169 -95 -110 -124 -76 -277 43 46 -274 -42 176 -46 0 -83 -73 -123 11 21
4476 21 -68 -157 -17 75 -86 -123 229 -160 -204 131 46 34 -29 -241 28 -19 -169 -166 -65 144 155 240 332 -384 -148
4501 -148 -8 -47 -100 242 191 53 213 -170 -227 -261 -62 39 -67 -288 291 263 107 174 -311 109 29 -47 205
4524 205 -100 -104 397 239 -148 6 -110 14 -201 98 -130 -63 131 -224 369 122 100 -25 133 46 15 -106
4546 -106 -95 -47 81 43 123 -33 -252 61 -209 -128 -21 -52 257 58 202 108 -213 -75 -304 222 43 -80
4568 -80 -160 -90 -7 8 63 64 93 3 -70 -268 24 -243 -275 -34 65 -231 173 -33 -163 -89 73 175 76 198 -219
4593 -219 -173 153 -163 -226 -54 106 -181 356 132 105 -27 43 39 37 155 414 -42 159 -14 208 -55 23 -94
4616 -94 257 153 -189 190 -95 -226 -28 7 -205 19 -117 157 122 78 -201 -12 -32 -19 -286 6 -258 -319
4638 -319 -207 181 28 104 -84 -137 105 -164 -212 -40 335 83 329 -66 26 -150 -54 -140 -174 20 15 -6 205
4661 205 112 -155 -80 223 -191 23 -204 182 112 363 164 38 146 -113 97 107 54 168 147 84 -33 -83 -129
4684 -129 -62 -88 21 -98 -62 -175 -64 -30 -89 27 104 112 -302 142 127 199 36 -54 90 -115 -325 101 -96 24
4708 24 222 67 67 236 44 -101 -102 204 -66 2 -88 140 174 -26 49 59 -145 -78 -95 313 -109 133 422 -166
4732 -166 137 27 51 -140 -215 -184 288 57 168 225 49 207 80 -128 -28 69 46 10 135 -126 -5 54 -156
4755 -156 -48 -119 4 -85 -348 -213 251 -60 139 -2 -73 -128 -1 -81 -238 -218 45 160 238 -76 -133 -141 -74 236
4779 236 -58 82 95 137 226 -57 124 -101 -65 11 -90 114 -463 -89 65 -18 -74 41 -95 26 -23 73 10
4802 10 66 369 -234 -5 53 106 -59 -172 -201 51 22 307 25 -90 -327 35 -90 128 55 74 459 -36 -20
4825 -20 31 80 -30 -10 -113 -90 78 159 -220 208 -245 -268 11 45 -101 171 32 -130 15 175 148 56 51 -102
4849 -102 -173 21 137 193 371 -32 -66 -77 -53 -19 -63 30 226 137 -49 171 -43 103 59 -167 209 77 -21 -63
4873 -63 -63 200 -43 27 89 -78 101 -21 -89 -15 -134 119 145 -7 18 -6 14 143 100 117 -49 66 169 -40
4897 -40 -15 -226 -31 18 -125 98 -114 194 -6 302 417 -308 271 134 -251 240 149 -102 -41 0 -217 122
4919 122 -46 -104 -18 120 62 -4 146 364 -174 -74 -370 54 -16 -206 -108 133 77 260 242 -200 -55 -140 38
4942 38 -307 -93 18 174 55 32 95 -171 227 -185 208 261 136 -162 132 25 257 -42 -32 -207 -43 324
4964 324 -30 -155 -203 128 -26 76 110 -269 -2 6 58 -140 -104 132 31 -143 -30 42 -141 69 101 92 -103
4987 -103 -87 -54 -1 -197 -119 -54 124 158 97 -175 45 6 22 78 -204 181 44 139 135 -220 210 -44 -104 -114 105
5012 105 -159 90 179 153 -236 -27 263 42 66 -78 29 -151 -79 187 -120 129 -117 182 -145 -413 -27
5033 -27 139 -22 114 21 30 -26 27 152 -221 148 362 -242 259 125 48 24 163 49 -138 149 -89 105 37
5056 37 87 -155 298 85 168 38 -147 194 37 -261 -7 -15 37 11 -312 42 -65 72 -81 -77 268 254 79
5079 79 276 29 -186 -96 -57 -25 156 142 394 37 -62 -39 -175 -103 8 -32 0 40 26 203 274 121 196 -35 5
5104 5 113 70 12 352 -145 117 -59 -25 102 -244 -261 172 132 88 246 97 -119 -39 -265 272 0 -205 -25
5127 -25 -75 -54 -9 3 -302 20 149 44 -52 43 117 -43 3 221 55 8 220 -57 -117 -11 -98 42 68 -64
5151 -64 -178 -98 102 43 -106 -38 -43 -40 -36 -68 -282 221 131 74 188 112 91 -36 51 58 -18 -64 -5 61 -154 -61 155 286
5179 286 -149 84 -256 307 56 68 -88 -12 -231 131 83 122 102 -252 -46 -197 -43 -439 -10 91 213 -218
5201 -218 326 189 107 -128 388 50 -112 90 36 -62 -63 125 113 -84 -114 47 62 86 11 -149 -102 -82 35 -91
5225 -91 137 147 215 -147 -170 126 -166 -104 -82 224 41 -2 -62 82 70 -41 -135 114 -194 -107 -271 6 -182 -165
5249 -165 99 99 69 43 16 -37 119 -67 -405 -66 234 -14 89 256 4 -93 -252 -123 -190 -133 173 67 -60
5272 -60 -62 -117 -151 112 -63 75 23 -181 128 -208 68 -119 -5 163 -24 25 311 273 58 -199 -160 -124 -116 -26
5296 -26 65 76 80 -2 20 -11 228 45 -265 22 32 -330 -258 53 110 -48 -79 131 -117 -7 -180 -79 -222 -239
5320 -239 152 43 130 -165 -168 43 -102 16 18 -81 154 26 57 167 -15 -50 -99 133 30 88 209 131 118 -45
5344 -45 -64 -64 59 -5 -98 187 325 -28 -128 -81 -94 142 -146 150 237 -218 -159 -14 38 -31 -153 119 121 -140 15
5369 15 20 -190 -175 13 14 198 143 -68 26 37 -44 -75 -112 -92 -98 -240 8 78 -227 -49 97 -51 -153 -286 3
5394 3 -70 -67 0 56 -16 -77 308 -63 268 -158 82 6 -247 -64 -156 -11 -105 92 312 -78 -332 176 -193 101
5418 101 -156 108 277 -233 -45 43 27 -51 -37 -160 -43 -9 -283 47 0 7 -18 -46 -114 -57 60 -40 -6 -212
5442 -212 -133 -22 95 287 95 -41 -75 6 -68 289 139 305 -50 19 64 -85 -103 -253 -141 22 34 276 253
5465 253 -296 18 5 91 -65 -134 -38 -258 -189 -47 -300 62 162 6 -384 13 41 -51 -124 55 417 -100 -120
5488 -120 221 45 -202 91 155 160 58 40 -46 -115 -91 11 -152 -43 -1 121 135 28 128 144 -27 -47 -18 263
5512 263 -106 70 248 -238 -256 108 56 222 191 174 47 -71 -5 39 116 -141 14 68 169 -53 -121 17 -167
5535 -167 89 -54 -74 30 -57 0 232 -24 -71 85 149 -236 82 -138 -49 -11 73 39 150 -23 138 40 -95
5558 -95 -33 106 -112 -106 123 12 44 -435 -99 -103 234 -90 -74 -292 -103 -38 239 117 -2 156 -76 16 -58 134
5582 134 73 88 73 65 -45 -90 -162 303 -3 128 -120 152 -116 284 -108 -158 11 24 69 240 118 4 17 25
5606 25 33 -47 175 -3 108 -49 285 110 -71 -36 -101 272 149 190 -14 1 -77 74 -25 -118 -164 -41 -83 17
5630 17 42 -137 104 12 67 -105 -173 77 116 76 -154 -170 182 -187 -58 39 287 -94 13 -8 167 -82 -83 51
5654 51 52 -23 -171 -64 319 -103 271 76 224 -90 -295 37 -120 -224 51 -85 -13 -381 94 262 -81 -21
5676 -21 -294 -223 223 68 -119 13 -400 -34 238 77 -164 -14 6 -17 -149 95 -258 -9 -13 77 -10 88 16
5699 16 100 445 -14 217 -130 34 -289 98 -107 83 -40 -68 -84 228 110 -51 149 51 -170 -213 384 30
5721 30 155 -222 -361 93 129 -88 -26 -314 121 -94 115 199 205 -29 -120 -25 -76 187 276 51 162 -198 17
5744 17 -90 -23 77 -36 -251 -84 34 251 149 -108 -251 -152 -145 -152 -27 121 151 143 475 160 50 7 -232 89
5768 89 -213 76 32 300 -93 -31 27 44 60 -154 -103 100 198 -27 11 -73 146 245 -151 -323 -85 -52 234 166
5792 166 96 -62 232 154 -13 -43 -124 81 -61 -53 -83 158 45 -84 -37 256 -72 45 -129 -196 -244 -111 -247
5815 -247 38 -16 17 -186 101 138 -136 25 144 191 55 38 -13 -12 -202 63 -132 -10 284 -41 -59 86 -26
5838 -26 140 -77 170 29 -266 -1 -74 -12 -130 -112 -47 96 -109 255 -65 37 143 109 29 93 79 113 165 -167
5862 -167 -85 -197 -8 48 35 -70 -68 -270 58 -202 -189 -85 86 166 222 -244 223 164 95 198 -67 136 -139
5885 -139 -31 130 44 -61 28 -108 67 84 96 -110 -80 225 -117 -69 173 126 79 -190 57 -3 229 206 -136
5908 -136 -99 101 -260 24 86 19 -18 -2 154 -123 118 -188 198 -172 122 29 -310 187 -65 -31 21 2 83
5931 83 -254 202 -103 259 281 -65 229 42 -137 -178 -106 -173 -73 130 23 97 136 87 -13 -230 -36 -98 -158
5954 -158 -25 9 373 70 -102 46 -146 327 139 -18 -129 52 -25 29 -69 -208 -157 192 -133 -183 -191 -108 5
5977 5 151 184 -24 82 -172 -193 0 -39 -33 168 53 89 2 51 -136 14 150 -93 154 -30 -121 243 59 -164
6001 -164 -50 27 82 -120 -52 -35 78 -93 103 -339 -192 -69 201 -138 106 -46 -250 111 280 137 111 238
6023 238 -35 195 1 -28 -90 -215 -131 319 30 89 5 -69 -71 -5 -7 -53 141 161 -124 55 57 -76 60 -22 156
6048 156 152 35 25 -163 174 -102 -160 190 81 139 13 -144 320 26 -313 59 344 -59 -112 25 15 24 -109
6071 -109 128 82 26 -51 0 175 61 166 29 164 259 152 -131 216 225 248 -25 -49 184 -85 82 291 189
6094 189 -101 -146 32 -341 -73 43 175 190 -91 -40 -87 -150 -62 -123 -45 -40 51 -310 263 -109 -236 -74 -111 -128
6118 -128 -32 127 24 -88 96 242 36 -93 -85 165 -93 164 -238 -72 136 163 -163 19 30 133 179 -44
6140 -44 -15 -103 -219 -21 115 70 157 14 -9 -151 63 -87 -95 -17 -63 -166 148 254 -104 -55 162 11 211 119
6164 119 -190 48 166 6 66 -248 -103 88 15 -68 112 33 -272 -102 128 -8 206 -30 0 228 70 -190
6186 -190 92 292 -198 -301 -9 348 138 178 355 -33 100 -114 65 15 -142 67 108 -113 -131 -57 -335 -98
6208 -98 -236 -2 176 305 123 394 13 4 21 12 -52 41 -144 283 -56 198 75 169 -80 -74 264 -433 173 2
6232 2 -91 -18 144 124 21 -183 -45 18 116 -29 195 -8 307 -153 -120 1 -231 139 -31 93 -18 240 37
6255 37 -158 -254 -41 -81 -53 -115 -72 -250 290 3 -96 341 96 -123 -258 23 -128 -24 -131 112 11 -172
6277 -172 -237 -14 104 -160 -19 64 -62 21 -188 -117 -156 -69 77 -187 233 -268 -14 166 254 225 345 80 -74
6300 -74 72 207 63 178 -128 4 -338 -145 113 -33 -166 -27 61 -135 -258 -12 306 -106 -180 202 -88
6321 -88 -101 345 -156 -323 -5 -87 321 -87 -75 -20 52 25 209 317 -10 -39 -14 -236 -337 113 -87 408 -187
6344 -187 -45 196 -128 6 -221 -212 -73 -51 7 1 -131 271 -115 -259 -131 86 90 52 -24 -182 130 145 -163 145
6368 145 -113 32 38 -52 77 293 12 -96 -42 5 -149 -192 -4 148 -181 -203 -135 27 -21 -70 -125 -165 40 -136
6392 -136 210 -21 -174 -149 -17 -71 -17 -78 -90 7 -45 -101 -142 -17 -42 -32 -132 20 -18 -240 -46 -9 232 59
6416 59 50 -104 -23 -111 103 328 -169 75 -86 41 149 -113 52 -38 -49 -26 91 38 48 -152 136 -35 128
6439 128 69 -62 -117 66 15 -163 -259 -58 249 178 2 -54 -209 71 321 -76 -235 -123 64 59 105 -186 62
6462 62 13 225 -38 36 -142 76 -289 -36 17 13 318 -203 439 230 186 -35 27 86 -290 -131 -283 179 -22
6485 -22 12 -153 -107 45 -86 24 -228 -457 -36 -131 0 -61 -9 142 -194 -45 -5 58 107 -4 -76 292 175
6508 175 139 191 155 169 -15 107 -317 352 32 -126 14 -381 -83 69 -231 -284 181 -86 -51 181 108 -214
6530 -214 59 42 155 -79 -355 57 -84 -18 55 256 6 -92 -7 35 -67 -56 203 20 -350 182 232 -104 360
6553 360 -35 -259 -19 -52 -43 -192 -7 -54 -6 -263 90 28 -52 -78 -244 152 12 -140 173 78 17 249 184 -70
6577 -70 110 173 -35 -28 92 78 -165 -107 113 32 115 -207 -119 36 54 -3 -212 -161 218 20 -120 83 -43 104
6601 104 157 -46 90 109 251 279 43 -145 -89 74 -13 233 260 -2 84 209 -151 120 16 -76 237 -318 -19
6624 -19 160 182 -8 -69 111 -180 125 126 -185 -283 -101 -36 40 36 20 -23 -82 -82 -95 85 -302 48 101 71 -6 60 -29
6651 -29 -130 -287 45 152 -121 -172 -108 -56 124 -151 -28 271 -210 259 -121 -140 22 -48 236 -95 -226 -53
6673 -53 30 110 -51 25 -81 -231 -156 22 133 -43 94 -52 -61 -70 120 134 61 -222 -231 278 129 177 -218 104 -6
6698 -6 -174 -38 198 60 217 -87 300 161 51 187 -36 -92 -9 -93 10 -29 -163 6 -134 -150 -22 -130
6720 -130 -278 -48 49 117 -53 -374 -27 -88 153 233 19 -151 -160 45 372 242 42 -185 -20 268 -174 -11
6742 -11 228 -36 62 52 -64 -120 81 232 117 62 -306 -96 149 -60 38 -106 -110 -53 196 0 59 -145 -24
6765 -24 105 -83 47 -49 50 -8 18 -195 79 260 -5 -166 148 -5 56 -20 96 87 27 153 -138 186 174 -31
6789 -31 -272 -85 117 -108 -305 171 12 108 131 -213 -44 125 -128 -216 55 -9 -155 -229 5 75 -84 192
6811 192 -98 179 127 207 -102 -49 84 69 -221 51 -278 -9 14 -17 52 -38 -112 -497 162 -88 2 -89 100 26
6835 26 -43 -155 97 88 43 -8 88 330 -57 -71 80 -90 117 162 28 137 -206 -1 -131 -39 339 210 230 181
6859 181 -24 -37 312 -7 125 -31 -168 97 16 -50 -248 -226 143 -63 47 -40 -152 -54 -77 31 -111 76
6881 76 -302 -47 162 -164 -78 283 -153 -172 140 -86 169 -224 -16 -163 -32 40 -91 -504 -26 1 -39 18
6903 18 109 -17 11 247 -230 -56 -440 -53 97 -39 -16 161 -16 -171 19 -70 5 145 -155 170 80 348
6925 348 144 292 -204 69 -110 22 -235 -17 -144 305 77 -239 192 -33 162 131 -60 5 153 -9 -88
6946 -88 185 -102 69 101 66 99 187 -213 3 77 32 38 -89 -166 -181 145 34 -125 -139 -268 63 -103 170 75
6970 75 -63 26 -279 -155 -69 181 -15 24 66 25 -376 193 20 78 -140 -79 -108 -250 23 113 -174 -142 1 93
6994 93 -106 225 -116 44 -12 186 35 67 -128 -140 109 -24 146 -77 152 -124 75 -119 -99 -78 -92 -55 -37
7017 -37 -181 -187 67 -39 -49 -33 -150 32 22 79 -106 -42 144 -21 -105 126 -62 162 -113 -136 -182 115 -130 22
7041 22 65 -172 46 -99 28 -119 145 -182 337 -128 36 340 -257 143 -174 -211 -2 155 -58 15 -86
7062 -86 147 69 -249 -2 -49 -4 -124 -5 -102 76 -91 -162 -59 154 156 10 -106 -34 -87 88 -313 -65 130
7085 130 118 50 -202 -42 34 -31 -100 128 83 -205 -46 -51 104 -173 171 -221 -247 -343 -122 41 -262 162 12
7108 12 4 94 4 -51 -129 -6 -22 61 139 -162 46 109 219 115 232 -101 54 -76 169 43 -124 -164 -234 -128
7132 -128 235 -136 -93 286 47 -74 177 -153 108 153 -69 -223 -17 -51 -309 -202 71 -50 -202 235 -281
7153 -281 199 38 -62 13 263 -88 153 -185 -213 136 -113 -125 -210 133 88 12 213 0 113 -79 70 -97
7175 -97 -101 -67 10 297 -68 -83 21 18 -327 13 -222 42 -139 448 8 64 -265 21 -169 141 166 -28 190
7198 190 44 -68 193 27 -4 29 8 29 -177 -254 -115 268 133 70 226 -78 -173 349 307 120 -64 -177 -380
7221 -380 -135 -68 266 -238 -121 -194 -41 -47 19 82 96 121 -22 231 -30 89 -97 -70 113 58 74 53 -180 -179 19
7246 19 0 222 42 -187 186 80 34 -245 -222 278 -35 66 340 31 71 9 -198 -84 243 -28 21 -72 -315
7269 -315 51 -41 358 56 4 -186 196 254 -21 -202 -13 98 335 31 138 93 173 -86 114 88 -197 -94
7291 -94 -3 134 -211 -98 -64 -121 71 -43 311 -34 -218 233 240 -9 -58 -103 -83 -62 -31 -59 51 -82 89 -307
7315 -307 -356 -108 -107 99 113 192 173 100 -18 21 122 -104 45 -147 -175 98 154 255 -186 196 -402 -12 -53 -68
7339 -68 245 112 -264 17 -293 87 95 157 240 237 -46 -123 205 -6 -161 -22 -237 81 244 124 -156 159 -44
7362 -44 -250 -22 -56 -13 -147 104 -461 -184 -243 -16 -265 20 55 73 205 -101 -224 -114 -241 -87 95 0
7384 0 -70 -97 -44 -277 357 -68 2 78 -91 -187 38 -107 -184 66 242 -201 -37 -65 11 140 -217 217 132 91
7408 91 20 -345 274 -32 -134 54 163 69 -57 -55 -42 44 196 231 57 -95 -115 -25 382 -280 130 -108 -18 -14
7432 -14 275 -24 -6 -19 -208 220 -137 -86 -117 -9 -8 -268 -189 84 -155 -197 -87 12 -82 -155 -129 319 115 -329
7456 -329 128 -134 12 143 188 126 205 290 -204 -286 68 -20 -125 48 219 -115 -90 46 7 -78 0 117 214 -153
7480 -153 22 -200 -146 -41 48 -102 68 -188 149 -122 -58 14 -251 -101 63 64 -43 -105 -168 -85 20 14 -63 -145
7504 -145 36 -54 -62 -191 -227 -146 149 -43 -390 68 -175 2 157 -193 -193 12 -139 -327 88 -45 -154 -99 -181
7527 -181 17 140 55 -17 72 86 99 60 318 -61 -387 12 -106 -32 29 -251 182 -226 37 -95 -107 -67 121
7550 121 -56 -128 -100 83 30 -335 22 -122 -82 387 -33 72 95 -40 160 211 -198 -139 -183 236 -51 -23 14
7573 14 61 -129 -108 77 122 253 -115 18 247 -82 -165 77 -118 -40 -57 12 -197 -75 -216 43 -54 95 38
7596 38 -472 151 156 -127 67 -81 26 24 -165 265 88 135 148 -92 90 143 248 -75 234 45 -4 180 -25
7619 -25 -36 165 151 29 46 153 297 -79 67 177 13 -145 -53 226 -307 125 -122 150 -174 -157 -118 235
7641 235 -251 -66 -40 -119 -26 -143 184 15 152 66 -33 -161 474 104 -62 -34 -57 -92 -28 162 -151 -198 82
7664 82 -29 -132 -241 -39 186 -124 79 -167 197 138 -197 23 6 22 61 -102 -124 -106 -297 113 56 121 -19
7687 -19 33 19 38 130 58 -22 42 215 67 90 13 293 -129 95 257 201 -149 -9 110 21 -143 -158 -53 57
7711 57 22 -72 268 -10 -75 -30 -215 -142 -139 91 -115 113 -223 -52 0 -85 32 -196 -95 109 -21 417 -149
7734 -149 20 -21 -75 41 73 135 67 -202 251 -221 210 18 -55 -40 80 253 -77 184 18 63 -90 -167 7
7757 7 136 11 18 -16 26 -199 -278 -85 -38 -65 -31 -69 -21 284 381 34 98 192 98 -107 -131 -146 -38 119 -242 -130
7783 -130 53 287 62 -413 64 -119 220 126 64 -56 67 -2 -62 -357 -209 147 -153 218 -41 200 -49
7804 -49 -65 248 97 198 -170 -339 -2 156 167 -144 -61 -297 -92 33 56 151 198 221 204 73 -98 416 -52
7827 -52 72 57 -47 -215 -174 29 146 31 53 95 73 152 9 -344 -53 -50 -95 -150 223 -73 252 -312 135 -52
7851 -52 -49 220 -24 139 -33 85 -25 -120 -405 95 112 10 196 131 109 -70 147 44 -285 -66 -149 -94 70
7874 70 -129 -9 32 -134 -244 -39 -281 -44 -21 -28 274 -99 269 -66 -136 -75 47 195 -151 270 34 -186
7896 -186 -133 -156 -165 -35 -25 46 -80 -85 160 115 -126 51 -34 195 80 142 478 -134 -53 14 167 -184 150 -5
7920 -5 -11 -198 -207 56 270 -103 -101 -186 -21 -167 -13 -203 40 247 -21 -34 20 410 -126 50 302 -32 -119 -177
7944 -177 -110 113 -16 -68 78 43 -189 111 -90 -193 -48 148 -18 92 29 210 92 -200 60 206 58
7965 58 262 -373 -119 -281 -72 64 -183 -221 88 93 211 23 -119 -179 -25 225 -73 201 37 -23 -160 48
7987 48 -98 -137 215 -11 48 -102 113 20 -154 -223 65 -135 19 -30 12 20 35 306 31 52 -326 82 187 -484
8011 -484 -35 -213 45 -23 -286 206 231 -135 -39 -42 68 -138 -156 -66 123 -73 68 -114 -88 54 144 -256 -218
8034 -218 58 -26 81 95 42 5 -152 111 -235 -113 -16 -66 39 227 85 4 -134 -180 -129 -181 70 48 254 19
8058 19 124 80 -134 -66 -124 -10 -143 119 -28 230 122 -79 36 56 23 180 211 -11 -102 -145 140 -61 74
8081 74 293 75 -14 173 75 105 190 -29 40 -267 15 25 -19 -174 90 220 151 141 11 63 -49 79 185 128
8105 128 -51 -27 -160 18 72 -223 50 -198 -61 -139 -122 199 -155 127 -2 60 -4 -30 114 -383 24 -9 -304
8128 -304 193 -10 92 -200 57 -274 242 -61 -267 -122 -101 -25 29 71 -170 -188 111 331 -128 -121 383 -115
8150 -115 77 -10 63 106 -207 151 -90 225 -3 69 -220 184 -438 34 276 -89 83 -26 68 122 -178 32
8172 32 -49 -113 -18 -60 63 198 -184 -51 -75 70 16 -64 -32 15 -173 129 -78 189 315
8191C15
$$ Imaginary data points
##PAGE= N=2
##DATA TABLE= (X++(I..I)), XYDATA
0 0 0 0 0 0 0 0 0 0 0 0 0 -8 8 -8 8 -8 16 -16 16 -24 25 -32 40 -48 56 -64 72 -82 97 -113 129 -145 165 -186
34 -186 210 -238 267 -299 334 -374 416 -461 513 -569 626 -691 763 -842 930 -1024 1127 -1243
52 -1243 1369 -1510 1669 -1847 2052 -2285 2555 -2875 3260 -3731 4323 -5097 6153 -7688 10143
67 10143 -14690 26009 -121199 -105124 117001 33328 -12577 93498 194584 54397 -100902
78 -100902 -106776 -38431 -52652 -50390 20376 92548 94816 84546 38860 -60039 -130260 -81941 -34152
91 -34152 -66459 -52118 97685 187017 81736 -40217 -4496 34232 -72366 -163580 -61971
102 -61971 86322 85091 16328 39880 82058 13336 -97163 -115910 -67601 -31431 1594 54276
114 54276 84962 80579 69695 33005 -50660 -106167 -68159 -10531 -14566 -14371 60791 118167 54009
127 54009 -48001 -59160 -26994 -53398 -87818 -30540 69226 97375 62149 41948 34300 -7558
139 -7558 -64473 -83817 -60969 -22039 19865 51671 56252 40136 21640 -7957 -54715 -80891
151 -80891 -51172 1103 27259 38952 65451 78101 38411 -25163 -57453 -55670 -51911 -43320 -8377
164 -8377 38481 61607 50296 23682 -4380 -32051 -50579 -49579 -27662 7474 42160 60878
176 60878 55455 32062 1269 -31669 -57263 -61438 -42198 -10077 21789 44457 50354 36919 10142
189 10142 -17931 -38891 -45413 -32656 -4174 25207 43875 48319 37143 10778 -21456 -45247
201 -45247 -53015 -44421 -20212 11740 35665 43772 39815 24808 -2968 -31873 -41307 -29828 -12028
214 -12028 5169 26002 44311 40203 13858 -14270 -30370 -40141 -43590 -29242 920 28127 40047
227 40047 39552 27719 6614 -16582 -31263 -33920 -24731 -4270 19866 32652 29714 19032 4721
240 4721 -17177 -38217 -41755 -24790 -3452 13119 28108 40179 35502 13168 -10776 -24200 -29224
253 -29224 -27367 -15155 5527 23554 28865 22944 9179 -8809 -25094 -31625 -27453 -13506 5988
266 5988 24958 34654 31208 18022 1332 -15744 -28931 -30464 -19142 -2438 12717 22537 24580
279 24580 16914 724 -15812 -25531 -25116 -16506 -1688 15602 28260 30148 21810 6724 -9870
292 -9870 -23157 -28749 -24038 -10516 5545 17696 22960 20270 9226 -5991 -18819 -23141 -18494
305 -18494 -7529 7134 20130 26757 23719 11491 -3995 -17920 -25711 -25160 -16202 -1321 12623
318 12623 21187 22120 14663 1705 -10902 -19279 -19891 -12655 262 12976 21119 22112 15168 2204
332 2204 -12158 -22224 -24774 -18759 -6737 6742 18000 22698 18614 8039 -4696 -14546 -18487
345 -18487 -16213 -6938 6332 16666 19967 15341 7238 -4776 -17178 -23868 -20200 -9763 2153
358 2153 12705 20488 21993 13569 -136 -11187 -16737 -16708 -11430 -977 10417 17836 17585 10521 -839
373 -839 -11856 -18557 -19564 -14340 -3792 10178 19970 20526 14180 5580 -4322 -14572 -20279 -15682 -3965
388 -3965 6480 12329 15741 14609 5964 -6944 -16505 -18407 -14061 -5859 4283 14427 19920 18471
402 18471 9128 -2738 -12510 -16963 -16104 -10626 -517 10536 16500 14833 7798 -1341 -10051 -15827
416 -15827 -16365 -9409 1698 11408 17424 17534 11380 1630 -8346 -16216 -17945 -12538 -3092 6251 12841
431 12841 15122 11712 3031 -7271 -13201 -14514 -11378 -3378 7782 15480 15608 11894 6122 -4011
445 -4011 -14988 -18657 -12621 -4625 1893 9072 16013 14968 5889 -3893 -10040 -12729 -12116 -6336 3111
460 3111 10619 14895 14497 7479 -3834 -11229 -12619 -13424 -12179 -2758 11825 16548 10315 5126 4129
475 4129 -2454 -14702 -17448 -6515 4398 6452 8325 13282 12321 1562 -9463 -13953 -13348 -9858
489 -9858 -2410 5248 9651 13238 14134 5831 -7996 -13204 -7769 -5621 -8198 -1753 14034 18971 6356
504 6356 -3903 -1712 -3144 -14049 -17675 -4821 8629 10252 8285 10083 9185 562 -8581 -12821
518 -12821 -11579 -5632 3441 8067 7157 7462 9835 3188 -11870 -16746 -6778 605 -2744 -763 13174
533 13174 19447 6929 -6869 -6026 -2743 -9228 -13593 -4171 8681 11760 7282 4499 2403 -3016
547 -3016 -8639 -10773 -9155 -2844 7595 11578 7126 4376 5998 2123 -10727 -16537 -6663 3273 2287
562 2287 478 8155 14240 5537 -7825 -9723 -4878 -4797 -6535 -1130 8559 11928 8538 2743 -2275
577 -2275 -5743 -7515 -8384 -7252 -1400 7327 11118 6791 1672 1070 -676 -7912 -12517 -5447 3938 6260
593 6260 4422 6168 8325 2741 -6302 -10777 -7070 -3798 -1642 1748 6328 9314 7220 1558 -4095
608 -4095 -6823 -6483 -5056 -2913 1458 7269 9269 5520 198 -2463 -4582 -7224 -8262 -3888 3014
623 3014 6778 6498 5525 3739 72 -4806 -7873 -6561 -2611 1276 4293 6063 6063 4041 -463 -5132
639 -5132 -6969 -6235 -3662 -107 3587 7056 7033 4393 242 -3677 -5722 -5990 -4776 -628 2821 5622
655 5622 6071 4051 813 -2887 -5617 -6075 -4606 -1111 2873 5512 6265 4958 1750 -2045 -4849 -6036
671 -6036 -4819 -2455 1291 4694 5745 4392 1855 -1201 -4244 -5995 -5237 -1982 1344 4321 5237 5367
687 5367 3191 -711 -3784 -5624 -4814 -3154 84 3134 4883 5357 3359 106 -3335 -4949 -4751 -3162
703 -3162 -579 2710 5364 5308 3111 163 -2236 -4401 -5328 -4259 -1192 2513 4318 4923 3637 1358
719 1358 -1903 -3958 -5086 -4123 -1142 1634 3912 4795 4000 1904 -1349 -3852 -4742 -4277 -1877 558
735 558 3547 4579 4178 1937 -311 -3035 -4384 -3996 -2346 427 2900 4525 3988 2225 -179 -2704
751 -2704 -4585 -4168 -2747 -178 2254 3914 4204 2644 524 -2186 -3681 -3926 -2855 -753 1875 3816
767 3816 4154 2785 827 -1832 -3461 -4204 -3451 -769 1527 3481 3704 3343 1355 -1033 -3319 -3836 -3178
784 -3178 -1456 887 2707 3719 3438 1613 -926 -3108 -3629 -3104 -1727 450 2814 3820 3581 1544
800 1544 -281 -2428 -3149 -3531 -2095 173 2206 3335 3233 2094 152 -1865 -3239 -3652 -2310 -543
816 -543 1444 3282 3271 2355 617 -1579 -2855 -3351 -2644 -637 1256 2880 3395 2516 727 -1070 -2509
833 -2509 -3290 -2576 -1107 1311 2677 2908 2659 1237 -717 -2397 -3127 -3048 -1216 563 2267 2877 2718
850 2718 1463 -520 -2427 -3059 -2528 -1575 122 1778 3151 2903 1725 -86 -1564 -2580 -3216 -2171
866 -2171 -121 1556 2626 2876 1924 243 -1263 -2736 -2856 -2080 -427 1328 2439 2711 2076 552 -1089
883 -1089 -2861 -2892 -2178 -792 783 2264 2718 2425 917 -628 -2063 -2555 -2271 -1127 649 1849 2355
900 2355 2238 1280 -387 -2137 -2556 -2220 -1372 268 1592 2607 2296 1290 -459 -1261 -2463 -2401 -1641 34
918 34 1735 2467 2221 1583 140 -1241 -2104 -2534 -1703 32 1202 2024 2028 1756 578 -899 -2390 -2704 -1455
937 -1455 -298 881 1518 2405 2030 789 -959 -1856 -1818 -1569 -1152 300 2080 2978 1823 701 -391
954 -391 -1283 -1921 -2166 -1267 390 1882 1925 1635 1112 226 -1147 -2363 -2233 -932 127 1183 1556 1547 1825
973 1825 378 -1318 -2308 -1622 -968 -500 493 1858 2506 1856 -401 -823 -1413 -1620 -1633 -814 756 2151
991 2151 2197 895 173 -222 -966 -2321 -2048 -690 1246 1413 1421 1379 1197 213 -1599 -2406 -1675 -69 695
1010 695 778 1487 2030 1484 -477 -1692 -1544 -1093 -841 -835 984 1977 1992 939 -354 -851 -1131 -1458 -1473 -466
1030 -466 1339 1742 1320 736 232 -125 -1559 -2193 -1271 348 916 905 1189 1324 970 -667 -1726 -1609 -959
1049 -959 -207 211 1059 1820 1640 413 -734 -1342 -1124 -1084 -1020 95 1110 1902 1261 382 -234 -891 -1271
1068 -1271 -1751 -1113 586 1319 1461 1130 974 314 -585 -1565 -1403 -985 -80 728 1065 1572 1040 300 -624
1087 -624 -1346 -1228 -668 -336 298 1082 1413 1066 135 -606 -943 -957 -1072 -794 378 1179 1307 910 649 -324
1107 -324 -626 -1209 -1047 -227 274 880 1160 734 699 -169 -738 -1130 -952 -568 270 766 1411 1132 714 201
1127 201 -902 -897 -1080 -877 -143 661 899 1203 1018 105 -539 -1035 -1071 -706 -65 487 964 924 874 45 -453
1148 -453 -930 -1213 -635 -339 111 1040 1076 929 409 -307 -495 -1049 -1017 -517 260 643 951 804 375 -128 -636
1169 -636 -1298 -671 -402 -234 462 904 823 833 -12 -737 -616 -919 -497 -306 292 911 732 659 90 -475 -360
1190 -360 -1117 -577 -248 373 881 1135 702 223 -166 -851 -931 -683 153 -58 772 692 721 180 -76 -943 -940 -804
1212 -804 -515 307 596 931 872 102 -86 -506 -683 -682 -682 88 576 646 511 52 -178 -332 -583 -688 -416 120
1234 120 297 856 222 455 -128 -391 -885 -933 -556 -440 216 566 952 397 167 -181 -636 -801 -685 16
1254 16 309 686 1043 653 123 -147 -688 -781 -581 -146 186 383 872 681 112 -117 -304 -599 -408 -233 -202
1275 -202 306 852 627 12 -145 -109 -820 -525 -738 -103 727 495 665 291 -158 -459 -489 -359 -310 110 191
1296 191 631 313 518 51 -395 -595 -590 -307 -59 235 530 779 461 318 -19 -489 -905 -276 148 215 592
1317 592 356 332 -92 50 -465 -520 -546 -256 232 315 675 348 388 -9 -278 -629 -470 -62 115 377 583 385
1339 385 -86 77 -125 -450 -495 -98 -214 360 579 181 481 -6 -114 -495 -394 -236 -63 588 231 453
1359 453 599 -372 -66 -290 -298 -574 -71 -58 355 231 200 336 -107 -654 -497 -270 -68 55 -69 260 252 325
1381 325 12 -376 -333 -392 -197 95 391 486 321 267 -160 -217 -517 -609 -332 71 38 435 412 196 239 -81 -123
1404 -123 -222 -187 -195 313 414 262 243 68 -220 -510 -244 -120 60 271 265 289 108 -9 -60 -80 -165 -117 91 198
1428 198 234 470 242 -102 -199 136 151 -226 -339 -9 155 177 177 -94 163 200 -446 -349 -492 304 62 19 185
1451 185 159 31 -370 -223 -164 -72 53 71 499 316 82 36 -595 -283 -110 372 -227 16 283 388 137 -460
1473 -460 -222 -85 -239 120 -163 179 104 74 103 72 -26 -243 -245 -195 252 117 87 331 26 161 -149 -553 -347
1496 -347 62 529 77 41 98 300 33 -537 -277 103 -162 -289 82 200 -149 117 22 -46 72 81 -90 -286
1518 -286 23 83 444 201 -193 -73 -32 -339 -379 130 159 645 -78 219 155 372 -16 -278 -204 -178 110 141 161
1541 161 84 122 -4 29 -274 -194 -50 47 172 66 296 36 -71 -151 -129 27 -280 -43 204 193 207 -12 -122
1564 -122 74 -55 -29 -111 157 32 4 293 30 337 82 -40 -353 -231 -62 -101 -159 452 -286 226 -76 -244
1586 -244 13 -189 -297 78 91 417 190 160 9 7 -29 -124 -234 -377 -19 205 113 221 131 -38 -72 -13 -37 162
1610 162 107 196 86 562 59 73 -42 -200 17 243 147 215 82 238 -61 -13 81 -72 -146 132 121 -144 89
1633 89 -1 184 4 -165 -136 -63 38 -205 166 149 107 147 202 -404 -42 155 -97 -38 -27 71 125 249 122 301
1657 301 -455 -188 17 -108 207 261 97 -205 185 125 -405 -227 -94 -196 152 96 111 150 113 -124 -412 -251
1679 -251 -396 -96 -152 234 -131 33 219 -112 134 -17 -10 196 87 318 36 152 -36 -47 -31 -260 -213 -115
1701 -115 204 115 310 366 97 -100 -138 -306 -193 -90 -59 20 162 236 -1 3 -248 -34 180 -151 -94 170 123
1724 123 8 79 17 195 -289 51 53 -169 63 90 126 -218 33 323 -15 47 -144 41 52 113 265 43 92
1747 92 -181 -136 -63 -79 -273 189 -140 -166 -184 58 324 -52 -71 -35 -94 -63 -6 33 -77 228 -41 394 -53 -124
1771 -124 -123 126 106 109 273 135 -65 14 38 -431 -98 -37 147 289 263 -4 -75 -168 -127 -195 -220 33 -162 200 248
1796 248 348 225 23 218 -106 158 -234 6 -145 166 60 163 19 174 -25 160 -217 -59 197 -20
1816 -20 127 162 -63 -297 147 6 11 -26 101 330 94 311 76 321 -347 -249 103 -73 -230 58 223 18
1838 18 193 -125 119 -56 112 -259 -29 -215 178 -78 -74 208 113 -233 -253 5 391 167 272 194 163 -7
1860 -7 80 61 -369 286 276 265 -34 208 -127 310 -222 -28 51 -76 214 158 260 47 -5 234 58 -69 -146
1883 -146 7 140 -97 205 -110 -120 237 96 -39 -93 -144 -129 -286 8 184 32 110 247 -164 -45 -116 -213
1905 -213 25 -14 -99 232 251 164 -51 151 -55 -103 22 -157 116 119 284 37 -135 -124 -161 -95 85 139 -292 149
1929 149 -204 390 369 -286 304 79 -28 -5 -257 -179 -106 267 -52 79 1 -121 -7 -398 258 -295 281 62
1951 62 182 -32 -151 -171 -29 -71 78 256 -100 86 -343 -79 -157 59 -47 78 -225 -8 94 150 66 65 -93
1974 -93 -269 36 -171 -79 117 255 230 -6 69 -79 161 -44 -41 -256 336 -125 23 24 -86 337 181 197 -173
1997 -173 -75 -212 31 93 171 255 -202 -81 76 -103 -25 -129 -14 240 -183 483 36 54 -217 -171 -10 151
2019 151 261 103 149 19 139 176 65 -16 -329 55 -64 23 -124 75 91 -174 116 -2 24 -195 -144 12
2041 12 274 -167 -8 285 -180 -65 -15 -255 -94 119 -247 -144 26 174 147 -48 -67 -6 -173 171 80 -254
2063 -254 -47 85 20 79 -242 -196 -299 -28 -114 120 -50 13 94 -170 -165 -123 -239 107 70 44 300 -124 -274 -117
2087 -117 -272 -307 120 -65 -151 160 129 -109 196 236 125 -166 -171 -84 -41 28 241 252 88 -191 -160 -467 -135 123
2111 123 -35 94 -15 124 -212 -184 78 -245 117 -98 -107 -74 2 -67 -14 -59 232 -20 43 -337 -142 -512 85
2134 85 -155 358 -88 -21 -76 -9 -70 -219 131 -130 277 -58 41 97 -506 -49 -99 -91 33 298 96 6 -76 0
2158 0 -107 -220 -275 162 31 383 -43 213 229 -28 -299 -79 22 -341 -279 -108 40 234 -31 214 -67 142
2180 142 90 -59 -2 33 -41 164 186 270 166 12 -234 -139 -47 -25 -20 -98 269 141 62 -399 -277 -47 40 -103 85
2205 85 271 59 31 -189 58 55 -64 -52 234 120 81 174 -256 -127 -259 -98 -7 -43 36 -183 -288 87 -37
2228 -37 80 102 -258 -91 -104 -18 -129 -159 137 458 119 -302 167 200 -315 -42 99 71 121 80 101 253 -188
2251 -188 -96 -164 -217 75 -100 120 210 186 -23 -13 -94 -86 85 55 -192 139 452 -34 177 -141 -286 -179 151
2274 151 -193 215 219 174 142 52 130 89 -207 -146 -395 17 58 105 -21 -114 380 -39 -8 -143 -115 -71 186 241 73
2299 73 91 81 -82 -8 8 -88 -12 278 -47 298 194 -45 196 -142 -164 -301 34 -73 185 356 163 502 225
2322 225 50 -11 -333 -444 -193 107 444 191 -50 -57 -133 -127 -136 -303 -174 32 -47 263 52 177 408 -276 -248
2345 -248 -399 145 -172 220 188 -44 219 102 -405 -37 -171 -167 24 137 108 -87 -31 56 -195 -58 -34 -303
2367 -303 300 -221 -55 258 249 -22 33 15 31 -86 -307 -75 -50 144 232 140 -22 -162 -246 -84 -175 15 48 120
2391 120 41 61 64 67 -154 -175 -193 -68 -31 227 42 168 -31 -57 -153 -322 -189 250 -128 254 141 -56 -70 258
2415 258 -215 -169 370 4 34 -51 184 -145 -239 -95 -327 -65 -114 -127 -94 231 159 -101 -166 -38 -81 -307 -214 158
2439 158 290 222 194 372 -58 -121 -7 -147 -142 203 90 245 103 180 70 -262 -141 -282 -107 47 -125 159
2461 159 312 166 140 -311 76 -192 -264 -324 99 232 262 -15 480 -352 67 -403 -269 -120 -133 342 -156 152
2483 152 196 201 -425 19 -87 -40 -193 232 162 31 231 402 -257 -370 136 113 -280 161 61 -44 146 -75
2505 -75 -28 -118 -243 -66 -16 147 110 -104 140 182 51 -115 -240 -126 -297 -25 70 414 161 93 185 -132 -131 -212
2529 -212 249 22 -34 441 370 26 173 -20 -195 97 -395 39 -109 66 191 -9 1 -100 -187 -328 -318 -174
2551 -174 17 364 250 -22 215 233 -10 -44 169 -44 8 139 111 183 17 -146 -224 -107 -60 -228 125 124 428
2574 428 243 224 -73 -37 -195 -26 82 -293 -140 245 -144 123 294 -150 -122 62 1 -41 -97 154 211 143 189
2597 189 -133 -239 127 -6 50 127 277 109 226 77 27 79 132 -282 -40 146 187 144 -35 42 -29 -232 -229 -51
2621 -51 -43 -196 36 50 -161 -75 -189 -204 -121 -292 -141 -40 -2 120 43 203 -79 252 -310 -199 -76 -3 -73 -14
2645 -14 430 128 286 -53 -35 -201 -234 242 124 -146 -162 128 -149 54 -196 19 -70 -440 -130 121 146 -76
2667 -76 283 -38 -99 -293 -94 -45 11 249 120 296 143 117 184 -153 -37 -172 3 166 -58 84 163 268
2689 268 -158 -102 -181 -79 -384 122 277 148 223 46 -302 79 -68 63 67 -95 -262 190 94 4 237 -161
2711 -161 -115 -100 167 -92 81 165 346 -176 51 -59 -51 -409 -37 133 54 308 169 182 -9 -33 -359 -79 80
2734 80 -90 220 446 356 252 52 53 27 -187 -304 173 -13 -191 284 313 169 286 72 -134 -54 99 234
2756 234 28 197 253 198 219 -330 -185 35 97 211 368 312 -196 -62 170 -26 -198 -27 194 142 266 -96
2778 -96 331 -77 -67 -127 -142 -151 -296 298 94 102 198 47 189 55 -139 -139 62 -68 137 -75 312 79 147 142 -280
2803 -280 -130 -2 -24 315 -2 171 163 97 272 -122 -361 -150 18 -7 -205 350 15 324 17 -49 -523 -403
2825 -403 -230 -195 309 388 53 -9 -48 282 256 -183 -179 334 286 -136 452 -108 -305 -94 17 78 3 -21 44 214
2849 214 127 156 -36 64 8 -193 -87 87 -243 237 328 128 206 256 -278 -266 -152 -38 331 -98 327 -22
2871 -22 55 163 -443 -121 -173 -155 -24 62 335 91 167 -106 -126 -143 -310 -107 -9 247 11 181 35 220 -279
2894 -279 159 274 55 142 198 354 33 250 -261 -16 5 -259 -213 -59 195 300 87 138 65 -91 -393 -98
2916 -98 -343 97 -212 -250 -14 80 -73 -248 -23 -17 -100 -299 32 46 141 234 116 7 9 148 -201 -216 141 475
2940 475 69 303 272 -93 -13 -231 166 -120 135 54 -59 225 274 -104 133 -89 -265 124 -244 262 546
2961 546 158 -215 -94 -106 182 -153 -240 -111 -35 295 359 155 141 68 -59 -356 -158 -153 -23 120 125 -78 351
2984 351 -343 15 -294 -214 -83 -337 98 181 356 -100 -79 113 -166 -78 -144 -58 34 95 131 233 104 -71 -273
3007 -273 -115 -187 -213 49 65 264 79 132 32 -58 -218 103 335 109 226 -166 62 80 -78 -154 -182 -131 46
3030 46 78 8 95 94 -1 159 65 -34 -248 57 26 -104 246 391 25 117 167 -87 -212 -177 155 197 66 188 128
3055 128 144 -111 89 246 -82 -176 246 186 -42 173 198 -173 -97 -121 -131 -150 164 -131 -77 383 -38 -245 -186
3078 -186 -27 106 -71 -225 343 25 -5 -220 39 42 39 -183 -146 65 88 299 -2 193 -149 -215 -117 -132 -115 -16
3102 -16 178 155 32 208 69 -8 -191 80 -195 -77 85 86 229 22 142 -29 -29 52 108 10 61 15 33 -158
3126 -158 -54 -61 -49 42 68 36 252 -14 75 287 106 113 -151 -132 -119 6 -52 -84 122 -56 71 138 -333 -229 -120
3151 -120 -170 222 35 -42 48 -146 45 -241 -31 29 -230 191 206 116 70 -81 -163 -116 154 -301 -62 29 67 197
3175 197 371 213 6 -56 82 156 142 2 105 116 -95 65 2 112 -300 -40 -456 243 291 -8 116 -51
3197 -51 411 120 112 -124 -235 115 256 228 116 407 -157 -64 59 -122 207 42 -303 86 -1 136 -149 191
3219 191 -110 -135 -180 -17 -36 152 103 179 44 -124 -148 176 8 84 32 153 69 32 -124 -116 -189 -165 -179 -181 -142 -160
3245 -160 -133 498 233 67 95 100 -51 50 28 -368 66 142 -126 -144 177 -345 -18 19 -17 170 139 425 239
3268 239 105 130 -91 -240 3 8 281 188 -106 -1 -232 -104 15 -170 35 -314 -186 187 -51 291 -42
3289 -42 196 99 133 134 81 -173 29 9 134 125 124 -32 -161 -421 -149 -57 122 -56 78 250 -189 308 97 -189
3313 -189 166 301 -221 68 51 69 -137 21 134 -240 169 28 228 69 165 20 76 -44 -91 58 128 179
3335 179 118 229 -78 352 -27 -114 72 -105 -242 -168 -39 42 -102 171 21 -168 44 121 -9 215 146 55
3357 55 -27 -24 -88 207 -469 -157 46 84 293 -142 111 -314 -40 119 125 -24 -157 -135 99 165 262 -183 -56 -201
3381 -201 192 244 70 -92 55 71 -9 -100 202 306 -55 -34 109 38 -119 89 201 -103 119 124 147 -55 28
3404 28 -40 -29 144 192 -111 148 -18 23 -84 -217 0 -68 46 -91 61 212 -94 -33 -243 7 -236 222
3426 222 -23 4 40 80 65 10 -202 -109 -219 -416 -154 -79 76 29 -26 176 89 -84 -91 0 126 152 66 46 283
3451 283 -34 244 -63 134 45 -284 3 -77 -6 114 11 -17 -193 205 60 307 -13 199 251 87 70 41
3473 41 -115 94 -59 -128 -190 -77 23 287 131 -53 -11 27 89 -226 14 219 124 44 48 253 148 7 93 -143
3497 -143 44 -219 -52 293 77 -50 173 16 -116 145 111 81 -27 169 -59 103 -72 -121 -91 121 -46
3518 -46 -165 -14 -218 269 373 -21 246 13 -84 -34 -173 -31 59 -75 8 -120 112 94 -179 -132 -160 149 42
3541 42 60 -170 116 -129 -54 -124 -129 -69 -89 -107 -56 -91 -72 -73 147 78 28 22 -300 -9 61 48 -258 35 -149 149 -182
3568 -182 -152 -91 33 116 -12 -130 -78 147 95 -114 89 -365 -94 148 -56 48 -129 2 154 196 -254 90
3590 90 -2 95 -39 73 7 -53 -189 -304 -89 -75 -159 2 75 -40 -197 -57 -90 -8 3 -155 -51 38 -19 90
3614 90 -243 -316 256 213 -210 -152 112 28 39 49 -105 -128 35 -63 19 87 -178 182 324 -51 73 37 -60 -140 -42
3639 -42 70 -103 -60 82 -290 116 127 159 -345 -11 -51 -45 -36 -21 -37 -117 9 4 -74 -307 -277 147 -59 100 63 -38
3665 -38 -187 46 307 -81 -60 -172 -56 141 312 -161 -146 116 86 -13 -87 -104 119 -100 -1 126 49 571 172
3688 172 -250 106 48 -201 37 -145 135 -173 -7 -55 208 -38 88 12 39 -37 -8 29 128 156 -29 253 -4
3711 -4 -18 -79 -39 103 153 -108 -184 -29 -145 -184 -60 -105 127 -16 -92 49 -52 -106 -155 5 42 -28 -47 6 -217
3736 -217 216 -67 -225 -108 -8 125 -105 -84 102 123 -72 -121 -70 -72 -139 -223 -82 324 -106 184 128 160 -119
3759 -119 236 -116 164 75 -9 -259 -54 -24 257 81 73 -159 58 -64 -339 79 -109 53 270 24 -23 21
3781 21 -63 55 154 79 61 -12 61 210 193 -3 296 219 -169 295 40 -63 134 -30 234 12 -72 332 -77
3804 -77 90 -28 -47 68 36 53 96 -326 11 -211 -13 -197 -72 273 12 -43 -52 62 -10 47 118 51 324 -214
3828 -214 -19 124 110 103 -340 171 -113 159 181 33 -189 279 -53 229 29 7 136 -105 226 55 306 44
3850 44 27 150 116 13 -82 189 -54 -165 -4 85 82 -167 93 -331 -157 238 -4 58 62 -105 13 7 102 50 37
3875 37 373 49 -105 -224 135 -215 -46 175 77 19 -169 120 9 -60 128 -151 -49 -40 111 57 244 17
3897 17 319 348 77 -99 92 -280 108 25 32 -74 -134 44 143 -316 17 180 -211 12 209 -276 -120 104
3919 104 140 84 -68 175 176 180 -144 105 -137 -175 150 283 170 45 -40 -61 -57 105 -140 -205 -9 5 55 -55 -46
3944 -46 120 164 -113 -18 -57 117 -1 -328 -65 -120 -184 285 30 -185 -115 165 114 -36 -252 -26 65 -55 -126
3967 -126 -224 193 -19 67 214 111 47 54 182 143 -13 -18 20 -45 119 46 321 -302 -312 -193 -116 30 -108 216
3991 216 -239 -91 48 134 325 -33 86 220 81 158 183 -284 -96 -25 254 -324 137 48 163 -8 223 43
4013 43 -49 105 21 -142 -294 112 -308 -205 123 -77 -102 417 -126 -61 -102 -524 -150 160 -25 137 -43 152
4035 152 222 18 -29 50 -4 -169 13 114 90 105 96 -24 16 5 -371 28 -24 -81 94 -158 39 38 -98 -76 -47
4060 -47 48 -114 104 -140 123 117 122 106 59 229 -31 -121 -36 -133 229 -152 -61 72 -45 -1 -226 -128 157 155 48
4085 48 234 234 108 -4 -9 -27 -102 236 17 50 -330 51 -157 215 148 -137 -67 152 131 -57 333 88 -113 -169
4109 -169 285 101 -16 -39 -152 243 160 169 122 138 130 -238 -5 -118 -81 -65 59 -82 466 -73 -62 -6 60 56 -289
4134 -289 -23 170 111 489 108 -17 -24 -226 65 -16 70 103 99 205 136 11 -119 -121 86 100 26 -88 20 348
4158 348 121 129 -22 64 -207 3 147 -1 32 262 86 -27 -68 -244 44 130 -25 -67 61 150 92 -23 -145
4181 -145 156 -221 104 -123 -32 -121 -56 -205 20 175 -105 -164 219 -139 -153 2 248 -54 13 145 105 -108
4203 -108 -143 -286 -303 -206 303 -16 360 147 -157 81 -74 34 18 220 16 245 123 28 -23 56 -106 24
4225 24 56 95 57 162 63 -166 -183 170 104 161 17 216 -58 -146 135 218 -6 -55 47 -167 -350 -38 2 -62
4249 -62 295 108 110 -285 91 105 254 -152 406 60 -41 191 120 -130 138 -256 -421 -197 64 -98 -198 320
4271 320 51 197 101 180 -45 -59 164 222 -23 -117 8 43 66 -28 16 -304 138 97 64 210 243 -165 -203 2
4295 2 -222 54 138 206 -37 69 157 44 28 -43 -26 300 -118 42 -247 134 139 -108 101 -168 -139 153 -78 48
4319 48 144 78 365 51 39 -178 -142 -341 -4 211 142 175 -122 -166 113 57 -93 -145 5 -124 88 70 69 7 -75
4344 -75 238 72 -75 13 -143 -376 4 10 94 226 -7 -168 48 156 128 87 47 -158 -49 225 174 116 -14
4367 -14 65 -86 223 231 168 114 199 171 80 -93 148 -6 184 108 99 454 -46 162 197 -146 4 69 -318 -312 97
4392 97 65 -115 -49 -124 -302 -47 -266 -204 -33 309 -102 22 53 302 -1 208 -269 -254 428 4 -72 2 10 251
4416 251 24 -92 -170 74 222 -32 286 59 55 81 21 196 -132 -138 -13 117 -177 -40 121 241 302 -34 -5
4439 -5 -202 23 18 26 75 1 262 142 151 47 -59 -3 101 36 70 -186 -115 -198 -21 -127 59 -240 -73 -87 121
4464 121 52 112 -356 -94 93 2 -190 -277 41 -53 -215 -11 -115 122 221 308 239 -74 90 79 -247 -88 116
4487 116 -186 -187 -23 -135 -44 61 -142 0 236 20 -42 -164 47 148 -180 217 412 219 28 103 -308 -52
4509 -52 122 -331 -121 -149 -464 -124 -129 -121 80 -232 -221 -58 62 220 179 -117 35 253 -460 -94 33 -70 182
4532 182 -95 -187 73 92 101 298 -22 -67 -119 192 142 22 55 -82 125 232 188 88 -37 -268 -32 220 37
4555 37 266 165 118 32 -44 -183 -176 -67 129 202 42 172 -54 54 144 -292 158 98 -37 29 26 127 -298 -149
4579 -149 -178 62 -44 143 -67 308 -6 -59 305 25 -219 -125 30 72 -164 -278 -59 153 -8 -286 -138
4600 -138 150 -138 90 68 -136 -114 58 300 -198 -131 125 -531 -150 13 -111 14 -76 67 -74 29 -113
4621 -113 63 -172 246 -47 -61 -9 252 -149 93 -45 -260 -138 -270 -33 64 310 20 -76 19 -7 -169 74
4643 74 76 -83 -2 130 33 -56 -21 -41 -140 7 75 -97 276 153 -56 -134 25 -237 -226 -199 200 143 232 -284 -102
4668 -102 20 -200 9 16 33 14 51 -197 -154 -11 -160 33 -119 254 -327 71 207 38 36 -24 -35 36 188 138
4692 138 -97 27 231 126 104 -124 229 -57 -23 -162 -218 -82 16 -142 -29 56 225 -117 -44 78 -357 -282
4714 -282 82 -101 -44 -231 79 289 -19 -345 36 120 141 95 55 24 60 327 230 113 -115 22 -1 133 -167
4737 -167 200 173 -15 123 -85 85 -58 242 -52 -37 141 -83 83 166 97 -34 -168 -82 -155 -85 191 7
4759 7 235 138 -57 -26 -293 255 -66 173 -159 109 530 266 39 92 -137 -133 213 -166 -66 -37 56 89 -10 178
4783 178 -86 -172 62 269 9 -206 -94 5 372 -130 18 -271 63 -107 287 82 171 167 93 287 -218 -209 140
4806 140 103 169 173 -93 -56 51 -13 83 56 -126 51 -140 -70 126 -111 -90 286 -495 69 -227 1 -86 204 2
4830 2 197 -184 -228 98 33 69 -18 372 -90 137 104 -44 15 -238 -123 -50 -79 174 -6 -23 190 291 -48 121
4854 121 204 309 125 -284 209 98 171 89 118 -310 -266 -83 -198 98 53 12 -33 -38 34 -124 4 -218 7 291
4878 291 -95 -47 102 182 -77 -151 65 -170 -136 125 112 -3 83 212 151 62 32 27 -144 -16 -23 -178 -57 -87 154
4903 154 106 -257 236 21 -98 304 -34 386 -50 77 172 170 -49 73 331 -101 -4 160 127 18 194 -180
4925 -180 47 321 -114 22 -19 -98 -108 -203 31 235 -198 2 -302 -226 -31 67 52 72 7 -37 118 -167 76
4948 76 -149 139 -43 -61 9 150 50 -382 21 -30 -181 -90 -41 82 259 -123 97 149 -140 -20 -171 -155 -92
4971 -92 259 267 46 -213 206 63 237 -207 -84 125 22 99 -29 -207 -13 -105 -372 131 -79 -95 90 -27
4993 -27 133 -259 -107 277 -39 -124 -247 -71 132 76 247 65 232 -84 -69 -153 -84 -50 85 208 209 -78 88
5016 88 338 -196 -32 -37 333 59 67 -42 -79 -144 92 -74 5 154 -35 -138 35 95 -61 343 77 30 -89
5039 -89 -11 -59 69 158 82 -9 95 -10 78 -261 4 -93 177 174 -109 -2 153 -108 139 14 154 -161 -158 223
5063 223 -32 -176 -4 225 -13 75 127 48 136 -129 -15 117 40 180 -38 -103 -33 -231 208 223 7 40 -5
5086 -5 -103 95 -51 -40 -117 -23 -191 12 234 -249 79 75 -9 128 -165 -121 -22 143 258 479 5 -51 -78 -2 186
5111 186 -288 13 80 -33 -166 131 -114 -27 106 99 -134 42 184 296 -30 -188 324 18 -78 169 -217 -171
5133 -171 -135 256 -19 86 287 -138 -104 -90 137 -27 -70 261 -2 110 14 172 302 -96 -53 -206 49 20
5155 20 136 -13 -186 -185 -165 -67 -176 -52 -232 159 -106 148 330 -73 24 -29 63 -150 -59 9 -246 299 20
5178 20 163 61 -143 63 -108 51 -164 -183 307 164 376 -218 228 -58 84 75 -42 -20 -21 -59 10 177 -210
5201 -210 -112 55 53 -215 -56 -150 -159 -38 70 -88 -107 -223 85 81 144 234 182 49 289 47 -76 -84 -68 -54 -154
5226 -154 184 13 14 -139 -22 -17 239 281 260 -267 -109 -87 111 32 309 4 -40 41 70 85 -41 97 24 106 9
5251 9 210 -352 87 18 -102 180 283 166 -44 161 226 64 -92 183 -188 54 115 -299 -114 137 60 -68
5273 -68 -3 -61 -75 94 -48 52 -53 -131 179 -37 -48 -13 64 102 -131 -167 -16 151 122 -81 -136 -54 -218 -57
5297 -57 52 -166 210 327 -99 117 -172 29 -148 -46 195 -94 3 132 115 -70 -107 84 16 130 -140 -253
5319 -253 118 233 20 -142 -46 144 113 -70 -9 -120 -254 82 68 429 -75 155 -15 -400 20 68 120 18
5341 18 -95 -208 -158 108 117 -233 -22 173 165 122 -162 22 13 -167 -77 -59 35 -4 42 44 169 94 -55 -233 105 -31
5367 -31 -53 -125 -293 26 -280 191 -52 -85 -249 -17 167 26 38 -10 128 80 153 72 -15 -217 181 -273 12
5390 12 222 -32 68 -72 84 308 -168 7 -25 -128 7 211 -39 94 -29 266 105 4 -126 -61 -249
5411 -249 -287 -67 -137 195 207 -52 -322 -43 -230 95 -98 144 48 170 -36 22 -79 37 103 139 95 201 114
5434 114 -19 38 -311 -163 -85 187 202 -49 -135 20 130 -46 64 173 -25 -302 186 -204 60 340 344 69
5456 69 196 305 -34 104 -29 -70 349 -93 -13 180 -304 -77 -108 -163 22 109 -112 -122 99 -116 54 17 18
5479 18 -318 -339 -197 8 -118 193 -55 -184 -101 113 15 -35 -15 89 285 93 149 63 -313 -33 124 -240 233
5502 233 292 -38 214 -154 -154 45 -9 117 119 -53 19 -158 237 -398 -102 68 1 38 12 -52 -4 -86 27 -26 -146
5527 -146 236 110 -76 46 43 -125 275 25 203 134 134 -79 -330 24 -136 -100 126 260 119 -139 164 59
5549 59 0 -102 303 -336 42 -305 -97 103 -82 112 -195 -60 -142 -43 -23 184 111 -124 -252 -178 -39 138
5571 138 304 -135 -373 210 117 59 28 -163 311 59 -142 -51 -168 86 -50 -57 488 -61 84 79 -89 -158 -251
5594 -251 -250 -36 4 -59 208 -145 -50 160 -202 119 100 -199 193 132 122 203 -52 -255 6 274 -259 -8 50
5617 50 -82 -92 -53 88 -89 10 288 -8 -196 -91 -41 43 74 57 45 -187 -21 107 -104 -123 328 56 206
5640 206 -166 -95 135 -357 -28 -96 -23 -220 98 256 54 114 -381 29 152 -97 -97 34 -52 81 17 -25 -48
5663 -48 -330 -143 38 21 128 -68 -54 44 -116 134 41 122 146 12 141 -27 217 -28 -76 74 -23 -23 164 53
5687 53 269 164 -43 172 255 -254 304 131 112 124 310 63 -88 -306 -410 -412 -106 -147 -3 -40 -227 142 181
5710 181 -72 -70 104 92 152 143 230 71 166 200 57 100 169 -233 -256 362 -169 -73 7 -177 -15 257 106 -128 -2
5735 -2 -75 -26 138 -19 -61 -68 41 40 62 -103 92 84 83 -100 -36 50 -34 -33 -86 -135 242 129 30 28 -197 8 2 361 160
5764 160 81 -140 62 -120 277 -137 63 -133 -152 300 -133 399 166 -38 -71 -103 34 59 167 -62 -14 -130
5786 -130 -31 67 -84 444 93 51 95 166 -263 61 -31 77 -42 -16 -181 -144 30 -104 26 23 -28 115 -243 -335
5810 -335 16 -50 50 139 -138 -110 -85 265 -10 -2 10 -14 69 -105 -98 -2 -116 145 -65 -31 102 -7 -28 86 20
5835 20 -36 -39 -188 -53 91 -94 100 -10 -147 119 -131 6 -154 -99 47 101 20 213 -27 -115 -173 49 -54
5858 -54 -200 75 181 -40 -162 31 -119 200 160 22 65 -139 22 413 130 -203 -206 -158 -45 -329 47 -39
5880 -39 -283 157 -116 166 -6 117 77 -187 -48 -59 -88 -121 144 -12 86 103 -85 -124 -108 235 20 42 46 180
5904 180 -31 -223 136 -262 6 -12 15 12 -168 214 93 148 271 -453 -84 54 95 268 121 -109 -16 296
5926 296 -107 -78 -334 87 131 12 -281 -44 3 20 -154 -106 1 64 -201 -320 341 -211 142 154 48 196
5948 196 -210 -42 -106 46 -21 8 -54 112 90 173 -47 -356 25 -186 261 -180 -35 184 -51 -333 129 10
5970 10 19 72 -57 223 -15 26 158 -391 35 -63 -214 -91 -65 72 8 291 249 71 -158 -107 44 418 403 -68
5994 -68 -59 -14 199 -62 177 19 -209 -82 -99 -183 -29 -65 -82 42 177 -218 -208 92 -8 -37 47 -72 -128 -175
6018 -175 6 192 -247 82 -5 -120 152 32 89 -8 -81 63 -157 -119 -113 74 4 194 -113 109 -137 -9 -225
6041 -225 -55 12 -23 -3 -156 66 -200 -160 155 90 -336 252 -117 -123 -17 186 169 -83 -65 -170 -24 43 29 -69
6065 -69 66 103 -157 -3 234 207 140 -273 220 66 -51 79 -41 -11 11 72 430 99 -406 -167 164 -20
6087 -20 38 440 -1 -82 -88 -66 257 35 -201 -157 87 6 54 219 -46 201 -231 -164 -149 124 85 161 39 238
6111 238 234 72 41 -95 26 137 115 198 16 221 -209 -21 -58 -20 173 163 86 -93 -165 76 164 -148 197 -349
6135 -349 -157 18 65 -40 154 -143 141 -62 -95 -155 347 37 -165 58 55 -89 73 173 -32 -107 -110 46 64
6158 64 -74 -6 32 -1 -115 11 -161 110 171 46 189 -208 -10 -211 158 78 -191 -104 11 197 -130 -172 -160
6181 -160 7 127 -90 148 -134 81 -106 -176 -42 232 -33 -11 -112 -59 -22 110 266 -37 10 43 -48 54
6203 54 -51 -106 132 99 35 190 0 -162 -42 40 -5 -128 5 -138 -223 -23 122 -5 -120 56 -300 62
6225 62 -235 -158 -103 -179 66 -188 77 -101 -94 362 -18 -259 134 -7 300 -100 66 -20 94 -37 171 227 -366
6248 -366 69 272 26 150 -125 -42 77 0 171 97 -5 341 -35 283 78 -160 -70 -345 108 105 -15 416
6270 416 4 -47 88 62 -152 -216 341 61 175 -105 -123 -60 52 -61 119 83 37 -45 -107 21 24 7 144 -170
6294 -170 65 -85 118 50 -109 105 127 170 -1 -265 20 -123 116 152 -78 -27 -16 -304 -149 -272 261 -101
6316 -101 196 -109 205 -94 120 314 -109 -107 -14 151 -252 -198 -80 136 -430 -176 37 -188 -14 72 147 247
6338 247 26 -342 -140 -200 -69 58 -79 205 -40 24 145 -27 -2 174 -60 136 130 -178 78 -119 -23 157
6360 157 116 27 6 242 274 86 184 -238 -150 41 -267 -113 -199 -52 38 -47 158 -226 -20 51 -188 -19 -111 -85
6384 -85 -86 -24 296 -42 0 -141 -89 14 -54 -151 -436 -132 -64 -71 349 147 -125 76 98 -89 129 -17 227 -287
6408 -287 -76 121 -65 229 -98 225 -29 78 -118 -122 248 169 -61 -63 -30 -349 103 -105 54 -51 -139 -67 -58
6431 -58 -75 83 11 -145 23 154 154 214 -63 77 171 9 -394 13 -180 -48 -25 -86 109 -122 -53 3 -90 -32
6455 -32 102 55 -27 -47 -61 -123 -70 -25 97 30 -41 144 -103 -138 8 100 104 284 -295 -140 39 180 23 88 53
6480 53 -31 37 -8 290 21 83 207 -331 41 -54 230 77 399 15 176 -68 -9 -52 -192 35 404 -3 -167
6503 -167 -17 127 73 191 -139 -166 47 89 50 19 -149 137 213 -27 -179 -156 -52 12 26 -107 90 -75 -80 84
6527 84 -204 119 48 -81 -198 211 162 -156 -36 -206 21 -221 209 192 178 -83 -192 -80 -33 10 -140 -152 135
6550 135 -106 2 -52 220 -140 81 36 -185 182 222 -88 110 58 55 -45 -23 27 -79 33 126 -52 253 -56
6573 -56 -213 198 -38 -127 157 -170 -65 -147 322 -14 34 33 46 -165 -44 97 26 -145 150 -158 5 -14 -48
6596 -48 -122 -3 99 238 204 65 -173 -74 -127 -63 24 -194 64 -79 -61 27 52 43 124 -55 215 34 367 -129
6620 -129 170 48 39 28 -5 165 -220 -17 -190 -212 44 286 -27 -99 141 406 -113 -158 109 -102 -157 -121 85
6643 85 -2 402 18 -234 131 132 -72 12 -183 -193 -126 36 -25 70 3 39 139 -85 67 -11 -250 24 135 103
6667 103 -36 -177 -132 6 16 -114 -47 144 99 -161 41 -83 122 -55 52 144 -26 14 113 224 104 -115
6689 -115 4 4 -95 93 -293 -83 -96 32 50 161 280 255 -88 -51 356 92 39 -121 228 169 -16 83 -89
6712 -89 -88 230 -19 92 90 82 -7 -65 -170 58 -113 32 56 83 228 150 -70 -97 -107 -202 26 -229 61 178 -18
6737 -18 -102 -82 -31 221 75 53 -33 -163 -106 69 106 -108 174 -158 -33 39 68 -13 11 -103 -149 -139 -64 151 -34
6762 -34 -117 -268 42 -164 19 -185 -285 -30 139 -91 -115 -40 47 -11 34 -108 246 -43 296 -51 -356 -108
6784 -108 180 -130 -200 -167 -182 10 -192 15 49 -175 55 115 -107 -72 -136 -100 87 -48 -248 -127 -21 -192 115
6807 115 8 104 191 -40 108 22 -282 84 64 -32 26 -85 -62 -111 -128 -370 -96 -110 -48 82 20 65 187 126 -53
6832 -53 -297 16 117 -65 -133 -92 38 34 -68 -25 49 162 181 -172 70 150 -95 -21 -24 -121 -164 -49 -332 7 69
6857 69 202 -35 -82 -18 -73 -72 -70 -112 -218 62 -119 -71 -152 -28 -256 184 -62 -300 50 -132 117 -77 106 90
6881 90 -114 -52 -80 209 78 41 131 -205 -74 298 -147 128 183 120 -110 198 10 -150 -32 100 -189 11
6903 11 -238 43 -88 59 13 155 30 -65 -69 85 46 59 118 76 118 122 -53 -151 105 97 328 -119 -32 -117 -165 22
6929 22 -199 111 -186 -7 -73 237 -65 -228 -25 -17 87 -70 185 217 -181 9 -8 0 -172 33 -242 -59 -166
6952 -166 -3 262 -103 -112 -58 -173 -61 -125 296 209 3 1 -95 52 -135 -170 -407 -205 53 213 -165 26 -91
6975 -91 -187 40 74 -15 81 -233 -82 -29 68 -46 -21 157 25 -108 -54 -234 -9 -33 -190 194 97 -25 -147 -207
6999 -207 121 81 8 74 155 178 -38 -57 -214 169 -69 15 299 -61 -5 63 -194 -31 -56 -22 266 -5 -25 -30 -277
7024 -277 -176 94 180 -133 -120 62 -81 -17 351 -102 290 -6 -27 145 -48 86 -314 -93 211 22 -556
7045 -556 112 -203 -144 -58 -26 -117 -246 -39 1 -57 232 201 268 86 56 -65 15 79 -54 155 118 154 101 90 163
7070 163 -235 51 -25 -47 95 -153 45 5 -138 1 -194 187 1 100 44 139 143 -134 164 -33 -44 -62 57
7093 57 -48 76 0 -179 -102 150 -9 56 -61 87 1 -273 43 -134 -1 -53 66 -80 226 18 -202 -31
7115 -31 -195 58 198 60 -476 -199 -176 -38 -195 -86 -153 -192 -127 -9 29 164 -218 -29 -184 136 283 56
7137 56 268 -183 50 99 163 37 123 -211 -88 19 -43 -224 236 -217 89 -108 -164 46 357 -53 114 61
7159 61 92 46 -123 -34 -189 124 -134 289 -109 231 -231 5 97 -128 -254 -23 -116 -227 -168 -172 126 79 126 -156
7183 -156 16 32 11 -14 269 77 -142 4 19 -139 -12 -164 -22 -72 77 107 -38 213 -115 -176 -447 131
7205 131 107 32 -56 -48 228 37 84 -384 -144 79 -90 311 2 -26 -60 -31 217 89 98 -186 -49 -77 3 -82 252
7230 252 0 -46 -80 -60 14 -179 267 106 122 370 -264 -61 145 93 8 65 -101 -37 -97 19 -127 -98 114 -198
7254 -198 -152 -18 -2 -30 185 -71 21 -190 151 74 105 -172 168 -115 162 23 136 -256 -191 -3 32 74 123
7277 123 -92 -71 313 72 -267 -64 328 -33 35 -59 -10 -30 -83 -247 109 1 34 35 269 115 -53 -96 -99 94
7301 94 147 -98 47 158 -237 -131 -88 48 -296 -111 -157 -34 -174 153 115 10 93 83 150 -159 172 -43 18
7324 18 7 -25 110 -9 0 223 -220 15 -53 -51 116 14 73 217 -55 252 -243 312 -169 -119 -95 15 -53 -252
7348 -252 85 180 72 -64 -183 -34 216 259 13 11 -173 60 -10 -31 -120 -235 12 53 99 114 -215 147 256
7371 256 93 -194 3 -109 71 107 -289 -251 -99 -81 133 -52 82 -72 -45 39 38 -324 147 -133 -126 -234 -56
7394 -56 25 -6 -145 24 32 -179 -191 63 22 -56 -55 -34 52 -192 186 -58 -156 51 -38 10 -127 -130 370 -73 -29 -197
7420 -197 -99 -45 -147 -64 -70 202 222 -276 -190 97 -9 -66 -59 -89 -33 52 -136 -168 104 46 3 -191 -122 33 -244 13
7446 13 59 -135 -139 78 -142 -50 -25 -57 60 -173 -138 66 -261 -217 -12 225 120 154 -43 203 75 -105 106
7469 106 47 -237 13 153 100 -62 -1 120 -95 -371 -179 188 20 -9 -166 -112 -113 55 88 86 66 154 -297 -96
7493 -96 -63 -80 138 176 -96 -153 2 -314 46 8 11 15 -41 -315 31 -152 58 70 -152 192 72 109 99 -95 30
7518 30 18 254 -113 138 -191 44 60 -170 -151 -203 81 136 18 67 201 -181 62 179 62 177 -126 -24
7540 -24 172 312 -36 202 23 -252 -347 395 126 -193 316 -157 -100 -114 -182 -44 119 -115 70 245 9 97
7562 97 92 -121 21 49 -36 -146 -114 66 -200 6 121 119 -156 -153 -69 72 -106 38 -71 -18 10 47 -46 67 -293
7587 -293 75 22 -28 3 -114 -40 -46 -7 -34 111 31 117 -52 38 -120 256 -93 5 121 73 99 36 14 -380 3
7612 3 43 175 -106 161 -66 -43 -270 -23 -293 -201 76 56 78 80 -20 -237 -61 295 -113 132 117 -143 -86 61
7636 61 66 -147 -92 72 300 22 -148 82 -82 -23 64 108 25 140 102 -305 91 -55 -83 -275 12 -113 -198 13
7660 13 -222 53 147 -130 18 26 217 102 -163 -87 76 277 -11 -6 -100 -396 28 -119 -83 152 -112 100 -135
7683 -135 53 -98 -117 -212 -46 11 37 132 92 -39 124 36 107 197 -124 -34 -162 -34 61 65 -263 114 -173 24
7707 24 -130 -196 59 132 -154 -81 -292 -138 109 -142 125 203 179 -261 13 -112 30 -63 38 -30 1 282 -8
7730 -8 18 108 -19 -162 79 -91 94 135 -96 25 31 179 -362 39 -5 -139 324 -341 -137 172 -135 -20 107
7753 107 206 -162 36 -146 34 110 -41 -138 79 192 61 133 49 -320 120 155 81 -11 -94 95 228 -15 -12 71
7777 71 0 20 47 -156 156 -117 -47 -181 -91 -102 -103 -100 -71 73 -93 156 57 -10 25 55 83 -41 -159 117 161 -155
7803 -155 -228 70 -148 -140 100 277 50 71 31 -53 -59 137 92 13 311 123 142 54 -101 255 58 277 199 99
7827 99 -48 -253 -149 9 12 216 -207 -67 172 -225 263 72 7 -50 -254 -256 -191 13 78 48 -315 -221 79 119
7851 119 -96 -1 -37 -108 250 -443 130 -111 -9 31 76 278 -34 -11 175 -232 -249 -48 -344 80 300 378 -58
7874 -58 122 47 80 268 265 -20 236 -88 -187 -70 -348 -31 -92 -121 247 242 6 -41 -33 273 49 63 -167 52 16
7899 16 -8 33 260 251 -86 40 193 97 -53 137 -184 130 -283 218 -235 -178 2 -22 -79 -69 -173 -260 81 -61
7923 -61 153 -154 4 -361 -68 -218 159 295 -156 255 27 29 61 -79 70 2 1 -148 220 0 -165 92
7945 92 -70 -54 -250 -8 -230 306 -237 184 -68 -178 13 -30 370 46 41 -229 -19 -102 -40 -187 -58 -204
7967 -204 -40 105 111 46 -92 219 108 -35 45 -87 -137 142 -31 5 137 203 79 32 -19 163 -107 332 30
7990 30 -236 -8 73 127 183 -5 156 -300 -129 -347 53 42 72 -316 -123 -225 -61 23 -4 92 165 86 110 90
8014 90 -14 29 303 46 -79 258 -76 26 -120 77 -51 -90 -167 -116 302 157 -316 -143 132 -48 102 84
8036 84 -101 173 250 -25 -219 -56 -145 -42 -54 191 77 5 -210 -79 -44 84 5 37 113 82 4 93 107 243
8060 243 -47 305 60 -205 -175 222 311 73 -107 94 -72 49 5 -215 -231 13 -151 -221 133 170 45 -71
8082 -71 171 7 75 42 208 -92 56 -81 55 -17 -2 30 -114 127 81 -13 226 237 -40 204 95 53 -181
8105 -181 -52 -142 178 -119 16 138 -191 14 -10 -56 122 -94 269 53 91 -6 -34 -187 -120 -140 175 159 -173
8128 -173 168 -88 38 89 -69 253 58 212 81 37 -32 -266 155 -53 -217 117 -209 124 -3 -154 92
8149 92 38 12 -242 -143 5 299 -7 -41 25 -57 -203 -291 43 269 44 196 -54 -26 185 -193 -170 -118 231 204
8173 204 -100 106 83 68 128 16 -73 36 -27 40 101 -136 210 55 -68 -157 -246 -158
8191a58
##END NTUPLES=NMR FID
##END=
