##TITLE=1H_DE-82msdek_TFA
 200.13MHz, CDCl3,
 8 sc
 
 27.3.2025
##JCAMPDX= 6.0         $$ Bruker NMR JCAMP-DX V2.0
##DATA TYPE= NMR FID
##DATA CLASS= NTUPLES
##ORIGIN= UXNMR, Bruker Analytische Messtechnik GmbH
##OWNER= pz
$$ XWIN-NMR		Version 3.5
$$ Thu Mar 27 13:47:48 2025 Russian Standard Time (UT+4h)  she@DPX200
##.OBSERVE FREQUENCY= 200.1313
##.OBSERVE NUCLEUS= ^1H
##.DELAY= (6, 6)
##.ACQUISITION MODE= SIMULTANEOUS
##.ACQUISITION SCHEME= undefined
##.AVERAGES= 8
##.DIGITISER RES= 18
##SPECTROMETER/DATA SYSTEM= spect
##.PULSE SEQUENCE= zg30
##.SOLVENT NAME= DMSO
##.SHIFT REFERENCE= (INTERNAL, DMSO, 0, 14.3821)
##AUDIT TRAIL= $$ (NUMBER, WHEN, WHO, WHERE, WHAT)
$$ ##TITLE= Audit trail, XWIN-NMR		Version 3.5
$$ ##JCAMPDX= 5.01
$$ ##ORIGIN= Bruker BioSpin GmbH
$$ ##OWNER= she
$$ F:/spectra/data/she/nmr/H-C/1/audita.txt
$$ ##AUDIT TRAIL=  $$ (NUMBER, WHEN, WHO, WHERE, WHAT)
(   1,<2025-03-27 13:46:14.51 +0400>,<she>,<DPX200>,
      <created by zg, POWCHK disabled, PULCHK disabled
       configuration hash MD5:
       00 E9 B6 7A A2 85 ED C7 34 08 36 98 17 FE 4E 26
       data hash MD5: 16K
       DF C8 22 63 3A 7C 01 41 EF 9A 08 0C 03 88 47 FF>)
$$ ##END=
$$ 
$$ hash MD5
$$ D4 0B 2E 1E 47 FB 3E E4 94 AF 16 34 28 6D 34 F6
##$RELAX= 
##$RELAX= 
##$RELAX= 
##$RELAX= 
##$RELAX= 
##$RELAX= 
$$ Bruker specific parameters
$$ --------------------------
##$DU= <F:/spectra>
##$EXPNO= 1
##$NAME= <H-C>
##$PROCNO= 1
##$TYPE= <nmr>
##$USER= <she>
##$AMP= (0..31)
100 100 100 100 100 100 100 100 100 100 100 100 100 100 100 100 100 100 
100 100 100 100 100 100 100 100 100 100 100 100 100 100 
##$AQSEQ= 0
##$AQ_mod= 1
##$AUNM= <au_zg>
##$AUTOPOS= <>
##$BF1= 200.13
##$BF2= 200.13
##$BF3= 200.13
##$BF4= 200.13
##$BF5= 200.13
##$BF6= 200.13
##$BF7= 200.13
##$BF8= 200.13
##$BYTORDA= 1
##$CFDGTYP= 0
##$CFRGTYP= 5
##$CHEMSTR= <none>
##$CNST= (0..31)
1 1 145 1 1 1 1 1 1 1 1 1 1 1 1 1 1 1 1 1 1 1 1 1 1 1 1 1 1 1 1 1 
##$CPDPRG= <>
##$CPDPRG1= <>
##$CPDPRG2= <>
##$CPDPRG3= <>
##$CPDPRG4= <mlev>
##$CPDPRG5= <mlev>
##$CPDPRG6= <mlev>
##$CPDPRG7= <mlev>
##$CPDPRG8= <mlev>
##$CPDPRGB= <>
##$CPDPRGT= <>
##$D= (0..31)
0 0.7 0 0 0 0 0 0 0 0 0 0.03 0 0 0 0 0 0 0 0 0 0 0 0 0 0 0 0 0 0 0 0 
##$DATE= 1743068773
##$DBL= (0..7)
120 120 120 120 120 120 120 120 
##$DBP= (0..7)
150 150 150 150 150 150 150 150 
##$DBP07= 0
##$DBPNAM0= <>
##$DBPNAM1= <>
##$DBPNAM2= <>
##$DBPNAM3= <>
##$DBPNAM4= <>
##$DBPNAM5= <>
##$DBPNAM6= <>
##$DBPNAM7= <>
##$DBPOAL= (0..7)
0.5 0.5 0.5 0.5 0.5 0.5 0.5 0.5 
##$DBPOFFS= (0..7)
0 0 0 0 0 0 0 0 
##$DE= 6
##$DECBNUC= <off>
##$DECIM= 32
##$DECNUC= <off>
##$DECSTAT= 4
##$DIGMOD= 1
##$DIGTYP= 9
##$DL= (0..7)
0 120 120 120 120 120 120 120 
##$DP= (0..7)
150 150 150 150 150 150 150 150 
##$DP07= 0
##$DPNAME0= <>
##$DPNAME1= <>
##$DPNAME2= <>
##$DPNAME3= <>
##$DPNAME4= <>
##$DPNAME5= <>
##$DPNAME6= <>
##$DPNAME7= <>
##$DPOAL= (0..7)
0.5 0.5 0.5 0.5 0.5 0.5 0.5 0.5 
##$DPOFFS= (0..7)
0 0 0 0 0 0 0 0 
##$DQDMODE= 0
##$DR= 18
##$DS= 0
##$DSLIST= <SSSSSSSSSSSSSSS>
$$ [...]
##$SUBNAM0= <"">
##$SUBNAM1= <"">
##$SUBNAM2= <"">
##$SUBNAM3= <"">
##$SUBNAM4= <"">
##$SUBNAM5= <"">
##$SUBNAM6= <"">
##$SUBNAM7= <"">
##$SUBNAM8= <"">
##$SUBNAM9= <"">
##$SW= 18.0517328524113
##$SWIBOX= (0..15)
0 0 2 0 0 0 0 0 0 0 0 0 0 0 0 0 
##$SW_h= 3612.71676300578
##$TD= 16384
##$TD0= 1
##$TE= 0
##$TE2= 300
##$TE3= 300
##$TEG= 300
##$TL= (0..7)
0 120 120 120 120 120 120 120 
##$TP= (0..7)
150 150 150 150 150 150 150 150 
##$TP07= 0
##$TPNAME0= <>
##$TPNAME1= <>
##$TPNAME2= <>
##$TPNAME3= <>
##$TPNAME4= <>
##$TPNAME5= <>
##$TPNAME6= <>
##$TPNAME7= <>
##$TPOAL= (0..7)
0.5 0.5 0.5 0.5 0.5 0.5 0.5 0.5 
##$TPOFFS= (0..7)
0 0 0 0 0 0 0 0 
##$TUNHIN= 0
##$TUNHOUT= 0
##$TUNXOUT= 0
##$USERA1= <user>
##$USERA2= <user>
##$USERA3= <user>
##$USERA4= <user>
##$USERA5= <user>
##$V9= 5
##$VALIST= <valist>
##$VCLIST= <CCCCCCCCCCCCCCC>
##$VD= 0
##$VDLIST= <DDDDDDDDDDDDDDD>
##$VPLIST= <PPPPPPPPPPPPPPP>
##$VTLIST= <TTTTTTTTTTTTTTT>
##$WBST= 1024
##$WBSW= 4
##$XGAIN= (0..3)
0 0 0 0 
##$XL= 0
##$YL= 0
##$YMAX_a= 179750
##$YMIN_a= -181549
##$ZGOPTNS= <>
##$ZL1= 120
##$ZL2= 120
##$ZL3= 120
##$ZL4= 120
##$ABSF1= 10
##$ABSF2= 0
##$ABSG= 5
##$ABSL= 3
##$ALPHA= 0
##$AQORDER= 0
##$ASSFAC= 0
##$ASSFACI= 0
##$ASSFACX= 0
##$ASSWID= 0
##$AUNMP= <proc_1d>
##$AZFE= 0.1
##$AZFW= 0.1
##$BCFW= 1
##$BC_mod= 2
##$BYTORDP= 1
##$COROFFS= 0
##$CY= -3
##$DATMOD= 1
##$DC= 2
##$DFILT= <>
##$DTYPP= 0
##$F1P= 0
##$F2P= 0
##$FCOR= 0.5
##$FTSIZE= 0
##$FT_mod= 4
##$GAMMA= 1
##$GB= 0.15
##$INTBC= 1
##$INTSCL= 1
##$ISEN= 128
##$LB= 0.25
##$LEV0= 0
##$LPBIN= 0
##$MAXI= 10000
##$MC2= 0
##$MEAN= 0
##$ME_mod= 0
##$MI= 1.114404
##$NCOEF= 0
##$NC_proc= 0
##$NLEV= 6
##$NOISF1= 3.799351
##$NOISF2= 2.8
##$NSP= 1
##$NTH_PI= 0
##$NZP= 0
##$OFFSET= 14.38212
##$PC= 1
##$PHC0= -468.435
##$PHC1= 14.39221
##$PH_mod= 1
##$PKNL= yes
##$PPARMOD= 0
##$PSCAL= 0
##$PSIGN= 0
##$REVERSE= no
##$SF= 200.129724274929
##$SI= 16384
##$SIGF1= 3
##$SIGF2= 2
##$SINO= 400
##$SIOLD= 16384
##$SREGLST= <1H.CDCl3>
##$SSB= 0
##$STSI= 0
##$STSR= 0
##$SW_p= 3205.1282051282
##$SYMM= 0
##$S_DEV= 0
##$TDeff= 0
##$TDoff= 0
##$TI= <>
##$TILT= no
##$TM1= 0
##$TM2= 0
##$TOPLEV= 0
##$USERP1= <user>
##$USERP2= <user>
##$USERP3= <user>
##$USERP4= <user>
##$USERP5= <user>
##$WDW= 1
##$XDIM= 8192
##$YMAX_p= 0
##$YMIN_p= 0
$$ End of Bruker specific parameters
$$ ---------------------------------
##NTUPLES= NMR FID
##VAR_NAME=  TIME,          FID/REAL,        FID/IMAG
##SYMBOL=    X,             R,               I
##VAR_TYPE=  INDEPENDENT,   DEPENDENT,       DEPENDENT
##VAR_FORM=  AFFN,          ASDF,            ASDF
##VAR_DIM=   8192,          8192,            8192
##UNITS=     SECONDS,       ARBITRARY UNITS, ARBITRARY UNITS
##FACTOR=    0.0002768,     1,               1
##FIRST=     0,             0,               0
##LAST=      2.2672688,     0,               0
##MIN=       0,             -181549,         0
##MAX=       2.2672688,     179750,          0
$$ Real data points
##PAGE= N=1
##DATA TABLE= (X++(R..R)), XYDATA
0 0 0 0 0 0 0 0 0 0 0 0 0 0 0 0 0 0 0 0 1 -8 8 -8 8 -8 12 -16 16 -16 22 -24 28 -32 36 -42 46 -52 60 -67 74 -81
40 -81 91 -103 113 -124 140 -155 171 -187 205 -227 249 -275 303 -336 369 -407 453 -503 562 -631
60 -631 712 -812 933 -1090 1298 -1590 2029 -2766 4308 -15293 52080 36385 -68367 40659
74 40659 158227 14347 -95150 87188 169376 -36896 -117104 78380 91238 -144477 -141537
85 -141537 71503 26191 -150210 -76368 81406 21959 -85518 18574 148142 46322 -53596
96 -53596 61750 115884 -24617 -67038 52683 47884 -103339 -98440 43504 11186 -112906
107 -112906 -39465 83011 21820 -64476 4184 91531 35967 -37555 21816 63454 -20636 -46082
119 -46082 34870 28253 -67960 -55383 50728 28709 -83070 -40246 71083 15733 -71150 -731
131 -731 78068 14793 -53065 10739 70065 938 -41305 28345 38255 -37787 -40247 18556 2735
144 2735 -56395 -25817 37380 -9949 -61073 14751 69514 4017 -31146 37444 73426 105
156 105 -42928 24664 45150 -36064 -54527 4809 -1241 -52884 -32182 24982 1071 -41720 15331
169 15331 63500 4086 -22155 41280 53142 -11098 -28182 21942 24200 -38837 -42883 12003
181 12003 4452 -37619 -20957 16311 7004 -19207 3439 35672 5824 -16459 24397 31838 -16933
194 -16933 -20550 24791 23518 -29380 -32778 21689 16511 -38776 -24871 22641 7685 -26947 -9870
207 -9870 22947 7793 -13837 16499 30395 -6701 -6186 30297 14815 -24772 -13366 18837 -2916
220 -2916 -44886 -20522 19040 -8939 -34686 935 28450 8519 -7519 17308 35710 8847
232 8847 -4949 17371 11561 -18996 -15527 2075 -10609 -33753 -17458 13629 -4527 -28091 6056
245 6056 33386 6024 -9736 16373 30509 2935 -13445 9922 13140 -15743 -13147 6566 -5817
258 -5817 -20580 -4780 10547 -5254 -19973 5011 20447 -7496 -15795 14059 20680 -3595 -10569
271 -10569 12376 20167 -5290 -11489 9883 5798 -14109 -9750 197 -6882 -15721 -3874 8439
284 8439 -5889 -10174 16926 20492 -4316 -1492 21474 16942 -10493 -12542 9285 1963 -23803
297 -23803 -15257 2102 -5997 -13701 -1858 9068 4123 345 14216 17467 -139 937 14201
310 14201 4734 -12472 -9747 3365 -1278 -19910 -13007 7373 200 -12291 -497 11385 5258
323 5258 -2316 5504 12586 1114 -2736 10033 5159 -9404 -2107 8214 -1838 -14466 -5684 7980
337 7980 -4303 -17504 -2071 9290 -3123 -7298 3937 10906 4885 410 9196 10272 280 1867
351 1867 5824 -3338 -9789 -4817 -1502 -9748 -16067 -3866 6132 -4926 -7833 8610 14713 4592
365 4592 895 10518 13758 283 -4505 4160 -888 -10889 -6438 -2629 -8443 -10087 -1693 4183 -3472
380 -3472 -4959 9808 10933 -1208 159 9228 7851 -2121 -4382 3758 2770 -7001 -4743 973 -2934
395 -2934 -5096 -2002 640 -2697 -4019 2805 5176 -3902 -1843 8739 5890 -2709 -967 7809 5841
410 5841 -5569 -4328 4998 -1014 -8581 -4056 -509 -3550 -4246 102 3215 -118 1053 8422 5061
425 5061 -1278 3143 6870 814 -6056 -4274 1629 -3173 -10445 -4228 2108 -1247 -3021 1634 6130
440 6130 4519 992 5435 6101 -247 -174 2789 -1959 -6541 -3532 151 -3343 -7992 -1562 5012 -1279
456 -1279 -3868 3682 5969 1883 -447 2855 4607 75 -1226 2298 131 -2989 53 208 -3285
471 -3285 -4126 -1450 901 -3463 -5717 1291 3369 -1498 -1282 4071 6380 2365 241 4323 5127 -1297
487 -1297 -1503 456 -3134 -5527 -3800 -2475 -4642 -5101 814 3281 -1940 749 7344 5753 1055 1729
503 1729 4919 3586 -2759 -3387 376 -2126 -5315 -3319 -1979 -2032 -1730 93 2107 684 310 4575
519 4575 3256 -919 885 3316 1498 -2332 -2124 2182 519 -4569 -1956 1293 -1037 -2820 -1071
534 -1071 641 -372 -1309 1624 2154 -323 1334 4488 1691 -619 1625 2782 45 -3595 -2028 387
550 387 -2873 -4589 -1596 -197 -605 -1389 725 3552 2323 1245 3498 2555 -113 509 819 -1343 -3619
567 -3619 -2189 -315 -2531 -4789 25 2021 -948 -623 2168 3596 1770 182 2169 1930 -1159 -579
583 -579 288 -1484 -2073 -983 -575 -1333 -1948 325 1440 -1253 -1006 1846 1983 64 -524 1680 2554 -76
601 -76 -780 1544 657 -1382 -696 -294 -1271 -2294 -1187 -45 -1777 -1902 1719 1657 -273 1118 3417 2597
619 2597 741 425 2221 982 -2183 -1650 -827 -2079 -2719 -2008 -1330 -1013 -812 822 1980 855 1796
636 1796 3462 1916 625 859 1440 593 -2284 -2065 281 -1478 -2900 -1147 -25 -513 -714 220 1266
653 1266 422 148 1891 1014 -221 1218 1323 -181 -593 -248 1047 -661 -1848 -393 36 -1325 -1620
670 -1620 -689 -77 -44 -842 788 1474 657 1140 1549 1102 389 445 759 -504 -1898 -889 -293 -2158 -2086
689 -2086 3 303 -415 -170 1170 1940 977 403 1693 536 -498 -131 -413 -1102 -1514 -831 -339 -1125
707 -1125 -849 878 757 -289 272 1244 1144 86 -364 649 597 -895 -511 41 -4 -693 -166 -57 16
726 16 -701 -232 286 -868 -73 649 37 -190 79 1138 991 -264 142 1138 -131 -756 -703 -640 -1008 -1143
746 -1143 -1124 -209 -444 -330 859 834 733 1282 1319 519 361 -160 255 -272 -1717 -942 -841 -1117 -1395 -776
766 -776 -18 257 -58 681 1350 624 673 1251 162 224 104 -50 -264 -968 -439 271 -730 -832 38 70 10
787 10 -219 123 710 152 -10 710 275 273 301 318 291 161 -136 -225 -569 -1035 -553 -301 -1252 -689 -187 318 -78
810 -78 -120 1174 1417 290 458 810 118 362 -40 -378 -465 -1197 -668 -189 -1020 -100 615 100 227 407 1035
831 1035 945 349 -38 462 227 -395 -448 -409 -317 -673 -520 -269 48 -369 211 425 42 211 528 345 -222
852 -222 161 391 -26 -501 232 191 18 -226 -383 -27 86 -512 -34 -130 -328 129 348 48 659 673 306
873 306 478 -139 111 44 -429 -881 -636 -546 -623 -699 -421 282 181 263 708 689 659 893 410 172 -99 -243 -115
896 -115 -567 -797 -471 -368 -981 -405 135 223 -15 121 463 902 308 455 74 71 382 -137 -361 -152 -226 -38
918 -38 -40 -544 -309 -2 -37 -364 -127 -97 340 275 74 484 529 105 343 115 113 -239 -553 -365 -491 -856 -402
941 -402 -387 -430 -21 432 365 369 428 955 593 287 344 488 -158 -149 -632 -616 -458 -710 -320 -133 -159 335 191 101
965 101 109 314 303 440 -249 -237 226 -104 -537 -78 24 -54 -19 -348 180 -167 61 207 70 -238 215 -65
987 -65 -199 90 199 139 -55 118 20 -113 -160 -315 -203 -241 -40 -235 -187 184 74 179 284 353 397 472 256
1010 256 96 22 -65 -18 -597 -376 39 -125 -546 -74 129 622 488 326 621 484 213 124 -387 -205 -16
1031 -16 -539 -374 -675 -300 53 -130 -400 -9 327 333 204 22 475 529 -122 9 140 195 128 -82 130 13
1053 13 -450 -25 114 -529 -11 206 -113 288 283 221 256 61 183 543 360 186 14 -20 14 -467 -346 -316 -364
1076 -364 -266 52 -457 172 385 339 159 342 497 538 129 182 192 -196 -355 -513 -365 -218 -58 -270 110 128
1098 128 59 277 204 139 214 417 168 102 -270 -7 230 -122 -134 185 -250 186 52 -298 105 -41 -318 159
1120 159 -302 -121 161 27 140 352 212 227 -133 -191 93 189 -432 -63 -342 40 67 -225 -133 254 153 329
1142 329 339 311 366 96 48 51 -452 -77 -399 -549 -175 18 -302 -147 -55 89 321 -51 29 315 266 27 -178
1165 -178 -133 -150 -157 -302 -212 -37 16 92 -326 -77 285 66 15 170 223 178 219 -157 126 -172 -44 1 -186 171
1189 171 72 -329 -162 26 -74 151 -84 105 156 65 162 -19 91 126 559 -87 -156 78 23 -310 -381 -494 -481
1212 -481 -181 -12 -287 -265 309 434 248 395 315 -127 136 76 -157 -37 -174 -429 -274 -312 -6 -333 -116
1233 -116 289 172 -45 -138 -209 123 113 156 -93 110 2 259 -24 -57 -109 68 -242 -198 -58 -136 132 -184 -196
1256 -196 43 114 69 100 -38 89 -4 127 39 93 43 -21 -182 -66 -19 128 -42 -42 28 340 340 167 343 161 109
1281 109 212 12 40 -364 -341 2 -227 -138 -59 -25 110 256 89 -27 139 42 169 140 5 110 1 -35 -166
1304 -166 -89 -154 63 -120 -238 -106 -95 115 261 -144 111 4 82 186 165 -15 173 10 -48 -119 -348 56
1326 56 45 -64 -235 85 -186 -189 -43 -51 633 272 217 -40 -94 523 69 33 -50 138 -241 -180 -167 -205 -286 -477 296
1351 296 12 137 44 73 -23 309 339 155 -135 -129 45 -164 -159 -426 156 -321 11 -208 -305 200 67 133 6
1374 6 -83 -190 198 -62 17 265 229 98 124 -158 76 -39 -209 -58 -109 -76 109 -77 -6 292 -174 220 116
1397 116 152 405 -61 -152 164 69 -288 -89 -7 -78 -122 -27 41 -20 186 324 12 145 261 -247 -47 42 -115
1420 -115 137 187 -27 81 -228 -214 -282 65 32 109 50 -42 -194 -137 -346 -75 -190 80 -46 -106 103 -198 -99
1443 -99 141 104 -131 213 -24 199 78 133 105 43 -77 140 -142 -146 -10 20 -104 -231 -281 -59 -64 -217 -309 388
1467 388 281 218 -59 152 377 553 -7 144 311 -155 150 -272 -29 -404 -95 -19 -8 -143 -81 -113 93 115
1489 115 252 373 372 104 5 -179 -301 60 -17 50 153 -237 -204 43 -81 -45 10 -46 -30 -27 29 35 69 54 137 118
1515 118 -200 -128 -64 -103 -235 -46 -150 -199 -347 -137 -185 -108 -10 324 -107 266 281 142 459 55 42 264 -144
1538 -144 80 -175 -198 -28 -5 189 6 154 30 21 219 -50 -169 -12 -132 144 -211 69 -172 89 -52
1559 -52 -116 98 -118 86 -306 -77 20 121 144 -153 41 -127 -76 59 -157 -99 108 181 -34 109 -200 58
1581 58 16 -27 165 -56 393 -60 8 174 167 107 69 87 -116 40 149 -90 -109 -111 41 152 -16 -5 82 -150 56
1606 56 280 215 212 4 57 135 -46 -68 140 -114 222 -5 -4 -83 -285 -55 145 10 47 10 1 106 284 147 -5
1631 -5 -9 -68 86 -200 21 -18 -94 -108 12 -89 -105 205 30 84 41 75 28 85 161 110 298 32 -1 -36 -154 -170
1657 -170 -274 72 -235 180 367 194 -117 131 180 265 423 278 173 34 -88 52 15 32 -187 -107 -367 28
1679 28 146 106 55 -239 209 192 -40 -87 50 100 196 168 -35 98 115 40 71 178 162 66 130 -237 -142 56 90
1704 90 5 -227 139 62 -155 105 7 134 125 -309 -201 -170 5 -128 104 35 8 76 -157 -160 -26 302 254 -42
1728 -42 13 0 -85 -16 -168 -147 -63 -283 -280 64 70 250 54 144 51 124 363 32 -52 20 -196 -205 -308 171 -206 -191
1754 -191 -281 50 341 144 145 553 -156 89 -15 176 72 68 29 3 -138 -12 401 -209 -120 -43 -44 2 -125 -220
1778 -220 -5 -304 -13 217 67 181 192 82 -68 170 50 -252 46 -148 -33 122 -145 41 -351 131
1798 131 92 -143 -87 115 -15 -10 0 147 220 -85 -90 -48 -138 -62 -115 53 138 -107 289 76 47 195 12 -17 155
1823 155 86 6 107 80 92 -178 57 -240 -405 -105 48 -207 -21 -136 -3 188 -35 360 -54 -75 260 -160
1845 -160 261 -104 -147 26 69 -128 -21 -89 -97 49 -69 94 174 102 56 250 155 255 -183 35 137 -111 229
1868 229 -248 -268 -101 23 -128 -19 189 -238 311 170 16 -66 -230 2 -168 -145 -70 73 137 -187 94 -124
1890 -124 -222 -169 98 183 -39 -69 36 -150 102 114 -61 -91 -135 -16 78 224 -31 -61 25 -58 264 105 17 -35
1914 -35 -322 -141 187 1 -34 -79 -179 418 134 -234 267 -37 -2 -14 -60 -162 -163 -112 137 -165 115 272 186
1937 186 228 -7 125 97 41 207 119 37 -103 204 -427 3 -265 -83 45 81 -97 -73 20 -96 9 -16 86
1960 86 40 60 -109 177 226 81 32 -80 -109 -85 264 -158 -65 -139 78 31 36 -23 -174 141 -201 172 -101 -17 -3
1985 -3 110 -255 -5 18 -506 6 54 212 -46 -229 149 155 74 213 -85 15 -75 -83 -348 -242 -30 -58 229 -256
2009 -256 -156 -92 186 -88 -21 77 -26 449 -25 295 92 68 -271 -23 -270 66 218 -83 26 -210 -229 39
2031 39 -111 -138 28 151 -155 -139 79 343 114 -227 -277 -62 134 -247 -87 52 -27 165 26 115 -110 -67
2053 -67 244 -195 215 161 174 50 -190 332 -168 -37 9 -298 117 -338 122 -80 103 40 19 258 100 -130
2075 -130 -6 25 208 -91 -116 -44 2 -144 47 -3 51 -364 14 75 215 59 93 108 -171 261 -40 297 41
2098 41 -288 79 324 -296 21 -166 92 -67 -108 137 66 56 -76 -136 -53 184 16 113 185 62 94 147 71 -246
2122 -246 83 -348 -17 -146 11 78 75 211 66 128 -207 119 -296 -176 187 -18 -175 200 32 -54 108 137
2144 137 -29 -28 -42 74 11 63 70 -99 126 42 -116 77 -101 97 -331 16 135 78 69 -112 -54 -9 -66 14 -128
2169 -128 -25 65 -13 57 224 -76 -36 38 16 221 -266 -204 -238 121 -143 31 -11 200 78 -239 84 149 216 85
2193 85 147 16 212 106 26 13 68 -247 -28 -191 -180 119 -52 299 -405 364 195 28 228 -4 19 334
2215 334 69 -243 88 -141 21 53 -32 -79 -79 -143 56 77 29 -220 -181 269 -66 -90 62 -134 189 -132 -70 -274
2239 -274 43 -346 -472 -36 145 -64 4 46 143 20 -89 -60 14 -14 30 -165 -328 -1 71 -106 -76 -231 105
2262 105 10 -222 -91 113 102 156 98 -213 135 149 224 -234 -28 259 34 -143 -71 -14 -37 -188 -76 -74 -137 -187
2286 -187 17 88 1 -81 62 33 -143 -36 92 -15 27 -32 10 -69 -433 -171 197 -66 -72 68 69 82 59 193 234
2311 234 -9 337 160 -51 185 -18 205 61 -218 1 -330 -54 -100 287 73 33 -4 -239 77 -101 16
2332 16 40 -468 372 -90 159 -158 -147 -208 37 150 229 289 -244 -3 268 104 -31 -197 72 269 155 -83
2354 -83 -47 73 -148 214 -130 191 -184 71 4 -103 222 -28 211 4 305 -64 -137 -20 -69 -141 304 -33
2376 -33 235 -39 -69 -162 -40 312 -213 182 -60 232 45 -35 17 13 59 9 -56 264 -193 23 120 32 -12 -8 135
2401 135 7 12 -19 -63 28 -21 105 62 87 -29 135 121 -83 4 -61 -40 -180 -52 2 175 -31 73 -164 -17
2425 -17 -168 40 83 70 -139 -83 -530 201 155 242 31 -112 173 118 184 -219 -56 18 1 -12 122 -63 -376 -151
2449 -151 277 -110 -37 -174 -121 14 -296 241 -41 68 380 160 -39 -17 23 -30 86 52 -215 76 -112 205
2471 205 12 -201 196 179 -49 -128 -185 -54 -174 138 -214 214 97 -244 -39 196 -98 -218 250 179 183 60
2493 60 -121 -143 -22 107 -171 -131 -89 -168 12 106 -5 -36 94 -50 -188 166 -129 105 -37 -52 346 104 -71
2516 -71 17 -231 41 -121 -29 89 10 -45 236 -86 11 163 -136 290 0 15 -167 15 44 143 105 -54 245
2539 245 -223 134 -298 -66 -21 290 78 52 101 -20 -346 88 -211 -14 22 77 120 -170 26 24 -182 228 161
2562 161 71 -43 117 -83 -134 54 -63 -113 -173 -222 172 58 140 92 -287 14 211 -49 30 -186 41 -182 -70
2585 -70 59 -97 -230 -92 -103 -306 -109 -167 -34 -177 -121 -27 -124 152 -105 64 -160 116 111 -43 106 155 -57
2608 -57 -15 -26 -228 164 105 -37 -317 248 -126 -274 -30 -70 119 199 -114 67 -56 -113 84 -256 49 -199
2630 -199 172 -44 -31 -38 -14 -79 298 -205 -106 29 -153 -132 17 200 -86 -34 -83 92 106 -192 -89 165 -42
2653 -42 -1 -9 25 178 -78 202 318 366 297 -132 34 -202 -88 -59 32 17 -58 331 -117 -185 -210 45 85 -129 -20
2678 -20 158 81 44 118 -120 146 -296 -309 -238 74 -21 61 121 -50 7 6 -127 -26 -19 180 97 -62 -115 57 -249
2703 -249 -3 -72 -172 251 -255 -21 -71 134 126 174 201 423 56 -15 -101 -99 -192 -60 -8 -170 192 -151 75 -69
2727 -69 121 -180 -21 -221 -113 121 56 -146 20 -280 -56 -165 103 154 -62 -110 83 -97 -128 185 81 127
2749 127 3 -100 -193 119 -222 -52 -3 15 92 75 150 129 -12 -55 63 13 -100 -140 89 -27 -186 -279 57 -101
2773 -101 -149 209 -52 -29 -156 -21 -255 29 -135 -234 -295 -61 -81 4 113 -183 -96 103 -35 -102 -226 -163 -97
2796 -97 -298 32 -58 105 132 -135 23 -14 -20 416 7 -15 63 80 75 141 -72 -151 1 241 -93 105 -123 -59 -141
2821 -141 -44 -84 -80 -24 261 31 -201 -192 43 -290 -104 332 -62 183 -152 -2 75 45 -49 124 -7 0 13 124
2845 124 213 -289 44 44 114 40 -211 -1 -155 54 -308 82 173 -29 174 9 13 -51 122 -90 -60 5 -115 -24
2869 -24 -164 310 -250 44 -186 -29 152 7 135 101 -17 111 24 14 -240 -204 -25 -138 62 -35 103 153
2891 153 173 378 87 -3 113 61 -51 -67 40 0 -188 81 -14 98 -3 389 -101 114 130 307 124 61 50
2914 50 194 347 156 -260 -46 -20 -77 -118 175 197 216 27 138 218 -172 191 -234 -249 422 -28 88 -80 -130
2937 -130 121 75 258 145 -107 -92 -94 -97 -35 -29 -125 -116 200 -107 137 23 2 -106 -349 134 255 128 120 -178 -6
2962 -6 21 -65 92 -103 -77 -160 72 47 -77 -100 -135 -155 -190 148 48 -38 166 147 -39 -242 -9 -165 145 184 -56
2987 -56 -67 -13 56 -95 -321 -129 -155 -80 310 369 91 -36 99 -90 115 -57 98 136 -229 63 73 111 -32
3010 -32 305 -58 -361 192 89 -124 -176 -116 115 170 -204 -171 3 219 64 40 143 -128 -342 -45 78 17
3032 17 -94 200 45 -149 101 123 65 80 -172 51 178 2 185 -81 -140 -95 299 26 153 205 -148 62
3054 62 236 -96 57 149 87 232 -28 221 -47 -254 -167 206 196 217 -69 -257 38 -78 62 94 290 -83
3076 -83 -41 72 -78 159 247 380 -194 -18 -74 -41 76 86 2 -228 237 48 -120 -215 -83 1 104 41 102 76
3100 76 -280 -49 -113 -137 9 -75 -276 51 177 -122 -215 80 324 86 -167 -148 137 124 -34 6 21 -117 88
3123 88 220 111 149 -272 238 33 131 -101 90 -31 -213 19 -35 57 -241 -1 -5 27 104 -108 57 -68 63
3146 63 324 25 75 72 -140 139 -316 2 18 108 186 -277 -167 177 211 -91 102 -98 158 82 -186 153 263
3169 263 155 -111 47 112 -62 96 -167 188 166 6 13 6 151 66 -34 -117 -53 12 277 210 -74 -18 121 142
3193 142 214 14 194 129 -182 -19 357 -85 96 133 -174 42 45 64 53 390 -78 -168 85 -35 132 -224 102
3216 102 218 -139 -280 90 126 -199 23 51 121 131 81 18 -306 280 159 -235 -204 -243 27 264 -222 -127 220
3239 220 -72 194 46 43 199 -73 169 -151 -72 215 -35 -564 203 2 63 437 -104 145 -1 124 39 43
3261 43 68 127 205 -174 131 80 348 -188 -8 -62 64 92 237 25 -29 -332 100 -61 92 -122 -14 271 119
3284 119 71 -151 -103 8 242 -65 186 -38 35 222 18 -75 139 -207 188 -56 52 -29 -37 431 -58 189
3306 189 -158 26 -133 -33 -31 288 0 0 36 -293 32 -143 149 -106 -11 111 -31 68 -51 -119 217 -152 -93
3329 -93 -21 34 -61 -11 -81 -197 63 79 177 17 66 14 -130 255 -74 -180 176 123 -38 -82 182 -84 -312 40
3353 40 171 123 -171 -4 195 -4 3 18 63 -126 78 -6 96 169 55 35 73 145 -15 27 17 -156 -69 89 -104
3378 -104 27 15 12 338 32 -237 39 216 -52 -260 -98 203 227 154 221 198 -58 -113 138 169 277 -180 135
3401 135 18 -132 242 -22 -72 33 11 -4 297 87 128 -112 69 -105 -211 -32 122 33 128 197 -88 35
3423 35 -193 -103 -48 -13 -250 101 18 -160 59 84 13 38 -69 111 -90 -91 24 -153 -24 -15 11 88 96 -213 10
3448 10 -71 23 78 -118 136 58 111 -45 -226 -203 217 28 -33 -3 -143 73 241 41 -252 337 -79 139 4
3471 4 76 233 177 99 130 137 32 -11 -95 25 232 -37 21 94 -26 107 18 8 141 20 -18 -13 11 139 -354 7
3497 7 -250 -173 -12 -3 -92 219 -141 -227 -113 6 39 152 111 105 -6 -138 247 207 -319 396 45 -237 -106 -144
3521 -144 26 -339 27 -175 -10 349 131 -19 -11 110 31 -130 -25 -13 -10 187 -47 146 68 -206 19 129
3543 129 -65 202 -3 34 51 -66 -145 -119 -17 -59 27 -12 57 -26 8 -6 123 -98 55 26 -112 44 222 -243
3567 -243 97 11 74 90 188 251 157 143 -186 41 -143 154 -81 -243 280 -160 -190 -18 7 209 -172 46 29
3590 29 -38 -160 214 12 181 -44 -76 100 -132 -99 129 11 -16 252 -4 -37 -75 197 -111 169 -178 32
3612 32 -104 -291 -199 -113 92 -4 123 -171 289 -36 -218 -104 -189 60 -8 -100 -57 29 28 248 -255 -102 12 87
3636 87 24 -213 121 3 5 -53 74 -88 -45 55 -78 70 -287 -5 167 15 295 15 82 63 -117 -1 47
3659 47 227 -164 64 18 240 258 40 -485 62 -72 -113 83 105 -59 245 135 -115 163 53 -177 -76 171
3681 171 106 107 26 -40 -132 142 -259 -104 -37 210 -166 -62 -17 99 -93 296 -19 29 -41 -33 -56 -99 -117 26 166
3706 166 97 -182 -229 64 -48 -15 -89 71 67 36 -149 132 -90 -13 -75 268 50 210 -9 155 20 70 548
3729 548 -206 -435 39 -35 -189 209 -15 207 323 126 5 -158 -142 -306 32 182 -223 -172 111 122 -204
3750 -204 -231 -192 47 61 1 -161 31 -37 20 6 160 157 60 -118 -274 -1 164 128 -45 155 -256 -20 -37 173
3774 173 104 -3 220 -69 132 29 -39 116 -240 -52 -89 63 -119 199 100 123 55 -19 -15 -384 -138 25 -141
3797 -141 23 -99 -235 189 81 97 18 -57 -124 156 -98 -66 157 -39 -74 36 135 86 118 -100 -143 126 -88
3820 -88 -207 -93 -42 60 22 -7 -1 -273 187 90 -115 -135 75 -88 -211 13 330 112 -277 93 -38 49 183
3843 183 -141 36 9 177 -265 -177 53 113 -114 -437 41 258 -117 -24 49 247 68 -140 36 -37 -76 94
3865 94 62 -269 -36 -140 23 215 -95 104 -19 122 182 223 -95 -164 -99 -143 211 -41 -59 271 -79 126 -169
3888 -169 -157 -122 -310 161 213 80 31 147 -26 97 4 -139 -11 359 101 381 32 135 209 -297 72 58
3910 58 36 -20 64 -46 -280 119 3 223 37 54 179 29 -68 -16 267 -313 -78 -210 92 -3 24 -97 133
3933 133 -27 -162 -134 1 267 5 270 -75 109 124 209 62 196 16 131 155 -46 -101 151 -22 99 7
3955 7 -38 18 58 34 176 29 -234 -190 24 -43 37 66 -303 -21 -136 107 29 3 65 -72 -167 -32 19 -42 -110 45
3981 45 -43 107 -66 38 -190 -26 -134 79 19 157 182 -108 253 -128 107 -89 -17 -167 -106 -5 -226 -136
4003 -136 232 -202 -370 57 8 -64 -62 -31 24 73 15 -10 256 73 -173 -99 -19 39 72 71 23 99 67 -9 95 18 -163
4030 -163 -2 -33 22 -151 -195 -130 -19 23 54 197 83 -131 -325 -54 53 -131 88 -60 76 109 8 -208
4052 -208 3 -139 98 -57 51 185 -350 258 -13 56 -279 84 52 -24 -17 35 -108 -69 73 -216 109 -186
4074 -186 58 -18 184 -258 326 37 -47 -105 21 44 -46 145 -130 -356 19 4 303 69 -227 188 71 129
4096 129 154 -49 -8 2 -154 -164 96 5 -210 183 -39 126 274 -102 -77 135 -113 -35 -87 305 -75 43 105
4119 105 -26 210 -159 280 -18 80 -55 7 -57 155 -38 291 -137 -354 1 -101 85 -53 152 -173 -158
4140 -158 23 54 153 190 112 3 -143 -147 -238 56 -117 -263 130 -89 -218 296 128 72 -197 -129 49 -111 284
4163 284 144 15 -48 113 120 -14 -89 -418 150 -123 -159 -17 103 -62 60 160 156 -172 276 156 85 -88 134
4186 134 84 -146 377 -91 80 -90 -213 110 178 88 10 135 146 -127 -58 151 -196 -66 51 -55 -28 212
4208 212 206 381 -150 102 -46 281 146 28 -85 57 105 -144 -266 -251 394 -135 324 -120 -41 157 32 -16
4230 -16 -187 -126 -402 98 -48 237 -125 21 -233 65 77 68 114 -109 27 -185 -174 -273 -49 12 -140 48 271
4253 271 -7 -205 -188 -128 25 -15 -71 -44 71 333 100 -19 133 -113 -287 12 -74 234 108 -74 270 -86
4275 -86 -36 5 -51 -18 -198 95 83 -122 34 83 24 133 -143 -72 -47 -140 -50 -1 167 147 75 81 -167 44 -173 10
4301 10 163 165 -253 -11 -171 31 84 -76 -204 -265 -22 -127 177 105 -118 40 165 -115 -288 -20 -291 -13
4323 -13 -62 -26 -30 -120 -25 156 170 45 63 51 200 109 -84 20 66 183 185 260 38 -114 60 127 123 60 -112 -333
4349 -333 -147 145 -45 -263 163 -42 -175 -149 121 -153 47 -4 -19 54 63 23 96 74 327 -114 -184 -130 -13 -42
4373 -42 -15 -5 -211 21 148 109 77 240 -37 202 -260 133 36 310 -114 -31 63 137 72 200 73 166 7 -135
4397 -135 8 -178 137 -235 -111 28 -81 24 68 191 122 50 156 -228 29 -61 82 52 -57 -106 62 297
4419 297 198 -133 111 45 -117 2 -114 81 -54 47 -103 -54 190 -69 9 -67 205 187 -62 77 35 166
4441 166 -10 -157 -320 48 64 119 172 -59 -60 127 -16 122 -140 -316 -21 73 -13 225 -40 -37 175 106 -108
4464 -108 3 -15 26 -55 -52 40 -76 3 -273 -194 186 72 188 -3 237 -145 31 15 27 160 193 331 -114 37
4488 37 -74 -179 -184 384 180 127 52 -106 53 -214 -90 283 33 -14 -222 125 166 -246 -85 -249 -267 166 195
4511 195 -192 -126 89 -91 -56 -87 -38 -24 -29 -95 -102 -132 -48 46 -67 16 -182 -185 114 33 110 -136 1 50 81 -70 -146
4538 -146 -211 79 -41 113 -145 93 102 261 -295 272 123 -52 -73 103 24 -262 -27 -184 140 -263 34 75
4560 75 -219 225 118 -29 28 120 -74 -124 216 30 -26 161 -25 -199 -37 192 -67 103 -322 -385 -51 0
4582 0 50 76 -139 -87 -34 64 -30 -401 147 -54 -103 64 59 -67 103 -16 -178 -63 -84 12 81 125 -85 -107 -35 -141
4608 -141 138 148 -105 56 26 181 -49 10 161 -54 237 -101 342 -139 -110 219 -206 -8 201 142 106 -208
4630 -208 -198 182 15 51 72 83 16 92 -61 -20 -24 48 172 -5 -253 -40 2 -61 -147 -99 80 -211 112 22 193
4655 193 -30 -231 -166 131 -117 -81 -32 211 -190 59 -45 128 274 -149 9 -205 -46 -23 86 125 -31 -78
4677 -78 86 -55 -92 182 246 -80 24 253 -4 -198 -381 -138 -3 394 -73 67 100 -223 181 47 -258
4698 -258 -80 240 -80 111 89 148 123 43 -47 47 5 47 4 -133 -34 83 -140 -98 -39 -29 -150 -427 -22 -47 -153
4723 -153 49 -157 65 61 -32 -26 212 -21 -114 121 -85 132 -13 -289 -131 6 395 -229 88 144 136 -126 -19
4746 -19 -125 156 65 -46 104 -102 55 -174 -23 103 168 299 66 -22 159 -103 -176 -32 -130 -116 -194 -360 -105
4769 -105 -117 -249 -42 -27 167 -150 191 59 -15 -63 -53 -207 -176 120 -79 -104 81 43 -189 36 -52 125 154
4792 154 148 -123 148 -283 86 165 -6 241 1 65 -164 259 -117 135 -1 -68 48 46 116 163 -84 68 -189
4815 -189 -194 124 29 -146 -7 77 -35 21 -94 -67 -77 41 59 135 241 -9 28 114 -109 165 189 -150 215 -90
4839 -90 -215 -27 120 -185 124 0 43 5 136 61 -132 244 -254 27 -183 -75 -32 190 76 -149 -171 -120
4861 -120 -282 -92 115 -127 -40 88 -54 43 78 215 24 -28 143 -138 -40 -196 -95 61 -26 -100 -96 -151 240
4884 240 -299 214 -3 46 195 -61 150 -90 -16 -136 203 -289 32 171 -85 -76 149 17 -39 20 40 138 -70
4907 -70 -70 -60 1 -131 26 -36 -17 -130 4 -10 49 -67 3 -34 85 -123 87 -187 45 162 95 117 17 206
4931 206 -99 -31 141 103 20 199 -43 -139 -224 207 -42 -70 -363 132 -73 123 -123 60 2 -103 0 177
4953 177 89 -30 -39 -163 -68 180 143 -18 -153 79 21 87 24 248 263 153 131 -85 269 -32 -47 73 139 117
4977 117 -152 -74 -42 -209 -226 -74 29 -59 -317 -298 110 39 -233 124 -101 22 -21 -39 -24 -250 204 272 70
5000 70 -28 -19 65 108 -137 192 -41 -70 174 -12 193 98 -117 252 72 71 -100 -185 -120 -144 64 -95 50 25 -111
5025 -111 -43 -47 236 -31 -66 25 -47 -60 -276 -130 20 -37 -200 -222 -115 91 84 -120 -104 154 69 188 16 -123
5049 -123 -140 -125 216 243 49 -134 -98 -257 241 -100 120 -131 -191 254 -93 160 -84 23 86 -206 78 -33
5071 -33 -130 84 -49 -112 -115 75 -31 239 -299 34 165 33 143 363 80 -135 -56 36 102 127 48 24 -87 -255
5095 -255 174 54 190 -37 -16 -57 -99 89 247 231 -17 204 -14 370 -144 -149 -173 113 -176 109 55 9 -131
5118 -131 -130 98 -206 -269 -268 -95 -53 24 -84 18 -117 88 -196 95 -58 174 -136 -120 431 -27 54 -77 -123
5141 -123 -103 -133 -215 41 10 85 -147 -203 267 45 -61 13 -235 -93 154 92 -177 -160 -379 -292 -193 -46 269 -123
5165 -123 -156 -61 108 34 51 59 -29 17 -117 -29 62 -138 86 -17 -97 -102 100 68 197 292 -126 -198 150 -10 193
5190 193 -323 11 75 -170 101 26 -64 78 22 181 -133 -86 7 -29 314 -107 82 69 -232 -176 10 -40 260
5213 260 -325 69 16 -61 112 55 -60 -137 -22 49 -87 126 -140 1 -35 -177 -45 130 114 -196 -29 -32 -156
5236 -156 21 -131 -259 -19 -123 20 73 280 269 -16 -51 188 33 -151 329 9 76 10 -159 226 -1 190
5258 190 90 -138 50 -77 -64 -78 267 98 50 -146 169 -33 136 -246 119 322 -149 171 144 -66 156
5279 156 -156 204 128 -37 216 203 26 49 -237 132 -11 -167 54 5 5 -183 -160 -278 -104 -75 -12 205 -38
5302 -38 113 -81 -186 181 -249 418 -132 77 188 85 60 -95 125 -256 330 334 301 206 123 -190 300 -4
5324 -4 19 -72 -3 178 -91 176 -123 -47 -57 -221 -154 228 375 -27 -386 -183 179 -170 48 33 -48 -110 -100 -284
5348 -284 164 -117 -25 -157 184 154 40 -20 62 -311 60 20 -121 306 -141 -182 -43 -134 64 -93 -305 -80
5370 -80 -14 -29 205 -95 -41 -50 167 10 172 100 -119 -224 60 -184 -174 15 -152 -64 -90 202 -10 111 197 293
5394 293 -32 -76 80 -78 12 -63 -164 -225 -102 163 -126 128 -66 73 -2 167 4 1 238 -82 -87 -49 5 -192
5418 -192 -151 43 -31 104 142 135 -39 -84 143 15 -199 123 -255 -6 82 172 -308 -14 -83 380 -22 -199 49
5441 49 31 184 89 -119 -14 -418 -225 -1 -142 235 33 -35 114 -60 -32 95 -196 14 46 -142 -54 -116 35
5464 35 137 -79 56 -193 228 -50 11 283 -323 203 -101 -136 58 107 -129 12 63 -51 9 146 26 185
5486 185 155 38 136 -274 13 32 142 -48 -80 -98 -24 -172 270 67 58 12 -342 79 41 37 -169 206 101 1
5510 1 2 -203 36 324 -126 -333 -217 96 -340 176 26 -52 24 15 120 -265 -21 -114 -14 32 -181 -67 10 -269
5534 -269 25 23 -170 -49 14 29 -25 136 -89 66 -127 -87 109 -271 -27 10 144 117 -77 -266 70 186 91
5557 91 -315 94 73 -16 -6 -145 23 46 135 -101 41 20 158 179 -94 114 59 -209 -7 -262 -36 -215 191
5580 191 -84 96 140 42 -230 13 12 385 120 -187 224 -11 73 -132 -183 11 210 197 140 -351 38 85 -18
5603 -18 -78 -193 159 -106 -112 212 -127 139 53 46 170 -167 95 -117 -75 152 -162 209 -98 231 -75 -41 79
5626 79 -248 34 -221 174 -37 -157 -253 51 174 -138 62 -174 106 -11 156 29 44 -33 -13 -90 -107 99
5648 99 98 174 114 384 174 20 318 38 91 -6 49 80 313 -262 77 18 15 15 -31 -42 42 83 39 141 -231 -177 75
5675 75 54 -80 -136 -53 -60 129 215 256 59 -75 28 -52 65 -88 -172 -4 30 166 -131 -47 129 58 331 78
5699 78 -44 107 406 -459 -153 166 -26 23 -172 -366 -167 -156 88 74 14 115 -122 -143 214 -130 -127 -154 70
5722 70 -55 -150 210 108 302 60 -115 11 235 -12 -363 121 32 83 -97 305 56 -26 27 -201 -2 -186
5744 -186 -245 -59 211 25 -110 -187 44 -85 -100 234 -157 -59 82 -7 -281 -131 13 26 226 77 94 117 -143
5767 -143 159 -51 -205 28 110 43 281 72 166 159 -19 -306 -11 -20 -161 -64 29 16 -18 31 11 341 -214 -246 -86
5792 -86 -365 -40 -186 -38 94 34 -139 233 55 140 167 35 77 12 -94 33 79 -209 -226 -161 -84 293 17
5815 17 276 172 139 -25 216 -115 138 269 63 97 178 -75 -150 225 -108 32 -30 -38 -178 -244 204 102 -273
5838 -273 -106 -41 -116 -231 185 80 34 -52 -58 -45 -102 80 -121 99 54 22 142 -17 -68 124 3 -188 159 83
5862 83 139 54 312 -196 2 -91 23 -51 137 -185 -59 54 -37 12 -63 188 -78 -71 -10 39 -143 84 1 -46 150
5887 150 51 77 57 -58 162 -160 -36 236 -80 77 6 -151 194 -66 49 -9 13 104 29 32 10 -1 351 49
5911 49 18 -169 -75 320 -13 -16 7 -60 -36 -11 -10 -149 52 158 4 21 -132 -14 122 133 45 220 12 -2 -359
5936 -359 161 -194 249 -168 -267 102 222 233 68 -181 61 74 -144 -193 -12 -43 -251 -81 36 101 -159 11
5958 11 -122 -9 124 184 85 -119 275 -82 168 -27 -44 58 -211 20 -63 108 -41 42 203 -217 34 -97
5980 -97 -12 -63 -10 -338 -240 -54 -208 76 104 214 64 351 104 103 -145 -402 49 -9 71 26 -58 50 -155 152
6004 152 -57 104 143 -117 35 -154 125 19 -91 -66 14 -61 -298 -74 -23 102 140 -10 -127 158 -114 131
6026 131 114 2 152 174 66 262 319 301 38 125 -212 60 152 214 2 -121 -136 250 -91 -292 -94 -76 151
6049 151 47 -103 -73 -247 68 39 -63 116 115 72 -128 -168 -197 83 -29 -322 51 -68 11 -8 -15 -29 139 58
6073 58 47 -11 -363 176 143 41 3 -407 -390 -137 77 -137 30 -160 37 17 51 -48 69 164 84 -62 87 -72
6097 -72 -18 34 -36 -10 -66 49 -184 251 -28 -108 345 162 -35 -218 -194 -73 3 38 89 88 -35 -100 155 120 -142
6122 -142 62 -80 95 -183 119 -47 132 -115 -9 291 -115 -6 112 147 -249 -82 24 55 -34 -241 32
6143 32 166 -49 122 -63 -104 169 168 -107 -61 39 32 88 -195 100 137 112 51 110 57 -11 -289 -151 106 -429 63
6168 63 -75 237 -94 -195 72 20 -88 96 64 71 -25 0 23 -28 -239 -190 170 257 -115 76 -77 66 -204 133
6192 133 122 -20 124 73 -80 -183 -40 -61 244 -102 125 -43 43 11 -158 -30 -15 29 -148 -229 -199 61 -90
6215 -90 128 131 -38 342 -24 -89 88 67 217 -61 4 -194 104 319 -158 -220 108 -160 108 -53 355 -39
6237 -39 -328 175 -209 121 149 148 -327 -72 133 -148 52 90 -196 126 102 -230 -231 -105 0 -75 111 -58 -49 -138
6261 -138 -46 -261 162 -113 -245 -91 220 138 -255 91 -146 -121 -134 128 103 -199 179 78 173 -73 250 -73
6283 -73 24 -141 -103 36 -122 90 -36 -240 -219 211 85 100 224 -111 9 224 11 179 -68 1 247 -323
6305 -323 133 -62 93 -106 258 104 109 70 75 -161 36 65 21 61 -177 110 -80 271 -2 -67 154 -66 -3
6328 -3 389 4 34 103 27 -140 86 -289 -161 -126 -240 -250 -60 33 76 -12 -227 -45 74 253 -48 -90 15 15
6352 15 147 305 7 91 -137 -10 0 176 -79 -215 4 136 -63 -40 81 226 169 -75 97 90 381 43
6374 43 -40 53 167 -27 -38 5 -221 -157 156 -31 -44 165 96 6 38 -110 -52 -248 353 121 -1 -73 124 -116
6398 -116 -129 -118 -11 9 -176 107 -30 10 -81 416 -33 -112 78 186 55 -59 235 299 105 113 31 254 -165
6421 -165 -428 -186 -18 -21 -144 48 3 51 114 -215 40 146 -99 -158 272 223 42 -246 49 111 -108 66 -134
6444 -134 25 -26 111 -79 -294 -11 -127 57 -403 22 7 -18 82 -126 -20 -81 -62 203 196 -112 230 -226
6466 -226 166 25 129 222 13 146 91 -53 -44 -4 70 -103 138 -86 47 61 -227 141 193 -88 -264 -6 -37
6489 -37 -70 -143 116 139 124 -14 -86 33 -203 218 -152 -27 305 202 58 -236 -169 -31 46 7 24 -50 -196 -148
6513 -148 151 -72 52 -28 102 121 -41 -86 27 87 -109 -162 -28 -133 48 27 43 -98 57 310 185 50
6535 50 14 140 -80 51 -44 122 -82 -21 31 114 95 135 -121 197 245 -114 75 98 -132 84 141 51 -85 35
6559 35 -1 147 64 47 92 -33 64 127 -6 -49 -9 -100 -125 -71 -111 -239 133 42 163 -99 196 245 188 46 333
6584 333 259 -108 -88 -21 217 123 52 -12 -107 -165 69 -78 102 153 -99 65 -92 108 40 -254 149 49 21 261
6608 261 70 90 -33 -117 44 -17 69 -18 8 190 -236 164 157 20 -110 -43 16 -43 109 132 258 -1 237 -63
6632 -63 -7 96 80 249 150 83 114 -137 248 39 147 18 -103 104 -8 277 69 32 -39 102 103 -54 34 102
6656 102 -155 -88 -33 218 -169 -205 -13 -40 -67 -288 -97 -60 -172 -160 34 -65 -13 129 171 -35 69 -120 68
6679 68 62 74 -130 209 49 -158 73 71 -323 -69 -182 17 76 -1 -129 -155 234 -80 -128 98 -15 -60 184 183
6703 183 -336 167 -19 -371 44 -236 70 -131 -140 -113 20 -41 341 -80 -91 92 -17 3 52 82 155 -238 -100
6726 -100 -36 -173 51 48 -25 58 89 -70 -98 10 146 218 77 68 303 -243 -172 -68 -118 285 -142 -62 52 106 144
6751 144 55 -206 210 -111 -74 72 7 272 186 -112 -336 -107 -7 -29 -134 235 144 -161 28 4 -136 3
6773 3 -43 163 -108 23 31 -136 50 98 -275 43 312 -194 154 22 -116 -222 166 -207 -40 102 22 -116
6795 -116 85 32 -73 46 112 115 -39 112 165 -211 155 194 -182 34 252 -9 -7 -63 36 -15 -179 -191 142 -40
6819 -40 -59 60 111 -199 25 -55 30 -7 -138 77 -42 -2 -4 -154 184 246 -53 -28 65 -63 -161 -226 186 -54 21
6844 21 110 -132 -114 -192 26 118 -19 40 -155 -72 225 117 265 -81 54 58 293 5 -61 -91 182 -78 -94 97
6868 97 45 45 -261 285 165 137 -139 194 140 -222 90 -181 86 -56 -112 -128 132 244 -48 13 -143 108 57
6891 57 -103 -122 46 7 -89 188 -156 -14 114 -120 108 88 112 134 111 -246 -139 -114 -13 224 -52 -6 -282
6914 -282 -94 15 -40 -11 -13 19 3 -51 -46 -143 -47 -7 73 -75 -94 -17 54 -42 -110 29 49 143 -130 33 14 232 -116
6941 -116 -102 133 -48 -105 110 -20 -105 -211 -201 206 -242 -42 -367 -94 191 0 -91 -9 -104 -248 -57 187
6963 187 0 -57 217 -3 97 -38 64 -160 -149 -125 70 -287 178 225 69 120 -157 205 -192 53 -124 178
6985 178 -60 206 -51 102 236 -42 111 57 144 -46 172 -321 -122 101 291 316 -96 76 -196 70 56
7006 56 -88 -499 121 67 18 77 52 236 -42 -90 25 281 -9 142 -278 9 -177 -180 159 -230 95 69 107
7029 107 210 -116 -190 112 55 49 -294 -115 -25 119 -100 -227 -154 227 39 -136 -6 -54 171 134 -52 164 -1
7052 -1 -8 -187 -64 276 24 -107 126 -8 163 49 37 190 -119 -114 306 115 -121 -115 46 -70 72 -140 -98
7075 -98 -290 19 40 -4 333 -123 199 80 46 -50 352 -24 56 112 -21 -7 -119 -63 65 -166 -269 -104 125
7098 125 -70 49 99 107 29 -224 -123 222 -190 41 163 38 -14 192 -85 202 10 -160 -102 -51 102 141 120
7121 120 227 56 -198 -325 -115 163 -14 -123 202 -51 115 31 186 1 87 -171 -18 -195 -181 21 69
7142 69 7 -60 11 54 -236 124 68 350 80 161 -1 132 290 -32 -107 28 23 94 189 202 13 170 -262 -217 2
7167 2 -97 -103 250 -122 -39 32 89 -61 123 101 86 -111 -142 -79 -72 127 -40 -43 -32 -95 95 20 -238 352 171 -224
7193 -224 -297 43 187 177 112 128 -29 -25 -191 -13 -60 115 83 -143 -111 31 247 110 263 -116 28 146 157
7216 157 20 -153 -23 329 27 69 -99 -123 124 -165 148 55 143 -89 111 -111 79 292 -57 30 57 -305
7238 -305 55 -164 -137 257 -24 -64 15 105 63 234 129 189 5 -147 207 56 -4 136 226 69 -222 -33 -68
7261 -68 304 -78 -105 -92 -41 -41 -181 -100 35 -90 -68 107 -3 72 228 161 -5 -18 200 24 -116 125 -134 9
7285 9 57 50 -84 200 -188 163 122 -73 -30 31 149 -88 -81 67 -154 40 -79 -11 16 -87 79 -142 29 8
7309 8 -75 -402 74 81 209 -29 60 129 -73 -111 -38 137 -33 -247 23 285 179 156 -99 42 148 143 18 -242
7333 -242 -26 100 -93 -26 -19 -31 400 139 -138 -121 -113 -176 -199 31 -102 80 -270 -58 -335 138 94 -4 -61 -17
7357 -17 -185 33 85 48 83 166 -37 204 430 -180 -109 -35 -237 -84 -93 247 -108 118 -32 90 -119 186 -40
7380 -40 -198 -20 152 -129 -89 225 -15 281 -75 104 134 -179 78 -75 140 -232 121 194 -221 27 -127
7401 -127 12 -272 -69 86 209 -44 -15 19 -138 2 -209 -115 138 -305 -93 319 -127 319 -11 292 66
7422 66 98 -40 18 197 145 267 -161 81 -65 -99 -69 -139 41 98 -83 324 -71 -42 303 200 -5 -146 174
7445 174 -132 74 204 90 -106 170 -81 136 215 79 102 -156 -223 -202 152 -183 48 -181 -209 146 3 149
7467 149 129 -57 -241 -1 -203 58 101 60 110 -168 -152 -96 195 -100 180 -54 -76 -288 -177 -21 100 229
7489 229 -385 104 -133 -27 -84 -252 220 44 49 8 176 86 162 -202 -73 -131 93 -244 171 32 -16 311 124
7512 124 36 -102 -53 101 -26 133 -248 -107 129 132 105 100 195 -136 -22 -129 -88 -8 -57 351 -42 262 -106 -266
7536 -266 201 -36 -41 -253 -303 38 67 -115 -28 91 -171 9 281 -243 78 58 64 29 -50 -90 125 16 110 -36
7560 -36 61 -76 33 -43 322 101 -129 -201 -122 -184 -104 -125 -14 -155 -184 -22 -113 -361 34 8 -166 114 60 -61
7584 -61 126 -177 -59 -90 -133 61 53 -266 -137 122 -243 125 -25 232 -37 36 115 -52 518 -166 -76 20 -33
7607 -33 229 -66 -86 -9 -28 -52 159 185 -136 7 -30 36 -158 71 -54 26 120 150 -55 -71 -6 -85 29 37 -80
7632 -80 442 72 74 -49 24 13 -324 -90 236 -124 33 316 68 153 47 261 -16 -374 -76 -31 -164 -55
7654 -55 -82 -84 126 46 -106 237 107 -101 -95 -96 -112 18 -262 -192 -121 -147 84 -180 -38 -94 26 139 94 -209 269
7679 269 15 -40 263 168 301 78 -121 127 -278 -336 -229 -32 208 28 -39 -52 -60 357 -389 122 86 -290 38
7702 38 -52 144 -230 -133 -80 7 163 74 -10 25 102 100 -113 -187 -78 75 -45 169 201 -81 -172 -408 -30 12 -36
7727 -36 50 193 -139 -168 123 -85 -25 -81 179 46 -83 25 -236 62 42 178 -110 -23 -154 -18 -57 -28 73
7750 73 172 -63 -199 -42 110 -121 101 206 -309 99 -120 -41 -49 182 185 54 -37 -125 -455 501 -191 125 96
7773 96 147 186 -176 203 -38 130 214 -33 -294 -133 -154 137 -47 178 24 96 -157 77 74 -137 175 148 127
7796 127 -10 -99 17 163 142 -85 13 122 -30 -118 21 -16 -120 0 33 167 50 -151 81 -37 77 280
7818 280 -9 -60 -57 126 125 -122 -64 -91 23 -109 100 26 -19 172 5 -183 128 -136 -96 -47 72 -82 -230 109
7842 109 -6 -57 121 86 -150 -54 -95 40 -42 16 -164 89 66 -185 182 84 -49 -14 85 71 -5 -211 -52 107
7866 107 22 -75 236 -136 28 89 -147 164 -70 156 -86 45 44 128 -118 118 -40 -281 -75 225 124 67
7888 67 46 -30 -216 10 -166 33 -91 253 -272 -156 -12 27 -149 152 48 81 79 3 144 25 150 -25 48
7911 48 161 -3 -153 29 199 -113 -23 45 -71 273 8 30 -123 313 192 54 -70 202 -150 -153 -6 -242
7933 -242 120 202 105 87 -119 326 -24 -446 -2 -224 46 236 -164 90 -325 179 -143 72 208 -227 165
7954 165 33 170 131 51 268 15 1 -228 30 25 207 -31 86 -7 -8 -99 -25 -10 -177 129 -325 78 -22 -23
7978 -23 122 -220 -165 69 -242 87 153 2 -83 -184 30 82 50 -26 -159 225 -20 -52 37 83 129 -116 63 -20
8002 -20 -85 -17 54 77 9 77 -32 -253 -376 142 -151 -148 91 -208 -131 -234 14 -306 -113 -268 -328 18 -12 -74
8026 -74 -249 70 29 209 93 107 -319 -229 -179 166 -30 126 227 59 -256 -36 75 -211 175 -137 -220 -22
8048 -22 -68 -191 -107 -49 141 120 192 61 -45 -156 298 -114 -22 -279 30 97 150 22 -238 -46 -297 -21 14
8071 14 45 -51 -196 -213 -29 -88 -62 131 -355 -14 -25 -52 160 -62 -95 163 -104 -39 149 86 -206 -153 -175 110
8095 110 113 -186 -39 52 293 209 237 -51 -260 24 -78 391 32 -164 -133 -418 74 135 -21 184 131 -153 161
8118 161 32 121 119 -48 -269 -212 225 143 59 -92 120 190 -138 86 40 289 114 265 45 -4 -41 -160 133
8141 133 -284 -156 391 -115 -53 256 7 -134 -1 124 -5 8 43 -65 -220 -11 -82 91 100 -114 -7 -126
8163 -126 -341 17 -133 -130 284 8 121 214 -77 140 166 309 119 118 -35 46 13 -3 -68 -307 211 -277 -61
8186 -61 -27 119 -59 194 -3
8191c
$$ Imaginary data points
##PAGE= N=2
##DATA TABLE= (X++(I..I)), XYDATA
0 0 0 0 0 0 0 0 0 0 0 0 0 -8 8 -8 8 -16 16 -24 24 -32 38 -40 51 -62 72 -80 96 -112 128 -150 168 -192 221
33 221 -246 278 -318 356 -398 443 -495 553 -612 680 -752 832 -920 1014 -1118 1232 -1357
50 -1357 1494 -1648 1815 -2005 2216 -2452 2721 -3033 3394 -3821 4332 -4960 5752 -6789 8205
65 8205 -10268 13562 -19667 34788 -157262 -126067 179750 -50730 -181549 9602 160000
76 160000 -13716 -72928 93795 154720 -12339 -35621 81399 69019 -74775 -65003 56661
87 56661 21564 -127048 -59054 77120 -15834 -126511 -1529 93214 -17176 -85101 44984
98 44984 107945 -19315 -60480 72626 90675 -31386 -38386 61589 38222 -77142 -49574 54252
110 54252 -14373 -110505 -9551 67447 -45417 -89505 48689 108183 -9499 -50351 65167
121 65167 83941 -25987 -28461 48635 15784 -66608 -44065 19577 -19122 -74847 -5660 51345
133 51345 -22907 -45062 52445 73960 -14174 -25477 64022 60902 -46731 -46555 44909 18515
145 18515 -71169 -45859 28290 4205 -56105 -18434 42428 1837 -31115 32113 47170 -14956
157 -14956 -12230 45621 30819 -34845 -19364 46154 16528 -55656 -26297 29641 -507 -44677
169 -44677 -17972 24562 -3682 -39506 6465 40955 -5510 -15553 37329 35470 -15547 -7495
181 -7495 41893 18511 -44689 -18310 31829 -15286 -60161 -12316 24993 -12101 -37747 7698
193 7698 40257 3322 -8511 34298 31486 -6477 2441 22876 -2682 -33652 -11744 13685 -23033
206 -23033 -48569 144 25107 -15207 -25312 19545 39948 5001 -12709 23783 31990 -9979
218 -9979 -14277 13688 4084 -23197 -15983 5848 -7782 -28073 -406 20130 -13745 -21010 19699
231 19699 23689 -12443 -12592 26060 26581 -13897 -10225 26180 12642 -17992 -5568 10637 -6062
244 -6062 -22661 -8166 3848 -17202 -21866 9454 11987 -13007 -3482 27050 24167 -3602 -841
257 -841 29050 17109 -19422 -11042 10028 -7356 -27473 -14957 903 -9572 -17642 5314 15181
270 15181 -3995 3260 26669 15074 -6652 2918 20480 3604 -23405 -9008 13228 -8564
282 -8564 -26365 -4870 10277 -2077 -11397 2798 15144 1996 -3807 11130 8730 -5064 747
295 747 9619 327 -11518 -2236 12132 -3668 -19350 225 11473 -8796 -16546 2058 11066
308 11066 -3678 -9793 9610 13918 -2224 2594 15206 4977 -4630 2463 5728 -7354 -17365
321 -17365 -3381 2737 -16098 -16808 4193 7613 -4108 -2582 13235 18140 4038 1184 13639
334 13639 7901 -4756 -3502 -926 -7751 -13273 -7382 -1801 -10595 -11594 6327 8635 -5144 -98
348 -98 15760 13222 -1535 -1293 12702 7834 -9185 -4738 4718 -3226 -9413 -4290 -521 -5270 -7240
363 -7240 1286 2325 -6783 -997 9315 3914 -3706 3214 11356 6880 -4259 603 10042 650 -9042
378 -9042 -3174 688 -5156 -10398 -5541 306 -5383 -5141 5497 4916 -1267 5902 12592 6169 -1753
393 -1753 3107 9463 -698 -11634 -2952 1826 -8214 -11218 -3273 1224 -2256 -3093 4037 6476 1503
408 1503 4625 7919 2202 -1129 2157 2901 -3227 -8303 -1722 3303 -5887 -8491 1553 4819 -1730
423 -1730 -3882 3323 7342 -487 -2412 4740 2891 -2406 537 2320 -1568 -3250 183 2374 -4223
438 -4223 -6154 2625 2043 -6151 -3593 3801 3203 -1519 -938 5902 5995 -122 1401 4375 926 -2029
454 -2029 -1451 -1532 -4422 -6220 -2563 -927 -5797 -3218 4442 3883 -38 2472 8530 7534 -284 165 5579
471 5579 671 -5709 -3488 -1925 -4615 -5863 -3225 -945 -3021 -1343 4611 3122 -642 3778 6598
486 6598 2803 -1124 686 4252 291 -5245 -1420 1622 -2316 -4194 -2195 253 -885 -3266 -242
501 -242 1673 -1207 205 3509 1502 -116 2705 4674 1949 -2355 1223 3969 -2494 -5289 -1309
516 -1309 -794 -4014 -5108 -1733 1055 -1105 -289 3928 3569 2016 4056 3984 1335 -458 773 858 -3206
533 -3206 -5438 -1435 -873 -3950 -3581 547 2298 384 -463 3610 4714 532 969 2604 574 -1093
549 -1093 -580 -376 -1967 -3239 -280 696 -3339 -2110 2043 836 -1769 -717 2254 2237 -604 -257 2920
566 2920 1559 -613 420 822 237 -791 -1183 -215 -1861 -2669 -205 -788 -2547 -577 1856 1746 91
583 91 880 4023 2794 -577 636 2055 -312 -2479 -2036 -1247 -2345 -3236 -830 -53 -1548 664 3106
600 3106 1509 1260 2470 3377 1728 -919 280 1481 -1221 -3088 -1495 -981 -1653 -2213 -967 1050
616 1050 174 -117 1794 1461 575 1364 1812 730 -365 136 1353 -658 -2499 -192 715 -1923 -2332
633 -2332 -381 116 -1077 -1754 301 1104 -341 422 1940 1330 1375 1879 1383 403 -457 294 -37 -2435
651 -2435 -2644 -1130 -1071 -2011 -1770 260 1562 -11 417 2711 2245 887 1431 1468 622 -681 -645 -410 -1635
670 -1635 -2299 -627 -751 -1884 -420 715 516 -220 227 2312 1306 -437 431 1058 -381 -502 -131
687 -131 -135 -167 -718 -212 -97 -889 -512 447 -345 -838 -336 875 734 -522 285 1969 536 -360 351 930
707 930 115 -928 -578 -131 -1090 -1420 -279 -572 -974 696 1079 779 361 737 1900 562 -445 453
725 453 550 -1294 -1539 -916 -254 -890 -1298 -105 730 200 651 1175 1013 773 549 489 584 -680 -105 128
745 128 -1137 -1004 -236 -43 -467 -640 36 657 -69 -288 900 343 -57 689 432 384 277 215 118 -317 -538
766 -538 64 -176 -1351 -624 -698 -291 -655 -885 337 761 364 924 1305 1218 1063 474 645 207 -632 -731 -602
787 -602 -1746 -1156 -633 -526 -694 -338 1052 943 46 838 1565 929 281 298 5 70 -603 -815 -344 -685
807 -685 -917 -252 -94 -358 291 221 98 437 173 971 253 -19 565 606 122 -132 -211 347 -89 -903 -122
828 -122 -62 -383 -271 -103 -469 -49 273 747 353 164 583 885 76 124 536 277 -518 -810 -580 -210 -800
849 -800 -646 -83 62 174 564 452 643 658 188 464 -261 -278 -276 -546 -722 -533 -298 162 -19 -287 551 613
871 613 103 602 696 351 276 47 -84 -268 -585 -305 24 -449 -171 143 -424 -218 -41 131 -24 -178 -80
892 -80 504 208 -212 173 153 420 300 -128 116 -277 -411 -438 -419 -899 -311 -344 -299 -69 83 737 609 335
914 335 952 753 507 578 25 47 -386 -747 -624 -688 -691 -322 -85 -419 272 668 682 919 231 427 718 382
936 382 -101 125 -230 -209 -243 -629 171 -275 -225 408 -271 -69 -205 12 -41 208 239 256 -51 -131 713 103 -127
959 -127 -126 331 134 -346 -645 -191 -313 -398 -141 -266 -368 405 259 198 492 502 566 451 135 57 -81 -316 -324
982 -324 -500 -402 25 -174 -131 168 308 -68 563 286 378 490 -147 15 -497 -109 -28 -510 -454 -78 -60 -190
1004 -190 140 166 393 200 -70 179 50 64 -137 -7 -357 491 -98 -376 -187 -257 -93 -158 -134 -167 97 -183
1026 -183 64 -270 -164 687 -31 138 243 390 164 -91 -112 -195 -169 -253 -396 -517 -299 -187 -215 56 601 396
1048 396 578 199 77 569 81 67 -380 -126 -57 -125 -640 -309 -173 -299 62 44 94 471 536 440 449 306 276
1071 276 15 -142 -87 1 -129 -167 -457 -71 307 -85 -158 187 -248 52 269 34 141 335 84 12 253 186
1093 186 413 98 -131 89 -41 -216 -298 -181 -183 259 -316 -61 110 262 356 458 538 416 169 481 222 -234
1115 -234 -329 -42 -479 -422 -314 -16 -39 -160 225 569 305 107 187 417 309 -209 -252 23 -162 -280 -89 -48
1137 -48 -359 121 273 454 205 228 23 -139 26 -20 331 -201 -45 55 122 21 -64 -32 304 -315 -6 -300
1159 -300 -415 83 -14 -105 -66 -1 231 430 80 339 457 405 -59 -225 -280 37 -356 -548 -89 -42 4 41 -167
1182 -167 302 191 401 464 -22 60 298 -128 -142 -380 -298 -232 -296 -151 -227 203 -75 -146 165 365 396 -30 151
1205 151 109 63 360 169 -146 -231 -99 -230 -370 40 -379 105 -138 -163 106 -41 -113 -183 104 471 457 116
1227 116 147 102 12 137 -133 -123 -371 -436 -291 -224 -270 -16 -173 -72 96 283 287 325 346 11 474 -119 8 -181
1251 -181 95 -44 -171 -459 -28 -86 -108 188 201 147 526 43 -38 150 206 79 -281 -204 81 57 -337 124 4
1274 4 -95 -61 -10 -361 106 -60 131 98 4 149 164 64 -75 -295 73 -170 -202 65 236 9 -79 -288 -10
1297 -10 243 102 186 -8 247 373 157 123 182 247 -116 -343 -321 -241 -131 -383 -63 162 345 122 -82 -11 171
1320 171 427 162 217 179 171 26 -308 -325 -67 132 -192 -11 37 31 -68 17 -51 61 286 141 37 -15 65 18 -27
1345 -27 -132 -126 172 -355 -265 55 -319 -37 -266 -252 -75 182 261 23 -70 214 481 -32 -42 346 57 -156 -90
1368 -90 -413 70 -244 -405 -81 -240 -137 4 -99 -65 320 192 178 391 -142 216 162 53 119 -86 -46 -104
1390 -104 178 -346 251 1 124 144 -226 70 125 -182 -202 41 -201 -3 66 129 -15 -81 -187 -57 -207 -172
1412 -172 -129 -148 -92 120 -75 231 165 54 83 -8 226 115 19 -96 -62 -53 45 -149 -171 -342 -278 -87 102 86 148
1437 148 93 -24 -243 29 -84 14 170 -331 -61 -75 -181 -70 -199 -19 98 -50 238 95 204 424 -39
1458 -39 139 14 -150 -136 -91 -43 6 -320 -346 -274 -130 -419 154 90 -252 83 144 -123 10 7 65 251 109 -208
1482 -208 43 -99 300 -318 -279 324 -135 -57 22 -82 -23 -30 170 -42 266 260 237 135 -147 9 169 -262 44
1505 44 -185 23 -56 -396 25 -20 -62 -369 60 59 184 -24 114 144 181 227 -103 -187 -97 138 32 133 -324 79
1529 79 109 -80 -215 -78 -96 -173 161 26 66 36 -6 88 53 -123 208 38 3 341 -124 -100 116 -167 179 -117
1553 -117 159 -95 -116 181 267 -198 -151 151 -60 159 -210 56 -60 -269 8 144 300 158 97 104 187 268 178
1576 178 89 143 -3 -3 87 238 90 100 55 -109 -295 438 59 103 102 85 -118 -36 11 77 -90 124 -145 -257 -223
1601 -223 -267 -50 -178 -208 95 -117 -103 -32 -51 22 56 -325 174 204 200 -53 -84 352 -64 91 -171 -25 -40 12
1625 12 1 360 21 122 29 102 -124 74 130 -68 -56 -42 -100 67 -281 379 -147 -72 27 -141 135 128 -166 69
1649 69 17 -34 428 42 124 -62 121 -28 160 66 86 28 -63 -94 -11 -9 -122 114 318 -179 -255 -134 143 195 -266
1674 -266 1 375 2 -18 -8 -15 -159 -248 29 -84 -69 86 -25 87 5 -14 -65 35 89 -99 258 127 220 -13
1698 -13 -168 -29 25 -321 188 -75 85 -42 189 80 137 -58 64 -62 -57 76 -48 45 47 -86 -149 59 -60
1721 -60 -64 -154 147 -101 203 25 232 -130 -116 -127 -153 240 90 200 -130 -88 -168 13 -154 148 37 -295 -79
1744 -79 140 332 -115 156 -22 120 -28 34 -27 -52 -251 239 -89 70 71 124 -186 -187 -88 -40 -38 200 75 98 -56
1769 -56 150 -189 242 201 63 32 -181 -158 -195 -219 -308 218 -113 98 312 39 321 69 -109 50 168 -253
1791 -253 115 369 96 74 26 -284 141 -134 -41 89 -215 -170 -6 59 -74 -6 -124 -60 98 24 -151 27 -335
1814 -335 126 31 -334 -205 14 -153 -348 -191 289 65 -76 48 -107 -251 68 77 352 148 38 110 -33
1835 -33 12 -34 78 -174 -57 -111 -121 -61 37 -149 243 -167 63 1 146 122 -46 -86 144 -107 39 1 -276 -184
1859 -184 147 40 -191 63 268 -103 -64 145 -247 -69 -29 153 -229 186 60 -166 24 140 -133 66 -229
1880 -229 -75 -151 122 90 219 152 -23 307 -261 -2 41 -42 66 -240 -166 -61 -107 50 -100 -144 -23 167 122
1903 122 44 32 -22 -100 -194 -21 -37 53 -161 -188 -1 -155 -165 -65 -37 -60 28 133 -131 135 101 -65 260 178 235
1928 235 57 -152 -129 293 54 -18 103 81 -219 45 -76 -9 120 -233 187 147 155 173 32 27 -348 -159 109
1951 109 -66 -228 100 -68 -193 106 -71 -271 263 -101 -99 -25 188 187 -1 -128 335 -31 -83 176 -116 -233
1973 -233 -132 103 196 30 110 73 78 -385 -24 -21 -25 -109 205 95 -10 -177 -43 -176 142 -75 -135 169 78 149
1997 149 -302 -22 115 50 269 -4 -124 135 -77 -193 65 233 124 54 -34 -15 193 37 236 75 -40
2018 -40 199 -148 212 37 -80 273 1 -328 -98 -160 -10 -54 131 -159 -45 -116 17 -293 266 -77 32
2039 32 91 -8 41 30 -226 1 79 69 -227 -4 144 7 -78 -155 409 74 -195 -88 -13 62 -7 193 142 -60
2063 -60 -52 104 -146 -136 -72 30 17 -308 -226 5 -88 120 53 -55 -15 -134 -26 11 178 -24 -69 57 170 -119
2087 -119 9 29 169 95 160 -67 101 79 263 -11 -312 -116 39 220 -182 20 81 108 -143 -106 -42 -12 32
2110 32 -161 143 -11 103 -101 127 161 -87 167 -11 120 -78 163 32 120 -80 -9 -7 -4 -107 -110 -345 -100
2133 -100 -142 63 90 97 6 -220 78 254 -4 -3 103 236 -100 116 163 -122 91 -15 -39 -66 -38 -152 168 80
2157 80 -38 321 136 35 -235 208 76 193 14 -81 -78 270 4 -175 -178 -89 163 60 -156 44 -221 -67
2179 -67 -134 24 141 -104 -82 197 167 -165 -109 11 98 -15 -308 -134 50 67 -3 102 282 20 33 23 -318
2202 -318 -16 -181 52 -84 -55 -185 -94 -182 -42 24 -289 51 -318 171 332 46 -165 -109 100 81 86 114 12
2225 12 6 -8 -49 132 -75 116 -17 28 57 -162 24 -124 -17 -17 -58 163 43 283 -65 190 46 -350 -45
2248 -45 -189 -201 109 -21 -103 3 -125 47 165 -195 -154 -135 62 -16 55 -243 124 46 18 5 188 175 92 86 -128
2273 -128 -51 -12 47 -126 167 -7 63 -12 146 -23 309 177 -18 149 -56 10 -1 -143 -125 94 183 157 -4
2296 -4 100 -222 -87 -159 43 -209 212 152 -242 217 108 240 -145 3 -6 122 151 149 -112 -137 54 -48 249
2319 249 -138 429 69 -42 57 -132 -152 -82 -287 -133 -338 15 236 -29 -268 -78 34 -17 -158 -83 56 185
2341 185 27 -265 251 -28 -81 -238 42 -18 134 123 25 87 -118 268 287 61 -88 92 90 54 166 -175 126
2364 126 279 -24 147 -226 -234 -192 99 -213 96 191 -204 -43 75 -196 -57 -204 65 -151 -125 52 177 -7
2386 -7 50 -80 -33 226 -46 89 -145 26 -67 168 146 105 -203 -303 -210 -41 -230 75 -213 -34 -18 -80 -16 -208
2410 -208 -135 48 -55 -44 133 71 -132 2 -54 183 -130 -106 -277 -140 -189 312 -212 -150 -203 -45 81 208 373
2433 373 -26 131 30 17 60 -58 29 94 -187 32 -38 160 -107 -42 -175 -112 32 -161 126 144 -69 -162 -140
2456 -140 35 -17 -196 -140 217 -218 -64 332 -31 11 23 -308 146 78 -63 -303 88 114 -166 158 91 -2 -219
2479 -219 -38 -166 0 209 -137 50 215 -206 -131 -161 130 -228 -84 10 -114 141 133 -92 193 -62 -41 -23
2501 -23 8 158 -28 107 -199 -6 -170 220 -168 105 364 125 89 -77 27 -96 15 173 -75 228 99
2522 99 227 -77 -44 212 -158 170 84 -153 12 132 150 -39 -124 -202 -88 -113 -263 -115 133 101 44 149 149 -242
2546 -242 -73 122 141 162 207 206 -129 100 -111 10 84 103 -10 -59 33 7 -198 41 404 78 192 -202 -211 109
2570 109 83 -284 -36 -160 -175 38 -56 -349 -32 -127 -55 -14 -176 -283 -103 -377 256 -9 -83 118 60 -56 -46
2593 -46 151 -13 -41 38 -269 184 163 40 130 -151 126 122 38 -89 2 -67 -116 96 -31 -213 -59 -202 234 -125
2617 -125 50 -86 91 20 -148 -48 -310 -65 15 -76 5 -165 -42 143 -45 78 -38 -91 169 -84 227 131
2639 131 125 -61 111 182 33 104 166 199 103 -98 -70 148 138 -182 34 -103 -205 -224 -95 -155 93 149 -53 40
2663 40 -153 -238 -83 104 -56 -185 68 55 -253 76 -179 146 -261 -139 -146 98 -14 -42 207 -40 -24 -193
2685 -193 47 486 -177 -154 -574 125 -62 17 125 44 23 4 -133 -119 -22 223 -85 -118 21 114 -131 -109 256
2708 256 -82 -29 154 -60 185 221 -97 435 176 -1 -7 -78 50 128 -52 42 -31 -147 164 -54 125 41 24
2731 24 128 -74 205 47 118 28 295 255 24 232 121 -93 -6 109 206 106 -288 -227 72 -174 -289 -208 -70
2754 -70 114 -107 -49 -36 -123 101 -119 23 -62 -163 239 -116 -51 -213 97 53 73 224 -420 48 5 -25 222
2777 222 -74 -49 -178 114 -170 337 -3 91 -245 -291 38 57 88 -132 228 -68 -18 -120 149 -398 -109 -176
2799 -176 -237 76 -55 270 4 254 109 -48 -130 -196 -102 42 -25 -38 104 56 353 -58 2 256 -151 179 -186
2822 -186 -88 -75 221 112 -6 -137 -23 -40 134 -88 20 46 -80 315 77 -117 -69 89 -1 71 -34 148
2844 148 -31 -118 -97 -168 276 85 -21 91 103 -159 -54 141 -185 216 41 -17 82 -12 261 -66 -4 -115 -287
2867 -287 -222 107 -48 191 24 35 -217 -155 56 -82 283 165 -351 162 117 -178 -315 -14 -159 -134 354 140
2889 140 13 130 -89 350 73 67 35 -89 252 -83 -128 -212 79 99 225 -44 -23 2 235 -96 -213 9 89
2912 89 -74 -17 183 -182 77 -47 70 152 143 11 -56 221 134 270 22 -169 108 1 -255 -53 46 -60 -163
2935 -163 5 370 62 152 107 -170 378 331 79 -182 -58 142 -182 8 -42 -85 184 -76 99 -170 -148 -251
2957 -251 231 114 256 -66 204 -95 82 -93 7 -129 -148 -243 20 -193 -23 69 -4 -181 -124 -190 160 0
2979 0 -134 -202 -77 -98 57 77 -107 86 19 -293 25 -107 -150 174 302 -38 -35 55 -49 58 -116 254 68
3002 68 -140 232 56 -251 119 173 -163 -92 -261 -102 107 -102 81 259 -106 250 149 -166 -10 -57 199
3023 199 9 132 -73 106 -120 113 -43 -206 -42 162 -87 107 -42 -116 -148 -9 42 14 284 -176 172
3044 172 -175 -19 -70 -88 208 100 218 135 -52 -44 175 167 -93 268 121 39 -121 153 51 -165 -8 306 -149
3067 -149 86 46 -123 14 159 13 172 -35 -56 -53 119 -151 -152 -161 -154 178 198 200 -106 -39 -41 -26 -13 58 -87 -126 -100
3094 -100 172 169 43 149 -60 -157 -73 44 167 258 -39 -15 -83 155 210 -116 112 121 -34 -153 -37 144 19
3117 19 -26 -155 -89 97 60 66 -161 49 -84 32 -6 51 -17 120 -147 -99 319 -81 -103 54 -224 -120 80 -272
3141 -272 -61 178 115 -42 242 15 -192 -73 -165 38 -125 -210 -25 20 171 -204 130 116 -34 11 -54 -143 215
3164 215 107 -93 -180 -154 7 -16 -53 -127 131 116 112 -60 -23 7 90 -83 -51 102 -105 -22 233 97 -97 -127 76
3189 76 249 -133 -69 -12 47 97 -78 125 76 35 119 59 -62 -193 125 -90 -67 5 76 121 152 -115 -138 69 46
3214 46 9 109 81 -134 140 -79 -132 7 31 156 60 -73 108 -277 73 42 -28 74 142 -105 -141 3 73 8
3238 8 95 135 171 250 -44 466 -40 136 93 65 178 -178 -18 -120 -14 29 58 244 -268 -76 -26 -23 -188 9
3262 9 -127 74 -361 67 -149 -77 -226 -172 -138 105 176 -240 -118 -60 73 -292 91 136 76 -1 -163 242 -230
3285 -230 -180 82 140 55 -47 -73 -6 -165 -139 162 21 -70 170 -48 14 -223 -114 164 -234 44 -36 18 188
3308 188 119 -276 -28 -72 279 -142 35 -146 182 -131 -157 296 68 -138 85 245 153 -46 15 173 141 -2
3330 -2 -120 147 -36 -13 83 109 -153 197 21 52 13 24 -432 -140 2 107 30 -141 211 4 113 27 -55 -42
3354 -42 -59 81 172 108 -83 251 -243 -217 -113 40 19 140 -155 -47 117 -181 14 -206 196 3 -109 19
3376 19 291 -43 224 54 -86 98 -55 92 109 -93 -61 -74 -295 -42 -46 73 -119 -93 165 -160 -172 -125 105
3399 105 -179 -46 -17 -55 132 -63 15 -229 11 -94 -345 480 186 -38 34 195 115 -55 42 -155 64 -119
3421 -119 100 19 270 7 -112 138 -30 -352 -262 -18 -80 -69 7 -96 -118 -146 -225 -142 113 -366 95 364 125
3444 125 -18 -180 191 61 -131 -215 -38 -93 75 -215 206 14 -179 -3 175 94 -9 -423 3 -102 81
3465 81 -91 -77 -115 117 178 -156 -135 81 101 91 133 41 -146 155 -31 30 -213 -94 27 159 9 158 179 4
3489 4 11 110 78 -226 -344 -218 -263 96 87 129 -107 27 137 200 155 -24 21 -100 331 -271 12 -78 59 -23 -36
3514 -36 81 -85 -129 -180 -151 -83 -24 -7 -32 196 -246 70 142 29 -10 -84 117 72 26 -66 -27 147 -86 39 98
3539 98 -50 -135 -180 176 94 41 -12 -51 113 209 97 -169 0 319 33 15 127 0 -114 -85 -140 154 -122 -14
3563 -14 64 48 36 21 145 156 290 -105 82 304 127 54 27 -170 -39 100 6 -115 153 27 -50 -72 -91 245
3587 245 -106 153 -460 -52 63 152 96 -24 -102 -119 220 137 41 -358 83 -204 94 -76 -8 -286 30 -143
3609 -143 91 123 -44 -72 -53 -97 76 163 68 -120 61 -3 -5 109 32 -72 -276 -242 -308 -72 -28 -113 -283 146 63
3634 63 -22 -106 175 260 108 -22 -91 -42 -52 -88 -132 124 26 -72 29 -49 -89 38 168 -286 62 8 -15 -160 -111
3659 -111 435 57 -351 70 -32 -151 110 77 155 177 -215 110 -52 -27 -8 56 110 -69 -229 13 -223 262
3681 262 -135 -211 167 -72 49 77 -200 235 32 263 -248 -456 -148 -144 124 46 165 70 10 -142 209 -221
3703 -221 -42 173 76 -142 151 -86 14 -60 145 57 117 -146 207 29 -35 21 204 -93 -101 -5 -345 166 -40
3726 -40 -224 -123 -3 -141 -198 -121 -142 160 -116 -145 118 -88 -406 -204 41 -146 -89 -129 34 -34 -80 -99 -74 129
3750 129 -112 113 9 14 7 19 -145 114 288 7 110 -148 -42 -86 -54 -110 -31 -34 -28 452 41 -251 -38 -62 209
3775 209 34 -377 109 139 162 -45 11 122 98 25 192 -164 -392 -129 -215 -60 29 81 111 -41 56 51 -226 -185
3799 -185 145 104 -39 -126 111 284 -75 19 -163 -109 50 -55 111 -123 -82 -23 -112 -83 189 -172 103 -276 -125
3822 -125 151 -60 392 23 -117 -99 128 172 25 147 -351 -58 204 -29 -74 -69 104 -42 -59 163 92 56 86
3845 86 63 -22 146 -105 -193 -1 -59 19 89 -84 146 -211 155 -39 -57 175 26 57 -215 183 -28 -189 -251
3868 -251 -29 -218 -9 76 -20 -76 47 188 -237 -108 25 102 30 81 74 -156 160 -186 -4 139 128 150 -166
3891 -166 -184 130 -93 -40 -9 25 204 -83 -55 -44 72 -83 -71 72 -231 78 284 91 244 -126 59 -26 246
3914 246 -126 -29 -125 224 142 29 -70 28 223 -150 49 -64 20 -13 113 -154 -124 313 38 -164 230 18 26
3937 26 -81 -238 -116 -205 26 -41 127 -98 210 -36 -22 -133 88 -224 -124 -2 117 262 98 90 -64 -269
3959 -269 -216 219 49 55 116 321 -180 37 18 2 35 -38 95 12 -107 129 -105 153 -149 -16 -29 185 66
3982 66 70 98 -160 -199 20 -161 137 17 39 -149 -103 79 -99 -147 -93 220 65 233 61 -52 101 -163 -132
4005 -132 244 -72 49 -31 -110 -411 -222 -3 24 -45 -17 110 15 -249 -71 -14 -308 333 102 -46 -48 -133 94
4028 94 390 -39 -129 -57 -80 95 253 -5 68 206 -328 27 91 -135 -172 -17 -177 138 25 -169 160 -132
4050 -132 254 10 97 52 -122 166 29 239 -407 16 -70 -132 43 -69 31 196 -58 -18 61 -194 -130 -127 -79
4073 -79 101 -82 -82 169 -89 32 -210 -20 149 159 -104 28 72 268 -166 110 -107 -19 7 57 -53 -241 40
4096 40 25 -74 84 28 -213 -93 128 -31 4 98 42 9 -59 -27 -24 27 -170 -15 -25 -10 -115 274 -112 -81 -8 -70
4122 -70 35 -94 -33 -341 41 181 -124 -170 269 -15 -22 -233 -37 -94 29 -20 -29 -45 144 -88 38 176 -132
4145 -132 -186 -58 -142 -336 -52 137 -106 193 -227 77 154 93 245 139 -25 140 -24 90 146 192 -27 -40
4167 -40 1 32 -298 -117 10 16 1 -59 42 28 35 -59 -133 101 57 -9 -154 -82 -227 56 -135 104 242 12 -85
4192 -85 110 -49 290 -295 -175 60 142 -214 200 -133 61 356 -79 14 139 -28 -84 243 -112 13 -128
4213 -128 -27 -370 49 5 -53 125 87 -72 70 3 -203 130 -3 87 147 101 -35 85 -132 -128 -193 -55 -148 -40
4237 -40 -222 -46 -59 -139 171 -82 107 61 283 58 -4 -54 25 -236 202 -6 -35 158 -277 422 -98 -104 -89 -13
4261 -13 100 186 -35 -102 107 134 56 -80 -6 120 104 -165 187 49 -104 -168 -2 36 16 138 -316 132 -72
4284 -72 -226 6 12 195 7 -55 -46 -57 120 -139 -13 50 -3 -186 -177 -72 303 -351 -202 -74 60 8 -242 247
4308 247 -21 -197 -225 -50 -97 -110 44 -145 115 -150 -23 171 -29 252 0 -46 -154 213 -54 56 -24 -159
4330 -159 -36 191 22 -36 364 -307 -206 27 -162 137 -92 -77 -260 55 403 -305 43 -142 149 -191 101
4351 101 215 82 -210 90 -111 51 -103 120 278 -245 -157 34 10 46 76 254 189 16 188 46 -206 -149
4373 -149 -47 -141 -37 -169 -10 132 -61 31 -251 -268 192 85 -283 -276 32 185 130 -10 -140 -205 298 -282
4395 -282 199 74 7 69 -106 -108 63 56 -107 -42 -283 -183 37 -229 133 -82 -148 11 283 -174 21 -201 -47
4418 -47 74 -188 16 200 -73 -40 48 -31 -226 19 -264 -4 -39 -17 -186 -30 -59 23 -321 -308 -28 -10 66 22
4442 22 108 -74 147 30 -428 35 58 -84 298 -128 -51 139 107 -139 13 -200 53 110 116 -259 2 97 320
4465 320 117 -162 -61 151 -106 -181 -150 -61 273 228 76 -229 185 45 149 -67 117 28 -154 -154 264 276 161
4488 161 17 -249 43 -16 92 -304 134 -478 50 156 145 -354 -46 229 109 185 212 -107 97 255 61
4509 61 -77 -72 -55 5 110 -98 -31 -271 185 118 68 -321 142 -129 -32 203 -89 25 225 245 -319 56 -19 84
4533 84 215 -80 -13 -12 117 -194 -120 34 149 330 52 202 157 -21 -21 22 18 189 -253 319 9 -105 126 103
4557 103 -159 352 141 252 162 -20 -64 -81 -50 -83 -115 113 59 -48 25 403 -14 -61 58 174 -85 -97 -98 87
4581 87 -196 -100 18 202 -90 38 -310 189 -6 216 84 322 -8 30 4 -102 77 155 121 284 -93 17
4603 17 136 57 -331 80 -94 -130 42 120 162 205 9 -220 60 -132 -80 66 -118 135 -11 3 154 137 71
4626 71 285 42 -148 108 -165 -107 15 86 195 350 54 -250 -45 -162 -134 68 67 -119 42 -84 -54 -90 119
4649 119 -72 151 -111 -131 94 12 340 115 261 194 40 77 -42 -210 -19 87 -197 76 -24 171 -26
4670 -26 125 149 55 133 -121 -118 26 31 -1 38 -37 179 215 148 73 -227 -209 97 -179 0 256 73 -112 30 -157
4695 -157 -88 -11 -23 59 51 -102 -146 54 186 -107 -128 140 273 -279 119 -198 -111 -60 -157 -88 -325 -141 260 182
4719 182 27 -19 -71 57 -64 105 -14 -115 -72 36 37 240 63 -125 -315 0 -42 -39 21 125 -113 28 140
4742 140 -117 -15 37 -83 -212 -384 34 171 -63 1 134 115 -97 -262 43 -165 -93 25 -131 -7 80 33
4764 33 209 166 -26 67 -151 -283 -73 196 100 -135 -50 -38 122 122 -71 8 80 -157 120 -14 141 3 -105
4787 -105 -78 117 95 -198 38 167 -36 54 108 116 60 -247 -41 -80 -61 231 -258 -21 -65 -154 132 -173 40 5
4811 5 78 77 -112 259 -349 102 -22 -95 34 235 32 -59 5 -103 20 -37 138 137 -29 -10 103 145 272 88
4835 88 115 88 91 68 9 -28 74 57 54 -66 305 -219 -144 -128 -382 -182 -101 -74 -143 -91 94 -22 -32 89 56 -232
4861 -232 -23 140 8 119 -9 -155 61 -31 82 21 73 42 61 109 -55 179 -67 -157 5 -168 -204 38 20
4884 20 -211 -128 160 72 128 70 56 46 82 23 148 -37 -27 104 -455 74 -99 -108 180 28 54 3 -206 -171 -8
4909 -8 -201 -16 -219 36 16 -70 -66 -243 17 97 33 -127 -92 -86 100 207 41 204 -12 -51 18 -60 112 6 -179
4934 -179 92 169 -14 -74 103 -94 -149 -267 -7 22 -212 50 7 -160 -177 196 -74 513 103 -19 82 -25
4956 -25 101 36 -28 75 161 -213 -66 71 -17 159 -125 335 142 147 148 99 -24 185 222 -129 22 429 -149 -82
4980 -82 273 -134 -324 3 87 124 -12 -103 65 -83 72 -57 46 176 31 165 -57 -75 134 75 218 -42
5002 -42 -293 14 -101 -98 12 -46 104 -258 -144 70 317 221 157 21 48 -136 173 81 65 159 -95 79 181
5025 181 101 318 81 -67 -99 224 94 -280 -425 -128 -98 -7 -6 -99 -78 290 98 128 270 -28 -227 -169 53
5048 53 106 98 120 -236 -102 116 78 -20 -67 -104 -258 -85 -90 73 -92 -153 88 105 -35 188 64 -183 172 67
5072 67 40 40 83 92 -207 -115 -290 150 -106 32 107 -53 281 -253 -214 149 -70 327 -4 -269 78 -132 47
5095 47 34 19 -15 91 -40 180 148 201 61 -143 233 55 -44 182 0 -27 -109 -37 58 70 -44 -63 -170 -16
5119 -16 29 -191 143 22 223 -182 252 -57 41 285 -127 115 75 70 73 -268 63 -23 -29 69 151 40 70 78 44 -141
5145 -141 -130 -72 147 6 111 -127 -113 34 -120 -111 30 -15 180 112 111 -216 -106 -90 312 236 177 216 99 290
5169 290 236 -6 48 -51 -104 12 100 -51 -12 102 110 -55 -391 143 47 41 -342 70 298 258 -197 -157 113 63 54
5194 54 67 -41 -125 270 12 -15 -138 20 -24 -23 84 -177 130 97 -131 -234 123 101 18 68 265 -85 58 -147
5218 -147 -315 180 207 21 -255 6 -133 68 -115 -97 -3 10 121 -19 -120 50 220 -170 -86 192 142 -68
5240 -68 236 -53 -147 49 -32 184 -27 67 3 -190 -70 116 42 128 70 70 17 -27 107 -121 113 -60 90 242
5264 242 -63 -83 -89 177 -211 55 -56 75 -30 72 -48 -76 -72 42 -36 -73 125 104 -101 48 41 -184 -81 -35
5288 -35 -95 -135 45 50 289 -67 109 37 -167 -4 199 124 -165 31 -140 -43 -83 163 -155 -35 106 -143 -117
5311 -117 79 -75 -264 156 261 -142 4 -130 -199 -216 0 -5 -107 -218 -36 118 170 -179 -12 24 97 339
5333 339 -299 167 294 30 123 -99 303 -73 211 -14 -254 -84 -283 -2 -107 86 57 69 -10 366 47
5354 47 116 -31 -293 -73 -53 68 -10 -137 -3 -5 -3 -117 44 217 113 54 -167 190 -58 -34 -120 161 -3 -30
5378 -30 -283 92 9 168 -359 189 93 -113 71 15 107 -184 -49 24 13 128 -176 46 120 -9 -154 226 87
5401 87 8 -126 -77 20 3 -260 269 -17 -167 -82 -144 -60 68 210 41 116 -89 74 -92 32 106 -45 -50 -42 1
5426 1 -16 38 -84 -258 138 45 -264 -88 331 181 -31 12 89 -57 -115 -260 127 116 -146 151 336 -154 -163 35
5450 35 -106 -39 -102 196 48 -46 234 43 189 -101 343 -158 -112 247 -82 79 -17 -310 9 -63 -300 72
5472 72 100 -25 234 -206 123 47 119 326 78 -17 -127 -86 -325 24 -11 -21 177 119 32 217 -207 89 113 5
5496 5 -158 115 -214 -9 16 -262 -15 -16 -173 -87 -198 23 -9 -113 -87 -4 279 76 238 275 206 32 -79 78
5520 78 143 30 -29 -55 326 146 25 -124 -6 -138 18 24 -196 -264 -241 -82 84 14 59 126 217 3 -151 -170
5544 -170 -214 -155 -37 1 -144 -19 -58 -18 186 -97 -28 146 147 169 -11 95 -96 339 -4 0 -107 -454 32 118
5568 118 280 110 -12 -14 284 200 -87 84 269 248 -276 -352 76 86 77 -72 -33 12 223 -129 18 -270 79
5591 79 -162 65 30 -31 -88 -67 185 -153 -68 -123 -104 104 -16 -9 -153 -32 55 -6 -113 80 -97 -127 60 2 -74
5616 -74 -146 -1 78 -173 117 37 -24 -27 95 -54 291 119 -59 -152 -90 207 -281 -46 51 -28 137 -143 -315 -189
5640 -189 60 55 5 -11 139 -123 -32 -86 354 123 -66 284 22 -174 92 98 -27 189 -136 129 234 94 -77
5663 -77 -254 102 -343 143 99 56 29 -216 258 -38 -31 114 78 -71 58 123 -199 -104 40 14 54 -198 -199 -143 -248
5688 -248 -115 76 -65 209 80 -101 105 317 218 -15 73 -169 -153 8 235 206 258 9 82 -214 132 20
5710 20 -42 29 127 79 2 -159 4 211 -150 -85 -193 -206 -195 -326 -119 273 83 36 311 168 -278 -202 -91 -211
5734 -211 200 -400 5 -54 -398 81 85 79 36 54 66 24 54 73 -199 -20 138 45 246 -356 80 179 134 -59 23
5759 23 -226 59 -28 -27 -74 80 -95 223 -15 215 521 -237 0 58 -124 175 -302 121 -109 -107 52 -268 13
5782 13 119 42 109 71 322 -88 193 -19 87 -81 -232 -86 -2 -34 -45 2 -2 31 -131 256 -153 77 162 -175
5806 -175 47 287 125 -36 69 1 112 8 198 -53 11 -180 -204 -150 -189 224 274 -161 -63 -139 31 79 12
5829 12 -23 -63 -132 -227 127 169 -123 -196 -2 36 34 -11 -170 68 -153 -56 143 8 4 -111 -120 -91 -58 -185 -187 -97 -18
5856 -18 -283 135 240 -153 166 168 -32 79 8 -13 45 -26 -103 269 -609 97 -98 6 65 316 -14 -106 70
5879 70 -217 214 -63 147 -116 -209 -156 -182 11 -171 176 -89 108 107 -114 124 -8 -84 -77 42 -168 -40 196
5902 196 -182 -8 113 205 4 208 167 40 -16 41 -43 79 -52 -17 84 -92 59 260 -177 74 -48 89
5924 89 21 -157 -50 -275 -264 275 -19 -50 -233 -113 86 -155 39 -33 245 -119 1 97 231 51 -79 26
5946 26 -122 -142 233 -260 71 330 -66 -310 15 -273 -3 120 177 -138 137 -106 150 -153 -148 154 -96 -12
5968 -12 -119 -102 -348 34 -71 -62 -111 57 -94 -78 -129 -123 194 -20 -151 89 231 64 -35 -117 -73 49 15 -58 155
5993 155 107 294 -55 255 -59 -36 -99 128 219 89 243 92 279 -156 -198 129 90 33 -238 136 -91 -87 171
6016 171 192 -59 -92 243 275 33 -234 373 -130 -216 50 -167 -152 -43 -98 60 125 -42 -50 82 280 -78 -16
6039 -16 179 -25 -147 -126 -9 18 21 22 291 -170 -52 29 119 101 -2 -12 -141 109 56 56 -326 -328 -21 78 -9 -76
6065 -76 236 -25 -314 -54 -151 -15 -11 -358 -31 -15 57 83 -1 -297 23 139 -151 -99 -51 -208 -164 -42 -311 88
6089 88 84 -280 -78 93 26 -96 121 2 16 -208 87 96 -173 -116 104 -21 -35 297 30 25 -98 89 31 192
6113 192 87 71 189 221 86 -249 15 139 125 226 -50 16 -154 -9 -210 74 -61 191 91 66 192 -144
6135 -144 -286 179 154 41 -127 152 -54 -92 70 52 130 -72 -47 299 144 -301 151 -199 177 -92 -140 84
6157 84 -38 -306 22 -72 6 239 125 41 -247 236 -108 -127 -30 -4 146 -107 145 160 356 -36 20 165 155
6180 155 195 -91 91 169 116 -65 -276 283 -99 52 129 105 339 -201 158 42 -306 132 -100 3 -104 128
6202 128 47 -114 45 -129 -165 -12 75 -206 36 95 71 151 -73 195 149 -60 -130 32 -131 -188 -123 171 -220
6225 -220 -118 -43 42 -277 -41 49 145 -3 70 -267 -12 -143 38 21 -17 -208 -72 -53 133 -84 -190 306 -79
6248 -79 33 -91 254 -35 -44 -26 -204 -206 -39 39 -239 97 142 -274 -236 -100 11 3 165 5 -260 -151 38 18
6272 18 -186 12 205 77 -7 -44 -162 54 -74 -42 -160 -111 -39 145 21 116 -172 142 -24 36 -78 -53 -180
6295 -180 46 -188 -149 122 -157 29 64 -148 -254 51 34 -34 54 -29 57 -197 -42 -229 12 39 -151 -186 34
6318 34 111 68 38 -54 -113 -96 37 -183 -15 2 -203 109 74 -62 -188 56 164 107 -41 197 -153 -177 189 -195
6342 -195 6 -219 490 -28 330 -280 89 81 -10 13 128 120 -15 187 -20 170 188 170 187 48 1 115 162 -115
6366 -115 -216 160 139 94 111 96 113 -12 118 -155 91 195 -186 -480 -219 157 30 -133 84 -97 122 -33
6388 -33 -32 48 -9 97 184 -99 117 264 -161 -70 91 217 3 62 151 222 -45 136 -344 143 -152 -182 5 -11
6412 -11 185 149 49 -66 28 -157 -36 92 -42 -39 45 240 98 117 118 -67 206 -150 -385 9 -50 -3 -173 56
6436 56 -90 -13 162 -25 -17 -3 29 62 95 -136 64 -357 -200 16 34 62 -28 80 -94 -80 -30 73 -132 -28
6460 -28 -20 115 143 -189 66 146 -33 -184 64 -243 -81 52 -19 82 -93 -34 -16 -178 -196 270 20 -83 40
6483 40 -9 114 -166 220 -46 173 105 3 9 -14 21 -8 -253 25 -359 243 157 -70 14 163 50 -40 36 264
6507 264 -40 -29 380 212 -84 -29 4 16 35 199 -237 -72 -3 -83 94 -188 64 -112 126 108 -14 297 260
6530 260 -155 46 174 -62 -274 -188 8 38 179 -96 194 44 104 36 224 -131 147 -116 -390 108 -53
6551 -53 140 261 194 -307 -43 -89 -178 404 37 104 -19 -217 -115 41 24 150 -137 61 -92 -248 77 -213
6573 -213 82 112 151 67 128 -184 -108 -6 18 236 -249 -275 26 34 81 -59 -84 61 113 34 -42 -88 -97 114 -68 156
6599 156 218 7 -9 77 35 -128 -137 -46 -112 165 162 59 -2 178 -15 -141 25 96 -42 -170 37 72 -46 -75 -6
6624 -6 -39 -67 -117 71 74 -38 -236 -28 -255 349 -172 -145 274 -250 149 9 63 -90 131 9 -2 -184 164
6647 164 -55 119 16 -230 14 264 -7 -45 -71 -71 -23 -28 179 323 59 -209 -189 -6 -114 -143 -40 12 -50 14
6671 14 -207 360 55 255 -97 -112 -216 -130 -83 -186 -11 -198 -133 -119 49 219 100 156 245 -40 118 -300 285
6694 285 -83 -97 92 -116 229 -14 -81 58 -211 -35 136 25 -53 -137 105 -228 133 -165 213 60 -22 151
6716 151 137 138 -51 212 40 249 -51 -100 -62 -161 -219 -83 34 132 -62 49 -74 114 -84 -114 123 -168 183
6739 183 70 -90 16 -6 -169 103 18 -80 215 -167 -38 -205 19 -54 -145 58 89 -244 58 65 -191 -212 -29
6762 -29 87 -156 151 27 -84 -65 85 -7 77 252 78 63 64 -40 10 -48 -22 -184 158 152 222 62 73 97 38
6787 38 215 -57 242 167 77 -180 335 -3 61 -38 32 67 147 -51 -73 218 48 -127 -73 -101 54 -226 25 72
6811 72 -76 -15 -57 -60 8 -124 -245 -62 30 -245 -60 119 -100 -6 -200 -85 -296 -179 54 -51 176 -31 -71
6834 -71 168 81 -144 22 -156 44 201 189 -253 -36 155 165 108 -57 25 118 -29 -27 29 -127 -211 0 -100 100
6858 100 -226 49 65 31 -124 -60 131 -127 -69 290 -106 29 126 112 -153 50 82 -53 233 304 -51 -349 -99
6881 -99 85 -45 96 36 -2 -88 -214 169 -191 37 -35 -194 -74 -174 69 -169 -71 -142 192 109 142 -104 -112 -97
6905 -97 -148 70 -8 -230 29 62 -25 -8 -204 225 -273 70 -53 -269 22 140 115 16 138 84 -237 192 5
6928 5 -110 -179 226 -201 4 88 -92 112 60 10 38 46 6 -122 -5 -194 111 31 -10 154 -136 72 138 -69
6952 -69 203 -135 -42 139 10 172 -265 -186 -64 -43 -31 -18 172 -312 -139 241 12 -275 224 -57 -270 162
6974 162 -49 -12 6 1 -257 46 -69 -108 -139 20 22 -148 -22 54 1 -172 16 -253 214 16 -35 167 185 -47
6998 -47 123 -30 -5 -67 -57 292 256 161 -66 71 -88 -61 103 -212 -169 61 -57 100 -271 -62 -105 56 -37
7021 -37 -226 45 74 120 14 -56 12 -157 17 -17 -7 310 -40 -109 -146 -61 132 -94 17 147 -5 -163 178
7044 178 128 98 251 141 164 -277 125 -36 46 -52 181 54 86 259 235 -135 -87 -140 156 -179 1 24 353
7067 353 66 151 194 1 -55 -316 108 343 98 5 283 -121 182 39 -20 -103 16 48 93 36 -108 -147 -78 267
7091 267 99 67 29 -29 117 180 -65 -96 -138 -32 5 -302 123 -245 68 34 -54 194 -35 210 174 -53 -205
7114 -205 -116 -213 18 -38 -17 -39 109 -164 -72 47 76 -96 -237 114 102 -99 9 66 111 237 -68 199 -404
7137 -404 -110 125 26 -47 -72 261 -74 45 37 75 67 -179 176 135 234 -8 -13 11 -271 32 -89 61 -43 -142 -192
7162 -192 -290 35 63 115 42 127 -102 5 -63 -122 -50 -59 -30 97 -108 -126 -72 70 -23 -67 19 -214 180 -7 -113
7187 -113 50 201 67 121 207 89 -123 176 130 101 -142 -143 151 -37 -174 32 -223 160 -25 -39 -24 -156 271
7210 271 164 75 -16 164 264 89 -17 -162 -123 -205 -33 -146 -125 -112 -281 55 -122 145 76 -10 2 -79 -33 -160
7234 -160 90 -31 164 -5 -279 207 39 66 63 -88 255 -191 139 -38 -15 -13 6 69 -147 103 -35 -18 -75
7257 -75 -67 126 -216 223 166 -31 320 179 -116 -201 -225 -51 208 4 -24 26 127 -222 -92 -94 -262 -19 170
7280 170 -97 -144 -108 -159 -81 89 29 -86 -204 -141 -94 335 96 41 60 -117 -212 47 -233 55 87 -54 191 233
7304 233 -193 -183 134 317 -46 32 51 106 -15 -33 208 68 39 19 48 49 -105 101 -126 56 -12 48 -234 400
7328 400 -18 -22 -40 -321 -18 122 33 72 -35 -27 -175 248 225 -152 70 -194 29 -128 140 144 114 124 47 -266
7352 -266 -84 -128 -38 -217 253 -139 32 162 -212 58 -167 -122 399 -98 256 131 34 208 -138 228 -47
7373 -47 248 -56 -151 101 63 156 161 -12 167 -132 50 89 154 -83 156 65 45 176 107 -85 -23 -3 168 62
7397 62 331 -102 20 59 -111 -139 -266 -195 250 1 169 83 -364 43 -129 72 -142 -83 -114 278 66 -223
7419 -223 -141 197 -241 245 -67 115 -29 -296 82 211 -143 79 142 -270 -26 -85 -101 -219 -223 145 179 141 112
7442 112 46 237 76 -102 103 -213 75 -269 -95 -315 -389 -8 -146 -2 -105 -75 117 -62 -30 -5 158 78
7464 78 181 -31 -57 9 -151 52 230 -95 185 40 40 136 48 -137 -116 -242 44 -111 -37 -160 -130 76 -46
7487 -46 -63 46 88 -177 -73 -93 -192 -176 257 199 -40 226 137 267 40 -164 -140 -18 276 -10 -306 136 -50
7510 -50 158 140 -18 -141 -63 58 215 -46 -27 -66 43 -8 -105 118 -255 -358 136 88 116 53 114 27 -33 135
7534 135 178 75 -294 -43 -32 -209 -240 107 153 4 124 -3 -83 -254 116 -304 3 202 -98 -165 21 99
7556 99 -150 -35 -49 217 -50 126 80 -108 110 160 -48 9 -99 -205 -180 -47 -100 348 -9 -47 -217 -86 181
7579 181 90 -19 105 -15 66 122 -26 -142 -108 -33 -64 66 146 262 100 128 -108 -234 -95 -116 97 -122 13
7602 13 139 83 89 -243 127 -203 -50 172 213 105 140 75 185 -103 -54 36 33 58 9 117 89 90 -4 -304 -132 387
7628 387 198 113 224 38 64 35 51 -52 46 -48 -79 63 284 -84 -128 206 -45 -126 95 -34 210 -115 229
7651 229 124 204 -2 29 -51 -41 -43 -217 -44 31 102 51 29 -3 116 -100 8 284 197 99 -134 57 176 -19
7675 -19 -122 0 129 168 98 -53 -157 62 389 -89 -115 189 -94 -4 131 -173 211 -34 9 -204 -48 205
7697 205 -200 18 169 3 150 -57 -23 82 -38 -53 124 31 -412 133 12 114 -114 -11 31 351 -115
7718 -115 116 -39 141 -99 -42 -12 50 73 206 20 11 179 -12 -142 -120 345 85 229 128 -25 6 -145 -13
7741 -13 -160 -59 -16 241 293 -30 0 -101 -66 -74 -101 -190 -36 -247 -238 100 -257 -122 -10 49 237 -234 -39 133
7765 133 233 37 -64 98 187 -96 -59 108 -297 75 -23 -82 -13 -10 136 -225 -32 115 245 82 142 -152 -35
7788 -35 -244 103 85 121 -58 196 16 -129 83 501 -160 -54 225 125 165 43 -185 -234 -12 112 -222 39
7810 39 -45 -160 32 139 -23 175 -6 -361 -29 158 158 -48 6 -37 7 23 -40 -45 -66 -18 -48 223 48 2 -204
7835 -204 -85 -47 136 -205 -5 -70 -318 -451 -317 234 74 -92 90 118 84 237 -42 61 37 -91 -110 -314
7857 -314 -181 33 -97 204 -34 1 -137 188 2 145 127 282 61 -2 41 -138 138 -157 155 107 241 -146
7879 -146 51 -71 207 88 10 33 54 -28 121 -103 31 203 -229 -50 -63 -247 -125 -110 130 -23 209 164
7901 164 121 49 -8 59 -97 -104 50 -50 38 19 -39 -158 265 -255 -30 -122 -45 0 -90 287 -26 179 87 -37 325
7926 325 28 80 31 293 -108 74 56 10 -19 26 -247 -313 88 -210 266 -16 4 -141 226 21 20 88 -71 57
7950 57 -65 0 211 -147 -257 317 13 -24 143 -25 56 -138 41 -40 93 28 35 28 -132 22 -37 -25 -25 -242 149
7975 149 143 -254 110 114 6 -89 33 135 25 358 -67 -33 -245 158 -68 -150 -9 -137 188 1 85 -230 -87
7998 -87 5 156 48 -36 108 -114 230 110 61 -20 -172 99 -258 84 -111 123 -139 150 48 -36 -2 143
8020 143 5 -192 -98 -56 -180 -73 -84 -388 -104 -24 -38 -54 110 21 50 3 22 314 -222 -112 -285 45 -273
8043 -273 -162 -164 -1 -249 53 -44 -300 -55 -44 159 33 149 188 69 74 59 207 -2 105 137 155 18 -243
8066 -243 205 -76 -191 72 23 -281 -135 44 15 172 257 57 56 -61 -139 -69 -42 -258 4 74 1 210 76
8089 76 159 185 -85 -79 3 207 138 117 45 0 -57 119 62 20 140 -210 55 261 -125 -161 70 -82 -8 -49 -84 -303
8115 -303 -96 -165 -91 13 62 -66 -69 -119 231 125 -250 312 -64 160 16 82 -11 -36 253 -159 6 184 -212
8138 -212 -25 -60 94 231 -31 -180 204 -42 295 -244 255 -87 -96 215 -204 230 -29 -215 -368 110 9
8159 9 108 33 28 -135 -14 -199 -85 -67 -232 205 -110 -211 4 37 5 -57 150 26 367 170 156 -123 -229 233
8183 233 -232 170 216 -159 -48 118 -29 -46
8191d6
##END NTUPLES=NMR FID
##END=
