##TITLE=1H_DE-82mm_TFA
 200.13MHz, CDCl3,
 8 sc
 
 27.3.2025
##JCAMPDX= 6.0         $$ Bruker NMR JCAMP-DX V2.0
##DATA TYPE= NMR FID
##DATA CLASS= NTUPLES
##ORIGIN= UXNMR, Bruker Analytische Messtechnik GmbH
##OWNER= pz
$$ XWIN-NMR		Version 3.5
$$ Thu Mar 27 13:57:39 2025 Russian Standard Time (UT+4h)  she@DPX200
##.OBSERVE FREQUENCY= 200.1313
##.OBSERVE NUCLEUS= ^1H
##.DELAY= (6, 6)
##.ACQUISITION MODE= SIMULTANEOUS
##.ACQUISITION SCHEME= undefined
##.AVERAGES= 8
##.DIGITISER RES= 18
##SPECTROMETER/DATA SYSTEM= spect
##.PULSE SEQUENCE= zg30
##.SOLVENT NAME= DMSO
##.SHIFT REFERENCE= (INTERNAL, DMSO, 0, 14.3821)
##AUDIT TRAIL= $$ (NUMBER, WHEN, WHO, WHERE, WHAT)
$$ ##TITLE= Audit trail, XWIN-NMR		Version 3.5
$$ ##JCAMPDX= 5.01
$$ ##ORIGIN= Bruker BioSpin GmbH
$$ ##OWNER= she
$$ F:/spectra/data/she/nmr/H-C/1/audita.txt
$$ ##AUDIT TRAIL=  $$ (NUMBER, WHEN, WHO, WHERE, WHAT)
(   1,<2025-03-27 13:56:30.28 +0400>,<she>,<DPX200>,
      <created by zg, POWCHK disabled, PULCHK disabled
       configuration hash MD5:
       00 E9 B6 7A A2 85 ED C7 34 08 36 98 17 FE 4E 26
       data hash MD5: 16K
       03 54 17 84 8B 65 91 5F 4D 47 DF A0 86 63 FB 92>)
$$ ##END=
$$ 
$$ hash MD5
$$ 7F F9 53 9B 56 76 18 30 8E 9C 98 24 9A B2 91 93
##$RELAX= 
##$RELAX= 
##$RELAX= 
##$RELAX= 
##$RELAX= 
##$RELAX= 
$$ Bruker specific parameters
$$ --------------------------
##$DU= <F:/spectra>
##$EXPNO= 1
##$NAME= <H-C>
##$PROCNO= 1
##$TYPE= <nmr>
##$USER= <she>
##$AMP= (0..31)
100 100 100 100 100 100 100 100 100 100 100 100 100 100 100 100 100 100 
100 100 100 100 100 100 100 100 100 100 100 100 100 100 
##$AQSEQ= 0
##$AQ_mod= 1
##$AUNM= <au_zg>
##$AUTOPOS= <>
##$BF1= 200.13
##$BF2= 200.13
##$BF3= 200.13
##$BF4= 200.13
##$BF5= 200.13
##$BF6= 200.13
##$BF7= 200.13
##$BF8= 200.13
##$BYTORDA= 1
##$CFDGTYP= 0
##$CFRGTYP= 5
##$CHEMSTR= <none>
##$CNST= (0..31)
1 1 145 1 1 1 1 1 1 1 1 1 1 1 1 1 1 1 1 1 1 1 1 1 1 1 1 1 1 1 1 1 
##$CPDPRG= <>
##$CPDPRG1= <>
##$CPDPRG2= <>
##$CPDPRG3= <>
##$CPDPRG4= <mlev>
##$CPDPRG5= <mlev>
##$CPDPRG6= <mlev>
##$CPDPRG7= <mlev>
##$CPDPRG8= <mlev>
##$CPDPRGB= <>
##$CPDPRGT= <>
##$D= (0..31)
0 0.7 0 0 0 0 0 0 0 0 0 0.03 0 0 0 0 0 0 0 0 0 0 0 0 0 0 0 0 0 0 0 0 
##$DATE= 1743069389
##$DBL= (0..7)
120 120 120 120 120 120 120 120 
##$DBP= (0..7)
150 150 150 150 150 150 150 150 
##$DBP07= 0
##$DBPNAM0= <>
##$DBPNAM1= <>
##$DBPNAM2= <>
##$DBPNAM3= <>
##$DBPNAM4= <>
##$DBPNAM5= <>
##$DBPNAM6= <>
##$DBPNAM7= <>
##$DBPOAL= (0..7)
0.5 0.5 0.5 0.5 0.5 0.5 0.5 0.5 
##$DBPOFFS= (0..7)
0 0 0 0 0 0 0 0 
##$DE= 6
##$DECBNUC= <off>
##$DECIM= 32
##$DECNUC= <off>
##$DECSTAT= 4
##$DIGMOD= 1
##$DIGTYP= 9
##$DL= (0..7)
0 120 120 120 120 120 120 120 
##$DP= (0..7)
150 150 150 150 150 150 150 150 
##$DP07= 0
##$DPNAME0= <>
##$DPNAME1= <>
##$DPNAME2= <>
##$DPNAME3= <>
##$DPNAME4= <>
##$DPNAME5= <>
##$DPNAME6= <>
##$DPNAME7= <>
##$DPOAL= (0..7)
0.5 0.5 0.5 0.5 0.5 0.5 0.5 0.5 
##$DPOFFS= (0..7)
0 0 0 0 0 0 0 0 
##$DQDMODE= 0
##$DR= 18
##$DS= 0
##$DSLIST= <SSSSSSSSSSSSSSS>
$$ [...]
##$SUBNAM0= <"">
##$SUBNAM1= <"">
##$SUBNAM2= <"">
##$SUBNAM3= <"">
##$SUBNAM4= <"">
##$SUBNAM5= <"">
##$SUBNAM6= <"">
##$SUBNAM7= <"">
##$SUBNAM8= <"">
##$SUBNAM9= <"">
##$SW= 18.0517328524113
##$SWIBOX= (0..15)
0 0 2 0 0 0 0 0 0 0 0 0 0 0 0 0 
##$SW_h= 3612.71676300578
##$TD= 16384
##$TD0= 1
##$TE= 0
##$TE2= 300
##$TE3= 300
##$TEG= 300
##$TL= (0..7)
0 120 120 120 120 120 120 120 
##$TP= (0..7)
150 150 150 150 150 150 150 150 
##$TP07= 0
##$TPNAME0= <>
##$TPNAME1= <>
##$TPNAME2= <>
##$TPNAME3= <>
##$TPNAME4= <>
##$TPNAME5= <>
##$TPNAME6= <>
##$TPNAME7= <>
##$TPOAL= (0..7)
0.5 0.5 0.5 0.5 0.5 0.5 0.5 0.5 
##$TPOFFS= (0..7)
0 0 0 0 0 0 0 0 
##$TUNHIN= 0
##$TUNHOUT= 0
##$TUNXOUT= 0
##$USERA1= <user>
##$USERA2= <user>
##$USERA3= <user>
##$USERA4= <user>
##$USERA5= <user>
##$V9= 5
##$VALIST= <valist>
##$VCLIST= <CCCCCCCCCCCCCCC>
##$VD= 0
##$VDLIST= <DDDDDDDDDDDDDDD>
##$VPLIST= <PPPPPPPPPPPPPPP>
##$VTLIST= <TTTTTTTTTTTTTTT>
##$WBST= 1024
##$WBSW= 4
##$XGAIN= (0..3)
0 0 0 0 
##$XL= 0
##$YL= 0
##$YMAX_a= 253405
##$YMIN_a= -209453
##$ZGOPTNS= <>
##$ZL1= 120
##$ZL2= 120
##$ZL3= 120
##$ZL4= 120
##$ABSF1= 10
##$ABSF2= 0
##$ABSG= 5
##$ABSL= 3
##$ALPHA= 0
##$AQORDER= 0
##$ASSFAC= 0
##$ASSFACI= 0
##$ASSFACX= 0
##$ASSWID= 0
##$AUNMP= <proc_1d>
##$AZFE= 0.1
##$AZFW= 0.1
##$BCFW= 1
##$BC_mod= 2
##$BYTORDP= 1
##$COROFFS= 0
##$CY= -3
##$DATMOD= 1
##$DC= 2
##$DFILT= <>
##$DTYPP= 0
##$F1P= 0
##$F2P= 0
##$FCOR= 0.5
##$FTSIZE= 0
##$FT_mod= 4
##$GAMMA= 1
##$GB= 0.15
##$INTBC= 1
##$INTSCL= 1
##$ISEN= 128
##$LB= 0.25
##$LEV0= 0
##$LPBIN= 0
##$MAXI= 10000
##$MC2= 0
##$MEAN= 0
##$ME_mod= 0
##$MI= 1.114404
##$NCOEF= 0
##$NC_proc= 0
##$NLEV= 6
##$NOISF1= 3.799351
##$NOISF2= 2.8
##$NSP= 1
##$NTH_PI= 0
##$NZP= 0
##$OFFSET= 14.38212
##$PC= 1
##$PHC0= -470.0854
##$PHC1= 14.19221
##$PH_mod= 1
##$PKNL= yes
##$PPARMOD= 0
##$PSCAL= 0
##$PSIGN= 0
##$REVERSE= no
##$SF= 200.129724274929
##$SI= 16384
##$SIGF1= 3
##$SIGF2= 2
##$SINO= 400
##$SIOLD= 16384
##$SREGLST= <1H.CDCl3>
##$SSB= 0
##$STSI= 0
##$STSR= 0
##$SW_p= 3205.1282051282
##$SYMM= 0
##$S_DEV= 0
##$TDeff= 0
##$TDoff= 0
##$TI= <>
##$TILT= no
##$TM1= 0
##$TM2= 0
##$TOPLEV= 0
##$USERP1= <user>
##$USERP2= <user>
##$USERP3= <user>
##$USERP4= <user>
##$USERP5= <user>
##$WDW= 1
##$XDIM= 8192
##$YMAX_p= 0
##$YMIN_p= 0
$$ End of Bruker specific parameters
$$ ---------------------------------
##NTUPLES= NMR FID
##VAR_NAME=  TIME,          FID/REAL,        FID/IMAG
##SYMBOL=    X,             R,               I
##VAR_TYPE=  INDEPENDENT,   DEPENDENT,       DEPENDENT
##VAR_FORM=  AFFN,          ASDF,            ASDF
##VAR_DIM=   8192,          8192,            8192
##UNITS=     SECONDS,       ARBITRARY UNITS, ARBITRARY UNITS
##FACTOR=    0.0002768,     1,               1
##FIRST=     0,             0,               0
##LAST=      2.2672688,     0,               0
##MIN=       0,             -209453,         0
##MAX=       2.2672688,     253405,          0
$$ Real data points
##PAGE= N=1
##DATA TABLE= (X++(R..R)), XYDATA
0 0 0 0 0 0 0 0 0 0 0 0 0 0 0 0 0 0 8 -8 8 -8 8 -10 16 -16 16 -22 24 -29 32 -37 43 -49 54 -61 69 -79 88 -98
38 -98 111 -123 136 -151 168 -185 204 -227 249 -274 304 -335 368 -404 448 -493 546 -606 674 -752
58 -752 845 -952 1086 -1251 1464 -1745 2138 -2728 3709 -5619 10690 -53111 -112572 40600
72 40600 49159 34371 121151 63326 -67932 63724 170543 -14129 -91015 85467 43873
83 43873 -150814 -52124 77682 -92037 -157830 20237 46116 -73334 -37216 83002 80943
94 80943 -2014 3146 82371 78988 454 -6632 33180 2696 -47168 -14024 -4099 -74948 -41768
107 -41768 57342 -14524 -100309 -746 53478 -19131 -3702 50100 -7620 -38384 50807 80343
119 80343 -6573 -32104 17066 10607 -3405 16339 -15248 -52929 -21772 3270 -11130 -14960
131 -14960 1092 8526 -1495 9318 36280 23952 2736 14559 10832 -7207 -1758 -1120 -22232
144 -22232 -28850 -8940 -6839 -27546 -10185 18329 -7839 -12081 33990 24141 -14161 7461 31350
157 31350 12212 -663 4494 -3794 -15823 273 10592 -18129 -29991 -10343 -5808 -4990 1224
170 1224 -6517 -7495 1805 13649 27913 16988 -4423 9518 23820 7454 -2730 3595 -2211
183 -2211 -18546 -13140 858 -14247 -20382 3373 -2869 -17099 8905 15498 -6492 2693 18636
196 18636 5108 -3172 9429 10900 -5916 -4250 8819 -3764 -10943 1613 -4817 -10713 4065
209 4065 893 -10010 -3217 6563 7166 2318 -362 4164 4579 2608 3695 -2325 -5981 -4474 -5357 -1619
225 -1619 -2798 -8737 -739 3876 -1218 6428 9083 1455 5091 9312 3260 -1345 675 1857 -5279
240 -5279 -9621 -778 -3477 -10674 -2007 -509 -6695 -628 2944 232 1565 4128 5387 4988 3514
255 3514 7599 5069 727 4917 2789 -4021 -3921 -4598 -5645 -6240 -9614 -6399 -3316 -4892 1266 3105
271 3105 390 7093 9551 5104 5646 6393 4486 1149 -2818 -515 -2411 -7089 -3607 -3326 -6374 -1490
287 -1490 -918 -3598 767 2275 811 1450 1872 4267 2667 108 4068 3544 -68 2270 870 -1875
303 -1875 -189 -2354 -4322 -2960 -4324 -3457 -2288 -2948 665 1171 597 4572 4169 2662 3988 2341
319 2341 798 932 -2437 -1744 -1541 -4541 -2189 -2118 -2716 1024 257 -684 2835 2377 1100 1232 -38 1667
337 1667 401 -2411 139 444 -1517 434 -483 -241 1754 -28 -1157 486 -511 74 -797 -2262 1534
354 1534 922 -1636 841 1672 566 912 -172 643 527 -2092 -920 -835 -2393 278 83 -1525 2262
371 2262 2357 930 1971 2353 1826 103 -1232 761 -1072 -4177 -1355 -1542 -3122 -654 -1117 -1088 1012
388 1012 573 1420 1684 952 2562 973 -640 2388 1139 -1702 82 394 -16 -537 -1945 -363 77
405 77 -2668 -1367 -702 -1645 -182 -198 -913 1299 1413 1787 1487 882 3336 2373 -1512 233 1511 -2457
423 -2457 -1984 -365 -1243 -2025 -1596 467 -28 -1596 1206 1312 -1404 1935 2730 -1581 149 2293 607
440 607 -1145 63 2219 -200 -2148 1565 1113 -3111 -169 1198 -1885 -1161 309 -428 -955 -170 1381
457 1381 -326 -942 2565 1494 -2523 436 2597 -683 -1649 378 1029 -783 -1416 1078 999 -2028 862
474 862 1985 -2073 -662 1419 -679 -2002 644 1936 -1546 -2469 2621 1872 -3511 892 3661 -1967
490 -1967 -1878 2886 293 -2374 548 2397 -1716 -2118 3234 1232 -3563 1226 2697 -2791 -1266 3078
506 3078 -436 -3316 366 2646 -906 -2097 1740 1306 -2277 1089 2057 -2112 -1277 1758 493 -1677
522 -1677 -576 1724 -35 -2266 2212 2692 -2792 -1248 3058 25 -2474 363 1306 -1951 -2096 2254
538 2254 499 -3477 1417 2954 -2606 -241 4143 -571 -2671 1503 2721 -1463 -1681 2459 -55
553 -55 -3017 1797 2504 -3121 -1602 1914 -717 -1940 554 45 -2114 -688 2738 1111 -1873 1164
569 1164 2898 -642 -350 2525 74 -1965 -738 1183 -799 -2689 227 344 -2430 -125 2132 -1664
585 -1664 -1583 1794 1001 -1407 70 2047 -245 -2072 2095 2825 -1703 -852 2143 -241 -919 875 -284
602 -284 -2646 -1226 1134 -374 -2913 464 1029 -1679 655 3384 74 -796 1489 2089 105 -566
618 -566 1046 -141 -1892 645 1336 -1989 -1074 1235 -443 -937 599 80 -1547 -1087 1259 903 -1489
635 -1489 -65 1579 -163 107 1669 550 -595 -189 997 346 -1614 -599 -116 -1736 -294 1191
651 1191 -937 -1184 1150 1153 -44 136 1257 445 -1030 1024 1506 -943 -437 1108 -455 -613 862
668 862 55 -848 -282 755 191 -1181 229 714 -809 -71 1210 -345 21 812 615 403 -235 396
686 396 179 -774 -127 579 -1268 -732 255 -77 -430 253 624 -64 -534 631 765 -621 -644 603 -494
705 -494 -569 508 -283 -262 -80 231 201 -560 5 582 -631 -314 560 -605 -657 262 310 311 344 162 281 -301
727 -301 169 335 -851 -321 718 -466 -231 186 -372 83 -408 23 226 -371 -377 325 -725 -143 128 -226
747 -226 30 466 -39 509 -114 207 185 -385 -104 224 -373 -729 101 -569 -300 42 57 33 138 -87 300
768 300 -155 -135 302 -237 88 372 -382 20 289 181 -209 -302 -147 302 -268 -158 156 -471 -166 -43 -318
789 -318 146 219 271 365 196 -14 319 -207 -255 107 -33 -624 153 -215 127 -82 -394 4 90 -80 182 -108
811 -108 155 364 -541 -192 -39 -138 -30 389 135 348 228 16 126 -100 -297 -93 -460 -313 263 -346 -358
832 -358 -26 -288 101 302 241 569 17 26 40 3 109 -237 -112 -120 -121 -140 298 120 -65 393 -83 219 365 -331
856 -331 -47 -289 -51 -177 49 266 559 5 186 316 155 -255 -22 -226 -61 -88 -399 -132 146 11 240
877 240 151 118 405 154 -24 299 3 -34 -274 -154 83 -261 28 105 -42 153 563 -356 -118 266 -9 -395
899 -395 -357 50 295 -244 -93 553 228 79 189 -148 14 12 -106 -128 5 -51 247 -418 -346 34 -407 -198
921 -198 656 101 -115 236 244 47 22 197 375 -156 -127 368 -28 -441 99 -163 -94 95 75 -461 -103 -215
943 -215 417 -203 -279 339 56 -59 688 276 -162 -62 36 192 -266 -433 213 -392 -233 557 44 -715 -93
964 -93 152 -245 -438 109 133 -389 19 361 -219 -365 548 118 -123 367 294 -327 -173 330 245 -400 -356 439
986 439 -419 -225 472 155 -432 -42 195 148 25 178 -111 -531 223 566 -264 -500 348 445 -301 -300 132 -114
1008 -114 -346 -224 397 -444 -228 434 -57 -164 325 152 -358 12 281 110 -432 110 399 -396 -223 527
1028 527 -370 -690 13 275 -399 -203 144 -17 -171 -155 144 -172 -31 342 -46 -46 453 343 -215 -327 399
1049 399 189 -420 -363 193 -274 -320 58 11 -376 173 528 -166 142 250 -105 -163 93 577 -30 -472 388
1070 388 -158 -339 27 130 -425 -24 -114 184 -380 -409 71 74 -236 410 251 130 204 73 168 -32 -61 350
1092 350 -112 -247 261 217 -443 100 59 -135 26 21 147 -66 330 675 124 -370 312 -144 -449 279 131
1113 131 64 58 40 -15 -59 -224 324 -223 -52 375 -80 -134 336 183 0 5 100 230 -78 49 293 -21 -227
1136 -227 134 136 -21 245 119 -137 -233 -152 265 -244 -173 172 269 -52 -62 18 -245 162 301 10 35 -68 129
1159 129 -442 -245 275 -77 -65 -8 50 -159 160 187 24 4 353 268 -114 -164 224 139 -173 340 119 41 229
1182 229 -59 46 43 -188 -73 -198 -515 -25 88 -330 157 373 -72 -2 233 73 261 85 -17 178 -88
1203 -88 286 -345 34 -38 88 14 -149 -230 126 -38 230 128 77 -14 111 225 -189 -6 129 -52 28 -120
1225 -120 -18 -112 -194 138 -19 62 -20 -6 -229 34 55 -195 -98 208 8 178 -338 334 192 50 205 122 -146
1248 -146 51 441 -245 30 -110 186 2 -275 505 -125 50 -86 39 -107 212 -2 178 -157 32 84
1268 84 74 31 -53 -208 108 149 -202 63 -43 -309 89 -85 -14 -54 -88 168 210 74 -64 213 73 26 -173
1291 -173 -254 -37 -18 30 89 -220 87 -33 -108 -21 62 -168 -169 -237 -185 -171 -46 -7 145 -74 -9 69 295 -54 -322
1316 -322 -193 29 -340 83 52 215 149 -94 -212 -178 -4 120 -182 13 25 -132 -133 -105 -86 61 -99 167 -3
1339 -3 -306 52 118 -109 146 -157 14 240 -66 -292 -169 -56 98 -232 19 373 30 8 37 118 188 -51
1361 -51 -149 -45 -8 -38 -188 -293 10 6 -28 42 28 -113 50 191 31 138 136 -165 -54 -80 -82 -42 -139 24 -132
1386 -132 -249 -195 103 -167 127 79 -88 215 17 -118 118 156 73 -53 -104 -25 372 -84 223 393 0 106
1408 106 225 -151 129 -38 166 -38 145 176 -27 -263 63 80 -348 111 25 -105 80 -108 -57 -197 -234 -50
1430 -50 -84 -205 141 -165 -158 27 70 -109 -108 -208 -113 -66 -105 104 -133 -50 -30 27 -91 86 113 42 173 -75 -101
1455 -101 -53 -155 309 -145 9 251 226 -122 131 -164 45 -14 56 -49 43 77 -14 321 19 -4 29 -101 -48
1478 -48 189 105 50 -16 -119 -303 -242 -4 70 -362 -42 128 147 -33 281 -35 109 -11 304 197 -212 243
1500 243 121 -335 57 168 -211 -196 279 -38 11 185 181 -20 -109 111 89 180 33 -213 27 102 -24 12 322
1523 322 -179 -66 -47 -343 -212 157 -84 132 -227 -20 -4 74 116 189 122 -5 104 -215 -37 82 -169 -141
1545 -141 -66 -146 138 -221 21 -64 -199 276 23 -76 -134 297 176 73 71 104 -4 -25 19 36 93 -26 -101 -2 -140
1570 -140 -63 -306 -62 -201 230 17 -25 -83 -31 133 -114 171 -169 -220 -25 24 -171 -17 25 95 -109 22 -290
1593 -290 117 131 14 42 -123 11 76 -23 -54 64 82 129 53 49 32 -102 239 160 74 -183 -92 -197 38 118 -143
1618 -143 -151 -90 257 89 72 196 304 -25 5 -25 46 62 90 -94 -258 -35 -204 159 -125 -1 128 -11 -64
1641 -64 -7 93 -97 -32 -83 -22 37 -28 -213 -156 -113 -30 406 -37 -55 45 -111 83 -191 -251 -138 178 -254 160
1665 160 1 -231 8 147 -48 -118 59 -218 -95 -17 50 -89 -25 86 -76 -43 -146 -249 -32 -74 81 -8
1687 -8 -212 -176 64 167 -216 149 -64 -10 87 -7 12 196 -62 55 -63 -5 202 -101 -66 33 -66 84 16 -96
1711 -96 216 208 116 -7 202 34 45 -69 39 83 -212 161 55 -138 -44 120 -208 -213 12 134 122 -57 84
1734 84 260 96 104 -128 35 -17 -38 79 87 113 -65 -195 63 -133 -57 -103 -242 -86 123 -103 -178 -112 -179 -21
1758 -21 -27 -51 48 125 -43 32 -61 -321 -190 212 -7 138 171 1 -78 -152 29 236 -128 18 35 -167 -151 211
1782 211 -277 -137 107 89 -44 188 -167 209 43 -370 -15 -42 -145 30 -114 311 102 -58 124 -33 74
1803 74 273 98 72 184 -134 262 81 155 -103 106 60 -65 -227 62 -130 -163 -39 -68 -151 -50 183 -137
1825 -137 36 -127 -72 36 -83 -182 -28 59 -219 -145 -117 -243 156 151 -58 -160 30 105 -8 -109 229 185 -151
1848 -151 12 -17 -83 136 -50 -219 280 -369 136 96 -181 -168 -25 -47 88 -231 -65 -82 -110 -93 8 208 -191
1871 -191 148 215 -222 -172 0 -208 54 142 -158 211 112 92 99 84 -45 -110 83 24 -21 60 -3 92 -60 11 97
1896 97 -142 217 56 114 -216 50 43 -19 30 53 50 106 -109 -408 -189 -235 -30 -128 283 68 211 -130 31 88
1920 88 257 68 -164 117 -56 -177 -23 126 83 -15 37 -89 -133 83 156 26 35 222 -6 -85 307 -124 -309
1943 -309 6 153 -62 10 75 -86 -247 14 260 -199 150 319 99 -130 -210 -23 -62 17 253 27 -9 -29
1965 -29 324 27 -22 -382 192 -157 66 36 -273 -396 67 -125 -96 -259 -356 244 -25 144 22 -7 -267 126
1987 126 25 -105 -74 -165 -1 -95 -236 11 -137 -95 0 -344 68 -9 60 123 -4 136 209 -146 121 2 -51
2010 -51 -126 186 -80 -82 -118 -213 -58 -325 108 -4 -120 -99 49 35 -86 -55 -8 -4 -62 73 4 -151 100 -19 -55
2035 -55 45 372 144 122 343 -55 211 -127 47 224 -66 82 -33 144 -65 -8 -35 302 3 -19 -16 249
2057 249 -89 -105 117 -98 57 -109 -154 147 -189 15 -9 -10 185 173 1 179 149 -38 183 -254 -9 -78 -138
2080 -138 159 -8 82 -7 -198 -180 99 -18 48 -58 -352 -218 119 -25 -134 -16 191 -90 203 -312 -144
2101 -144 -74 102 -5 -35 -183 46 -7 191 -18 144 108 32 -148 -71 47 37 321 -55 309 47 -337 218
2123 218 -177 -293 -170 -68 380 -6 23 34 88 144 -163 25 -64 -166 79 -145 -53 9 74 -14 142 -13 39
2146 39 97 124 -60 -129 49 -111 19 -15 -73 93 17 -41 -85 200 44 -88 -151 -28 -30 -129 -265 83 68 -15 -130
2171 -130 -106 139 -15 -368 -88 98 -182 109 -44 -39 231 -192 -122 -8 -394 137 -339 35 -101 162 54
2192 54 -38 -30 67 -95 186 -165 -308 45 51 159 78 172 -33 -127 -7 78 -216 246 14 101 -45 -75 -40 41 144
2217 144 -110 -191 -131 -66 21 62 -28 -30 -98 -170 22 -165 -44 -47 -100 -64 -6 -159 230 40 117 -253 -169 64 96 -29
2243 -29 129 -64 21 46 -28 183 -128 -64 111 -90 -227 88 209 76 184 244 -135 -49 22 37 -95 63 120
2266 120 158 370 342 -114 272 180 122 156 -221 77 114 123 55 -136 -125 -117 136 28 48 -133 -127 -134 141 -11 -161 -10
2292 -10 -107 182 97 111 -56 -266 97 -138 40 -168 -186 -94 136 148 87 -276 369 315 99 -173 28 39 -135
2315 -135 2 33 -153 51 67 69 -47 133 154 -133 90 -81 75 3 -99 25 26 -42 -70 -38 -176 95 20 183
2339 183 28 288 29 -211 146 202 -185 76 72 -278 -155 -98 -10 -82 -336 3 -3 -98 24 -96 101 -215 -184
2362 -184 26 -42 41 -23 -5 77 -53 161 -13 105 10 -11 -46 -15 -171 -196 -220 225 36 29 85 -7 -73 -56 -91 -129
2388 -129 -97 103 -87 157 59 119 194 -50 26 -109 -137 154 -16 349 -136 -113 136 -103 -1 51 122 -26 -15
2411 -15 -242 -109 95 -142 -144 169 -19 231 -68 -122 -108 240 71 -242 93 104 121 -149 -40 93 145 190 -112
2434 -112 110 176 -72 18 55 -25 176 2 203 -216 -401 155 -196 67 34 -48 32 6 -87 34 13 -55 4 147
2458 147 13 -365 23 20 -61 -108 -314 163 -173 -73 116 -47 113 -151 -122 78 220 209 105 -170 -127 -225 9
2481 9 308 154 66 418 -190 87 160 -311 3 60 -175 -158 162 -22 102 -32 109 -120 -147 -8 -198 213
2503 213 -50 -2 -220 282 14 -370 11 16 -55 -21 -51 34 19 -56 -25 -96 148 10 -29 48 61 8 -30 127 55 -131
2529 -131 205 -181 -254 74 89 -228 -28 169 -6 -16 163 -192 109 251 -85 22 201 -55 203 76 146
2550 146 -18 -45 88 60 -253 -93 143 42 -169 -152 16 -79 102 162 93 -41 89 192 -167 380 -190 409
2572 409 -141 -32 -215 -56 -44 34 221 43 -217 361 313 -28 138 22 303 -69 -135 -21 -3 -77 -182 -190 8
2595 8 29 225 -423 103 523 65 -176 -190 -117 23 100 -87 175 78 43 141 -80 17 104 155 9 -105 195 118
2619 118 -49 -313 -9 -136 -133 55 -84 1 103 116 130 154 -234 -126 -111 -61 -26 -169 -117 -433 92 -104 -189 112
2643 112 -6 28 -232 40 165 -175 -195 181 228 -101 82 10 -303 -294 52 -305 132 172 133 -64 -130 -459 -327
2666 -327 -72 -149 -4 76 -94 16 35 163 61 134 140 -190 90 -158 -55 -44 -45 162 275 70 0 -38 -125 124
2690 124 -83 -119 97 86 163 -67 -198 88 -120 -322 -9 -141 -23 -199 76 26 -187 -45 -86 -145 -83 -285
2712 -285 -24 -153 356 -203 94 278 -227 7 207 23 270 94 38 -159 -207 -171 -36 -14 147 -80 -140 266
2734 266 126 -64 -185 -144 134 29 -11 -49 -152 96 238 -9 197 147 -143 124 284 -11 166 132 -27 66
2756 66 -352 111 -9 -42 75 -52 -125 6 133 105 32 -138 105 -139 -133 27 56 104 31 -22 244 70 -43 17
2780 17 175 35 -206 6 -106 -82 63 25 69 9 73 -98 2 209 -63 86 259 30 -188 -135 270 -71
2802 -71 36 94 -60 41 -21 -42 76 -114 -164 37 153 -59 114 272 -97 155 -24 96 -480 -151 112 162
2824 162 43 96 135 36 256 -204 141 144 -23 -39 -137 227 28 -14 71 116 -134 -36 -14 -184 -57 166 -44 -172
2848 -172 24 168 1 34 53 -131 78 13 -109 -62 331 11 -300 132 -285 -233 101 53 68 -177 -189 -142 181
2871 181 21 57 -244 103 -232 -102 -52 -50 55 308 250 -13 281 -195 -113 203 -128 -264 187 55 -128 24
2893 24 54 -94 179 -64 274 36 -267 -33 230 -192 -263 426 -115 -149 -46 45 19 -53 -255 97 88 -240 -91
2916 -91 -73 -47 43 -149 -162 -165 110 -243 259 118 -209 105 -454 -65 39 46 109 44 99 -224 41 267 -34 -33 -38
2941 -38 -269 -81 -59 -111 237 -67 123 -77 19 41 -209 -12 148 238 190 101 -175 -205 165 142 71 -290 -16 25
2965 25 77 125 -163 -169 109 -253 206 -39 -103 -20 -25 -82 87 -194 41 67 102 246 -141 48 -184 169 -41 -102
2989 -102 -153 13 -35 122 60 185 111 -117 -7 46 -218 -40 65 88 -61 31 -40 -252 -439 -76 97 54 59 -168
3013 -168 -100 -103 -85 126 -95 -64 -166 192 92 137 205 -281 -160 91 -16 -48 -79 -359 -80 1 175 -10 116
3036 116 -15 -11 63 108 219 12 155 -326 -278 -153 -26 -228 -35 -146 8 -120 -182 21 111 73 74 6 250 -126
3060 -126 -254 -32 -179 118 59 140 -99 -171 -57 -21 -216 -123 74 -24 110 -45 -290 -166 -120 65 -86 204
3082 204 -28 -148 131 -267 -86 43 131 135 112 -120 -108 144 -80 165 101 -59 -4 102 0 -118 12 -43 5
3105 5 -55 175 71 192 -49 237 -79 -104 2 -103 311 118 165 -57 104 -107 -125 62 -10 -452 56 210
3127 210 -134 36 96 -2 77 76 308 124 64 159 -143 -193 -171 105 -131 -206 182 204 57 -206 266 -273 75 285
3151 285 -107 -19 -59 150 184 234 -3 -22 -74 -27 -38 -292 -320 -258 143 -60 -75 -145 -155 -94 108 144 -196 -51 1
3176 1 22 217 -171 -43 321 49 -4 123 -344 148 205 22 -37 182 84 -172 -60 -179 28 45 -164 -229 114
3199 114 15 276 -117 20 -109 69 143 -57 -102 -170 210 98 -52 -56 136 15 100 -2 -216 19 -121 -300
3221 -300 -150 22 134 -155 -83 248 -241 214 -30 93 204 -184 -59 42 223 61 -20 -95 -69 23 193 240
3243 240 -75 116 43 74 -269 -18 130 68 -103 31 -74 -108 -18 296 98 289 137 121 192 -105 -86 -178 -86
3266 -86 -103 126 176 367 -291 -107 -86 53 -73 142 -18 117 -35 283 26 -9 -52 29 -411 51 -21 -127 61
3289 61 -129 60 3 -89 21 -88 -86 -71 106 -46 -287 -158 224 103 121 -142 -161 295 58 100 -2 27 24 -76
3313 -76 -134 192 102 -42 -230 107 240 -236 212 -178 -49 289 65 -107 -215 -90 190 272 -143 35 96 -38
3335 -38 -35 50 -22 -39 -51 -70 215 163 -53 -267 145 -143 -116 178 26 -77 82 -54 -221 221 35 -37 168 305
3359 305 240 -112 255 123 273 -4 -178 -52 134 -72 -67 -96 -91 61 -74 -56 -40 266 -172 -42 14 37 22 -61
3383 -61 232 159 -10 67 -104 190 1 145 156 -70 -44 27 -62 -202 -1 -181 -7 66 -28 -95 80 87 177 -215
3407 -215 57 -144 -40 -39 -119 62 -20 10 21 -30 -13 45 94 -176 -175 -84 -154 -124 -138 57 -185 -68 -133 -14 -93 40
3433 40 -140 68 41 9 -177 32 -48 106 -49 -137 -217 112 92 70 74 -258 -46 428 237 137 398 62 8 -166
3457 -166 -144 -311 40 123 15 -122 133 25 162 46 -15 251 -358 -130 36 -304 3 -94 104 -38 -17 60
3479 60 -106 -10 50 66 -75 -21 80 -23 -10 -158 -96 -1 -296 228 153 -144 149 -99 60 -53 -33 -174 -67
3502 -67 72 53 -269 -216 -351 -31 -6 -179 -180 57 134 133 -215 228 -178 -59 -1 -92 75 -174 -126 -179 197 64
3526 64 -154 58 -306 13 88 254 -161 20 19 99 67 64 -67 -91 297 183 78 147 -29 -129 48 -135 -41 39
3550 39 -121 -192 -187 -107 9 274 -284 -56 -93 -128 194 -52 -60 -9 -7 25 -200 -121 38 -165 -100 -149 201 36 55 35
3576 35 39 89 -35 -50 199 -26 206 11 59 215 -273 212 -126 -174 65 211 184 -21 79 -11 -215 265 6
3599 6 203 308 -55 291 298 59 94 -311 -88 -30 -2 -59 259 -95 -218 11 88 -222 177 64 -168 -170 -26 124
3623 124 16 -38 2 118 -77 200 -68 134 107 47 -30 96 -51 69 0 -53 10 154 -105 -167 201 94 124
3646 124 -97 -114 -171 72 127 -31 53 -281 -93 -250 -14 129 -36 162 247 97 -23 185 -178 -165 -32 -12
3668 -12 202 -438 -22 -5 -101 -172 -49 -124 116 -80 -13 101 33 -116 104 -48 -74 150 -94 40 123 -71 -226
3691 -226 -46 26 -35 60 -32 -111 -70 144 -5 87 130 90 316 -120 -229 -52 65 30 115 -69 -275 107 117 71
3715 71 54 -148 -141 -47 -11 5 207 260 72 -7 2 -120 -70 -141 -8 97 10 66 149 -199 -108 -191 100 -5 7 -64 193
3742 193 -247 55 -123 -278 19 -11 -52 -262 -255 4 -166 -189 84 100 108 66 86 118 88 76 -59 241 -16 228
3766 228 -7 -28 -30 43 -104 74 103 245 -210 283 -158 36 78 -137 105 -2 209 -242 65 -72 -89 -205
3788 -205 280 135 0 50 112 275 -24 -57 -192 -33 27 -47 -193 88 -198 -129 -38 63 66 248 54 40 -8 194
3812 194 -369 100 118 221 -121 -190 126 -15 21 355 -164 -115 -37 47 83 5 -82 153 12 247 3 45 -48 -192
3836 -192 -160 68 224 125 148 -34 252 -211 56 85 162 -269 -83 -95 23 -68 -32 -246 73 80 -284 115 -159
3859 -159 -105 -42 -178 -69 282 -113 29 -77 -246 224 121 163 -2 -228 33 -158 -75 -101 68 167 -69 -21
3881 -21 -2 106 -96 138 243 -169 -151 -83 -17 -23 -140 -37 201 101 -11 3 169 55 95 9 231 164 -185 165
3905 165 154 -50 139 334 142 41 0 -20 -35 176 3 99 -38 -21 2 151 -329 -337 -179 -209 -51 125 210 150
3929 150 131 207 -137 119 240 -5 144 -106 120 -107 -230 98 134 -59 116 39 3 -167 107 -38 151 144
3951 144 235 -85 80 178 25 -57 1 45 -98 69 -347 -157 -358 123 -279 -204 -86 4 -49 191 13 92 21
3974 21 -77 230 100 192 -270 -76 -153 -57 60 244 3 -366 -270 -89 32 -158 -201 118 -312 -49 -69 19 -59
3997 -59 11 -61 -77 18 -124 4 231 -14 55 -43 62 -123 7 -173 -85 -111 1 -102 63 -69 115 7 -158
4020 -158 -19 61 190 -13 287 -83 32 -33 -99 -145 283 61 67 -40 -313 -118 5 -117 93 104 50 66 -4
4043 -4 227 215 10 -187 142 75 12 -158 112 -17 -217 -133 31 -60 115 -94 -213 -251 17 129 15 19 -50 396
4067 396 211 211 -262 194 -61 -221 7 -176 251 -37 178 -365 287 -29 179 -123 168 307 58 0 50
4088 50 -30 -248 0 -140 -171 15 -71 54 42 -93 -110 -148 11 107 76 -96 -101 116 135 145 274 -124 142 -25
4112 -25 65 -172 190 -139 -72 97 -225 234 -61 415 -40 -41 83 26 14 -314 194 123 -99 -31 -34 10 -143 5
4136 5 -133 62 -123 176 177 -147 133 2 -154 252 -90 57 32 -336 -78 106 -65 89 67 -69 -182 59
4158 59 -9 163 67 -33 132 111 135 97 220 70 -174 -105 2 65 -4 -55 29 52 -162 -104 232 -211 16 142
4182 142 -79 -50 79 -35 -30 88 112 70 -136 224 -164 2 117 4 -68 -79 42 149 -27 -43 -106 61 24
4205 24 -147 -44 -65 70 20 59 -32 -164 228 258 -56 -125 69 -48 248 -184 -29 113 -114 65 23 17 -70 25
4229 25 -47 139 -74 -141 -512 -149 -243 -40 146 88 52 -269 306 -30 -325 87 -52 -47 94 -252 -58 -153 -152 27
4253 27 -226 65 -39 -204 249 -117 30 -46 102 252 -153 114 24 86 -150 22 355 140 45 -80 -38 -52
4275 -52 278 117 -122 -145 -104 35 -46 -140 286 67 -68 -11 56 -125 43 -289 -203 -120 313 -94 -51 -1 121 77
4299 77 -98 39 -39 165 210 -165 -74 -101 -227 -43 92 45 -129 -116 27 77 146 -82 209 -70 113 162 9
4322 9 6 -73 -90 -39 -80 -51 55 -154 -136 98 50 158 11 93 3 -45 200 107 -30 22 -98 -96 19 -170 -113 -37 -50
4349 -50 106 149 -74 384 175 -159 -214 -241 -99 27 -21 51 -65 144 121 -118 112 -187 45 -185 158 -31
4371 -31 -76 -59 94 -236 -9 43 17 51 -211 -103 -189 -80 84 71 -114 61 -29 -76 0 103 -197 188 234 135
4395 135 254 131 -61 286 62 -214 51 153 -193 -29 -13 -153 114 45 -13 150 65 116 -66 -13 74 -157
4417 -157 -208 44 -127 162 -54 81 232 181 182 -96 -3 176 100 -202 -144 119 9 -215 -33 230 -150 146
4439 146 -48 30 -54 -135 164 -317 -1 157 108 -35 -53 -78 -39 27 62 -25 -205 41 -130 25 -43 -78 84 176
4463 176 215 220 127 25 -130 -276 63 -90 24 77 132 132 -98 -29 -94 -102 74 104 147 182 113 23 -89 24 202 -139
4489 -139 -120 327 -231 -165 50 -64 -137 56 -87 86 6 211 187 112 68 -117 129 -56 -306 -116 166 -151
4511 -151 78 26 135 251 38 -155 69 -160 -50 -100 120 -25 17 98 165 147 -195 233 127 52 48 -49 10 34
4535 34 109 110 94 38 3 217 130 -65 42 223 95 183 126 -104 154 -172 176 -115 136 145 21 -135 -63 -161 49
4560 49 54 -133 -187 163 49 94 62 -177 0 117 14 -132 5 17 -13 9 278 -228 -2 140 128 26 -44 -233
4584 -233 65 376 136 48 -52 449 171 -117 -113 -238 -143 90 -95 43 23 282 -74 -37 -36 -48 -44 5 92 -226
4608 -226 163 77 -15 60 311 178 73 -32 155 3 183 -46 -369 34 -144 57 -330 -25 -217 284 227
4629 227 305 95 -299 11 261 -41 -102 -93 -18 -137 141 -161 117 -129 171 41 64 -190 191 -54 161 -203
4651 -203 -256 41 31 -298 -224 130 94 241 -60 -32 -158 61 -13 83 -23 131 176 123 97 -82 -32 170 72 112
4675 112 69 143 17 -111 303 -171 -44 -197 -223 82 -320 -55 -126 55 -9 93 29 -461 -43 -242 98 -6
4697 -6 209 228 -53 111 -77 -164 -158 -65 -225 -169 145 119 112 23 -157 -143 110 -142 106 10 102 39 83 102 62 -176
4723 -176 29 150 -128 -39 61 -148 -15 -153 -51 -18 -349 -75 -46 -55 -108 -142 255 -129 -46 -76 0 -3 24 -146
4747 -146 -72 119 78 7 159 -64 81 82 -96 118 -68 -89 306 222 -193 162 4 144 2 -147 -248 371
4769 371 125 -137 239 -334 -242 117 63 -21 -147 22 -215 135 118 -174 -112 128 218 -87 138 53 -209 193
4791 193 47 25 -13 53 66 53 -113 103 200 55 207 -17 170 5 184 -52 -286 132 -279 177 138 -80
4813 -80 57 19 206 122 -124 14 -63 -75 266 106 -5 -344 46 41 -114 68 298 -169 28 -28 -176 -45 -114
4836 -114 12 57 -189 -14 144 135 51 65 137 103 -208 18 55 -139 7 111 -1 -19 321 -45 297 -2 15
4859 15 81 89 115 -115 -298 126 305 133 304 9 -349 118 121 158 -62 160 61 -166 215 76 167 -52 -117 -34
4883 -34 -254 4 -230 -2 -1 185 -234 -34 -156 -10 -28 -401 -47 74 143 22 78 43 43 -37 -199 203 16
4906 16 -53 -150 -25 340 -86 40 119 219 84 46 -235 -457 -56 105 -150 244 -48 -6 -79 -168 83 33 141
4929 141 34 50 319 -6 -260 -3 64 142 -342 -207 -23 -58 -55 -71 -121 -81 -198 -99 23 99 -137 -75 -94 -94 -29
4954 -29 79 -18 -16 -11 -44 10 -48 -9 99 71 127 130 176 172 -191 -56 -146 -92 -93 136 -289 62 252 130 43 -27 -79 127
4982 127 201 87 270 248 219 -349 -56 -86 -152 102 -109 -120 -46 151 139 -72 -26 -81 51 -164 -62 -93 198 206
5006 206 173 49 45 29 26 -139 -97 -16 -110 -41 -140 84 -79 79 -395 173 54 -26 -5 126 -199 277 110 2
5030 2 -106 -120 37 117 224 -188 144 325 -102 -94 -144 284 -176 -32 -222 -372 -20 -85 164 -58 151 -104 140
5053 140 -6 53 186 -116 64 -245 -28 -220 29 148 -108 -85 -168 349 7 59 -183 34 -46 -80 -452 73
5075 73 95 -129 43 -137 146 46 73 -124 13 -22 37 -37 -433 281 147 -57 226 164 -9 227 6 90 144
5098 144 -220 78 -106 -195 116 38 94 -139 -49 -240 115 23 -164 -264 45 -90 -48 -220 -111 -123 -81 -11 71
5121 71 -134 44 99 66 78 137 -142 -196 -124 93 71 -128 54 -51 -278 36 -216 -67 -96 208 -108 -64 -137 84
5145 84 -126 -124 26 90 7 -41 34 42 64 -100 -62 -119 -204 139 -103 15 -35 -187 -81 -340 75 64 82 -30 52 -116
5171 -116 -11 -100 45 40 307 -100 -382 -190 -153 -48 -166 6 134 -31 -1 -59 -75 -50 106 -97 -3 150 73
5194 73 -3 142 -90 148 172 242 153 -61 -163 -152 207 -97 126 56 -100 46 109 -169 110 -153 -265 -64 -109
5217 -109 -267 79 -102 10 18 0 -56 -236 91 14 55 99 175 69 124 97 16 -26 160 -353 107 80 17 195 198
5242 198 145 -73 -27 -245 82 -140 -80 207 -164 204 -82 -84 160 183 -69 64 20 -192 23 90 -92 -52 116
5265 116 -50 -170 84 243 248 -295 31 -55 -309 -96 -116 78 38 -71 -77 144 12 -3 -190 -77 -274 99 -160
5288 -160 -103 83 5 237 -183 -28 266 275 31 -237 -189 -108 120 -74 93 38 25 4 27 -132 179 -95 167
5311 167 168 -78 2 64 161 -179 87 108 -112 22 -377 -182 -112 195 -8 86 28 86 -12 250 12 -13 40 80 -93
5336 -93 -307 3 67 -12 -21 -157 23 -272 132 235 394 -1 200 -22 73 329 -356 100 -186 -115 24 -81
5358 -81 46 194 316 12 186 -67 208 -260 10 264 155 -176 -132 336 -53 -32 -58 47 -153 108 23 80
5380 80 25 -182 -76 84 -70 -79 56 52 -79 -44 -86 -95 68 -142 -210 -53 -159 45 -107 -28 -39 -46 -171 -53 -197
5405 -197 91 56 5 2 -346 234 -177 -7 -26 -128 -55 78 -27 137 113 76 -354 118 216 -49 440 -88 151
5428 151 -29 -121 -10 -61 -101 -209 -37 205 92 -20 301 -99 -16 179 -144 191 3 117 17 154 -186
5449 -186 -68 131 -215 104 217 145 -78 57 -43 -209 -183 75 153 -30 -12 174 97 -101 89 158 149 113 43
5472 43 -105 -18 -68 -243 438 115 116 166 181 0 -113 -82 -29 -6 -106 37 -156 114 116 -202 -83 -114 -10 -64 17
5497 17 100 33 86 210 -74 100 -216 -316 32 50 170 70 -54 -182 21 -108 -218 75 83 13 -148 108 267
5520 267 131 64 -17 -125 -56 274 -19 -11 -119 122 6 -11 -89 63 125 -167 -106 -32 -61 -133 -24 205 138 -79
5544 -79 -103 23 -62 -255 -9 -199 73 65 -31 -106 -203 -5 73 53 116 -70 -223 -7 87 7 -12 -56 -86 221 124 46
5570 46 -58 -118 -114 419 124 -52 -48 -216 73 5 85 29 -192 134 -61 -30 241 56 68 -92 -65 242 45 -16
5594 -16 -84 -4 -20 -115 -196 -104 303 76 -84 -102 209 13 175 68 -173 -148 -27 -69 60 17 111 -132 222 -20
5618 -20 -79 -125 95 354 20 146 68 -72 92 203 182 44 108 -139 122 276 -31 -26 -162 -54 39 -89 -153
5641 -153 -33 61 257 458 -90 194 -52 119 130 179 -13 176 -13 -125 46 -66 -120 9 48 -124 61 -145
5663 -145 -116 -94 26 -17 -224 -114 -276 185 11 143 -103 -206 21 11 255 -28 65 -106 89 235 -122 143
5685 143 -32 364 383 44 76 -94 -215 -330 -45 -10 -154 178 -181 -42 -118 173 81 65 28 -4 0 -12 -70 -127
5709 -127 48 -195 35 -60 234 30 -20 -33 -165 126 -41 17 -1 211 -297 47 246 -54 -327 -125 -122 -221 21
5732 21 -100 317 37 294 -220 -116 -55 -61 0 65 127 -153 29 19 -153 -40 -170 132 119 63 177 -61 219
5755 219 -36 -11 157 -40 -2 -71 156 119 28 1 -174 -243 -102 142 -68 -148 -73 76 42 42 -137 -140 -69 -148 31
5780 31 87 149 109 -120 -258 343 7 -142 -111 53 115 -32 151 -283 -131 -6 193 -33 91 -31 155 111
5802 111 -101 117 40 72 23 -185 -89 -221 256 -174 78 5 -14 69 -188 -98 29 105 139 167 80 7 -282 -189 -66
5827 -66 64 -254 -201 -16 -88 -47 283 33 233 93 119 78 -70 -41 158 -362 -110 276 62 -70 -160 -28 179
5850 179 -114 37 127 86 -246 11 67 -114 -10 69 183 -18 145 152 -21 -9 -156 -177 101 100 122 23 -148 186
5874 186 -260 -20 59 105 -97 54 115 -56 65 188 89 -60 125 61 -96 285 201 75 -201 100 103 40 306
5897 306 -58 32 -68 -12 209 -72 41 74 -119 241 -11 319 56 21 -97 169 -111 253 -44 -167 57
5918 57 -223 105 223 75 8 197 107 -61 -229 -71 175 66 -69 66 -80 43 133 124 -230 127 105 132 -150
5941 -150 65 -329 109 125 -138 -67 99 -47 20 270 391 -206 264 -185 -254 40 -162 -367 12 46 -222 138
5963 138 78 9 117 134 260 -131 -267 123 1 -77 -283 -213 -21 384 -127 -56 71 355 4 243 127 74
5985 74 9 124 244 74 263 -12 158 -142 51 -8 -13 121 4 -71 -49 -22 69 201 49 -455 -217 112 -105
6008 -105 11 -213 14 -97 -196 -239 109 -1 -148 -340 88 -70 41 -47 98 110 156 236 23 1 -104 -97 -347
6031 -347 -6 180 124 -84 91 -103 222 -17 239 28 -340 -45 248 87 40 318 -11 -200 -105 -181 172
6052 172 182 242 -65 102 7 -167 -109 -184 -115 -107 -192 -52 -73 -192 -84 -236 -32 -72 31 -160 7 0 118 -32
6076 -32 -62 -33 224 102 -167 -22 -41 -280 -26 138 141 391 90 -43 215 56 36 255 -126 -53 -74 -103 -228
6099 -228 -52 170 -46 -78 -101 -96 -85 225 -155 -104 54 243 -240 -152 -287 -30 -34 -43 35 -97 -59 -94 410 38 194
6124 194 -132 -142 80 305 -82 -24 -20 261 18 215 -158 -78 34 -58 -306 -20 116 -13 27 -34 74 -224 147
6147 147 4 -118 -168 -185 -39 -151 -207 -130 -5 -9 -219 200 -161 -242 55 87 -55 -89 -107 -6 6 -5 -62 173
6171 173 303 39 -154 157 -57 157 -252 -135 217 132 -27 -41 58 -203 -153 -13 81 -52 -98 85 -108 60
6193 60 133 -198 84 -17 -39 -120 -88 51 139 254 -152 -42 -15 18 385 72 -126 272 67 -275 92 -98 -49
6216 -49 -107 294 -25 76 175 44 260 103 94 52 -21 27 -149 -208 -307 -73 -85 -291 -36 82 123 154 308 14
6240 14 35 -109 -32 -236 -134 171 -347 66 40 -311 -227 151 278 -268 125 -2 62 -92 -135 -67 77 124 357
6263 357 -23 28 -170 -34 -363 1 -86 -89 271 165 -143 -45 -104 65 -59 -84 44 106 115 -152 -60 -56 74 120 -77
6288 -77 -106 -124 -22 -177 82 98 -149 -19 -86 270 7 321 24 -75 26 151 -141 21 173 139 -28 186
6310 186 92 134 -210 -153 -5 119 339 52 -210 78 55 68 -79 -128 70 111 -108 66 -110 0 -223 -81
6332 -81 -161 176 204 -83 -108 -39 -80 107 -101 26 129 -284 34 33 29 64 -245 -242 194 -61 -1 -120 27 -142 -14
6357 -14 36 -63 128 -110 -170 -311 63 -186 36 -97 -83 56 -66 135 -122 -33 -361 -99 -18 -8 -132 -75 -101
6380 -101 -412 98 -102 -78 84 -70 18 276 27 -112 13 -15 37 -74 1 32 -142 17 257 91 127 163 84
6403 84 59 -36 249 -76 -30 -79 -68 96 -61 269 36 -25 -119 102 -130 -55 56 83 123 -76 -105 -164 -253 114 13
6428 13 44 21 293 25 -175 -210 -24 -214 -110 -256 60 -53 75 -126 25 152 -79 -101 -108 -255 -26 -101 -51
6451 -51 -12 -116 -108 212 16 -244 -81 118 -12 -223 86 148 -7 -55 214 14 -111 65 137 -217 65 -156
6473 -156 78 -33 199 44 69 -234 -185 52 -114 69 61 -113 -221 -51 109 8 61 -220 -401 -79 -11 -155
6495 -155 169 -18 -309 -46 -18 221 159 -83 -66 -64 68 149 -149 -32 -156 77 29 -77 -79 24 -61 217 -137
6518 -137 -147 102 -37 5 157 -67 -37 -333 -119 -62 200 -228 -26 167 -2 -93 -63 -87 20 -73 236 -148 -82
6541 -82 -29 0 -32 158 128 80 -150 -14 -135 -135 -45 -112 90 -78 -6 28 69 19 -24 130 265 -242 -107 -141 116
6566 116 -86 -237 63 -50 -163 -108 191 -81 227 176 -30 -166 111 92 -163 184 51 -67 -340 -52 -245
6587 -245 -99 23 -124 -21 -14 7 25 -183 34 54 101 208 7 72 96 105 361 -125 -24 5 6 -186 66 -120
6611 -120 -102 257 -183 214 -151 -224 -35 -55 166 130 -26 42 25 5 -63 196 160 44 -18 -247 43 -65 -152 -150
6635 -150 69 311 304 -297 71 77 -84 -35 -94 106 -25 264 -134 -53 67 119 -107 -221 -12 -8 -148 -233 266 -7
6659 -7 -80 50 0 58 127 17 109 -146 325 53 73 -61 -215 -20 -229 188 89 39 -251 -164 140 211 122 47 -152
6684 -152 126 -45 340 -47 157 108 42 88 31 -185 164 208 -98 -108 -89 -67 -95 2 90 104 46 30 -211 11 -148
6709 -148 -242 -109 -93 270 -155 -34 135 -61 121 1 -32 -38 -29 -19 -211 -10 72 -31 46 -153 -84 -130 174 -45
6733 -45 74 162 103 -12 -13 25 -57 -190 22 -63 135 10 -3 -292 81 -258 -176 -85 82 -200 -48 175 75 149
6757 149 12 348 109 63 -171 -21 160 37 -39 -181 53 -92 -106 190 -22 -142 -116 77 -102 -104 -153 90
6779 90 -19 -167 132 165 216 137 92 -65 91 -102 100 280 -144 -193 171 -172 -76 -110 -17 -107 92 -160 35
6802 35 -37 -78 -150 -209 18 -78 -74 -197 -138 215 -115 -425 274 -113 269 -128 278 -144 209 -26 -33 -31 -232 -18
6826 -18 94 -11 -98 -308 292 106 -109 -129 69 -32 45 -64 -68 294 130 140 -29 -284 189 -269 99 -40
6848 -40 25 64 113 135 63 42 -9 54 92 -16 -243 6 76 240 -346 68 38 -85 88 -23 -324 -359 -22 128
6872 128 124 275 -111 -57 -54 -32 61 142 -183 -60 -128 125 -36 -280 -6 -92 134 -299 -58 35 83 37 -70 103
6896 103 1 -179 -19 38 -75 -168 105 32 2 34 211 143 133 -228 133 11 178 70 203 182 121 18 -142
6919 -142 76 -88 79 -106 -94 57 -122 54 -22 47 -74 -25 287 -43 2 -243 60 326 -193 -76 -52 -52 310
6942 310 -98 -23 -97 148 153 159 -88 -136 -191 -227 108 55 75 71 159 143 180 -252 -55 -17 203 123 -3 7 -51 -197 -123
6969 -123 -72 118 48 -118 55 -343 -45 -40 126 -97 106 -84 82 -128 -151 86 74 -159 -214 -11 -3 -159 -69
6992 -69 10 167 122 0 -87 -146 -1 -33 -265 34 -87 -89 -7 189 18 -115 17 -288 40 -54 512 7 -150
7015 -150 201 171 -56 223 38 54 -113 40 -175 137 -100 -93 -184 342 -96 -193 3 213 238 -308 215 -37
7037 -37 54 59 -48 227 163 -112 -123 106 -3 325 -107 79 345 291 -74 -101 -114 123 -111 -259 -271 -75 -16 -4
7061 -4 217 41 -36 -67 -117 22 27 -242 -19 -175 -10 -162 -103 317 147 -182 15 -37 221 -54 -63 18 314 66
7085 66 344 14 56 -122 -114 279 266 -52 -271 -43 -110 -26 25 69 84 98 -12 96 152 -9 -122 75 -14 -130
7109 -130 2 -23 57 80 -146 30 -13 284 309 -107 33 -152 59 -84 -66 305 -108 164 60 10 12 131 -12
7132 -12 86 -82 -157 9 -33 16 -117 -50 25 1 -25 -184 76 -194 163 5 308 52 -152 32 -50 180 -313
7155 -313 126 -8 71 -116 99 1 98 -126 -136 70 -46 -207 -13 -373 -356 123 28 -20 76 20 184 -136 -283
7178 -283 252 -97 85 -79 243 -18 -89 -303 -95 292 -175 -10 173 146 421 -262 -66 193 -196 469 65
7199 65 -67 -165 -110 23 -8 56 -15 131 9 -146 1 -4 210 -225 330 -185 61 -114 -124 107 -2 -95 -10 127
7223 127 184 28 -239 51 -148 -189 181 35 68 -115 -114 42 -41 8 -91 300 -43 49 -146 148 70 -210 212
7246 212 -46 -216 -45 233 321 -114 43 136 408 -196 102 -81 -60 127 -14 75 59 281 -139 -171 -11 177
7268 177 116 -57 154 -30 125 -263 119 -55 57 138 -128 196 -13 -49 -191 -146 -185 26 31 221 182 -107 185
7291 185 -197 136 6 175 101 0 102 89 188 -63 69 -209 -92 196 118 183 -267 144 64 172 -94 -215
7313 -215 -74 75 -71 48 200 123 20 -108 -127 -107 80 -168 96 -145 314 -85 82 237 -22 -177 -21
7334 -21 26 292 -36 -95 11 392 1 93 85 299 -41 11 -320 38 16 246 177 28 266 -270 -56 -16 91
7357 91 -115 -252 -31 -226 67 -344 -28 -63 -151 79 -330 96 6 111 -23 -25 -287 -78 72 -116 -244 -7
7379 -7 273 -85 -2 270 28 -52 176 -89 -76 47 -131 42 105 329 266 171 85 -174 151 -126 116 -83 50
7402 50 -23 135 -139 -95 131 -182 244 -185 94 -11 -35 283 -135 105 243 83 -420 -90 -200 -159 82 41
7424 41 128 137 -81 121 -21 -264 -164 -183 148 -110 167 9 64 -19 -102 -109 -241 -38 269 30 259 57 -126
7447 -126 -114 66 278 -37 -68 -127 169 367 122 170 141 -70 -40 45 -73 50 -75 101 -303 140 28 53 -205
7470 -205 43 67 133 33 -165 44 -19 -99 84 -75 214 -71 158 23 -133 26 53 -78 -24 -50 13 -192 18
7493 18 -37 201 -96 116 -231 -16 -43 -155 -30 -89 127 -18 0 44 178 -116 -329 -81 -376 -70 8 -151
7515 -151 297 58 -1 -87 -70 286 26 9 40 -14 -92 103 -194 -42 108 114 93 -38 156 -23 170 -104 -72 -118
7539 -118 -1 -146 128 246 245 73 -115 -165 -146 84 119 -104 5 20 -398 -96 -194 -25 150 -59 -472 233
7561 233 -245 -52 110 -220 233 239 25 -37 -232 -313 -70 119 -8 34 -210 201 0 -197 -117 106 176 24
7583 24 -57 18 171 -79 -115 2 62 -25 -106 21 -202 -82 -78 -75 112 -151 -37 -112 141 58 -33 -61 -29 -47 -82 -186
7609 -186 -32 -385 -72 -127 -230 250 103 -161 142 216 34 35 189 71 136 -236 -244 -45 208 93 -182 -259 -19
7632 -19 163 -261 48 -54 10 -37 -16 -68 59 286 85 -125 -146 -110 -129 175 158 54 -68 12 -95 -87 155 54
7656 54 70 -226 206 87 170 -381 70 -18 34 -60 -131 135 102 177 161 -374 -280 96 106 236 173 286 44 3 -158
7681 -158 26 241 22 87 211 -151 -58 93 -164 50 -21 -124 -40 146 93 -289 -150 -83 -212 -94 41 -179
7703 -179 166 59 -45 -12 111 -222 -115 -134 60 -134 102 91 106 266 -52 90 429 -183 4 -287 86
7724 86 -127 151 99 -172 215 37 87 53 -48 192 -17 35 -116 241 97 147 83 -125 28 -108 -132 -254 3
7747 3 175 3 -138 -84 -81 112 137 293 -39 241 34 -68 -73 79 -44 -75 2 123 157 -28 -4 117 65 13 -257
7772 -257 -56 -111 200 -80 -73 -54 92 -78 -50 -223 -170 -78 25 -2 -24 141 15 -22 120 33 -57 -135 124 -151
7796 -151 -95 -14 247 20 -50 -226 -189 -50 -39 267 -149 16 -51 -288 -304 -71 -186 54 223 -26 -94 69 178
7819 178 -152 46 56 -69 87 -75 72 159 88 -63 8 106 -167 -87 -41 -230 138 -53 228 -58 4 -248 -12
7842 -12 85 -83 181 -30 -30 0 215 -108 142 -138 -449 85 -11 6 -205 63 -131 -179 176 -192 -23 194 -115
7865 -115 160 63 111 31 -206 87 134 130 -184 136 -37 135 -238 167 -44 40 14 -260 -32 -164 -174 75 161
7888 161 77 123 144 -268 -138 -151 141 -298 132 1 88 48 14 -157 -30 160 64 165 153 154 -5 234 10 120
7912 120 111 -130 126 -22 -124 44 135 -35 65 -134 -86 96 -283 -56 115 -50 51 83 121 42 -62 -94 332
7935 332 -39 -32 -68 271 -27 -125 -59 48 89 104 -150 -5 -207 98 -57 157 -68 -212 183 -170 66 67 411
7958 411 14 -160 -157 -199 -4 195 -171 -62 -84 -71 -85 66 -115 -55 79 -47 -35 -38 -134 -205 -65 -38 127 -21
7982 -21 181 -30 3 56 -21 11 124 -145 -108 42 130 94 35 -149 -198 130 -97 -72 -198 14 38 99 -204 -126 19
8007 19 -13 -14 69 43 218 49 -148 28 -173 -113 -362 -267 -243 118 57 -108 -32 -150 -132 116 -145 110 160 -12
8031 -12 57 -51 -22 -27 -126 120 -42 103 -155 25 -84 46 -179 247 244 41 -14 -30 -209 -236 -31 -169 107 78
8055 78 72 -279 110 -93 223 -61 -85 -62 278 -93 173 -114 -4 69 -36 79 171 -6 86 -175 -96 -81 171
8078 171 -122 -101 -12 -6 -110 79 9 -175 -46 -48 -255 -97 16 -33 -198 137 -111 226 -163 -181 -49 -21 244
8101 244 38 -128 -131 -259 -123 -44 3 -204 -159 171 -215 -17 175 -30 25 -59 35 49 113 -81 389 -124 71
8124 71 -151 -138 83 -288 -73 -223 140 276 48 37 -8 148 243 140 124 199 -233 239 144 -192 -125 -97 -15 -112
8148 -112 -63 -17 -321 -321 27 81 179 -215 -23 171 257 95 259 -47 47 17 -306 -135 -126 -148 -9 -90 110 10
8172 10 1 -118 -402 -157 -211 -188 -201 49 -32 171 -129 316 142 28 -309 45 95 226 253
8191B53
$$ Imaginary data points
##PAGE= N=2
##DATA TABLE= (X++(I..I)), XYDATA
0 0 0 0 0 0 0 0 0 0 0 0 8 -8 8 -9 16 -16 24 -32 32 -40 48 -64 72 -88 104 -120 136 -160 184 -208 240 -272
32 -272 311 -352 396 -447 500 -562 628 -700 780 -868 962 -1064 1177 -1301 1437 -1582 1745
49 1745 -1922 2116 -2330 2570 -2836 3132 -3470 3851 -4290 4800 -5401 6122 -7005 8118
63 8118 -9572 11552 -14427 18997 -27395 47931 -209453 -127540 253405 -115844 -197771 58695
75 58695 89431 -87696 42882 147049 32489 -30797 80238 71079 10395 1620 3900 -9255
87 -9255 -2134 -35779 -26888 -10605 -48309 -51070 -1870 -40589 -59834 23848 51814 -28245 -19564
100 -19564 71936 67891 -148 17469 48556 35777 26743 -11207 -52598 -14453 -1560 -42216
112 -42216 -24397 -12995 -65220 -37944 56542 43676 -33086 -7997 49709 20387 10931 52177
124 52177 2624 -58406 2183 40897 -21136 -42489 1752 4713 -31916 -16176 32173 10624
136 10624 -29239 6383 33080 810 -26 28310 14004 -11806 5345 21837 -9666 -23535
148 -23535 6461 -7866 -38262 -7515 2979 -31951 -19903 16939 13268 -44 6185 15168 17644
161 17644 23980 25999 3099 -10349 3019 1985 -6667 -8396 -23739 -27859 -10225 -3232 -1969 -5663
175 -5663 -16051 -1790 19399 11232 3332 11540 12622 4257 7050 16346 3343 -9298 5730 551
189 551 -20548 -2678 5745 -20664 -14367 7542 -3872 -12119 6275 13302 -1267 171 17213
202 17213 7627 -6367 6653 5282 -8588 597 1637 -13139 -8048 3634 1846 -3666 -4822 2579
216 2579 6855 3195 4043 2224 -1010 1821 2004 1817 431 -7361 -3873 1673 -6052 -4291 1290 -6060
232 -6060 -4109 4133 1176 -637 3940 7926 5041 1909 8949 8308 -2172 1116 2666 -8003 -6656
247 -6656 -3493 -9384 -9173 -5757 -4130 -2486 -1293 3769 5880 3556 8577 10156 3509 4173 5450 1953
263 1953 436 -3120 -4175 -2144 -5684 -4854 -2971 -7505 -3818 343 -3763 -3135 1660 1992 2095 1721
279 1721 5714 7037 2829 4919 6710 427 1475 1175 -5131 -4370 -3452 -6847 -6551 -5102 -2657 -1208
295 -1208 -2195 2278 5260 2412 4888 5768 1820 3312 2219 -1215 -407 -1874 -2877 -1657 -3162 -1337
311 -1337 -350 -2394 261 1701 -1396 630 1190 -432 1005 -14 555 2068 135 1259 2068 -260
327 -260 1497 669 -2877 -680 -647 -2941 -2053 -1963 -444 481 -1414 1515 3546 1188 2085 2254 353 1606
345 1606 -221 -2763 -1060 -1681 -2126 -1937 -2492 528 1860 -900 1115 3716 1164 1482 774 588 949
362 949 -1373 -1427 -370 -2202 -671 332 -2114 577 1528 -920 17 1254 240 -21 -784 1195 1337
379 1337 -2047 724 2105 -538 423 889 -1235 -4 -915 -1788 -1373 -1868 -990 -755 -1752 1080 1927 -257
397 -257 1836 2964 2276 1309 572 750 1591 -1968 -1901 -490 -2319 -1970 -1242 -2430 -601 173 -198 95
415 95 22 1664 2463 -1067 340 3095 86 -549 2203 778 -346 -416 686 369 -2270 -784 335
432 335 -3211 -940 1224 -2629 -1983 1872 653 -1108 843 2687 1394 -934 2057 2835 -1931 -395
448 -395 2397 -1361 -1938 778 11 -1133 -494 526 -159 -1780 994 1449 -2711 -670 2916 -650 -2045
465 -2045 963 1660 -142 -628 1421 1665 -1428 378 2783 -1593 -1449 1585 -32 -2157 114 1528
481 1528 -1378 -2406 1681 2073 -3491 -476 3464 -1501 -2809 2424 1131 -2450 680 2720 -744
496 -744 -2151 2694 2036 -3626 -279 3738 -2288 -2482 2861 -158 -3251 395 2925 -268 -2465 1056
512 1056 1784 -1797 -19 2229 -1773 -1593 1582 267 -1604 -409 1602 516 -1863 1313 2967 -2313
528 -2313 -1680 3138 935 -2832 542 1715 -1071 -1727 2179 1222 -3310 250 3138 -2330 -2034 3040
544 3040 -574 -3929 1096 2813 -1205 -1337 2339 1723 -2033 1886 3419 -2303 -2100 2678 -58 -2170
560 -2170 227 143 -1777 -1673 1972 866 -2719 -466 2473 -978 -1391 1929 617 -1460 348 2346
576 2346 757 -1499 913 1820 -1140 184 2065 -1546 -2695 705 199 -2698 -1357 1126 -761 -1686
592 -1686 1530 2761 -1505 -677 2929 1245 -227 1515 473 -1507 -777 1930 156 -2527 -312 1234
608 1234 -1118 -931 2220 -834 -2899 707 1321 -746 -984 1002 944 -706 1198 2449 -417 -914 2439
625 2439 453 -1128 34 -410 -1712 -1427 405 -135 -1934 -682 1337 52 -568 1553 358 -131
641 -131 513 1051 429 -888 -139 1133 -699 115 1813 -733 -1683 644 660 -1060 -833 -114 -138 -1354
659 -1354 -95 1475 -757 -610 1800 638 60 1461 485 -999 -207 829 40 -1510 -530 583 -915
676 -915 -550 862 -175 -749 413 603 123 -205 -51 521 -377 -34 819 -364 -874 965 607 -238 15
695 15 253 -222 -658 -78 418 -857 -854 436 157 -138 556 357 -432 90 456 135 -611 -236 280 -670 -847
716 -847 923 50 -964 436 352 -161 65 63 185 -610 -182 373 -718 -430 1001 191 -334 569 341 -298
736 -298 148 96 216 -418 -637 320 -221 -366 280 -360 -207 912 -121 -92 -28 84 -6 -216 -319 232 -111
757 -111 -81 589 -15 -31 326 30 -305 -171 -542 -114 -389 -283 313 -162 -441 677 184 -11 581 220 414
778 414 -137 -304 207 -252 -348 78 -245 -434 253 -116 -203 225 -353 -135 -29 -224 212 -124 -451 349 252
799 252 -21 511 147 112 280 -151 -23 -13 -243 12 -386 -653 350 -443 -478 482 2 133 -3 208 133
820 133 116 -12 155 -190 -347 357 -285 50 327 -202 136 259 -325 127 -86 -209 193 -219 -244 319 -28
841 -28 31 100 102 283 304 -84 290 289 -39 19 -185 -224 159 -505 -323 191 -68 -109 156 223 433 454 -157 172 -227
866 -227 -128 -11 44 43 296 -94 -65 148 -7 138 -392 -369 48 -384 -426 -149 -91 -393 -51 116 320 258 -278
889 -278 214 24 185 168 -263 -264 -89 -137 -233 -262 5 -77 98 -412 278 80 -436 72 111 90 139 202 -32 426
913 426 392 404 -153 -1 121 -158 -320 413 -232 -661 -1 -79 127 -512 -243 192 11 -209 679 137 -628
934 -628 435 -62 -159 -114 -63 -102 -342 -298 125 -25 -589 0 132 -338 122 178 -575 -7 -96 102 -206 -285 428
957 428 -75 -150 627 -140 -503 4 258 -54 -413 -44 11 -279 -129 664 -53 -540 332 400 -612 144 299
978 299 -297 -133 233 543 -647 -182 467 -104 -146 368 151 -623 -17 66 -69 -302 14 93 -354 -327 348
999 348 117 -242 439 269 -401 -47 242 -28 -91 120 341 -98 -429 55 24 -631 245 382 -418 -167 477
1020 477 357 -387 348 362 -149 -324 878 295 -461 175 526 65 -39 78 -217 -309 -99 178 -447 -383 89
1041 89 -9 3 429 500 -193 14 172 530 294 -149 250 128 -343 297 211 -546 -341 104 -404 -171 231 -25
1063 -25 -199 -290 545 176 -275 409 272 -84 247 -84 -86 -350 -114 44 -328 -378 365 -104 -302 -55 340 -472
1085 -472 59 208 115 11 -52 78 174 -278 412 224 -117 161 52 -264 -188 154 139 -191 -352 387 -130 -344
1107 -344 384 387 -99 449 384 -137 -117 128 -144 -218 177 296 -46 -224 124 -126 -83 89 187 8 -267 -71
1129 -71 337 -253 -137 83 9 -277 36 99 -74 17 216 -96 -402 39 98 30 -428 376 51 -227 33 -125
1151 -125 -382 -80 102 86 -84 93 76 134 190 464 138 30 167 -65 -36 207 261 -117 -295 -68 -7 149
1173 149 -6 -122 64 29 -37 123 47 134 -73 -35 -126 -85 338 47 -245 -50 -106 -526 -21 174 -231 -82 -2
1196 -2 -310 93 -208 133 329 -139 -2 228 87 282 -221 21 419 89 -282 127 -201 -235 67 -398 -182
1217 -182 -144 -171 -103 47 163 -60 6 243 55 56 102 231 -234 88 -210 -145 -219 47 133 -190 -34 32 90 -340
1241 -340 60 16 39 104 142 -28 233 -29 -238 31 -10 -69 -6 49 22 211 -111 -29 -83 -165 -70 258 -278 75
1265 75 61 -100 187 -313 -155 -170 -326 21 9 -191 225 -207 -282 -156 214 51 146 153 96 151 -73 109 32 40
1289 40 -62 -16 144 15 -213 77 54 -204 238 -48 -320 -157 -130 -55 95 -412 -46 108 -277 273 -48 -213
1311 -213 388 74 -1 285 65 37 170 119 -29 -50 -312 201 80 -107 19 -102 -104 219 -304 -172 -101 119
1333 119 -81 -4 104 -276 263 -165 48 163 -126 86 -85 -34 42 -279 109 -172 -369 100 78 -73 20 72
1355 72 270 -103 180 165 -107 -31 -89 64 69 -46 10 8 224 -110 38 165 36 -127 -48 -147 31 172 -235 335
1379 335 260 174 132 371 -111 136 23 -20 135 -133 139 321 -131 -214 2 -55 32 -157 -187 60 -8 -125 184
1402 184 155 169 -28 18 300 -23 82 275 -248 -77 -44 16 173 -110 -431 -91 -131 -190 -228 -96 35 89 -34
1425 -34 -142 89 -212 91 87 -8 -22 -141 76 -195 212 -37 128 0 -116 -175 -198 58 29 -11 79 98 -126 -168
1449 -168 143 288 -91 -72 198 -336 146 293 89 9 58 433 -83 -239 6 -152 -89 142 -33 -41 -202 -148
1471 -148 92 -39 57 -181 178 32 317 -53 -8 -57 166 -210 -55 -25 131 -419 -27 -45 -325 174 53 83
1493 83 77 24 56 -125 -310 50 192 -131 37 212 42 -193 -5 -382 -192 -210 105 -55 -68 -193 13 -132
1515 -132 -80 -24 -15 19 -50 -13 96 71 29 -333 -173 -282 184 186 -76 -15 98 -52 126 57 197 -193 -207 86 -280
1540 -280 -88 109 90 -14 228 50 -169 -61 82 86 -162 -86 -136 -151 -127 -7 76 -21 126 -16 -253 120 -228
1563 -228 80 -80 -58 121 -211 75 -323 17 -258 120 224 -172 -310 -22 -101 40 -26 127 31 15 54 -73
1585 -73 -266 43 -52 241 8 118 -63 -77 252 -110 38 -170 -48 -27 87 -243 -114 3 -164 -39 -176
1606 -176 -90 -76 131 174 -286 113 77 8 -206 -69 127 -106 308 -44 -184 -207 -19 -101 -357 -51 -13 -64 -71 97
1630 97 -40 -38 -16 172 -114 -29 -108 -52 -156 -318 -101 84 83 21 -145 -99 328 33 -158 89 -85 -150 88 -33
1654 -33 -129 100 41 -31 81 5 -107 94 -191 5 56 54 48 -108 -101 37 -358 -5 45 35 -8 99 -111 281 87
1679 87 220 -37 -23 70 -76 110 -327 133 -215 -90 -186 -212 -170 107 42 252 502 9 63 228 -164 -18 218
1702 218 -86 -151 -238 220 -164 -352 -47 -112 195 -10 -54 -182 330 42 75 122 32 53 -216 -122 232 121 16
1725 16 -261 238 68 99 -201 132 -27 -80 -41 56 -19 32 -5 -88 -172 -137 124 181 -82 -92 -230 1 4 79 -124
1750 -124 326 197 79 31 147 78 -22 21 -93 -198 -25 133 -292 19 -175 151 30 -124 -361 81 -127
1771 -127 -111 205 -111 22 24 -98 -163 -61 -210 -263 -70 290 186 -137 210 175 -6 219 -109 133 266 -6
1793 -6 7 -80 29 53 8 -46 -75 -105 118 -111 138 -403 230 -115 25 60 -121 -146 79 -217 81 -66 -48 177
1817 177 -108 258 84 -108 -141 -37 171 -87 -130 15 22 89 -19 348 79 299 -163 59 -6 262 -115 40
1839 40 95 -10 -441 139 -155 48 158 -96 -120 -76 -86 -52 -33 -31 110 57 -114 151 -175 -25 189 9 153
1862 153 36 47 -52 -151 -245 2 3 -34 107 -5 250 203 -333 102 90 11 -260 86 81 41 -33 -246 -29 86 -128
1887 -128 -87 -124 -164 -53 -64 -272 14 -97 64 203 -161 309 -212 -5 87 60 110 -2 -73 -109 -102 250 -75 65
1911 65 35 261 -78 97 31 91 -77 191 -10 -263 -47 -317 46 -153 -123 -82 -330 -55 -38 -219 -34 59 -227
1934 -227 -143 -198 36 310 -286 237 21 -162 -101 -169 -132 249 184 -14 -222 -85 -235 47 158 202 367 -63
1956 -63 -78 -28 142 113 -20 -8 -118 -348 44 68 127 26 -161 -322 107 12 -166 3 104 78 -338 -67 65
1979 65 31 -4 -60 30 96 -118 96 3 -130 -139 62 -64 347 -153 -51 -154 30 84 -354 -245 127 -154 192
2002 192 -125 -276 171 -92 133 -39 -214 6 -178 227 -2 308 98 89 261 -97 39 -56 -142 94 -92
2023 -92 -3 -42 -238 96 83 68 83 37 -99 -18 -89 124 -30 30 16 256 219 38 89 302 197 61 -277 133
2047 133 57 -42 -159 -122 -52 -7 -107 -39 -183 123 -42 -16 465 -381 -160 -145 -180 78 39 103 295 175 95 -14
2071 -14 -70 63 -81 -161 28 -58 140 77 87 99 224 -223 -8 -76 92 -157 -186 240 -96 -21 -121 105 -166
2094 -166 13 -144 92 -32 -151 64 224 43 99 54 170 -22 -333 75 116 48 -99 -45 -81 7 60 53 -62
2117 -62 -90 98 130 72 -118 -51 -238 58 117 -224 54 50 -3 88 -129 -73 31 -80 -229 84 115 -166 -144 151
2141 151 3 -17 66 21 169 -197 73 -384 92 224 23 199 -3 48 215 49 134 -121 70 -91 -49 -55 345
2164 345 145 142 -82 -129 -63 206 10 -17 -58 -107 145 309 -60 151 122 54 175 -308 -95 57 14 313 15
2187 15 48 168 100 9 1 -38 136 -17 -125 -343 -71 4 -43 -87 34 68 114 185 -288 -69 81 -121 165 46
2211 46 -134 -222 58 -61 224 -42 157 70 -16 -21 11 12 62 81 152 169 48 -140 -166 -53 -158 164 -15 -53 -123
2236 -123 -2 -155 63 -4 120 -39 -182 77 -16 225 115 69 -26 26 -246 196 213 13 46 237 117 162 -30
2259 -30 -7 93 -69 -209 -173 -333 -182 95 107 118 186 63 -220 231 -226 3 76 -67 51 -117 -30 136 190
2282 190 175 235 -21 140 -81 201 12 218 142 -57 15 -31 -140 -118 -98 -305 -203 -143 127 -64 153 -36 -307
2305 -307 -61 182 283 65 -89 108 77 90 80 -79 -95 -211 -209 -27 -128 76 -21 189 30 -112 -201 -130 134
2328 134 201 -248 -91 186 184 172 245 -162 21 51 -112 -21 1 151 67 -83 66 321 -274 9 -139 55 51 -29
2352 -29 112 256 -118 -83 -190 -105 -88 -108 -95 58 -40 -151 -205 -46 74 -5 -192 116 227 -353 38 -153 -78
2375 -78 94 86 -51 110 -198 229 24 98 -154 76 206 153 99 -132 16 63 -2 -117 1 -130 -34 22 -247
2398 -247 -183 -202 -35 11 43 392 -25 -197 92 133 -132 -106 -138 15 -132 -17 37 -43 -41 -67 63 142 -73 74
2422 74 -171 90 136 -42 301 114 347 87 91 -116 14 179 67 -38 -263 62 -30 -138 16 114 -56 78
2444 78 53 75 -135 71 -119 -102 -49 -124 -47 -24 114 123 -237 253 36 43 300 -225 -110 -2 129 -13 125 2
2468 2 -63 208 -215 124 186 -43 -365 -129 109 -21 -91 149 -48 34 -18 1 26 -85 -102 -166 -195 -5 0 14 -64
2493 -64 -89 62 186 252 -228 1 102 195 70 -26 120 102 2 -146 -172 -125 -222 -6 11 54 191 -74 -55 -167
2517 -167 275 134 -53 -69 53 89 -99 -41 -242 -17 -14 -11 -179 81 10 97 77 -123 209 65 123 -73 52 -27
2541 -27 -46 48 -160 161 -172 74 -42 -88 -127 134 10 26 -188 -68 30 -130 -224 -5 -48 3 8 23 -138 -138 213
2566 213 -136 75 -238 -12 -141 222 50 81 -90 130 41 -182 -60 -333 140 -233 -39 252 131 185 -131
2587 -131 326 168 42 -59 17 -90 96 21 163 -54 -263 -89 141 191 150 125 -76 -39 -153 -94 141 306
2609 306 -213 -345 35 -83 -398 -128 73 -160 336 108 233 83 -15 53 -421 -151 198 77 43 -150 -36
2630 -36 182 -110 33 56 -32 125 10 125 2 317 241 -178 295 123 -79 150 34 -43 99 -25 191 -30
2652 -30 28 -180 -282 -30 12 -88 -219 -130 73 122 69 59 -296 80 73 -23 -117 2 162 -107 -2 80 -5 232
2676 232 175 -145 170 181 31 -38 67 -33 40 102 -50 -120 88 12 131 -118 -227 104 78 264 53 -102 109
2699 109 -172 125 -220 -61 -32 -26 125 -246 -97 37 -122 153 -52 70 81 -171 -83 -222 -44 37 -133 34
2721 34 177 5 -46 -89 176 -52 -74 -30 -54 31 93 45 -190 151 -71 75 178 -323 201 -68 -206 -92 -292
2744 -292 184 -136 173 135 111 -167 -30 185 -442 -119 -87 50 163 -75 -23 -20 -87 -24 102 29 -79 13 163
2767 163 -142 -536 -67 -428 -46 -161 3 -3 -36 312 -122 154 -207 160 141 -30 155 -180 -152 -169 6 -4
2789 -4 -35 -149 110 -118 -130 154 -42 -115 216 -142 15 -59 -59 95 254 -34 129 -228 91 -78 90 -177 35
2812 35 -107 207 86 -81 -25 -343 -35 51 -161 148 55 -132 11 -99 270 331 158 63 271 127 -241 132
2834 132 28 -102 211 -29 26 -42 -159 13 152 268 -67 -62 -300 126 14 17 43 -7 -142 -86 26 -243 -139
2857 -139 19 94 104 -104 -116 164 -44 84 85 263 -8 196 -133 -102 -103 -219 -162 274 -6 49 -403 37 -5 46
2881 46 52 -261 1 66 -145 -192 149 58 -74 69 56 150 -42 -116 145 -45 134 -490 72 87 -283 -38 75
2904 75 -319 -94 -101 -17 -388 -92 -36 91 146 -103 37 234 -57 82 172 7 16 -27 41 -86 258 108 101 61 128
2929 128 95 217 -78 206 76 45 -21 -1 55 93 -239 -32 66 -56 -147 186 79 -32 41 64 71 -328 257 -209
2953 -209 51 -19 237 140 -160 -2 -112 90 162 -360 6 15 -184 89 92 -146 184 59 -79 -281 106 285
2975 285 23 -77 334 -176 39 -79 80 -9 93 -98 -20 7 114 -177 136 -121 -145 161 -38 30 21 125
2997 125 148 44 -261 -110 -23 -20 126 -102 -96 259 -38 47 -143 -67 85 181 33 -192 24 89 51 -27 -44 -183
3021 -183 197 -206 -115 291 0 110 6 -149 -204 -90 -20 -132 -96 71 128 -136 -33 -100 78 156 -65 -53 -13
3044 -13 99 30 -166 204 358 193 -124 -92 111 -46 126 -98 81 -18 145 156 85 -79 -7 -161 -177 4 -169
3067 -169 372 75 -275 261 -204 100 -124 -56 -134 -87 -247 170 -121 -7 24 -260 -58 60 10 174 -141 -257
3089 -257 -111 58 166 44 298 129 -38 -44 -38 127 145 21 62 -60 189 -15 19 -37 -21 216 -183 -136 172
3112 172 -50 58 257 -252 -200 33 -87 102 211 -244 101 270 -118 116 420 11 3 119 -67 110 184
3133 184 103 -127 114 11 -230 -329 85 57 -112 -23 109 -134 -113 -174 -148 61 -6 -163 -201 -43 -289 115 -118
3156 -118 -97 11 -150 -27 204 -141 -63 63 -202 -70 -31 -82 104 17 -184 148 51 -122 79 162 -55 -230
3178 -230 143 131 78 65 -279 -112 89 111 -13 -117 107 113 -356 59 13 80 -156 134 69 2 5 -286 111 -275
3202 -275 -142 195 -171 -242 -35 -191 -14 -25 -135 123 101 -124 -20 118 -86 -126 -7 156 -58 -49 203 150
3224 150 -260 162 -331 82 -18 -274 6 171 49 -52 -17 180 -20 -208 -249 191 -16 -185 -33 176 101
3245 101 -100 -51 76 96 -239 -57 -58 22 58 -53 -207 -33 131 50 105 -160 -234 38 -380 174 181 -324 -120 37
3269 37 -338 -172 157 -222 56 54 126 -438 55 18 -21 165 -99 112 -354 8 -268 -284 -124 36 71 -6 13
3292 13 98 60 -81 -93 94 245 155 -149 -141 -27 -50 14 -94 201 228 -75 35 56 -138 272 -164 30 209 -24
3316 -24 37 -75 -20 -3 28 -56 375 -36 -114 65 -264 89 -199 160 181 -64 -42 -59 -152 103 14 167 -137 -9
3340 -9 112 -86 71 239 237 13 81 89 69 -72 -141 -104 79 -43 179 24 69 -258 -229 106 -39 84 -50 -157
3364 -157 -131 171 121 -213 67 -196 91 -206 -286 -271 -160 147 -166 137 -244 -109 114 -45 114 3 21 -86
3386 -86 -310 69 -142 -276 12 92 -71 -107 32 -44 94 -95 187 -61 162 -136 143 33 2 72 -70 -3
3408 -3 34 -51 -95 -30 19 186 185 10 57 361 34 68 -137 119 146 -26 257 -318 -305 -9 147 -110 166 49
3432 49 -220 -99 -45 -26 108 168 99 298 -257 251 31 -50 -174 74 293 54 -74 45 3 119 -58 84
3454 84 -31 -136 -231 -7 -27 199 132 -89 -136 219 -51 34 35 105 -66 171 149 -59 31 -64 -154 -74 68 -93 -136
3479 -136 100 22 40 178 44 -79 -14 25 40 18 -237 -136 -13 43 -223 35 263 -196 3 -69 -9 65 -137
3502 -137 -69 118 -233 115 16 182 -129 46 114 -206 -76 35 -222 -180 68 117 11 -118 -125 -205 49 -152 223
3525 223 -49 31 117 -28 -223 -125 -146 3 18 280 24 -17 -294 -203 -19 -52 65 35 157 -382 -236 118 -144
3548 -144 -245 122 -97 65 151 -101 -61 253 -71 193 116 -33 -106 77 329 111 188 14 -163 -122 10 -14
3570 -14 253 73 -16 -161 39 -82 18 -16 -107 49 34 96 -87 -15 154 127 -180 -90 16 45 -5 -83 134 -101
3594 -101 -204 91 -120 0 -7 201 -3 61 27 -258 61 183 117 138 24 -164 99 261 75 -165 42 -161
3616 -161 -288 -127 10 65 -181 59 -152 -72 -250 110 -74 -87 -10 -30 -100 153 -99 -14 -99 7 -261 -144 175
3639 175 -247 66 -72 12 40 83 -184 70 12 62 -12 -42 77 -40 194 -68 112 51 -73 -64 80 94 17 178
3663 178 105 -130 -98 126 39 -99 1 -253 247 -178 -102 110 -84 -134 118 65 126 -68 -153 84 -109 -173 62
3686 62 292 272 -95 -100 -129 -60 136 314 29 -70 90 -117 124 -47 -11 -74 -19 -41 -32 -185 -220 12 -125 -20 -28
3711 -28 -116 26 -157 -84 -54 114 220 134 92 -298 -144 56 -41 -177 44 -6 -112 -37 -294 -228 27 23 174 114
3735 114 -89 -79 158 56 -66 54 -37 -81 -193 -47 -233 -249 -250 18 -173 142 32 -52 116 -123 129 17
3757 17 157 194 409 -46 -344 25 315 183 -325 -4 5 164 255 -173 180 47 -25 45 -91 -19 148 152 265
3780 265 36 86 9 30 -92 -3 -39 122 -208 -56 -113 -64 -141 58 147 -107 -48 -233 -17 -151 49 142 341 11
3804 11 12 155 -125 -40 17 -50 327 -320 289 -71 -81 -302 20 130 39 10 3 81 -18 12 -312 101 -129 -36 -4
3829 -4 34 77 -277 45 -241 -41 -213 15 -82 -84 -66 -17 -98 -69 59 35 -82 -174 196 -186 -106 -10 -39 -10 59 3
3855 3 -75 188 -98 -193 -78 -61 -137 -243 -85 285 -22 -512 54 -249 -26 -140 1 150 119 -191 207 68
3877 68 -40 -156 65 -8 -146 75 -202 185 -168 192 100 -229 180 -44 -4 -28 77 29 -270 -190 -154 15 122
3900 122 60 -8 128 49 1 -35 171 66 -44 29 -36 385 -108 -57 108 -343 20 -31 -41 193 51 5 -60 2
3924 2 -70 93 81 -120 -59 148 -65 -95 162 272 165 147 90 23 -69 -48 -80 86 -20 -201 -269 100 -184 42
3948 42 8 -18 24 25 -69 -82 21 5 143 -62 -125 56 -135 -64 -97 -73 -258 -205 -34 266 -78 -31 -48 198 72
3973 72 -3 58 122 45 -124 282 92 -204 -134 26 -304 65 79 -114 114 23 -4 177 -150 -73 75 100 36 -69
3997 -69 18 -18 -83 -7 -148 -12 -155 -1 39 -79 243 -38 -58 113 -100 -14 -164 -55 -73 -195 -199 127 -52 48
4021 48 -75 88 27 54 129 -11 34 -122 119 -16 -239 -7 12 -187 -67 93 -336 -55 -116 -42 51 -107 61
4044 61 -215 29 -181 -121 213 220 81 -75 28 -191 27 -171 -208 -97 -171 132 -235 -105 206 161 264 -34
4066 -34 -76 -196 30 -65 189 412 213 -110 -136 195 -197 57 108 110 -258 9 91 -84 -184 -195 -131 77 -15 -235
4090 -235 -94 5 -95 179 78 -25 124 100 -126 70 101 -3 130 -44 -73 116 -7 81 -300 -99 -76 108
4112 108 -65 -23 6 29 -153 32 -170 188 -102 235 -212 184 100 -144 38 -89 87 -54 146 95 144 196
4134 196 106 -84 138 -246 -168 -103 -25 51 18 -149 -15 263 -169 93 -354 -31 161 45 80 157 -201 191 51
4157 51 -49 136 -39 -90 298 -159 -299 36 113 66 -52 -39 217 172 109 329 261 88 -109 -45 -134 -32 -154
4180 -154 183 69 238 35 -327 -54 -44 -75 -199 -64 -109 -49 -40 117 211 -75 -201 65 294 362 144 -159 31
4203 31 -61 27 -88 111 197 79 -38 14 283 -86 188 -222 5 162 137 -301 -119 151 142 -70 2 -251 -22
4226 -22 73 -40 9 7 54 21 -43 -64 310 -16 124 -129 -52 -29 146 222 70 -207 -50 148 -129 -125 239 27 12
4251 12 177 -207 -64 16 69 171 -14 96 -211 -246 -62 -152 61 32 49 0 239 -132 -4 -266 94 -15 1
4274 1 13 54 -165 199 171 -34 53 -40 -31 -74 -82 60 28 145 -107 -64 102 -76 75 -49 180 79 -267 209 -65
4299 -65 85 -60 297 -133 199 -123 -130 14 111 -123 116 33 57 -35 -33 -51 60 79 -258 -43 206 -219 135 -194
4323 -194 0 -80 34 56 -30 -173 135 16 -136 326 118 121 210 -113 -208 -33 152 174 -45 6 -254 217 -231
4346 -231 165 -45 -14 144 231 -2 58 119 27 -45 163 -49 94 146 -60 -285 -4 14 170 223 -242 147 160
4369 160 -76 -173 88 81 65 -236 -66 209 243 -329 -77 -195 41 -40 56 -69 142 56 -12 -150 266 176 105 25
4393 25 -42 122 -160 92 23 125 -91 -166 -33 -147 289 87 -137 150 187 -22 4 -109 30 -13 -10 -149 -112
4416 -112 118 -82 97 -167 91 64 84 -83 -58 -196 -216 67 40 -72 -185 6 -189 136 17 166 -36 201
4438 201 -24 132 163 43 -70 83 -114 -108 99 -120 126 139 65 130 215 40 347 -32 -111 -52 176 -40 -104
4461 -104 -66 93 157 -157 97 36 -63 -93 -202 44 0 -188 -184 174 -135 -327 -182 133 183 -103 295 -98 -154
4484 -154 -134 -52 102 -114 -17 109 -412 -24 164 212 169 172 -76 31 123 -47 55 -132 -85 -149 -196 -220 -192 -194 98
4509 98 -121 -8 74 115 43 -60 -174 98 35 -8 -34 174 -89 77 -1 -27 99 -147 -28 -121 215 -132 -238
4532 -238 117 44 -53 -121 43 -35 -79 -45 -23 -131 162 89 94 -38 -96 -201 -222 180 56 178 -27 -67 120 39 125
4557 125 -22 -125 105 -66 -367 194 144 153 116 137 -260 56 57 -151 -50 -18 -110 -138 -12 -13 141 70 -48 -39 -168
4582 -168 3 -20 3 165 -47 -35 -19 73 -127 -174 13 -260 74 -17 -310 -231 68 -131 24 113 -198 134 -131
4605 -131 -41 -224 -9 103 189 37 -172 -63 -257 167 174 25 83 177 -52 60 -241 100 173 39 -36 -22 435
4628 435 -106 254 223 -138 136 8 106 -87 -126 -178 -129 106 189 17 130 -1 -64 106 -57 65 -124 -46 -245
4651 -245 -213 -48 202 -152 124 -31 -10 36 38 173 -204 -74 52 184 -75 -103 1 14 -142 80 130 -40 -118
4674 -118 374 51 87 15 -39 -43 -92 91 9 -45 -199 1 34 -52 166 16 -188 -483 317 30 44 -102 -292 26
4698 26 -28 -177 -112 -156 115 30 -187 137 -184 -99 -27 82 64 -73 -35 7 41 -426 49 -66 114 -38 54 -5
4722 -5 -19 -216 -12 5 -25 -221 91 194 -45 -29 -124 -166 -66 22 188 62 364 -137 -59 -36 50 -41 175 282
4746 282 82 -334 -110 94 -10 -11 -81 -66 218 71 74 -121 108 122 -58 138 -49 -109 -191 -122 102 -163 -12
4769 -12 -139 -194 -82 54 4 161 -101 -346 147 -13 71 -191 94 -200 -6 -205 -312 -163 -328 -113 -142 -157
4791 -157 107 -197 -2 34 -129 177 -105 -153 195 160 -44 28 209 210 30 134 116 -284 -237 5 -79 14 -150
4814 -150 43 5 31 -23 292 -6 228 160 114 -149 105 87 -274 -53 -167 62 70 -128 -48 11 58 -138 57 43
4838 43 -232 -112 -82 -267 -23 208 -114 -108 179 -66 -76 -6 -146 58 -31 19 170 198 98 143 121 195 -76 17
4862 17 -3 -51 -80 77 -28 27 -28 -182 47 -171 67 184 231 53 -117 42 -136 9 123 -1 12 -15 24
4885 24 152 150 -60 -17 -118 94 -48 -194 156 -31 285 12 -34 -147 -250 -153 311 -218 -231 -174 110 -151 18
4908 18 -21 215 22 61 -81 86 -70 284 -12 69 -131 40 -24 273 -6 -244 24 -77 -218 -71 281 56
4930 56 -118 -82 183 116 299 97 -81 -45 27 -138 -91 55 -48 16 37 54 75 -64 -382 -284 -72 -20 100 14
4954 14 -61 -221 -161 -99 141 88 2 171 382 84 154 -228 -188 1 185 -1 -71 -11 379 -12 -178 -16 -86 129
4978 129 183 -120 -195 -6 147 33 -59 140 -64 210 -22 105 -6 10 182 96 188 14 -128 -143 -126 332 149
5001 149 5 193 -1 -99 162 -47 222 -123 -327 -2 5 180 2 43 44 -239 -96 102 -119 -90 -103 -188 -50
5024 -50 -306 -66 -42 -11 153 -21 385 -75 -71 295 -63 129 53 -201 134 157 -70 206 12 -16 143 -195 50
5047 50 27 -32 -467 -110 100 235 -123 -175 57 124 165 95 76 172 327 148 69 -70 -140 -208 -151 -220 -338 -211 -77
5072 -77 131 -300 128 58 -201 214 -205 -90 271 -16 -283 97 -378 -52 -8 222 -278 242 -228 -145 -71 140
5094 140 -63 211 205 187 -49 69 274 -212 -215 -102 76 124 126 99 235 223 34 161 -156 -44 -264 39 23 -93
5118 -93 118 -71 26 126 97 201 -37 -45 -167 152 52 3 188 -214 -116 -230 -158 34 328 35 34 19 -64 87
5142 87 -226 -170 226 -44 17 188 -198 -83 -131 -261 238 -159 34 -343 -229 -214 -9 81 396 265 -173 -88
5164 -88 77 -13 -57 -129 108 75 3 -51 -91 -325 -7 13 -26 -95 179 -135 -49 6 4 260 -8 -126 -174 -25 133
5189 133 276 -147 172 -126 145 -52 -56 112 185 191 76 46 -175 -247 57 51 -147 -39 110 109 -103 -288 163 -164
5213 -164 -111 137 -24 -25 85 104 77 28 19 121 -275 -313 158 -120 -297 212 248 121 46 -48 -229 227 -56 152
5237 152 -140 -113 31 223 148 280 89 -295 295 82 183 -328 87 247 26 -253 -37 31 37 -19 208 64
5259 64 -41 -3 63 -200 59 86 -211 -151 40 104 -30 -49 119 52 -53 -6 174 147 -347 31 -28 149 227 -225
5283 -225 -60 1 -221 200 -191 123 -162 -13 65 87 -127 121 -165 34 -298 -35 -154 43 134 14 -16 -121
5305 -121 -187 89 -61 83 365 -160 -34 73 -13 -50 -270 -292 243 -115 15 -111 -4 73 -162 -101 297 -14
5327 -14 -139 117 111 -176 142 -113 346 -309 -83 -260 -16 -163 92 80 -237 -35 59 80 29 194 -74 -194
5349 -194 -97 155 0 -33 1 -108 473 -103 -27 130 95 245 -206 -121 146 19 77 -31 81 -308 -121 -265
5371 -265 25 -198 77 131 85 -100 -175 -387 53 132 -68 15 -225 -249 41 154 -87 -36 -135 -236 -150 78 266
5394 266 58 109 -27 -171 -11 -223 -381 -31 -113 -320 -83 37 176 -394 -118 202 -52 -25 69 -170 -64
5415 -64 -11 389 -333 -22 -97 289 75 235 276 184 -207 -78 132 65 -89 -260 137 33 -204 -56 204 -54
5437 -54 197 95 34 185 55 74 -129 23 26 -44 44 18 -284 -77 -86 -166 -33 110 154 200 -120 -280 -279 59 5
5462 5 -113 -84 -176 -156 178 -61 5 -59 38 346 -187 -243 -185 54 76 20 -27 105 -147 227 -18 -318 144 -190
5486 -190 91 219 65 108 -154 -317 30 37 37 -116 164 -225 -13 133 18 -48 -68 -44 -84 -18 3 199 17 -118
5510 -118 -114 -20 128 -1 69 106 46 -24 -52 341 -149 12 -114 174 -18 -3 -5 -16 129 186 -70 -14 98 24 -89
5535 -89 -20 -74 161 2 159 23 35 -6 72 114 -118 -188 -124 125 24 98 -117 169 -131 -170 174 -54 -27 -71
5559 -71 -99 16 -92 -46 -35 -49 -86 88 -170 179 -114 123 65 -38 201 42 -64 -74 -75 74 93 -89 116 249
5583 249 -237 -36 -68 -151 -65 -142 288 -241 -77 -170 -41 54 -233 12 -38 109 -48 -31 -17 -13 -68 -141 138 -68
5607 -68 234 137 -50 -95 -103 -93 185 -186 191 -140 -332 -84 -25 24 127 88 -43 9 -18 -6 167 -189 -8 152
5631 152 -265 140 -313 61 -309 -54 191 60 254 -252 110 145 133 80 -129 -9 -69 -254 82 -21 -197
5652 -197 58 67 -69 105 -2 143 -84 45 -100 -247 -13 37 -79 -133 83 63 -140 25 -111 211 -16 -47
5674 -47 173 -158 -27 109 -34 -279 158 -241 -113 -106 -6 41 62 27 39 288 -74 12 81 267 165 -249 147
5697 147 45 -42 -296 -51 -178 3 -67 -50 -228 378 69 274 140 81 -76 -200 84 99 8 -256 -8 -94
5719 -94 1 135 256 19 95 -224 -124 252 152 -170 249 -285 -43 -132 -4 -23 5 -115 -233 -66 29 -48 77
5742 77 -55 -142 104 366 -167 -105 15 41 181 172 28 255 87 -10 22 34 51 67 65 -81 187 3 -126 -40 -12
5767 -12 -109 -157 -126 -147 -51 198 -101 -148 212 154 176 285 156 -21 185 -23 258 -24 93 27 -155 238 18
5790 18 163 -104 -45 -80 -7 98 -43 -320 84 51 169 296 288 -130 -144 -196 168 76 -50 156 20 -9 -8 137
5814 137 -223 -189 282 72 25 69 -231 174 125 22 23 -44 -47 -68 -55 144 -173 -48 50 190 -73 22 96 279 -195
5839 -195 -10 -42 17 85 -38 -133 140 -248 -64 156 87 266 -40 -215 295 238 -49 113 9 139 -90 -206
5861 -206 -189 100 79 13 10 135 505 213 48 193 159 -82 52 -34 -1 -56 -70 -205 -96 99 66 121 -67 47
5885 47 -58 113 -61 -115 -131 -39 -123 109 -141 65 16 45 -129 40 57 76 121 83 205 -268 -34 -115 107 -19
5909 -19 106 153 -41 9 -55 -67 -16 27 140 -121 66 -96 94 -157 -150 -22 29 -36 187 101 -76 -184 12 192
5933 192 -129 -134 247 155 225 -45 152 30 -179 235 -5 22 113 157 126 -109 -185 202 77 -37 -135 -100 163 172
5957 172 -106 -25 -57 38 159 93 91 -208 -73 176 -82 -230 -277 -150 -1 37 -152 -48 30 -34 149 4 159
5980 159 -175 96 34 -122 -72 -48 -100 32 -11 79 -28 149 81 -97 72 -257 -82 -182 -160 62 4 -20 6 -134
6004 -134 109 -33 -400 -101 -156 4 30 -22 -71 -48 -116 -73 239 114 73 26 262 94 112 -193 125 -17 -459
6027 -459 32 56 -39 78 55 -35 24 -42 61 -69 -203 134 -76 81 16 -17 69 160 59 -236 33 -79 -11 -51
6051 -51 8 185 -53 182 80 -11 6 -164 -171 27 4 8 162 -153 -80 -221 50 -164 92 58 6 221 -98 86
6075 86 -238 43 -89 128 159 19 -76 -36 190 -155 24 92 86 -182 -36 44 -171 3 236 -153 -66 -117 150
6098 150 41 174 16 -52 256 105 15 -107 -383 -30 -93 138 -252 124 -17 194 -89 129 -59 109 99
6119 99 -197 -8 -31 -194 -209 -77 38 -53 155 -22 214 -132 -30 -23 -25 -161 -6 3 -12 -114 -17 -54 118 53 -290
6144 -290 42 19 123 107 106 40 7 -69 122 44 -160 168 103 -77 4 -91 131 117 -134 162 -203 90 64 -96
6168 -96 19 -199 41 -66 21 113 285 -83 58 0 47 -75 70 -8 -210 90 -82 64 92 -206 -163 -20 -124
6191 -124 11 -242 166 159 30 -88 62 -14 -36 -84 27 53 -13 148 -65 56 -127 81 -3 -256 -162 -329 -71
6214 -71 21 -170 -94 209 341 13 370 -200 -41 98 84 45 15 22 30 -286 -125 -187 25 72 5 13 -194 -12 19
6239 19 -10 -48 131 46 -164 40 -52 63 62 42 34 -150 190 180 -126 -139 -123 -179 134 -439 78 79 -78 5 67 -324
6265 -324 -4 262 112 158 -96 -103 216 48 22 161 106 -100 57 -173 270 171 -58 -26 -197 29 -260 -155
6287 -155 -111 -63 -271 38 205 263 -32 180 -256 178 286 136 -23 -118 217 -154 -72 -54 114 81 58 23 -113
6310 -113 -263 114 236 117 -154 -61 -107 7 -57 125 101 88 75 70 -199 -60 -212 -162 -77 -90 246 -209 -142 221
6334 221 187 -88 56 -60 123 99 125 -87 -107 84 29 64 229 85 -99 -101 19 -70 31 -294 -94 -29 -253
6357 -253 126 -81 12 -14 -98 -195 -78 140 -210 -47 3 -26 -417 -179 50 -9 46 -7 -319 17 -38 104 7 94
6381 94 11 288 -78 -80 33 60 103 57 -160 -16 -5 -272 -128 102 162 -46 38 -283 -240 31 -151 -42 51 -94
6405 -94 -215 -223 -72 -50 -57 -18 -6 16 117 -152 22 -31 81 -55 147 -8 193 68 -4 -9 204 -75 -6 -139 28
6430 28 -171 190 -124 116 99 -145 180 -205 -130 264 -116 93 331 105 -5 94 -84 8 -25 196 -11 -231
6452 -231 265 88 -49 133 457 -279 -177 65 -70 -106 263 -61 200 29 -79 -120 -10 -42 193 -6 -150
6473 -150 -68 59 -29 -28 -32 137 350 10 -250 216 256 161 -113 -58 -113 81 -121 -77 -22 3 -225 185 116 -116 -6
6498 -6 199 -114 -317 72 28 32 -102 130 -221 5 -270 -67 67 -131 -95 -96 -145 354 -46 206 -58 -132 -107 -103
6522 -103 -26 129 81 -67 64 -158 -66 104 -253 -135 -41 187 -14 140 10 109 -124 -1 -71 31 209 206 156
6545 156 -138 268 -37 78 -29 232 -78 -56 71 -43 117 -36 203 74 -212 166 -49 230 -263 -33
6565 -33 42 -256 -16 -117 166 -69 -96 158 323 218 -74 -82 -4 25 -1 157 -143 79 -74 117 10 158 46
6588 46 24 -3 105 254 113 204 88 42 -31 138 -69 -49 -56 -68 30 85 -306 84 98 -75 136 110 1 33 63
6613 63 108 182 170 40 -29 62 52 37 216 176 193 -233 -140 -241 121 -120 -162 22 -136 -205 120 33 139 -193 -71
6638 -71 -61 194 149 -122 106 42 110 -73 -100 283 -135 149 229 34 258 120 -230 127 128 75 12 11 -127 -118 36
6663 36 150 90 245 -225 7 172 302 -153 51 249 -40 134 -203 -184 -64 164 3 -28 -185 51 232
6684 232 169 -92 -126 20 -61 151 -187 243 -120 -21 -221 261 -138 -51 173 -259 -13 84 91 241 96 84 -76
6707 -76 -93 20 35 281 -86 71 16 -120 229 37 -92 78 47 -149 -197 263 -121 76 -330 83 89 24 111
6730 111 299 -226 -171 -239 119 74 180 -108 -2 138 -171 -155 -27 -82 152 -90 -23 -198 206 -182 10 209
6752 209 -101 61 -9 -265 331 334 40 28 -174 33 8 71 -228 -219 183 140 -112 -65 -16 63 -115 133 37 85 168
6777 168 118 -205 -42 -4 -208 -30 166 23 -48 -27 99 369 173 -41 137 -87 -45 78 -73 -155 35 15
6799 15 -16 143 -218 53 84 61 231 -100 -128 -148 73 -8 118 120 208 243 -54 40 71 21 288 31 -231 -32 261
6824 261 74 102 -551 -250 154 -4 162 103 45 -32 -8 -68 -26 -6 -267 -58 -47 137 -67 39 75 3 -278 -213
6848 -213 95 -43 -105 152 88 44 -10 -107 -143 -183 171 38 102 105 -76 -126 59 95 -44 35 -66 170 -174 -135 -233
6873 -233 182 -45 171 46 206 21 -4 96 105 271 -194 -186 -50 -130 -102 56 22 212 85 37 -220 -176 24
6896 24 -85 175 103 312 -249 38 19 15 82 -186 -133 -147 -117 -14 -41 38 131 -287 -234 101 151 -87 -80 7 64 -141
6922 -141 40 118 279 21 247 62 -131 -26 -2 20 197 119 13 -313 -67 3 -9 236 104 -22 97 2
6944 2 81 65 -265 47 -119 -138 179 -28 103 -9 -217 269 123 -16 -51 -231 -69 -14 97 224 230 208 -134
6967 -134 -151 55 -159 32 -97 -83 216 -33 160 -153 -12 171 192 85 96 -62 -221 -41 169 192 184 232 136
6990 136 -54 212 -216 179 -5 -88 -172 -82 130 -78 -205 -63 89 -162 -36 62 -199 -69 -79 295 -60 41
7012 41 124 11 142 -79 -130 137 -158 23 -240 -108 70 48 -149 -20 103 14 176 -176 -54 67 162 -114
7034 -114 56 -51 -185 0 -203 -63 -269 74 134 -275 -268 -102 -92 118 -61 103 -46 -172 57 -280 142
7055 142 -65 116 22 194 -52 180 111 -111 -296 97 43 84 57 55 -101 -105 -302 -9 -180 -211 -330 -123 -16
7078 -16 -101 -93 -171 149 -25 -107 44 273 116 240 -20 295 -89 9 -27 -292 67 150 14 70 109 10 195 60
7102 60 157 -11 -138 44 -30 -89 15 159 100 -165 88 133 -45 -101 18 -289 -318 -87 167 115 378 -151 169
7125 169 92 324 -148 -99 -236 -132 88 -156 161 43 309 -96 -136 -289 -173 -310 -80 98 -140 26 -2
7146 -2 -195 -124 -187 56 94 35 -197 -240 255 147 7 -127 96 174 -165 129 198 -49 -52 147 133 64 22 169 46
7171 46 73 -100 95 -83 56 129 143 9 -12 223 146 85 125 -44 -219 29 83 7 15 -153 281 63 -120 -22
7195 -22 194 95 99 9 -88 18 -29 -267 -40 125 -102 31 -256 19 -54 -105 121 31 125 -8 31 -16 -120 -61 67
7220 67 94 134 62 -53 194 119 -102 -63 56 101 -326 122 181 -149 125 248 -106 -72 -33 92 214 -71 -190
7243 -190 -93 265 42 29 156 -63 161 -177 -45 -147 168 110 -4 92 -96 147 -66 53 38 102 -108 -37
7265 -37 -165 -28 -99 -104 205 -227 159 82 -136 96 -84 -172 -139 -198 -35 -65 -204 -122 -96 255 -93 71 -21 -319
7289 -319 -22 35 118 -83 -150 -65 -35 224 34 -91 99 -131 78 -24 94 261 115 -107 98 -87 -263 -157
7311 -157 -23 -49 -50 38 -9 -109 62 -104 25 -107 69 80 -155 -141 75 -108 -276 -8 296 27 -5 231 67
7334 67 9 -235 -51 19 -51 -2 89 26 -79 56 -59 121 71 -15 218 76 76 -255 39 -223 -22 76 51 182
7358 182 158 -15 111 301 114 43 -67 18 171 -79 -325 -102 -51 -272 -15 247 51 -25 145 78 -10 179
7380 179 202 81 -47 -231 -211 -26 12 -349 -346 33 -19 141 -218 101 302 -140 11 -201 96 -128 -30 122
7402 122 -154 140 166 -145 1 101 -254 78 -267 -239 222 -36 256 74 -285 -73 414 179 149 -163 -165 107
7424 107 -163 -247 -274 -188 137 -151 -135 44 -49 236 -97 -51 96 -82 -260 94 -77 -136 -80 127 -121 -25 -44
7447 -44 153 208 86 -328 9 -122 100 215 105 102 -30 -34 -28 -108 308 58 -128 -161 205 -214 57 44 -109 -40
7471 -40 -23 88 -183 135 187 -135 171 126 3 143 134 10 -27 -3 236 -283 54 92 6 67 97 -221 183 73
7495 73 -24 -275 -234 122 -80 -90 118 155 4 139 67 184 -28 165 -102 66 31 23 26 118 297 -12 -217 105
7519 105 -70 -170 190 9 200 183 148 -3 -8 -62 -181 32 -68 63 224 -17 -38 37 239 -144 -180 -135 -97
7542 -97 33 36 162 162 161 -251 11 28 262 134 24 116 -153 80 -87 -99 -44 -135 -168 -155 42 -6 190 -140 -32
7567 -32 75 -260 -144 69 -6 -83 -7 -265 -54 -82 75 -89 -391 -114 -73 -219 -62 79 25 -80 -11 -15 101
7590 101 -21 -5 -146 8 126 195 -118 41 234 349 -299 45 165 67 45 -1 198 21 -45 -184 28 -152
7612 -152 -236 52 -101 -254 31 -56 154 -176 -70 56 135 -28 36 186 -81 143 53 69 72 -149 -52 -187 -69
7635 -69 45 206 210 -318 -62 -150 -69 -19 105 72 268 82 -19 -14 115 184 104 132 26 -183 -242 -81 -235 -47
7659 -47 -155 -74 -43 -63 82 26 -63 189 -235 16 -8 -160 -64 -24 64 -75 -17 115 -132 -95 -2 -100 -27 160 111
7684 111 22 -29 199 -114 -56 -101 56 -144 -40 16 -105 37 163 -85 -41 -6 181 -121 -315 -156 -21 -16 -44
7707 -44 8 112 -78 272 -33 111 31 -55 229 -136 18 -122 268 159 -227 16 -102 51 98 -193 -156 207
7729 207 132 -5 -95 -365 -96 -33 -154 97 -258 103 -84 -41 193 -330 57 -46 -147 4 -510 -62 -27 133
7751 133 21 231 329 -27 172 -243 16 -53 242 135 -60 30 20 32 90 34 -67 -38 -81 -30 369 -133 -46 -227
7775 -227 -241 197 -129 79 -19 58 181 -3 136 19 -11 79 -238 58 -3 -80 -287 -143 -74 -40 3 166 87 -72
7799 -72 -122 -46 -83 -65 37 27 206 0 -323 150 -123 -278 -246 36 173 -7 61 74 -128 -61 165 209 -102 101
7823 101 -18 66 167 223 119 -5 -169 145 53 -96 26 -68 -213 -42 -36 -102 5 -95 -48 -81 207 18 306
7846 306 113 -71 112 183 140 197 136 37 210 99 -10 138 199 300 -458 -129 210 -150 -9 21 4 -55 -227
7869 -227 108 -27 -126 133 9 -28 76 -74 -90 37 -55 118 -7 98 -95 -35 -102 -26 -79 -9 103 149 -112
7892 -112 -281 173 88 -171 -123 -111 -104 -20 91 -154 -30 194 -8 39 -70 11 134 119 -50 129 237 -117 197
7915 197 -179 -69 -18 79 -44 -64 -72 79 147 115 -18 -151 -63 497 81 51 105 -135 -88 -113 42 190 75 25
7939 25 96 -170 -68 -16 -64 -29 24 -45 -90 145 35 169 15 -138 -285 124 -56 122 297 162 -58 181 83
7962 83 149 -39 120 168 -31 44 112 127 -24 37 247 -144 -221 50 80 399 296 -205 -48 -45 -296 3 143 -108
7986 -108 -14 296 119 -170 88 142 -195 -14 -105 22 103 -15 -58 87 -187 -25 161 54 146 167 -202 -76
8008 -76 -139 -102 -70 -110 -154 -43 -68 79 21 -10 86 -69 441 250 -97 88 149 -118 150 -184 14 12 2 -31 -140
8033 -140 -60 -16 -156 -116 176 -57 32 -339 9 -137 -77 -25 24 19 -354 39 -44 -98 106 112 161 -124 215 342 -143
8058 -143 153 213 -78 -276 -119 -132 158 114 -199 -262 77 -38 -157 -128 -126 -72 11 15 -94 221 -161 100 -34 -205
8082 -205 -87 -45 204 15 -80 -284 -21 -72 -224 11 -119 156 50 53 -384 -30 37 -117 -348 -102 -85 41
8104 41 154 106 295 66 36 69 -87 157 36 22 -302 -131 98 -262 205 -4 234 -278 -26 37 -102 229
8126 229 -30 58 -282 -413 92 205 -56 147 153 21 -67 -115 67 92 -152 -107 75 -99 -84 -91 219 -7 122
8149 122 128 4 -125 -106 -136 39 -237 84 -79 35 -217 -77 -2 222 54 -106 -138 168 212 -45 11 -231 341
8172 341 -132 76 -7 60 -173 96 10 13 13 -76 -145 60 -18 -197 -37 -130 -131 23 271
8191B71
##END NTUPLES=NMR FID
##END=
