##TITLE=1H_DE-82k2_d6
 200.13MHz,DMSL,
 8 sc
 
 26.6.2025
##JCAMPDX= 6.0         $$ Bruker NMR JCAMP-DX V2.0
##DATA TYPE= NMR FID
##DATA CLASS= NTUPLES
##ORIGIN= UXNMR, Bruker Analytische Messtechnik GmbH
##OWNER= pz
$$ XWIN-NMR		Version 3.5
$$ Thu Jun 26 16:25:05 2025 Russian Standard Time (UT+4h)  she@DPX200
##.OBSERVE FREQUENCY= 200.1313
##.OBSERVE NUCLEUS= ^1H
##.DELAY= (6, 6)
##.ACQUISITION MODE= SIMULTANEOUS
##.ACQUISITION SCHEME= undefined
##.AVERAGES= 8
##.DIGITISER RES= 18
##SPECTROMETER/DATA SYSTEM= spect
##.PULSE SEQUENCE= zg30
##.SOLVENT NAME= DMSO
##.SHIFT REFERENCE= (INTERNAL, DMSO, 0, 14.3821)
##AUDIT TRAIL= $$ (NUMBER, WHEN, WHO, WHERE, WHAT)
$$ ##TITLE= Audit trail, XWIN-NMR		Version 3.5
$$ ##JCAMPDX= 5.01
$$ ##ORIGIN= Bruker BioSpin GmbH
$$ ##OWNER= she
$$ F:/spectra/data/she/nmr/H-C/1/audita.txt
$$ ##AUDIT TRAIL=  $$ (NUMBER, WHEN, WHO, WHERE, WHAT)
(   1,<2025-06-26 16:23:33.32 +0400>,<she>,<DPX200>,
      <created by zg, POWCHK disabled, PULCHK disabled
       configuration hash MD5:
       00 E9 B6 7A A2 85 ED C7 34 08 36 98 17 FE 4E 26
       data hash MD5: 16K
       46 0B B3 8D A2 22 5A D6 E7 FD 1E BE AE F9 1B 25>)
$$ ##END=
$$ 
$$ hash MD5
$$ 7E 67 9D 3F E3 B8 1F 59 F7 24 E9 F2 D3 A8 69 93
##$RELAX= 
##$RELAX= 
##$RELAX= 
##$RELAX= 
##$RELAX= 
##$RELAX= 
$$ Bruker specific parameters
$$ --------------------------
##$DU= <F:/spectra>
##$EXPNO= 1
##$NAME= <H-C>
##$PROCNO= 1
##$TYPE= <nmr>
##$USER= <she>
##$AMP= (0..31)
100 100 100 100 100 100 100 100 100 100 100 100 100 100 100 100 100 100 
100 100 100 100 100 100 100 100 100 100 100 100 100 100 
##$AQSEQ= 0
##$AQ_mod= 1
##$AUNM= <au_zg>
##$AUTOPOS= <>
##$BF1= 200.13
##$BF2= 200.13
##$BF3= 200.13
##$BF4= 200.13
##$BF5= 200.13
##$BF6= 200.13
##$BF7= 200.13
##$BF8= 200.13
##$BYTORDA= 1
##$CFDGTYP= 0
##$CFRGTYP= 5
##$CHEMSTR= <none>
##$CNST= (0..31)
1 1 145 1 1 1 1 1 1 1 1 1 1 1 1 1 1 1 1 1 1 1 1 1 1 1 1 1 1 1 1 1 
##$CPDPRG= <>
##$CPDPRG1= <>
##$CPDPRG2= <>
##$CPDPRG3= <>
##$CPDPRG4= <mlev>
##$CPDPRG5= <mlev>
##$CPDPRG6= <mlev>
##$CPDPRG7= <mlev>
##$CPDPRG8= <mlev>
##$CPDPRGB= <>
##$CPDPRGT= <>
##$D= (0..31)
0 0.7 0 0 0 0 0 0 0 0 0 0.03 0 0 0 0 0 0 0 0 0 0 0 0 0 0 0 0 0 0 0 0 
##$DATE= 1750940612
##$DBL= (0..7)
120 120 120 120 120 120 120 120 
##$DBP= (0..7)
150 150 150 150 150 150 150 150 
##$DBP07= 0
##$DBPNAM0= <>
##$DBPNAM1= <>
##$DBPNAM2= <>
##$DBPNAM3= <>
##$DBPNAM4= <>
##$DBPNAM5= <>
##$DBPNAM6= <>
##$DBPNAM7= <>
##$DBPOAL= (0..7)
0.5 0.5 0.5 0.5 0.5 0.5 0.5 0.5 
##$DBPOFFS= (0..7)
0 0 0 0 0 0 0 0 
##$DE= 6
##$DECBNUC= <off>
##$DECIM= 32
##$DECNUC= <off>
##$DECSTAT= 4
##$DIGMOD= 1
##$DIGTYP= 9
##$DL= (0..7)
0 120 120 120 120 120 120 120 
##$DP= (0..7)
150 150 150 150 150 150 150 150 
##$DP07= 0
##$DPNAME0= <>
##$DPNAME1= <>
##$DPNAME2= <>
##$DPNAME3= <>
##$DPNAME4= <>
##$DPNAME5= <>
##$DPNAME6= <>
##$DPNAME7= <>
##$DPOAL= (0..7)
0.5 0.5 0.5 0.5 0.5 0.5 0.5 0.5 
##$DPOFFS= (0..7)
0 0 0 0 0 0 0 0 
##$DQDMODE= 0
##$DR= 18
##$DS= 0
##$DSLIST= <SSSSSSSSSSSSSSS>
$$ [...]
##$SUBNAM0= <"">
##$SUBNAM1= <"">
##$SUBNAM2= <"">
##$SUBNAM3= <"">
##$SUBNAM4= <"">
##$SUBNAM5= <"">
##$SUBNAM6= <"">
##$SUBNAM7= <"">
##$SUBNAM8= <"">
##$SUBNAM9= <"">
##$SW= 18.0517328524113
##$SWIBOX= (0..15)
0 0 2 0 0 0 0 0 0 0 0 0 0 0 0 0 
##$SW_h= 3612.71676300578
##$TD= 16384
##$TD0= 1
##$TE= 0
##$TE2= 300
##$TE3= 300
##$TEG= 300
##$TL= (0..7)
0 120 120 120 120 120 120 120 
##$TP= (0..7)
150 150 150 150 150 150 150 150 
##$TP07= 0
##$TPNAME0= <>
##$TPNAME1= <>
##$TPNAME2= <>
##$TPNAME3= <>
##$TPNAME4= <>
##$TPNAME5= <>
##$TPNAME6= <>
##$TPNAME7= <>
##$TPOAL= (0..7)
0.5 0.5 0.5 0.5 0.5 0.5 0.5 0.5 
##$TPOFFS= (0..7)
0 0 0 0 0 0 0 0 
##$TUNHIN= 0
##$TUNHOUT= 0
##$TUNXOUT= 0
##$USERA1= <user>
##$USERA2= <user>
##$USERA3= <user>
##$USERA4= <user>
##$USERA5= <user>
##$V9= 5
##$VALIST= <valist>
##$VCLIST= <CCCCCCCCCCCCCCC>
##$VD= 0
##$VDLIST= <DDDDDDDDDDDDDDD>
##$VPLIST= <PPPPPPPPPPPPPPP>
##$VTLIST= <TTTTTTTTTTTTTTT>
##$WBST= 1024
##$WBSW= 4
##$XGAIN= (0..3)
0 0 0 0 
##$XL= 0
##$YL= 0
##$YMAX_a= 55631
##$YMIN_a= -111284
##$ZGOPTNS= <>
##$ZL1= 120
##$ZL2= 120
##$ZL3= 120
##$ZL4= 120
##$ABSF1= 10
##$ABSF2= 0
##$ABSG= 5
##$ABSL= 3
##$ALPHA= 0
##$AQORDER= 0
##$ASSFAC= 0
##$ASSFACI= 0
##$ASSFACX= 0
##$ASSWID= 0
##$AUNMP= <proc_1d>
##$AZFE= 0.1
##$AZFW= 0.1
##$BCFW= 1
##$BC_mod= 2
##$BYTORDP= 1
##$COROFFS= 0
##$CY= -3
##$DATMOD= 1
##$DC= 2
##$DFILT= <>
##$DTYPP= 0
##$F1P= 0
##$F2P= 0
##$FCOR= 0.5
##$FTSIZE= 0
##$FT_mod= 4
##$GAMMA= 1
##$GB= 0.15
##$INTBC= 1
##$INTSCL= 1
##$ISEN= 128
##$LB= 0.25
##$LEV0= 0
##$LPBIN= 0
##$MAXI= 10000
##$MC2= 0
##$MEAN= 0
##$ME_mod= 0
##$MI= 1.114404
##$NCOEF= 0
##$NC_proc= 0
##$NLEV= 6
##$NOISF1= 3.799351
##$NOISF2= 2.8
##$NSP= 1
##$NTH_PI= 0
##$NZP= 0
##$OFFSET= 14.38212
##$PC= 1
##$PHC0= -1183.057
##$PHC1= 2.192196
##$PH_mod= 1
##$PKNL= yes
##$PPARMOD= 0
##$PSCAL= 0
##$PSIGN= 0
##$REVERSE= no
##$SF= 200.129724274929
##$SI= 16384
##$SIGF1= 3
##$SIGF2= 2
##$SINO= 400
##$SIOLD= 16384
##$SREGLST= <1H.CDCl3>
##$SSB= 0
##$STSI= 0
##$STSR= 0
##$SW_p= 3205.1282051282
##$SYMM= 0
##$S_DEV= 0
##$TDeff= 0
##$TDoff= 0
##$TI= <>
##$TILT= no
##$TM1= 0
##$TM2= 0
##$TOPLEV= 0
##$USERP1= <user>
##$USERP2= <user>
##$USERP3= <user>
##$USERP4= <user>
##$USERP5= <user>
##$WDW= 1
##$XDIM= 8192
##$YMAX_p= 0
##$YMIN_p= 0
$$ End of Bruker specific parameters
$$ ---------------------------------
##NTUPLES= NMR FID
##VAR_NAME=  TIME,          FID/REAL,        FID/IMAG
##SYMBOL=    X,             R,               I
##VAR_TYPE=  INDEPENDENT,   DEPENDENT,       DEPENDENT
##VAR_FORM=  AFFN,          ASDF,            ASDF
##VAR_DIM=   8192,          8192,            8192
##UNITS=     SECONDS,       ARBITRARY UNITS, ARBITRARY UNITS
##FACTOR=    0.0002768,     1,               1
##FIRST=     0,             0,               0
##LAST=      2.2672688,     0,               0
##MIN=       0,             -111284,         0
##MAX=       2.2672688,     55631,           0
$$ Real data points
##PAGE= N=1
##DATA TABLE= (X++(R..R)), XYDATA
0@%%%%%%%%%%%%%%%%%nJ3j6J6j6J6j8K6l2L2m0M8n3O1o9P7q6R9j11J24j40J56
$$ 0 0 0 0 0 0 0 0 0 0 0 0 0 0 0 0 0 0 -5 8 -8 8 -8 8 -10 16 -16 16 -24 24 -29 32 -37 40 -46 53 -58 66 -74 82
39H2j75J95k14K38k65K91l22L57l92M32m76N24n77O36p01P75q59R53j064J192
$$ 82 -93 102 -112 126 -139 152 -170 187 -205 227 -249 275 -302 334 -367 408 -451 502 -562 630
59F30j343J523j744K027k399K905l645M840p060J2537n3329o6226J12681N4234
$$ 630 -713 810 -934 1093 -1306 1599 -2046 2794 -4266 8271 -45058 -111284 1397 55631
73E5631l5313r219K0012j6538o22N225k0579r287J7235r908j5000Q419J516r547
$$ 55631 20318 11099 31111 14573 13951 19176 -1403 -10690 6545 -3363 -18363 -9944 -8428 -17975
87a7975P538o84o900J7448J7029j4061n969J5830L904r723l126j213L12L597k746
$$ -17975 -10437 -11121 -18021 -573 16456 2395 -3574 12256 16160 6437 3311 2098 2410 6007 3261
102C261m672K010r30l647L151o87p877J166N480l206R3P741P71l376L331M010
$$ 3261 -1411 599 -331 -3978 -827 -1514 -9391 -8225 -2745 -5951 -5858 1883 2654 -722 2609 6619
118F619q14j251l046k771K733J196n469j089M212P9j905J083Q00m84m35j648r23
$$ 6619 5805 4554 1508 -1263 1470 2666 -2803 -3892 320 399 -1506 -423 377 -107 -542 -2190 -3113
135c113K956K821l220l165L578N382j560m837q98K737J048k118k511lL362J115
$$ -3113 -157 2664 -556 -3721 -143 5239 3679 -1158 -2056 681 1729 -389 -2900 -2903 459 1574
151A574l418k25M309J574l804p46K049Q05J80k314l037J716M529k593m914K078
$$ 1574 -1844 -2069 2240 3814 10 -736 1313 2118 2298 -16 -3053 -1337 3192 599 -4315 -2237
167b237L243j106j098l77k1J617K021k551r11K965K12j360N51Q20l30L59j096
$$ -2237 1006 -100 -1198 -1575 -1596 21 2042 -509 -1420 1545 1757 397 948 1768 1438 1797 701
184G01k317Q57J672k397k174J767J526j09k14l21O26K459m50j931J35J844q22
$$ 701 -1616 -759 913 -1484 -3658 -1891 -365 -474 -688 -1009 -383 2076 1626 -305 -170 1674 852
201H52p15L43J88L60K00j768m29J782o29k323j63J623pn24K33M03J113J211j193
$$ 852 137 480 668 1028 1228 -540 -969 813 184 -2139 -2302 -679 -686 -1210 -977 -574 539 1750 557
220E57j298K030O79k006m49N93J92k67k40r79O47J362n79j646O41Q81J60j040
$$ 557 -741 1289 1968 -38 -487 106 298 31 -209 -1188 -541 821 242 -1404 -763 118 278 -762
238g62Q3O43O18P62j270k23J319L56j412o67N84M2k93n78k53P67R03o04p32R90
$$ -762 -679 -36 582 1344 74 -149 1170 1526 114 -553 31 73 -220 -798 -1051 -284 619 15 -717 273
258B73Q42m06o64o2K56K89l12m56k01P48J10q17j89N84J12l60n07K34N68M67p39
$$ 273 1115 709 45 -17 239 528 216 -240 -441 307 417 -400 -589 -5 107 -253 -760 -526 42 509 -230
279b30j79N12P19k34m13J4L12o4p24m44L18O28m98o24l6J120ln45J97k9M81J60
$$ -230 -409 103 822 588 175 189 501 437 -287 -731 -413 215 -283 -907 -943 177 174 -371 -174 -203 278 438
301D38o68l6O33J41k30l60K51J40K44p43l50L35J19n80l62N97L21J70n3j47L69
$$ 438 -230 -266 367 508 278 -82 169 309 553 -190 -540 -205 -86 -666 -1028 -431 -110 60 7 -140 229
322B29M01k77j59k22M06q5l03k94N3L14k40j53j49L91J23l12K1J90J59j14n3K7
$$ 229 630 353 194 -28 378 293 -10 -304 -251 63 -177 -330 -479 -88 35 -277 -256 -66 93 -21 -74 -47
344d7J87L22k61j97K73L87q4n84j47M95o24K77l08m5L88Q8Q8o7p5J74l37j21M66
$$ -47 140 462 201 4 277 664 580 -4 -151 344 -280 -3 -311 -356 32 120 208 141 66 240 -97 -218 248
367B48j90K37j77k07J65MN1l4p7J16j65Q7k81K54j2M9r0l0K83m18K74M1k7K2K70
$$ 248 58 295 118 -89 76 80 131 97 20 136 -29 58 -223 31 19 68 -22 -52 231 -187 87 128 101 123 393
392C93l56M9k46J74l1K4L3k98N15k35l03N18o9k85J16r5L3J39Q8Q5r7K52k61j04
$$ 393 37 86 -160 14 -17 7 40 -258 257 22 -281 237 168 -117 -1 -96 -63 76 164 249 152 404 143 39
416C9K18k00p8QJ5p2K58m00J8L87k43K41k12J45j50J47M2l70N08qj57j60j16M34
$$ 39 257 57 -21 -13 2 -70 188 -212 -194 193 -50 191 -21 124 -26 121 163 -207 301 293 136 -24 -140 294
440B94o44Q2K96l8K95l24K14j16o6K76j89k08M85j31m88L37j93j57K68j47j09
$$ 294 -350 -268 28 -10 285 -39 175 59 -7 269 80 -128 357 226 -262 75 -118 -275 -7 -154 -263
461b63m1K87k33L48j18r9K65k8k81K64J95J1n2m33J48K02K5j01j90rK6l3j41J56
$$ -263 -304 -17 -250 98 -20 -119 146 118 -163 101 296 307 255 -178 -30 172 197 96 -94 -103 -77 -110 -251 -95
485i5J66K7q3Jk0J07o4j81K21K1k6j01J7q2k8M36l50J04j2j69J02P6k99J48j23
$$ -95 71 98 15 16 -4 103 39 -142 79 100 74 -27 -10 -92 -120 316 -34 70 58 -111 -9 67 -232 -84 -207
510b07J07L2l9K81j06J38l55L43k73J38k08M27n08J04M4K08j61L0K4j75q4Qk44
$$ -207 -100 -68 -107 174 68 206 -149 194 -79 59 -149 278 -230 -126 -82 126 -35 -5 19 -156 -240 -232 -476
533d76N07O5N5j16N3k16N42k35k8l4l01J70O4j61J32K98l36L95Qn25J95k07L44
$$ -476 31 96 151 35 88 -128 414 179 151 117 -184 -14 50 -111 21 319 -17 378 386 -139 56 -151 193
556A93j85L0K5n3j45J67l0J44k63j07K66J25J6j95O5J12j57j93N4L12l28K38m9
$$ 193 8 38 63 10 -135 32 2 146 -117 -224 42 167 183 -12 53 165 8 -185 -131 181 -147 91 42
579D2N9k14N3L0p7R2r5kK82l88K23K78j80m0r1j26K06q5J54l34N8Q9L7M6J68m77
$$ 42 101 -113 -60 -30 -107 -15 -110 -112 170 -218 5 283 103 63 -28 -154 52 -33 121 -213 -155 -66 -29 17 185 -292
605b92L91RLJ5j53q4K84N2j22J01k0J24j81N6j13q9Kj28N3j22L03L1k04J12L3
$$ -292 99 108 111 126 -27 -111 173 225 103 204 184 308 127 183 70 -19 -17 -145 -92 -214 89 120 -84 28 61
630F1m2j68J63k78L07j42R1j03J84O9j71J44j36J11k90k1RJ91k53J94J44J13k82
$$ 61 19 -149 14 -264 43 -99 -8 -111 73 142 -29 115 -21 90 -200 -221 -212 -21 -274 -80 64 177 -105
653a05j60N5l7L42j79N1m9N29l91j34L35K2q8j67J48n04N26k97J71j73K9k2l3
$$ -105 -265 -210 -247 95 -84 -33 -82 447 56 -78 257 279 191 24 172 -332 194 -103 68 -105 -76 -98 -131
676a31J73M8J67k65J6j7J0j76J69M8j82P1m6J00R9N0j03N0j70J83j32j32O2R3
$$ -131 42 90 257 -8 8 -9 1 -175 -6 42 -140 -69 -115 -15 84 134 31 81 -89 94 -38 -170 -108 -15
700a5k61K01J54j67R4j70k58N70k15J75J05m3j32l08K79q5R9O3j81L59k93M04
$$ -15 -276 -75 79 -88 6 -164 -422 148 -67 108 213 170 38 -270 9 -76 23 86 -95 264 -29 375
722C75l39J44j3j03J59k10J54j23k1k54K14m6P2J18k52K7J06J06J16k14o8j45
$$ 375 36 180 167 64 223 13 167 44 23 -231 -17 -63 9 127 -125 -98 8 114 230 16 -52 -197
744a97K17k26j79M52k50K99k65K9J50k20J82j21q9nK70L8Q4l17L46k74Kn3m2J77
$$ -197 20 -206 -385 67 -183 116 -149 -120 30 -190 -8 -129 -218 -223 47 85 169 -148 198 -76 -74 -127 -169 8
768Hq1L10k80P2K07j68m0j49K38Q0k72P1R2k8r6J77K27j29k13L5J72l51R1j5k43
$$ 8 -73 237 -43 29 236 68 28 -121 117 197 -75 -4 88 60 -36 141 368 239 26 61 233 -118 -27 -42 -285
793b85J30J95J34m12K70J44n38K60J26L11l75k10L01K4q7J49k33Q2L5k6L13k10
$$ -285 -155 40 174 -238 32 176 -362 -102 24 335 -40 -250 51 75 -12 137 -96 -14 21 -5 308 98
815I8k64J42k22J08L15j49k09l9K99j59J21J26q2q4mJ41n2J39j60q8M5j66K52
$$ 98 -166 -24 -246 -138 177 28 -181 -220 79 -80 41 167 85 1 -3 138 86 225 65 -23 22 -144 108
838A08j62j74L94j63j87L31Rj95J51m5j0j3K9k19K72j87M5j53J39J21l4J5n6j23
$$ 108 -54 -228 166 3 -184 147 156 -39 112 67 57 44 73 -146 126 -61 -16 -169 -30 91 57 72 16 -107
862a07Q4PJ67K30k71l7o6R8l6k62O9K42L4n05K16P4%J38j42Mq2J10m3j60K17p
$$ -107 -23 -16 151 381 110 73 7 105 69 -193 -124 118 152 -353 -137 -63 -63 75 -67 -63 -145 -35 -78 -238 -21 -28
888b8M9L6R1k30j1J50o9j3L24j5l00K36j23j03j80J85RK8p2K4N5m1j08J94o0p1
$$ -28 21 57 148 -82 -93 57 -12 -25 299 284 -16 220 97 -6 -186 -1 8 36 -36 -12 43 2 -106 88 28 -43
914d3k7K59l78J19J34J07k28O9J26q8q3o0Q9nl7J82k52j25K23l5R6K61k73m0j01
$$ -43 -70 189 -189 -70 64 171 -57 12 138 50 -33 -93 -4 -9 -46 136 -116 -241 -18 -53 43 304 31 -9 -110
939a10L43k54J93j09n6m5J02K43n79L86q2N3j14Q0m2l3j71K80l4n2J57l74K91
$$ -110 233 -21 172 63 7 -38 64 307 -272 114 32 85 -29 51 9 -24 -195 85 51 -1 156 -218 73
962G3j07K1M8LL80p02K35M5J60n7l17L44k72J20J57p2j07J98lj23j2k8q7oM7j43
$$ 73 -34 -13 35 38 418 -284 -49 -4 156 99 -218 126 -146 -26 131 59 -48 150 147 24 12 -16 -103 -109 -62 -205
988b05K91J19l6j50O8R1j60P3k59J77k27J36L37q9k02Q2J33k85L47j68n3R1j2
$$ -205 86 205 169 19 87 178 18 91 -168 9 -218 -82 255 166 -36 46 179 -106 241 73 20 111 99
1011I9j28J61m58K68J4R7J19k59L02l50L48l24O7oM5J99l2L2J44j86p3J25j25
$$ 99 -29 132 -326 -58 -44 53 172 -87 215 -135 213 -111 -44 -50 -5 194 162 194 338 152 79 204 79
1034G9lK54l68l1J55j60M89l89m6J19J20l46J99J51l68N9J77J8k28J38K14l50
$$ 79 76 330 -38 -69 86 -74 415 26 -20 99 219 -127 72 223 -145 -86 91 109 -119 19 233 -117
1056a17L59o1r1j11j31L03j66O1P0j23k27L53j44N4k10K09j47K8K5J12j0p5L01
$$ -117 242 181 90 -21 -152 151 -15 46 116 -7 -234 119 -25 29 -181 28 -119 -91 -66 46 36 -39 262
1079B62l98l7K42o9m6J25m7J0L2l35K63r5J3J67k26K17j67kK92k33k80N00l26
$$ 262 -136 -173 69 0 -46 79 32 42 74 -261 2 -93 -80 87 -139 78 -89 -91 201 -32 -312 188 -138
1102a38O5j01o9K08J61J02o5j12K1M5J5l13j61L75j88J73R2j18L0Kr4K18K1k22
$$ -138 -73 -174 -243 -35 126 228 163 51 72 117 132 -181 -342 33 -155 18 110 -8 22 24 -70 148 169 -53
1126e3j06M13Q0l27K6K73k73o1OJ00j51J34Q2n9J83m54L41J72j46j81j80O2J1
$$ -53 -159 254 334 7 33 306 33 -28 -22 78 -73 61 143 84 267 -187 154 326 180 -1 -181 -119 -108
1149a08J09J15J5J60j73j2k14j18N20j6j29O1l66J79J71l46M58m68K79j67K24
$$ -108 1 116 131 291 118 106 -108 -226 294 278 149 210 -156 23 194 -152 306 -162 117 -50 174
1170A74j23J04k82M81l14j48J56k56K17j85K75J58ro08J92K20R7k47R0J78l01
$$ 174 51 155 -127 354 40 -108 48 -208 9 -176 99 257 248 -360 -168 52 149 -98 -8 170 -131
1191a31L31k85j75N4K57R6j32j00lL06k63j02K27k49N34m86J28j2q6J22j4Q5j38
$$ -131 200 -85 -260 -206 51 147 15 -85 -88 218 -45 -147 80 -169 365 -121 7 -5 -91 31 17 102 -36
1214c6K99m1j78K5J06k53K17j85M2j13O7k2P8r0K84l5j86L2k00L88j97J5j2k58
$$ -36 263 222 44 69 175 -78 139 -46 -4 -117 -50 -72 6 -84 200 165 -21 11 -189 199 2 17 5 -253
1238b53L93j71M1rl19L44J70R4k76K7p9J74k64j61J65K87j21j68J00r6K10l43
$$ -253 140 -31 10 1 -318 26 196 290 14 41 -38 136 -128 -289 -124 163 42 -126 -26 -122 88 -255
1260b55K32k50L86j64J2J25q8J69J01m40J37J14k45J5L13j21n4j62K60K61m06
$$ -255 -23 -273 113 -51 -39 86 -2 167 268 -172 -35 79 -166 -151 162 41 -13 -175 85 346 -60
1281f0N6j81K63j17KJ29Nr1J7K2R8j94J06oL30m04j46K89l51P3J77J28k63J04
$$ -60 -4 -185 78 -39 -37 92 97 6 23 45 143 -51 55 49 379 -25 -171 118 -233 -160 17 145 -118 -14
1305a4j39jK81k30K53k3k34J08L2r3L0j47J69O9j72o7%l5M67m14O3K19n1r1q7
$$ -14 -153 -154 127 -103 150 127 -107 1 33 -60 -30 -177 -8 61 -111 -178 -178 -213 254 -160 -97 122 71 -20 -107
1330a07J1J97m0M8k11R2J17l95K80J06q3j21K26K35k99NJ58m09K23J82j92M2j68
$$ -107 -96 101 61 109 -102 -10 107 -288 -8 98 15 -106 120 355 56 61 219 -190 33 215 23 65 -103
1353a03L37J45m13j04J28k66L83J17k20N3J56p4n5J26j08j74k0M2J84k12M4j51
$$ -103 234 379 -34 -138 -10 -276 107 224 4 57 213 139 84 210 102 -72 -92 -50 134 -78 -34 -185
1375a85J14J49j28l7J4l9j63L29P9OJj30r7Q8j58J02m1M9L73m93L20J7q3J13k42
$$ -185 -71 78 -50 -87 -73 -112 -275 54 133 139 140 10 -87 1 -157 -55 -96 -47 326 -167 153 170 87 200 -42
1400d2K16R1l52M9P0kKM3k51k32L91n9J74j05Jm5J55p6j3j31l4K43j43m4m1K58
$$ -42 174 265 -87 -38 32 30 32 75 -176 -408 -17 -76 98 -7 -6 -51 104 28 15 -116 -150 93 -50 -94 -135 123
1426A23k89q9M90l15J54j30MM53l61o9J84p2j26j28N7L13l61MJ14j23j4K61k38
$$ 123 -166 -255 235 -80 74 -56 -52 401 40 -29 155 83 -43 -171 -114 199 -162 -158 -44 -167 -181 80 -158
1449a58J79k3O8j56J57J37k35R2k03J82n4l8J65M8k04J16j3q7K12l18K38Mr1m9
$$ -158 21 -2 66 -90 67 204 -31 61 -142 40 -14 -52 113 161 -43 73 60 -27 185 -133 105 109 18 -31
1473c1J25k57K6J48J89l27L72kl17P8K61l69O0O5m1N5j32J62j22J28j61J92r0
$$ -31 94 -163 -137 11 200 -127 245 243 -74 4 265 -104 -44 21 -20 35 -97 65 -57 71 -90 102 12
1496A2j84K06J55l21J9J07k77K52kp8K1L04k45L40j02r8r3j6l8l7L8o0O2K7m2
$$ 12 -172 34 189 -132 -113 -6 -283 -31 -33 -111 -90 214 -31 309 207 109 16 0 -38 -75 -37 -97 -35 -8 -50
1521e0j80J69k04K53J75l59L03k63J63Q2K06l02m0j50N6L85l27P9m5L84j76m10
$$ -50 -230 -61 -265 -12 163 -196 107 -156 7 89 295 -7 -47 -197 -141 244 -83 -4 -49 335 159 -251
1543b51M02Kl00MK63j93J66k53L54j72j72N1K18k72K53j97Q4K0M7q1P2n0R1j73
$$ -251 151 153 -147 -143 120 -73 93 -160 194 22 -150 -99 119 -153 100 -97 -13 7 54 -27 45 -5 86 -87
1567h7m4L21m02J29M8J49j81O3r1J80Pk04M2M5P8m09M15M3q5J63k33P9j91K36
$$ -87 -131 190 -212 -83 -35 114 -67 -4 -95 85 92 -112 -70 -25 53 -356 59 102 17 180 -53 26 -165 71
1591G1n2Q5M2l23l1M25j33J02m04o5N3L03p6j93K39j46m6P7K22k58j18K98K1j37
$$ 71 19 104 146 -177 -208 217 84 186 -218 -283 -230 73 -3 -196 43 -103 -149 -72 150 -108 -226 72 93 -44
1615d4R2j66L20k53J03m6k24J85J2R3j14j47J15Q3J62k69J80o0J67q5J59k71M6
$$ -44 48 -118 202 -51 52 6 -218 -33 -21 72 -42 -189 -74 9 171 -98 82 22 189 104 263 -8 38
1638C8Q3n10J98L50j96L05k92n8K07j8p7Q4l60J70j00J19K7K17k37j8J88m3k10
$$ 38 121 -389 -191 159 -37 268 -24 -82 125 107 30 114 -246 -76 -176 -57 -30 187 -50 -68 120 77 -133
1661a33j3O8Oj02J52K7P0r3LK56n55L31o5o4j5L52j81j89J72k41J75m5J72m3j04
$$ -133 -146 -78 -72 -174 -22 5 75 -18 -15 241 -314 17 -48 -112 -127 225 44 -145 27 -214 -39 -84 88 45 -59
1686e9J14m25K26M64n34Q6K05k28j3K78l33M66j81j17J4K97j42K7l90M65j34J60
$$ -59 55 -370 -144 320 -214 -128 77 -151 -164 114 -219 247 66 -51 -37 260 118 145 -245 220 86 246
1708B46k94n7J24K3K08j8l0k21L2L3K37k81M9o4P7Q6k96J81o3j58Q4K45k15K15
$$ 246 -48 -105 19 42 250 232 202 -19 13 46 283 2 51 -13 64 150 -146 35 -28 -186 -102 143 -72 143
1732A43l36J17j1J25j79J03K6j07L68k50J63J31j93q5K79k61r8k14L01j78K83
$$ 143 -193 -76 -87 38 -141 -38 -12 -119 249 -1 162 293 100 15 294 33 -65 -279 22 -156 127
1753A27k36L17k93JM64m69K33qk5q3j34J45K91k14k68l0M02o4r4J20k92J7J20
$$ 127 -109 208 -85 -84 380 -89 144 136 111 28 -106 39 330 116 -152 -182 220 156 62 182 -110 -93 27
1776B7j03K11N5K58o61K68K3J05j70j5O3L7M6q7j06J58p2r7J26j64j36J71l0J13
$$ 27 -76 135 190 448 -213 55 78 183 13 -2 61 98 144 57 -49 109 37 -60 66 -98 -234 -63 -93 20
1800B0k19J95J18L6Q3l96M10j82J05q2j26j98K54M4J84jj98k38K90j90j48L4K33
$$ 20 -199 -4 114 150 233 -163 247 65 170 88 -38 -236 18 62 246 245 47 -191 99 -91 -239 -205 28
1823B8M19j65m4l44J37j96l3J57q6q7R4l0J14K13l22m7K38k40m5J61J37K9Qk10
$$ 28 447 282 238 -106 31 -165 -198 -41 -127 -214 -120 -150 -36 177 -145 -192 46 -194 -239 -78 59 88 96 -114
1847a14J65M9r9J34n3k78K43p8Q6N9j36Q1j07j53N8j67L31J5j52J40J79k80l6
$$ -114 51 100 1 135 82 -196 47 -31 55 114 -22 59 -48 -201 -143 -310 21 36 -116 24 203 -77 -113
1870a13J92qk70R8J23%J8N9k36L19l59K54n3J35J7qj98q9o2L13M6l74J56J43j64
$$ -113 79 71 -199 -101 22 22 40 99 -137 182 -177 77 24 159 176 168 -30 -119 -181 132 178 -196 -40 103 -61
1895f1J66k21P9j71K2K98j29mj95L50J7o9j32R2m9j78K16R1Q3k05k47K33k11J82
$$ -61 105 -116 -37 -208 -186 112 -17 -21 -216 134 151 82 -50 42 -7 -185 31 122 205 0 -247 -14 -225 -43
1919d3K08j31J01j04J36j54l44K49K32j32r1o9N9k3K64O8l86K51j39L3K38k80
$$ -43 165 34 135 31 167 13 -331 -82 150 18 -73 -142 -83 -106 158 226 -160 91 -48 -15 223 -57
1941e7K2J24k32J79K0m7n5p6K94j71j24j10L8p6K98n3j08K72j09RO5j90j54K04
$$ -57 -35 89 -143 36 56 9 -46 -122 172 1 -123 -233 -195 -271 27 -26 -134 138 29 38 103 -87 -241 -37
1965c7K05j40j56nJ61j46J7L69l00J02J4j46k12J1K32Q7j12L8l15p9M22L0p7Q0
$$ -37 168 28 -128 -133 28 -118 -101 268 -32 70 84 -62 -274 -263 -31 56 -56 -18 -333 -412 10 40 -37 43
1989D3r9j11K65P1o2o3k4K15l21p6P1K73j60J09l55K16O4n5J72k69J89j85J6o4
$$ 43 -56 -167 98 169 107 44 20 235 -86 -162 -91 182 22 131 -224 -8 56 1 173 -96 93 -92 -76 -140
2013a40L06k9J1j18J09q8J11k56J93l16K06o2K27k74L6K62m88K41l8N35n48K10
$$ -140 166 137 148 30 139 51 162 -94 99 -217 -11 -73 154 -120 -84 178 -310 -69 -107 428 -120 90
2035I0j6p3j51l0J63K46q9j28k6N9J08k34j53J47o9J04p9K98j33k70J87J59k79
$$ 90 74 1 -150 -180 -17 229 140 12 -14 45 153 -81 -234 -87 -156 -52 -131 167 34 -236 -49 110 -169
2058a69J46M2r6K79l27L53m33q6M10k2l1j08K01l00L97j54k35J04J86j36k29J47
$$ -169 -23 19 -77 202 -125 228 -205 -291 119 97 66 -42 159 -141 256 102 -133 -29 157 21 -208 -61
2080f1j53k8N3K56K36l09j3J28k45P6J77k44J5J06N1K3j42QJ19j46O7j64J49J00
$$ -61 -214 -242 -189 67 303 -6 -19 109 -136 -60 117 -127 -112 -6 45 68 -74 -66 53 -93 -26 -190 -41 59
2104E9J6j56K33k83k3J22k5JK35N1n10L79j67m9K77L1k03j66R5P1j69J79P7j59
$$ 59 75 -81 152 -131 -154 -32 -57 -56 179 230 -280 99 -68 -117 160 191 -12 -178 -83 -12 -181 -2 75 -84
2128h4K49k37n3J37q0%M6j1L38k61lo9J12m7K8p2J33J11k66j12O4K92k0l54M61
$$ -84 165 -72 -125 12 -68 -68 -22 -33 305 44 41 -28 84 37 65 -7 126 237 -29 -141 -77 215 195 -159 302
2153C02l05j69N7k4M6J19M6k47L27k48j33L33j36j9K87m06N5K95j38j18m8J96
$$ 302 -3 -172 -115 -139 -93 26 72 -175 152 -96 -229 104 -32 -51 236 -170 -115 180 42 -76 -124 72
2175G2k60L26m6k01J95k6j88K67q5r5K16j06j79J07j54l04N92K34m28j05J32k7
$$ 72 -188 138 92 -109 86 60 -128 139 54 -41 175 69 -110 -3 -157 -461 131 365 -63 -168 -36 -63
2197f3R2j72J86j53J59P5k23j35J87k0j62L42n9j31m4O4K46j74J04j82o8L45j27
$$ -63 29 -143 43 -110 49 124 -99 -234 -47 -67 -229 113 54 -77 -121 -57 189 15 119 -63 -131 214 87
2220H7Lj20M9k04M64n57J49J78k87Q5k1K45k83L06l16K83p8J49Pm4j77j50M9K07
$$ 87 90 -30 19 -185 279 -278 -129 49 -238 -153 -174 71 -212 94 -222 61 -17 132 139 95 -82 -232 -183 24
2244B4j30K34j31j28m2K08P2k26K53l52J44P0O3k52mJ24k45R3N50m69L64k36k27
$$ 24 -106 128 -3 -131 -173 35 107 -119 134 -218 -74 -4 59 -193 -197 -73 -318 -225 325 -144 220 -16 -243
2267b43M30j71K70r1k17j52J37Q2O9r4r4Q9J27Mn5j34L0o5M07l95k80J22L83j02
$$ -243 187 16 286 195 -22 -174 -37 45 114 20 -74 15 142 146 91 -43 -13 -78 329 -66 -346 -224 159 57
2291E7j70J31J45k09k9N2l31M79l27M35n01K28J92j42j1J24j29Q0l17J65K48k03
$$ 57 -113 18 163 -46 -75 -23 -354 125 -202 233 -268 -40 152 10 -1 123 -6 74 -243 -78 170 -33
2313c3J2j64K28J58k53m4K16k18J1K30R4k38M8J67l80R1r0K37j28R1m86P48n55
$$ -33 -21 -185 43 201 -52 -96 120 -98 -87 143 237 -1 47 214 -166 -75 -165 72 -56 35 -451 297 -258
2336b58M56j27q1M31m52j20l2J67k33QM09p6j12J11M7j40l3j22L90j99O1m7K1
$$ -258 198 71 -10 421 -31 -151 -183 -16 -249 -241 168 92 -20 91 138 -2 -35 -157 233 34 95 48 69
2359F9K8P4k57n9J98J32j68J21j31n9L19j36m7O7l47L26j79O9l74O50j08k82K01
$$ 69 97 171 -86 -145 53 185 17 138 7 -52 267 131 84 151 -196 130 -49 20 -354 296 188 -94 107
2382A07K1j28j39K95J8j51k68J76L16j90J44l05L26o5l80M33l24P9K11k13J70
$$ 107 128 0 -139 156 174 23 -245 -69 247 57 201 -104 222 157 -223 210 -114 -35 176 -37 133
2403A33j08J5o6n1j15m3K21l5P1k96P2o5N47l08J36k7k40L93n13M78k52L57o24
$$ 133 25 40 -26 -77 -192 -235 -14 -49 22 -274 -202 -267 280 -28 108 81 -159 234 -279 199 -53 304 -320
2426c20L87K02l39J30j46J61R5k57L41j35k68M4N1K64K5l24J50K13k64L17m82
$$ -320 67 269 -70 60 -86 75 170 -87 254 119 -149 -105 -54 210 235 -89 61 274 10 327 -155
2447a55R8k07K38q8Q8k8l6J99j14K54k73J57j39J7J67k52L08k28j54J98J98p6
$$ -155 -57 -264 -26 -114 -26 -54 -90 109 -5 249 -24 133 -6 11 178 -74 234 6 -148 50 248 172
2469A72k02Q3J70Qk75j2L9L9o6r2K39n7Q1k77L27p2J91j71k37j69L26j62J03o9
$$ 172 -30 53 223 231 -44 -56 -17 22 -44 -136 103 46 127 -150 177 105 296 125 -112 -281 45 -117 -14 -83
2493h3n4L8j06K37l6R2J59l14j73N14m06K26j5j42Poj24M23j10o6J4j31K18j47
$$ -83 -137 -99 -205 32 -4 88 247 -67 -240 274 -132 94 79 -63 -56 -62 -186 237 127 61 75 -56 162 15
2517A5m9mJ29k68K07j37J19m5k00J08K11k61L7J41j35J43k43J77J47l32J64P1
$$ 15 -34 -38 91 -177 30 -107 12 -33 -233 -125 86 -175 -138 3 -132 11 -232 -55 92 -240 -76 -5
2539eN8j16J37n0k2j4r0K74j87P5j01J64k27J72J65l76J25J55J1j03J64k11J50
$$ -5 53 -63 74 24 2 -12 -102 172 -15 60 -41 123 -104 68 233 -143 -18 137 148 45 209 -2 148
2562A48k03j43J06R1o4P8j66K93k69L9M6K89n31Q0L26j6l72L47j47n7K83k2R5
$$ 148 -55 -198 -92 -1 -65 13 -153 140 -129 -90 -44 245 -286 -206 120 104 -268 79 -68 -125 158 136 231
2585B31j33j12k2J24J02j12k19K72k4p3J8k8j00J4J4P1J2L1l38K91j25K43k53
$$ 231 98 -14 -36 88 190 78 -141 131 107 34 52 24 -76 -62 -48 23 35 66 -272 19 -106 137 -116
2608a16K29l03J69n9R8j23J36m1K6K5J10q6j37jk41K64J23k35K49m32K13K27J95
$$ -116 113 -190 -21 -80 18 -105 31 -10 16 41 151 65 -72 -73 -314 -50 73 -162 87 -345 -132 95 290
2631B90n3l57R3j0L7o2J98j58j63J71K0q3J30j44J03k01J53K86l35l40O16mk89
$$ 290 237 -120 -27 -37 0 -62 136 -22 -185 -14 6 -77 53 -91 12 -189 -36 250 -85 -425 191 187 -102
2654a02J91j30p6M26m05K78j65q9J41l12R8K01l03L82j93P1j93O6L97j88J0L5
$$ -102 89 -41 -117 309 -96 182 17 -72 69 -243 -145 56 -247 135 -58 13 -180 -114 283 95 105 140
2676A40N3k13m1J07J49o13K67j06M69K1k79q8J68Mj58K04l10K86J6l38K15m1K05
$$ 140 193 -20 -61 46 195 -418 -151 -257 212 233 -46 -134 34 38 -120 84 -226 60 76 -262 -47 -88 117
2699A17j27J4Q4P2j90J35j70J07J31j58n1K97j67k35K03o2j25L27l71J21J62j88
$$ 117 -10 4 88 160 -30 105 -65 42 173 15 -36 261 94 -141 62 0 -125 202 -169 -48 114 -74
2721g4J36J89l57N55n02PQ2k66K10O9L0kQm06M56k54J16n6o0L75j52n58M92j48
$$ -74 62 251 -106 449 -53 -46 36 -230 -20 49 79 77 85 -321 135 -119 -3 -59 -119 256 104 -454 38 -110
2745a10O7k5J55P0k42J61k54k20K38J86j03J95j37J45j16O7j06p8J7K61k24K0
$$ -110 -43 -68 87 157 -85 76 -178 -398 -160 26 -77 118 -19 126 10 77 -29 -107 -90 171 -53 -33
2767c3J06j65O3k21K62J60p0j85J91j36J11j37J82j12J2q0mO3r0l4J28Jj89L76
$$ -33 73 -92 -29 -250 12 172 102 -83 108 -28 83 -54 128 16 28 -52 -56 7 -83 -117 11 12 -177 199
2791A99o8k28j05l7L05l9O4J5L5l46K93j38K23r1j51O1K60k32R6p5k61L17j76
$$ 199 131 -97 -202 -239 66 27 91 106 141 -205 88 -50 173 82 -69 -8 252 20 116 41 -220 97 -79
2814g9J20k26L74p5k39J25J3j28K32m63k7N69k01n0kO7J69j13l08K89NOj43L8
$$ -79 41 -185 189 114 -125 0 13 -115 117 -346 -373 196 -5 -55 -57 10 179 66 -242 47 52 58 -85 -47
2838d7J25l14K06N6M8p2J77k57KOJ17m0k9J58M7j70m8q2L01n61M05N6k38rR0R4
$$ -47 78 -236 -30 26 74 2 179 -78 -76 -70 47 7 -22 136 183 13 -35 -117 184 -377 28 84 -154 -163 -73 21
2864B1m7M50n45J91L00l29j81Q5J0M4k90K70k16NQ5L0mK73k08M77m11j3J35k74
$$ 21 -26 424 -121 70 370 41 -140 -55 -45 -1 -291 -21 -237 -232 -147 -117 -121 152 -56 421 10 -3 132 -142
2888a42K16l21L92k24R5k62j3K25k4J16J62k03k20k8M55lj07p5L0j85M21o00P22
$$ -142 74 -247 145 -79 16 -246 -259 -34 -58 58 220 17 -203 -231 224 221 114 39 69 -116 305 -295 427
2911D27n92K1K58k65K3J39p2J81Q6J10k81j9j0n4j84K57m5J29L0l46L27n6K45
$$ 427 -165 -144 114 -151 -128 11 -61 120 206 316 35 16 6 -48 -232 25 -20 109 139 -207 120 64 309
2934C09k85n2j04R6j01q2P4J82M0k11mL15j93O7K3k71M20m9l38QL97j99pJ92l80
$$ 309 24 -28 -132 -36 -137 -219 -145 37 77 -134 -138 177 -16 51 74 -197 223 174 -164 -156 241 42 35 227 -153
2959a53J18J63K00k69j94J5Q2J08l04j65N40j34O5o7j36J52J15n9j3k14J24n1
$$ -153 -35 128 328 59 -135 -120 -38 70 -234 -399 141 7 72 5 -131 21 136 77 64 -150 -26 -77
2981g7J77j88J90kr6o1j43M33l6j50j62J45j15O2Nj7N9J93j78J07k38J39m0j90
$$ -77 100 -88 102 100 4 -57 -200 233 197 47 -115 30 -85 -23 -18 -35 24 217 39 146 -92 47 7 -183
3005a83K05J10k89l5L12k46K59O3j18Rp5j40J48l4p3K86J55k39k14O0r2l1RM2
$$ -183 22 132 -157 -192 120 -126 133 196 78 87 12 -128 20 -14 -87 199 354 115 -99 -39 -131 -162 -153 -111
3029a11N8J55k37J31K98k03M0k45l7K5j31L52j02J19k74K7L17J20M8k13k62R3
$$ -111 -53 102 -135 -4 294 91 131 -114 -151 -126 -257 95 -7 112 -162 -135 182 302 350 137 -125 -32
3051c2j50J9K27k7j72n8m3K71J7k3J36k01l2O4nq5K2K06r0r7Q5j26J34J11Mj94
$$ -32 -182 -163 64 37 -135 -193 -236 35 52 29 165 -36 -68 -4 -9 -94 -72 134 44 -53 32 -94 40 151 155 -39
3077c9j4J06j66K74l04k12L37J76n14K09K19k21K61l22K08p6J86j35K40k2k41
$$ -39 -53 53 -113 161 -143 -355 -18 158 -356 -147 72 -149 112 -210 -2 -78 108 -27 213 191 -50
3098e0o1R2J87j46J00l24O0J3o0K80np8k00K30j29L39l01J29l6j17P2J9K77l03
$$ -50 -111 -19 168 22 122 -202 -142 -129 -189 91 86 8 -192 38 -91 248 -53 76 40 -77 -5 14 291 -12
3122a2Q7r5J25R4k94P9mj5j00K41k99K55p7j08J82j31K20q4j94k5K21j17j11K90
$$ -12 75 -20 105 199 -95 -16 -20 -35 -135 106 -193 62 -15 -123 59 -72 148 64 -130 -155 66 -51 -162 128
3146A28J13m42N9K30k93K43m1L5j3P4j54mJ89j09K2k7NP6k57J28J26j50L4Q6k8
$$ 128 241 -201 -142 88 -205 38 -3 32 19 93 -61 -65 124 15 37 10 15 91 -166 -38 88 -62 -28 58 30
3171C0r0l48L02m4L16r0Q4k56R1m3n4j0J4M22m39J19o6J10K00j90j4p6K39k39
$$ 30 -60 -408 -106 -150 166 76 160 -96 -5 -48 -102 -112 -98 324 -115 4 -62 48 248 58 44 -32 207 -32
3195c2j93j0L55k80N6M3K8K13j38l5J3Q6k11M6K28l2j37Q2j73k29L91r6K73k24
$$ -32 -225 -235 120 -160 -104 -61 -33 180 42 7 20 106 -105 -59 169 137 0 82 -91 -320 71 -25 248 24
3219B4r0q6n5J11J38m4p2k93K98j7L81m54M6N9L3N0r7K95k09L17m07K0L86l44
$$ 24 -66 -152 -207 -96 42 -2 -74 -367 -69 -86 295 -159 -113 -54 -21 29 -68 227 18 335 -72 -52 334 -10
3243a0j15l22N21k5R0J39k86%J08j24K16m6L5n6k54J65p8K32k65K39k83K50k63
$$ -10 -125 -447 74 49 139 278 -8 -8 100 -24 192 146 181 125 -129 36 -42 190 -75 164 -119 131 -132
3266a32K42J3K7k7N2p9j22k1K67l51ro7J83k01MK38J22J12l38J34P7j76N0j19
$$ -132 110 123 150 123 175 96 -26 -47 220 -131 -140 -207 -24 -225 -221 17 139 251 -87 47 124 -52 -2 -121
3290a21L15j07l0j26K7PK82k41J9J08l07J44pl3j23J90j3r7Nq2M1M17m03K7J58
$$ -121 194 87 57 -69 -42 -35 247 6 25 133 -174 -30 -37 -70 -193 -3 -16 -113 -108 -190 -149 268 -135 -108 50
3315E0j65K42n1N0k52J99m8j26Nj0K19j10K9k10Q0J69j9N3k70K67j3k01R0j7R2
$$ 50 -115 127 76 126 -126 73 25 -101 -96 -106 113 3 32 -178 -98 71 52 105 -165 102 89 -112 -22 -39 53
3340E3m6J90k67j03L49j60l27K01J12K06j43j58K14l17J49J08k28L29j53j6O7
$$ 53 7 197 -70 -173 176 16 -311 -110 2 208 65 -93 121 -196 -47 61 -167 162 9 -7 60
3361F0n8J07j95n3M8j35Q7nK78j69K95l59M2J24M1k7j56K34j63K04J3k86N5j43
$$ 60 2 109 -86 -139 -91 -226 -139 -144 134 -35 260 -99 -57 67 108 81 -75 159 -4 200 213 -73 -18 -161
3385a61K48k0o2Q0l22K48j61nJ72J93k68r1R5J71m9k49M32J24n49L31k09mJ15
$$ -161 87 67 5 85 -237 11 -150 -155 17 210 -58 -149 -54 117 68 -181 251 375 -174 157 -52 -56 59
3408E9m2n4L05M9j77j59K8j13n4N0L22q2k15M98o39J44J56j98jM14m08O9j09K79
$$ 59 17 -37 268 317 140 -19 9 -104 -158 -108 214 132 -83 415 -224 -80 76 -122 -123 291 -117 -48 -157 122
3432A22Kk40J54l4O6p8J55l0k42J29J10J46o08M73j24P9j22oj28R8l9j07L23Q5
$$ 122 124 -116 38 4 70 -8 147 117 -125 4 114 260 -348 125 1 80 -42 -48 -176 -78 -117 -224 99 184
3456A84j3M0j36m21K91O5j36R0J6J43j61K41j30r4J15j90J02J09j77J12k07K20
$$ 184 171 211 75 -346 -55 10 -126 -36 -20 123 -38 203 73 -21 94 -96 6 115 -62 50 -157 63
3478F3o9m1J77j49k67N3K62j07j99K09k19j51N55k29Q2j46K48j81m1K02k24N4
$$ 63 -6 -47 130 -19 -286 -233 29 -78 -277 -68 -287 -438 117 -112 -30 -176 72 -109 -150 52 -172 -118
3500a18p0J93R6j36j14J94Q4K00j12j28N3p5K41m42L39j07q8J11k26q5L29k74
$$ -118 -188 5 101 -35 -149 45 129 329 217 89 142 67 308 -134 205 98 10 121 -105 -190 139 -135
3522a35K12j90J2K08m3J35j48k5K20j78Q9M7k64J17P1k5J09j45j63P0Q2K59l31
$$ -135 77 -113 -101 107 64 199 51 26 246 68 157 204 -60 57 128 103 212 67 -96 -26 56 315 -16
3545a6N2j39j77M33o4l10Q5q0J80n0J54j31P2l62K48L6J24J43m9j11Ok18N0K48
$$ -16 36 -103 -280 153 89 -221 -136 -216 -36 -86 68 -63 9 -353 -105 -69 55 198 149 38 44 -174 -124 124
3569A24n4j00r9r5M88k96J06j23mk5O1o6N6j3k80L25q7k52L10K13l16k47L75k33
$$ 124 70 -30 -129 -224 264 -32 74 -49 -53 -78 -17 -83 -27 -40 -320 5 -82 -334 -24 189 -127 -374 1 -232
3593b32K23J10j93J77j38j35K57j81R9j06J52j52J52l7j11r6J67N0J82k58J67
$$ -232 -9 101 -92 85 -53 -188 69 -112 -13 -119 33 -119 33 -4 -115 -211 -44 6 188 -70 97
3614I7k84L05J03n5k33J81l5l31L09j30r0K20J82j46RO8k00J48k41J76k28K33
$$ 97 -187 118 221 166 -67 114 79 -252 57 -73 -163 57 239 93 102 170 -30 118 -123 53 -175 58
3636E8no6J92m47L30j80P9n1J04nP1kM2n6j03r5L38k26k22n5N05j94j23k25K94
$$ 58 53 -13 179 -268 62 -118 -39 -90 14 9 80 78 120 64 -39 -134 204 -22 -244 -299 206 12 -111 -336 -42
3661d2j82J89L08k17jJ00k45kk0P7j20RJ68l0Q3p5J59n00N61k39K8m0p8L61m98
$$ -42 -224 -35 273 56 55 155 -90 -92 -112 -35 -155 -146 22 -8 75 0 159 -341 220 -19 9 -31 -109 252 -246
3686b46K84j21J41M5j08J10J60j11k44L11k42J60q5J71m62K87j57J48n0q0J16
$$ -246 38 -83 58 103 -5 105 265 154 -90 221 -21 139 54 225 -237 50 -107 41 -9 -89 27
3707B7J31Q3k12N0l05J16K73l53N6K67k31J03K08k5k93P6p2R5K13O7j67k15J57
$$ 27 158 241 29 79 -226 -110 163 -190 -134 133 -98 5 213 188 -105 -29 -101 -6 207 274 107 -108 49
3730D9k05K41l61K99m1J20j50J87l4m3J13l3n3J78l99K12O1j69Lj01O9k4N8Q2
$$ 49 -156 85 -276 23 -18 102 -48 139 105 62 175 142 89 267 -132 80 141 -28 -25 -126 -57 -81 -23 59
3754E9j06K69k60k24M22ok42k6K77m58K25J74l34Q2K01k8j40L81j10j76Q9n2j11
$$ 59 -47 222 -38 -262 160 154 -88 -114 163 -295 -70 104 -230 -148 53 25 -115 266 156 -20 69 17 -94
3777i4P8J30m19J01R2j82L10q9k5n4M0J51j70J38n7o4M9K6p1M5J69k23j07N4j3
$$ -94 -16 114 -305 -204 -112 -294 16 -73 -98 -152 -112 39 -131 7 -50 -114 -65 -39 -110 -65 104 -119 -226 -172 -185
3802a85k5k8J24lK14n19N05k11K34J61m37N4m2J76j63J31k31K02K41l63L03J01
$$ -185 -210 -238 -114 -117 97 -422 83 -128 106 267 -170 -116 -158 18 -145 -14 -245 -43 198 -165 138 239
3824B39m78PJ76o9kL1P6j21K69k55K33j46L5k2M10j90j42r9j48K81k27P3J76j07
$$ 239 -239 -232 -56 -125 -127 -96 -20 -141 128 -127 106 -40 -5 -27 383 193 51 -48 -196 85 -142 -69 107 0
3848@qk37J66r2M6K2Q3J72q0N2j09J30j91K28o2J8k47M4K10Q0q2l20k29M61Q5
$$ 0 -8 -245 -79 -171 -125 -103 -20 152 72 124 15 145 -46 182 120 138 -109 -65 145 225 143 -177 -406 55 140
3873A40j38N0r9K0p0k1Q5J81j81M1J85q2k53j39J20L18l56J9J18o5P3R1K0j50
$$ 140 2 52 -47 -27 -97 -118 -33 148 -33 8 193 111 -142 -281 -161 157 -199 -180 -62 -127 -54 37 57 -93
3897i3J32j9kl9l4j33N8L03l70N82p33N60m47j0K77p9j85K09J16n0k49M0L16k89
$$ -93 39 20 18 -21 -55 -188 -130 173 -197 385 -348 212 -235 -245 32 -47 -232 -23 93 43 -206 -166 150 -139
3921a39J90Rk73K82r6J34J74m41J3O3lL05j59k15Q9j15L09j02K19n2k35K53m13
$$ -139 51 60 -213 69 -27 107 281 -160 -147 -84 -87 218 59 -156 -67 -182 127 25 244 192 -43 210 -203
3944b03L43n0q0j63Q7J40oJ73j20j7k40Q6O9J33l1J87l97K1P2j20L20n10L37O4
$$ -203 140 90 10 -153 -66 74 68 241 121 104 -136 -50 19 152 121 308 -89 -68 4 -116 204 -306 31 95
3968I5K53m53J26K4q4j0O9J99k15k42K53j36Pj50O3K28k49N6M12Ml56K07j64K10
$$ 95 348 -105 21 45 -39 -49 20 219 4 -238 15 -121 -114 -264 -201 27 -222 -166 246 250 -106 101 -63 147
3992A47j21R6k63L17j14j43M7J53j73J19n6j15o4K91j75J85j41J0Q7j25L41l41
$$ 147 26 122 -141 176 62 -81 -34 119 -54 65 9 -106 -170 121 -54 131 -10 0 87 -38 303 -38
4014c8j66K95j92O7J15q0K01l06r5J87n9O5k59L05Qk25lNK18j21J11P4l34J91
$$ -38 -204 91 -101 -34 81 1 202 -104 -199 -12 -71 -6 -265 40 48 -177 -180 -175 43 -78 33 107 -227 -36
4038c6j4K4K19l97K66j98K64nQM5j16%q0j46N16m64Mp4qK12Q6j29o9J97l04J99
$$ -36 -50 -26 193 -204 62 -136 128 123 131 176 60 60 -20 -166 350 -114 -110 -184 -192 20 106 -23 -92 105 -199 0
4064@j1j97J7K52l87K73l14L51K34O2l61m3K00l27N22j79j57J37L9m6l92M13j50
$$ 0 -11 -208 -191 61 -326 -53 -367 -16 218 280 -81 -124 76 -251 271 92 -65 72 111 65 -327 86 -64
4087f4J8J32J45l46J04L21j98p9K66l79K6K62j35l4J83l29j67K80J89k6k52n4
$$ -64 -46 86 231 -115 -11 310 112 33 299 -80 -54 208 73 39 222 -107 -274 6 195 169 -83 -137
4109a37K21k03J52r8j2K42K3rj76J21k69J62k48O9%K00j48K0q5J47j39K03l0K
$$ -137 84 -119 33 -65 -77 165 188 179 3 124 -145 17 -231 -162 -162 38 -110 -90 -175 -28 -167 36 6 8
4133HJ01p9q6j86J90Oj2p0J68q7K69l70J35j05K19k85rR8j59L41j17L65k41K7
$$ 8 109 30 -56 -242 -52 -46 -58 -128 40 -47 222 -148 -13 -118 101 -184 -193 -95 -254 87 -30 335 94 121
4157A21m4j85j0K01p4M7N3L8n6j02OJ65k42j83K10R9k56o6L07Jj65N8Q9L21l53
$$ 121 77 -108 -118 83 9 56 109 147 91 -11 -5 160 -82 -265 -55 44 -212 -278 29 30 -135 -77 12 333 -20
4182b0l1r7K36j04K86l80K04k20K70k13K68k2j83j03k13P26p12P05l57j67J72
$$ -20 -51 -148 88 -16 270 -110 94 -126 144 -69 199 177 -6 -109 -322 404 -308 397 40 -127 45
4203D5J86k23j05j67M54p4k01l7J38o4Q8R0k74J74P8p1l72L48p5j70K66O5j39
$$ 45 231 8 -97 -264 190 116 -85 -122 16 -48 40 130 -144 30 108 37 -335 13 -62 -232 34 99 -40
4226d0K9K9j91k2q2J05K39k07J31J31j07N0n3J43k06q2J39k79L50k57K67k92L44
$$ -40 -11 18 -173 -195 -277 -172 67 -140 -9 122 15 65 12 155 -51 -133 6 -273 77 -180 87 -205 139
4249A39j50l3K2O0J56k01L95n49M2K20J45j15P4o8j02n2j19K35j34K51j74J9n
$$ 139 -11 -44 -22 38 194 -7 388 -161 -119 101 246 131 205 137 35 -17 -136 99 -35 216 42 61 56
4272E6k14K67K34j76k80K04KM0j61L19m17K4J84j56r1J99J23r1m0j64J7q4N9J16
$$ 56 -158 109 343 167 -113 91 93 133 -28 291 -126 -102 82 -74 -165 34 157 66 26 -138 -121 -205 -146 -30
4296c0N3L14j60k37J80l27L32kj77LK27N0k82n5K1J41J9O4J3p9l3j2o3O9k00M9
$$ -30 23 337 177 -60 120 -207 125 123 -54 -51 176 226 -56 -111 -90 51 70 134 147 68 35 23 -40 29 -171 -122
4322a22L27j46J83m2q6j75J69k4k20J80M1j35O8k68M39j14P8J5k65L88j53n0J2
$$ -122 205 59 242 200 114 -61 108 84 -136 44 85 -50 18 -250 189 75 153 168 -97 291 138 88 100
4345A00j19k65L00O3r0o8l88K36J83l3J01q3kR5nJ20j16K63m67L10j83J06j36
$$ 100 -19 -284 16 79 -11 -79 -467 -231 -48 -81 20 -63 -65 30 25 145 29 292 -175 135 -48 58 -78
4368g8l5l2J13Q4l7k77J01J69J4K51J67n53n0j3K66o2p5K63Jj63k6n6J75j1K96
$$ -78 -113 -145 -32 52 15 -262 -161 8 22 273 440 -113 -163 -176 90 28 -47 216 217 54 28 -28 147 136 432
4393D32l87O3j33Q6j23J55p3L6k12o0p1K61M50m64NJ70j70l0P6j55J86j28o2l9
$$ 432 45 108 -25 61 -62 93 20 56 -156 -216 -287 -26 424 -40 -35 135 -35 -65 11 -144 42 -86 -148 -187
4417a87J49K3kJ38L72m44J49j59m9m5J19p5k29J46K81P2k73l20L53k19J20m5J30
$$ -187 -38 -15 -17 121 493 49 198 39 -10 -55 64 -11 -240 -94 187 259 -14 -334 19 -200 -80 -125 5
4440ER6r5J66l79j06Q7j16O43l28p7K13n6o1N8J89l31J9J42MJ09k21o7J34j81
$$ 5 101 6 172 -207 -313 -226 -342 301 -27 -104 109 53 -8 50 239 -92 -73 69 73 182 -39 -106 28 -153
4464a53K89j39J04j65J50O6K1j0r6Q1j82j59M01j93k06p6K77j01K11k86o5K07
$$ -153 136 -3 101 -64 86 152 173 163 67 148 -34 -193 208 15 -191 -267 10 -91 120 -166 -231 -24
4486b4M1j84M05k11m9k15L91j17j16J64K2J45j85N4k92J98J36m3j32j54K20KJ8
$$ -24 17 -167 238 27 -22 -237 154 37 -79 85 107 252 67 121 -171 27 163 120 -12 -166 54 56 74
4509G4j54J10J53J92l85K62k87P7m64L03j46K04J2J00o0k2K62r6K2j30OM1j11
$$ 74 -80 30 183 375 -10 252 -35 42 -422 -119 -265 -61 -49 51 -9 -31 231 135 157 27 33 74 -37
4532c7p2L11l19K31M4j5j98J2J11K30l76J97J64l46M39m06k5p4j42L27j54J11
$$ -37 -109 202 -117 114 158 143 -55 -43 68 298 -78 119 283 -63 376 -30 -55 -129 -271 56 -98 13
4554A3m19L04qJ19Mn6j41Q4J71j24O7J9ml4J61k69J7J61j2j12J07q8o0JJ06J50
$$ 13 -406 -102 -110 9 13 -43 -184 -100 71 -53 14 33 29 -5 156 -113 -96 65 53 -59 48 -40 -100 -99 7 157
4580A57k90m6K85l59L79l58J43p0j4L79m54L16Q1q5k22J77o1J62j98N7j26J92
$$ 157 -133 -179 106 -253 126 -232 -89 -159 -173 206 -248 68 149 64 -158 19 -42 120 -78 -21 -147 45
4602D5k18L09j68N8r5n5J48NM5q5m1Rk14m7N61j81o2J32o6k29J66j17J51l07O0
$$ 45 -173 136 -32 26 -69 -124 24 29 74 -11 -52 -43 -257 -304 257 76 14 146 80 -149 17 -100 51 -256 -196
4627a96L68k82L54Qm65l4K54Q9j19p6Lr3K05j33M70k84j33J1J27k06K85j48J2
$$ -196 172 -110 244 252 -213 -247 7 96 -23 -99 -96 -189 16 -117 353 69 -64 -53 74 -132 153 5 17
4650A7J20K2l57L06K01n73L83k07j56K40q6J27l12J75L04l32L03k83J35K35l81
$$ 17 137 159 -198 108 309 -264 119 -88 -244 -4 -90 37 -275 -100 204 -128 175 -108 27 262 -119
4671a19J34l1M4r0K38j02n2L40l06J64l3k02J80m8q5k42J83j32K36j92k22M36
$$ -119 15 -16 28 -62 176 74 22 362 56 220 187 -15 165 117 32 -210 -27 -159 77 -115 -337 99
4693I9j11P9O0l78L53j70j04M0J70j74m6K49j07J95n9N1q6k99M3K83p3L3j21l7
$$ 99 -12 67 127 -251 102 -68 -172 -132 38 -136 -182 67 -40 155 96 147 61 -238 -195 88 15 48 -73 -110
4717a10Q0j65L94j56k15K97k69q5J31J09k42P3K37j61m0O6L32l46q6K31n5n1J92
$$ -110 -30 -195 199 43 -172 125 -144 -229 -98 11 -231 -158 79 -82 -122 -56 276 -70 -156 75 20 -31 161
4740A61k57J23k16jJ72K0J9Q1j34j9j08O6l2L47n0P3k90N8k23J7L12j2J87n97
$$ 161 -96 27 -189 -190 -18 2 21 102 -32 -51 -159 -93 -125 222 172 245 -45 13 -210 -193 119 107 294 -303
4764c03L61j0j3M2l0N0l41K74J70j76J22k55J55J00j25n1J35k7j10l1J20M3k66
$$ -303 58 48 35 77 47 97 -244 30 200 24 146 -109 46 146 21 -30 105 78 -32 -63 57 100 -166
4787a66J7J88r3o1j59L13q3l6k2K29M8P1r9j08j01j45M4j75M15l04M98j57k84
$$ -166 -149 39 -54 -115 -274 39 -44 -80 -102 127 175 246 147 39 -62 -207 -163 -338 77 -227 271 114 -170
4810a70J73j69K33j98J6J09r1K16N7j4j90P0k72K49k05J48J37k45J78l52K61m2
$$ -170 3 -166 67 -131 -115 -6 -97 119 176 162 -28 42 -230 19 -186 -38 99 -146 32 -320 -59 -101
4832a01M6J74k32n0K14J41M3k08j34J80o4j72L3J19J32j66J4Jk5L6l76K82n2L37
$$ -101 -55 119 -113 -163 51 192 235 27 -107 73 9 -163 -130 -11 121 -45 -31 -30 -55 -19 -395 -113 -165 172
4856A72j29P9k64J68j93P5Q5ln6J37M7k57o7L79k75J24l9m3k55K13J59J0j18N4
$$ 172 43 122 -142 26 -167 -92 -7 -10 -66 71 118 -139 -206 173 -102 22 -17 -60 -315 -102 57 67 -51 3
4880CJ5j40L55k51J29l01J32K04J13m56k8L06J86m23J14J06J16l4l20J64m7J41
$$ 3 18 -122 233 -18 111 -190 -58 146 259 -197 -225 81 267 -156 -42 64 180 146 -174 -10 -57 84
4902H4k22K77P8k96J51k11J21m6J41j17L00l61K47K4j01j38J79j1r2k73L64k55
$$ 84 -138 139 217 -79 72 -139 -18 -64 77 -40 260 -101 146 170 69 -69 110 99 7 -266 98 -157
4924a57l1K01K5j02O9J00K5j81N7j46L2m2K06l56K51j13P3j22J47m2J0P2m2j52
$$ -157 -188 13 38 -64 5 105 130 -51 6 -140 -108 -150 56 -300 -49 -162 -89 -211 -64 -106 -96 -24 -66 -218
4948b18L18l6k29K94j24p2J16J65k13J36k17l5J21M5j66K81j35J25j16o6M9j66
$$ -218 100 64 -165 129 5 -67 49 214 1 137 -80 -115 6 51 -115 166 31 156 40 -26 23 -143
4970a43M27k73j85J15J09Q2q8j2j24R9k55L25j15k27N62k55q1J72k83J97j46Q0
$$ -143 284 11 -174 -59 50 132 44 32 -92 7 -248 77 -38 -265 297 42 -39 133 -150 47 -99 -19
4992a9o9PJ66J14j27K03l77L1j01M7J83J11j37j60L6J60l7O3j36q6L46l24K22
$$ -19 -88 -81 85 199 72 275 -102 -71 -172 -125 58 169 32 -128 -92 68 31 94 -42 -128 218 -106 116
5015A16j81Q9J31K4l38lQ2m6L1J47k58M4L00j06J33K4l9k6k8k65K33j71P9L7K38
$$ 116 -65 24 155 179 -159 -162 -80 -126 -95 52 -206 -162 138 32 165 189 150 124 96 -169 64 -107 -28 9 247
5040B47k78k02J74rL79k25j98o2j06K77j02P2L04j46j60J30j93j93M35o0n6J34
$$ 247 -31 -233 -59 -68 311 86 -112 -174 -280 -3 -105 -33 271 125 -35 95 -98 -291 144 84 28 162
5062A62k44P4J38O2N1j35k93K1J89q1K95k45j02J87k36M5Q9J47k40M9l9M2M2J22
$$ 162 -82 -8 130 192 243 108 -185 -164 25 -56 239 -6 -108 79 -157 -112 -23 124 -116 -67 -106 -64 -22 100
5086A00J59j20l54J11J8J66m4p2J93m6j90k50M13j37K19r6q3k07K77n3l09L43
$$ 100 259 139 -215 -104 -86 80 36 -36 157 111 -79 -329 84 -53 166 70 -13 -220 57 4 -305 38
5108C8R1J2j23j70j0j19K04K7J22j27K31m34L47q4j13J60r2n8K06k30j02M7J27
$$ 38 129 141 18 -152 -162 -281 -77 -50 72 -55 176 -258 89 5 -108 52 -40 -98 108 -122 -224 -177 -50
5131e0J41m10J84J63j79n0L35j76k82K19K47P3l39J45M7M6k0R5k17r0K29j4j48
$$ -50 91 -319 -135 28 -151 -201 134 -42 -324 -105 142 215 -124 21 68 114 94 189 -28 -118 111 97 -51
5154e1k80J01K31j6k0J73j47K0lq2M7j05j8K15J09j19k62J15p4L2M02k55J88l85
$$ -51 -331 -230 1 -15 -35 138 -9 11 8 -74 -27 -132 -150 65 174 55 -207 -92 -166 -134 268 13 201 -184
5178a84K68m3m3q0O8j73K98J35l02J99l02J26O3N8k19R3j58K64K1j07Q3J73o7
$$ -184 84 41 -2 -82 -14 -187 111 246 -56 143 -159 -33 30 88 -131 -38 -196 68 89 -18 65 238 171
5201A71m30K56k13K67l4k06l5J96P2j25Q6j84J75N0j7P8r3j35J40k38J35K17j33
$$ 171 -259 -3 -216 51 17 -189 -224 -28 44 -81 5 -179 -4 46 29 107 14 -121 19 -219 -84 133 0
5224@O3o9k3j69J11M8K21k02N7Ok5J7M0j54r0K59r8j04J04j48L00M1l22J73k88
$$ 0 63 -6 -29 -198 -87 -39 182 -20 37 43 18 35 75 -79 -169 90 -8 -112 -8 -156 144 185 -137 36 -252
5249b52K59j33L38k76k50L74l68M00j78J99j59q2Q2k17K28J94L3n7k30J97m9j63
$$ -252 7 -126 212 -64 -314 60 -308 92 -86 113 -46 -128 -46 -263 -35 159 192 135 -95 102 53 -110
5271a10J78k21P5o2N7K62l60M5L4J84j56pk9J71k99K05K86k84n7L31j97n1Q6n6
$$ -110 68 -153 -78 -140 -83 179 -181 -136 -102 82 -74 -81 -110 61 -238 -33 253 -31 -88 243 46 -5 81 25
5295B5M0Lj41J36j36o9O2J03%Q7K0k88L7L4L2n5J96K14k50l7p0k14K73J52l21
$$ 25 65 68 -73 63 -73 -142 -80 23 23 110 130 -158 -121 -87 -55 -110 86 300 50 13 -57 -271 2 154 -167
5320a67J16Q1J05k06J74j70J63N0r2j07l9K41l56J16j14K45j72K70o7l88R5K09
$$ -167 -51 30 135 -71 103 -67 96 146 54 -53 -92 149 -207 -91 -205 40 -132 138 71 -317 -222 -13
5342a3j5j56L83j74j31J43m2K09J24m38o2K83j79j94K91K11m67R4K51r7r4L2K94
$$ -13 -28 -184 199 25 -106 37 -5 204 328 -110 -172 111 -68 -262 29 240 -227 -133 118 21 -73 -41 253
5365B53j50k24K37j53L70m20mj24J16j7J98j8K25n04M65j84k86L46l6j20l59L92
$$ 253 103 -121 116 -37 333 -87 -91 -215 -99 -116 82 64 289 -215 250 66 -220 126 90 -30 -389 3
5387Cm6J63L2j3p5p9J00j1j02p3L1L25q4k95L70l07K72k6j57J87M1r7k48j25L44
$$ 3 -43 120 152 139 64 -15 85 74 -28 -101 -70 255 171 -124 246 -61 211 185 28 215 256 159 -89 -214 130
5412A30J6k96L04n8q7q4k5J52l5j1r1K1J39l24J72j1J33Q3k91J88k55K42R9m01
$$ 130 146 -150 154 96 9 -75 -100 52 17 6 -85 -64 75 -249 -77 -88 45 128 -163 25 -230 12 111 -290
5436b90K09K91N9l44P9m5j25J34L02l84Q5J49j21j02q0L26j1j65J71M9j42O3j92
$$ -290 -81 210 269 -75 4 -41 -166 -32 270 -114 -29 120 -1 -103 -183 143 132 -33 138 187 45 108 -84
5459h4O3l6mn6J39n4K23q5k87o4K39L4l00M23q0K15j78R2l36J85p4J19k00o9K56
$$ -84 -21 -57 -61 -117 22 -32 191 106 -181 -245 -6 28 -272 151 71 286 108 200 -136 49 -25 94 -106 -175 81
5484H1k20L76j07P9k89%P0j23M9q4J79p6P8J19q7q5J76L0j29K28j95q8m12M38
$$ 81 -139 237 130 209 -80 -80 -10 -133 -84 -168 11 -65 13 132 45 -40 136 166 37 265 70 -18 -430 8
5508HM8j82L8k2R4j38L20j19J1M9j96M1J90j90K1R5k44K1J58K6R9Q7l30K16M1
$$ 8 56 -126 -88 -110 -16 -154 166 47 58 107 -89 -48 142 -48 -27 68 -176 -155 3 29 128 215 -115 101 142
5533A42o3N5J2k06k22K89jP4L6j29r5J79m1m3j29J14K30j62o9k2N0p9K06j14K2
$$ 142 79 134 146 -60 -282 7 6 80 116 -13 -108 71 30 -13 -142 -28 202 40 -29 -51 -1 -80 126 12 34
5558C4J57j65K16k08j8j4K2j35R4K95m17R8K9pM3j51J92M4j66J18r1j44n2M3K24
$$ 34 191 26 242 34 16 2 24 -111 -17 278 -139 -41 -12 -19 24 -127 65 109 -57 61 -30 -174 -226 -183 41
5583D1k2J13L5j92K42l38J43J2j24q4J69L39m67K46Rn9o7r3L9m4Q0m8Q3J35r1
$$ 41 19 132 167 -25 217 -121 22 34 -90 -174 -5 334 -133 113 122 63 -4 -97 -58 -102 -22 -70 13 148 57
5608E7j59J27J28rj27k03K13n7J1j30J75K16k91k70J51j07K37K5KL0J15K06j9
$$ 57 -102 25 153 144 17 -186 27 -30 -19 -149 26 242 -49 -319 -168 -275 -38 -13 -11 19 134 340 321
5631C21l08J22l59N1j0M23j63n8M4p6j5R1J18k8k53K60j26j7j69k1L01j14j12
$$ 321 13 135 -224 -173 -183 240 77 19 63 -13 -28 63 181 153 -100 160 34 17 -152 -173 128 14 -98
5654i8J85m9k13K60k31J9P3N5j53J32n0J23K72j34j51J00p7o2J8q1J94Kl44OK84
$$ -98 87 38 -175 85 -146 -127 -54 1 -152 -20 -70 53 325 191 40 140 63 1 19 -62 132 134 -210 -204 80
5679H0nk00J49j63P7r5J0J39Jl3J72O8n05J01N75l08K00n26M93l04J78K3m7k89
$$ 80 75 -125 24 -139 -62 -157 -147 -8 -7 -40 132 200 -305 -204 371 63 263 -263 230 -74 104 127 80 -209
5703b09K29N0pJ63m86O00n09j8J20N5L26m14K67k18m7K34K2K8j37J42j23%o3m4
$$ -209 20 70 63 226 -260 340 -169 -187 -67 -12 314 -100 167 -51 -98 136 158 186 49 191 68 68 5 -39
5727c9M9O3K70k94j22K91k31m5m%Q5j34J97j85rM0J74j7j61J97k9j80J44J50j70
$$ -39 10 73 343 49 -73 218 -13 -58 -62 -62 23 -111 86 -99 -108 -68 106 89 -72 125 96 -84 60 210 40
5752D0m4K35m68K02J44j49r5N9j73L26j06K12l75R0p2K71k6N4j46p6J07J14J05
$$ 40 -4 231 -237 -35 109 -40 -135 -76 -249 77 -29 183 -192 -102 -174 97 71 125 -21 -97 10 124 229
5775B29k74J48l25K64k18L21j79q0p3K44j44O3J88k75P7j60J40j33J79R6j51Q6
$$ 229 -45 103 -222 42 -176 145 -34 -114 -187 57 -87 -24 164 -111 -34 -194 -54 -187 -8 88 -63 23
5797B3l7K15k33j12L72k74j01Q5M3j43K85k84L81O3j69j7q1k24K81J1j42J69j13
$$ 23 -14 201 -32 -144 228 -46 -147 -62 -19 -162 123 -161 220 283 114 97 16 -208 73 84 -58 111 -2
5820bn9pK68j75J39j33J2j79Kj11K21k31J43K23k60J81R9j64j27L9K29k86J0J43
$$ -2 -61 -68 200 25 164 31 43 -136 -134 -245 -24 -255 -112 111 -149 32 131 -33 -160 -121 108 -178 -168 -25
5844b5K23k54J08N7l4J83m02R0K71J22o11J06K98l33l3J26l40K99J62j77K27N0
$$ -25 198 -56 52 109 75 258 -144 -54 217 339 -272 -166 132 -201 -234 -108 -448 -149 13 -164 63 113
5866A13M4k33J5j25K64j82K94J26l97J28j28K80j27l72L96j83j12K22o6K19j50
$$ 113 157 -76 -61 -186 78 -104 190 316 -81 47 -81 199 72 -300 96 -87 -199 23 -43 176 26
5887B6k31P7j55L57j49j07J30j51J43K04n3J16k43O4m0J79n62L29J35k31J46N0
$$ 26 -205 -128 -283 74 -75 -182 -52 -203 -60 144 91 207 -36 28 -12 167 -395 -66 69 -162 -16 34
5909C4K1r3j19k05K91L51m10L72l47J74j80O9kj66J7J29J19j05K42k89J71j5J12
$$ 34 55 -38 -157 -362 -71 280 -130 242 -105 69 -111 -42 -44 -210 -193 -64 55 -50 192 -97 74 59 171
5932A71J26l15p4J69l04K32n1M6K39l61J2J4N5q6J02J04n7j45K72q1p1m3M7l63
$$ 171 297 -18 -92 77 -227 5 -46 0 239 -122 -110 -96 -41 -127 -25 79 22 -123 149 68 -3 -46 1 -362
5956c62M68K18n66J58K7Q3n6j9J60n4J3j84K84l27J55j68j16K20K38J11j66k1
$$ -362 106 324 -242 -84 -57 26 -30 -49 111 57 70 -114 170 -157 -2 -170 -286 -66 172 283 117 96
5978I6l19M96k81mO1J35m56K16m8J38J18k24R4J21kO5l02J52N4n2R3j72p6K26
$$ 96 -223 273 -8 -12 49 184 -272 -56 -104 34 152 -72 22 143 141 206 -96 56 110 58 151 -21 -97 129
6002A29K4k64K62j32K33k69r9J49k87M48j92Q4l10J82k05L42j4J93n37p3L37N9
$$ 129 153 -111 151 19 252 -17 -116 33 -254 194 2 86 -224 -42 -247 95 81 274 -263 -336 1 60
6024F0k79K52p9K5j37J75j65j3K39J15k41k23K44M7o1J39J7j74p7L67l04q5N0
$$ 60 -219 33 -46 -21 -158 17 -148 -161 78 193 -48 -271 -27 20 -41 98 115 -59 -136 231 -73 -158 -108
6047a08Q7N8j19k25K15J51K09l56j42R1N2j04N7lM1J71j28j53M19k38K05k88p9
$$ -108 -21 37 -82 -307 -92 59 268 -88 -230 -139 -87 -191 -134 -137 -96 75 -53 -206 213 -25 180 -108 -187
6070a87J40n2J0K3j3J36L3R2l62J82J08q4k13J32k61L92N5r0J11J6j37l21L16
$$ -187 -47 -99 -89 -66 -79 57 90 182 -180 2 110 26 -187 -55 -316 76 131 41 152 168 31 -290 26
6093B6Q7n0Lq9j37J60q9P8k57L38m0j25m3K69j43J24j57J88J34l74K41q3j0j38
$$ 26 113 63 66 -23 -160 0 -89 -11 -268 70 30 -95 -138 131 -12 112 -45 143 277 -97 144 61 51 -87
6117h7J39J57j95Q6k04j6K39j45P5J66m50N6R0L70k56K28m46J58j08J45J54j64
$$ -87 52 209 14 100 -104 -120 119 -26 49 215 -235 -179 -89 281 25 253 -193 -35 -143 2 156 -8
6139hK14o04L38q4M43k39j37j3L7K31n1k78L62k87K24j71K49k06O3r6J10j09%
$$ -8 206 -398 -60 -144 299 60 -77 -90 -53 178 127 -151 211 -76 148 -23 226 20 83 -13 97 -12 -12
6162a2q4K16k41k64L61p7o7L0K89j54J09l14K31j3k2o8N1k7O4j06J12k5m4j2K35
$$ -12 -96 120 -121 -385 -24 -101 -168 -138 151 -3 106 -208 23 10 -12 -80 -29 -56 8 -98 14 -11 -55 -67 168
6187A68r3q7m9J46j97K51mk10NJ23j9j73M93m84J81k36J36J04m08N95k01j71P1
$$ 168 75 -12 -61 85 -112 139 135 -75 -70 53 34 -139 354 -130 51 -185 -49 55 -353 242 41 -130 -59
6210e9j17J11K1O5J2Q4J52n79N29Om00QK47k93R4lP4J55O9r1j65oj00K07R6k47
$$ -59 -176 -65 -44 21 33 117 269 -310 219 225 -175 -167 80 -213 -119 -122 -48 107 176 85 -80 -86 -186 21 117 -130
6236a30P1R4M3j16J74k13J65l92J66K95q3q5k42L39l14L08o3j42J38J2O9J7k7
$$ -130 -59 35 78 -38 136 -77 88 -304 -138 157 74 -11 -253 86 -228 80 17 -125 13 25 94 111 84
6259H4q6k38L70j59P8P5k63o3J99R9k10M3K77j18j40OPP7k15N7k7J49j29J90k52
$$ 84 -2 -240 130 -29 49 124 -139 -202 -3 96 -114 -71 206 88 -52 -46 -39 38 -177 -120 -147 2 -127 63 -189
6284a89K13K02k97J73k13J56p4j60K30l23L95K24l32k27J77p9K13q9M5QJ74l05
$$ -189 24 226 -71 102 -111 45 -29 -189 41 -282 113 337 5 -222 -45 -124 89 0 45 53 227 -78
6306g8pM05l64J53jl03J57L2O5j69J42M4K93m91J33K48j74l37L27k04K5j21o4
$$ -78 -85 320 -44 109 108 -195 -38 -6 59 -110 32 76 369 -122 11 259 85 -252 75 -129 -104 -225 -289
6329b89L13m5K46k74J71j15m49N93Ll14J55k31K00J66K42l33j69J30K9k24J66
$$ -289 24 -21 225 -49 122 7 -442 151 154 -160 -5 -236 -36 130 372 39 -130 0 29 -195 -29
6350b9j26K79l76L35k40k09L00j5N1O6k37L61j91M2j05R6k44J74J50l26J79K5
$$ -29 -155 124 -252 83 -157 -366 -66 -81 -30 36 -201 160 -31 11 -94 2 -242 -68 82 -244 -65 -40
6372d0J7j17J00J70J3l17K40Nk73L49k9j47J63l75M78k99L42k28J80m86L47q4
$$ -40 -23 -140 -40 130 143 -174 66 71 -202 147 118 -29 134 -241 237 -62 280 52 232 -254 93 9
6394Ij00K63l3j09j62n7K99J47k62J49N2j12K3kQ0K1j85k01N00k86lj98p1L12
$$ 9 -91 172 139 30 -132 -189 110 257 -5 144 196 84 107 105 185 206 21 -180 320 34 31 -167 -238 74
6418G4n6J79j77k04j47K01k2J79p9L8j19J91jl12K95J0j6J65r7j88r1J44K9L01
$$ 74 18 197 20 -184 -331 -130 -152 27 -52 -14 -133 58 57 -255 40 50 34 199 102 -86 -177 -33 -4 297
6442B97l17j70J77K34j19j2n7j41K10K6j38P4M9J26r2j77m0J81J09k92p8M24l47
$$ 297 -20 -190 -13 221 102 90 33 -108 102 128 -10 64 113 239 147 -30 -70 111 220 -72 -150 274 -73
6465g3mK4N1Q9J00o8l84N15n7l13K17K3K04j30j42K44m33M01k48o9K81m52J37
$$ -73 -77 -53 -2 87 187 119 -265 250 193 -120 97 120 324 194 52 296 -137 264 16 -53 228 -224 -87
6488h7K45q5j76j33L88k08J38j18J96n2k55O7l9O7K4J01J14k95k5K8l9J01j35
$$ -87 158 73 -103 -236 152 -56 82 -36 160 108 -147 -80 -119 -52 -28 73 187 -108 -133 -105 -144 -43 -178
6511a78L95l94o1L34j45J4L6K9P5o8n7p1K13j94MJ50n3j9K20j88p5L04l0k19J53
$$ -178 217 -177 -238 96 -49 -35 1 30 105 37 -20 -91 122 -72 -68 82 29 10 230 42 -33 271 241 22 175
6536A75j43n9K35l24M06j86k29k8K6K08O2l25J72j87J47K44j83J76j35r9j63K55
$$ 175 32 -27 208 -116 290 104 -125 -153 -127 81 143 -182 -10 -197 -50 194 11 187 52 -47 -210 45
6558D5J05k25j45L48m1K45k92k14M83n52N19m4l13P3j19J2J59kn5K19n19L33J27
$$ 45 150 -75 -220 128 87 332 40 -174 309 -243 276 232 -81 -8 -127 -115 44 42 -13 206 -313 20 147
6581A47l47J98J52k59J78k1j37J18J13j2k81K27K16j68l47M70l11j7J05j92K52
$$ 147 -200 -2 150 -109 69 48 -89 29 142 130 -151 76 292 124 -223 247 -64 -81 24 -168 84
6602H4k08K16p9Q7j99M67m57j01L96o6k16J75J05l27Q6j76K89j27J63k37J60J27
$$ 84 -124 92 13 100 -99 368 -89 -190 206 140 -76 99 204 -123 -37 -213 76 -51 112 -125 35 162
6624A62l11K12N5o2j03n8q4r0K49N3J43j48n1J09l36K20j22L18k71j85M16r3j64
$$ 162 -149 63 118 56 -47 -105 -189 -279 -30 23 166 18 -33 76 -260 -40 -162 156 -115 -300 116 23 -141
6647a41K49k27J80l9o0J51k48p7J6P5R0J99k01J83k63O4k0j00J85o2Q0l19M81
$$ -141 108 -119 61 22 -38 113 -135 -212 -196 -121 -31 168 -33 150 -113 -49 -69 -169 16 -46 34 -285 196
6670A96l34M4L75o3j10k99J29R6n5j72J62j70J64J35k14K40l6j79J37j78K68j65
$$ 196 -138 -94 281 218 108 -191 -62 34 -21 -193 -31 -201 -37 98 -116 124 88 -91 46 -132 136 -29
6692b9K00j04Q1j33J63k49n5K5K48m7l74M51J69l59J83j3l02K93l07Q8L29n4M2
$$ -29 171 67 148 15 178 -71 -126 -101 147 100 -274 177 346 -13 170 157 -145 148 -159 -71 258 204 246
6715B46l67J94j75K4J47l6J5jkj77L01j98J66j80J53J16l10k3M65j02l79J76l83
$$ 246 -121 73 -102 -78 69 33 48 47 45 -132 169 -29 137 -43 110 226 -84 -107 358 256 -123 53 -330
6738c30K03J89J9j97K47M1l06K70j8j29L11m13L30j02mj44o5Kk21L40k05P8J88
$$ -330 -127 62 81 -116 131 172 -134 136 118 -11 300 -113 217 115 111 -33 -98 -96 -317 23 -182 -104 84
6761H4J00j41j11K59j83k13M26m65K17k19K13k83K35J01j02R4k34M52o6k26M6
$$ 84 184 43 -68 191 8 -205 221 -244 -27 -246 -33 -316 -81 20 -82 12 -222 230 164 -62 -16
6782a6K25k66L6J42l73L42L04l61l6Kn1L6k84L07o7J71o7k25J66q7R7q1l2L18
$$ -16 209 -57 -21 121 -252 90 394 33 -3 -1 -52 -16 -300 7 -60 111 44 -181 -15 -102 -5 -86 -118 200
6806B00k32K70k36J19q8q8J43o1j29K34J8m79K85k59J38Q9K0J37j26j44L40R5
$$ 200 -32 238 2 121 33 -55 88 27 -102 132 150 -329 -44 -303 -165 -76 -56 81 -45 -189 151 246
6828B46k29o3J31k1j39q7L64k18L4q3K91j19n2R4k41K96K2l98j38M10J7k68K75
$$ 246 17 -46 85 64 -75 -162 202 -16 18 -65 226 107 55 149 -92 204 226 -172 -310 100 117 -151 124
6851A24l3l16L44k29J05K2j58M14p8m34J64K0O9L4J31o82M31k7J1K63k9m5k61
$$ 124 91 -225 119 -110 -5 17 -141 273 195 -239 -75 -55 14 48 179 -503 -72 -99 -88 175 146 101 -160
6874a60J83j12m6J31N1j56J07J28k24Mqm3K96j43o1J14J35j31j07Q0l67M03j06
$$ -160 23 -89 -135 -4 47 -109 -2 126 -98 -94 -102 -145 151 8 -53 61 196 65 -42 38 -329 74 -32
6897c2J8K67P0j52l37J91k28K37l48O92m99R8J1j48J73l22L64J15n8l03L25k84
$$ -32 -14 253 323 171 -166 25 -203 34 -314 378 -121 -23 -12 -160 13 -309 55 170 112 -191 134 -150
6919a50J57L22l95J90k25j56K74k84K03O9J25j84k3jj37O9J49j99J14N6P8j02
$$ -150 7 329 -66 124 -101 -257 17 -267 -64 5 130 -54 -77 -78 -215 -146 3 -196 -82 -26 52 -50
6941e0L0J24J82n90K58l2n3q3K73l9jM3q0J07l1j04R1O8m53N21l4K29l33j43J80
$$ -50 -20 104 286 -304 -46 -78 -131 -214 59 20 19 62 -18 89 58 -46 45 113 -340 181 147 376 43 -100 80
6966H0k37p7K38j46J82Jk19Q0N0N9K17m35J76J62J1k71j18J45K47l19K77n7p2
$$ 80 -157 -234 4 -142 40 41 -178 -98 -48 11 228 -207 -31 131 142 -129 -247 -102 145 -174 103 46 -26
6989b6R6N3pn0k47K16O3k98J34J74l2j37K54k11J2N4l3k84L9L41j81K89j53J03
$$ -26 70 123 116 66 -181 35 98 -200 -66 108 76 -61 193 -18 -6 48 15 -269 -230 111 -70 219 66 169
7013A69j6l57j11M40J4k29K97j90O8Kpk05o6M6M6L1K24k66k62N40P8j26M1J02
$$ 169 153 -204 -315 125 139 -90 207 17 85 87 80 -125 -191 -145 -99 -68 156 -110 -372 168 246 120 161 263
7037B63k39Rj26n8K92k73J84J33j37J0j92PJ32R6LKK4j28J68m72K17L28m90K01
$$ 263 24 33 -93 -151 141 -132 52 185 48 58 -134 -127 5 101 104 106 130 2 170 -302 -85 243 -247 -46
7061d6P4j75K47j54Q0j01k70K17o2Q6J79j66QM9M4jkJ35j18J66r2J47j69k28M20
$$ -46 28 -147 100 -54 26 -75 -345 -128 -190 -104 75 -91 -83 -34 10 9 7 142 24 190 98 245 76 -152 268
7086B68k57P5M1j54J2k38J83J70O7k1o4M1k65N0q8j97N3M10j87MJ87J25k63m5
$$ 268 11 86 127 -27 -15 -253 -70 100 167 146 82 123 -142 -92 -180 -377 -324 86 -101 -97 90 215 -48 -93
7110i3k6L5K41r6J53k01m23M20R4M4m1l78L03k66J27K43j54J47k45J67k93J04
$$ -93 -119 -84 157 61 214 13 -410 10 104 148 107 -271 32 -234 -107 136 -18 129 -116 51 -242 -138
7132a38J70j50O0m4j16L03m8k9j59Q4k4k8k08L70J5l51N27l71K55j53q6O3O1J07
$$ -138 32 -118 -58 -102 -218 85 37 8 -151 -67 -91 -119 -327 43 58 -293 234 -137 118 -35 -121 -58 3 110
7156A10q4j58J42p4Lj1MK5k3K21j18k6J04j76O7R5r7n3k23J05J34J57k07K95k18
$$ 110 26 -132 10 -64 -61 -72 -68 -43 -66 155 37 11 115 -61 6 101 4 -49 -272 -167 -33 124 -83 212 -6
7181fO6km1qj76K19q3K81m48J65J36k28K28p8Q2j12J67k27n1J22j05k95K49K24
$$ -6 60 58 17 9 -167 52 -31 250 -198 -33 103 -125 103 25 107 -5 162 -65 -116 6 -99 -394 -145 79
7205G9j25K81o5j72j59l2L12m83L7M48k98K72L5k14K24j78k36M73l48L50j36J92
$$ 79 -46 235 170 -2 -161 -193 119 -364 -327 121 -177 95 130 -84 140 -38 -274 199 -149 201 65 257
7227B57O6l27p8o0p8J49J92j65J28l9l1K38k68l1K66k95j24N9K71k61J08L1j14
$$ 257 323 -4 -82 -142 -220 -71 121 -44 84 45 14 252 -16 -47 219 -76 -200 -141 130 -131 -23 8 -106
7250a06k46Q3K91j31K85Q7n3k4m4o6p3l9J78l46K10L3M9k66K55J17r9j2j28j5
$$ -106 -352 -269 22 -109 176 263 210 186 142 76 3 -36 142 -204 6 39 88 -178 77 194 95 83 -45 -60
7274f0K08j63J61n1j79J53j81J82j86k44M00O8J72k57l1j1j6o5J2L12J7j34J3
$$ -60 148 -15 146 95 -84 69 -112 70 -116 -360 40 108 280 23 -8 -19 -35 -100 -88 224 241 107 120
7297A20l59L44p2J43J11m41J49jo9o9M48o03L07j67J96j1K26k20Q8q8K5lk85J45
$$ 120 -239 105 33 176 287 -154 -5 -6 -75 -144 304 -299 8 -159 37 26 252 32 120 32 57 54 -231 -86
7321h6l3M13l12J63Q1J04k18j86P4J14j74j1J00J7J55k68R2K31l19j00K84k53
$$ -86 -119 294 -18 145 226 330 112 -74 0 114 -60 -71 29 46 201 -67 25 256 -63 -163 121 -132
7343a32L3rK32l05Q9K65n8o4J24M1l93l2L54j72o9O8j26J20K8J8L14j36l33P8
$$ -132 -99 -108 124 -181 -92 173 115 51 175 216 -177 -209 145 -27 -96 -28 -154 -34 -6 12 326 190 -143 -65
7367f5J39q4j16j10L5K14K33j30j80K17k25K27p5j14J58n5J16J81l11j35J01k38
$$ -65 74 -10 -126 -236 -201 13 246 116 -64 153 -72 155 80 -34 124 69 185 366 55 -80 21 -217
7389b17J93L04j60r5K5k67J68j34J58q5M0j11J05J72n5L46n01K76j96PO9Q5m77
$$ -217 -24 280 120 25 50 -217 -49 -183 -25 -110 -70 -181 -76 96 41 387 -114 162 -34 -27 42 127 -350
7412c50L15M52k33j48Q9k86O5O7M4J10j89Q2J06k35K18j14K44j91l71J62k7L24
$$ -350 -35 417 184 36 125 -161 -96 -29 15 125 -64 18 124 -111 107 -7 237 46 -325 -163 -190 134
7434A34j32m0n9J98j00K96l49j50J26J49m1j27l4J65l2J23j42Q8k5J13J6m3q5
$$ 134 2 -38 -97 101 1 297 -52 -202 -76 73 32 -95 -129 36 4 127 -15 73 48 161 177 134 49
7457D9O2j71K28j26K5p6M3K1k65K63J01k87k4K26j53J11k75M15j28m6P0Lj26J42
$$ 49 111 -60 168 42 67 -9 34 55 -210 53 154 -133 -157 69 -84 27 -248 167 39 -7 63 66 -60 82
7481H2o5O9k26L98k27j32K4j38J21J33l1r3J79j59m6K4J83L1q5j65K96l34J29
$$ 82 17 86 -140 258 31 -101 -77 -215 -94 39 8 -85 94 -65 -111 -87 96 127 42 -123 173 -161 -32
7504c2P5q1J2P4k70L10m2N4n2K42l64P0L3r0q1J15K63k77J06O4j61q9m0K89jn19
$$ -32 43 -38 -26 48 -222 88 46 100 48 290 -74 -4 29 -61 -142 -27 236 -41 65 129 -32 -121 -161 128 127 -392
7530c92M87l23K78m3k17J28L12k42k2J92k94l4K55j4j62O4n1PJ26P8k10K89k11
$$ -392 95 -228 50 7 -210 -82 230 -12 -34 158 -136 -170 85 71 -91 -27 -78 -71 55 133 -77 212 1
7553AJ92n9k94J67l02L35k99N26l23j16J51j57J22L13l91P3K44k98n7J36J64j49
$$ 1 193 134 -160 7 -295 40 -259 267 -56 -172 -21 -178 -56 257 -134 -61 183 -115 -172 -36 128 -21
7575b1J16j88NJ10J85k73Q5m4r9J20J51n9n8j95L84m86L04j5j38K52j48n7J35
$$ -21 95 -93 -88 22 207 -66 19 -25 -124 -4 147 88 30 -165 219 -267 37 22 -116 136 -12 -69 66
7598F6J34k26J2j38J00P4J79n9j97J10r4k1p7L85l22M6q5J34O8L9k39R5o5O4l2
$$ 66 200 -26 -14 -152 -52 22 201 142 -55 55 -39 -60 -137 248 -74 -28 -113 21 89 128 -111 -16 -81 -17 -49
7623d9L32j97p6Qr6K21j96k98K11P2J80r9Q2j66R5j0q9L49l54j67L14J3j88J38
$$ -49 283 86 10 18 -78 143 -53 -351 -140 -68 112 13 95 -71 24 14 -75 274 -80 -247 67 80 -108 30
7647C0j78K31j96P1P4k44M1L05j75N7J02J6k03j06O4J13J40l00J89K69l57j81
$$ 30 -148 83 -113 -42 32 -212 -171 134 -41 16 118 134 -69 -175 -111 2 142 -158 31 300 -57 -238
7669b38J79J94q2j13R1J0j00J73P8k11O7J88j27l11K60m7M09m19k00j45M22M3
$$ -238 -59 135 53 -60 31 41 -59 114 192 -19 48 236 109 -202 58 11 420 1 -199 -344 78 121
7691A21k52K37l37K17r3K89j09k45M74l26J15j0k47J79q7J7r0k2L05m47J36O8
$$ 121 -131 106 -231 -14 -107 182 73 -172 302 -24 91 81 -166 13 -74 -57 -147 -169 136 -311 -175 -107
7713a07L11j27J34k84l18L97O2k0n0p3J71j5j13n5P8J62m2J16m70J68m3J80p9
$$ -107 204 77 211 -73 -391 6 68 48 -2 -75 96 81 -32 -87 -9 153 111 227 -243 -75 -118 62 -17
7736a7p8K10J78j11l46o2Q2m7Q2J79J92l13r3P8J76J8k09J85j35J1j35k14M77
$$ -17 -95 115 293 182 -164 -226 -144 -191 -109 70 262 -51 -144 -66 110 128 -81 104 -31 -20 -155 -369 108
7759A08Q4m39J93J98m17K56m2j58J58p1K56M0n1J06j17K86m23O8o6k44M37j08
$$ 108 192 -247 -54 144 -273 -17 -59 -217 -59 -130 126 166 115 221 104 390 -33 35 -31 -275 162 54
7781E4J88j03j17l8J59k1k42M7o2j4J1K30j22l16L41Q6k73J38j16K30J9k02J26
$$ 54 242 139 22 -16 143 122 -120 -73 -135 -149 -138 92 -30 -346 -5 81 -192 -54 -170 60 79 -123 3
7804Cn8%J40j39l6pO4J95K7j2k79K18p7m05L47j03K99k60k09K7L15j47o8J64L5
$$ 3 -55 -55 85 -54 -90 -97 -33 162 189 177 -102 116 39 -366 -19 -122 177 -83 -292 -265 50 -97 -165 -1 34
7829C4M3m65K99J55R6m09K12m3k5O6L2J4k2n5J02J38n0k48l7L38l53K47k02P5
$$ 34 77 -388 -89 66 162 -247 -35 -78 -103 -37 -5 9 -13 -68 34 172 122 -126 -163 175 -178 69 -133 -58
7853e8J32l27m2L34j16j84K60O2j72k20K48k08O04l74l3l52L24R6M4j9k75Q4K59
$$ -58 74 -253 -295 39 -77 -261 -1 61 -111 -331 -83 -291 313 -61 -94 -446 -122 -26 18 -1 -276 -192 67
7876F7k4L3j40K5O2k58J43o7M35m31R8J59J77m18K52j52j35J80K1J5k51J29J06
$$ 67 43 76 -64 -39 23 -235 -92 -159 276 -155 -57 102 279 -139 113 -39 -174 6 27 42 -209 -80 26
7899B6Q8o1p2m8N0j44R3%O1n3j38J67O6l7J85k62J14r3R0K3l40M48l07M0M45m97
$$ 26 114 53 -19 -67 -17 -161 -68 -68 -7 -60 -198 -31 35 -2 183 -79 35 -58 32 55 -285 163 -144 -104 341 -156
7925a56J53Jp8j84L25j64M8J85qJ28J78n18K93j56q5j69j59K43n8j84M69p9Q6
$$ -156 -3 -2 -80 -264 61 -103 -55 130 122 250 428 -90 203 47 -38 -207 -366 -123 -181 -365 104 25 111
7948A11j12j44J44q9Q3k20K82J66J7k13j51K01n6J01J23k00k06J98L5j27K77l63
$$ 111 -1 -145 -1 -90 -7 -227 55 221 238 25 -126 75 19 120 243 43 -163 35 70 -57 220 -143
7970a43O9k17K97K47l22L39k10j00J78n7l6R9m09K85j21L54l22K8K08m14K88j28
$$ -143 -74 -291 6 253 -69 270 60 -40 138 81 45 144 -265 20 -101 253 -69 -41 167 -247 41 -87
7992h7J39N4l73K25J66l37J14J82k3k09M80m59Q5K0j05J31J92L04m72J56j79J78
$$ -87 52 106 -267 -42 124 -213 -99 83 60 -149 331 -128 -43 -23 -128 3 195 499 27 183 4 182
8014A82N0k74R4o4K55m22q9K37J6J05k17J82J69l07J1n5J93k6q9N3J8j42K35J1
$$ 182 232 -42 52 -12 243 -179 -268 -31 -15 90 -127 55 224 -83 -72 -127 66 40 -49 4 22 -120 115 126
8038A26l7j58n8K0j60K89l6j8M1M4K46j63j66J03q6k08J83j5j40O3q1L76j58Q5
$$ 126 89 -69 -127 -107 -267 22 -14 -32 9 53 299 136 -30 73 -13 -221 -38 -53 -193 -130 -211 165 7 92
8062I2j56K06Mk20J52J61m05K58j03j32j22J86j48K22j17J58q6K8J99k96P3j52
$$ 92 -64 142 146 -74 78 239 -166 92 -11 -143 -265 -79 -227 -5 -122 36 -50 -22 177 -119 -46 -198
8084a98L23l72J08M71l92j32p7k02N66n6p3j3M3p2k0Q7J82j17J27P0j65j45K9
$$ -198 125 -247 -139 332 -60 -192 -269 -471 95 39 -34 -47 -4 -76 -96 -9 173 56 183 253 88 -57 -28
8107b8j98M99j65k24L34k21j6mn5R6K1L52m18O0o7k03K75K90m55J9L08q2k71K7
$$ -28 -226 273 108 -116 218 -3 -19 -23 -78 18 39 391 -27 33 -34 -237 38 328 -127 -108 200 118 -153 -126
8131a26k73R5K81r8L36J30l57j65K90L8l0lj24j28K42j1mP1k82K21l2J24k35K06
$$ -126 -399 -304 -23 -121 215 345 -12 -177 113 151 121 118 -6 -134 108 97 93 164 -118 103 71 195 -40 166
8155A66k33j02N9r7J44K03j88j18J32j41K30P0N1k03K20J19l13J14l07K03K85
$$ 166 -67 -169 -110 -207 -63 140 -48 -166 -34 -175 55 125 176 -27 193 312 -1 113 -194 9 294
8176B94l05j98O6L5RJ63J39k80m1K0l7L35J23m70K26
$$ 294 -11 -209 -143 -108 -99 64 203 -77 -118 -98 -135 200 323 -147 79
8191G9
$$ Imaginary data points
##PAGE= N=2
##DATA TABLE= (X++(I..I)), XYDATA
0@%%%%%%%%%%%%%pJ5j6J6j6J7k5L2m0M8n6O4p2Q8j03J18j35J52j70J94k23K54
$$ 0 0 0 0 0 0 0 0 0 0 0 0 0 0 -7 8 -8 8 -8 9 -16 16 -24 24 -32 32 -40 48 -55 63 -72 80 -90 104 -119 135
35A35k86L19l58M00m45M98n54O14o83P55q33R20j015J120j233J358j496J648j818
$$ 135 -151 168 -190 210 -235 263 -291 323 -360 395 -438 482 -533 587 -646 712 -784 864 -954
54i54K008k221K462k736L054l428L872m407N074n933P078q697J1179j5511K5279
$$ -954 1054 -1167 1295 -1441 1613 -1815 2057 -2350 2724 -3209 3869 -4828 6351 -9160 16119
69A6119r1687J5027J04299o6397J19L3458J0725j1296J7998j7856p060J3932O66
$$ 16119 -75568 -60541 43758 -22639 -22520 10938 21663 10367 28365 10509 3449 17381 18047
82A8047k1241J1417M499j0475k256K069j4488O051Q328j6246j1235J9935P628
$$ 18047 -3194 8223 12722 2247 -9 2060 -12428 -6377 1951 -14295 -25530 -5595 2033
95B033q696p8P354L287M907j195l812J929J935m364J353L91p255j573N307l762
$$ 2033 -6663 -6741 613 3900 8807 7612 3800 5729 7664 3300 4653 5044 -2211 -3784 1523 -2239
111b239l933N065k38n428K416M567r40j146J08P7L911K247m150j188M847K60l702
$$ -2239 -6172 -1107 -1345 -6773 -4357 210 -730 -1876 -1768 -1691 2220 4467 317 -871 3976 4236 534
128E34N20O98j348j321j170o75J808J878l323k098M453N110j951m628Q1L894M69
$$ 534 1054 1752 404 -917 -2087 -2762 -954 924 -2399 -4497 -44 5066 3115 -1513 -1432 2462 2931
145B931l175k246N30K763L78l017p55M069J308m281q99K835M09n63j078j176K373
$$ 2931 -244 -2490 -1960 803 1181 -1836 -2591 1478 2786 -1495 -2394 441 850 287 -791 -1967 406
162D06M437k045m852K310L771k650l069m02p3J029R67k176j025L638R40j899L32
$$ 406 4843 2798 -2054 256 4027 1377 -1692 -2094 -2167 -1138 -171 -2347 -3372 266 1206 -693 -361
179c61J765o66N40m08j321J539J762j531k393J761J437j786j348k75m06J402l49
$$ -361 1404 738 1278 870 -451 1088 2850 1319 -1074 687 2124 338 -1010 -1285 -1691 -289 -638
196f38k188N45K632j34j009R13R90r4M89n00n08J239j97k192qJ484m10j221j79
$$ -638 -2826 -2281 351 217 -792 121 1111 1017 1506 1006 498 1737 1540 -652 -660 824 414 -807 -986
215i86J91M98N12j051j118J622R65j187m07J588M14m95M91o84M21R23o67j805
$$ -986 -795 -297 215 -836 -1954 -332 633 -554 -961 627 1041 546 1037 353 774 1697 1030 -775
233g75K37J255q71j124R1M39Q26L22r19J9J325M23j270r14J332K56n13r7l19M06
$$ -775 -538 717 -154 -1278 -1187 -748 78 400 -519 -500 825 1248 -22 -936 396 652 139 42 -277 129
253A29Q41r76j100R38O26p39r53M81O56L94j38k85K83Q93o4p71m37Q49l16o35
$$ 129 970 -6 -1106 -168 458 -281 -1234 -753 -97 297 159 -126 157 1050 986 215 -222 627 311 -324
273c24ro44Q46K92q08M4N17O92n84k14nM88J15m61j46N05M44m39m08q8N69K7q12
$$ -324 -333 -977 -131 161 -647 -603 -86 606 22 -192 -197 291 406 -55 -201 304 748 309 -99 -187 382 409 -403
296d03k53L05J52j04o58L21P58L81m71k61O82K18j1o30k48L23J80k65p17L90L03
$$ -403 -656 -351 -199 -303 -961 -640 118 499 28 -233 449 667 656 26 -222 101 281 16 -701 -311 -8
317hK24m47q8L42O6l52j61K37K45J12l69K71L74kl31k05L47J18N2o25k98L80K74
$$ -8 216 -231 -319 23 89 -263 -424 -187 58 170 -199 72 446 444 113 -92 255 373 425 -200 -498 -118 156
340A56l63j47P5L22j06j1M4N9J11n6j30J82J32J57m42J07K27Kk96M3l01M47k01
$$ 156 -207 -354 -279 43 -63 -74 -30 29 140 84 -46 136 268 425 -17 90 317 319 23 66 -235 212 11
363A1l86J52j90K81J78j84K58K20K1j02m26M25k18K97k72L2j80K71r3k36J75o2
$$ 11 -375 -223 -413 -132 46 -138 120 340 361 259 -167 258 40 337 65 97 -83 188 95 -141 34 -28
385b8j23N9j14J31L17k37j31L35J84k78p1j07Q3j21K61k11j00k6l6L13j57K8K72
$$ -28 -151 -92 -206 -75 242 5 -126 209 393 115 44 -63 20 -101 160 -51 -151 -177 -213 100 -57 -29 243
408B43k99L11k72K07O2k81j23J38L10k02j04Q3qK07O9l79N9k19m0K01j66M23j00
$$ 243 -56 255 -17 190 252 -29 -152 -14 296 94 -10 73 65 272 341 -38 21 -198 -238 -37 -203 220 120
431A20j30j46L58j47J70j26o0J7p0k12j13L27j7j13K22r1K5K78j99J17j30J51
$$ 120 -10 -156 202 55 225 99 39 56 -14 -226 -339 -12 -29 -142 80 -11 14 292 93 210 80 231
453B31k97K9J81m1K26j9l46l5K25l27J88O5j20j54N6q9J48O0J2K06k16J39k7l6
$$ 231 -66 -37 144 103 329 310 -36 -71 154 -173 15 80 -40 -194 -138 -227 -79 -19 -7 199 -17 122 95 59
477E9O5j72J48q8Pj5L0k20l1L30r8L2m09M32j81J40R5j76O8k7K77m9j21o4J53
$$ 59 124 -48 100 12 19 4 34 -186 -217 113 15 47 -362 70 -111 29 124 -52 16 -11 266 217 96 32 185
502A85k00L71k3k90J21R9l97l1Qo1L24P3j44J94r0k20N9J63l2O1j2J60j40L6q1
$$ 185 -15 356 333 43 164 263 -134 -165 -157 -218 106 179 35 229 139 -81 -22 141 109 170 158 318 178 214 133
527A33r5K44j59NM5m32K96j52L97m84J03K22O7j68j73j02J28N01j88j14k00k9
$$ 133 38 282 123 128 173 -259 37 -115 282 -202 -99 123 190 22 -151 -253 -125 376 188 74 -126 -155
549a55N4N0p7r3K12J52l59M49l5J28n29L42m36J79L83j82J20j71j15M2k25M3L80
$$ -155 -101 -51 -128 -221 -9 143 -216 233 198 326 -203 139 -297 -118 265 83 203 32 -83 -41 -266 -223 157
572A57l11M12Q5l15M8m4J18Q3n43K26J8J0m7K26j73JJ64m5r7J05p1k62K78K04
$$ 157 -154 258 343 28 76 32 150 233 -310 -84 -66 -56 -103 123 -50 -49 115 70 -27 78 7 -255 23 227
596B27j36p6K42J64q7k28j17m9J67j94J56l5j24K1J02Rq2j01m6K34J06m8j16p7
$$ 227 91 15 257 421 334 106 -11 -60 107 -87 69 34 -90 -69 33 42 -40 -141 -187 47 153 105 -11 -88
620h8j16N4J0J2K47j29K48j33O2j83jM3L7m8j32j4M8J67k08K20J91l44m6K83l50
$$ -88 -204 -150 -140 -128 119 -10 238 105 167 -16 -17 26 63 15 -117 -131 -83 84 -124 96 287 -57 -103 180 -170
645a70J49m8j02K52l26K65M6j72L6M7l3q8M23k29K42n18J67r2L32M9k07n8M1%
$$ -170 -21 -69 -171 81 -245 20 66 -106 -70 -23 -56 -144 279 50 292 -226 -59 -151 181 230 23 -35 6 6
669Fr7J5q1M42n13L7M45k85J21j49L54l90J40j48J59p5J39N1l7K09j05j89R0j94
$$ 6 -91 -76 -157 285 -228 -191 254 -31 90 -59 295 -95 45 -103 56 -19 120 171 134 343 238 49 139 -55
693e5Q3M4q7m7K60m3l42K9L09k22Q9L7M5l05L63j27j90J28J14J20j79J46k21J0
$$ -55 28 72 -15 -62 198 155 -187 -158 151 -71 18 55 100 -205 158 31 -159 -31 83 203 24 170 -51 -41
717d1N4k47M42qq7k86J7O0K54j39J50j45o0K3J68m57J70n4J62k8p9j18q7M28l31
$$ -41 13 -234 208 200 113 -173 -156 -96 158 19 169 24 -36 -13 155 -302 -132 -186 -24 -52 -131 -249 -336 92 -239
742b39J0J33L62j40j18j50J1L27k50%j75L51k2l9N8k7j21K18n7l28M05m57K40
$$ -239 -229 -96 266 126 8 -142 -131 196 -54 -54 -229 122 100 61 119 92 -29 189 132 -196 209 -248 -8
765hO0M9k42Q5J54n5K48m43Kl6L39j21o7J44j26r5Kj05K27K61j89k80J77L64l24
$$ -8 52 101 -141 -56 98 43 291 -152 -150 -186 153 32 -35 109 -17 -112 -110 -215 12 273 84 -196 -19 345 21
790B1j76L65l13K6j50K43m8K6j4j3j70K13Q0j17J0j00L31n17L32N5l64K23N6J00
$$ 21 -155 210 -103 -77 -227 16 -32 -6 -20 -33 -203 10 90 -27 -17 -117 214 -303 29 84 -280 -57 -1 99
814I9j01r1K29j88k09K36n2l7K50j07q1J03k46J6j40O0K77j20jJ97l2J17j53j18
$$ 99 -2 -93 136 -52 -261 -25 -77 -114 136 29 -52 51 -195 -179 -319 -259 18 -102 -103 94 62 179 26 -92
838i2Q1k7L4j67L3Q8r6J45Q3j22o9K70k0N8P5l22o6J25q5n8L98m36J74j13J22
$$ -92 -11 -38 -4 -171 -138 -50 -146 -1 82 -40 -109 161 141 199 274 -48 -114 11 -74 -132 266 -170 4 -109 13
863A3q3K68N8j28j98M10m21M7K72l41KL11j28j12K01m73K39M1l2J26k0l7j69L36
$$ 13 -70 198 256 128 -70 340 -81 -34 238 -103 -101 210 82 -30 171 -302 -63 -22 -54 72 52 15 -154 182
887A82j12q5R6m9k5j27m5K93j18p2K45k47K36l19J50L06m00M03l31j51K1q5N68
$$ 182 70 -15 81 32 7 -120 -165 128 10 -62 183 -64 172 -147 3 309 -91 312 -19 -170 -149 -234 334
910C34k56j30m6J04j37P2K23k26K41p2J52k5l55J0j8J76l4l2J19k40J91n0j9j93
$$ 334 78 -52 -98 6 -131 -59 164 -62 179 107 259 234 -121 -111 -129 47 13 -19 100 -140 51 1 -18 -211
934b11L02J49j06m82L39k8K7J35k60L27k32j9k92M30p7P9j60km6J11j51j3J91
$$ -211 91 240 134 -348 -9 -37 -10 125 -135 192 -40 -59 -351 79 2 81 -79 -81 -127 -16 -167 -180 11
957A1j7p6J21J1k32L68l02M2K12k38p0J22j8J08j64J47r3k10J9L69j2k57m3L6
$$ 11 -6 -82 39 50 -182 186 -116 -74 138 -100 -170 -48 -66 42 -122 25 -68 -278 -259 110 98 -159 -202 -166
981a66L49l47M3L48k51l6K85j26M9j97J89k79J74Rj10K26j86N0n4j12K39k91J58
$$ -166 183 -164 -121 227 -24 -60 225 99 148 -49 140 -139 35 44 -66 160 -26 24 -30 -142 97 -194 -36
1004c6k11J34J84o1Jr0M8j75J95p6L67k59L0j66P6J46R5k49J31j31J14j16j85
$$ -36 -247 -113 71 10 11 -79 -31 -206 -11 -87 280 21 51 -115 -39 107 202 -47 84 -47 67 -49 -234
1027b34K60o5K82l44J5P6j39J50K59o0k27Q8k00J99J60j15n8N2J13q7j14k23M27
$$ -234 26 -39 243 -101 -86 -10 -149 1 260 200 -27 61 -139 60 220 105 47 99 212 125 11 -212 215
1050B15m08L56k0j75p2J09J61m3k52n0L28l77K47n9R7J27k73J19m9l5Q7o7K90
$$ 215 -193 163 143 -32 -104 5 166 123 -129 -179 149 -228 19 -40 57 184 -89 30 -19 -54 33 -34 256
1073B56l74L65k19j5j8Q5j27Mq4K96O3l02J62N0n2k6P3J55k82J52k44O4j71k02
$$ 256 -118 247 28 13 -5 80 -47 -43 -127 169 232 -70 92 142 90 64 137 292 10 162 -82 -18 -189 -391
1097c91M84j09M4J31p5Q0j34j09j05m1K95j37J51m5j12j71K01k06K8K63J35j82
$$ -391 93 -16 28 159 84 164 30 -79 -184 -225 70 -67 84 39 -73 -244 -43 -249 -221 42 177 -5
1119ej30L5J48j72Q5k06L54J15m88K59nn9R9J07j13j10j20L28mk03j0j28J03J08
$$ -5 -135 -100 48 -124 -39 -245 109 224 -264 -5 -10 -69 30 137 24 -86 -206 122 118 -85 -95 -223 -120 -12
1143a2j08%J72m5k89N33k03k6j4K2N4j02K86%j51j02LR2M4j67j96N01j94p9j15
$$ -12 -120 -120 52 7 -282 251 48 22 8 30 84 -18 268 268 117 15 18 110 154 -13 -209 292 98 19 -96
1168i6j0J02qp7q1L35k22j34K11J19J86m27K58m27N75k88l32N87k37j69J39j78
$$ -96 -106 -4 -12 -89 -170 165 -57 -191 20 139 325 -102 156 -271 304 16 -316 271 34 -135 4 -174
1190a74N03q3l20k9%K21qj04m8n7j21O32l19k69j33N7L45J02o8j79L20k18J64
$$ -174 329 246 -74 -103 -103 118 110 6 -42 -99 -220 412 93 -176 -309 -252 93 195 127 -52 268 50 214
1213B14m97L49K0k03L8K95j04K65l46K42k20K28l12N8K87k72l22J05K60J3j51
$$ 214 -283 66 86 -117 -79 216 112 377 31 273 53 281 -31 27 314 42 -280 -175 85 98 -53
1234e3q4J30J22k32K28n07J93jn5K71M4q8J14J83j52q1J95l25J62j13K49j81j78
$$ -53 -137 -7 115 -117 111 -396 -203 -204 -259 12 56 -32 82 265 113 32 227 -98 64 -49 200 19 -159
1257a59M32l78J8J6q1j5o8M6o1N5N11l29pp9p1K76J60j1j82lo7J25j70P6l13K42
$$ -159 273 -105 -87 -71 -152 -167 -235 -189 -250 -195 316 -13 -20 -99 -170 106 266 255 73 70 3 128 -42 34 -279 -37
1283c7j56K96m17K40J16m8L26n63L17k56K04q9K06j37k87K67J09L19n11J03k39
$$ -37 -193 103 -314 -74 42 -6 320 -243 74 -182 22 -67 139 2 -285 -18 91 410 -101 2 -237
1304b37J10n9J91O3j81q7J2J4J89O5L6k64K6J26J98j20l23K85J35j84j5J9P6L53
$$ -237 -127 -186 5 68 -113 -200 -188 -174 15 80 116 -148 -122 4 202 82 -241 44 179 -5 -20 -1 75 428
1328D28l47k35J32J4k3J8K6J29J82n44K74k29j20L35N9J07k75j4J75M5k41J95
$$ 428 81 -154 -22 -8 -31 -13 13 142 324 -220 54 -175 -295 40 99 206 -69 -83 92 137 -104 91
1350I1j41j09K87q9K2K00k93L5k22K8j5N50l28K8L9l50L17J47j42o8J37j55K10
$$ 91 -50 -159 128 39 61 261 -32 3 -219 -191 -206 344 16 44 83 -267 50 197 55 -13 124 -31 179
1373A79j32j4k70N14k05l0m0p3J02l4j83K71J53m27K16J3j0j93K92k3j99R9k69
$$ 179 47 33 -237 277 72 42 2 -71 31 -3 -186 85 238 -189 27 40 30 -163 129 106 -93 6 -263
1396b63K60j87L20k35L9j22J59P5J58o7Jj42J20j62L85l61j24N6N7l3k11M90k42
$$ -263 -3 -190 130 -105 -66 -188 -29 46 204 137 138 -4 116 -46 339 -22 -146 -90 -33 -66 -277 213 -29
1419b9P0j7l7j78J8K73j55J97k1j21K41j85o0R6o5Q8l28K82j36q8k9j00N16q5
$$ -29 41 24 -13 -191 -173 100 -55 142 121 0 241 56 -4 92 27 115 -213 69 -67 -155 -184 -284 232 147
1443A47k91L9K39q6n0mL9K30l49K40k69J02L2L03n51K05p6n0L53l84L49j33q1
$$ 147 -144 -105 134 48 -2 -6 33 263 -86 154 -115 -13 19 322 -229 -24 -100 -150 203 -181 168 35 -46
1466d6J35J95k14N6k52K73k17P3p9L67l08J9j19l4m3K84k32Q2J15J73k86J42n9
$$ -46 89 284 70 126 -126 147 -70 3 -76 291 -17 2 -117 -151 -194 90 -142 -60 55 228 -58 84 25
1489B5p9R5L8r8j2K67j62k19J67N7j49r8r9K82MJ53j50J7P5o5r1jR4L2L2L0O6
$$ 25 -54 41 79 -19 -31 236 74 -145 22 79 -70 -168 -267 15 19 172 22 39 114 49 -42 -43 51 83 115 145 211
1516B11q4j14n6k8m8P5J01J04m7m60L17j34J00L1J29r3j45P4L61j21L1k31K0J60
$$ 211 127 13 -43 -71 -119 -44 57 161 114 -346 -29 -163 -63 -32 97 4 -141 -67 294 173 204 -27 -7 153
1540A53L0l59J0M11k38j85L19k57J35j25K33L0n9p0K09l74J46k6J07j85OO1K24
$$ 153 183 -176 -166 245 7 -178 141 -116 19 -106 127 157 98 28 237 -137 9 -17 90 -95 -89 -28 196
1563A96l13L74l55q5K47j03K10j07O9k78M14r6rm79L86L2j5l52J01m7J96Q3k36
$$ 196 -117 257 -98 -183 64 -39 171 64 133 -145 269 173 164 -315 71 103 88 -264 -163 -210 -14 69 -167
1586a67L64j11k4j00qj85J22J42P9l15L70l61M3k0J51j26N4J72k83K74k3k47K37
$$ -167 197 86 62 -38 -46 -231 -109 33 112 -203 167 -194 -151 -171 -20 -146 -92 80 -203 71 48 -199 38
1609C8J8m1L15m59k2O2L42n26J74K29q1K94l19J02j17m95M92J49j67L1Rl76L15
$$ 38 56 15 330 -129 -151 -89 253 -273 -99 130 49 343 24 126 9 -486 6 155 -12 19 28 -348 -33
1632c3K50k79l3J24L3j86P3J52Nj19j41L10k00J96R5j85Kl32L05J55O9n30K11
$$ -33 217 -62 -95 29 62 -124 -51 101 106 -13 -154 156 -44 152 247 62 64 -268 37 192 261 -269 -58
1655e8J90j97N3J80k68QL49l62K90j83j5K5L6o2K21J13j57j97N9KP1j41nM9J41
$$ -58 132 -65 -12 168 -100 -92 257 -105 185 2 -13 12 48 -14 207 320 163 -34 25 27 98 -43 -48 1 142
1680A42k06j7J67j81J75J34j08l4l9j49J21M0q2J50k95K90j7k02k13M21j39K49
$$ 142 -64 -81 86 -95 80 214 106 72 33 -116 5 45 -37 113 -182 108 91 -111 -324 97 -42 207
1702B07k18j72J49n5J7j39N5J56n0J57r9j97L10k28J00N8J42k21k0N7j12J79j01
$$ 207 -11 -183 -34 -89 -72 -211 -156 0 -50 107 8 -189 121 -107 -7 51 193 -28 -48 9 -103 76 -25
1725b5p6K08l64J57L04j31mJ11j07j77J80R4n9j8l05Q7J68o8J94j53k0N47n97
$$ -25 -101 107 -257 -100 204 73 69 180 73 -104 76 170 111 93 -212 -125 43 -25 169 16 -4 543 -54
1748e4K98k71J43j54o4l8K17j61j28K07K2j3P5p5J72j55j25L30Ql24O2R6Q8k70
$$ -54 244 -27 116 -38 -102 -140 77 -84 -212 -5 17 4 79 4 176 21 -104 226 234 -90 -28 68 156 -114
1772a14p3K8J53K6j02l4K23n2Mj77j97L76J79k91o4K02J27l81K34j20k95K83J80
$$ -114 -187 -159 -6 20 -82 -116 107 55 59 -118 -315 61 240 -51 -115 87 214 -167 67 -53 -348 -65 115
1795A15m29M90o81M54M9n2J90k28K29O5o7l79N19m33L36j73j81P5J60K16k56M7
$$ 115 -314 176 -505 -51 -2 -54 136 -92 137 202 135 -244 275 -158 178 5 -176 -101 59 275 19 66
1817F6KR6Jl29K05R8l21K83j92M4p0J7J55m1k56K25R2j11K33l02K06j29J2R3p5
$$ 66 68 164 165 -164 41 139 -182 101 -91 -47 -117 -100 55 14 -242 -17 75 -36 197 -105 101 -28 -16 77 2
1842BJ7J00k15K05j93K0q4L24l99R0K37k42K48j82O0M7J63l3q4m9p6J26r3J94
$$ 2 19 119 -96 109 -84 -64 -148 176 -223 -133 104 -138 110 -72 -12 35 198 165 81 32 -44 82 -11 183
1866A83j4k52O2j47J08Q5O3j06J90o4m7l89L37N7j70N0j17J33J11o6j44j46L53
$$ 183 169 -83 -21 -168 -60 25 88 -18 172 108 61 -328 9 66 -104 -54 -171 -38 73 7 -137 -283 70
1889G0l24Q9K57j84L8o7J10J29k17n3K49j64L07k40j58J59j38K41Q2l59L0l5j73
$$ 70 -254 -165 92 -92 -54 -121 -11 118 -99 -152 97 -67 240 0 -158 1 -137 104 186 -173 -143 -178 -351
1912c51L85o5j29L00l12J24j12j37K46K67m3r4k7J24j64Jm1N1L6qq5O2J34j97
$$ -351 34 -31 -160 140 -172 -48 -160 -297 -51 216 173 79 52 176 12 13 -28 23 59 51 -34 28 162 -35
1936c5k76K87K77j04n2k43K50N0k60M12k73L9j00L0m3J89J64m86J2J35j39L15
$$ -35 -311 -24 253 149 97 -146 104 154 -106 306 33 72 -28 2 -41 148 312 -174 -162 -27 -166 149
1958A49j6j84J16j0m5N10l13j46j89J88k11K10J5J05j56j3n5K29k75N0P4k77M56
$$ 149 133 -51 65 55 10 520 207 61 -128 60 -151 59 74 179 23 10 -45 184 -91 -41 33 -244 212
1981B12k25j63K41k24K81n9mk38L8K25k82M71j24nJ4j02p6l52K40J85K1n8PL8
$$ 212 -13 -176 65 -159 122 63 59 -179 -141 84 -198 273 149 144 158 56 -20 -372 -132 53 74 16 23 61
2005F1J52k46R1J71k18K90j76p8LL6l8M6l08L27j50J0p3N09m38j30J99k06P3J91
$$ 61 213 -33 58 229 11 301 125 47 50 86 48 94 -214 113 -37 -27 -100 409 -29 -159 40 -166 -93 98
2029I8o6l16J56J77o0M90m28q0K9MJ2O0j09j36M12k26k10J61J15j55p0O1M1j1
$$ 98 32 -284 -128 49 -11 479 51 -29 0 4 16 76 -33 -169 243 17 -193 -32 83 -72 -142 -81 -40 -51
2053e1O8l9J25k04k12L31j0l1r9n9n1K54k67P1M1PR8j07J29j96j83K47K99K4l15
$$ -51 17 -22 103 -101 -313 18 8 -23 -122 -181 -232 22 -245 -174 -133 -126 -28 -135 -6 -202 -385 -138 161 185 -130
2078a30O9kk36L04k76L12j88K26n6q3K4j46J88J46p0r8L32l55J08l20K60K58o9
$$ -130 -61 -63 -299 5 -271 41 -147 79 23 -60 -36 -182 6 152 82 -16 316 -39 69 -251 9 267 198
2101A98m66K67J45j13J41j41l8j1r2P0J43k27J19J84j40k21J96K58j67O4Pjl05
$$ 198 -268 -1 144 31 172 31 -7 -18 -110 -40 103 -124 -5 179 39 -182 14 272 105 169 176 175 -130
2124a30N3J85O7l3j52L73l98N8Q9j25j27J80o4j02J7k51M99k80J97l45K32P8k05
$$ -130 -77 108 175 142 -10 363 -35 23 112 -13 -140 40 -24 -126 -109 -360 139 -141 56 -289 -57 21 -184
2147a84ol2K47q2O1J30j56n3J99k33k35L65J73l07L07N0l5l50J16j23J29K9J94
$$ -184 -190 -222 25 -57 4 134 -22 -75 124 -109 -344 21 194 -113 194 244 209 -141 -25 -148 -19 10 204
2170B04j24o4Q1k87J65k5nM0O2k01J18k77J80%K02%j72O2NK1J17k89L4K50L10
$$ 204 80 16 97 -190 -25 -50 -55 -15 47 -154 -36 -313 -133 -133 69 69 -103 -41 -36 -15 102 -187 -153 97 407
2195D07o78K54K60k08M9K17j92j45R8k06K50k14J20O6O0O0k96l1L7K31k19K10
$$ 407 -271 -17 243 35 84 301 109 -36 62 -144 106 -108 12 78 138 198 -98 -129 -92 139 -80 130
2217A30j81r2q2N7J65L9M3K1j94R0lJ46l63J44j8J16K25l65J49j95K36M9j19J
$$ 130 -51 -143 -225 -168 -3 36 79 100 -94 -4 -7 139 -224 -80 -98 18 243 -122 27 -168 68 117 -2 -1
2241aNM0L50m30K30l56L0R1J26l72K34j4r1J01J54J19n5l23J14j25O8J19r1J93
$$ -1 4 44 394 -36 194 -162 -132 -41 85 -287 -53 -67 -158 -57 97 216 161 -162 -48 -173 -105 14 -77 116
2265A16m96M57j97J7J82N9p3j19j00K01j25K72q8l8j41j05K38p8Q6J02pJ21k88
$$ 116 -380 77 -120 -103 79 138 65 -54 -154 47 -78 194 106 68 -73 -178 60 -18 68 170 163 284 -4
2288dM0j8j16J45l1K50k31q7j6K05j26r4J52j3R5k22Q8j41J42J12k03K5pj13J47
$$ -4 36 18 -98 47 16 266 35 -52 -68 137 11 -83 69 56 151 -71 17 -124 18 130 -73 -48 -55 -168 -21
2313b1J9J54l9l40J54J14j22J75j46J85k04M5j63J41N6k2J05j23J17q6pJ01j04
$$ -21 -2 152 113 -227 -73 41 -81 94 -52 133 -71 -26 -189 -48 8 -14 91 -32 85 -1 -8 93 -11
2336a1K37k38K85k87j3j78M11k11K89l01P0j6R8l06k53O29J19m36J96q8o2K32
$$ -11 226 -12 273 -14 -27 -205 206 -5 284 -17 53 37 135 -171 -424 205 324 -112 84 -4 -66 166
2358A66k9k26M07l56J57o6j19K37p97N47J62j72K96l18p6J03j98M55ko5l7K4l02
$$ 166 137 -89 318 -38 119 53 -66 171 -626 -79 83 -89 207 -111 -187 -84 -282 173 171 106 69 93 -209
2381b09M94m0o8q8k52j1N40m26k35M12o8j65J56L3l37M66k36jp0m2K03K19j31
$$ -209 285 245 177 89 -163 -174 366 -60 -295 117 49 -116 40 73 -264 202 -34 -35 -105 -147 56 275 144
2404A44k65J66k6J93l63R4Q7q9n7J77k36L59j26K40j86l31K01j4J67l57M78j68
$$ 144 -121 45 19 212 -151 -57 30 -59 -116 61 -175 184 58 298 112 -219 -18 -32 135 -222 256 88
2426H8j46j2J31o9k37J58L8j43J55P7J21k08M56m66J98j66Jo4J53O4J48l28j27
$$ 88 -58 -70 61 -8 -245 -87 -49 -192 -37 40 161 -47 409 -57 141 -25 -24 -88 65 129 277 -51 -178
2449a78O1lJ84k55K45pL74m31j7j92K03J90J15l09q4J30M6k87L09J16k72J94n61
$$ -178 -117 -120 64 -191 54 47 421 -10 -27 -219 -16 174 289 -20 -104 26 72 -215 94 210 -62 132 -429
2472d29L51M8r7K27J7k74L48l7l65M28l30O8O1R2n4O7pO4j17j84J59k49N69l39
$$ -429 -78 -30 -127 100 117 -157 191 154 -211 217 -113 -45 16 108 54 121 114 178 61 -123 36 -213 356 17
2496A7Q4r9k3K7j53K13P2l42J85k34L17j9j65K82j26kj80J40O3j15q0j54J27j38
$$ 17 101 2 -21 6 -147 66 138 -204 -19 -253 64 45 -120 162 36 34 -146 -6 57 -58 -138 -292 -165 -303
2520c03K95l2k2n7K0J10j01j24J74O6n7k1j14L19k74K9K2k03K23q2jJ82j55J67
$$ -303 -8 -40 -62 -119 -99 11 -90 -214 -40 26 -31 -52 -166 153 -121 -92 -70 -273 -50 -132 -133 49 -106 61
2544F1K8j11n2K54k04M1jj95L22l63L02k3m5oJ83m03K01j11Q4m9j2o0J16R2r9
$$ 61 89 -22 -74 180 -24 17 16 -179 143 -220 82 59 14 8 191 -212 -11 -122 -38 -87 -99 -159 -43 49 -50
2569e0n7L8J93o4k18M11o2k16Jr5N9j62J39Mj10J58j84K80J51p6n16L11L54%j04
$$ -50 -107 -69 124 60 -158 253 191 -25 -24 -119 -60 -222 -83 -79 -189 -31 -215 65 216 140 -376 -65 289 289 185
2594A85k35j08J85j27q3K96Kj24N5J24P5k99J46N2j20K9k46J82r9L39j69j42J03
$$ 185 -50 -158 27 -100 -183 113 115 -9 46 170 245 -54 92 144 24 53 -193 -11 -110 229 60 -82 21
2617B1J95j57j13J5R3n2P3K0l12J13K28m5j88J46j18O0k85M07n8j16J29K9j66
$$ 21 216 59 -54 -39 54 2 75 95 -217 -104 124 79 -109 37 -81 -21 -306 101 43 -73 56 85 -81
2640h1J93k56J22J06j85L07p6m64L92J89n47L32j26J99l23L83j76J10K5m%j98
$$ -81 112 -144 -22 84 -101 206 130 -334 58 247 -300 32 -94 105 -218 165 -11 99 124 120 120 -78
2662g8Kn6J27q2K80l11J52L7oj04j24K80pj06K2J13j97nj21P8L09k76K11j59k54
$$ -78 -76 -132 -5 -87 193 -118 34 71 65 -39 -163 117 110 4 26 139 -58 -63 -184 -106 203 -73 138 -21 -275
2687b75M07k18L50j27j52J20Q0k9o3j56K18J03j29J1J5j01j09L52l23P8l0N1Q3
$$ -275 132 -86 264 137 -15 105 185 156 93 -63 155 258 129 140 155 54 -55 297 -26 52 22 73 156
2710A56j93k3J89m3m1K7Q7j44K15j46j62q6K30O1J17k89N3M4j40O6L6P5r9j02
$$ 156 -37 -60 129 86 45 72 159 15 230 84 -78 -164 66 127 244 -45 8 52 -88 -22 14 89 -10 -112
2734a12K56j30j2KK1j14jQ7K04m34J55J94l51L10j01M2jJ66r0j47J25J31r4k77
$$ -112 144 14 2 4 25 -89 -90 -3 201 -233 -78 116 -235 75 -26 16 15 181 91 -56 69 200 106 -171
2758a71K49k04OR5J68j0j20J55O1q4j18Q4j40J13l5j10k08J4K36K1Ko7J15pq4
$$ -171 78 -126 -120 -25 143 133 13 168 229 145 27 111 -29 84 49 -61 -269 -255 -19 2 4 -63 52 45 -39
2783c9J13j51J65J72l03J77j83PL24l99J5j47M80m23J45p5QJ58j03k9j8K07k24
$$ -39 74 -77 88 260 -43 134 -49 -42 282 -117 -102 -249 231 -192 -47 -122 -114 44 -59 -88 -106 101 -123
2806a23%K05J45m10J54J08l06L44j06K80j85q8P1M8l07K97n7R6qk64j26L85j77
$$ -123 -123 82 227 -183 -29 79 -227 117 11 291 106 18 89 137 -170 127 70 166 158 -106 -232 153 -24
2829b4N6k53K22r0J72j02Q5L8o1j19M9J99J11l46J82K8j10nJ17k23j69J58J19
$$ -24 32 -221 1 -89 83 -19 66 104 43 -76 -27 172 283 -63 119 147 37 32 149 -74 -243 -85 34
2852C4mj42J32O2n9l57L29P1j80l05J75K54o0O5P9k17K62J9j09j45K88l72K69
$$ 34 30 -112 20 82 23 -334 -5 66 -114 -419 -244 10 -50 15 94 -123 139 158 49 -96 192 -180 89
2875H9r5J59l69K11j87J42J99j4k32K22K5k83L03l46M64n42L79j94R3N3N7l33
$$ 89 -6 153 -216 -5 -192 -50 149 135 -97 125 150 -133 170 -176 288 -254 125 -69 24 77 134 -199
2897a99K15K24m05J86j19J49m6J87N0m45K29J39n2j48K77m06P4J72J03k60K44
$$ -199 16 240 -165 21 -98 51 5 192 242 -203 26 165 113 -35 242 -164 -90 82 185 -75 169
2918A69k63l5J12K02j18j25N0p7L6P8k49L73j10k6J87l72K17K05j70m56N16l3
$$ 169 -94 -129 -17 185 67 -58 -8 -85 -49 29 -220 153 43 17 204 -168 49 254 84 -372 144 111
2940A11r2MJ88l18J91J0k12J19k68L47j49L72m07K52l41L40k00L4J34m70K62K53
$$ 111 19 23 211 -107 84 94 -118 1 -267 80 -69 303 -104 148 -193 147 -53 -19 115 -355 -93 160
2962A60k70L13l33K09j35j36L44M3j60M0j92K29Q0p0J79k69K46k50j17j58K43
$$ 160 -110 203 -130 79 -56 -192 152 195 35 75 -117 112 192 122 301 32 278 28 -89 -247 -4
2983dL27k02r6k40M3L29l7j16N1k63M34l52Q2K92j91J5k02J10K37l51kM9k19K46
$$ -4 323 121 25 -215 -172 157 120 4 55 -208 226 -126 -44 248 57 72 -130 -20 217 -134 -136 -87 -306 -60
3007f0J65j48J79j63J9J00m45L11k04N40k48k18K97j8k37J19L7k7m9m1j90O0M32
$$ -60 105 -43 136 -27 -8 92 -353 -42 -246 294 46 -172 125 107 -130 -11 26 -1 -50 -91 -281 -221 211
3030B11J21n04M8J4J44K06k67J8rj58P2J60P7m76L63n5l9l3qR1O1M4k17P9J63
$$ 211 332 -172 -124 -110 34 240 -27 -9 -18 -176 -104 56 133 -343 20 -35 -74 -107 -115 -24 37 81 -136 -57 106
3055A06j03o7K04j72o5J00j25K15j02J6J01j1j81nJ46j04O2M4j97J34Pm7o7K39
$$ 106 3 -64 140 -32 -97 3 -122 93 -9 7 108 97 -84 -89 57 -47 15 59 -138 -4 3 -44 -111 128
3079A28m52N53j83L23l99L40k55N0n2R1Kj27N3j07J8l4P7j99J39J68j83L22j41
$$ 128 -324 229 46 369 -30 310 55 105 53 144 146 19 72 -35 -17 -51 26 -173 -34 134 -49 273 132
3102A32p9K80k65J49l02J2J29J05p7k22J18k48M52m35N4N8m7J28Kj55J22J14J
$$ 132 53 333 68 217 -85 -73 56 161 84 -138 -20 -268 184 -251 -197 -139 -186 -58 -56 -211 -89 25 26
3125B6J70k12j49K38j77K12%j1j15l79K44J05J92j05j01l25P23m38L8k24M22p8
$$ 26 196 -16 -165 73 -104 108 108 97 -18 -397 -153 -48 144 39 -62 -387 336 -102 -64 -288 134 56
3147E6r2J06j24K1oJ82q7k13K31N2PQk01J97k38J59J8j11K31p6l7l9n3J59k39
$$ 56 -36 70 -54 -33 -39 143 56 -157 74 126 133 141 -60 137 -101 58 76 -35 196 120 83 44 -9 150 -89
3172h9k5J98O7Rj62k03L39l34R5J74J49m09Q1J49J04n9q1MR8J97j93k81K33j03
$$ -89 -114 84 151 160 -2 -205 134 -200 -105 69 218 -191 -110 39 143 84 3 7 105 302 109 -172 61 -42
3196d2J44j74J35j92K40r8j14k19N91j47k97L92k8j30r3nO3p6l1K18O6j69K4k10
$$ -42 102 -72 63 -129 111 13 -101 -320 271 124 -173 219 191 61 -32 -37 26 -50 -81 137 203 34 58 -152
3220a52M42l73J0Q1J68j36k11M45j70j42L19j31k81K07k63K68L2q6j16J12p7J97
$$ -152 290 -83 -73 8 176 40 -171 274 104 -38 281 150 -131 76 -187 81 113 27 -89 23 -54 143
3242A43j25O4k93K96j98J9J68n4k2j09r7K93m3k55K89l5J53k67J02P8Q8k52K75
$$ 143 18 82 -211 85 -113 -94 74 20 -2 -111 -208 85 42 -213 76 41 194 -73 29 107 195 -57 218
3265B18k29K80j38k81J86J2J89k38j3j2q2J37j43M25m07J70j7n6p9J19j96J92
$$ 218 -11 269 131 -150 36 48 237 -1 -14 -26 -108 29 -114 311 -96 74 57 1 -78 41 -155 37
3287C7J09j81k15J49J36K00j7l75K27L3l1l15K50l4k03M01r6K10m71K29l01K53
$$ 37 146 -35 -250 -101 35 235 218 -157 70 103 72 -243 7 -27 -230 171 75 285 -186 43 -258 -5
3309ej63K28q3l67L23J41q0n7j40J51l2J16j46o5K76k26K63q7j23L27k02j38K82
$$ -5 -168 60 -23 -390 -67 74 -6 -63 -203 -52 -84 32 -114 -179 97 -129 134 47 -76 251 49 -89 193
3332A93l55K1P9J68K1q1P2R1l70j08J92K91j56j83JM5L0J10j45K25j96j4L6J03
$$ 193 -162 -141 -62 106 127 46 118 209 -161 -269 -77 214 58 -125 -124 -79 -49 61 -84 141 -55 -69 -33 70
3356G0l49M55k24K00J22k65k44K84J65k37K50k65J19L8K8N2p1o3j13k84K71J33
$$ 70 -279 176 -48 152 274 9 -235 49 214 -23 227 -38 81 119 147 199 128 65 -48 -332 -61 72
3378G2p0k3k2J78l47K37l1O3k63M08j77J08k98O2J85k07K28J80o15J93K74j91
$$ 72 2 -21 -43 135 -212 25 -6 57 -206 202 25 133 -165 -103 82 -125 103 283 -332 -139 135 -56
3400e6K96j50k2J77k30J20m1l40J67l1L11k28O8m3k75K48j0J60j57n6J23J88l23
$$ -56 240 90 68 245 15 135 94 -246 -79 -110 201 -27 41 -2 -277 -29 -39 121 -36 -92 31 219 -104
3423a04N0O4N2J9j73L02r0J02j4j98k04O4J70n1j33K08%R6q1p1j0j13rr9J62j65
$$ -104 -54 10 62 81 -92 210 120 222 208 10 -194 -130 40 -11 -144 64 64 160 79 8 -2 -115 -124 -223 -61 -226
3449b26K49Nj02J46J73n04K95p0L4J01RK59k44j70P9j72J95L7r4r5J93R4O2j74
$$ -226 23 28 -74 72 245 -259 36 -34 0 101 110 369 125 -45 34 -138 57 94 0 -95 98 192 254 80
3473H0o2k8p8J94k72r5K89j49K49j02J48l03l5j2J7M47m17R1QK7r7K38j32j69
$$ 80 18 -10 -88 106 -166 -261 28 -121 128 26 174 -129 -164 -176 -159 288 -129 -38 -30 -3 -100 138 6 -163
3497a63J67Mo7r1M39l24j8J14N1Q1l14J29o3l4j52J45r8K01J98j79J25m9rk47
$$ -163 4 8 -59 -150 289 -35 -53 61 112 193 -121 8 -55 -89 -241 -96 -194 7 205 26 151 102 93 -154
3521a54L3k42J73j75J39J53K43j12l15L20r4j00J64j91J09L50k16m7j34P5J7J69
$$ -154 -121 -363 -190 -365 -226 -73 170 58 -257 63 -31 -131 33 -158 -49 301 85 38 -96 -21 -4 165
3543A65j24k4J11m0j11R4K23k81k21K95L9N9J4k31O9j68L19k08pj6J42j32N2k07
$$ 165 41 17 128 88 -23 71 294 13 -208 87 126 185 199 -32 37 -131 188 -20 -27 -43 99 -33 19 -188
3567a88K13l6L9J50j5k28J47l4N2k14jK55l57J31J12k6m8M2j40J07J8J92l32K64
$$ -188 25 -11 28 178 163 -65 82 48 100 -114 -115 140 -217 -86 26 0 -48 -6 -146 -39 -21 171 -161 103
3591A03l08K63K7k99J82J38j17o9J24o4J72j08O8n59K65K38k43J27jM9L32l00
$$ 103 -205 58 85 -214 -32 106 -11 -80 44 -20 152 44 112 -447 -182 56 -187 -60 -61 -12 320 20
3613B0J11j24q3Q3Q5K40k63j17R2k71K61K48j48l17j57J31L35j86L92l98L29O1
$$ 20 131 7 -76 7 92 332 69 -48 44 -227 34 282 134 -183 -340 -209 126 -60 332 -66 263 324
3635C24l93K8J25On4k14J57K33l14J49KL98n33L36l46J20R0k40J0j46N49j47m6
$$ 324 -69 -41 84 90 36 -178 -21 212 -102 47 49 447 -86 250 -96 24 114 -126 -116 -262 287 140 94
3658I4j75N08k76n5j10j19N7J09R7J17l59J7K13k87M49l63K6o6J55Q7k56K5kK38
$$ 94 -81 427 151 96 -14 -133 -76 33 130 247 -112 -95 118 -169 280 -83 -57 -123 32 119 -137 -112 -114 124
3682A24k8k36J23r8M47l74l49M79m1K36n65K47j13J18j68P1L50J05j74k56J50
$$ 124 96 -140 -17 -115 332 -42 -391 88 47 283 -282 -35 -148 -30 -198 -127 223 328 154 -102 48
3703D8Q8J33k51m11K50J76k68J34N06l95j46Q3n0L88m85O39n48J26j6r5K5m6L23
$$ 48 136 269 18 -393 -143 33 -235 -101 405 10 -136 -53 -103 285 -200 439 -109 17 1 -94 -69 -115 208
3726B08l34K93o4k47M1J9M3j35K49l23K13K44l97J31M3J48k63L64j32J26k55l7
$$ 208 -126 167 103 -144 -103 -84 -41 -176 73 -250 -37 207 -190 -59 -16 132 -131 233 101 227 -28 -65
3748f5J28k72J93J69k71L29k07l1j1mK94l68J82J08o0k34M2J45N3j9k01J84r7
$$ -65 63 -209 -16 153 -118 211 4 -27 -38 -42 252 -116 66 174 114 -120 -78 67 120 101 -100 84 -13
3771a3m7l9k8J97q0K26m09M06l10J05k37J13n5J69J96j35J13m96K46j93N09j96
$$ -13 -60 -99 -127 70 -10 216 -193 213 -97 8 -229 -116 -171 -2 194 59 172 -324 -78 -271 238 42
3793D2l2J13j89K43k81J74p1K94k80J32k9l80J55K50l23M8pJ21J87q3n5j49N9
$$ 42 10 123 -66 177 -104 70 -1 293 13 145 116 -264 -109 141 -182 -134 -141 -20 167 84 29 -120 -61
3816f1L5J56J3j04l3r3K39n32L18K49k61O0r8J28j31J69k7Jj53J5J94k03Q6J89
$$ -61 -26 130 143 39 6 -87 152 -380 -62 187 -74 -14 -112 16 -115 54 27 28 -125 -110 84 -119 -33 156
3840A56j85k32J32J92L3k51K6L24k51M08m23J04R5k77Q6L28n15J88J04j62J28
$$ 156 -29 -261 -129 63 96 -155 -129 195 -56 352 -71 33 128 -149 -63 265 -250 -62 42 -120 8
3861Hj2K43j44j32p0J51n5K29k85L69k30j69N7m1Ol2K70l73q1K36K93l84j41J46
$$ 8 -4 239 95 -37 -107 44 -11 218 -67 302 72 -97 -40 -81 -75 -107 163 -210 -291 -55 238 -146 -287 -141
3885a41L61n83K75r4K96m38J13M1N7K69q6l00L39l07j5M50k57n2J07J0K5O0q6
$$ -141 220 -363 -88 -182 114 -324 -211 -170 -113 156 70 -230 109 -198 -213 237 -20 -72 35 45 70 130 44
3908D4j35r9P3L7j76M44J33j07l55K43L8m00M19j55J49q5q0l1J72k09L6r8J42
$$ 44 -91 -190 -117 -80 -256 188 321 214 -141 102 140 -260 159 4 153 68 -12 -43 129 -80 -44 -142 0
3931@j42J24K6p2P9M3Q9j1j10J7j33J32q8O2j17j1o5j6J49p7k5N8m05P39r6k85
$$ 0 -142 -18 8 -64 15 58 147 136 26 43 -90 42 -46 16 -101 -112 -177 -193 -44 -121 -146 -88 -493 246 150 -135
3957a35Q7K5K8k07j39J49P6j16L78j67k39RL88k16P7q3J52M6o3k93J33J0J2K48
$$ -135 -48 -23 5 -202 -341 -192 -116 -232 146 -21 -260 -251 137 -79 -2 -85 67 113 50 -243 -110 -100 -88 160
3981A60k80M4N00n81K12m4On6k6Q2J05Rj56R7Q9l8k27m1P1J14M7k27K75j03J04
$$ 160 -120 -76 424 -157 55 11 17 -39 -65 17 122 131 -25 72 161 123 -104 -145 -74 40 87 -140 135 32 136
4006A36mk19K31j06k14J64j32r1K23m3K48m12K41O2l27K76Q4O0k68R9J80r1j33
$$ 136 132 -87 144 38 -176 -12 -144 -235 -12 -55 193 -219 22 84 -243 33 117 177 -91 8 188 97 -36
4029c6M9j3J29r7L7P7k1J8j81L7NQ3k82K26p9M9N9j51J03j79l0K85q4n7L55m06
$$ -36 13 0 129 32 69 146 125 143 -38 -1 4 87 -195 31 -48 1 60 -91 12 -167 -197 88 4 -53 302 -104
4055a04K30m8j84P3J01k7q1k58J40R1J35r5j5J42Q2k10j1j8r9N7K74j6j56k52
$$ -104 126 78 -106 -33 68 41 -40 -298 -158 -67 68 -27 -42 100 182 -28 -39 -57 -156 -99 175 159 3 -249
4079b49J98J37r1J76j42o0L3r1J93J12j71l10J86J19Mm5r9K10K9l48L01k93J12
$$ -249 -51 86 -5 171 29 -31 2 -89 104 216 45 -265 -79 40 44 -1 -100 110 139 -209 92 -201 -89
4102h9J84q6K2j15j06L11j16J8R4j87j17M19k33J1J43k31J12j79K33k88J09JK85
$$ -89 95 9 31 -84 -190 121 5 23 117 -70 -187 232 -1 10 153 -78 34 -145 88 -200 -91 -90 195
4125A95k39Q1J77k79r7p3J64K4R0l31K57k1k3K45o1j10o8m6j35K22O3Ll05kJ41
$$ 195 -44 37 214 -65 -162 -235 -71 -47 43 -288 -31 -52 -75 170 109 -1 -69 -115 -250 -28 35 38 -267 -269 -128
4150a28J92k60J34j12J99K19K5j61Mj19j79K64j03M9J1J39l00J48J76j76r4L14
$$ -128 64 -196 -62 -174 25 244 269 108 112 -7 -186 78 -25 24 35 174 -126 22 198 22 -72 242
4172B42lk05K68j87j58J64j23o3L10l48r5J83P8P8k44J06J95k66K38j89n4J19
$$ 242 239 34 302 115 -43 121 -2 -65 245 -103 -198 -15 63 141 -103 3 198 -68 170 -19 -73 46
4194D6N6j35P8p8rJ43m7k44j17M89j31J4MJ7Q9Lk12L06k33o5k5j36K89j81J21
$$ 46 102 -33 45 -33 -42 101 54 -190 -307 182 51 65 69 86 175 178 -34 272 39 -26 -51 -187 102 -79 42
4219D2J60j77j59L96k78J77m4j29j36J11J71L9l87J80M64k97r8k1k02P9R3k8l75
$$ 42 202 25 -134 262 -16 161 117 -12 -148 -37 134 173 -214 -34 430 133 35 14 -188 -109 -16 -44 -419
4242d19L67J00R6j94QK00L5m70K45kp8l37L86j07J32kJ04k35J47L3N6O9l92K85
$$ -419 -52 48 144 -50 -42 158 193 -277 -32 -34 -112 -449 -63 -170 -38 -40 64 -171 -24 9 65 134 -258 27
4266B7j54K99j19M4k77K53k10J53J62k65Q3J4N6J55j16k69M1J56r9j27R7O3o0
$$ 27 -127 172 53 97 -180 73 -137 16 178 -87 -4 10 66 221 105 -164 -123 33 -66 -193 -96 -33 -93
4289i3J13P4j09Q1l2J34K41l64M36n18O2o3J72m6N0j64J84l72J83K49k1j15k41
$$ -93 20 94 -15 66 34 168 409 45 481 -37 25 -38 134 88 138 -26 158 -214 -31 218 197 82 -159
4312a59o2R3J3k1J79j05j60J39K53J92m13k27M7J07NJ63j41j25L22k92M2K52m7
$$ -159 -221 -128 -115 -136 43 -62 -222 -83 170 362 -51 -278 -231 -124 -119 44 -97 -222 100 -192 -150 102 55
4335E5J1j20j16J99K84j68q4l65K59j52L92r2l38K35J74j57R8j99J23q4K4l1R1
$$ 55 66 -54 -170 29 313 145 61 -304 -45 -197 195 103 -235 0 174 17 115 -84 39 -45 -21 -52 39
4358C9r6J07r3r3M5J17%o5J22k28q9K96L1j65o3mJ54j53J58m6k4J97k6l50J86
$$ 39 -57 50 -43 -136 -91 26 26 -39 83 -145 -234 62 93 -72 -135 -139 15 -138 20 -26 -50 147 121 -229 -43
4383d3L5n7k21M19k23R0P3k54M7L36k80Pn3m8K88j42R7l66N0L16r1l95L07p1K49
$$ -43 -8 -65 -286 133 -90 0 73 -181 -134 202 -78 -71 -124 -172 116 -26 71 -295 -245 71 -20 -415 -108 -179 70
4408G0j40j1R9M1j13r0O7J92j04j66k10L69j88LJ77J11j49K16j68K58j03j22k
$$ 70 -70 -81 18 59 -54 -144 -77 115 11 -155 -365 4 -184 -181 -4 107 -42 174 6 264 161 39 37
4431C7m9J3J07j51l1n8J24r4k3K91j30L4j53j46K48l9l5J27j19K90k36oO0O5L
$$ 37 -12 1 108 -43 -74 -132 -8 -102 -125 166 36 70 -83 -229 19 -20 -55 72 -47 243 7 1 61 126 129
4456A29j62j75L01k44K39R4k36J57j78J41k09K81j08j09L68k18J73n9l9k18J39
$$ 129 -33 -208 93 -151 88 182 -54 103 -75 66 -143 138 30 -79 289 71 244 185 146 -72 67
4477F7q0j25L06j61K34j54m7l8R3m3k54K96l52M26j56k05J77J59l00J36J32k16
$$ 67 -13 -138 168 7 241 87 40 2 95 52 -202 94 -258 168 12 -193 -16 143 -157 -21 111 -105
4499a05j22L89k28J83j67q3j96J35J70L47k46J37n75M23m5k5K07j51p4J42j09
$$ -105 -227 162 -66 117 -50 -133 -329 -194 -24 323 77 214 -361 62 17 -8 199 48 -26 116 7
4520GJ92m86P7J66kK9k52j28J61K56l1mn2N7k68K19J56k78n8J09K17o7o8o3M36
$$ 7 199 -287 -210 -44 -46 -17 -269 -397 -236 20 -11 -15 -67 -10 -278 -59 97 -181 -239 -130 87 20 -48 -111 325
4545C25l46N3J97o9k66J76k38K66j2n0q3K19k34P6J67r5j46j1J41j98q6K08J27
$$ 325 -21 32 229 160 -106 70 -168 98 86 36 -47 172 -62 14 181 86 -60 -71 70 -128 -214 -6 121
4568A21k37L92l54R0l33N22l02K00p1k69Q6J88j38J41L6j29K05j57J72M0p9q3
$$ 121 -116 276 -78 12 -321 201 -101 99 28 -241 -155 33 -105 36 72 -57 148 -9 163 203 124 41
4590D1J9N2L8j0j30J2j9n4LJ28j78m5K0K82j13k92J68pN3j06J71J39j99L9R2j13
$$ 41 60 112 150 140 10 22 3 -51 -48 80 -98 -143 -123 159 46 -246 -78 -85 -32 -138 33 172 -27 12 104 -9
4616ij69L07l77J66P7K64j05k45L52l19M4J40k0q0K6R7j93k01L54k64K01Q7J16
$$ -9 -178 129 -248 -82 -5 259 154 -91 261 -58 -14 126 106 26 52 149 -44 -245 109 -155 46 133 249
4639B49j80J54l77J13j4O5Lm7o4l7L67m7j38oR4j34Q5q7k95J64K1O0p3P8k15M27
$$ 249 69 223 -154 -41 -55 10 13 -34 -98 -135 232 185 47 41 135 1 86 -1 -296 -132 -111 -51 -124 -46 -261 166
$$ [...]
8191f0
##END NTUPLES=NMR FID
##END=
