##TITLE=1H_DE-82k2_TFA
 200.13MHz,CDCl3,
 8 sc
 
 4.4.2025
##JCAMPDX= 6.0         $$ Bruker NMR JCAMP-DX V2.0
##DATA TYPE= NMR FID
##DATA CLASS= NTUPLES
##ORIGIN= UXNMR, Bruker Analytische Messtechnik GmbH
##OWNER= pz
$$ XWIN-NMR		Version 3.5
$$ Fri Apr  4 16:11:39 2025 Russian Standard Time (UT+4h)  she@DPX200
##.OBSERVE FREQUENCY= 200.1313
##.OBSERVE NUCLEUS= ^1H
##.DELAY= (6, 6)
##.ACQUISITION MODE= SIMULTANEOUS
##.ACQUISITION SCHEME= undefined
##.AVERAGES= 8
##.DIGITISER RES= 18
##SPECTROMETER/DATA SYSTEM= spect
##.PULSE SEQUENCE= zg30
##.SOLVENT NAME= CDCl3
##.SHIFT REFERENCE= (INTERNAL, CDCl3, 0, 14.3821)
##AUDIT TRAIL= $$ (NUMBER, WHEN, WHO, WHERE, WHAT)
$$ ##TITLE= Audit trail, XWIN-NMR		Version 3.5
$$ ##JCAMPDX= 5.01
$$ ##ORIGIN= Bruker BioSpin GmbH
$$ ##OWNER= she
$$ F:/spectra/data/she/nmr/H-C/1/audita.txt
$$ ##AUDIT TRAIL=  $$ (NUMBER, WHEN, WHO, WHERE, WHAT)
(   1,<2025-04-04 16:10:25.12 +0400>,<she>,<DPX200>,
      <created by zg, POWCHK disabled, PULCHK disabled
       configuration hash MD5:
       00 E9 B6 7A A2 85 ED C7 34 08 36 98 17 FE 4E 26
       data hash MD5: 16K
       C4 D0 75 F3 60 C5 5B BF A4 10 B1 7E 36 A9 44 E1>)
$$ ##END=
$$ 
$$ hash MD5
$$ FB 5A 08 8B 47 03 36 45 51 57 0C CA B2 BC 2B 5B
##$RELAX= 
##$RELAX= 
##$RELAX= 
##$RELAX= 
##$RELAX= 
##$RELAX= 
$$ Bruker specific parameters
$$ --------------------------
##$DU= <F:/spectra>
##$EXPNO= 1
##$NAME= <H-C>
##$PROCNO= 1
##$TYPE= <nmr>
##$USER= <she>
##$AMP= (0..31)
100 100 100 100 100 100 100 100 100 100 100 100 100 100 100 100 100 100 
100 100 100 100 100 100 100 100 100 100 100 100 100 100 
##$AQSEQ= 0
##$AQ_mod= 1
##$AUNM= <au_zg>
##$AUTOPOS= <>
##$BF1= 200.13
##$BF2= 200.13
##$BF3= 200.13
##$BF4= 200.13
##$BF5= 200.13
##$BF6= 200.13
##$BF7= 200.13
##$BF8= 200.13
##$BYTORDA= 1
##$CFDGTYP= 0
##$CFRGTYP= 5
##$CHEMSTR= <none>
##$CNST= (0..31)
1 1 145 1 1 1 1 1 1 1 1 1 1 1 1 1 1 1 1 1 1 1 1 1 1 1 1 1 1 1 1 1 
##$CPDPRG= <>
##$CPDPRG1= <>
##$CPDPRG2= <>
##$CPDPRG3= <>
##$CPDPRG4= <mlev>
##$CPDPRG5= <mlev>
##$CPDPRG6= <mlev>
##$CPDPRG7= <mlev>
##$CPDPRG8= <mlev>
##$CPDPRGB= <>
##$CPDPRGT= <>
##$D= (0..31)
0 0.7 0 0 0 0 0 0 0 0 0 0.03 0 0 0 0 0 0 0 0 0 0 0 0 0 0 0 0 0 0 0 0 
##$DATE= 1743768624
##$DBL= (0..7)
120 120 120 120 120 120 120 120 
##$DBP= (0..7)
150 150 150 150 150 150 150 150 
##$DBP07= 0
##$DBPNAM0= <>
##$DBPNAM1= <>
##$DBPNAM2= <>
##$DBPNAM3= <>
##$DBPNAM4= <>
##$DBPNAM5= <>
##$DBPNAM6= <>
##$DBPNAM7= <>
##$DBPOAL= (0..7)
0.5 0.5 0.5 0.5 0.5 0.5 0.5 0.5 
##$DBPOFFS= (0..7)
0 0 0 0 0 0 0 0 
##$DE= 6
##$DECBNUC= <off>
##$DECIM= 32
##$DECNUC= <off>
##$DECSTAT= 4
##$DIGMOD= 1
##$DIGTYP= 9
##$DL= (0..7)
0 120 120 120 120 120 120 120 
##$DP= (0..7)
150 150 150 150 150 150 150 150 
##$DP07= 0
##$DPNAME0= <>
##$DPNAME1= <>
##$DPNAME2= <>
##$DPNAME3= <>
##$DPNAME4= <>
##$DPNAME5= <>
##$DPNAME6= <>
##$DPNAME7= <>
##$DPOAL= (0..7)
0.5 0.5 0.5 0.5 0.5 0.5 0.5 0.5 
##$DPOFFS= (0..7)
0 0 0 0 0 0 0 0 
##$DQDMODE= 0
##$DR= 18
##$DS= 0
##$DSLIST= <SSSSSSSSSSSSSSS>
$$ [...]
##$SUBNAM0= <"">
##$SUBNAM1= <"">
##$SUBNAM2= <"">
##$SUBNAM3= <"">
##$SUBNAM4= <"">
##$SUBNAM5= <"">
##$SUBNAM6= <"">
##$SUBNAM7= <"">
##$SUBNAM8= <"">
##$SUBNAM9= <"">
##$SW= 18.0517328524113
##$SWIBOX= (0..15)
0 0 2 0 0 0 0 0 0 0 0 0 0 0 0 0 
##$SW_h= 3612.71676300578
##$TD= 16384
##$TD0= 1
##$TE= 0
##$TE2= 300
##$TE3= 300
##$TEG= 300
##$TL= (0..7)
0 120 120 120 120 120 120 120 
##$TP= (0..7)
150 150 150 150 150 150 150 150 
##$TP07= 0
##$TPNAME0= <>
##$TPNAME1= <>
##$TPNAME2= <>
##$TPNAME3= <>
##$TPNAME4= <>
##$TPNAME5= <>
##$TPNAME6= <>
##$TPNAME7= <>
##$TPOAL= (0..7)
0.5 0.5 0.5 0.5 0.5 0.5 0.5 0.5 
##$TPOFFS= (0..7)
0 0 0 0 0 0 0 0 
##$TUNHIN= 0
##$TUNHOUT= 0
##$TUNXOUT= 0
##$USERA1= <user>
##$USERA2= <user>
##$USERA3= <user>
##$USERA4= <user>
##$USERA5= <user>
##$V9= 5
##$VALIST= <valist>
##$VCLIST= <CCCCCCCCCCCCCCC>
##$VD= 0
##$VDLIST= <DDDDDDDDDDDDDDD>
##$VPLIST= <PPPPPPPPPPPPPPP>
##$VTLIST= <TTTTTTTTTTTTTTT>
##$WBST= 1024
##$WBSW= 4
##$XGAIN= (0..3)
0 0 0 0 
##$XL= 0
##$YL= 0
##$YMAX_a= 121734
##$YMIN_a= -122645
##$ZGOPTNS= <>
##$ZL1= 120
##$ZL2= 120
##$ZL3= 120
##$ZL4= 120
##$ABSF1= 10
##$ABSF2= 0
##$ABSG= 5
##$ABSL= 3
##$ALPHA= 0
##$AQORDER= 0
##$ASSFAC= 0
##$ASSFACI= 0
##$ASSFACX= 0
##$ASSWID= 0
##$AUNMP= <proc_1d>
##$AZFE= 0.1
##$AZFW= 0.1
##$BCFW= 1
##$BC_mod= 2
##$BYTORDP= 1
##$COROFFS= 0
##$CY= -3
##$DATMOD= 1
##$DC= 2
##$DFILT= <>
##$DTYPP= 0
##$F1P= 0
##$F2P= 0
##$FCOR= 0.5
##$FTSIZE= 0
##$FT_mod= 4
##$GAMMA= 1
##$GB= 0.15
##$INTBC= 1
##$INTSCL= 1
##$ISEN= 128
##$LB= 0.25
##$LEV0= 0
##$LPBIN= 0
##$MAXI= 10000
##$MC2= 0
##$MEAN= 0
##$ME_mod= 0
##$MI= 1.114404
##$NCOEF= 0
##$NC_proc= 0
##$NLEV= 6
##$NOISF1= 3.799351
##$NOISF2= 2.8
##$NSP= 1
##$NTH_PI= 0
##$NZP= 0
##$OFFSET= 14.38212
##$PC= 1
##$PHC0= -829.8657
##$PHC1= 12.39221
##$PH_mod= 1
##$PKNL= yes
##$PPARMOD= 0
##$PSCAL= 0
##$PSIGN= 0
##$REVERSE= no
##$SF= 200.129724274929
##$SI= 16384
##$SIGF1= 3
##$SIGF2= 2
##$SINO= 400
##$SIOLD= 16384
##$SREGLST= <1H.CDCl3>
##$SSB= 0
##$STSI= 0
##$STSR= 0
##$SW_p= 3205.1282051282
##$SYMM= 0
##$S_DEV= 0
##$TDeff= 0
##$TDoff= 0
##$TI= <>
##$TILT= no
##$TM1= 0
##$TM2= 0
##$TOPLEV= 0
##$USERP1= <user>
##$USERP2= <user>
##$USERP3= <user>
##$USERP4= <user>
##$USERP5= <user>
##$WDW= 1
##$XDIM= 8192
##$YMAX_p= 0
##$YMIN_p= 0
$$ End of Bruker specific parameters
$$ ---------------------------------
##NTUPLES= NMR FID
##VAR_NAME=  TIME,          FID/REAL,        FID/IMAG
##SYMBOL=    X,             R,               I
##VAR_TYPE=  INDEPENDENT,   DEPENDENT,       DEPENDENT
##VAR_FORM=  AFFN,          ASDF,            ASDF
##VAR_DIM=   8192,          8192,            8192
##UNITS=     SECONDS,       ARBITRARY UNITS, ARBITRARY UNITS
##FACTOR=    0.0002768,     1,               1
##FIRST=     0,             0,               0
##LAST=      2.2672688,     0,               0
##MIN=       0,             -122645,         0
##MAX=       2.2672688,     121734,          0
$$ Real data points
##PAGE= N=1
##DATA TABLE= (X++(R..R)), XYDATA
$$ plain form
0 0 0 0 0 0 0 0 0 0 0 0 0 0 0 0 0 0 0 0 5 -8 8 -8 8 -8 12 -16 16 -16 21 -24 28 -32 36 -40 45 -53 59 -63 70 -79
40 -79 90 -99 109 -121 136 -149 163 -181 198 -219 242 -266 293 -323 356 -394 439 -490 548 -618
60 -618 702 -804 936 -1109 1345 -1692 2249 -3304 5964 -27943 -34195 18425 103 44974 98560
75 98560 18788 -28557 88575 95730 -43141 -26354 86852 -6124 -117946 -8366 33234
86 33234 -110801 -86743 54974 -5158 -95089 12609 97643 25042 -17263 45658 66864 18235
98 18235 19213 49022 8087 -37649 -7781 19323 -27614 -60166 42 25747 -55216 -59621 33271
111 33271 13682 -50377 13973 55554 -25958 -34610 66371 63855 -32862 -16494 54081 7372
123 7372 -39098 15394 17548 -51146 -41761 17132 3902 -38073 -7169 37602 3470 -19978 34858
$$ packed form
0@%%%%%%%%%%%%%%%%%%Nj3J6j6J6j6K0k8L2l2L7m5N2o0O8p6Q5r8J12j22J33j49
40g9J69j89K08k30K57k85L12l44L79m17M61n08N59o16O79p50Q33r29J038j166
60f18J320j506J740k045K454l037L941n553R268l3907o252N2620j8322M4871N3586
75I8560p9772m7345J17132P155j38871J6787J13206r2976j11822J09580M1600
86C3234j44035K4058J41717o0132q9931J07698Q5034p2601m2305O2921K1206m8629
98A8235R78K9809m0935m5736K9868K7104m6937l2552O0208K5705q0963m405R2892
111C3271j9589o4059O4350M1581q1512q652J00981k516r6717J6368P0575m6709
123G372m6470N4492K154o8694R385N8893j3230m1975L0904M4771l4132k3448N4836
$$ plain form
136 34858 46843 -5606 -2477 31482 5512 -29837 -4011 19373 -21835 -45702 -3303 8608
148 8608 -22972 -12975 13665 583 -13545 7107 27406 7954 -10903 17871 28386 -10745
160 -10745 -13617 19755 8710 -22364 -11497 3966 -20976 -30655 6679 8015 -31056 -13752 24830
173 24830 9358 -3107 18598 20537 4434 7393 20629 11960 -9461 -6378 4297 -8166 -18986
186 -18986 -9729 -534 -7559 -19505 -7054 9692 -6047 -7612 17722 7804 -12876 9375 24677
199 24677 625 -8069 13797 12295 -12561 -4547 12615 -10100 -20413 4190 1899 -16910 -6602
212 -6602 8451 3198 -4294 2187 11890 5756 -620 7022 5457 -6290 -5794 2232 1062 -9677 -8950
227 -8950 5746 946 -10303 5474 11994 -5591 -2072 12570 4138 -7255 2050 9540 -3947
$$ packed form
136C4858J1985n2449L129L3959k5970l5349K5826K3384m1208k3867M2399J1911
148H608l1580R997K6640j3082j4128K0652K0299j9452j8857K8774J0515l9131
160a0745k872L3372j1045l1074J0867J5463k4942r679L7334J336l9071J7304L8582
173B4830j5472j2465K1705J939j6103K959J3236q669k1421L083J0675j2463j0820
186a8986R257R195p025j1946J2451J6746j5739j565K5334r918k0680K2251J5302
199B4677k4052q694K1866j502k4856Q014J7162k2715j0313K4603k291j8809J0308
212f602J5053n253p492O481R703o134o376P642j565j1747M96Q026j170j0739P27
227h950J4696m800j1249J5777O520j7585L519J4642q432j1393R305P490j3487
$$ plain form
240 -3947 -9548 5770 3947 -10939 -2904 4138 -6809 -8120 333 835 -3866 -4334 4158 6885 411
255 411 5139 11233 5109 1978 5302 4454 -2395 -7964 -2928 -2255 -12921 -10018 152 -5016 -6733
270 -6733 2930 4929 1407 3464 9091 7705 148 3278 8272 -560 -3615 2538 -68 -4597 -3159
285 -3159 -1343 -2054 -6220 -4793 -50 -4034 -6258 799 1610 -567 2348 5623 6970 4562 4702 8233
301 8233 3240 -2216 1881 -368 -7298 -6358 -4127 -5205 -6523 -4227 1357 -140 -1407 5488 5775 820
317 820 3487 5076 1620 -33 323 1387 -1110 -3724 291 65 -4256 -1281 500 -3005 -2827 -1240
333 -1240 -227 -1042 -1836 2274 3575 168 2963 5449 2433 1617 2145 903 -856 -3123 -2337 -1916 -5413
350 -5413 -3219 -196 -2423 -1219 2205 1721 1512 1530 2665 2897 -708 -118 2043 -1402 -2053 -13 -687
$$ packed form
240c947n601J5318j823j4886Q035P042j0947j311Q453N02m701m68Q492K727o474
255D11M728O094o124l131L324q48o849n569N036O73j0666K903J0170n168j717
270f733R663J999l522K057N627j386p557L130M994q832l055O153k606m529J438
285c159J816p11m166J427M743l984k224P057Q11k177K915L275J347k408J40L531
301H233m993n456M097k249o930R40K231j078j318K296N584j497j267O895K87m955
317H20K667J589l456j653L56J064k497k614M015k26m321K975J781l505J78J587
333a240J013q15p94M110J301l407K795K486l016q16N28j242j759k267P86M21l497
350e413K194L023k227J204L424m84k09J8J135K32l605N90K161l445o51K040o74
$$ plain form
367 -687 -941 -455 -311 589 -992 -520 1829 -459 -880 1579 456 218 1286 885 1256 455 15 1206
385 1206 -846 -2494 -472 -1470 -2522 -1482 -1162 376 826 -96 2478 2505 622 2804 2517 -17 449
402 449 333 -709 -1569 -2261 -1342 -1843 -2817 101 -698 -2381 516 1303 114 1305 1363 2013 3129 1325
420 1325 1385 2137 670 719 -52 -1570 -1953 -3180 -2321 -2116 -4362 -2097 382 -2003 -220 2708 985
437 985 1176 3659 3233 1308 937 2601 1632 -1452 -314 376 -2709 -1639 -700 -3044 -2276 -1062 -1645
454 -1645 -1075 -1144 -170 1533 859 1682 2665 1718 2165 2547 1420 1027 -715 -920 26 -2838 -3636 -1042 -2246
473 -2246 -2227 210 -638 -574 1451 2105 1195 648 1854 2302 -350 405 1161 -1630 -579 1303 -1682 -1618
491 -1618 5 -927 -1206 -325 -403 -933 -697 930 1160 -368 1441 2667 750 1760 1942 -11 182 -258
$$ packed form
367f87k54M86J44R00j581M72K349k288m21K459j123k38J068m01L71q01m40J191
385A206k052j648K022r98j052J040L20J538M50r22K574K7j883K182k87k534M66
402D49j16j042q60o92R19n01r74K918p99j683K897P87j189J191N8O50J116j804
420A325O0P52j467M9p71j518l83j227Q59K05k246K265K479k385J783K928j723
437I85J91K483m26j925l71J664r69l084J138O90l085J070R39k344P68J214n83
454a645N70o9R74J703o74Q23R83r47M47L82j127l93j742k05R46k864p98K594j204
473b246J9K437q48O4K025O54r10n47J206M48k652P55P56k791J051J882k985O4
491a618J623r32k79Q81p8n30K36J627K30j528J809J226j917J010J82j953J93m40
$$ plain form
509 -258 -1489 -1158 -2538 -2353 -827 -2015 -1377 629 683 828 1970 2255 1875 791 2136 1917 -1318 -459
527 -459 1721 -1405 -1986 65 -1332 -1726 124 -453 -1869 -1751 192 251 -1201 287 1487 148 1195
544 1195 3164 1763 1451 1277 1219 1006 -833 -1399 -618 -2386 -2763 -1135 -2020 -2040 -105 144 -387 519 1720
563 1720 1866 44 1068 2019 -377 189 1566 -433 -431 1363 228 -599 -362 -773 -396 -768 -1033 -1305
581 -1305 -2253 -893 241 -188 -95 420 805 2094 1251 830 1695 320 -350 1317 -146 -1575 -91 -332
599 -332 -1176 -275 338 -686 -1010 296 490 -1714 -504 1208 -1440 -1077 1457 147 -79 1700 759
616 759 299 1450 1219 403 -834 77 -84 -1405 -628 -538 -1764 -308 198 -671 178 -93 -528 1221 744
635 744 -419 313 503 119 573 596 361 -324 132 1063 -562 -893 674 -1228 -1654 272 -632 -1402 154
$$ packed form
509b58j231L31j380J85J526j188O38K006N4J45J142K85l80j084J345k19l235Q59
527d59K180l126n81K051j397l94J850n77j416J18J943N9j452J488J200j339J047
544A195J969j401l12j74n8k13j839n66P81j768l77J628q85k0J935K49n31R06J201
563A720J46j822J024R51k396N66J377j999KJ794j135q27K37m11L77l72k65k72
581a305r48J360J134m29R3N15L85J289q43m21Q65j375o70J667j463j429J484k41
599c32q44R01O13j024l24J306J94k204J210J712k648L63K534j310k26J779r41
616G59m60J151k31q16j237R11j61j321P77R0j226J456N06q69Q49k71m35J749m77
635G44j163P32J90l84M54K3k35o85M56R31j625l31J567j902m26J926r04p70J556
$$ plain form
654 154 340 -271 276 962 1027 254 412 1088 -71 27 1017 -675 -634 477 -326 -482 -111 -624 15 -112
674 -112 -378 -33 -253 -19 560 46 325 409 119 1083 652 -376 316 -94 -846 -28 -466 -1140 -551 -308
694 -308 -111 -6 -60 637 346 97 873 265 -62 748 69 -509 200 -66 -211 -71 -192 106 -136 -434 130
715 130 -286 -665 25 -455 -502 457 -19 445 783 536 605 366 56 692 -138 -720 -62 -697 -651 -51 -581
736 -581 -404 245 9 304 416 163 392 111 44 311 -206 -159 284 -182 239 280 -295 615 388 -523 -81
757 -81 -75 -620 -361 -514 -291 -118 -131 277 409 20 827 536 -60 633 370 -343 8 -116 -405 0 -240 123
779 123 155 -41 116 -143 -10 307 -272 -451 261 -374 -377 228 -69 145 695 41 375 535 171 365 -90
800 -90 -197 40 -721 -381 -153 -523 -146 276 -48 368 331 -94 322 140 16 182 -211 96 227 -240 258
$$ packed form
654A54J86o11N47O86O5p73J58O76j159R8R90j692M1J111q03j56L71n13O39j27
674a12k66L45k20K34N79n14K79Q4k90R64m31j028O92m10p52Q18m38o74N89K43
694c08J97J05n4O97k91k49P76o08l27Q10o79n78P09k66j45J40j21K98k42k98N64
715A30m16l79O90m80m7R59m76M64L38k47O9k39l10O36q30n82O58o35M6O00n30
736e81J77O49k36K95J12k53K29k81o7K67n17M7M43m66M21M1n75R10k27r11M42
757h1On45K59j53K23J73j3M08J32l89Q07k91n96O93k63p13L51j24k89M05k40L63
779A23L2j96J57k59J33L17n79j79P12o35lO05k97K14N50o54L34J60l64J94m55
800i0j07K37p61L40K28l70L77M22l24M16l7m25M16j82j24J66l93L07J31m67M98
$$ plain form
821 258 388 -110 218 -18 -441 306 -278 -379 -70 -346 -386 12 -245 63 198 155 582 491 56 522 84
842 84 37 41 -97 -174 -15 -375 -199 -149 -670 -64 138 -223 247 1 44 227 -56 158 408 320 275 375 271
865 271 171 183 -265 311 -438 -448 -234 -469 -186 -143 -482 -14 193 -187 476 293 363 363 345 209 414 -113 38
888 38 87 -525 -91 -167 -570 -255 -3 -446 -158 -334 0 109 -149 220 210 185 575 411 51 496 244 -208
910 -208 332 -212 -216 -78 -315 -143 -54 -495 -30 -148 -310 12 -142 -115 219 51 100 253 132 395 69 -136
932 -136 340 270 -481 -108 -202 -403 -163 -100 -28 -192 -274 167 83 -123 300 33 -38 439 133 22 284 -68 84
955 84 301 -118 -48 349 -395 -135 243 -260 44 -280 -147 -54 -263 104 164 -229 186 464 -145 411 460 -103
977 -103 -63 163 135 -152 -192 101 -165 -360 106 7 -492 254 441 -423 198 -34 -226 8 245 195 58 -14
$$ packed form
821B58J30m98L28k36m23P47n84j01L09k76m0L98k57L08J35m3M27r1m35M66m38
842H4m7Mj38p7J59l60J76N0n21O06K02l61M70k46M3J83k83K14K50q8m5J00j04
865B71j00J2m48N76p49j0K14k35K83M3l39M68K07l80O63j83P0%j8j36K05n27J51
888C8M9o12M34p6m03L15K52m43K88j76L34J09k58L69j0k5L90j64l60M45k52m52
910b08N40n44mJ38k37J72Q9m41M65j18j62L22j54K7L34j68M9J53j21K63l26k05
932a36M76p0p51L73r4k01K40O3P2j64q2M41q4k06M23k67p1M77l06j11K62l52J52
955H4K17m19P0L97p44K60L78n03L04l24J33R3k09L67O0l93M15K78o09N56M9n63
977a03M0K26k8k87m0K93k66j95M66r9m99P46J87q64O21k32j92K34K37n0j37p2
$$ plain form
999 -14 190 79 -110 75 -124 -270 83 -160 -170 -135 -542 -123 224 -322 -70 417 -45 103 298 383 66 -44
1021 -44 189 84 -226 170 61 -553 -130 196 -170 -2 -57 -261 -399 153 -39 -118 -53 403 244 251 264 150
1043 150 -127 175 93 -135 145 -341 -182 27 -335 -115 37 -238 -82 80 -36 103 326 234 49 83 218
1064 218 287 -118 18 33 -315 -105 -29 -428 -286 -113 -114 -123 -167 -33 124 -93 -46 71 -120 172 350 185 171
1087 171 -41 82 198 -218 -143 -100 -278 -184 69 -300 -250 108 148 -161 10 173 234 -189 270 294 -277 153
1109 153 268 -307 -164 -28 -200 -239 63 -150 -141 -114 -6 107 -83 -168 254 118 188 11 3 240 -81 40 287
1132 287 -236 -202 202 -198 -162 -47 -278 -190 -167 -5 27 -250 99 71 -88 16 312 -16 97 310 63 136
1154 136 10 46 -169 -170 -137 104 -121 -90 202 -105 116 12 -83 136 55 -134 116 -32 -87 118 -56 -118 -11
$$ packed form
999a4K04j11j89J85j99j46L53k43j0L5m07M19L47n46K52M87m62J48J95Q5l17j10
1021d4K33j05l10L96j09o14M23L26l66J68n5k04j38N52j92p9O5M56j59PJ3j14
1043A50k77L02q2k28K80m86J59K09l62K20J52k75J56J62j16J39K23r2j85L4J35
1064B18O9m05J36J5l48K10P6l99J42J73jrm4J34J57k17M7J17j91K92J78j65j4
1087A71k12J23J16m16P5M3j78R4K53l69N0L58M0l09J71J63O1m23M59K4n71M30
1109A53J15n75J43J36j72l9L02k13RK7J08J13j90q5M22j36P0j77qK37l21J21K47
1132B87n23L4M04m00L6J15k31Q8K3J62L2k77L49k8j59J04K96l28J13K13k47P3
1154A36j26L6k15jL3K41k25L1K92l07K21j04r5K19q1j89K50j48n5K05j74o2J07
$$ plain form
1177 -11 -105 43 -107 -189 75 -68 -33 40 -161 -51 117 -64 33 172 76 128 68 -29 274 132 5 24 -73 -211
1201 -211 104 -225 -110 78 -87 47 29 -126 185 -161 -37 57 -45 31 229 29 -115 393 47 65 75 32
1223 32 164 -1 -133 2 -274 66 146 -16 19 54 -62 179 97 -72 -6 68 113 14 115 -16 194 118 43 132
1247 132 -83 181 -68 -18 -59 -208 -201 -115 -213 -87 -136 -42 -89 -27 124 190 54 143 250 54 -34 176 65 -200
1271 -200 39 -181 -233 -166 -216 -61 32 -28 101 -56 -25 -141 1 9 214 -107 89 145 -69 92 -31 -131 79
1294 79 84 -43 45 -82 -206 53 -222 63 54 182 14 196 6 88 172 -46 135 -49 -49 -130 26 -87 197 -202
1318 -202 -140 34 19 257 -194 74 110 -114 -62 53 -28 122 196 -113 94 115 -96 233 -56 -63 -9 -13 -60 82
1342 82 -172 -201 -93 -123 143 -12 -66 235 -64 29 87 -195 -26 23 -109 -90 -44 -43 63 -120 -30 -50 17 183 26
$$ packed form
1177a1r4J48j50q2K64j43L5P3k01J10J68j81R7J39r6N2o0r7L03j42j27J9r7j38
1201b11L15l29J15J88j65J34j8j55L11l46J24R4j02P6J98k00j44N08l46J8J0m3
1223C2J32j65j32J35k76L40Q0j62L5L5j16K41q2j69O6P4M5r9J01j31K10p6p5Q9
1247A32k15K64k49N0m1j49PQ6r8J26m9R4m7O2J51O6j36Q9J07j96q8K10j11k65
1271b00K39k20n2O7n0J55R3o0J29j57L1j16J42QK05l21J96N6k14J61j23j00K10
1294G9Nj27Q8j27j24K59k75K85rJ28j68J82j90Q2Q4k18J81j84%q1J56j13K84l99
1318b02O2J74j5K38m51K68L6k24N2J15q1J50P4l09K07K1k11L29k89pN4mm7J42
1342H2k54k9J08l0K66j55n4L01k99R3N8k82J69M9j32J9M6JJ06j83R0k0O7J66j57
$$ plain form
1367 26 -63 -39 -23 -94 19 -36 34 147 -36 -113 -10 124 13 56 -2 31 0 -107 41 -162 -123 29 -177 -35
1391 -35 93 -91 -4 139 -7 -68 35 47 14 -294 1 199 30 140 190 -94 -36 105 50 -46 -59 -204 -56
1414 -56 2 -125 76 -76 -52 19 -95 7 158 -93 118 134 -62 147 -36 -98 -59 -22 -200 -49 165 -149 -125
1437 -125 -53 -116 9 -35 69 49 7 43 90 -24 36 128 101 59 -40 137 -74 -214 -59 42 -38 94 67 -250 -75
1462 -75 -49 160 89 56 134 25 -90 -20 -41 -153 112 -81 -176 -130 -123 -72 -125 -49 -82 3 -100 23 -102 111 52 133
1488 133 -74 -28 -26 102 144 -179 63 -18 -211 168 -5 -36 -24 -154 39 -38 -81 21 217 79 132 -71 16 88
1512 88 -47 -89 -2 140 23 43 -95 -50 -160 -58 133 -107 11 119 10 -57 25 -46 161 -61 93 134 70
1535 70 -133 14 -67 -35 -43 -90 -10 -29 -152 78 -54 16 7 4 27 156 -7 -28 -49 6 59 65 -67 -84 -143 147 -162
$$ packed form
1367B6q9K4J6p1J13n5P0J13j83p7J03J34j11M3n8L3l1j07J48k03L9J52k06J42
1391c5J28j84Q7J43j46o1J03J2l3l08K95J98j69J10N0k84N8J41n5r6j3j45J48
1414e6N8j27K01j52K4P1j14J02J51k51K11J6j96K09j83o2L9L7j78J51K14l14K4
1437a25P2o3J25m4J04k0m2L6M7j14O0R2k7m2r9J77k11j40J55J01q0J32k7l17J75
1462g5K6K09p1l3P8j09j15P0k1j12K65j93r5M6PN1n3P6l3Q5j03J23j25K13n9Q1
1488A33k07M6KJ28M2l23K42q1j93L79j73l1J2j30J93p7m3J02J96j38N3k03Q7P2
1512H8j35m2Q7J42j17K0j38M5j10J02J91k40J18J08j09o7Q2p1K07k22J54M1o4
1535G0k03J47q1L2qm7Q0j9j23K30j32P0rlK3J29j63k1k1N5N3Oj32j7n9K90l09
$$ plain form
1562 -162 6 -84 -70 -39 -182 -63 -59 -60 33 118 -161 -12 110 -27 20 -1 -75 104 -178 -8 54 -101 -97 99 -188
1587 -188 82 -70 95 -22 -53 -8 -83 151 90 34 53 43 40 30 -6 -24 7 66 -56 -40 -143 -110 -105 89 -141 -9
1613 -9 -13 7 54 -10 63 13 49 -63 56 -86 111 22 -129 63 -30 114 55 -108 -2 142 99 39 39 -162 9 42
1639 42 -57 -74 -70 -54 85 25 197 0 36 129 -137 10 8 -7 155 -17 14 -37 28 202 31 -5 -53 76 19 117
1665 117 -71 -77 -4 27 -48 55 32 30 53 -72 -89 -137 -54 -107 178 68 21 -56 -209 -93 5 -129 55 28 119 45
1691 45 193 78 15 -1 124 86 -73 22 -42 10 -105 -91 -44 33 -157 -61 -171 19 -103 145 31 -87 -5 73
1715 73 -22 80 128 223 -104 -66 55 -24 -43 70 -20 -47 -16 -73 -87 35 20 -78 -112 -139 24 -74 -16 149 -113 -30
1741 -30 43 -56 4 -59 39 -102 75 -136 111 94 -52 108 64 -35 9 73 -12 -27 106 89 7 -98 16 161 136
$$ packed form
1562a62J68r0J4L1j43J19MjR3Q5k79J49J22j37M7k1p4J79k82J70O2j55MJ96k87
1587a88K70j52J65j17l1M5p5K34o1n6J9j0lj0l6j8L1N9j22J6j03L3NJ94k30J32
1613imK0M7o4P3n0L6j12J19j42J97q9j51J92r3J44n9j63J06J44m3o0%k01J71L3
1639D2r9j7MJ6J39o0J72j97L6R3k66J47kj5J62j72L1n1O5J74j71l6m8J29n7R8
1665A17j88oP3L1p5J03k3kK3j25j7m8Q3n3K85j10m7p7j53J16R8j34J84k7R1p4
1691D5J48j15o3j6J25l8j59R5o4N2j15J4M7P7j90R6j10J90j22K48j14j18Q2P8
1715G3r5J02M8R5l27L8J21p9j9J13r0k7L1n7j4J22j5r8l4k7J63r8N8J65k62Q3
1741c0P3r9O0o3R8j41J77k11K47j7j46J60m4r9M4O4q5j5J33j7q2j05J14J45k5
$$ plain form
1766 136 118 87 79 19 158 25 25 -113 -2 -23 87 60 121 -12 -2 117 55 111 27 47 211 134 28 -42 38 -21
1792 -21 -124 1 -168 -100 161 27 149 -49 12 0 132 -92 -123 4 -182 -138 -8 -5 -73 79 -96 -123 -45 -86
1816 -86 -97 -43 3 142 70 155 95 -112 165 132 40 -27 30 36 147 -91 -161 169 96 73 -22 -47 11 96 107 -218 112
1843 112 37 10 -18 -29 6 87 -25 -44 -166 -189 56 81 -279 -49 -11 -55 -56 63 229 -54 155 -25 148 51 14
1868 14 209 69 -110 76 60 -9 -131 -10 -44 65 187 90 93 59 155 80 120 -32 113 -30 47 -117 -10 22
1892 22 -18 -3 -103 94 108 190 78 -44 -68 -114 -48 16 37 -32 -26 -74 -52 63 -29 -113 87 -41 111 61 -9 -84 10
1919 10 -279 36 21 -41 -134 -128 23 145 31 110 -39 -58 18 20 -13 -52 8 43 63 3 -4 -69 3 -11 19 -46 31 69 12
1948 12 -170 30 69 -75 46 136 -29 72 -62 128 99 -16 -19 -40 281 146 -103 -31 28 145 -35 -77 -65 -7
$$ packed form
1766A36j8l1qo0J39j33%j38J11k1J10k7O1j33J0J19o2N6q4K0J64p7j06p0Q0n9
1792b1j03J25j69O8K61j34J22j98O1j2J32k24l1J27j86M4J30Lo8J52j75k7P8m1
1816h6j1N4M6J39p2Q5o0k07K77l3r2o7N7OJ11k38p0L30p3k3r5k5N8Q5J1l25L30
1843A12p5k7k8j1L5Q1j12j9j22k3K45K5l60K30L8m4jJ19J66k83K09j80J73r7l7
1868A4J95j40j79J86j6o9j22J21l4J09J22r7Ll4R6p5M0j52J45j43P7j64J07L2
1892B2m0J5j00J97J4Q2j12j22k4m6O6O4K1o9Om8K2J15r2q4K00j28J52n0p0p5R4
1919A0k89L15j5o2r3OJ51J22j14P9j49j9P6Kl3l9O0L5K0o0po5P2j4L0o5P7L8n7
1948A2j82K00L9j44J21R0j65J01j34J90k9j15lk1L21j35k49P2N9J17j80m2J2N8
$$ plain form
1972 -7 63 -86 -10 170 -44 -54 131 -139 -15 72 95 26 -57 23 -57 159 15 -110 79 92 193 122 78 -207 -199
1997 -199 -221 -62 75 -187 2 -41 70 144 145 -7 -2 108 53 114 -16 -70 -198 -124 -10 84 -80 -55 -98 -74 -5
2022 -5 133 11 -38 -204 -129 119 30 -60 -81 117 -29 -10 -30 -183 68 -6 -54 9 -108 -175 -60 -217 41 132 145
2047 145 75 9 11 -26 -128 103 127 161 0 -30 123 -82 -162 -246 -31 -53 92 -96 46 81 -88 -31 -46 -99 52
2072 52 -49 -10 42 18 -77 54 -96 10 -66 -81 5 149 9 49 -88 -59 -10 -200 153 -32 -112 -142 -17 -57 -30
2097 -30 -66 -79 178 8 25 76 -37 48 2 155 118 -92 118 -12 -104 -17 26 -36 -91 71 -49 123 114 43 0 33
2123 33 19 126 -103 -67 -128 59 84 122 48 -75 63 71 90 -49 -25 20 16 107 -105 -49 -149 181 205 34 -22 123
2149 123 -135 -42 -138 -3 -35 30 28 -93 79 80 121 72 -31 -74 -129 -12 -42 81 65 -112 95 22 91 -330 -75
$$ packed form
1972gP0j49P6J80k14j0J85k70J24Q7K3o9q3Q0q0K16j44j25J89J3J01p1m4k85Q
1997a99k2J59J37k62J89m3J11P4Jj52NJ10n5O1j30n4j28P4J14R4j64K5m3K4O9
2022eJ38j22m9j66P5K48q9r0k1J98j46J9k0j53K51p4m8O3j17o7J15j57K58R1J3
2047A45p0o6Kl7j02K31K4L4j61l0J53k05q0q4K15k2J45j88J42L5j69N7j5n3J51
2072E2j01L9N2k4r5J31j50J06p6j5Q6J44j40M0j37K9M9j90L53j85q0l0J25m0K7
2097c0l6j3K57j70J7N1j13Q5m6J53l7k10K10j30r2Q7M3o2n5J62j20J72rp1m3L3
2123C3j4J07k29L6o1J87K5L8p4j23J38QJ9j39K4M5mR1k12N6j00L30K4j71n6J45
2149A23k58R3r6J35l2O5kj21J72JM1m9j03m3n5J17l0J23j6j77K07p3O9m21K55
$$ plain form
2174 -75 6 114 -111 -114 127 -145 100 -93 -141 -169 -182 102 -66 -59 50 -127 118 152 -53 -3 105 113 -16 -80 135
2199 135 92 -236 -58 -128 -222 25 113 -132 28 82 -48 -87 -45 50 109 100 -39 88 114 37 -73 64 1 84 3
2224 3 -154 -48 -30 -87 -101 -37 59 33 -2 -183 4 95 121 12 36 96 159 -51 -66 -32 16 -54 -205 41 -57 -115 -162
2251 -162 23 101 69 -145 130 -50 39 -140 41 98 54 86 -126 -29 70 12 -65 160 -147 -45 198 -265 53
2274 53 -76 -14 66 -88 -67 -51 109 -187 31 68 -19 50 22 112 95 -38 -39 2 -28 82 180 11 88 74 70 -105 -83
2301 -83 67 -2 -31 82 27 96 16 95 73 19 -3 -82 5 -32 -2 -134 -29 -47 167 -80 -22 201 28 -134 121
2326 121 -45 140 217 91 62 11 167 167 -32 -15 139 -43 97 -62 70 6 105 27 57 -18 -202 35 22 112
2350 112 128 -65 -39 36 -17 135 32 75 30 24 116 -69 69 60 187 103 5 12 20 -114 137 -15 76 -52 68 196
$$ packed form
2174g5Q1J08k25lK41k72K45j93m8k8j3K84j68PJ09j77K45L4k05N0J08Qj29o4K15
2199A35m3l28J78p0r4K47Q8k45J60N4j30l9M2R5N9rj39J27K6p7j10J37o3Q3q1
2224Cj57J06J8n7j4O4R6k6l5j81J87R1K6j09K4O0O3k10j5L4M8p0j51K46r8n8m7
2251a62J85P8l2k14K75j80Q9j79J81N7m4L2k12R7R9n8p7K25l07J02K43m63L18
2274E3j29O2Q0j54K1J6J60k96K18L7q7O9k8R0j7j33jM1l0J10R8j69P7j4mj75K2
2301h3J50o9k9J13n5O9q0P9k2n4k2p9Q7l7L0j32J05j8K14k47N8K23j73j62K55
2326A21j66J85P7j26k9n1J56%j99J7J54j82J40j59J32o4R9p8L0p5j84K37j3R0
2350A12J6j93K6P5n3J52j03M3m5oR2j85J38rJ27q4r8PQj34K51j52R1j28J20J28
$$ plain form
2376 196 -106 174 -118 125 1 15 -164 -80 68 7 -40 -9 75 18 -91 -60 16 -113 79 -87 -4 19 -34 -125
2400 -125 130 34 83 -46 -33 33 -87 2 46 77 160 27 -186 58 28 -26 42 55 -2 142 -80 -50 -50 85 -66
2425 -66 -81 -104 -27 -71 21 41 111 -98 20 -103 -76 -53 -125 186 -23 -87 61 -38 -20 -258 73 -185 -49 -15 68
2450 68 199 -111 72 -63 6 -92 -95 88 -15 -5 5 -24 98 -44 124 38 25 -3 4 127 -92 77 35 131 67
2475 67 25 26 148 77 -51 18 48 -11 -56 65 -34 -111 -124 114 -105 180 106 -120 -100 -11 236 45 183 85 51 21
2501 21 15 -4 -127 9 -76 30 52 -142 57 -63 21 -53 -149 -2 52 46 -193 40 -43 138 13 114 21 -64 -34
2526 -34 -106 -111 59 70 4 -2 -13 25 -61 77 -48 36 -97 -112 75 -154 84 68 150 -39 -49 125 -15 -37 -105 -113 -99
2553 -99 20 -66 13 -12 82 61 -54 44 54 31 -102 -25 -108 158 192 114 -133 48 78 -45 -83 30 135 63 139 -86
$$ packed form
2376A96l02K80k92K43j24J4j79Q4J48o1m7L1Q4n7j09L1P6j29J92j66Q3K3n3r1
2400a25K55r6M9j29J3O6j20Q9M4L1Q3j33k13K44l0n4O8J3n7J44k22L0%J35j51
2425f6j5k3P7m4R2K0P0k09J18j23K7K3p2L11k09o4J48r9J8k38L31k58J36L4Q3
2450F8J31l10J83j35O9r8lJ83j03J0J0k9J22j42J68q6j3k8PJ23k19J69m2R6o4
2475F7m2JJ22p1j28O9L0n9m5J21r9p7j3K38k19K85p4k26K0Q9K47j91J38r8l4l0
2501B1oj9j23J36q5J06K2j94J99j20Q4p4r6J47N4ok39K33q3J81j25J01r3q5L0
2526c4p2nJ70J1o6oj1L8q6J38j25Q4j33j5J87k29K38j6Q2j89j0J74j40k2o8qJ4
2553i9J19q6P9k5R4k1j15R8J0k3j33P7q3K66L4p8k47J81L0j23l8J13J05p2P6k25
$$ plain form
2579 -86 109 -139 36 32 12 165 54 7 -68 46 3 -102 63 25 78 163 96 30 -16 158 142 35 84 95 -49
2604 -49 64 38 111 7 -51 187 14 7 -64 -2 32 -45 45 51 -40 34 105 169 -4 57 150 39 -3 51 -46 -26 -96 31
2632 31 0 16 25 30 -36 -115 -64 30 27 -68 -19 151 49 -10 -71 -155 -92 -193 0 84 -6 -53 16 -2 176 -2 103 -35
2660 -35 -74 -29 69 -50 -23 -25 -122 113 38 -4 -40 -43 -55 123 149 193 58 39 -9 -38 -138 -145 -30 -146 -139 3 -96 158
2688 158 -79 -48 113 177 -5 -12 -8 -149 -114 -45 68 148 -60 -146 158 -51 49 102 -106 -36 55 -112 -51 39 -133
2713 -133 41 15 145 9 -147 103 -20 -75 -71 151 16 17 91 211 57 57 49 -94 65 -67 105 157 167 -34
2737 -34 2 -49 18 -102 -73 -132 -64 78 -4 148 -61 39 2 -154 -92 32 38 -2 120 62 158 96 184 -119 92 70
2763 70 94 128 -111 -78 -53 -27 49 -72 62 78 11 12 -82 -4 -42 14 73 -56 19 182 -113 -92 191 -80 -86 33 -48
$$ packed form
2579h6J95k48J75mk0J53j11m7p5J14m3j05J65l8N3Q5o7o6m6J74j6j07M9J1j44
2604d9J13k6P3j04n8K38j73pp1O2L4p7R0Or1P4P1O4j73O1R3j11m2N4r7K0p0J27
2632C1l1J6RNo6p9N1R4lr5M9J70j02n9o1q4O3j01J93Q4r0m7O9j8J78j78J05j38
2660c5l9M5R8j19K7kr7K35p5m2l6lj2J78K6M4j35j9m8k9j00pJ15j16PJ42r9K54
2688A58k37L1J61O4j82pMj41L5O9J13Q0k08q6L04k09J00N3k08P0R1j67O1R0j72
2713a33J74k6J30j36j56K50j23n5MK22j35JP4J20j54%qj43J59j32J72N2J0k01
2737c4L6n1O7j20K9n9O8J42q2J52k09J00l7j56O2J24Om0J22n8R6o2Q8l03K11k2
2763G0K4L4k39L3K5K6P6j21J34J6o7Jr4P8l8N6N9j29P5J63k95K1K83k71oJ19q1
$$ plain form
2790 -48 -9 -28 -91 -9 108 -36 19 -146 -74 -35 -78 -68 178 -80 53 -35 -1 38 189 101 -64 29 33 -13 -187 1
2816 1 80 19 -113 115 12 117 8 38 -70 135 -66 -115 48 7 40 -134 -89 68 35 -15 103 65 11 56 50
2841 50 118 -20 66 5 -49 -45 -5 -21 66 60 -138 155 84 -29 -10 51 -29 -63 -111 56 -120 0 -16 154 43 8 178
2868 178 195 73 69 80 -44 -64 230 -101 79 -52 166 -108 47 55 -277 33 78 4 77 108 175 -93 -34 -20 -35
2893 -35 174 8 52 24 -15 10 177 -199 161 26 59 40 136 9 -99 61 186 152 -4 -47 1 24 129 -120
2917 -120 18 -80 52 29 173 -80 -14 34 -52 -40 -79 -68 -26 -68 28 -18 24 58 -54 -8 -182 -134 102 -28 -71 64
2943 64 57 -141 -144 -64 -29 10 -108 -158 -97 104 90 -82 9 33 51 -5 -152 -92 -69 -142 32 -32 -24 60 169 172 0 -9 -105
2972 -105 95 -90 23 1 28 -148 -44 -48 19 -156 41 162 21 -51 31 35 -31 -108 25 -10 -4 143 17 63 133
$$ packed form
2790d8L9j9o3Q2J17j44N5j65P2L9m3J0K46k58J33q8L4L9J51q8j65R3Mm6j74J88
2816AP9o1j32K28j03J05j09L0j08K05k01m9J63m1L3j74M5J57l3n0J18l8n4M5o
2841E0O8j38Q6o1n4MM0j6Q7oj98K93p1j13J9O1q0l4m8J67j76J20j6J70j11l5J70
2868A78J7j22mJ1j24k0K94l31J80j31K18k74J55Ql32L10M5p4P3L1O7k68N9J4j5
2893c5K09j66M4k8l9K5J67l76L60j35L3j9R6j27j08J60J25l4j56m3M8K3J05k49
2917a20J38r8J32k3J44k53O6M8q6J2l9J1M2m2R6m6M2L4j12M6j74M8K36j30m3J35
2943F4pj98lQ0L5L9j18n0O1K01j4j72R1K4J8n6j47O0K3p3J74o4QQ4J09Lj72rr6
2972a05K00j85J13k2K7j76J04mO7j75J97J21j41p2Q2Mo6p7J33l5OJ47j26M6P0
$$ plain form
2997 133 -151 72 71 41 -41 -44 145 -34 101 187 82 -56 113 126 46 -80 76 44 10 -4 115 59 -108 11
3021 11 -1 -30 96 108 -64 -170 -3 -41 -91 -32 -30 7 -13 129 -40 -6 -58 -17 -7 -22 107 52 -4 124 41 50 36
3048 36 11 -184 15 13 -34 -15 119 0 10 -105 76 -46 2 -41 18 65 -29 51 -94 28 45 81 -41 -70 -95 -87
3074 -87 22 19 66 -46 -141 37 -61 23 39 -120 -24 78 -39 -95 -15 39 141 -181 28 -171 -129 -47 -127 170 -51
3099 -51 -15 -96 151 11 -119 -27 -81 -14 -133 -15 35 -97 -169 -94 -40 -102 -56 -67 126 -38 27 -67 -48 -20 -12 178
3125 178 -46 -85 -29 34 13 -33 77 143 -65 18 -95 36 98 24 7 -74 159 -15 70 -58 154 121 -49 -67 58
3150 58 -158 -46 42 -10 114 66 -2 -51 -81 113 49 -17 169 18 172 -115 191 95 -106 -23 -158 -6 -74 -31
3174 -31 40 27 -17 109 -75 111 31 -25 79 2 -25 10 107 -53 -204 -91 -71 159 -45 16 -92 -164 97 119 26
$$ packed form
2997A33k84K23jl0q2lJ89j79J35Q6j05j38J69J3q0j26J56l2l4j4J19n6j67J19
3021A1j2k9J26J2j72j06J67l8n0N9KL7k0J42j69L4n2M1J0j5J29n5n6J28q3Rj4
3048C6k5j95J99km7J9J34j19J0j15J81j22M8m3N9M7r4Q0j45J22J7L6j22k9k5Q
3074h7J09lM7j12r5J78r8Q4J6j59R6J02j17n6Q0N4J02l22K09j99M2Q2q0K97k21
3099e1L6q1K47j40j30R2n4O7j19J18N0j32p2P5N4o2M6j1J93j64O5r4J9K8QJ90
3125A78k24l9N6O3k1m6J10O6k08Q3j13J31O2p4j7q1K33j74Q5j28K12l3j70j8J25
3150E8k16J12Q8n2J24m8o8m9l0J94o4o6J86j51J54k87L06r6k01Q3j35J52o8M3
3174c1P1j3m4J26j84J86q0n6J04p7k7L5R7j60j51J13K0K30k04O1j08p2K61K2r3
$$ plain form
3199 26 -54 55 131 48 20 -89 -38 -60 -29 -29 -177 57 55 -89 102 -62 -152 61 -147 -47 -1 -58 138 37 -113
3224 -113 106 89 119 -51 -116 -213 121 -22 6 31 99 -25 -4 58 -38 12 158 25 107 174 31 -14 129 12 -85
3249 -85 -35 3 -36 56 156 -142 4 11 140 -63 -87 109 117 -55 -327 -67 35 62 54 111 -8 -25 159 163 -12 -91
3275 -91 -44 221 -121 143 0 -76 59 -65 -51 86 82 71 34 67 -28 -23 -12 -81 23 -3 -43 -19 -100 76 48 -51 -112
3302 -112 -44 -33 158 -47 -45 42 78 22 90 69 50 41 31 108 -76 -55 -26 31 -14 -135 90 -63 62 -57 38 -63
3328 -63 56 -98 166 42 4 68 56 9 28 -40 -40 48 -47 74 4 -148 -9 169 -51 3 23 -95 -48 -111 -40 185
3354 185 -27 -66 -21 162 108 -269 -97 -22 46 -44 6 23 41 -150 -167 -50 80 -83 -35 -26 -110 94 164 -6 227
3379 227 -50 -30 -65 -52 52 1 -11 -59 87 -95 -28 120 -25 -34 10 -267 -81 56 120 -80 -75 89 74 -1 59
$$ packed form
3199B6q0J09P6q3k8j09N1k2L1%j48K34kj44J91j64r0K13k08J00M6n7J96j01j50
3224a13K19j7L0j70o5r7L34j43K8K5O8j24K1O2r6N0J46j33Q2O7j43m5J43j17r7
3249h5N0L8l9R2J00k98J46PJ29k03k4J96Qj72k72K60J02K7qN7j19j7J84Mj75p9
3275i1M7K65l42K64j43p6J35j24J4J37mj1l7L3r5NJ1o9J04k6m0K4q1J76k8r9o1
3302a12O8J1J91k05KQ7L6n6O8k1j9rj0P7j84K1K9N7m5j21K25j53J25j19R5j01
3328f3J19j54K64j24l8O4j2m7J9o8%Q8r5J21p0j52J39J78k20N4K0j18M7o3P1K25
3354A85k12l9M5J83n4l77J72P5O8r0N0J7J8j91j7J17J30j63M8Rq4K04P0j70K33
3379B27k77K0l5J3J04n1j2m8J46j82O7J48j45rM4k77J86J37O4k00NJ64j5p5O0
$$ plain form
3404 59 70 -28 -140 -33 59 142 75 35 9 29 62 98 63 -30 266 7 -47 60 77 -128 64 101 -10 -53 -19 -41
3430 -41 14 11 31 45 56 1 -13 38 104 80 -44 -79 99 18 99 21 -52 36 -82 72 -139 -7 -104 13 -90 -93 78
3457 78 55 -38 -189 -96 -17 121 -36 111 -33 70 -140 -74 37 -58 -26 55 -40 110 31 -10 188 187 81 -183 -58
3482 -58 -13 -45 56 0 -207 -111 145 -57 15 181 -27 137 -129 197 -7 -119 123 3 -23 -106 128 -88 -46
3505 -46 110 -24 48 21 -14 -83 6 6 3 -46 53 -16 -166 -44 53 -95 -131 -19 174 -17 -113 197 -222 -40 69
3530 69 123 1 -141 -150 113 -36 80 37 -93 7 112 136 -14 78 77 45 75 -114 45 -166 -75 90 57 -62
3554 -62 -82 -17 -127 142 -85 81 73 198 -5 -38 60 154 12 -116 82 -63 205 -140 -110 23 -14 -2 -1 -221
3578 -221 -48 28 40 -38 -81 155 53 39 29 -29 -4 86 -148 -38 -14 73 34 -125 -52 -38 -29 -121 86 10 98 -110
$$ packed form
3404E9J1r8j12J07R2Q3o7m0k6K0L3L6l5r3K96k59n4J07J7k05J92L7j11m3L4k2
3430d1N5lK0J4J1n5j4N1O6k4j24l5J78q1Q1p8p3Q8j18J54k11J32r7J17j03lJ71
3457G8k3r3j51R3P9J38j57J47j44J03k10O6J11r5L2Q1r5J50p9m1J98jj06k64J25
3482e8M5l2J01n6k07R6K56k02P2J66k08J64k66L26k04j12K42j20k6q3K34k16M2
3505d6J56j34P2k7l5o9Q9%lm9R9o9j50J22R7j48l6J12J93j91r6L10m19J82J09
3530F9N4j22j42rK63j49J16m3j30J00J05K4j50R2jl2L0j89J59k11R1J65l3j19
3554f2k0O5j10K69k27J66qJ25k03l3R8R4j42j28J98j45K68l45L0J33l7J2Jk20
3578b21J73P6J2p8m3K36j02j4j0n8K5R0k34J10K4Q7l9j59P3J4Rr2K07p6Q8k08
$$ plain form
3604 -110 47 -30 -33 37 56 -82 35 29 -47 13 -33 48 100 67 93 -146 -100 0 129 34 -11 -183 -73 -37 45 56 106
3631 106 -1 102 107 -40 17 -84 -124 -119 20 22 94 188 68 -43 -83 71 55 -166 -182 -86 -93 -22 67 55 160 -125
3657 -125 69 -75 105 -71 -85 161 53 5 -79 -106 -11 31 13 64 -142 -14 176 115 5 -42 -34 11 -18 -14 -3 16
3683 16 -50 -185 80 44 -119 4 31 81 96 102 -27 -57 -169 20 77 -139 19 -15 31 87 158 -2 79 12 -155
3708 -155 -105 -105 -120 -40 -23 15 -79 -76 44 103 23 -166 -20 125 -96 70 1 -69 -19 -141 51 -172 85 -3 107
3733 107 -138 -5 4 -140 35 162 -128 -148 -17 56 56 84 -65 -2 -56 121 32 -67 -18 2 -21 -7 93 7 250
3758 250 42 -64 -108 -39 -110 23 50 -74 98 71 34 -13 -44 74 -32 -29 66 24 -43 -1 230 -32 58 -106 34
3783 34 191 99 -38 -19 137 26 124 -64 80 4 20 34 147 -6 -20 19 157 45 -78 105 31 -15 -115 101
$$ packed form
3604a10J57p7lP0J9j38J17op6O0m6Q1N2l3K6k39M6J00J29r5m5j72J10L6Q2J1N0
3631A06j07J03Nj47N7j01m0NJ39KP2R4j20j11m0J54j6k21j6R6pP1Q9j2J05k85
3657a25J94j44J80j76j4K46j08m8q4k7R5M2j8N1k06J28J90o1j10m7QM5k9MJ1J9
3683A6o6j35K65l6j63J23K7N0J5Oj29l0j12J89N7k16J58l4M6N6P1j60Q1o7j67
3708a55N0%j5Q0J7L8r4LJ20N9q0j89J46J45k21J66o9p0N0j22J92k23K57q8J10
3733A07k45J33Rj44J75J27k90k0J31P3%K8j49O3n4J77q9r9M9K0k3J4J00q6K43
3758B50k08j06m4O9p1J33K7j24J72k7l7m7l1J18j06LR5m2o7M2K31k62R0j64J40
3783C4J57r2j37J9J56j11R8j88J44p6J6J4J13j53j4L9J38j12j23J83p4m6j00K16
$$ plain form
3807 101 47 -6 27 41 -115 -38 14 -50 122 -165 -31 100 -60 74 -80 -62 105 104 53 39 -112 -26 -13 -58 -3
3832 -3 9 119 22 28 -6 147 -22 37 -38 64 -59 54 10 -44 81 80 25 -182 22 56 58 60 112 -150 -182 -154 -47
3859 -47 -20 3 -71 -6 60 -26 -18 10 -49 46 -241 15 -5 24 110 16 -112 64 -8 127 24 37 -124 165 -35 -70
3885 -70 146 41 82 -149 -22 233 7 -167 -75 -132 -1 62 26 -124 -147 136 58 -95 -27 -33 -12 -218 -75 26
3909 26 107 -60 52 235 -1 127 49 -114 -55 -28 -94 -38 77 70 113 86 -9 -15 58 -18 83 -48 -61 -31 14 74 -88
3936 -88 48 92 -50 -34 36 67 -126 -114 94 -29 -3 20 -44 21 -27 -63 130 -66 181 61 -138 29 78 -210
3960 -210 -107 100 -15 11 146 176 -16 33 -109 -1 24 30 204 92 -18 68 96 119 -29 37 144 -102 -138 33
3984 33 45 63 -55 152 -4 26 -64 -16 127 7 -102 -61 -95 60 -126 -148 234 33 -3 -190 -97 42 -43 -86
$$ packed form
3807A01n4n3L3J4j56P7N2o4J72k87J34J31j60J34j54J8J67jn1j4j51Q6J3m5N5
3832cJ2J10r7Ol4J53j69N9p5J02j23J13m4n4J25jn5k07K04L4KKN2k62l2K8J07
3859d7K7K3p4O5O6q6QK8n9R5k87K56k0K9Q6r4j28J76p2J35j03J3j61K89k00l5
3885g0K16j05M1k31J27K55k26j74R2n7J31O3l6j50k3K83p8j53O8oK1k06J43J01
3909B6Q1j67J12J83k36J28p8j63N9K7o6N6J15pM3k7r5oP3p6J01j31j3L0M5O0j62
3936h8J36M4j42J6P0L1j93J2K08j23K6K3o4O5m8l6J93j96K47j20j99J67M9k88
3960b10J03K07j15K6J35L0j92M9j42J08K5OJ74j12j10Q6K8K3j48O6J07k46l6J71
3984C3J2J8j18K07j56L0r0M8J43j20j09M1l4J55j86k2L82k01l6j87R3J39q5m3
$$ plain form
4008 -86 41 107 88 -133 35 151 188 -96 -167 81 115 192 -16 139 -164 -80 19 -118 -153 71 126 -115 126 215
4032 215 97 64 194 -43 26 -55 49 -6 4 8 -88 143 -197 -25 -83 96 54 99 261 165 228 44 -34 -78 38
4057 38 234 -117 -83 -7 45 -45 -19 -311 -14 24 -86 -126 45 90 -57 -14 67 95 28 85 -61 -156 81 -54 -27
4082 -27 53 147 -24 20 -113 26 -237 -26 43 151 -8 -4 24 48 88 -112 13 -220 49 128 -64 -35 57 -19 -48
4107 -48 8 64 -83 82 57 5 40 21 -57 -147 -17 56 -44 -184 -117 101 80 75 36 47 133 144 -144 -125 55 106 29
4134 29 -52 54 126 44 -23 -92 -3 102 -56 -12 -91 -48 -25 -143 161 -135 56 -54 -99 2 -175 86 -76 82
4158 82 109 45 50 -30 69 -88 75 -19 -49 15 125 78 85 87 -154 19 28 -46 -149 52 -145 -108 -99 -234 146 -130 -90
4185 -90 152 22 105 -97 -117 24 78 -119 -23 -47 97 36 -6 126 -8 26 -1 -25 -23 -79 44 -210 19 82 62
$$ packed form
4008h6J27O6j9k21J68J16L7k84p1K48L4P7k08J55l03Q4R9j37l5K24N5k41K41Q9
4032B15j18l3J30k37O9q1J04n5J0Mr6K31l40J72n8J79m2M5J62r6O3j84p8m4J16
4057C8J96l51L4P6N2r0K6k92K97L8j10m0J71M5j47M3Q1K8o7N7j46r5K37j35K7
4082b7Q0R4j71M4j33J39k63K11O9J08j59MK8K4M0k00J25k33K69P9j92K9R2p6k9
4107d8N6N6j47J65k5n2L5j9p8r0J30P3j00j40O7K18k1nl9J1Q6J1k88J9J80N1p7
4134B9q1J06P2q2o7o9Q9J05j58M4p9M3K3j18L04k96J91j10m5J01j77K61j62J58
4158H2K7o4Nq0R9j57J63r4l0O4J10m7PKk41J73Rp4j03K01j97L7Rj35L80k76M0
4185i0K42j30Q3k02k0J41N4j97R6k4J44o1m2J32j34L4k7k4Kn6J23k54K29O3k0
$$ plain form
4210 62 -25 80 36 -101 105 39 -114 148 -147 -20 98 -15 57 -197 -62 45 116 61 29 -24 29 171 -17
4233 -17 91 169 -130 71 -20 125 -70 105 71 -188 -64 89 -46 13 -7 -390 100 -31 -190 76 199 65
4255 65 168 -229 87 -56 -100 -38 66 -74 -104 -134 -118 196 32 21 120 -5 0 -137 -107 -169 -15 53 95 -110 -5
4280 -5 -17 246 10 -118 -17 -72 -170 -37 5 35 159 85 -25 -44 12 116 -41 79 157 -1 45 66 -52 -31 123
4305 123 93 23 83 29 162 -11 73 -36 -58 85 -70 -108 -203 39 85 212 -168 82 152 -73 28 182 1
4328 1 4 17 -75 16 -4 -65 -41 -5 19 89 -51 -177 -4 190 30 -98 86 31 -129 -47 84 -31 -83 115 84 142
4354 142 60 71 -49 162 71 26 95 -18 90 -74 -92 67 110 -45 -89 64 -45 246 -39 38 92 50 -41 276
4378 276 -141 -98 -56 -60 80 64 5 53 39 165 -90 -26 -116 -187 138 49 10 3 42 -68 -41 -103 17 89 150 -182 120
$$ packed form
4210F2q7J05m4j37K06o6j53K62k95J27J18j13P2k54J35J07P1n5l2n3N3J42j88
4233a7J08P8k99K01r1J45j95J75l4k59J24J53j35N9k0l83M90j31j59K66J23j34
4255F5J03l97L16j43m4O2J04j40l0l0J6L14j64j1R9j25Nj37L0o2J54O8M2k05J05
4280ej2K63k36j28J01n5r8J33M2L0J24p4j10j9N6J04j57J20P8j58M6K1j18K1J54
4305A23l0p0O0n4J33j73Q4j09k2J43j55l8r5K42M6J27l80K50P0k25J01J54j81
4328ALJ3r2R1k0o1K4L6K4P0j40j26J73J94j60j28J84n5j60Q2J31j15n2J98l1N8
4354A42q2J1j20K11r1m5O9j13J08j64j8J59M3j55m4J53j09K91k85P7N4m2r1L17
4378B76m17M3M2mJ40j6n9M8j4J26k55O4r0p1L25q9l9pL9j10K7o2J20P2O1l32L02
$$ plain form
4405 120 -106 64 -55 -18 147 -121 88 -93 30 -139 -102 202 20 94 -40 -75 195 187 -70 227 67 -157
4427 -157 85 142 169 92 97 128 -144 -20 -138 123 123 -80 -144 26 -76 117 67 18 25 -78 -64 -156 93 43 17 87
4453 87 -49 109 124 -61 -12 -18 -66 -97 -145 93 -105 -71 60 -118 17 44 108 120 52 65 68 142 54 81 112 -22 122
4480 122 32 -151 13 -48 -7 -46 -86 101 -66 70 -129 -131 -181 -101 141 -8 50 189 134 102 25 107 124 -121 116
4505 116 72 119 -44 221 -30 -38 -7 -130 -5 -12 37 -108 -46 -150 -54 89 -122 -4 -97 103 63 27 103 93 5
4530 5 98 44 154 -113 8 172 -147 -11 -62 -8 136 212 58 -65 79 -37 299 -80 -95 143 -145 98 -6
4553 -6 -20 -124 105 33 127 18 6 -200 -211 82 -1 -153 76 43 -73 76 -43 -118 -162 -48 -150 -31 3 -66
4577 -66 -39 90 77 -50 -7 81 25 65 -5 97 -67 25 -73 -134 -133 89 -96 -25 -107 61 -92 36 23 33 -75 -164
$$ packed form
4405A20k26J70j19L7J65k68K09j81J23j69L7L04j82P4j34l5K70qk57K97j60k24
4427a57K42N7K7p7NL1k72J24j18K61%k03o4J70j02J93n0m9Pj03J4r2K49n0k6P0
4453H7j36J58J5j85M9om8l1m8K38j98L4J31j78J35K7O4J2o8J3LP4q8K7L1j34J44
4480A22r0j83J64o1M1l9m0J87j67J36j99kn0Q0K42j49N8J39n5l2p7Q2J7k45K37
4505A16m4M7j63K65k51qL1j23J25pM9j45O2j04R6J43k11J18r3K00m0l6P6j0q8
4530ER3n4J10k67J21J64l19J36n1N4J44P6j54j23J44j16L36l79j5K38k88K43j04
4553fj4j04K29p2R4j09j2k06j1K93q3j52K29l3j16J49j19p5m4J14j02J19L4o9
4577f6K7J29j3j27M3Q8n6M0p0J02j64R2r8o1JK22j85P1q2J68j53J28j3J0j08q9
$$ plain form
4603 -164 -105 184 -46 227 -98 73 102 -42 30 -63 139 7 35 22 -82 97 51 -166 -19 -11 -58 -91 54 -81
4627 -81 8 87 -22 133 -82 26 60 -184 -46 15 -96 62 242 -6 21 18 53 125 -26 29 -41 -122 -6 23 11
4652 11 -173 -6 42 -26 -52 36 86 23 -28 -35 -69 26 -86 82 48 -50 54 70 57 49 2 52 90 127 49 -128 -62 -58 -38
4681 -38 -67 -6 -33 132 -16 -100 50 -4 110 136 -158 104 -10 166 -115 -66 158 -79 -71 100 60 -8 41 -124
4705 -124 -4 26 125 64 -88 -48 -165 -27 69 103 81 -49 59 120 53 77 -107 -27 -88 66 339 -40 146 -42
4729 -42 -122 41 49 -60 -86 72 -26 216 -3 -8 -98 -27 -15 -78 29 -82 70 -121 -1 -87 186 -16 42 -41 44
4754 44 14 51 -81 -16 204 58 14 121 -51 -10 53 5 -55 117 133 60 49 -80 121 -14 49 52 5 216 16
4779 16 59 20 0 -107 -27 23 23 -1 -65 18 105 66 181 -87 22 -43 95 34 43 12 164 24 86 -75 66 12 26
$$ packed form
4603a64N9K89k30K73l25J71K9j44P2r3K02j32K8j3j04J79m6k17J47Qm7l3J45j35
4627h1Q9P9j09J55k15J08L4k44J38O1j11J58J80k48K7lL5P2j51N5p0q1J16K9j2
4652A1j84J67M8o8k6Q8N0o3n1pl4R5j12J68l4r8J04J6j3qm7N0L8L7p8j77O6MK0
4681c8k9O1k7J65j48q4J50n4J14K6k94K62j14J76k81M9K24k37QJ71m0o8M9j65
4705a24J20L0R9o1j52M0j17J38R6L4k2j30J08O1o7K4j84Q0o1J54K73l79J86j88
4729d2q0J63Qj09k6J58r8K42k19nr0P1J2o3J07j11J52j91J20q6K73k02N8q3Q5
4754D4l0L7j32O5K20j46m4J07j72M1O3m8o0J72J6p3j1j29K01j35O3Lm7K11k00
4779A6M3l9k0j07Q0N0%k4o4Q3Q7l9J15k68J09o5J38o1Rl1J52j40O2j61J41n4J4
$$ plain form
4806 26 -79 31 127 -116 -17 -260 -11 65 -100 -88 71 -32 26 6 93 45 -67 42 7 62 61 168 -72 44
4830 44 -128 -28 3 25 100 -10 -89 106 68 -143 38 -37 -38 80 140 -24 -84 -114 37 -44 -82 -183 11 -8 -61
4855 -61 -8 114 -145 66 -9 -67 102 53 74 -64 -109 211 18 -11 81 -43 91 -50 65 56 96 43 43 -10 123
4880 123 -101 -45 -6 -69 70 22 31 23 22 -40 13 -103 25 -42 26 -187 -130 14 -39 -23 -77 41 101 20 -14 -135 17
4907 17 11 -24 13 -88 -153 -141 -17 40 177 -175 5 -61 101 77 77 45 -90 225 86 58 -33 10 -101 -250 182
4932 182 45 161 78 -3 -148 105 -27 21 39 -49 45 -23 -36 -72 37 -92 4 -57 -14 17 4 -44 173 -119 149
4957 149 17 -50 71 -70 -130 -74 -116 -37 3 -68 85 178 -116 15 70 98 -186 -21 -116 -14 40 17 58 -209 -35
4982 -35 111 85 -32 -165 -92 -127 -14 -139 -26 -66 3 121 -33 13 -83 -131 19 21 -39 83 -109 68 67 135 -160
$$ packed form
4806B6j05J10R6k43R9k43K49P6j65J2J59j03N8k0Q7m8j12J09l5N5jJ07k40J16
4830D4j72J00L1K2P5j10p9J95l8k11J81p5jJ18O0j64o0l0J51q1l8j01J94j9n3
4855f1N3J22k59K11p5n8J69m9K1j38m5L20j93k9R2j24J34j41J15rM0n3%n3J33
4880A23k24N6L9o3J39m8Rqjo2N3j16J28o7O8k13N7J44n3J6n4J18O0q1l4j21J52
4907A7ol5L7j01o5J2J24N7J37l52J80o6J62k4%l2j35L15j39k8r1M3j11j49M32
4932A82j37J16q3q1j45K53j32M8J8q8R4o8j3l6J09j29R6o1M3L1j3m8K17k92K68
4957A49j32o7J21j41o0N6m2P9M0p1J53R3k94J31N5K8k84J65r5J02N4k3M1k67J74
4982c5J46k6j17j33P3l5J13j25J13m0O9J18j54M6r6m8J50Ko0J22j92J77jO8k95
$$ plain form
5007 -160 -80 -151 -65 -56 -44 -73 38 82 187 -7 -26 -169 38 99 -38 -10 -57 64 -81 138 68 72 9 -103 0
5032 0 -4 27 -8 -96 39 181 37 -47 71 -49 64 -67 68 103 -63 19 -66 7 29 26 -103 7 201 37 150
5057 150 -37 39 52 141 10 -138 185 84 9 -104 43 47 -53 33 -95 21 44 -28 51 -42 25 24 237 -26 -55
5082 -55 -3 -69 -24 -199 21 -91 95 38 -44 170 -93 67 -216 -72 -13 156 115 -158 13 106 101 38 -15 43 31
5107 31 -48 79 -53 -109 -191 -265 -35 -53 59 -55 -48 166 -63 -11 99 62 -171 -131 -91 23 206 105 -33 -96
5131 -96 -156 -49 -144 -117 -148 -101 -30 36 -133 110 -6 13 27 -134 17 5 -109 -25 165 -19 -49 -25 186 70 7
5156 7 -31 -67 8 -109 107 26 22 -72 54 -33 -135 -62 -9 3 87 -142 183 42 75 -33 -45 -195 50 0 -63 116
5182 116 -153 -172 -5 -60 -43 -28 34 11 -27 -27 22 -27 -99 -7 -43 30 77 18 15 37 0 50 -141 98 35 -102 -16 -18 39
$$ packed form
5007a60Q0p1Q6RJ2k9J11M4J05j94j9j43K07O1j37K8m7J21j45K19p0Mo3j12J03
5032@mL1l5q8J35J42j44q4J18j20J13j31J35L5j66Q2q5P3K2lj29J10J94j64J13
5057A50j87P6J3Q9j31j48L23j01p5j13J47Mj00Q6j28J16K3p2P9r3O7jK13k63k9
5082e5N2o6M5j75K20j12J86n7q2K14k63J60k83J44N9J69m1k73J71R3no3n3N8j2
5107C1p9J27j32n6q2p4K30j8J12j14PK14k29N2J10l7k33M0M0J14J83j01j38o3
5131i6o0J07r5K7l1M7P1O6j69K43j16J9J4j61J51j2j14Q4J90j84l0K4K11j16o3
5156Gl8l6P5j17K16q1mr4J26q7j02P3N3J2Q4k29L25j41L3j08j2j50K45n0o3J79
5182A16k69j9J67n5J7J5O2k3l8%M9m9p2R2l6P3M7n9lK2l7N0j91K39o3j37Q6kN7
$$ plain form
5211 39 -119 43 -95 103 -16 -25 -136 -9 28 -32 -152 143 39 -55 -108 -93 -99 -169 -61 -38 -37 43 -76 79 -73
5236 -73 -5 66 -35 -283 -62 -143 61 -37 -151 145 38 -51 -103 32 151 -9 -146 -151 44 85 -29 32 -10 -31
5260 -31 -95 -1 101 -9 37 36 92 -93 -42 -134 91 -148 -2 -37 39 -117 -89 23 -9 20 111 109 9 58 86 30 -46
5287 -46 223 -35 -27 41 73 26 21 46 101 -142 91 146 -153 -128 50 -40 160 187 -82 -61 82 -12 -206 -12 27 154
5313 154 -19 -111 -214 2 52 -17 -142 67 -70 -50 30 134 -28 204 159 -167 -20 -35 20 23 54 -131 -161 -25
5337 -25 -70 179 60 -24 -82 54 143 16 92 -27 46 42 11 -52 34 -112 -146 58 -9 -138 -56 60 -27 7 61 -24
5363 -24 -115 -20 49 -97 -16 -72 -38 -52 -33 -67 -9 -13 91 -148 114 -33 -55 83 -76 -32 134 4 -117 98 -71
5388 -71 64 94 -38 39 3 -281 -142 130 -6 65 16 -81 -18 19 35 -92 -34 43 81 -106 45 97 -95 -35 -122
$$ packed form
5211C9j58J62j38J98j19rj11J27L7o0j20K95j04r4n3J5op0J08K3JQ0j19J55j52
5236g3O8P1j01k48K21q1K04r8j14K96j07q9n2J35J19j60j37nJ95M1j14O1m2k1
5260c1o4R4J02j10M6jN6j85N1r2K25k39J46l5P6j56K8J12l2K9R1kj00M9K8n6p6
5287d6K69k58QO8L2m7nK5N5k43K33N5k99K5J78r0K00K7k69K1J43r4j94J94L9J27
5313A54j73r2j03K16N0o9j25K09j37K0Q0J04j62K32m5l26J47j5N5LL1j85l0J36
5337b5m5K49j19q4n8J36Q9j27P6j19P3ml1o3Q6j46l4K04o7j29Q2J16q7L4N4q5
5363b4r1R5O9j46Q1n6L4j4J9l4N8mJ04k39K62j47k2J38j59M4J66j30j21K15j69
5388g1J35L0j32P7l6k84J39K72j36P1m9r7O3L7J6j27N8P7L8j87J51N2j92O0q7
$$ plain form
5413 -122 39 82 -1 35 68 48 -61 -80 -128 -52 117 106 -72 110 -30 15 4 89 174 74 90 -7 -87 96 128 -122
5439 -122 -44 254 15 -66 90 31 -32 129 52 62 -30 -65 13 83 -170 -168 5 53 -27 -128 142 -76 -151 47 205
5464 205 93 70 -33 93 21 18 178 -17 -121 -27 -104 17 93 -21 -127 -118 -16 -41 62 -37 156 -6 -50 -71
5488 -71 59 -217 8 123 -88 46 74 86 -48 50 12 46 15 169 -13 -27 -39 172 116 -76 -123 82 59 23
5512 23 -19 14 240 37 7 -125 33 -138 43 168 -25 -54 -23 -98 12 -56 46 -58 -152 11 -174 76 -5
5535 -5 -2 8 242 24 -16 57 126 74 -92 -99 162 -34 -35 -17 5 -41 98 -1 3 -33 137 155 26 -6 -54 -266 -17 160
5563 160 55 79 -28 -24 42 -119 -193 63 -24 -95 103 -88 53 -181 -27 51 -45 -99 20 30 -162 -119 -122 134 102
5588 102 -144 -71 -61 82 131 -27 8 -23 122 -147 13 -31 28 -116 56 -42 60 101 -34 23 84 -21 -31 -3
$$ packed form
5413a22J61M3q3L6L3k0j09j9m8P6J69j1j78J82j40M5j1Q5Q5j00J6r7q0J83L2k50
5439a22P8K98k39q1J56n9o3J61p7J0r2l5P8P0k53KJ73M8q0j01K70k18p5J98J58
5464B05j12k3j03J26p2lJ60j95j04R4p7J21P6j14j06RJ02k5J03r9J93j62m4k1
5488g1J30k76K25J15k11J34K8J2j34R8l8L4l1J54j82j4j2K11n6j92m7K05k3l6
5512B3m2L3K26k03l0j32J58j71J81J25j93k9L1p5J10o8J02j04r4J63j85K50q1
5535eLJ0K34k18m0P3O9n2j66pK61j96jJ8K2m6J39r9Ml6J70J8j29l2m8k12K49J77
5563A60j05K4j07MO6j61p4K56q7p1J98j91J41k34J54P8r6n4J19J0j92M3lK56l2
5588A02k46P3J0J43M9j58L5l1J45k69J60m4N9j44J72r8J02M1j35N7O1j05j0K8
$$ plain form
5612 -3 -117 171 163 139 66 -280 50 -96 51 -126 -107 -36 -86 118 -58 137 -106 -50 83 -102 74 56 -43 -22
5636 -22 101 17 21 86 31 -85 107 -22 58 32 -190 -190 -125 -29 87 35 -166 123 130 45 -14 25 -148 54 70 145 97
5663 97 76 -46 90 21 151 115 51 7 169 -53 -18 104 -44 -33 -100 -11 -202 -6 -89 -46 -149 17 -50 -59 128
5688 128 -76 -35 -26 -110 -26 141 -188 136 -284 6 -86 -15 -47 17 105 50 94 0 -47 71 -163 -5 -14 -7 -34 200
5714 200 -138 83 -51 50 131 -91 -33 -109 73 -52 -54 -32 103 -69 -88 -14 70 -132 123 -11 175 56 106
5737 106 71 13 -55 73 -46 -87 146 123 -37 59 -36 -134 -102 96 -76 -10 50 190 143 -31 -67 73 111 -105 118
5762 118 169 -37 91 -65 28 35 -3 -60 -55 16 -57 51 57 37 164 156 -16 -39 54 16 -31 61 50 82 194 41 42 242
5790 242 50 107 -73 115 -6 180 106 -74 170 52 -55 89 -95 -25 12 -165 66 77 68 -5 -66 -46 -183
$$ packed form
5612cj14K88qk4p3l46L30j46J47j77J9P1n0K04j76J95k43N6J33j85J76j8r9K1
5636b2J23q4MO5n5j16J92j29Q0k6k22%O5R6J16n2k01K89Pq5n9L9j73K02J6P5m8
5663I7k1j22J36o9J30l6o4m4J62k22L5J22j48J1o7Q9j91J96q3M3j03J66o7rJ87
5688A28k04M1Rq4Q4J67l29L24m20K90r2P1l2O4Q8n5M4r4m7J18k34J58rPk7K34
5714B00l38K21j34J01Q1k22N8p6J82j25kK2J35j72j9P4Q4k02K55j34J86j19N0
5737A06l5n8o8J28j19m1K33k3j60R6r5r8L2J98j72O6O0J40m7j74l6J40L8k16K23
5762A18N1k06J28j56R3Pl8n7NP1p3J08Ok0J27qj72k3R3l8m7R2j1L2J12j53JK00
5790B42j92N7j80J88j21J86p4j80K44j18j07J44j84P0L7j77K31J1rp3o1K0j37
$$ plain form
5813 -183 -94 -66 21 19 -48 -40 25 -108 124 -137 103 2 -173 115 -210 -110 49 -91 -68 98 -76 -72 -34 -57 83
5838 83 6 -114 -133 85 50 1 -40 -87 72 -129 100 -36 -56 -47 -4 -14 -48 -87 81 15 99 -145 61 -11 -16 -190
5864 -190 16 15 -91 120 23 8 70 84 51 -103 144 81 50 116 4 62 139 -48 -76 169 79 10 -75 22 95 3
5890 3 12 -59 56 -32 0 -24 -312 2 -29 10 46 -314 -190 -17 42 50 35 197 -10 -152 -64 113 -47 -128 -42 76
5916 76 43 52 -166 -86 -21 -105 -6 -126 -5 -7 -108 -34 197 152 96 133 -162 11 -45 12 -102 46 -90 73 -133
5941 -133 -18 84 -197 -39 -1 61 -156 -168 14 -37 -98 14 -59 75 78 -244 -28 107 -131 -50 -51 -13 181 96
5965 96 67 -111 -46 40 -44 -45 -40 -116 -57 78 178 53 7 73 69 10 83 -165 -1 47 -131 78 22 -16 -48 -64 100
5992 100 -33 78 20 -10 55 194 -3 -129 203 35 176 -38 60 63 -6 34 -49 140 104 65 -7 76 -108 -71 -69
$$ packed form
5813a83Q9K8Q7ko7QO5j33K32k61K40j01j75K88l25J00J59j40K3J66j74ML8k3J40
5838H3p7j20j9K18l5m9m1m7J59k01K29j36k0RM3j0l4l9J68o6Q4k44K06p2nj74
5864a90K06jj06K11r7j5O2J4l3j54K47o3l1O6j12N8P7j87k8K45r0o9q5R7P3r2
5890CRp1J15q8L2k4k88L14l1L9L6l60J24J73N9Qj5J62k07j42Q8J77j60q1Q6J18
5916G6l3Rk18Q0O5q4R9j20J21kj01P4K31m5n6L7k95J73n6N7j14J48j36J63k06
5941a33J15J02k81J58L8O2k17j2J82n1o1J12p3J34Ll22K16J35k38Q1jL8J94q5
5965I6k9j78O5Q6q4jNp6N9J35J00j25m6O6mn9P3k48J64M8j78K09n6l8l2j6J64
5992A00j33J11n8l0O5J39j97j26L32j68J41k14R8Lo9M0q3J89l6l9p2Q3j84L7K
$$ plain form
6017 -69 -5 166 -96 51 -90 131 9 13 -43 -81 128 193 74 -96 -75 87 -5 -36 131 52 -27 -64 109 -94
6041 -94 -23 -44 -31 67 -38 48 -8 -69 65 56 3 95 -103 -91 -18 -54 -120 57 -87 36 -41 -141 -76 92 1 17 -79
6068 -79 2 -164 50 -16 -46 36 -20 -94 51 2 -124 52 -26 -70 -17 100 103 -57 72 302 -67 -137 15 84 -136
6093 -136 57 291 24 31 3 -135 -40 -132 90 -58 146 102 129 -200 -72 13 -94 -48 21 -100 21 -137 97
6116 97 -105 -64 -85 -155 -12 67 98 30 -177 47 28 -24 33 70 9 -61 -11 -75 -52 -60 -103 -154 3 -346 35 -41 33
6143 33 -95 42 28 -144 -114 212 162 111 105 119 -151 -144 35 -244 -27 4 -59 -8 -123 -15 46 39 -79 -90 9 174
6169 174 197 85 172 114 4 -79 52 -110 72 -15 81 -4 95 6 -123 -18 -176 -108 20 -82 173 -33 0 -101
6193 -101 -63 16 -43 7 -82 86 -153 41 -24 -200 -102 12 62 -96 -20 35 -154 63 -213 1 1 -52 10 -50 108
$$ packed form
6017f9O4J71k62J47j41K21j22Mn6l8K09O5j19j70K1J62r2l1J67p9p9l7J73k03
6041i4P1k1J3R8j05Q6n6o1J34rn3R2j98J2P3l6o6J77j44J23p7j00O5J68r1J6r6
6068g9Q1j66K14o6l0Q2n6p4J45m9j26J76p8m4N3J17Lj60J29K30l69p0J52O9k20
6093a36J93K34k67Pk8j38R5r2K22j48K04m4K7l29J28Q5j07M6O9j21J21j58K34
6116I7k02M1k1p0J43P9L1o8k07K24j9n2N7L7o1p0N0o4K3qm3n1J57l49L81p6P4
6143C3j28J37j4j72L0L26n0n1oJ4k70PJ79k79K17L1o3N1j15J08O1pj18j1R9J65
6169A74K3j12Q7n8j10q3J31j62J82q7R6q5R9q9j29J05j58O8J28j02K55k06L3j01
6193a01L8P9n9N0q9J68k39J94o5j76R8J14N0j58P6N5j89K17k76K14%n3O2o0J58
$$ plain form
6218 108 27 9 -153 -93 1 -29 67 57 66 -75 -18 -134 -21 20 -94 -6 32 180 -10 137 76 -116 153 -39 -87
6243 -87 108 68 -45 165 -10 -207 -6 20 183 162 84 -152 44 150 27 90 20 -97 -15 -63 141 119 -221
6266 -221 18 -76 -16 160 -179 -80 111 34 -117 30 22 -76 -34 184 86 54 21 -164 24 -107 64 -45 143 -57
6290 -57 39 -21 89 -26 -36 5 77 85 48 76 165 -117 -151 15 89 -43 -243 60 98 -78 24 127 45 129 -70
6315 -70 -148 -11 104 70 -44 -13 -59 -54 36 -62 29 55 85 -99 -65 114 -28 19 49 -4 70 94 -123 -47 16 10 62 -38
6343 -38 -196 -132 -36 91 4 -152 -27 -90 6 10 -70 -140 -177 140 -155 37 7 -35 -12 -130 23 87 -97 46 -139
6368 -139 10 165 72 -253 38 3 -34 56 83 160 104 -35 -94 21 -248 -13 -98 145 76 -12 64 23 2 10 183
6393 183 -75 36 92 -84 14 113 87 81 7 -147 -12 -32 13 -132 -112 137 -43 -46 15 -34 -62 -58 -35 -159 151 -54
$$ packed form
6218A08q1j8j62O0R4l0R6j0Rj41N7j16J13M1j14Q8L8J48j90J47o1j92K69j92m8
6243h7J95m0j13K10j75j97K01K6J63k1p8k36J96J06j23O3p0j17Q2m8K04k2l40
6266b21K39r4O0J76l39R9J91p7j51J47qr8M2K18r8l2l3j85J88j31J71j09J88k00
6290e7R6o0J10j15j0M1P2Ql7K8Q9k82l4J66P4j32k00L03L8j76J02J03q2Q4j99
6315g0p8J37J15l4j14L1m6NR0r8R1K6L0j84L4J79j42M7L0n3P4K4k17P6O3oN2j00
6343c8j58O4R6J27q7j56J25o3R6Mq0p0l7L17k95J92l0m2K3j18J53O4j84J43j85
6368a39J49J55r3l25K91l5l7R0K7P7n6j39n9J15k69K35q5K43o9q8P6m1k1QJ73
6393A83k58J11N6j76R8R9k6op4j54J35k0M5j45K0K49j80lO1m9k8MK3j24L10k05
$$ plain form
6419 -54 -173 -96 25 -10 -8 -14 -129 -114 -65 -61 -5 129 -52 -133 20 -15 234 -10 119 -26 -46 30 -95 73 -40
6444 -40 75 1 -128 -21 -45 14 94 85 -93 -50 11 49 126 65 40 -45 82 190 -6 -33 16 -116 -30 -176 92 -78
6470 -78 33 -87 98 70 20 -42 -64 8 21 2 -60 -77 -43 -44 -50 38 29 15 -11 -142 -110 -11 67 45 41 54 58 94 248 51
6500 51 -107 98 -10 5 90 -85 -145 -5 -86 -73 -58 -56 25 -46 -6 -54 100 7 -33 -189 29 5 -98 49 -73
6525 -73 -68 -271 44 -80 129 -41 107 -61 -43 121 78 55 62 -55 2 -45 42 -65 52 26 17 -1 -59 81 -10 -269
6551 -269 81 92 114 -95 -81 55 -127 -56 19 167 -15 37 27 -48 -97 8 -17 -98 -42 23 20 100 -97 189 173 41
6577 41 -30 -142 -50 -22 92 -46 -17 214 80 -158 33 -124 142 -55 89 83 36 34 9 -47 49 98 176 -12 20
6602 20 -49 -100 28 84 -104 93 -28 17 -72 -122 80 -105 -21 8 -13 -68 -22 -40 -28 36 6 -62 17 55 166 -61
$$ packed form
6419e4j19P7J21l5Koj15J5M9MN6J34j81q1J53l5K49k44J29j45k0P6j25J68j13
6444d0J15p4j29J07k4N9Q0rj78M3O1L8P7o1k5q5J27J08j96k7M9j32Q6j46K68j70
6470g8J11j20J85k8n0o2k2P2J3j9o2j7L4joQ8rj4k6j31L2R9P8k2mJ3ML6J54j97
6500E1j58K05j08J5Q5j75o0J40q1J3J5KQ1p1M0m8J54r3m0j56K18k4j03J47j22
6525g3Nk03L15j24K09j70J48j68J8J64m3k3Pj17N7m7Q7j07J17k6rj8n8J40r1k59
6551b69L50J1K2k09J4J36j82P1P5J48j82N2j0p5m9J05k5q1N6O5lQ0j97K86j6j32
6577D1p1j12R2K8J14j38K9K31j34k38J91j57K66j97J44om7kk5n6R6M9P8j88L2
6602B0o9n1J28N6j88J97j21M5q9n0K02j85Q4K9k1n5M6j8J2O4l0o8P9L8J11k27
$$ plain form
6628 -61 -56 -112 144 -166 7 7 60 56 -63 -15 -30 193 -82 -52 112 77 19 -38 -26 -8 0 48 -51 14 1 36 -20 -132
6656 -132 -89 72 56 34 -94 -47 -67 15 40 97 -30 -56 194 31 79 21 -151 -100 3 130 -11 -52 40 -19 -18 78
6682 78 -156 -115 110 -119 107 6 47 204 56 33 -81 94 3 97 12 -69 1 9 83 155 55 21 4 -23 44 -65
6708 -65 87 16 -29 -23 75 64 -154 86 -79 61 -20 -9 -99 19 -82 -105 -19 -35 -88 91 22 87 -156 27 -42 -87
6734 -87 -23 -230 -64 -91 -84 22 229 -177 81 -29 -29 53 147 -54 -89 -39 67 183 -26 -5 -84 -23 -128 -71 107
6759 107 137 49 -120 -29 -5 60 54 29 -59 54 -150 80 -18 2 -10 61 9 -118 -48 -68 -43 37 22 -20 -200 -1 -25
6786 -25 18 -159 34 39 -88 220 -18 -12 93 -4 -66 -55 25 -195 -29 -197 197 -90 -111 -22 -59 179 -121 -11
6810 -11 -93 -46 17 16 -88 -218 -251 0 -152 42 -101 6 55 41 14 -176 -108 -98 -21 -30 -79 -113 -66 5 -51 82 46
$$ packed form
6628f1Nn6K56l10J73%N3mj19M8j5K23k75L0J64l5n8n7J2J8QM8r9O5j3L5n6j12
6656a32M3J61j6k2j28M7k0Q2K5N7j27k6K50j63M8n8j72N1J03J27j41m1R2n9JR6
6682G8k34M1K25k29K26j01M1J57j48k3j14J75r1R4q5q1P0QP4P2j00l4j7k7O7j09
6708f5J52p1m5OR8j1k18K40j65J40q1J1r0J18j01k3Q6j6n3J79o9O5k43J83o9m5
6734h7O4k07J66k7PJ06K07m06K58j10%Q2R4k01l5N0J06J16k09K1p9O1j05N7J78
6759A07L0q8j69R1K4O5ok5q8J13k04K30r8K0j2P1n2j27P0k0K5Q0j5m2j80J99k4
6786b5M3j77J93Nj27L08k38OJ05r7o2J1Q0k20J66j68L94k87k1Q9l7K38l00J10
6810a1q2M7O3jj04j30l3K51j52J94j43J07M9j4k7j90O8J0P7rm9l4M7P1n6J33l6
$$ plain form
6837 46 -9 122 19 -52 -19 -64 -38 -8 -47 -14 41 -45 144 144 -9 -68 -30 10 62 33 85 -5 3 -99 -34 27 112 -15
6865 -15 17 -3 92 48 205 143 -129 37 51 50 -29 138 28 217 155 -74 31 249 105 85 -103 70 -9 131
6889 131 128 49 62 -127 -82 -23 59 -5 -16 70 187 -79 93 25 -1 -32 -118 -79 -33 -145 -44 79 -52 107 54 136
6915 136 40 -53 84 3 -67 28 20 65 18 82 -86 81 67 22 21 -32 102 196 -7 47 36 128 -65 100 123 -5 -100
6942 -100 92 37 -56 28 -84 -63 20 19 -18 58 0 -107 25 79 -55 21 -39 -174 26 9 65 161 -56 -48 -104 170
6968 170 -121 104 -91 163 35 23 71 -3 -59 -20 13 -2 -114 28 42 -47 115 -118 -51 -188 -61 -7 -237 136
6992 136 -235 3 -94 160 102 -1 26 -13 99 -44 75 -23 -159 4 14 -53 2 109 130 79 71 -11 -40 -71 -57
7017 -57 -30 -4 32 19 81 -115 -227 -182 31 58 33 233 6 21 139 -9 -6 -63 -140 -94 -157 42 -107 -116 39 -26
$$ packed form
6837D6n5J31j03p1L3m5K6L0l9L3N5q6J89%j53n9L8M0N2k9N2r0Qj02O5O1Q5j27
6865a5L2k0R5m4J57o2k72J66J4jp9J67j10J89o2k29J05K18j44k0j88J73p9J40
6889A31lp9J3j89M5N9Q2o4j1Q6J17k66J72o8k6l1q6L9M6j12J01J23j31J59n3Q2
6915A36r6r3J37q1p0R5qM5m7O4j68J67j4m5jn3J34R4k03N4j1R2j93J65K3j28r5
6942a00J92n5r3Q4j12K1Q3jl7P6n8j07J32N4j34P6o0j35K00j7N6R6k17Qn6K74
6968A70k91K25j95K54j28j2M8p4n6L9L3j5j12J42J4q9J62k33O7j37J27N4k30L73
6992A36l71K38r7K54n8j03K7l9J12j43J19r8j36J63J0o7N5J07K1n1qq2k9l1J4
7017e7K7K6L6j3O2j96j12M5K13K7k5K00k27J5J18j48Ln7p7M6o3J99j49rJ55o5
$$ plain form
7043 -26 -157 21 -31 26 -83 -123 85 -87 -3 -18 -26 119 21 52 -97 -69 60 91 58 -190 11 -2 195 50 85
7068 85 -37 -130 126 -107 25 -120 65 -209 -115 -171 9 -125 106 -13 134 -43 -220 -31 195 -135 -106 46
7090 46 -3 53 169 -16 -1 44 -57 84 -39 156 -68 69 -210 -72 82 76 -89 -30 -17 63 -26 -124 77 30
7114 30 -66 -73 -238 -66 -34 -44 -56 70 158 -10 62 28 7 -85 105 161 92 95 192 50 -45 59 85 14 -101 -129 -68
7141 -68 -106 120 -136 -91 -63 11 13 188 -236 62 -91 20 88 -61 -138 145 190 -108 -159 -39 80 32 -51 -65 -10
7166 -10 103 -45 -49 -72 91 -234 44 128 -125 -6 -17 81 -47 51 -35 16 53 -4 11 -14 -12 148 -147 14 151
7191 151 17 -43 -56 -86 29 218 -108 28 -97 -60 30 42 23 -147 -41 -248 224 22 46 -59 -57 109 118 91
7215 91 167 9 -102 119 -63 130 36 1 -76 -156 34 31 -207 137 87 101 -111 -109 41 -33 68 -35 -63 117 48
$$ packed form
7043b6j31J78n2N7j09m0K08j72Q4j5qJ45r8L1j49K8J29L1l3k48K01j3J97j45L5
7068H5j22r3K56k33J32j45J85k74R4n6J80j34K31j19J47j77j77J89K26l30K9J52
7090D6m9N6J16j85J5M5j01J41j23J95k24J37k79J38J54oj65N9J3Q0q9r8K01m7
7114C0r6pj65J72L2j0j2J26Q8j68P2l4k1r2J90N6o9LR7j42r5J04K6p1j15k8O1
7141f8l8K26k56M5K8P4KJ75m24K98j53J11O8j49p7K83M5k98n1J20J19m8q3j4N5
7166a0J13j48mk3J63l25K78Q4k53J19j1R8j28R8q6N1L7n7J5k5KJ60k95J61J37
7191A51j34o0j3l0J15J89l26J36j25L7R0J2j9j70J06k07M72k02K4j05KJ66Rk7
7215I1P6j58j11K21j82J93r4l5p7q0J90lk38L44n0J4k12KJ50p4J01j03k8J80o9
$$ plain form
7240 48 -32 47 85 32 2 -223 -6 -94 -87 90 -72 5 166 31 96 43 186 140 -237 -14 -120 75 131 37 90
7265 90 66 -108 115 34 183 -26 -136 9 -157 67 0 76 128 39 32 84 -164 92 -76 89 -59 -25 52 -41
7289 -41 -4 -63 -63 78 -45 -63 9 -51 87 14 84 -15 -31 84 -124 -64 13 66 4 238 -50 -41 -41 -32 -11 -34 54 4 30
7318 30 -41 -22 21 84 -11 163 18 -25 6 8 -47 -99 150 -121 -26 -2 -11 -51 134 62 147 20 68 -144 112 42 -92
7345 -92 -22 -50 -3 144 31 -23 -137 126 5 111 -142 -112 -21 -302 -3 -106 289 35 58 -146 -142 56 123 -39
7369 -39 -25 -29 19 -140 110 46 -63 11 94 -83 -179 -78 9 62 -28 132 -9 23 -90 -88 31 67 -110 -109 17 117
7395 117 61 91 270 -43 -88 18 -95 -78 -239 -235 -48 45 -122 24 -1 140 -163 -64 82 12 50 -53 32 -108
7419 -108 58 160 174 25 75 26 -59 -29 16 22 -69 -52 29 -101 118 8 102 207 -71 16 5 -3 -141 116 -31
$$ packed form
7240D8q0P9L8n3l0k25K17q8PJ77j62P7J61j35O5n3J43m6l77K23j06J95N6r4N3
7265I0k4j74K23q1J49k09j10J45j66K24o7P6N2q9pN2k48K56j68J65j48L4P7r3
7289d1L7n9%J41j23j8P2o0J38p3P0r9j6J15k08O0P7N3o2K34k88R%RK1k3Q8n0K6
7318C0p1J9M3O3r5J74j45m3L1Kn5n2K49k71R5K4rm0J85p2Q5j27M8k12K56p0j34
7345i2P0k8M7J47j13n4j14K63j21J06k53L0R1k81K99j03L95k54K3k04MJ98O7j62
7369c9J4mM8j59K50o4j09P4Q3j77r6J01Q7N3r0J60j41L2j13KJ19L6j77JJ26J00
7395A17n6L0J79l13m5J06j13J7j61MJ87R3j67J46k5J41l03R9J46p0L8j03Q5j40
7419a08J66J02J4j49N0m9q5L0M5Or1J7Q1j30K19j10R4J05k78Q7j1qj38K57j47
$$ plain form
7444 -31 -15 97 47 45 -68 94 23 27 108 59 -33 -97 101 -44 -52 12 8 -133 97 -16 41 -49 -14 -16 -100 1 -6 11 -31
7473 -31 -31 -39 11 -127 -18 -127 -196 71 65 -153 15 9 -56 82 -151 53 148 163 -63 36 -23 -95 -78 161 48 -50
7499 -50 23 2 -29 3 -10 -37 84 11 59 36 -19 78 59 -150 254 43 60 -85 -89 -62 -30 -76 39 -57 -62 93 53 135
7527 135 -9 169 -143 165 22 86 -83 14 6 -13 -32 97 10 23 -151 134 39 48 -39 74 -14 73 13 -42 167
7552 167 267 -38 87 89 10 60 -3 -55 38 113 -43 52 138 -73 -53 128 105 -41 -4 50 8 137 27 141 -93
7577 -93 29 23 43 156 -70 14 49 97 17 5 77 138 -32 103 -22 184 -70 -112 -8 24 139 -31 -132 63
7601 63 5 -60 -32 127 -104 -250 22 79 -3 -220 35 50 -18 37 94 -60 58 77 -3 -97 37 -85 76 196
7625 196 76 19 110 34 12 82 75 164 95 15 132 97 -83 183 15 -8 64 80 10 3 -48 33 98 20 -79 186 84
$$ packed form
7444c1J6J12n0kj13J62p1MQ1m9r2o4J98j45qO4mj41K30j13N7r0L5kq4J01pJ7m2
7473c1%qN0j38J09j09o9K67ok18J68oo5J38k33K04R5J5k26R9n9p2J7K39j13r8
7499e0P3k1l1L2j3k7J21p3M8k3n5R7j9k09M04k11J7j45mK7L2m6J15r6nJ55m0Q2
7527A35j44J78l12L08j43O4j69R7qj9j9J29q7J3j74K85r5Rq7J13q8Q7o0n5K09
7552A67J00l05J25Kp9N0o3n2R3P5j56R5Q6k11K0J81k3j46L7N4m2J29j10J14k34
7577i3J22oK0J13k26Q4L5M8q0j2P2O1j70J35j25K06k54m2J04L2J15j70j01J95
7601F3n8o5K8J59k31j46K72N7q2k17K55J5o8N5N7j54J18J9q0r4J34j22J61J20
7625A96j20n7R1p6k2P0pQ9o9q0J17l5j80K66j68k3P2J6p0pn1Q1O5p8r9K65j02
$$ plain form
7652 84 -12 -83 66 102 -209 -129 -22 -56 96 60 -25 -4 -98 -130 3 48 -14 7 42 78 114 -26 -33 15 -71 64 114
7679 114 -139 74 -110 196 20 -106 69 -208 -64 120 170 92 186 99 -134 51 24 -179 -20 -103 47 -3
7701 -3 59 104 -27 53 4 14 93 -63 111 -24 76 -23 -87 -117 42 -9 45 131 18 -2 -17 57 -56 141 160 -5
7727 -5 114 -9 39 -13 125 65 -14 119 -21 -73 -32 -138 84 -72 15 56 -29 60 67 14 -120 10 -81 -88 -157 29
7753 29 -28 -26 40 -131 3 98 -21 72 24 -49 14 -77 203 -93 94 -9 -107 55 -112 -10 -40 -105 -50 34 -42 -4
7779 -4 59 155 -126 -96 -73 1 40 -76 80 27 131 11 -143 41 -121 187 148 49 -135 -33 -77 -70 48 4 -116
7804 -116 17 48 -31 91 -22 -31 7 -117 54 27 114 -62 -23 4 -165 -56 -105 64 54 -79 171 -16 -56 83
7828 83 105 26 58 -62 -156 -76 78 35 134 124 -163 56 -132 -58 -2 -85 -49 18 91 42 138 166 -4 31 -67 -98 135
$$ packed form
7652H4r6p1J49L6l11Q0J07l4J52l6q5K1r4l2J33M5o2K1L5L6L6j40pM8q6J35N0
7679A14k53K13j84L06j76j26J75k77J44J84N0p8R4q7k33J85k7k03J59q3J50n0
7701cO2M5j31Q0m9J0P9j56J74j35J00r9o4l0J59n1N4Q6j13k0j5P4j13J97J9j65
7727eJ19j23M8n2J38o0p9J33j40n2M1j06K22j56Q7M1q5Q9Pn3j34J30r1po9J86
7753B9n7KO6j71J34R5j19R3m8p3O3r1K80k96J87j03r8J62j67J02l0o5N5Q4p6L8
7779dO3R6k81L0K3P4L9j16J56n3J04j20j54J84j62L08l9r9j84J02m4PJ18m4j20
7804a16J33L1p9J22j13rL8j24J71k7Q7j76L9K7j69J09m9J69j0j33K50j87m0J39
7828H3K2p9L2j20r4Q0J54m3R9j0k87K19j88P4N6q3L6O7P3m9R6K8j70L5r8l1K33
$$ plain form
7855 135 -29 -67 -50 98 -50 -214 -31 -18 -91 -180 108 -24 127 -48 -66 67 -73 13 6 -34 100 58 159 157
7879 157 -149 -112 -59 34 -33 97 -106 20 40 -50 18 -7 -79 -76 -3 -16 46 80 19 96 10 -32 -74 81 22 152 -5
7906 -5 -25 -26 24 -80 -96 3 176 232 -172 173 -20 98 -115 8 218 41 -21 -45 8 -55 -28 -5 2 -164 -37 -63
7932 -63 53 3 53 -84 -81 -85 -7 -115 -24 -33 -22 137 -124 -30 -42 -71 -132 -53 -18 -199 88 -105 -258 94 -20 -86
7958 -86 220 104 -31 63 1 80 -22 46 1 -60 35 51 106 66 126 -1 -37 13 68 -15 -6 35 -56 -34 41 145 -40
7985 -40 122 76 -10 -80 268 18 -80 -84 317 44 117 156 13 103 24 100 -134 52 -150 31 -44 -53 -46 30 -114 -43
8011 -43 -138 -82 109 -10 -23 -105 -82 207 -15 -108 3 47 -63 -96 -37 87 169 -169 22 -76 33 42 -49 49 -12 -56
8037 -56 104 -46 51 -64 -2 -132 -20 66 -10 22 -33 12 -157 -153 27 159 112 22 -48 82 38 5 -9 72 118 0
$$ packed form
7855A35j64l8J7J48j48j64J83J3p3q9K88j32J51j75j8J33j40Q6pm0J34m2J01k
7879A57l06L7N3R3o7J30k03J26K0r0O8k5p2LP3j3O2L4o1P7q6m2m2J55n9J30j57
7906ek0jN0j04j6R9J73N6m04L45j93J18k13J23K10j77o2k4N3o3K7K3Pj66J27k6
7932f3J16n0N0j37LmP8j08R1rJ1J59k61R4j2k9o1P9L5j81K87j93j53L52j14o6
7958h6L06j16j35R4o2P9j02O8m5o1R5J6N5m0O0j27l6N0N5q3RM1r1K2P5J04j85
7985d0J62m6q6p0L48k50r8mM01k73P3L9j43R0p9P6k34J86k02J81p5rPP6j44P1
8011d3r5N6J91j19j3q2K3K89k22r3J11M4j10l3N9J24Q2l38J91r8J09Rr1R8o1m4
8037e6J60j50R7j15O2j30J12Q6p6L2n5M5j69MJ80J32m7r0p0J30m4l3j4Q1M6j18
$$ plain form
8063 0 6 -27 147 -42 205 54 10 -16 58 -28 -17 -42 -34 145 86 119 9 23 -182 104 161 -148 -37 7 31 257
8089 257 68 -40 57 0 -19 21 33 82 82 -44 40 11 77 -109 -85 -74 -7 82 36 25 -115 55 -158 140 50 -106
8115 -106 -170 -50 142 -6 -43 -63 -50 -192 -118 82 -111 -135 30 44 80 -152 33 -159 43 -26 16 35 17 82
8139 82 71 63 152 -161 21 -80 15 -113 18 33 -141 -47 57 56 -127 140 20 -110 -117 168 -27 -10 -53 -3 106
8164 106 -134 -155 -16 59 150 119 160 131 -111 -91 121 -27 -205 -10 80 101 -85 -36 34 30 -18 -58 -87 247 80
8189 80 11 82
$$ packed form
8063@Ol3J74j89K47j51m4k6P4q6J1k5QJ79n9L3j10J4k05K86N7l09J11M4K4K26
8089B57j89j08R7n7j9M0J2M9%j26Q4k9O6j86K4J1O7Q9m6j1j40J70k13K98r0j56
8115a06o4J20J92j48l7k0J3j42P4K00j93k4J65J4L6k32J85j92K02o9M2J9j8O5
8139H2j1qQ9l13J82j01R5j28J31J5j74R4J04jj83K67j20j30pK85j95J7m3N0J09
8164A06k40k1J39P5R1l1M1k9k42K0K12j48j78J95R0K1j86M9P0mm8m0k9L34j67
8189H0o9P1
8191H2
$$ Imaginary data points
##PAGE= N=2
##DATA TABLE= (X++(I..I)), XYDATA
$$ plain form
0 0 0 0 0 0 0 0 0 0 0 0 0 -8 8 -8 8 -8 16 -16 20 -24 32 -32 40 -48 56 -65 80 -88 104 -120 136 -154 176 -200
34 -200 226 -255 287 -322 359 -401 444 -496 549 -609 673 -741 819 -903 996 -1097 1208 -1332
52 -1332 1468 -1619 1790 -1982 2200 -2449 2739 -3086 3497 -4004 4640 -5472 6609 -8258 10893
67 10893 -15739 27662 -122645 -90605 121734 -82693 -122584 34403 55745 -58359 18660
78 18660 103452 35367 -19886 63274 69706 -5887 -20485 30764 25651 -28022 -47511 3957 -4148
91 -4148 -60704 -24441 18691 -62753 -69570 53135 55654 -56828 -20489 90798 42812 -32289
103 -32289 47410 82385 -13563 -24346 35085 -8150 -61068 -19729 10305 -33337 -61057 -19583
115 -19583 15611 -2546 -3148 25096 16363 -5100 21213 50968 18102 -27766 667 33078 -12724
$$ packed form
0@%%%%%%%%%%%qJ6j6J6j6K4l2L6m4N6o4P2q8J04j21J45j68J92k24K56k90L30l76
34b00M26m81N42o09O81p60Q45r40J045j158J282j414J560j722J899k093K305k540
52a332K800l087L409l772M182m649N188n825O583p501Q644j0112J2081j4867J9151
67A0893k6632M3401j50307L2040K12339k04427l9891J56987K1342j14104P7019
78A8660Q4792o8085n5253Q3160O432p5593j4598N1249n113n3673j9489N1468q105
91d148n6556L6263M3132q1444o817J22705K519j12482L6339J11287m7986p5101
103c2289P9699L4975r5948j0783N9431m3235n2918M1339L0034m3642k7720M1474
115a9583L5194j8157o02K8244q733k1463K6313K9755l2866m5868K8433L2411m5802
$$ plain form
128 -12724 -30307 17802 6766 -40865 -16538 21861 -4211 -29007 7125 27373 -14879 -18543
140 -18543 35720 30268 -14003 4021 31040 875 -18708 14052 17522 -35092 -37141 13481 -2721
153 -2721 -41843 -5934 21190 -10990 -11624 25920 25013 -907 12509 36693 9784 -18044 6901
166 6901 19341 -9748 -21883 -7402 -5073 -20241 -17031 6472 -4752 -30652 -1829 26382 -4155
179 -4155 -13331 21281 20500 -8033 4741 30488 6801 -15102 12190 12458 -24798 -14084 12192
192 12192 -9568 -25420 -6301 2337 -7254 -5842 9155 9480 -2438 4543 16937 7962 -2455
205 -2455 998 7675 2441 -10382 -3637 7444 -8301 -12113 7279 -100 -14985 1151 11655
218 11655 -5165 -11063 6989 10691 -6254 -915 13660 -538 -8387 7211 4942 -8085 -5671
$$ packed form
128a2724j7583M8109j1036m7631K4327L8399k6072k4796L6132K0248m2252l664
140a8543N4263n452m4271J8024K7019l0165j9583L2760L470n2614k049N0622j6202
153b721l9122L5909K7124l2180o34L7544r07k5920J3416K4184k6909k7828K4945
166F901J2440k9089j2135J4481K329j5168L210K3503j1224k5900K8823K8211l0537
179d155r176L4612p81k8533J2774K5747k3687k1903K7292K68l7256J0714K6276
192A2192k1760j5852J9119Q638r591J412J4997L25j1918O981J2394q975j0417
205b455L453O677n234j2823O745J1081j5745l812J9392p379j4885J6136J0504
218A1655j6820n898J8052L702j6945N339J4575j4198p849J5598k269j3027K414
$$ plain form
231 -5671 -102 -2388 -7414 -4601 3934 1447 -2350 5588 9019 4541 3408 6526 7042 -2706 -6607
246 -6607 2940 -1946 -14313 -5306 713 -9451 -6999 4286 3099 -3433 1110 10356 4380 -2750
260 -2750 6930 7903 -2326 1093 5996 186 -2819 -669 1169 -3353 -9078 -3560 -1228 -9371 -7715
275 -7715 -661 -1482 -2313 1952 7198 6654 3280 8868 11284 1728 737 5449 -1693 -7189 -4315 -3360
291 -3360 -7047 -8621 -2727 269 -4987 -1413 6385 1814 -246 4917 4628 1682 1171 2924 3602 -1059
307 -1059 -485 3620 -987 -3646 107 -1532 -4779 -4635 -3524 -2113 -4164 -3121 2858 1646 419 5930
323 5930 6417 3348 3940 3948 2844 -768 -3109 -559 -3251 -6637 -2550 -2006 -4092 -1290 817 988 932
340 932 887 3750 2143 -1060 2423 2470 -1732 -146 1322 -201 -873 -1109 278 -263 -3380 -864 -53
$$ packed form
231e671N569k286n026K813Q535k487l797P938L431m478j133L118N16r748l901
246f607R547m886j2367R007O019j0164K452J1285j187o532M543R246n976p130
260b750R680R73j0229L419M903n810l005K150J838m522n725N518K332q143J656
275g715P054q21q31M265N246n44l374N588K416r556r91M712p142n496K874R55
291c360l687j574N894K996n256L574P798m571k060N163k89k946n11J753O78m661
307a059N74M105m607k659L753j639l247J44J111J411k051J043N979j212j227N511
323E930M87l069N92Qj104l612k341K550k692l386M087N44k086K802K107J71n6
340I32m5K863j607l203L483M7m202J586J468j523o72k36J387n41l117K516Q11
$$ plain form
357 -53 -3251 -1482 470 -815 257 1399 2400 2531 1025 2898 3212 -1049 -740 828 -2166 -2690 -1830
374 -1830 -1579 -1292 -2086 -61 2096 -642 612 3553 887 223 1483 505 -201 -1162 -748 -95 -2355
391 -2355 -1464 1121 -1921 -2162 884 -105 -516 538 805 1532 909 1486 2907 1259 804 2264 665
408 665 -243 -682 -2339 -1337 -2085 -3463 -1325 -2036 -2272 978 779 -367 1968 3166 2643 2026 1906 2794
426 2794 1129 -92 1442 -681 -2014 247 -1697 -3103 -1432 -2461 -2451 -977 -1301 -1053 243 1205
442 1205 2311 1690 2571 3780 2057 2442 2887 -858 -579 578 -2440 -2923 -2118 -2622 -2402 -1727 -1237 -300
460 -300 -799 744 2276 664 1256 1812 1127 1794 926 49 1510 283 -965 335 -1267 -2504 -361
477 -361 -775 -2886 -2288 -721 179 -1149 65 2513 429 965 4277 1450 -633 1907 555 -1664
$$ packed form
357e3l198J769J952j285J072J142J001J31j506J873L14m261L09J568k994n24Q60
374a830K51K87p94K025K157k738J254K941k666o64J260r78p06r61M14O53k260
391b355Q91K585l042k41L046r89m11J054K67P27o23N77J421j648m55J460j599
408F65r08m39j657J002p48j378K138p11k36L250j99j146K335J198n23o17j20Q88
426B794j665j221J534k123j333K261j944j406J671j029J0J474l24K48J296R62
442A205J106o21Q81J209j723L85M45l745K79J157l018m83Q05n04K20O75M90R37
460c00m99J543J532j612N92N56o85O67q68q77J461j227j248J300j602j237K143
477c61m14k111N98J567R00j328J214K448k084N36L312k827k083K540j352k219
$$ plain form
493 -1664 -1268 -1129 -2202 -2568 -1017 -170 -1699 -743 2000 666 620 1824 1069 947 1059 260 687 -38
511 -38 -812 757 -107 -1672 -146 -375 -1625 -1380 -1094 -976 -1578 -631 929 -743 8 3637 2028 494
529 494 2712 2047 734 1408 54 -1684 -2098 -1544 -1183 -2673 -2184 -498 -1372 -529 1627 606 278 1551
547 1551 1394 1408 929 249 1596 755 -195 1055 306 -716 593 -162 -1618 -1288 -700 -1265 -2266 -1571
565 -1571 60 -1085 -818 1801 828 431 3193 1988 762 1113 908 185 -180 -649 -915 -1775 -926 405
583 405 -857 -1222 -359 -236 176 -73 -732 304 -321 -924 1377 1045 -873 1101 1802 329 900 1625
601 1625 539 -666 154 530 -2037 -1825 472 -1293 -2090 826 45 -1228 782 470 -181 487 813
618 813 81 -205 354 1054 56 328 725 -221 313 1087 -644 -485 -194 -1461 -254 -204 -1887 -1045 24
$$ packed form
493a664L96J39j073l66J551Q47j529R56K743j334m6J204p55j22J12p99M27p25
511c8p74J569q64j565J526k29j250K45K86J18o02R47J560j672P51L629j609j534
529D94K218o65j313O74j354j738m14N54L61j490M89J686q74Q43K156j021l28J273
547A551j57J4m79o80J347q41r50J250p49j022J309p55j456L30N88n65j001O95
565a571J631j145K67K619r73l97K762j205j226L51k05p23l65m69k66q60Q49J331
583D05j262l65Q63J23M12k49o59J036o25o03K301l32j918J974P01j473N71P25
601A625j086j205Q20L76k567K12K297j765p97K916p81j273K010l12o51O68L26
618H13p32k86N59P00r98K72L97r46N34P74j731J59K91j267J207N0j683Q42J069
$$ plain form
637 24 -127 189 494 502 553 662 1473 492 -578 992 60 -1160 757 270 -1266 -268 173 -989 -600 137
657 137 -170 -817 -587 534 21 -199 1037 127 -129 1447 673 61 401 -246 -128 22 -727 -544 -753
676 -753 -725 -172 -274 -442 82 89 400 670 -128 396 366 -264 645 597 -347 175 353 -20 84 -75 -177 -389
698 -389 -857 -131 -21 -738 252 326 -484 376 1039 489 559 496 352 288 -539 -50 -486 -1022 -292 -315 -997 34
720 34 -4 -150 213 124 123 232 53 620 208 -517 335 345 29 554 100 -90 471 -279 -263 -58 -630 -404 -517
743 -517 -565 65 -152 -228 620 379 429 996 73 480 513 -244 -96 103 -518 -353 -77 -384 55 -1 235 159
765 159 -288 115 348 -504 -38 125 -617 194 214 -57 497 587 359 459 131 238 2 -425 -24 -213 -916
786 -916 -86 -294 -596 257 100 -25 658 109 38 291 -153 34 -1 -207 15 -34 -203 569 -30 150 463
$$ packed form
637B4j51L16L05QN1J09Q11r81j070J570r32j220J917m87j536R98M41j162L89P37
657A37l07o47K30J121n13k20J236r10k56J576p74o12L40o47J18J50p49J83k09
676g53K8N53j02j68N24PL11K70p98N24l0o30R09m8r44N22J78l73J04j59j02k12
698c89m68P26J10p17R90P4q10Q60O63n50P0o3j44o4q27M89m36n36P30k3o82J031
720C4l8j46L63q9jJ09j79N67m12p25Q52J0l16N25m54j90N61p50J6K05n72K26j13
743e17m8O30k17p6Q48k41N0N67r23M07L3p57J48J99o21J65K76l07M39n6K36p6
765A59m47M03K33q52M66J63p42Q11K0k71N54R0k28J00l28J07k36m27M01j89p03
786i16Q30k08l02Q53j57j25O83n49p1K53m44J87l5k06K22m9j69P72n99J80L13
$$ plain form
807 463 -189 16 281 -407 -291 105 -373 -150 -209 -160 144 29 239 507 166 298 446 -64 138 52 -396
828 -396 55 -83 -312 58 -84 -258 172 -232 91 78 -249 19 53 -198 211 183 -119 553 201 354 474
849 474 -59 160 171 -404 -223 -150 -461 -220 -376 -301 62 -223 183 224 270 416 288 28 406 231 -105 199
871 199 15 -70 47 -299 -261 6 -390 -188 -234 -280 69 -129 -45 201 -96 142 240 194 260 530 -179 157 325
894 325 -320 -164 -167 -326 -251 -354 -367 -102 -287 196 -20 -224 227 320 -51 309 218 159 468 -30 -26 438 -64
917 -64 -126 90 -552 -264 -145 -404 -177 -177 -96 171 -100 143 210 -85 256 446 -2 99 183 -3 61 229 -138
940 -138 119 -36 -94 78 -362 -189 -84 -518 -118 -64 -243 7 -16 129 429 -118 140 432 187 -109 117
961 117 -161 -218 -194 -347 4 -330 25 190 -361 -77 337 -284 -11 165 -121 -150 209 163 -86 150 286 244
$$ packed form
807D63o52K05K65o88J16L96m78K23n9M9L04j15K10K68l41J32J48n10K02q6m48
828c96M51j38k29L70j42j74M30m04L23j3l27K68L4k51M09k8l02O72l52J53J20
849D74n33K19J1n75J81P3l11K41j56P5L63k85M06M1M6J46j28k60L78j75l36L04
871A99j84q5J17l46L8K67l96K02m6m6L49j98Q4K46k97K38R8m6O6K70p09L36J68
894C25o45J56lj59P5j03j3K65j85M83k16k04M51R3l71L60r1n9L09m98MM64n02
917f4o2K16o42K88J19k59K27%Q1K67k71K43O7k95L41J90m48J01Q4j86O4J68l67
940a38K57j55n8J72m40J73J05m34M00N4j79K50k3J45L00n47K58K92k45k96K26
961A17k78n7K4j53L51l34L55J65n51K84M14o21K73J76k86k9L59m6k49K36J36m2
$$ plain form
983 244 -62 232 258 -414 -131 241 -388 -196 127 -273 -77 -149 67 -43 -153 219 202 57 96 200 20 188
1005 188 132 -128 184 -91 -41 199 -142 -345 178 -356 -416 -62 -3 -214 -283 133 289 10 368 421 -154 137
1027 137 592 -81 -132 -47 -324 -272 -101 -40 -317 -268 -111 -41 -230 -124 129 66 167 386 122 71 127 71 246
1050 246 54 -220 123 -442 -303 104 -392 -395 -27 -3 -103 -151 -23 152 -37 202 509 53 351 417 -83 27
1072 27 202 -35 53 -136 -355 -78 -226 -83 48 -107 -8 13 -28 104 93 4 224 46 27 319 -49 -175 366
1095 366 49 -294 73 -37 -293 -329 -148 125 -156 -10 253 -147 -63 416 -29 230 163 -99 113 127 86 -104
1117 -104 142 -95 -15 -382 -118 -5 -102 15 30 -110 100 118 38 312 188 42 342 60 -125 131 68 -52
1139 -52 -63 -167 -85 -173 -281 198 -194 -81 168 170 -126 254 9 -208 27 98 139 -102 -71 72 34 -46 286 77
$$ packed form
983B44l06K94K6o72K83L72o29J92L23m00J96p2K16j10j10L72j7j45L9J04j80J68
1005A88n6k60L12k75N0K40l41k03N23n34o0L54N9k11o9M16J56k79L58N3n75K91
1027A37M55o73n1Q5k77N2J71O1k77M9J57P0j89J06K53o3J01K19k64n1N6n6J75
1050B46j92k74L43n65J39M07m96lL68K4j00m8J28J75j89K39L07m56K98O6n00J10
1072B7J75k37Q8j89k19K77j48J43J31j55R9K1m1J32j1q9K20j78j9K92l68j26N41
1095C66l17l43L67j10k56l6J81K73k81J46K63m00Q4M79m45K59o7k62K12J4m1j90
1117a04K46k37Q0l67K64J13r7J17J5j40K10J8q0K74j24j46L00k82j85K56o3j20
1139e2j1j04Q2q8j08M79l92J13K49Kk96L80k45k17K35P1M1k41L1J43l8q0L32k09
$$ plain form
1163 77 -176 179 -150 -104 76 110 23 -35 -99 226 -48 69 229 -9 108 55 72 13 57 32 126 41 -123 -58 98
1188 98 -82 231 -119 -94 -11 -94 58 26 -26 89 32 68 30 92 33 120 158 -96 -116 59 102 60 -72 58 17 -239
1214 -239 66 -252 -195 90 74 -66 107 -41 15 23 10 77 79 162 238 104 -60 182 -69 -189 56 -87 -43 -70
1238 -70 -228 -122 -141 -94 107 -36 -49 167 185 73 55 -116 -44 -19 -210 -26 72 -22 -40 -15 -36 -117 -56 -33 64 11
1264 11 26 -165 -11 151 126 20 162 18 27 162 -13 -78 53 22 -52 -165 -132 -54 -188 -122 137 151 -2 136
1288 136 -41 -164 197 -1 65 225 65 129 19 -148 164 -208 -99 -32 -41 -151 29 -107 20 144 -223 27
1310 27 39 -49 220 172 11 153 16 -22 -31 20 50 33 -54 -183 -148 30 -11 -136 7 47 208 274 26 86 72 156
1336 156 -112 202 -126 240 107 61 -153 -76 -60 -71 73 -35 59 196 -133 67 3 -3 22 -35 20 160 22 -92
$$ packed form
1163G7k53L55l29M6J80L4q7n8o4L25k74J17J60k38J17n3J7n9M4k5R4q5j64O5J56
1188I8j80L13l50K5Q3q3J52l2n2J15n7L6l8O2n9Q7L8k54k0J75M3m2j32J30m1k56
1214b39L05l18N7K85j6j40J73j48N6Qj3O7KQ3P6j34j64K42k51j20K45j43M4k7
1238g0j58J06j9M7K01j43j3K16J8j12j8j71P2K5j91J84R8r4j8K5k1q1O1K3R7n3
1264A1J5j91J54J62k5j06J42j44RJ35j75o5J31l1p4j13L3P8j34O6K59J4j53J38
1288A36j77j23L61j98O6J60j60O4j10j67L12l72J09O7rj10J80j36J27J24l67K50
1310B7J2q8K69m8j61J42j37l8rN1L0j7q7j29L5J78m1j25J43M0J61O6k48O0j4Q4
1336A56k68L14l28L66j33m6k14P7J6j1J44j08R4J37l29K00o4oK5n7N5J40j38j14
$$ plain form
1360 -92 157 -119 79 -45 45 251 -52 -128 8 -40 -88 -13 -74 141 67 -17 94 -99 -85 -12 -15 -103 -122 25 -35
1385 -35 71 -16 183 40 -51 27 -207 -121 163 41 25 -8 -173 66 62 33 -119 6 -49 283 -47 -59 163 6
1409 6 -146 198 -96 77 3 -21 -73 0 -57 -6 28 -122 79 92 157 -77 149 101 -33 -53 52 79 -12 88 -38
1434 -38 -163 -32 -87 -8 -12 -94 -54 39 -158 39 16 -83 242 -4 183 155 -40 71 19 162 -36 62 -124 -117 -8
1459 -8 -94 33 -45 -99 -94 78 -108 45 -12 -81 127 7 138 34 282 127 41 60 -102 -46 -147 -71 -39 123 -73
1484 -73 -85 55 -87 30 166 67 104 24 5 60 79 -59 -32 121 -20 -36 -98 -218 95 -44 -124 15 -130 5
1508 5 36 -87 53 115 -153 31 70 -64 107 180 101 -106 51 169 112 -47 -34 42 -72 28 -42 -41 82 40 63
1533 63 171 -27 63 42 24 4 51 83 53 60 -32 -3 -257 -53 -24 89 47 -116 -45 -13 86 20 -84 -4 79 -58 -36
$$ packed form
1360i2K49k76J98j24R0K06l03p6J36m8m8P5o1K15p4q4J11j93J4P3lq8j9J47o0
1385c5J06q7J99j43r1P8k34Q6K84j22j6l3j65K39mk9j52J25n5L32l30j2K22j57
1409Fj52L44k94J73p4k4n2P3n7N1L4j50K01J3O5k34K26m8j34k0J05K7r1J00j26
1434c8j25J31n5P9mq2M0R3j97J97k3r9L25k46J87k8j95J11n2J43j98R8j86PJ09
1459hq6J27p8n4NJ72j86J53n7o9K08j20J31j04K48j55q6J9j62N6j01P6L2J62j96
1484g3j2J40j42J17J36r9L7q0j9N5J9j38K7J53j41j6o2j20L13j39q0J39j45J35
1508EL1j23J40O2k68J84L9j34J71P3p9k07J57J18n7j59J3P6j14J00p0JJ23m2K3
1533F3J08j98R0k1j8k0M7L2l0Pr2K9k54K04K9J13m2j63P1L2R9o6j04Q0Q3j37K2
$$ plain form
1560 -36 8 136 88 -158 207 110 33 129 -259 -5 85 -114 -126 23 64 58 78 -105 4 144 45 24 -61 -178 -46
1585 -46 -158 109 30 -66 -34 -52 -17 59 88 82 -36 -112 -43 41 -21 -63 22 69 117 25 125 59 1 -118 62 153 68 -85
1613 -85 -33 -10 -39 11 152 55 -163 4 113 -35 147 -28 98 -13 -26 0 -81 -9 192 87 -81 -5 -9 45 74
1638 74 30 211 -102 -40 110 -11 199 -113 -141 -34 -8 -77 133 -28 37 -41 -186 -69 166 -143 145 42 96
1661 96 293 106 132 -34 -10 -125 -218 -24 -41 18 -47 -166 -65 32 -36 206 18 -6 143 41 191 -62 -75 -26
1685 -26 -42 114 -11 6 64 -12 -113 86 -18 51 111 -31 -88 3 -1 -159 -39 14 13 -74 -132 65 -2 -87 93 29
1711 29 -120 -51 98 77 74 -43 60 -65 -81 32 -44 -22 -16 -51 -8 112 -151 -61 67 76 -65 -57 -3 61 21 -18 -17 29
1739 29 12 239 -63 -88 185 -113 -16 -78 -139 131 5 -110 -66 -43 -2 151 -192 141 75 -14 -10 81 22 85 67 -28
$$ packed form
1560c6M4J28m8k46L65r7p7R6l88K54R0j99j2J49M1oK0j83J09J40r9k1q5j17J32
1585d6j12K67p9r6L2j8L5P6K9oj18p6O9Q4o2m2Q5M7M8r2J00o6n8j19J80R1q5j53
1613h5N2K3k9N0J41r7k18J67J09j48J82j75J26j11j3K6q1P2K01j05j68P6mN4K9
1638G4m4J81l13O2J50j21K10l12k8J07K6o9K10j61O5p8j45J17K35l09K88j03N4
1661I6J97j87K6j66K4j15r3J94j7N9o5j19J01R7o8K42j88k4J49j02J50k53j3M9
1685b6j6J56j25J7N8p6j01J99j04O9O0j42n7R1mj58J20N3jq7n8J97o7q5J80o4
1711B9j49O9J49k1lj17J03j25j6J13p6K2Ol5M3J20k63R0J28Rj41QN4O4m0l9JM6
1739B9j7K27l02k5K73k98R7o2o1K70j26j15M4K3M1J53l43L33o6q9MR1n9O3j8r5
$$ plain form
1765 -28 106 -16 -20 105 -1 -29 -35 -25 22 -106 -137 -59 47 -150 11 72 -112 37 54 107 -71 -15 21 47 29 6
1791 6 206 -26 88 118 38 -71 160 118 94 -74 -4 -9 11 19 -2 10 -100 50 5 -56 -78 19 -11 -33 76 84 -56
1818 -56 169 31 68 -87 1 36 117 -12 134 -75 -145 3 43 -45 -41 69 13 -116 -2 -48 -29 124 170 -4 -167
1843 -167 60 -134 -84 -171 -24 -36 142 26 23 -46 -21 137 -111 7 11 46 25 -2 -64 -26 36 -4 -64 61 -14 35
1869 35 -206 21 50 50 -45 -12 118 -44 82 39 23 -10 84 -83 22 118 -3 47 30 -95 88 17 -4 -141 97
1894 97 -119 -138 174 28 74 -33 71 -178 59 -97 -57 84 -215 -123 -69 -81 -11 -70 54 104 -62 -12 -26 -113
1918 -113 90 -57 -57 -183 -73 -92 73 -16 -60 -3 -59 16 -105 35 176 -202 160 -59 -14 85 -99 -127 -269 -14
1942 -14 90 -61 70 190 -24 76 -11 30 -20 34 -92 -73 -77 88 92 -177 -54 91 -21 2 7 -91 36 -40 -104
$$ packed form
1765b8J34j22mJ25j06k8oJ0M7j28l1P8J06j97J61O1j84J49J7N3j78N6L6K6j8k3
1791FK00k32J14L0q0j09K31m2k4j68P0nK0Qk1J2j10J50m5o1k2R7l0k2J09Qj40
1818e6K25j38L7j55Q8L5Q1j29J46k09p0J48M0q8MJ10n6j29J14m6J9J53M6j74j63
1843a67K27j94N0q7J47j2J78j16lo9K5J58k48J18ML5k1k7o2L8O2m0o0J25p5M9
1869C5k41K27K9%r5L3J30j62J26m3j6l3R4j67J05R6j21N0j7j25J83p1k1j37K38
1894I7k16j9L12j46M6j07J04k49K37j56M0J41k99R2N4j2P0n9J24N0j66N0j4q7
1918a13K03j47%j26J10j9J65q9m4N7n6P5j21J40J41l78L62k19M5R9j84k8j42K55
1942a4J04j51J31J20k14J00q7M1n0N4j26J9mJ65Mk69J23J45j12K3Nr8J27p6o4
$$ plain form
1967 -104 -24 -58 -122 -256 -109 -54 -79 -60 37 41 -218 -68 -80 -56 51 31 25 22 -75 101 -27 221 163 35 18 -57 -28
1994 -28 94 -7 21 191 3 -41 13 -23 -186 39 96 38 -69 -181 -4 -45 102 62 -44 -3 -18 -7 42 43 151
2019 151 -3 24 4 -46 -42 69 30 108 139 -171 60 -38 -18 54 -5 64 -15 -143 -10 53 -277 -148 -108 41 128 2
2045 2 24 -159 2 -91 59 -35 64 26 4 56 137 -136 -13 -151 -15 -23 92 167 -47 -81 -73 70 9 -24 84 80 155
2072 155 -44 61 148 -86 40 -86 109 -79 49 104 -11 12 -47 -16 104 -37 -24 -33 -9 113 3 -67 21 5
2096 5 -72 -60 -183 34 12 -203 68 -6 -86 156 134 -23 -58 44 -102 -157 3 91 -116 -57 7 37 22 28 46 134
2122 134 -152 -248 -2 -139 41 130 -138 -58 286 -71 -87 92 0 -156 -108 2 112 179 15 -92 206 65
2144 65 -58 4 87 -54 -46 36 -16 178 64 -106 28 123 -105 -65 99 -215 71 78 18 25 -4 -40 -84 -61 98 -140
$$ packed form
1967a04Q0l4o4j34J47N5k5J9R7Mk59J50j2K4J07k0olr7J76j28K48n8j28j7p5K9
1994b8J22j01K8J70j88m4N4l6j63K25N7n8j07j12J77m1J47m0j06M1j5J1M9JJ08
2019A51j54K7k0n0MJ11l9P8L1l10K31r8K0P2n9O9p9j28J33O3l30J29M0J49Q7j26
2045BK2j83J61r3J50r4R9l8k2N2Q1k73J23j38J36qJ15P5k14l4QJ43o1l3J08mP5
2072A55j99J05Q7k34J26j26J95j88J28N5j15K3n9L1J20j41J3rK4J22j10p0Q8j6
2096Ep7J2j23K17k2k15K71p4q0K42k2j57l5J02j46n5J60Q8k07N9O4L0j5OJ8Q8
2122A34k86r6K46j37J80Q9k68Q0L44l57j6J79r2j56M8J10J10O7j64j07K98j41
2144F5j23O2Q3j41QQ2n2J94j14j70J34R5k28M0J64l14K86Po0Pk9l6m4K3J59k38
$$ plain form
2170 -140 -10 -27 -19 -106 37 -30 -1 97 -94 27 -98 -17 56 118 23 21 131 103 14 -12 -25 -116 -159 -1 80 20 90
2197 90 -50 92 -32 40 84 94 -123 56 -39 81 0 77 -35 -140 34 -194 -70 152 78 -30 -24 101 47 80
2221 80 71 -96 49 -148 46 34 -9 -102 -11 -13 134 -89 62 23 -72 -80 -78 53 0 5 -56 43 -34 -136 53 50 -32 168
2249 168 -30 -28 -77 59 91 119 -109 -121 89 -16 -15 -85 86 -167 123 -10 -21 77 -122 -75 -148 -124 80 -201 -10
2274 -10 -61 -144 82 -46 163 41 -81 114 84 121 20 -135 -25 -8 51 99 -38 167 -18 15 -117 78 50
2297 50 76 -3 14 56 14 -37 114 -21 -18 -8 23 -59 -98 -52 -82 -12 45 -4 3 41 134 -108 17 52 -134 65 62 -174
2325 -174 -60 89 31 83 -64 67 -28 190 -64 -41 -30 -18 25 -17 -79 -1 -100 202 -83 -35 6 75 -43 2 31
2350 31 18 -112 -20 -102 144 -76 86 -4 -20 18 56 28 149 -73 79 -32 85 8 66 133 59 -55 -71 29 5
$$ packed form
2170a40J30j7Qq7J43o7K9R8j91J21j25Q1P3O2r5kJ10k8q9k6j3r1m3J58Q1o0P0
2197I0j40J42j24P2M4J0k17J79r5J20q1P7j12j05J74k28J24K22p4j08OJ25n4L3
2221H0rj67J45j97J94j2m3r3R1kJ47k23J51l9r5qKJ31n3No1R9p7j02J89lq2K00
2249A68j98Km9J36L2K8k28j2K10j05Jp0J71k53K90j33j1R8j99M7p3K4K04k81J91
2274a0n1q3K26j28K09j22j22J95l0L7j01j55J10J7N9M8j37K05j85L3j32J95k8
2297E0K6p9J7M2m2n1J51j35LJ0L1q2l9M6l0P0N7m9PL8R3k42J25L5j86J99lk36
2325a74J14J49n8N2j47J31r5K18k54K3J1J2M3m2o2P8r9L02k85M8M1O9j18M5K9
2350C1j3j30R2q2K46k20J62r0j6L8L8k8J21k22J52j11J17p7N8O7p4j14j6J00k4
$$ plain form
2375 5 -63 -10 -2 21 20 -5 -120 13 50 -174 80 63 -44 -172 81 -135 -125 -155 -106 -19 57 -50 -134 -48 41 -80 108
2402 108 177 -14 -64 -96 26 -32 41 84 -26 -151 -11 64 -98 79 84 -110 184 -7 -67 20 -55 159 64 51 -2
2427 -2 143 -96 -21 -72 3 -18 -76 91 -201 141 88 -175 95 86 -39 24 6 188 -76 110 -104 44 66 20 -84
2452 -84 -18 227 -128 17 106 3 175 55 -3 -43 16 28 91 -41 31 22 -146 -65 -88 15 -63 -49 -55 -177 -120 164
2478 164 48 -46 -42 -38 56 182 -81 185 -93 38 103 -13 91 -53 19 8 159 24 108 -62 11 231 -137 -207
2502 -207 137 -32 56 -68 72 -18 88 42 78 -132 -153 -24 -1 62 -108 -34 -11 -2 -24 -78 39 79 79 -126 -3
2527 -3 -64 -89 -3 30 37 -52 -40 -39 -6 85 164 109 -3 -7 -124 -118 106 7 -39 44 109 40 -226 64 -255 -121 -19 -125
2555 -125 -81 149 131 37 -29 -235 -82 118 75 -2 -78 19 11 62 -101 -70 -13 -263 -10 -33 43 37 44 55 142 -185 21
$$ packed form
2375Eo8N3QK3jk5j15J33L7k24K54j7j07j28K53k16J0l0M9Q7P6j07q4Q6Q9j21J88
2402A08O9j91n0l2J22n8P3M3j10j25J40P5j62J77Nj94K94j91o0Q7p5K14r5j3n3
2427bJ45k39P5n1P5k1n8J67k92L42n3k63K70rj25O3j8J82k64J86k14J48K2m6j04
2452h4O6K45l55J45Q9j03J72j20n8m0N9J2O3j32P2rj68Q1k3J03p8J4oj22N7K84
2478A64j16r4MMR4J26k63K66k78J31O5j16J04j44P2j1J51j35Q4j70P3K20l68p0
2502b07L44j69Q8j24J40r0J06m6L6k10k1J29K3O3j70P4K3Rk2n4J17M0%k05J23
2527co1k5Q6L3Pq9J2JL3R1P9n5j12mj17OK24r9m6Q3O5o9k66K90l19J34J02j06
2555a25M4K30j8r4o6k06J53K00m3p7p6R7qN1j63L1N7k50K53k3P6oPJ1Q7l27K06
$$ plain form
2582 21 65 117 74 -179 -69 -22 -104 -144 61 -81 -111 73 -38 -154 -58 86 -71 -24 1 -38 57 52 -30 34 -39 31
2608 31 59 -50 64 -51 18 80 40 113 42 -81 9 -34 95 -18 38 102 97 67 -57 -148 -74 184 -21 -71 -13 88
2634 88 197 81 28 -41 -83 -140 -16 -85 41 144 -9 72 -7 81 70 -12 -29 -15 -237 98 -4 97 -29 101
2658 101 78 -17 -98 -87 -115 48 -120 -51 76 -10 8 -247 35 118 10 -85 -82 -23 -41 94 8 62 87 87 -170 -41
2684 -41 -98 16 16 317 109 -34 -108 112 43 -109 22 37 -58 60 125 50 91 -114 46 80 80 20 -61 68 32 14
2710 14 -11 -61 -97 24 -64 -120 37 -5 12 -106 -178 10 70 48 -102 4 -23 -144 16 120 -14 31 -119 -37 27
2735 27 -107 158 -84 -83 84 -180 -95 5 168 -87 -144 -76 84 111 -70 -38 102 69 -40 -48 7 -40 -70 12 70
2760 70 -153 -201 66 -33 -67 -83 82 55 27 -18 13 -173 20 157 -34 93 119 25 99 125 111 -66 85 132 -116
$$ packed form
2582B1M4N2m3k53J10M7q2m0K05j42l0J84j11j16R6J44j57M7K5l9R5nq2O4p3P0
2608C1K8j09J14j15O9O2m0P3p1j23R0m3J29j13N6O4nl0j24r1P4K58k05n0N8J01
2634H8J09j16n3o9m2n7J24o9J26J03j53Q1p9Q8j1q2j7J4k22L35j02J01j26J30
2658A01k3r5q1J1k8J63j68O9J27q6J8k55K82Q3j08r5LN9j8J35q6N4K5%k57J29
2684d1n7J14%L01k08j43p4K20o9j52J31J5r5J18O5p5M1k05J60L4%o0q1J29l6j8
2710A4k5n0l6J21q8n6J57m2J7j18p2J88O0k2j50J06k7j21J60J04j34M5j50Q2O4
2735B7j34K65k42JJ67k64Q5J00J63k55n7O8J60K7j81L2J40l3j09qN5m7l0Q2N8
2760G0k23m8K67r9l4j6J65k7k8m5L1j86J93J37j91J27K6r4P4K6j4j77J51M7k48
$$ plain form
2785 -116 -53 50 125 -42 26 -53 166 -66 121 -220 -155 11 -21 -138 45 52 -11 52 -77 122 22 -119 69
2808 69 167 119 -93 12 24 120 74 -73 -69 -116 66 36 -85 -97 124 -80 91 -39 -49 -111 -25 45 50 -42 68 -39
2834 -39 43 -1 -130 -59 93 -62 9 54 145 26 -124 -30 -53 7 -141 25 143 -72 19 -87 84 -37 6 39
2858 39 75 65 147 -151 78 47 -139 25 -104 85 188 147 6 -162 17 93 200 -51 -28 103 99 -126 -41 -99
2882 -99 -23 -24 -103 9 -10 -53 -166 -70 29 -39 -141 44 51 33 118 32 -93 -64 -118 -97 79 -81 -59 -24 101 -33 -119
2909 -119 -9 49 68 138 65 -73 68 50 46 -33 8 -59 62 -34 64 -41 -59 -2 -5 -3 -132 -111 11 -81 -55 3 6 -173
2937 -173 36 -54 58 -105 41 -86 -131 110 -306 -103 18 -14 227 -42 -38 39 -1 170 92 -64 113 -94 -130
2960 -130 -12 -78 35 120 -58 63 79 -71 -36 225 -40 15 -72 72 103 55 39 -6 72 -25 198 7 -88 -52 11
$$ packed form
2785a16O3J03P5j67O8p9K19k32J87l41O5J66l2j17J83Po3O3j29J99j00j41J88
2808F9R8m8k12J05J2R6m6j47Mm7J82l0j21j2K21k04J71j30j0o2Q6P0Nr2J10j07
2834c9Q2m4j29P1J52j55P1M5R1j19j50R4k3O0j48J66J18k15R1j06J71j21M3L3
2858C9L6j0Q2k98K29l1j86J64j29J89J03m1j41j68J79P6J07k51K3J31mk25Q5n8
2882i9P6jp9J12j9m3j13R6R9o8j02J85Pj8Q5q6j25K9n4K1J76j60K2L5J25j34q6
2909a19J10N8J9P0p3j38J41j8mp9M1o7J21r6R8j05j8N7lKj29K1J22r2K6N8Lj79
2937a73K09r0J12j63J46j27m5K41m16K03J21l2K41k69MP7m0J71p8j56J77k07l6
2960a30J18o6J13Q5j78J21J6j50L5K61k65N5q7J44L1m8j6m5P8r7K23j91r5L6O3
$$ plain form
2985 11 2 47 -10 51 109 126 -67 159 -79 113 -155 -156 173 -84 -16 -74 26 101 -41 211 -79 -18 13 68 -20 29
3011 29 -6 -41 21 163 -82 29 9 -75 9 181 -37 53 -16 -3 54 -84 136 31 101 -94 32 -129 -167 100
3035 100 78 16 105 -147 199 -40 -129 27 -109 80 -12 -65 -24 -21 -14 0 -12 -92 -215 -7 6 148 -39 -69 -79 76
3061 76 -167 -92 -3 -1 116 -12 -109 100 76 -2 -79 -22 -104 22 -62 -75 -191 -146 121 47 -33 174 9 20 161 -65
3087 -65 67 -110 -123 -10 -161 111 113 -13 -6 61 -120 76 104 2 84 -98 98 115 -20 -31 -81 -143 -170 1 -66
3112 -66 23 -12 40 -187 -279 11 159 -29 84 -75 -52 -81 -22 -63 34 -186 151 -109 -53 -144 74 -102 91 84 -118
3137 -118 -60 -34 243 -132 47 -33 -44 -148 66 -30 4 10 5 -82 180 47 -27 -24 110 75 27 103 105 -13 -133 33
3163 33 43 180 10 -140 26 14 -82 -49 75 2 -25 -99 -39 78 86 -25 152 33 76 -149 -60 8 13 155 71 -40
$$ packed form
2985A1rM5n7O1N8J7j93K26k38J92k68jL29k57O8n8J00P5j42K52k90O1L1N5q8M9
3011B9l5l5O2J42k45J11k0q4Q4J72k18R0o9J3N7j38K20j05P0j95J26j61l8K67
3035A00k2o2Q9k52L46k39q9J56j36J89r2n3M1LPJ4j2q0j23K08J3J42j87l0j0J55
3061G6k43P5Q9KJ17j28r7K09k4p8p7N7q2J26q4j3j16M5K67p4q0K07j65J1J41k26
3087f5J32j77j3J13j51K72Kj26PO7j81J96K8j02Q2j82J96J7j35j1n0o2k7J71o7
3112f6Q9l5N2k27r2K90J48j88J13j59K3k9N9m1R7k20L37k60N6r1K18j76J93pk02
3137a18N8K6K77l75J79q0j1j04K14r6L4Onq7K62j33p4LJ34l5m8P6Kj18j20J66
3163C3J0J37j70j50J66j2r6L3J24p3k7p4O0J17Qj11J77j19M3k25Q9O8NJ42q4j11
$$ plain form
3189 -40 -225 -4 10 -56 4 -49 -134 -46 -84 56 -45 54 -9 42 93 -55 -73 39 141 20 69 -52 -119 -169 87
3214 87 79 28 -126 -54 73 -134 -83 178 -101 -153 73 -34 -38 63 -97 -1 12 -68 45 -70 -37 -46 -10 -38 8 -130
3240 -130 19 19 199 11 7 -168 -61 81 2 35 229 89 7 61 -65 18 -13 164 -50 -56 -21 -93 -22 -137 -26
3265 -26 216 -105 126 -7 29 111 54 148 -91 49 -72 -33 -171 153 -115 -165 18 -52 -59 81 -55 -93 -49 -57 74
3290 74 -217 -82 -103 -19 34 -12 140 -27 -50 -31 -65 -48 -7 -64 36 -108 89 26 20 25 16 -3 -45 -168 -96 -56 53
3317 53 -22 48 -208 -9 -158 -83 61 -102 -18 68 28 43 -95 -20 62 48 59 -76 -49 -46 89 90 -51 -18 46 -139
3343 -139 -70 51 -64 105 111 34 -27 -38 -119 181 -147 138 51 193 67 -42 123 77 -40 -50 -28 -15 44 -77
3367 -77 -62 105 -35 -52 129 87 -15 19 122 48 -33 56 47 -50 85 31 -156 -72 -81 -7 202 -33 68 -159 81
$$ packed form
3189d0j85K21J4o6O0n3q5Q8l8J40j01R9o3N1N1j48j8J12J02j21M9j21o7n0K56
3214H7qn1j54P2J27k07N1K61k79n2K26j07mJ01j60R6J3q0J13j15L3rL6k8M6j38
3240a30J49%J80j88mj75J07J42p9L3J94j40q2N4j26Q3l1J77k14oL5p2P1j15J11
3265b6K42l21K31j33L6Q2n7R4k39J40j21L9j38L24k68n0J83p0pJ40j36l8M4qJ31
3290G4k91J35k1Q4N3m6J52j67k3J9l4J7M1n7J00j44J97o3oNrj9m2j23P2M0J09
3317E3p5P0k56J99j49P5J44j63Q4Q6m0J5j38P5Q2j4J1j35K7LJ35Jj41L3O4j85
3343a39O9J21j15J69Op7o1j1q1L00l28K85q7J42j26j09J65m6j17j0K2J3N9j21
3367g7J5J67j40j7J81m2j02L4J03p4q1Q9rr7J35n4j87Q4rP4K09k35J01k27K40
$$ plain form
3392 81 -87 41 23 13 -31 121 21 91 -98 -140 94 -28 94 -14 29 -16 4 18 82 -80 -57 165 -22 23
3416 23 41 -45 -39 27 -66 -123 -103 -32 -82 58 47 -30 92 -19 41 -4 -73 20 0 214 50 88 -22 26 119 88 -14
3443 -14 48 -132 16 40 46 -3 -7 12 5 49 -71 16 -103 43 -39 98 -126 -22 -170 -48 -36 -59 23 -100 133 112
3469 112 3 -3 40 -62 -58 -70 105 -55 -135 1 74 60 -91 33 -35 -73 8 -7 -97 -61 -53 4 54 11 125 -172 163
3496 163 191 61 -106 -58 -54 -31 56 -67 -3 188 150 -76 56 54 52 -102 35 6 98 -108 -93 -36 19 111 -66 -2
3522 -2 13 63 34 95 37 11 -60 -241 -87 107 -42 69 -24 24 -42 -99 60 -14 -80 -136 -34 -85 11 41 -153 -52
3548 -52 -147 13 -84 -8 -86 49 117 56 -76 92 23 -65 -104 -3 29 -22 79 68 54 -5 -90 -108 130 -173 -99 103
3574 103 -198 81 43 -22 133 133 -214 -27 -156 -143 -66 166 56 52 36 -114 -63 0 -118 -51 36 -70 -5 -25 29
$$ packed form
3392H1j68J28j8j0m4J52j00P0j89m2K34j22J22j08M3m5K0J4O4j62K3K22j87M5
3416B3J8q6OO6r3n7K0P1n0J40j1p7J22j11O0m5o9R3k0K14j64L8j10M8R3l1j02
3443a4O2j80J48K4Om9mJ9pM4j20Q7j19J46q2J37k24J04j48J22J2k3Q2j23K33k1
3469A12j09oM3j02Mj2J75j60q0J36P3j4j51J24o8l8Q1j5r0L6QN7N0m3J14k97L35
3496A63K8j30j67M8MK3Q7j23O4J91l8k26J32kkj54J37k9R2k06J5N7N5R2j77O4
3522bJ5N0k9O1n8k6p1j81J54J94j49J11r3M8o6n7J59p4o6n6J02n1R6L0j94J01
3548e2r5J60r7P6p8J35O8o1j32J68o9q8l9J01L2n1J01j1j4n9q5j8K38l03P4K02
3574A03l01K79l8o5J55%l47J87j29J3P7K32j10mj6j50N1O3j18O7Q7j06O5k0N4
$$ plain form
3599 29 93 -42 21 -105 -5 -75 -138 62 27 -21 -23 -26 170 57 11 -292 2 63 136 157 -151 107 111 46 92 55 -41
3626 -41 -129 -76 -39 13 -86 -169 -38 53 26 -33 2 33 -165 50 160 -165 69 -122 -162 215 -77 50 -143 -270
3650 -270 -3 -59 -205 26 -39 -81 110 101 -13 -40 -32 101 11 55 147 51 -37 171 -3 77 103 129 -201 -84 -33 -71
3676 -71 26 80 -26 23 -23 -62 -41 5 165 211 188 41 18 -84 72 46 -24 -82 48 46 33 -118 -54 60 84 -103
3702 -103 -207 59 -27 134 -45 52 -114 2 120 22 -102 -3 145 -53 -106 72 -111 91 11 5 3 165 60
3725 60 -95 -38 -42 -83 -102 3 35 -102 106 -104 -147 17 56 -33 113 -62 72 115 135 36 74 -52 140 115 -68
3750 -68 -21 -94 -36 138 150 36 2 144 -50 30 -46 55 104 210 78 -201 -89 17 49 -45 89 -100 40 -160
3774 -160 -40 -240 22 44 261 115 -30 -83 10 148 15 -37 -33 -12 -13 -12 -72 -88 46 -199 -58 -33 90 149 18
$$ packed form
3599B9O4j35O3j26J00p0o3K00l5m8klJ96j13m6l03K94O1P3K1l08K58Mo5M6l7r6
3626d1q8N3L7N2r9q3J31R1k7n9L5L1j98K15J10l25K34j91m0L77k92J27j93j27
3650b70K67n6j46K31o5m2J91rj14k7QJ33r0M4R2r6q8K08j74Q0K6K6l30J17N1l8
3676g1R7N4j06M9m6l9K1M6J60M6k3j47k3j02J56k6p0n8J30kj3j51O4J14K4j87
3702a03j04K66q6J61j79R7j66J16J18r8j24R9J48j98n3J78j83K02q0okJ62j05
3725F0j55N7mm1j9J05L2j37K08k10m3J64L9q9J46j75J34M3K0r9L8j26J92k5j83
3750f8M7p3N8J74J2j14l4J42j94Q0p6J01M9J06j32k79J12J06L2r4J34j89J40k00
3774a60J20k00K62K2K17j46j45n3R3J38j33n2MK1jJo0j6J34k45J41K5J23N9j31
$$ plain form
3799 18 -188 60 107 46 136 -71 85 -31 127 102 -99 -39 196 -148 100 -45 3 198 -66 -159 -48 24 -158
3822 -158 -42 297 108 29 -26 83 -129 80 -63 -136 75 63 -183 151 37 -194 -69 -133 -53 -23 -12 102 73
3845 73 -164 -193 71 67 -160 35 28 63 221 51 -1 125 -49 16 78 20 6 -34 89 148 -74 -69 73 -57 -88 16
3871 16 -5 155 -36 20 -257 95 -76 87 207 188 17 -122 153 -53 40 -182 -112 -12 25 6 -37 -61 149
3894 149 -70 8 32 -60 96 -58 -127 -34 -13 91 26 59 113 40 -30 168 -15 3 -106 4 -11 17 -160 53 -89
3919 -89 97 23 1 -131 28 164 8 76 -138 121 12 38 -142 5 90 -55 -20 6 -24 -137 -127 81 -176
3942 -176 -294 -88 42 39 273 24 -64 -45 73 -9 -46 24 -178 13 55 -153 -58 60 202 -42 -59 72 27 -105
3966 -105 -27 26 136 52 -7 31 -178 7 -126 -68 32 -43 58 -131 -20 -126 188 87 143 51 94 -47 110
$$ packed form
3799A8k06K48M7o1R0k07J56j16J58k5k01O0K35l44K48j45M8J95k64r3J11P2j82
3822a58J16L39j89p9n5J09k12K09j43p3K11j2k46L34j14k31J25o4Q0L0J1J14k9
3845G3k37k9K64mk27J95pL5J58j70n2J26j74O5O2n8j4m0J23N9k22NJ42j30l1J04
3871A6k1J60j91N6k77L52j71J63J20j9j71j39K75k06R3k22P0J00L7j9m3k4K10
3894A49k19P8K4r2J56j54o9R3K1J04o5L3N4p3p0J98j83J8j09J10j5K8j77K13j42
3919h9J86p4k2j32J59J36j56O8k14K59j09K6j80J47Q5j45L5K6l0j13J0K08k57
3942a76j18K06J30lK34k49q8J9J18q2l7P0k02J91M2k08R5J18J42k44j7J31m5j32
3966a05P8N3J10q4n9L8k09J85j33N8J00p5J01j89J11j06L14j01N6r2M3j41J57
$$ plain form
3989 110 143 -34 -46 -9 35 4 -177 -48 -95 14 129 139 -51 -189 151 6 100 -95 -16 -196 -79 126 -135
4012 -135 17 10 109 67 195 11 -14 10 49 -16 97 -112 94 78 11 -116 -63 65 -13 31 -48 11 -145 -18 -10 14
4038 14 -94 56 -146 25 -97 -43 -56 -28 142 -31 4 -31 28 -91 -110 144 42 58 -123 35 44 53 -13 -30 -12
4063 -12 60 -30 -146 -76 52 -20 -160 38 59 24 112 96 176 24 -162 -46 95 47 147 67 26 55 14 4 0 -124
4089 -124 67 -268 68 -123 37 36 17 107 -43 206 36 115 -36 -87 -41 149 -112 97 46 -64 82 122 65
4112 65 -72 -111 100 30 -94 40 15 -56 -91 -73 -111 40 45 -50 -49 116 145 21 -23 141 -56 -115 29 -146 16
4137 16 -44 57 -6 -90 -53 -4 -133 -14 130 -12 -242 -139 -47 -201 -41 33 58 -32 -21 -57 -17 4 -11 50 2 159
4163 159 107 -79 32 28 -94 -125 -10 -89 -19 -19 -163 -16 -40 -7 46 91 -18 -123 -123 44 -224 -85 56 -6 -9 -10
$$ packed form
3989A10L3j77j2L7M4l1j81J29m7J09J15J0j90j38L40j45R4j95P9j80J17K05k61
4012a35J52pR9m2J28j84k5K4L9o5J13k09K06j6o7j27N3J28p8M4p9N9j56J27QK4
4038A4j08J50k02J71j22N4j3K8J70j73L5l5N9j19j9K54j02J6j81J58RRo6j7J8
4063a2P2r0j16P0J28p2j40J98K1l5Q8j6Q0j52j86J16J41m8J00q0m1K9m1j0mj24
4089a24J91l35L36j91J60jj9R0j50K49j70P9j51n1M6J90k61K09n1j10J46M0n7
4112F5j37l9K11p0j24J34k5p1l5J8l8J51Nr5JJ65K9j24m4J64j97n9J44j75J62
4137A6o0J01o3q4L7M9j29J19J44j42k30J03R2j54J60P4K5r0J1l6M0K1j5O1m8J57
4163A59n2j86J11mj22l1J15p9P0%j44J47k4L3N3M5j09j05%J67k68J39J41o2lj
$$ plain form
4189 -10 21 -95 13 58 -101 -161 43 1 -152 -62 -101 96 37 34 -8 23 27 -64 129 100 107 -87 -78 40 15 -38 -38 -81
4217 -81 87 -65 99 -129 63 -59 -54 -7 -65 28 -133 14 134 -33 -98 -56 -172 145 -68 -140 -116 49 -100
4240 -100 45 84 -139 125 43 133 -42 -71 -95 4 -71 79 -73 9 -53 -98 182 62 -1 0 -55 -52 -165 -188 -139 59
4266 59 -69 9 13 -81 127 -4 -35 -45 46 31 196 -12 -162 -81 -40 -39 64 -22 -62 154 -34 -98 32 53 84 -88
4292 -88 43 180 120 -15 -63 71 89 56 81 -2 145 -152 -184 -8 243 -99 13 -27 -167 165 4 -13 126
4315 126 -6 -4 60 -194 -106 36 -32 75 3 49 -53 6 135 -56 -81 5 200 -93 -116 69 -88 61 -110 -14
4339 -14 -29 -74 26 -37 136 5 67 -52 -1 -25 50 -73 21 -83 -37 -13 68 -165 -91 -194 -143 -41 88 105 32
4364 32 -109 71 6 -110 81 -100 -49 -47 -77 -84 -29 1 84 -150 2 35 -141 -42 118 -45 -133 -84 -19 -66 120 -9
$$ packed form
4189a0L1j16J08M5j59o0K04m2j53R0l9J97n9lm2L1Mr1J93k9Pj94RJ18k5n3%m3
4217h1J68j52J64k28J92j22NM7n8R3j61J47J20j67o5M2j16L17k13p2K4J65j49
4240a00J45L9k23K64q2R0j75k9k4R9p5J50j52Q2o2m5K80j20o3Jn5Lj13k3M9J98
4266E9j28P8Mr4K08j31l1j0R1j5J65k08j50Q1M1JJ03q6m0K16j88o4J30K1L1j72
4292h8J31J37o0j35m8J34J8l3K5q3J47k97l2J76K51l42J12m0j40L32j61j7J39
4315A26j32KO4k54Q8J42o8J07p2M6j02N9J29j91k5Q6J95k93k3J85j57J49j71R6
4339a4j5m5J00o3J73j31O2j19N1k4P5j23R4j04M6K4Q1k33P4j03N1J02J29J7p3
4364C2j41J80o5j16J91j81N1Kl0pN5L0Q3k34J52L3j76R9J60j63q8M9O5m7J86j29
$$ plain form
4390 -9 -68 43 -108 58 155 -13 55 -56 -127 260 8 -59 48 25 -47 -9 -125 -37 72 -72 161 22 19 10 144
4415 144 -102 -89 -4 76 43 144 25 54 67 26 -12 -107 119 -73 30 -101 -21 91 154 173 39 -31 31 73 -136
4440 -136 18 38 14 105 -221 -34 58 -71 16 -93 62 44 83 21 73 59 -15 -49 4 -73 86 1 51 -44 108 31
4466 31 -16 -4 -182 -57 -15 60 -128 -23 -99 137 0 41 -11 -26 -33 -137 -60 146 68 47 -24 -12 44 -29 -225 162
4492 162 114 22 99 -43 131 115 -165 65 -21 -150 -117 -60 24 32 -6 84 -85 -125 128 65 14 -62 -55 183 -87 20
4518 20 -77 -44 -52 15 -90 -42 -64 14 -100 -16 -59 62 -135 8 -3 -35 -90 -66 33 5 190 31 -5 -154 107 211
4544 211 138 -112 -46 122 -29 -28 87 -20 33 48 -17 100 161 63 -24 -42 81 65 -157 38 149 12 -16 74 -18
4569 -18 -151 -103 74 -110 75 -8 -15 28 -23 18 171 -48 40 -38 -104 -42 -38 59 2 6 -173 221 -29 -44 -60 80 -74
$$ packed form
4390in9J11j51J66R7j68O8j11p1L87k52o7J07k3p2L8j16Q8J09j44K33j39lrJ34
4415A44k46J3Q5Q0l3J01j19K9J3m1l8r5K26j92J03j31Q0J12O3J9j34p0O2M2k09
4440a36J54K0k4R1l26J87R2j29Q7j09J55j8L9o2N2j4p4l4N3p7J59q5N0r5J52p7
4466C1m7J2j78J25M2P5j88J05p6K36j37M1n2j5pj04P7K06p8k1p1J2N6p3j96L87
4492A62m8r2P7j42J74j6k80K30q6j29L3N7Q4Ql8R0j69m0K53o3n1p6PK38k70J07
4518B0r7L3qO7j05M8k2P8j14Q4m3J21j97J43j1l2n5K4R9k8J85j59l6j49K61J04
4544B11p3k50O6J68j51JJ15j07N3J5o5J17O1r8q7j8J23j6k22J95J11j37k8R0r2
4569a8j33M8J77j84J85q3pM3n1M1J53k19Q8p8o6O2MR7n7Mj79L94k50j5j6J40j54
$$ plain form
4596 -74 95 4 12 161 65 20 -53 -151 -154 -38 -12 108 120 -130 16 6 -99 -20 -301 20 78 65 143 7 65 73 65
4623 65 -70 14 -13 53 14 58 33 -193 176 41 -94 7 -3 -32 -68 66 -34 -66 156 86 17 4 -47 -108 48
4648 48 -106 36 49 -255 -147 32 -17 -68 -78 -75 -106 28 -109 -70 28 -14 35 116 -105 -34 -102 43 117 112 -35 -34 84
4675 84 -150 168 -34 -61 -12 -10 -216 -5 -119 109 -41 82 114 -75 106 -58 258 55 -87 58 -10 22 74
4698 74 40 -32 -43 -142 96 132 38 -8 89 77 18 -83 -85 26 87 -42 44 -55 18 -26 19 72 13 -57 36 -86 -15 15
4726 15 -24 84 8 -99 27 133 79 -108 -125 -55 90 4 103 115 -45 57 36 -39 -6 -95 71 -6 -52 -81 111
4751 111 -143 22 95 -127 -93 -102 2 19 -20 152 140 55 -51 101 6 -5 69 -96 85 36 13 153 53 -79
4775 -79 -3 -11 -15 -112 -84 -109 185 43 18 104 89 -26 54 144 76 -171 88 80 5 20 -12 28 48 -56 -110 -36 -48 9 -201
$$ packed form
4596g4J69r1QJ49r6m5p3r8lJ16K6J20J2k50J46j0j05P9k81L21N8j3P8j36N8Qq
4623F5j35Q4k7O6l9M4k5k26L69j35j35J01j0k9l6J34j00l2K22p0o9j3n1o1J56
4648D8j54J42J3l04J08J79m9n1j0Ll1J34j37L9R8m2M9Q1k21P1o8J45P4nj47JJ18
4675H4k34L18k02k7M9Kk06K11j14K28j50J23L2j89J81j64L16k03j42J45o8L2N2
4698G4l4p2j1r9K38L6r4m6R7j2n9j01kJ11O1j29Q6r9P3m4M5N3n9p0R3j22P1L0
4726A5l9J08p6j07J26J06n4j87j7P0J45q6R9J2j60J02k1p5L3q9J66p7m6k9J92
4751A11k54J65P3k22L4rJ04J7l9J72j2q5j06J52r5j1P4j65J81m9k3J40j00j32
4775g9P6qmr7K8k5K94j42k5Q6j5j15Q0R0o8k47K59qp5J5l2M0K0j04n4P4j2N7k10
$$ plain form
4804 -201 -126 -81 -147 77 -40 -33 -6 88 208 -94 98 16 17 77 -133 -5 -141 34 45 -34 -91 -66 50 106 -196
4829 -196 72 152 15 0 -10 -75 -168 -48 13 152 -64 -7 66 -178 101 131 -44 112 -50 -13 8 95 -45 31
4853 31 -1 -53 -14 47 39 -157 8 128 -177 -97 -164 17 15 40 26 -41 182 82 -52 -98 61 142 17 59 33 74
4879 74 -135 56 209 -174 82 192 -146 35 36 301 -36 -33 -117 123 -51 7 -63 129 195 -138 -47 5 85 -93
4903 -93 34 -80 -93 -58 -34 -53 -115 107 204 15 -68 21 75 82 182 42 -166 -104 139 12 -22 -52 17 26 153 34
4929 34 -8 20 -102 25 83 4 -194 10 -20 -77 49 -84 -5 12 -14 81 78 134 2 -80 13 -26 62 -68 41 41 127
4956 127 147 94 224 186 1 -58 52 -69 175 -152 68 18 -173 32 -140 41 37 26 82 -40 182 68 54
4979 54 6 107 87 -13 -54 -86 23 -212 -31 99 -39 -78 -57 -104 -102 111 -98 -157 141 -86 -67 -174 -24 58
$$ packed form
4804b01P5M5o6K24j17PK7R4J20l02J92q2JO0k10J28j36J75J1p9n7K5J16N6l02
4829a96K68Q0j37j5j0o5r3J20O1J39k16N7P3k44K79L0j75J56j62L7K1Q7j40P6
4853C1l2n2L9O1qj96J65J20l05Q0o7J81kK5j4o7K23j00j34m6J59Q1j25M2k6M1
4879G4k09J91J53l83K56J10l38J81JK65l37Lq4K40j74N8p0J92O6l33R1N2Q0j78
4903i3J27j14j3L5K4j9o2K22R7j89q3Q9N4PJ00j40k08O2K43j27l4l0O9RJ27j19
4929C4m2K8j22J27N8p9j98K04l0n7J26j33P9J7k6R5lN6j32q2R3l9Q8j30J09%Q6
4956A27K0n3J30l8j85n9J10j21K44l27K20n0j91K05j72J81mj1N6j22K22j14j4
4979E4m8J01k0j00m1l2J09k35J81J30j38l9K1m7KK13k09n9K98k27J9j07J50Q2
$$ plain form
5003 58 -42 184 -18 88 -3 49 27 15 -53 -19 -9 82 -71 -7 -57 -11 73 -99 105 81 132 48 -138 -112 163 14
$$ packed form
5003E8j00K26k02J06r1N2k2j2o8L4J0R1j53O4n0M6Q4j72K04k4N1q4j86K6K75j49
$$ [...]
8191F4
##END NTUPLES=NMR FID
##END=
