##TITLE=1H_DE-82k2
 200.13MHz,CDCl3,
 8 sc
 
 4.4.2025
##JCAMPDX= 6.0         $$ Bruker NMR JCAMP-DX V2.0
##DATA TYPE= NMR FID
##DATA CLASS= NTUPLES
##ORIGIN= UXNMR, Bruker Analytische Messtechnik GmbH
##OWNER= pz
$$ XWIN-NMR		Version 3.5
$$ Fri Apr  4 14:12:23 2025 Russian Standard Time (UT+4h)  she@DPX200
##.OBSERVE FREQUENCY= 200.1313
##.OBSERVE NUCLEUS= ^1H
##.DELAY= (6, 6)
##.ACQUISITION MODE= SIMULTANEOUS
##.ACQUISITION SCHEME= undefined
##.AVERAGES= 8
##.DIGITISER RES= 18
##SPECTROMETER/DATA SYSTEM= spect
##.PULSE SEQUENCE= zg30
##.SOLVENT NAME= CDCl3
##.SHIFT REFERENCE= (INTERNAL, CDCl3, 0, 14.3821)
##AUDIT TRAIL= $$ (NUMBER, WHEN, WHO, WHERE, WHAT)
$$ ##TITLE= Audit trail, XWIN-NMR		Version 3.5
$$ ##JCAMPDX= 5.01
$$ ##ORIGIN= Bruker BioSpin GmbH
$$ ##OWNER= she
$$ F:/spectra/data/she/nmr/H-C/1/audita.txt
$$ ##AUDIT TRAIL=  $$ (NUMBER, WHEN, WHO, WHERE, WHAT)
(   1,<2025-04-04 14:11:08.96 +0400>,<she>,<DPX200>,
      <created by zg, POWCHK disabled, PULCHK disabled
       configuration hash MD5:
       00 E9 B6 7A A2 85 ED C7 34 08 36 98 17 FE 4E 26
       data hash MD5: 16K
       CC 38 3D E8 D0 4E 9E 43 D0 20 46 B4 DB 3C 1F 31>)
$$ ##END=
$$ 
$$ hash MD5
$$ 19 C9 76 8C 39 AF F0 8B D8 00 44 2D 25 F9 9A D9
##$RELAX= 
##$RELAX= 
##$RELAX= 
##$RELAX= 
##$RELAX= 
##$RELAX= 
$$ Bruker specific parameters
$$ --------------------------
##$DU= <F:/spectra>
##$EXPNO= 1
##$NAME= <H-C>
##$PROCNO= 1
##$TYPE= <nmr>
##$USER= <she>
##$AMP= (0..31)
100 100 100 100 100 100 100 100 100 100 100 100 100 100 100 100 100 100 
100 100 100 100 100 100 100 100 100 100 100 100 100 100 
##$AQSEQ= 0
##$AQ_mod= 1
##$AUNM= <au_zg>
##$AUTOPOS= <>
##$BF1= 200.13
##$BF2= 200.13
##$BF3= 200.13
##$BF4= 200.13
##$BF5= 200.13
##$BF6= 200.13
##$BF7= 200.13
##$BF8= 200.13
##$BYTORDA= 1
##$CFDGTYP= 0
##$CFRGTYP= 5
##$CHEMSTR= <none>
##$CNST= (0..31)
1 1 145 1 1 1 1 1 1 1 1 1 1 1 1 1 1 1 1 1 1 1 1 1 1 1 1 1 1 1 1 1 
##$CPDPRG= <>
##$CPDPRG1= <>
##$CPDPRG2= <>
##$CPDPRG3= <>
##$CPDPRG4= <mlev>
##$CPDPRG5= <mlev>
##$CPDPRG6= <mlev>
##$CPDPRG7= <mlev>
##$CPDPRG8= <mlev>
##$CPDPRGB= <>
##$CPDPRGT= <>
##$D= (0..31)
0 0.7 0 0 0 0 0 0 0 0 0 0.03 0 0 0 0 0 0 0 0 0 0 0 0 0 0 0 0 0 0 0 0 
##$DATE= 1743761468
##$DBL= (0..7)
120 120 120 120 120 120 120 120 
##$DBP= (0..7)
150 150 150 150 150 150 150 150 
##$DBP07= 0
##$DBPNAM0= <>
##$DBPNAM1= <>
##$DBPNAM2= <>
##$DBPNAM3= <>
##$DBPNAM4= <>
##$DBPNAM5= <>
##$DBPNAM6= <>
##$DBPNAM7= <>
##$DBPOAL= (0..7)
0.5 0.5 0.5 0.5 0.5 0.5 0.5 0.5 
##$DBPOFFS= (0..7)
0 0 0 0 0 0 0 0 
##$DE= 6
##$DECBNUC= <off>
##$DECIM= 32
##$DECNUC= <off>
##$DECSTAT= 4
##$DIGMOD= 1
##$DIGTYP= 9
##$DL= (0..7)
0 120 120 120 120 120 120 120 
##$DP= (0..7)
150 150 150 150 150 150 150 150 
##$DP07= 0
##$DPNAME0= <>
##$DPNAME1= <>
##$DPNAME2= <>
##$DPNAME3= <>
##$DPNAME4= <>
##$DPNAME5= <>
##$DPNAME6= <>
##$DPNAME7= <>
##$DPOAL= (0..7)
0.5 0.5 0.5 0.5 0.5 0.5 0.5 0.5 
##$DPOFFS= (0..7)
0 0 0 0 0 0 0 0 
##$DQDMODE= 0
##$DR= 18
##$DS= 0
##$DSLIST= <SSSSSSSSSSSSSSS>
$$ [...]
##$SUBNAM0= <"">
##$SUBNAM1= <"">
##$SUBNAM2= <"">
##$SUBNAM3= <"">
##$SUBNAM4= <"">
##$SUBNAM5= <"">
##$SUBNAM6= <"">
##$SUBNAM7= <"">
##$SUBNAM8= <"">
##$SUBNAM9= <"">
##$SW= 18.0517328524113
##$SWIBOX= (0..15)
0 0 2 0 0 0 0 0 0 0 0 0 0 0 0 0 
##$SW_h= 3612.71676300578
##$TD= 16384
##$TD0= 1
##$TE= 0
##$TE2= 300
##$TE3= 300
##$TEG= 300
##$TL= (0..7)
0 120 120 120 120 120 120 120 
##$TP= (0..7)
150 150 150 150 150 150 150 150 
##$TP07= 0
##$TPNAME0= <>
##$TPNAME1= <>
##$TPNAME2= <>
##$TPNAME3= <>
##$TPNAME4= <>
##$TPNAME5= <>
##$TPNAME6= <>
##$TPNAME7= <>
##$TPOAL= (0..7)
0.5 0.5 0.5 0.5 0.5 0.5 0.5 0.5 
##$TPOFFS= (0..7)
0 0 0 0 0 0 0 0 
##$TUNHIN= 0
##$TUNHOUT= 0
##$TUNXOUT= 0
##$USERA1= <user>
##$USERA2= <user>
##$USERA3= <user>
##$USERA4= <user>
##$USERA5= <user>
##$V9= 5
##$VALIST= <valist>
##$VCLIST= <CCCCCCCCCCCCCCC>
##$VD= 0
##$VDLIST= <DDDDDDDDDDDDDDD>
##$VPLIST= <PPPPPPPPPPPPPPP>
##$VTLIST= <TTTTTTTTTTTTTTT>
##$WBST= 1024
##$WBSW= 4
##$XGAIN= (0..3)
0 0 0 0 
##$XL= 0
##$YL= 0
##$YMAX_a= 120767
##$YMIN_a= -170357
##$ZGOPTNS= <>
##$ZL1= 120
##$ZL2= 120
##$ZL3= 120
##$ZL4= 120
##$ABSF1= 10
##$ABSF2= 0
##$ABSG= 5
##$ABSL= 3
##$ALPHA= 0
##$AQORDER= 0
##$ASSFAC= 0
##$ASSFACI= 0
##$ASSFACX= 0
##$ASSWID= 0
##$AUNMP= <proc_1d>
##$AZFE= 0.1
##$AZFW= 0.1
##$BCFW= 1
##$BC_mod= 2
##$BYTORDP= 1
##$COROFFS= 0
##$CY= -3
##$DATMOD= 1
##$DC= 2
##$DFILT= <>
##$DTYPP= 0
##$F1P= 0
##$F2P= 0
##$FCOR= 0.5
##$FTSIZE= 0
##$FT_mod= 4
##$GAMMA= 1
##$GB= 0.15
##$INTBC= 1
##$INTSCL= 1
##$ISEN= 128
##$LB= 0.25
##$LEV0= 0
##$LPBIN= 0
##$MAXI= 10000
##$MC2= 0
##$MEAN= 0
##$ME_mod= 0
##$MI= 1.114404
##$NCOEF= 0
##$NC_proc= 0
##$NLEV= 6
##$NOISF1= 3.799351
##$NOISF2= 2.8
##$NSP= 1
##$NTH_PI= 0
##$NZP= 0
##$OFFSET= 14.38212
##$PC= 1
##$PHC0= -827.5485
##$PHC1= 6.992209
##$PH_mod= 1
##$PKNL= yes
##$PPARMOD= 0
##$PSCAL= 0
##$PSIGN= 0
##$REVERSE= no
##$SF= 200.129724274929
##$SI= 16384
##$SIGF1= 3
##$SIGF2= 2
##$SINO= 400
##$SIOLD= 16384
##$SREGLST= <1H.CDCl3>
##$SSB= 0
##$STSI= 0
##$STSR= 0
##$SW_p= 3205.1282051282
##$SYMM= 0
##$S_DEV= 0
##$TDeff= 0
##$TDoff= 0
##$TI= <>
##$TILT= no
##$TM1= 0
##$TM2= 0
##$TOPLEV= 0
##$USERP1= <user>
##$USERP2= <user>
##$USERP3= <user>
##$USERP4= <user>
##$USERP5= <user>
##$WDW= 1
##$XDIM= 8192
##$YMAX_p= 0
##$YMIN_p= 0
$$ End of Bruker specific parameters
$$ ---------------------------------
##NTUPLES= NMR FID
##VAR_NAME=  TIME,          FID/REAL,        FID/IMAG
##SYMBOL=    X,             R,               I
##VAR_TYPE=  INDEPENDENT,   DEPENDENT,       DEPENDENT
##VAR_FORM=  AFFN,          ASDF,            ASDF
##VAR_DIM=   8192,          8192,            8192
##UNITS=     SECONDS,       ARBITRARY UNITS, ARBITRARY UNITS
##FACTOR=    0.0002768,     1,               1
##FIRST=     0,             0,               0
##LAST=      2.2672688,     0,               0
##MIN=       0,             -170357,         0
##MAX=       2.2672688,     120767,          0
$$ Real data points
##PAGE= N=1
##DATA TABLE= (X++(R..R)), XYDATA
0@%%%%%%%%%%%%%%%%%qJ6j6J6j6J6k0K8l2L4m0M6n3O1o9P9q8R9j12J23j36J52
$$ 0 0 0 0 0 0 0 0 0 0 0 0 0 0 0 0 0 0 -8 8 -8 8 -8 8 -12 16 -16 18 -22 24 -29 32 -37 42 -46 53 -59 64 -72 80
39H0j70J91k11K34k58K84l16L48l82M20m62N10n64O22o85P59q43R37j047J175
$$ 80 -90 101 -110 124 -134 150 -166 182 -200 220 -242 268 -296 326 -359 400 -443 494 -553 622
59F22j327J515j751K053k458L028l879N291q019J5026o5086j15372K15854P5270
$$ 622 -705 810 -941 1112 -1346 1682 -2197 3094 -4925 10101 -54985 -170357 45497 120767
73A20767j14210M2333O8542o8858J131N4360n1460m5040L9060n3464q3742N3918
$$ 120767 6557 48890 117432 48574 49705 104065 52605 7565 46625 -6839 -90581 -36663
85c6663J4116r1290L7372P2102n5489N911Q8515l955k7380K3076R693R991J9187
$$ -36663 -22547 -113837 -76465 -4363 -59852 -53941 34574 30619 3239 26315 36008 45999 65186
98F5186k5966l2743J9127P764m0730R491L5800n7457m6445M4604k016l2254K5261
$$ 65186 39220 6477 25604 33368 -7362 2129 37929 -19528 -65973 -21369 -23385 -55639 -30378
111c0378k007j8353M1032J6430j9993L6643M3228l4479l7600L7984K6664m5164
$$ -30378 -32385 -50738 -9706 6724 -13269 23374 66602 32123 -5477 32507 59171 14007
123A4007k4651L310k3845R669L2587k5995k6453K1108K0294Q155p80j0645J446
$$ 14007 -10644 -7334 -31179 -21510 11077 -14918 -41371 -20263 31 8186 7406 -3239 -1793
136a793Q673P629k550j2372Q987J5750j4720j2135P866M066n156j6144r979M726
$$ -1793 6880 14509 11959 -413 8574 24324 9604 -2531 5335 9401 4245 -11899 -21878 -17152
150a7152j864P178R339j4287M037K6879L200L63P552p478n581M88n069p207p692
$$ -17152 -19016 -11838 -2499 -16786 -12749 14130 17330 17693 25245 17767 12186 12674 7605 398 -7294
165g294k974k342p185M962M685k339Q778n86r109J3727Q379p729L346p14j539
$$ -7294 -10268 -12610 -19795 -14833 -10148 -12487 -3709 -4295 -13404 323 8702 973 4319 3605 2066
180B066J6498M520j3699m584M516L38q096m647l408j4649M14J3827j0115j972
$$ 2066 18564 23084 9385 4801 9317 9655 1559 -3088 -6496 -21145 -20731 -6904 -17019 -18991
194a8991J8918j227k027J4888l34m322Q491J00j1146m239P104l67j1322J988L997
$$ -18991 -73 -1300 -3327 11561 11227 6905 15396 15496 4350 111 7215 6848 -4474 -2486 1511
209A511q836N304O042j3273k74P094n001J017M865k620K564N658L053l07n29M454
$$ 1511 -7325 -2021 4021 -9252 -9526 -2432 -7433 -6416 -1551 -4171 -1607 4051 7104 6797 6268 10722
225A0722k533q176J542k593n961L649l466n371R090L308k235M661Q02o57L020
$$ 10722 8189 13 1555 -1038 -6999 -3350 -6816 -12187 -3097 211 -2024 2637 3439 2782 5802
240E802p31j436k966j500K310l225j418M384l431j340N085l954r54K945l050n2
$$ 5802 5071 3635 669 -831 1479 -1746 -3164 1220 -2211 -3551 1534 -2420 -3374 -429 -3479 -3531
256c531J743n15L114K024J289L055j954J049K022m959k065j214n245l34n48l467
$$ -3531 -1788 -2303 811 2835 4124 7179 5225 6274 8296 3337 1272 58 -5187 -5521 -6069 -9536
272i536K562Q77R84N037P67J056L057j091J243M72k964J811o4l260J310l24j767
$$ -9536 -6974 -6097 -5113 -76 691 1747 4804 3713 4956 5428 2464 4275 4211 951 2261 1937 170
289A70Q88l106j860J029l225n69R69r20L073J611Q54M909J220o0L011j96j333
$$ 170 1058 -2048 -3908 -2879 -6104 -6673 -5704 -6624 -3551 -1940 -1086 3823 5043 4983 7994 7798 6465
306F465n70l797j101j770l864Q49n70j811K307j36k99L336l65J82K611o07R54
$$ 6465 5895 2098 997 -773 -4637 -3788 -4358 -6169 -3862 -3998 -4297 -961 -1326 -1144 1467 860 1814
323A814J275o06K179j19q02J620j778k886J41k649j961L00k758N62J011p65K344
$$ 1814 3089 2483 4662 4543 3741 5361 3583 697 838 -1811 -3772 -3472 -6230 -5668 -4657 -5422 -3078
340c078J968J452K974L38K43J362j510p34N11k127k31n44k366P04m83j374J241
$$ -3078 -1110 342 3316 3654 3897 5259 3749 3015 3526 1399 1168 624 -1742 -1038 -1521 -2895 -1654
357a654q34o81J093j039M98J954r5J561J232M75J663j48j223R15j397j539q5k601
$$ -1654 -2488 -3169 -2076 -3115 -2617 -663 -758 803 2035 2510 4173 4025 2802 3717 2320 781 696 -1905
375a905j040N43j422O52Q29J07J455P33Q4J493o5j15J487j763P9J133j128L7j03
$$ -1905 -2945 -2402 -3824 -3172 -2343 -2236 -781 -48 36 1529 1464 1349 2836 1073 1152 2285 1157 1194 1091
394A091j601J023n87j661J02p10j89J093p60Q74J539l90J543J117o03J053l50
$$ 1091 -510 513 -74 -1735 -1633 -2343 -2532 -1439 -2199 -1325 214 -176 1367 2484 1881 2934 2584
411B584j181L56j390j500J57l57m14J34k57P89N78k94Q10k82L19J692j637l94
$$ 2584 1403 1759 369 -1131 -974 -1331 -1745 -1611 -1868 -1079 -501 -795 15 -267 52 1744 107 -287
429b87K094m89j47J144j198j76J60r09o35j263M97j85j135M39O39m25J663J611
$$ -287 1807 1318 1171 2315 1117 941 1101 192 -443 -1706 -1209 -1394 -2529 -2090 -1451 -1876 -213 1398
447A398j259R04J249m07j32l65o67M7o31l3m62p62O83Q5n71J14o9p60J204o87
$$ 1398 139 1043 2292 1885 1753 1388 721 768 137 104 -358 -1120 -437 -352 -923 -809 -878 -1638 -434 -1121
467a121l63J431K11j13J144l24o7R54k72l40j183K87k22r99k50L66r38P54J385
$$ -1121 -1484 -53 158 45 1189 865 798 1752 1480 1140 -43 244 22 -977 -1227 -861 -1799 -1045 340
486C40q29l14J395l86K31J16k16j05j66M19j74o89P90O44j394M93K04o14K65O9
$$ 340 -489 -803 592 206 437 553 337 232 66 485 311 -378 412 1056 -338 155 359 -255 10 79
506G9j025N92K46J57J92l58K34Q72p91K32m1o78j27L39n87l22J33N02M44n46P59
$$ 79 -946 -354 -108 49 241 -117 117 989 198 430 389 -289 -416 -77 -664 -986 -853 -351 93 -453 306
527C06J13k30O58j30r37K93P14o19m01MK08J90l45k59P4l46O79l66l62J09L35
$$ 306 419 189 847 717 -220 73 787 168 -233 -229 -21 169 -176 -435 -361 -707 -28 -394 -756 -647 -312
548c12%J010n61R9J156n66j04Q8n86l8O5l88n46m79R54l30n92P45K30o44R73N27
$$ -312 -312 698 137 236 1392 826 722 810 224 186 251 -137 -683 -1162 -208 -538 -1130 -385 -155 -799 174 701
570G01q10j34O98Om35O18k9n28O68no46m71Q28k31j384P86r4m69P39m0q39J308
$$ 701 -109 -243 455 461 26 644 615 87 755 750 104 -367 461 230 -1154 -368 -462 -931 -192 -232 -1071 237
592B37O65n86j00K72j99J71j57p1p36K57M57o37J15O02q07J10Q44r12k78R95k95
$$ 237 902 316 216 488 289 460 303 232 -504 -247 210 -427 -312 290 -517 -407 437 -475 -753 242 -53
613e3k06O47k77L17o1J46j72m45N98j15j038K49K15o22L33K62j66K34O18m17o7
$$ -53 -259 388 111 428 367 513 341 -104 494 379 -659 -410 -195 -817 -484 -222 -388 -154 464 47 -20
634b0L82kj75K9j03L3m38M92k22k10K26j27j92M46m57l72L16R9M1K06j53M46K82
$$ -20 362 360 185 214 111 144 -294 198 -24 -234 -8 -135 -327 119 -338 -710 -394 -295 -254 -48 -201 245 527
657E27j19R4m9Q7K96n61j50j47k96L4j18K0l2P0j11K67N7K34J40k2K43P5k02J41
$$ 527 408 502 453 540 836 275 125 -22 -318 -284 -402 -382 -414 -344 -455 -188 -131 103 243 221 464 539 337 478
681D78J05k06m8l3j33Qj36k52J25l08L5k92j0K88N02m09N76M12n95M07q5j85k2
$$ 478 583 377 329 296 163 171 35 -217 -92 -400 -365 -657 -667 -379 123 -286 290 702 107 514 429 244 222
704B22r8K5k18k63K94l27J55K34m58R4L33j89k0n5Q7K75L5L5K43m1j24l9L7j98
$$ 222 124 149 -69 -332 -38 -365 -210 24 -434 -340 -7 -196 -216 -271 -184 91 126 161 404 363 239 200 237 39
728C9J22k14kj69j42M5J16r9O6L75m91K87J34J30Kl98L35K08k98O2Q8k20R0p9
$$ 39 161 -53 -55 -224 -366 -321 -205 -304 -238 137 -354 -67 67 197 199 -199 136 344 46 108 196 -24 66 -13
752a3R6q9J7Q8k22j7P3l8j18K16L00l24J97Q2j2Q2jn82J65K51q8k2j68j00J74
$$ -13 83 -6 11 99 -123 -140 -67 -105 -223 -7 293 -31 166 248 236 318 317 -265 -100 151 63 41 -127 -227 -53
777e3n0K89l7l00J08j67L72J20k76K50l40j12M49l96j44p1M10k02M96n11m9K51
$$ -53 -103 186 149 -151 -43 -210 162 282 6 256 -84 -196 253 -143 -287 -358 52 -150 346 -165 -214 37
799C7l8j2o2k65O16j65M5q4q3L91j39k15k78K78m6K12k79Q9p6J41j54L7q7N6l36
$$ 37 -1 -13 -75 -340 276 111 156 72 -11 380 241 26 -252 26 -20 192 -87 2 -74 67 -87 -50 -137 -81 -417
824d17P99l38K28k85M1K20k93J58O1j03k37L6J86j66k58L30J09j08r5L74l59K94
$$ -417 382 44 272 -13 28 248 -45 113 174 71 -166 -130 56 -110 -368 -38 71 -37 -132 242 -117 177
846A77k91L03k17k28k2M39k85J17%j79M3r6J63j03K84j41k53M54k75k9L73j45
$$ 177 -114 189 -28 -256 -278 161 -124 -7 -7 -186 -143 -239 -76 -179 105 -36 -289 165 -110 -139 234 89
868H9J59m75K94K34k53M3%n4Q8l02k4N35k39k36M17k95N7K43k12l7k98L34M6l40
$$ 89 248 -227 67 301 48 91 91 37 125 -177 -201 334 95 -141 276 -19 38 281 69 32 -266 68 114 -226
892b26J97k0J16k5N2k10J93L07m16J49J32l41L19r8l68J88k2J10K11m22M11j11
$$ -226 -29 -49 67 42 94 -116 77 384 -32 117 249 -92 227 129 -239 -51 -73 37 248 -174 237 126
914A26j78J46j66P5J36o6j65J05J87j71K96j31j38Q8k93J75K76l33j5n3K99l74
$$ 126 -52 94 -72 3 139 73 -92 13 200 29 325 194 56 144 -149 26 302 -31 -46 -99 200 -174
936a74J45K8j75Q7m1L37n14K99k5j45P6N04k34l55J64N43j36q10M37M6Jj10J41
$$ -174 -29 -1 -176 -89 -130 207 -307 -8 -33 -178 -102 402 168 -187 -23 520 384 -426 11 57 58 -52 89
959H9l06L64k12K15o0l6j31P7N7l58M61k07J02O1j41J34q1k56M9J96j33J4k59
$$ 89 -217 147 -65 150 90 54 -77 0 57 -301 160 -47 55 116 -25 109 28 -228 -179 17 -116 -102 -361
982c61L99j67J12j60Kj7J42J67k3J9n4J38j32j95L43j72K3JK32l27p4L1K77j47
$$ -361 38 -129 -17 -177 -175 -192 -50 117 94 113 59 197 65 -130 213 41 64 65 297 -30 -104 -73 204 57
1006E7J0m08K72J32O2j94k60M77j96J53j1M5J22k89J1L4j50K09k5m7k60L75j00
$$ 57 67 -341 -69 63 125 -69 -329 148 -48 105 94 139 261 -28 -17 17 -133 76 51 4 -256 119 19
1029A9RM6j19q7n1K40R7k97j01N66k71J86k79J70k53J95J25k77K23K62l13l2q6
$$ 19 28 74 -45 -132 -183 57 154 -143 -244 322 51 237 -42 128 -125 70 195 -82 141 403 90 58 -28
1052b8j42j19L89k56K19j42J16J19j70K69%k28J13k03Q3JR7k6k57M5J66N5Q9J2
$$ -28 -170 -289 100 -156 63 -79 37 156 -14 255 255 27 140 -63 20 21 118 92 -165 -120 46 101 190 202
1076B02r1M0p3j1N9j46j11NL36n20K94J92m04K73k85K62l7j4j78J08M9L4Q6Q1
$$ 202 111 151 78 67 126 -20 -131 -126 210 -310 -16 176 -228 45 -240 22 -15 -29 -207 -99 -50 -16 70 151
1100A51q9J89l20LQ8p5J28r7j49J33k47J39K19ol04J41J42n4j09N3k3K32k84L10
$$ 151 62 251 -69 -66 22 -53 75 -22 -171 -38 -285 -146 73 67 -237 -96 46 -8 -117 -64 -87 145 -139 171
1124A71r6l44N71m61J68nN0K0O3j16J00k90KP6J15N6Qj27j32J75j07J78l0j73
$$ 171 75 -269 302 -159 9 4 54 74 137 21 121 -169 -167 -91 24 80 88 -39 -171 4 -103 75 45 -128
1148a28J49N2m9k91K62J31j13K4M2J05P5l30O4j60K66j1J7l27J22J60K57m16J74
$$ -128 21 73 24 -267 -5 126 13 37 79 184 259 -71 -7 -167 99 88 105 -222 -100 60 317 -99 75
1171G5O2p1j4r1qJ66J85l84j9J48k33J36J72j91j33Q8K62l05K91j19p0K56j21
$$ 75 137 66 52 -39 -47 119 304 -80 -99 49 -184 -48 124 -67 -200 -112 150 -155 136 17 -53 203 82
1194H2k71R1L7J52n0Rj41L23o9k73J34k40K26M8J90j86j01J28q8j30J80j05K1
$$ 82 -189 -98 -61 91 41 50 -91 232 163 -110 24 -216 10 58 248 62 -39 89 1 -129 51 -54 -33
1217c3r1n3N07j09j56l6P5j81k04M67k58N49m63j07N0j89K06r0L02R5j57j86K26
$$ -33 -124 -177 330 221 65 29 104 -77 -281 186 -72 477 14 -93 -43 -232 -26 -116 186 281 124 -62 164
1240A64j84K19r4j08M5k18K18l8J46j98J45k1o4J91K8K6q2j74m4J58j53l5j17
$$ 164 -20 199 105 -3 42 -176 42 4 150 -48 97 76 12 203 231 257 175 1 -43 115 -38 -73 -190
1263a90J97K02p2nk00m34L43N44l18m65M62M09l59k04K32j32j1Q5L2k80p8O23
$$ -190 7 209 137 132 -68 -502 -159 385 67 -398 64 473 114 -90 142 10 -1 84 116 -164 -242 381
1285C81m49Q7j8m5n0L12j10j86J4P4J88k15M7l38M71nk8J56m30J46L51m47M6Q4
$$ 381 -68 19 1 -44 -94 218 108 -78 -64 10 198 -17 30 -308 163 158 130 286 -144 2 353 -94 -48 36
1309C6n2M6j31J60k47L89j56j03O8L8q3j63M0O1R4L69l27KJ7l07K77j56K7K29
$$ 36 -16 30 -101 59 -188 201 45 -58 10 48 -35 -198 -158 -97 -3 366 39 41 58 -249 28 -128 -101 128
1333A28n15K89K30l47K78k05K82p9p0J1P4j90N05k63N3k68k5N6J2Q4k96J82K9
$$ 128 -387 -98 132 -215 63 -142 140 61 -9 2 76 -114 391 128 181 -87 -112 -56 -44 40 -256 -74 -45
1356d5k47L05J54k70j05J53O5n9N6K02k83J01O6l65J33J30J06p6n8J64j29K5O3
$$ -45 -292 13 167 -103 -208 -55 10 -49 7 209 -74 27 93 -272 -139 -9 97 21 -37 127 -2 23 86
1379H6lJ87k69J31l46J46j39L52K33l49q9J95Ok18j07J94L6j57M9Mj34J93P2Q4
$$ 86 83 270 1 132 -214 -68 -207 145 378 29 -60 135 141 -77 -184 10 46 -111 -62 -58 -192 1 73 157
1403A57j16K22l66J52O5l3k27K65l67P1J46n3j44J04K27m6j47J69O2k12J11O9
$$ 157 41 263 -103 49 114 81 -146 119 -248 -177 -31 -84 -228 -124 103 57 -90 79 141 -71 40 109
1425A09j28J09J18l92J01J80p8J01j89K99n56L92j95J90j45j10RL50k30K12q1
$$ 109 -19 90 208 -184 -83 97 19 120 -69 230 -326 66 -129 61 -84 -194 -185 165 -65 147 66
1446F6j65L17k45J09j83J18o3K57j17l00J15K55R1m86L46J01j49n2K21o92K44
$$ 66 -99 218 -27 82 -101 17 -46 211 94 -206 -91 164 255 -231 115 216 67 15 236 -456 -212
1467b12K67j7M7J11j69j23J12N9k73K32N1j54j40r2M16j79M8J19j0j6l79N59j16
$$ -212 55 38 85 196 27 -96 16 75 -198 34 85 -69 -209 -301 115 -64 -16 103 93 77 -302 257 141
1490A41J66l98m3K08k01j13J73J75n6k06J63N5p6j96J02J81j59k7J20p9k02K74
$$ 141 307 -91 -134 74 -127 -240 -67 108 52 -154 9 64 -12 -208 -106 75 -84 -111 9 -70 -272 2
1512Bo1R4j04J86j97k34K19M2j78J51J70j25J18j32MK5K9M9n3l8K91j47j45J90
$$ 2 -59 35 -69 117 -80 -314 -95 -53 -231 -80 90 -35 83 -49 -45 -20 9 58 5 -33 258 111 -34 156
1536A56j08k54K23J06k16K36j39J67k79J37l35L63R6l12M58m06M07m52J98K17
$$ 156 48 -206 17 123 -93 143 4 171 -108 29 -306 57 153 -159 299 -107 300 -152 46 263
1556B63k63j50L48k30K01j57j56J57k7L9o8M7P8J81o0k12J60k51N0Q5k95L33L7
$$ 263 0 -150 198 -32 169 12 -144 13 -14 25 -43 4 82 263 203 -9 151 -100 -50 35 -260 73 110
1579A10j84M6j62J09r5J03l7J30J63j80M1j87mk2q8J11PnM4RJ98k12J12k74L24
$$ 110 -74 -28 -190 -81 -176 -73 -110 20 183 3 44 -143 -147 -169 -257 -146 -139 -144 -100 -91 107 -105 7 -267 57
1604E7k91N5o6K20K28j92M2j62Q6j28L4K31k98J64j25J2O8r1K82K53l74m0j38
$$ 57 -234 -179 -245 -25 203 11 53 -109 -23 -151 -117 114 -184 -20 -145 -133 -65 -156 126 379 5 -35 -173
1627a73p4R5K96m15M85l95l3L37N5j38j62K38j19p3J7Q2J48j37K11k41j17P2K15
$$ -173 -247 -152 144 -271 214 -181 -214 123 178 40 -122 116 -3 -76 -59 23 171 34 245 4 -113 -41 174
1650A74j86J3q6j6M6M5K85k80l19N64k51J73j52JJ75k01K03K0k01j1K0j20K01
$$ 174 -12 1 -85 -101 -55 -10 275 -5 -324 240 -11 162 10 11 186 -15 188 208 7 -4 16 -104 97
1673I7l18N73o01L46k32J84j33J8l4L8k3J73k67J30J86J31n24K30k50L66l11K87
$$ 97 -221 352 -249 97 -135 49 -84 -66 -100 -62 -85 88 -179 -49 137 268 -256 -26 -276 90 -221 66
1695F6n0K7J71j72l6J82L9j20k32J67j03j32J38J14j4K13l85k89N56l19J98M5
$$ 66 16 43 214 42 6 188 227 107 -125 42 -61 -193 -55 59 45 258 -127 -416 140 -179 19 64
1717F4J7r6J37j50k1k36J51m3K5m1J47P0j23J30l4J77j56l04L71j12o9L6n3L14
$$ 64 81 -15 122 -28 -49 -285 -134 -177 -152 -193 -46 24 -99 31 -3 174 18 -286 85 -27 -96 -60 -113 201
1741B01j70r7K2R2J38k46J91L9j2k64K02j8o3j49M12k14j53K60o2p8K67j52J6
$$ 201 31 -66 -44 48 186 -60 131 170 158 -106 96 78 15 -134 278 64 -89 171 109 31 298 146 162
1764A62k19J35j76J50j30J17J64J9N1k67n9J37J14l22K29j80L50k27k9q7o1k8
$$ 162 -57 78 -98 52 -78 39 203 222 273 6 -53 84 198 -124 105 -75 275 48 19 -68 -129 -157
1786a57L79L8l1j44k6R8m48M13o3q6K5p7j29K48J00j47Q1L92k14J16j14m53J67
$$ -157 222 260 229 85 59 157 -291 122 59 -27 -2 -79 -208 40 140 -7 74 466 252 368 254 -199 -32
1809c2l3oJ7J01r1K20L9k27J51j25Q7j39J46m04N49m18O8L02j95j26K89j4q6K22
$$ -32 -65 -71 -54 47 -44 176 215 -12 139 14 101 -38 108 -296 253 -165 -97 205 10 -116 173 159 73 295
1833B95l31pj34l4J49J18J69k64kJ44JK11m94L14k84O1L22p5j49l3k8k00R6K48
$$ 295 -36 -43 -177 -211 -62 56 225 -39 -41 103 104 315 -179 135 -149 -88 234 159 10 -23 -51 -251 -155 93
1857I3j31J3j05j38L54r8M8K2l46J03J53N5n0L9k37o6L51J44n78M77j38j4J60
$$ 93 -38 -25 -130 -268 86 -12 36 58 -288 -185 -32 23 -27 12 -225 -291 60 204 -374 103 -35 -49 111
1880A11j41j16J19Kn5L50m70K68k10J94Q9L7j46O3j83j60K46O0j36o1P6N4J41
$$ 111 -30 -146 -27 -25 -80 270 -200 68 -142 52 141 178 32 95 -88 -248 -2 58 -78 -139 -63 -9 132
1903A32r3Kj00j65K23q0J13J05m0l35L43k88L67m6j54J64o3j47K18jR8k36k6L7
$$ 132 39 41 -59 -224 -1 -81 32 137 97 -238 105 -183 184 138 -16 148 85 -62 156 155 253 17 -9 28
1927B8j46K54j25j27P9L2K54k72j15jJ62o1l5L44m11K37j79J57m05N48j60n6O
$$ 28 -118 136 11 -116 -37 -5 249 -23 -138 -139 23 -38 -73 271 -140 97 -82 75 -330 218 58 2 8
1950HK76l32K83m03J28J18j72j92M75k19j07L6J82Q3j91R4j98L91k41K38k99n3
$$ 8 284 -48 235 -168 -40 78 -94 -286 189 -30 -137 -101 81 164 -27 67 -131 260 19 257 -42 -95
1972i5p5K10j37j3K26q1k30L34k16K72l10M23m68k9K95j11J50q1R8l61R6J39L0
$$ -95 -170 40 -97 -110 116 35 -195 139 -77 195 -115 308 -160 -189 106 -5 145 64 162 -199 -103 36 66
1995F6N8l12K5L66N6j84K30m80L28k5k8K4n8J72K7j51j55K61j15Q2l97L31k54
$$ 66 124 -188 -163 203 259 75 305 -175 153 128 100 124 66 238 265 114 -41 220 105 187 -210 121 -133
2018a33L44P5m04J1J59rM9L9j15j57k10%M01K49k85K35o9m93M80k32K18j56q2
$$ -133 211 286 -118 -107 52 43 92 131 16 -141 -351 -351 50 299 14 249 180 -313 167 -65 153 -3 -85
2041h5k4K41M4J2r5Qj04O1k22L4p8K45o0J57J4k24l9O2J11k02K5K44j41Q5k01
$$ -85 -109 132 176 188 93 101 -3 58 -164 -130 -208 37 -23 134 148 -76 -115 -53 58 -144 -119 125 -16 69 -132
2066a32J46Lj34L41k41j55J36M25n57K82m4k7K46k28k76K42o3j25L56k84K04o5
$$ -132 14 17 -117 224 -17 -172 -36 389 -168 114 70 43 289 61 -215 27 -36 -161 195 -89 115 50
2088E0j23K07l10M47m67J6J85K8l4J6k31Q1K37m45M15j91K3J50m8l1L90k63L6
$$ 50 -73 134 -176 271 -196 -180 5 33 -1 15 -216 -135 102 -343 72 -119 -96 54 6 -25 365 102 138
2111A38Ok15R9J00p6R3l48L33j52M2Q7o3Q8k98J22K51k90K91p6nl7M2k50L97j16
$$ 138 144 -71 28 128 52 145 -203 130 -22 20 107 44 132 -166 -44 207 -83 208 132 127 90 132 -118 279 163
2136A63k76L17j43j8j47K74p1j3R6k30J53o0J5j18J68j8j51J34k90J53NK35r5
$$ 163 -113 204 61 43 -104 170 99 86 182 -48 105 45 60 -58 110 92 -59 75 -215 -62 -57 178 83
2159H3j02k63J37M7J77N5l2J08j32k39K03K2K99m07m5Q8k4p9M44n36m2K59k25
$$ 83 -19 -282 -145 -98 79 134 102 210 78 -161 42 64 363 -44 -89 -1 -25 -104 340 -196 -238 21 -204
2182b04R5J86l14L00o5J23L7j80M25k36m7J9j15j37J54Nk08J76J14k51L1jl5L12
$$ -204 -109 77 -237 63 -2 121 158 -22 403 167 120 139 24 -113 41 46 -162 14 128 -123 -92 -93 -128 184
2206A84K15k36L1m04K48j3n1n1K28l70J2L53j12k70J24R7k30J48l6L36k97r2M57
$$ 184 399 163 194 -210 38 25 -26 -77 151 -219 -207 146 34 -236 -112 -15 -245 -97 -133 203 -94 -186 271
2229B71k01n3Q0q7QN5j9Qj00J53k51PL45j64k06j3K44j81j86L61j61l8r2K53j13
$$ 271 70 17 97 10 18 73 54 62 -38 115 -136 -129 216 52 -154 -167 77 -104 -290 71 -90 -128 -220 33 -80
2254h0J41k2k87K17N8J48j86j27k8K55j3j77J42J42k84J9l4N4Q8Q1l56L46m1j0
$$ -80 61 39 -248 -31 27 175 -11 -138 -166 89 76 -101 41 183 -101 -82 -116 -62 26 107 -249 97 56 46
2278D6K08k94J9k50J35j18K50p0J11k24L90j29N6n2j41Q4j82Q7j53M12j8j80q0
$$ 46 254 -40 -21 -271 -136 -254 -4 -74 37 -187 203 74 130 78 -63 21 -161 -74 -227 185 167 -13 -93
2301i3L15m65K01k12J70K39l7j08mj20J60j06J53j43j4M1J64k61K1J69l37L65
$$ -93 222 -243 -42 -254 -84 155 118 10 6 -114 46 -60 93 -50 -64 -23 141 -120 -99 70 -267 98
2323I8k15O4P9l0j22K37k01Q4M5M7L30l41j16J90l6k28L44p0j53J0q8K59l65P4
$$ 98 -117 -53 26 -4 -126 111 -90 -6 39 86 416 75 -41 149 113 -115 229 159 6 16 -72 187 -178 -104
2347a04O9m2j59L21j01K4R0l30K83rj73L76l74J29L6k3o1o5J42J3j71L82q0K81
$$ -104 -35 -77 -236 85 -16 8 98 -232 51 42 -131 245 -129 0 36 13 -48 -113 29 42 -129 253 173 454
2371D54m60m1Q5J70j15m8j45J39k32J00K00j01j20NJ08J7J5o3k1k48K99O0k04
$$ 454 -6 -47 38 208 93 45 -100 39 -193 -93 107 6 -114 -109 -1 16 31 -32 -53 -301 -2 58 -146
2394a46j33q3L61j4m0o9n0K10k18j07J78j79M84l99M96k94K08N7l6j62j74J93
$$ -146 -279 -362 -1 -15 -55 -124 -174 36 -182 -289 -111 -290 194 -205 291 -3 205 262 226 64 -110 83
2416H3l42J3L8L37l69L56J05k81O1JK6m02M74k63j34M21k39K75k41k29M31k04
$$ 83 -259 -246 -208 129 -240 116 221 -60 1 2 28 -374 100 -163 -297 124 -115 160 -81 -310 121 -83
2438h3J87l04K24j72R9K50k28k17J76K49k54k98M79O6L0j64l09K83j40N63l86
$$ -83 104 -200 24 -148 -49 201 -27 -244 -68 181 -73 -371 108 174 204 40 -269 14 -126 437 51
2459E1L9J9p6P4L3j73R1L4o7jj18J5K87M7n37L38j69M6O0j34L05k37J38q7R6j11
$$ 51 90 109 33 107 140 -33 58 92 25 24 -94 -79 208 255 -282 56 -113 -67 -7 -141 164 -73 65 -22 74 -37
2485c7j77p3J89J33Q1j28j73K34j28l29M42O8M9k99K63k5O5j95J90L8j1j20k41
$$ -37 -214 -287 -98 35 116 -12 -185 49 -79 -408 34 102 151 -148 115 90 155 -40 150 188 177 57 -184
2508a84J55L9J98l64K94l75K71l3l33K72J70K32l49j1o4J98m35J35J33j10J98
$$ -184 -29 10 208 -156 138 -237 34 1 -332 -60 110 342 -7 -18 -82 116 -319 -184 -51 -161 37
2529C7j45J02j65K62k89J48ok44L66Q3j38l86K89J65r0k48K59k00M99k31l2r8
$$ 37 -108 -6 -171 91 -198 -50 -56 -300 66 149 11 -375 -86 79 -11 -259 0 -200 299 68 36 -62
2551f2JK35n56K73J56k37J61j65K75j0j41J5J04j81J45N9j86J45j0j10P1M8M3
$$ -62 -61 174 -382 -109 47 -190 -29 -194 81 71 -70 -55 49 -132 13 72 -114 31 21 -89 -18 30 73
2574G3J16k96J00k4O0o5j99J1J26K86o1r7m8j03P5J14j03O2K71k30LJ19j60j59
$$ 73 189 -107 -7 -31 29 -36 -235 -224 -98 188 127 30 -18 -121 -46 68 -35 27 298 68 71 190 30 -129
2598a29J67j5r2K59j48n9k17M3K17K6J6j05J5j2J63o4O9m1j90K92n22K12J9r8
$$ -129 38 23 -69 190 42 -17 -234 -191 26 52 68 -37 -22 -34 129 65 134 93 -97 195 -327 -115 -96 -194
2622a94K90k94K28j09M9J01j43Q4j68K27j18R6L5k19N1J82l62M90j77m5n4m9P0
$$ -194 96 -198 30 -79 -30 71 -72 12 -156 71 -47 49 84 -135 -84 98 -264 226 49 4 -50 -99 -29
2645b9l35L07n9K44j78M7K29k41J68j71o9k5o1K96k14j65L16j16j07L6J7J33k27
$$ -29 -364 -57 -116 128 -50 -3 226 -15 153 -18 -87 -112 -173 123 -91 -256 60 -56 -163 -127 -110 23 -204
2668b04K78pj24K2j09j30N59m11K95j32O6q2k1qJ57k70K59m7j1j67n6J47Jp4m0
$$ -204 74 67 -57 -35 -144 -274 285 -126 169 37 103 21 0 -8 149 -121 138 91 80 -87 -143 4 5 -69 -109
2693a09N25n46L54k03J54J49l09J3j46K10J75k14J98k12K55k24J32k84J57j45
$$ -109 416 -130 224 21 175 324 15 28 -118 92 267 53 251 39 294 70 202 -82 75 -70
2713g0NJ23l91L81k5J8K35l91K1qq1K93r8K65l26p5J77k9K9N4j53l5J21j69M4
$$ -70 -65 58 -333 48 23 41 276 -115 -94 -102 -183 110 12 277 -49 -124 53 24 53 107 -46 -81 40 -129 -85
2738h5j25k8%L67j92K61j56k85L92n1k5m90L71p0J62L2j3k53J63J04p3nL0q1J56
$$ -85 -210 -238 -238 129 -63 198 42 -243 149 98 73 -417 -46 -116 46 78 65 -188 -25 79 6 1 31 -50 106
2763A06J9k63R8J43M9j34j98r5R2L11L61o17K94m99N32K11m94J17p5k0K03l9Q6
$$ 106 125 -138 -40 103 152 18 -180 -275 -183 128 489 -128 166 -333 199 410 -84 33 -42 -62 141 102 188
2786A88r4k26J39r6J55O7p4o3m4J57N0J35k99j23J20K06N4k68k73L26k04l8J85
$$ 188 94 -132 7 -89 66 133 59 -4 -48 109 159 294 -5 -128 -8 198 252 -16 -289 37 -167 -205 -20
2809b0K10j45j50J22n9k92L06r5J00J48k84J98N2j73L64k57j08O1j38L16p2q8
$$ -20 190 45 -105 17 -42 -334 -28 -123 -23 125 -159 39 91 -82 282 25 -83 -22 -160 156 84 -4
2831dJ78k12q1J32J70n2q7R1k43j07J99r5L05l24m2L13n9J36P6k61l4K09M7j86
$$ -4 174 -38 -119 13 183 131 44 135 -108 -215 -16 -111 194 -130 -172 141 82 218 294 33 -1 208 255 69
2855F9j97K87O6m14M63l68l3K68Q8l53K30J04l21J32l19K19J71J4j39m2K38j58
$$ 69 -128 159 225 -189 274 -94 -127 141 229 -124 106 210 -111 21 -298 -79 92 106 -33 -75 163 5
2877Ek08L12L3r2l04M46l39J42J44j99j30k70L63K00J20k09K62m86J39K50l14
$$ 5 -203 109 142 50 -254 192 -147 -5 139 -60 -190 -460 -97 103 223 14 276 -210 -71 179 -135
2898a35K28k54J38J52L3k26j54O3J62k04P1Q6l6q2L14n8j81l8K45L2n9Q8k57J36
$$ -135 93 -161 -23 129 162 -64 -218 -155 7 -197 -126 -40 -76 -158 156 98 -83 -121 124 156 97 185 -72 64
2922F4k35N2J37k23N6K63Q6j38K32l00K34j83j29J71j5J39k13q3r0N6n5J70R3
$$ 64 -171 -119 18 -205 -149 114 200 62 294 -6 228 45 -84 87 72 211 -2 -85 -175 -119 -174 -4 89
2945H9j61J59j03j17L32r2j0k37P2o5K98k33J42O4R0k10o5J99j91L35l70j44L23
$$ 89 -72 87 -16 -133 199 107 97 -140 -68 -133 165 -68 74 138 228 18 -47 152 -39 296 -74 -218 105
2968A05n9L1p6j20K92J4k08J14k35J17J69j13j48K0j38J94K4J33k2j49l5J65k9
$$ 105 46 77 1 -119 173 187 -21 93 -142 -25 144 31 -117 -97 -235 -41 -17 116 94 -55 -90 75 46
2991D6j67J40q4K44k92N4j16J73J32m04L59j82j2J53j6j03O8j0o3M81k16k7j1
$$ 46 -121 19 -65 179 -113 -59 -175 -2 130 -274 85 -97 -109 44 28 -75 -7 -17 -80 401 185 158 147
3014A47k46K02k8j97K85k39L34l4n18M43j99J87k62l07K30K22k14K40j04N9j90
$$ 147 -99 103 75 -122 163 -76 258 224 -294 149 -50 137 -125 -432 -202 20 -194 46 -58 1 -189
3035a89P6j46L21Q8nk30M3K01j60k4Q6j10J91L3m30K44J77pk22K41k3m04K02K9
$$ -189 -113 -259 62 150 145 -85 -42 159 -1 -25 61 -49 142 175 -255 -11 166 159 -63 178 155 -249 -47 -18
3059a8K2J71r7k51K5J05L9J55k27J83k09nJ70L5q1L2j12J51rj27L62l64Q5j30
$$ -18 4 175 78 -173 -148 -43 -4 151 -76 107 -102 -107 63 98 17 49 -63 88 79 -48 314 -50 35 -95
3083i5J94k63M13m1m12N4K84p9K7k58J63k0q1J15J43j67r1J94l01J86R0j94L25
$$ -95 99 -164 249 208 -204 -150 134 55 82 -176 -13 -33 -114 1 144 -23 -114 80 -221 -35 55 -139 186
3106A86k92j18K03K89Q5m19P2k10o7O0K06Nj2nJ33j93J2R7l3J39j3j30N5k1k93
$$ 186 -106 -224 -21 268 353 -66 6 -204 -271 -211 -5 0 -12 -17 116 -77 -65 32 -1 138 125 -5 50 29 -264
3131b64L22O3k79R3J87k57L09k46PQ6j40K52k31M3k64K04J50k43R0pK24K1l03
$$ -264 58 121 -158 -65 122 -135 174 -72 -65 21 -119 133 -98 -55 -319 -115 35 -208 -118 -125 99 120 -183
3154a83K37Pk33J77R6k17J56j2N6j28j28kL41k51K0N0j44kqN8n7R9j7Q1k09M6
$$ -183 54 61 -172 5 101 -116 40 28 84 -44 -172 -174 167 -84 -64 -14 -158 -160 -168 -110 -167 -68 -85 -4 -213 -167
3180a67R2l1J37M3r0k1j11m3N1J45P7L7j35J15p3l12R4J72N4j26J44j03K21m95
$$ -167 -75 -106 31 74 -16 -37 -148 -191 -140 5 82 119 -16 99 26 -286 -192 -20 34 -92 52 -51 170 -325
3204c25L54l00J98K66k08q5P7K65n32K87M8q3k03K85p5J6J14o1P0j08q5J46M3
$$ -325 29 -271 -73 193 -15 -100 -23 242 -290 -3 45 -38 -241 44 -31 -15 99 38 108 0 -85 61 104
3227A04j3j3m3K34m04L72j55J04j93L31o07jK69n3N6k6J57l74K85J2l3R4j67K6
$$ 104 91 78 35 269 -135 237 82 186 -7 324 -283 -284 -15 -68 -12 -38 119 -255 30 42 9 103 -64 -38
3251c8J71m18K38k00J40J27p6P9J11j85L04k18m59L83j12L96k4j89j92J57J06
$$ -38 133 -285 -47 -247 -107 20 -56 23 134 -51 253 35 -424 -41 -153 243 219 30 -162 -5 101
3272A01p8R7j46k14L51Q2L3k24l6J77j70J61j38J85q7m48K57L52l09J50j02J15
$$ 101 23 120 -26 -240 111 193 226 2 -34 143 -27 134 -4 181 94 -354 -97 255 -54 96 -6 109
3294A09q6J32j28j65L08k34j96L51m03L18j31q6L75p2l05K16j14m9J66j91K19
$$ 109 23 155 27 -138 170 -64 -260 91 -312 6 -125 -211 164 92 -213 3 -111 -160 6 -185 34
3315C4p3k79L61j8K1N1j14K57n71J24K40O1j26J09j21oP6J43j05Jk38O3M8J70
$$ 34 -39 -318 43 25 46 97 -17 240 -331 -207 33 94 -32 77 -44 -50 26 169 64 65 -173 -110 -62 108
3339A08k96M25j91j41RQ2o4M6K0L7jK2q0J36l96J06kL18J13k75R1J4N3L5l84L30
$$ 108 -188 237 46 -95 -86 -4 -68 -22 -2 35 34 56 -24 112 -284 -178 -180 138 251 -24 67 81 134 169 -215 115
3365A15j36j92M26j82J15j40j19J94j96j49M27j89L0J31j44J5N7J1mLj17j43K07
$$ 115 -21 -213 213 31 146 6 -113 81 -115 -264 163 -26 4 135 -9 6 63 74 70 73 -44 -187 20
3388B0q6J3m7Q6L1L8K1K05k97QJ07J21k71k1J38k17K39j47l6J57m8k75K79j31
$$ 20 -66 -53 -100 -14 17 55 76 281 -16 -8 99 220 -51 -72 66 -151 88 -59 -95 62 14 -261 18 -113
3412a13K02L11k62k00K23k09R3k79P4K11o9j82L58K7j29k36J67q0J92l3j21R0
$$ -113 89 400 138 -62 161 -48 45 -234 -160 51 -18 -200 158 185 56 -180 -13 -93 99 66 -55 35
3434C5J35l41J40k6l3N8J13j63J40k46Q0P7J70k77j9p9K60O4J0j45j07K61k08
$$ 35 170 -171 -31 -57 -90 -32 81 -82 58 -188 -108 -31 139 -138 -157 -236 24 88 98 -47 -154 107 -101
3457a01R3%j19J39R6l71M16j81jJ92k14k4K32n5m11K14O5J95j74P8J05j98J93
$$ -101 -8 -8 -127 12 108 -263 153 -28 -29 163 -51 -75 157 102 -309 -95 -30 165 -9 69 174 -24 169
3480A69j99L51j93j32j35J93l21L99M5m44J11K80m17K27P2jo3j27L08J14p1m21
$$ 169 -30 321 128 -4 -139 54 -267 132 177 -267 -156 124 -293 -66 6 5 -58 -185 123 237 166 -255
3502b55L27J24l04J49P4k06J42j63J09j67J62k6R3mK5k31K36j68K73l42L30j68
$$ -255 72 196 -108 41 115 -91 51 -112 -3 -170 -8 -34 59 55 80 -151 85 -83 190 -152 178 10
3524A0k5J55m08K32j98M54k28QJ0O2j35J78j79n7J6j78K08K80k4k93J62P6N5k34
$$ 10 -15 140 -268 -36 -234 220 -8 0 10 72 -63 115 -64 -121 -105 -283 -75 205 181 -112 50 126 181 -53
3548e3K33l88M08j46j18K76l47k93N20L9l68l1K34j73J32j00N2J84k38K34j58
$$ -53 180 -208 200 54 -64 212 -135 -428 92 131 -237 -268 -34 -207 -75 -175 -123 61 -177 57 -101
3569a01J73O4k02j02J45j11Q2J05M1r7j15L82k57J5J42k45j2N4J60r1k08j95N13
$$ -101 72 136 -66 -168 -23 -134 -52 53 94 -3 -118 264 7 22 164 -81 -93 -39 121 30 -178 -373 140
3592A40k84P9q0K80j67J34j89Q9j79K41Q3j1l46K15j15pL50l08M3j40O8q4K48
$$ 140 -144 -65 -145 135 -32 102 -87 2 -177 64 147 136 -210 5 -110 -117 233 -75 -32 -172 -104 -188 60
3615F0K8l18K42q1L7l5K37J2k48O3O3l4O3O7n4j21n3J93n49K93m0P9J88j45J35
$$ 60 88 -230 12 -69 -32 -67 170 182 -66 -3 60 26 89 156 102 -19 -72 121 -428 -135 -175 -96 92 -53 82
3640H2j47j3j81M50M2k86J41Q1l45L3K57O4j32k3Or4K68k99M4K2L27j44l97L41
$$ 82 -65 -78 -259 191 233 -53 88 169 -176 -143 114 178 46 23 29 -65 203 -96 -52 -30 297 153 -244 97
3664I7k96L7K68l77L17Kk76M24q9L1l74K38j17K38K7k78k1J75L6l08j6QL58Q8
$$ 97 -199 -162 106 -271 46 48 -228 196 107 138 -236 2 -115 123 150 -128 -149 26 62 -246 -262 -254 104 192
3688A92k18J78n68N76j32m9l54K99J17l8J74j55j89K16j65j76jJ95J71J1n5o4
$$ 192 -26 152 -416 160 28 -21 -375 -76 41 3 177 22 -167 49 -116 -292 -293 -98 73 84 29 -35
3710c5j69K37j82kj6K09N0j14p4J8M2J33r1k98L15J89k88q0J21J20Mj25Q6j38
$$ -35 -204 33 -149 -151 -167 42 92 -22 -96 -78 -36 97 6 -292 23 212 -76 -156 -35 85 89 -36 50 -88
3734h8K4P5k02K92k77Q4J21J18k3q4M8j61L07j85pn1M3j69J97N2L40k81j48l8
$$ -88 -64 11 -191 101 -176 -92 29 147 124 40 88 -73 234 49 42 -9 34 -135 62 114 454 173 25 -13
3758a3O4k07J7L0K78j24l09L00J44m22K20J48j1l0mM0lL9K5j27l55P4L49k33j36
$$ -13 51 -156 -139 -109 169 45 -264 36 180 -242 -22 126 115 85 81 121 118 157 182 55 -300 -226 123 -110 -246
3783b46K87k86M06j83Q4k55R1K60k47R7j96L4J98K06j82K8r0k05M34j30O9r5P
$$ -246 41 -245 161 -22 62 -193 -102 158 -89 8 -188 -154 44 250 68 96 6 -199 235 105 174 79 86
3806H6Q9k34K17k39J60j04M2L03k7k21j19j06j33M11j42L32l02j77J57o2j1K16
$$ 86 175 -59 158 -81 79 -25 17 320 293 72 -47 -153 -286 125 -17 315 13 -164 -7 -69 -80 136
3828A36n40M58rKK50l76j00K5L02o3k09K13j64j71J62L4l5J9K34l23j75K38k73
$$ 136 -404 54 45 47 297 -79 -179 -154 148 85 -124 89 -75 -246 -84 -50 -85 -66 168 -155 -330 -92 -365
3851c65L23k15L55j54J1q3J97J08l00R0k3K4q9j06M0PmJ19J14o9k1Q5J06l48J91
$$ -365 -42 -257 98 -56 -45 -128 69 177 -123 -33 -56 -32 -121 -227 -187 -180 -184 -65 49 -20 -41 44 150 -198 -7
3876gk3J84o6p6K30k13j16M05l48L0k24K75j35J55m5j30j5J90P1r6o8o2J54j07
$$ -7 -30 154 88 12 242 29 -87 318 -30 0 -224 51 -84 71 26 -104 -119 71 142 46 -22 -84 70 -37
3900c7R9l27O24l24m0J59j06k5Q9l12K5L75l78K00j11J99k38J35K3l7P7j82J23
$$ -37 62 -265 359 35 -5 154 48 23 112 -200 -175 200 -178 22 -89 110 -128 7 30 -7 70 -112 11
3923A1k37K58l6J53N8o9j16J21q6J04j67J71P7l05r4J78J42r9j47M6K3M0M7J79
$$ 11 -226 32 -4 149 207 138 22 143 57 161 -6 165 242 -63 -157 21 163 64 -83 -37 -14 26 73 252
3947B52m22L37m66J97J61k21J24L89j98j35J61k82J05J53k83K96k24m2J15j9J96
$$ 252 -170 167 -299 -102 59 -162 -38 351 153 18 179 -103 2 155 -128 168 -56 -98 17 -2 194
3968A94n32K16Q6J1P8K24n41K67r9J68j38q4J67J34l41K52k64J38K65j85J24l67
$$ 194 -338 -122 -36 -25 53 277 -264 3 -96 72 -66 -150 17 151 -190 62 -202 -64 201 16 140 -227
3990b27K17p8J20ol7J95l56K94j43n7J30j93K95Q8k93J64q9oK27k62n2K0l04M48
$$ -227 -10 -88 32 26 -11 184 -172 122 -21 -78 52 -141 154 242 -51 113 24 18 245 -17 -69 -49 -353 95
4014I5N6k8k02K31p6k92K4L80n0j03k47K48j94j15L42p3K6K1n1J75j84k23J49
$$ 95 151 123 -79 152 76 -216 -192 188 138 35 -212 36 -158 -273 69 -4 22 43 -8 167 -17 -240 -91
4037i1P8J42k00L2J11l1j49j42L50k3o4K77m38k6j3K92Pj88M7K30q5P3q6R8p46
$$ -91 -13 129 -71 -39 72 41 -108 -250 100 77 13 290 -148 -174 -187 105 112 -76 -29 201 116 189 103 201 -545
4062e45N64m0M6j37J05r9L7j12J66r4J28M10o46K6J90l7l2k72M00q3n7Qk14M18
$$ -545 19 -21 25 -112 -7 -106 -69 -181 -15 -109 19 429 -217 -191 -1 -38 -70 -342 58 -25 -82 -74 -288 130
4086A30k32L34k89O5J96j81q9K81k35K41m1k13n0J45j94J26J15k44L52j55m4j24
$$ 130 -102 232 -57 8 204 23 -66 215 -20 221 180 -33 -83 62 -132 -6 109 -135 217 62 18 -106
4108a06N4j36o4K12j08K24J61k38J3k35K62k57K50j0O7j34N3k5k65K43qj41K66
$$ -106 -52 -188 -252 -40 -148 76 237 -1 12 -223 39 -218 32 22 89 -45 8 -17 -282 -39 -47 -188 78
4131G8J10j01j40K4M0k75M35n89L78K52j51L9j77j65K66K31l02J08P7k63J55J40
$$ 78 188 87 -53 -29 11 -264 171 -418 -40 212 61 100 -77 -242 24 255 -47 61 138 -125 30 170
4153A70j34p9k4q8L37k72K01kj19o6J93r4k0N2J6k15J38J08o2J6K13m4l29K03
$$ 170 36 -43 -67 -155 182 -90 111 109 -10 -76 117 23 3 55 71 -144 -6 102 40 56 269 225 -104 99
4177I9q8n0J81k5n52L11K7K83j17k67L12j92n5n6J50p4K28j87r9K92J59l84J05
$$ 99 11 -39 142 117 -435 -124 -97 186 69 -198 114 -78 -133 -189 -39 -113 115 -72 -171 121 280 -104 1
4200AN4L1o2j10j01P1j09K6J25o8K68j39K4j94K38J06r8j08k2k25K21L90k10l4
$$ 1 55 86 24 -86 -187 -116 -225 -199 -74 -142 126 -13 11 -183 55 161 63 -45 -67 -292 -71 319 109 75
4224G5N5j58k66M27j04j7R2j19k3j39L0N3j67J71J84j56M2J44j68J90j75K18n21
$$ 75 130 -28 -294 133 29 12 104 -15 -38 -177 -147 -94 -261 -90 94 -62 -20 124 -44 146 -29 189 -332
4247c32K86k3N7j46o0J91J37j34N7KJ42j15qk71K52O3l1q6N4j08j00K76L4k48
$$ -332 -46 -69 -12 -158 -218 -27 110 -24 33 35 177 62 54 -217 35 98 67 -19 35 -73 -173 103 137 -111
4271a11K64m5j08n1OQ8k05K14k63J24O6j56O3K02p9J60L2k38k3j34j8M7NJ09m9
$$ -111 153 108 0 -51 -45 43 -162 52 -211 -87 -21 -177 -114 88 9 169 201 -37 -60 -194 -212 -165 -160 -51 -100
4296a00J82Pj16L9j60J25K67k02r9k9K90p1M2n8p5J26k28O0K04p2j18QmJ20j98
$$ -100 82 89 -27 12 -148 -23 244 42 -57 -86 204 133 175 117 42 168 -60 0 204 132 14 22 18 138 -60
4321f0k00L28k33J43o1M9o3J44O7n1M9J17j88j09J93j99k6J67j29K07j32N9K0
$$ -60 -260 68 -165 -22 -83 -34 -97 47 114 63 112 229 41 -68 125 -74 -100 67 -62 145 13 72 92
4344I2k03P8P8k20L64p3j13Q1J01m07J82r3M7nL80l84j27K15l0k9O8j67L35j13
$$ 92 -111 -33 45 -175 189 116 3 84 185 -222 -40 -133 -86 -91 289 -95 -222 -7 -37 -66 2 -165 170 57
4368E7p3k02J02L40m39J89J15k69J68j25J51K21j41l00L32l02j08K73N9l3l1R3
$$ 57 -16 -218 -116 224 -215 -26 89 -180 -12 -137 14 235 94 -206 126 -176 -284 -11 48 15 -16 77
4390G7j58Q9M7j07k5l6j04J24p4J12L74l33L40m46j17N07j68q4p3p7RK19l48K46
$$ 77 -81 8 55 -52 -77 -113 -217 -93 -167 -55 319 -14 326 -120 -237 270 102 18 -55 -132 -123 96 -252 -6
4414fj1k27L90k56M1j01J43j34K73j68K22j42j8q1J64m5j1j25K06l0j13J64j86
$$ -6 -17 -244 146 -110 -69 -170 -27 -161 112 -56 166 24 6 -75 89 44 33 -92 114 84 -29 135 -51
4437e1J11o2k0j66K48j34Q4Q1k14K29k68R9J09k32K75lJk05J17j18K2J34k00J20
$$ -51 60 -2 -22 -188 60 -74 10 91 -123 106 -162 -63 46 -186 89 86 87 -118 -1 -119 -97 37 -163 -43
4461d3J35o7k6j25L62o2q9r8J3N9MK25k95o4N0n0J41k09J75j54J76j85p9L25j01
$$ -43 92 25 -1 -126 236 174 85 -13 0 59 63 288 -7 -71 -21 -71 70 -139 36 -118 58 -127 -206 119 18
4486A8M2k50J25m2R4j62L30P7j46j32J76K13m22L3Oo1o5J33j34L69j90p3Q5K63
$$ 18 60 -190 -65 -107 -13 -175 155 232 86 -46 130 343 -79 -46 -40 -101 -166 -33 -167 202 12 -61 24 287
4510B87l14J07j39qJ1n5J91J51k60k28K92j63J80J46k72K94p8j36K22j88J17m5
$$ 287 -27 80 -59 -67 -56 -111 80 231 -29 -257 35 -128 52 198 -74 220 142 6 228 40 157 112
4532A12p2q0n8K59l19o0L58k96L95m89J69j1N6K9k13q5L88k55JJ48k52K46j84
$$ 112 40 -40 -98 161 -158 -218 140 -156 239 -250 -81 -92 -36 -7 -220 -305 83 -172 -171 -23 -275 -29 -213
4555b13L19j86J14j93j8L3K64m64K80K3n7K60q6J97m9R3l81L27m04Q3k31J98K10
$$ -213 106 -80 34 -159 -177 -144 120 -344 -64 -41 -98 162 76 273 224 317 -64 263 -141 -58 -289 -91 119
4578A19k50P5L1J33l16R9R7q7K86j00k72J63l29K63L13q1k58J52j28j30M1L75
$$ 119 -131 -56 -25 108 -208 -109 -12 -99 187 87 -185 -22 -351 -88 225 144 -114 38 -90 -220 -179 196
4600A96l57J20J17P2j99r2M7J35M8j20k0k6K71j85K6j02P1j64K88j17J74r2k79
$$ 196 -161 -41 76 148 -51 -143 -96 39 87 -33 -53 -79 192 7 33 -69 2 -162 126 9 183 91 -188
4623a88K79l44K25j46K3J85Rk74L13k12O9j00J35K00l38L38j79N6J55l20j9M4
$$ -188 91 -253 -28 -174 -151 34 43 -231 82 -130 -61 -161 -26 174 -164 174 -5 51 206 -114 -133 -89
4645h9J01l0j45K67q0N1j30n4K77k18Lp5L53k08L1J30l91J62k19L77M9k12k27
$$ -89 12 -18 -163 104 24 75 -55 -109 168 -50 -47 -122 231 23 54 184 -207 -45 -264 113 162 -50 -277
4668b77J51K47N3l2j65J98k90J18R1l78J8L24O2j64L37m13Q8L7j63K38Q1l04o6
$$ -277 -126 121 174 142 -23 175 -115 3 94 -284 -266 58 120 -44 293 -120 -32 5 -158 80 161 -143 -209
4691b09J62O0K94j86J51n93L13J8P3K09m65J04oO7J04nl68J55K83k53j17L4J60
$$ -209 -47 13 307 121 272 -321 -8 10 83 292 -173 -69 -75 -8 96 91 -277 -122 161 -92 -209 -175 -15
4714a5J46l25J35K18n50L89K75n8j32j68M60o37M19n27K96J43j69r5R5j01K29
$$ -15 131 -194 -59 159 -391 -2 273 215 83 -85 375 -262 157 -370 -74 69 -100 -195 -100 -201 28
4735B8k39J87k4J11k14J13j7%p2q3M39m42J35K22j75j74L47l02M43m59M8J59j8
$$ 28 -211 -24 -48 63 -151 -38 -55 -55 -127 -210 229 -213 -78 144 -31 -205 142 -160 283 -176 -128 31 13
4758A3K07j78J88j43r4m0N5Q6j1j36L12j11j80p1m9J95k8j38M2K08j24k27M31
$$ 13 220 42 230 87 -7 -47 8 94 83 -53 259 148 -32 -103 -152 43 15 -123 -81 127 3 -224 207
4781B07k06j10J58k79J80Q8k20J66p0n5j72M93j44j04J2K45N9l10JL8J32k85M62
$$ 207 1 -109 49 -230 -50 38 -182 -16 -86 -141 -313 180 36 -68 -56 189 248 -62 -61 -23 109 -176 286
4804B86m6k90N4mL4l6M74l26J45j92k64R4J46n4Q1M4J82k45j96K35j16r4n9R4
$$ 286 240 -50 4 0 34 -2 472 146 291 99 -165 -71 75 21 102 146 328 83 -113 122 6 -88 -147 -53
4828e3n6O0R4Qj20n8L38k34r9K16o5J05k65J72l1k1QR0j23j40K09L1L0M9rk94
$$ -53 -109 -49 45 53 -67 -125 213 -21 -120 96 31 136 -129 43 12 -9 -1 89 -34 -174 35 66 96 145 136 -158
4854a58Q0J79j31O9o7P9L79m85o8N1J21k9j84Q8K42k48r7L0K23o5j94K90N5k01
$$ -158 -78 101 -30 39 -28 51 430 -55 -123 -72 49 20 -164 -76 166 -82 -179 -149 74 9 -185 105 160 -41
4878d1J39M1M5j37n3n2K2J5r9J17L1j22j9P5p7K33k66K47j20J94r4k87J90j52
$$ -41 98 139 184 47 -6 -58 -36 -21 -120 -3 28 -94 -113 -38 -115 118 -148 99 -21 173 79 -208 -18 -170
4902a70J48R4J08o11M63j8Lj88J10J30M9r1q0r1J53j55K5K23j60m1J51j25M97
$$ -170 -22 72 180 -431 32 14 17 -171 -61 69 118 27 -53 -144 9 -146 -121 102 -58 -99 52 -73 424
4925D24m88K16l56L66j86R9K01n88N21m05J80j96J76J80n1o6j76K64o5q8K9K21
$$ 424 -64 152 -204 162 -24 75 276 -312 209 -196 -16 -212 -36 144 93 27 -149 115 50 -38 -9 212
4947B12j03K40m80O7J56j03r5K43j66j35K46m6q9nM3J4K12l57J90R1J13l80K01
$$ 212 109 349 -131 -64 92 -11 -106 137 -29 -164 82 36 -53 -58 -15 -1 211 -146 44 135 248 -132 69
4970F9k2k1j64O2L06j83J28j72j43L1J48K91r4k25lJ28k06J48j11K4K86j57m18
$$ 69 47 26 -138 -76 230 47 175 3 -140 -109 39 330 236 11 8 136 -70 78 -33 -9 277 120 -298
4993b98K32J24P2k70k70K35kL57j90J9Lk27K59j44O6J27m5MR3j51RJ22q0m3j80
$$ -298 -66 58 130 -140 -410 -175 -177 180 -10 9 12 -215 44 -100 -34 93 48 52 145 -6 3 125 45 2 -178
5018a78M26j58n6j35J85j69k19R6R1k1J27j85J37o0J90j75L55l39j26M98n13O1
$$ -178 248 90 34 -101 84 -85 -304 -208 -117 -138 -11 -196 -59 -119 71 -104 251 -88 -214 284 -229 -168
5040a68RK63p4o9L54j87m5m3o9jj0J05j54P2l5n6O2k75L26J9R4p6m2q4O3L25k15
$$ -168 -159 104 30 -39 315 128 83 40 -29 -30 -40 65 -89 -17 -52 -108 -46 -321 5 24 118 42 0 -84 -21 304 89
5067H9N5r6J91j52k81J70M5oj41L89k12n4j93J50J88k13q5J04j8l3J85J17l12
$$ 89 144 48 239 87 -194 -24 21 15 -126 263 51 -3 -196 -46 142 -71 -156 -52 -70 -103 82 199 -113
5090a13K56j09L5j30n7K33n6r8k40L24J94m20L43j66k81J61K87k67N3O2L1O7o1
$$ -113 143 34 69 -61 -118 115 59 -39 -279 45 239 -181 162 -4 -285 -124 163 -104 -51 11 42 109 48
5113D8j99K18M8k24m0K47o2K17q1r0K27j96q7q7R6j3K63k19j70K3J55M6k06k82
$$ 48 -151 67 115 -109 -149 98 36 253 172 82 309 113 26 -61 35 22 285 66 -104 -81 74 120 -86 -368
5137c68M01j98J0J93k89L1J3K12k1k8K77o3R2l84J33Np3J14J42k66K8J65j1l23
$$ -368 33 -165 -155 38 -251 -220 -207 5 -16 -44 233 170 262 -122 11 16 -57 57 199 -67 -39 126 115 -208
5161b08M43k34J77k7j69PJ04l0N7P1k18J01m1o6LJ86n5J84l46K23p6J5j10j19
$$ -208 235 1 178 151 -18 -11 93 63 120 191 -27 74 33 -33 -30 156 101 285 -61 162 86 101 -9 -128
5185a28N8J68k37m3L52j86J3r2o0L31k61J11m3pj34oJ55K11p4j64QK91k37Q9m16
$$ -128 -70 98 -139 -182 170 -16 -3 -95 -155 176 -85 26 -17 -24 -158 -164 -9 202 128 -36 -28 263 26 115 -301
5210c01M9J09l5N85n24K6J69j16J02j02o4K95L4l22J37J5J53j97q1K27k24J57
$$ -301 -252 -143 -178 407 -117 -91 78 -38 64 -38 -102 193 227 -95 42 57 210 13 -68 159 -65 92
5232I2j24K0j7pN6K24l01l58M39n2P0j20K56O3n17L79J60l38K07R3r8j74J73K0
$$ 92 -32 -12 -29 -36 20 244 -57 -415 24 -28 42 -78 178 241 -276 103 263 -75 132 225 127 -47 126 146
5256A46p3n8r3K4J02j59K48k42K20j42J46N5l21O5J56k6j2k4RJ92k07l2j21K39
$$ 146 73 15 -78 -54 48 -111 137 -105 115 -27 119 174 -147 -82 74 48 36 12 21 213 6 -26 -147 92
5280I2j18r9J31J38k08K19j87M60l84Mp5L2K26r1k12K6J90p8j69J95J21l43k8
$$ 92 -26 -125 6 144 -64 155 -32 428 44 48 -27 5 231 140 -72 -46 144 66 -103 92 213 -130 -158
5303a58J40J2j71j13J83J45O4j47j13L97J86m63k1j35K25K9K1k4p2Q7j13L20m28
$$ -158 -18 -6 -177 -290 -107 38 102 -45 -158 239 425 -38 -59 -194 31 60 81 57 -15 72 -41 279 -149
5326a49j8R7Q1k21J86j82L40n5J09r1k22L35k26l0K98k68J01mk4k81M65k14J88
$$ -149 -167 -70 11 -210 -24 -206 134 79 188 97 -125 210 -16 -46 252 -16 85 81 57 -224 241 27 215
5349B15l61J35l9K25j75k9j8J48mJ33l02n1Q8O3p5RK70j23k60L07k17J49k99j70
$$ 215 -146 -11 -50 175 0 -29 -47 101 97 230 -72 -123 -35 28 -47 -38 232 109 -151 156 -61 88 -211 -381
5373c81J58L19J35m84O71k31j42J41O5j76N4l39M57k38J1j0P5R0k8j59j6M9J30
$$ -381 -223 96 231 -253 418 187 45 186 251 75 129 -210 247 9 20 10 85 175 147 -12 -28 21 151
5396A51k50K77j16k92M8K43j15j09K7L21k88p7K45j92N3j26R7L58l26j46J76J06
$$ 151 -99 178 62 -230 -182 61 -54 -163 -136 185 -103 -180 65 -127 -74 -200 -103 255 -71 -217 -41 65
5418F5j45K18k34p9R8K0J51K2Q4m64J80J56N4m26L29K57p3r1k00L7J98Kk01j7
$$ 65 -80 138 -96 -175 -77 -57 94 116 200 -264 -84 72 126 -300 29 286 213 122 -78 -41 157 159 -42 -59
5442e9K45j66k28J10L44k75O9K88l7j16j01j97J98p7j97K36l05M99j25K7l2j95
$$ -59 186 20 -208 -98 246 -29 40 328 291 175 74 -123 75 -2 -199 37 -268 231 106 133 101 -94
5464i4L31k83J37O6J60j49l84N21l83j95M34q7o2j34L5K28j67l8j96Q1K47j73
$$ -94 237 -46 91 157 317 168 -216 305 -78 -273 161 74 12 -122 -87 141 -26 -64 -260 -179 68 -105
5486a05K33j68p4m4K83r0j16L48l03o7J71l07J18K26k9J4J53k73Q4k26J89k43
$$ -105 128 -40 -114 -158 125 35 -81 267 -36 -103 68 -239 -121 105 76 90 243 -30 54 -172 17 -226
5508b26K30P2k11K42r2kj81J66J21q6k04m8k04L38J22o2K90m16L3P9k8P3n1p9
$$ -226 4 76 -135 107 15 13 -168 -2 119 33 -171 -219 -423 -85 37 -25 265 -151 -118 -39 -67 6 -45 -124
5532a24J90k17K55l39M87k27J92m80L19q8j09o8O7N19l10n5K86l94K74k53L04
$$ -124 66 -151 104 -235 252 25 217 -263 56 -32 -141 -209 -142 377 67 12 298 -96 178 -75 229
5553B29l81M5K89r3O6j40k27K76j7k50L69k73Q3L8PJ52l16J81k4j88Q4K48k43
$$ 229 -152 -107 182 89 155 15 -212 64 47 -203 166 -107 -24 14 21 173 -143 38 14 -174 -90 158 -85
5576h5K16Nnl15J79Q1m37L35o6J56L32l56j74M81m73M4J48l6o5R4k85L02j71J64
$$ -85 131 136 131 -184 -5 76 -361 -26 -92 64 396 40 -134 347 -126 -82 66 30 -35 59 -226 76 -95 69
5600F9J29l87M13r5l18L00m3l5p4J72l06M7p2J87j14Q4j31J52Q2j80K12m20O8
$$ 69 198 -189 224 129 -189 111 68 33 -41 131 -175 -128 -200 -13 -127 -43 -174 -22 60 -120 92 -328 -260
5623b60K71j13O2k04N93l47K2q9J13m1J18P5Rj57l4L5l51L17p6O9j7K97l0L4l09
$$ -260 11 -102 -40 -244 349 2 24 -65 48 7 125 200 209 52 18 53 -298 19 -57 12 -5 292 262 296 -13
5648a3j54J37J94j46r8J40Lk9m7j65N16m58J59l65J39M3J21K64j30l36J57QJ44
$$ -13 -167 -30 164 18 -80 60 63 34 -13 -178 338 -120 39 -326 -187 -144 -23 241 111 -225 -68 -60 84
5671H4N2l84L48j78J06k7j31J93Q7k94J39p5pJ19j36j82N34l44J88j77K12k10
$$ 84 136 -248 100 -78 28 1 -130 63 150 -144 -5 -80 -87 32 -104 -286 248 -96 92 -85 127 -83
5693h3P3L7j16M4j03J10M7K4k4J17r8J53l34L4K09m6r8q6L2P0k14L70j2k32l0
$$ -83 -10 27 -89 -45 -148 -38 9 33 9 126 28 181 -153 -119 90 44 -54 -140 -108 -38 -252 118 106 -126 -156
5718a56K83l51m7J34K31O7j71J40k91L23j27j77K33p3j02J67k00j19J80L2j57
$$ -156 127 -224 -271 -137 94 161 -10 130 -161 162 35 -142 91 18 -84 83 -117 -236 -56 -24 -181
5739a81L22l73L54p5n2K04L5j40o9K59m49J66L0k33p1L7J13K15j15K2r6L20N7
$$ -181 141 -232 122 47 -5 199 234 94 25 284 -165 1 31 -202 -273 -236 -123 92 -23 -1 -97 223 280
5762B80m13M5K26j48q0J21J56j54j56JK82k15O0r9J69j85K35L13j62k77k93K43
$$ 280 -133 -88 138 -10 -90 31 187 33 -123 -122 160 -55 5 -94 75 -110 125 438 276 -1 -294 -51
5784e1l2k28K53J91j6j72p8L00j22J9p4J7r1o7K23k52L73n1j67J83j81J09k78
$$ -51 -83 -311 -58 133 117 -55 -133 167 45 64 -10 7 -84 -151 72 -180 193 142 -25 158 -23 86 -192
5807a92K47j32K62k39O5l32K94j80L38n3k69K33j64K65l47J00K02K9k34J00J94
$$ -192 55 -77 185 -54 11 -321 -27 -207 131 78 -191 42 -122 143 -204 -104 98 127 -107 -7 187
5828A87n55L23R1j16L7J76k54j5J81j07J6j5j20jJ27l4J8J41l18L98j97l26N09
$$ 187 -368 -45 46 -70 -33 143 -111 -126 55 -52 -36 -51 -171 -172 -45 -79 -61 80 -238 160 -37 -363 146
5851A46l9J7j67n7J01M2j60M0L85l30L59l54j42J9K8j00J03L25k36K58k09J25
$$ 146 107 124 -43 -100 1 43 -117 -77 308 -22 337 -17 -159 -140 -112 -212 -109 216 -20 238 29 154
5873A54l36L01k17j79M45l7j11l8K51k79J41j43j43l1K55j76L57k68J28j24n4
$$ 154 -182 119 -98 -277 168 131 20 -18 233 -46 95 -48 -191 -222 33 -143 214 -54 74 -50 -104
5894a04r6J00K7K01R3k02J14J61k99O1p2KJ08m77N41pk87J46j04q0K39j65O0K35
$$ -104 -200 -100 -73 128 221 19 133 294 -5 56 -16 -14 94 -383 158 151 -136 10 -94 -174 65 -100 -40 195
5918A95k56k44L29m6k02L97l04%K51K11l42k13J57J02P7l0M7j28J20o9q7pQ0j64
$$ 195 -61 -305 24 -22 -224 173 -131 -131 120 331 -11 -224 -67 35 112 82 129 1 121 52 -35 -42 38 -126
5942a26K68k61J65n1R0j95O3J58r8J56L6j01j23J20l09K06p8n3j6L23j23l7qj92
$$ -126 142 -119 46 -5 85 -110 -47 111 13 169 205 104 -19 101 -208 -2 -80 -133 -149 174 51 14 6 -186
5966a86K00l0K47l95L24j08q7K9o9J23K01l05M8J63k08J68m6k44K35J57l56L3
$$ -186 14 -16 231 -164 160 52 -35 -6 -75 48 249 -56 -8 155 -53 115 69 -175 60 217 -139 -106
5988a06R2J0J8j63J39K48l30O7j23n5R9j7K26N8l47L35P5j81J00p3m5O7j6l16
$$ -106 -14 -4 14 -149 -10 238 -92 -25 -148 -203 -104 -121 105 163 -184 151 226 45 145 72 27 94 78 -238
6012b38J95p1M33m19L5Jr4mL2p1K62j32O0j51J2M35k48Q1k21o0j16K39k2J80n0
$$ -238 -43 -114 319 -100 -65 -64 -158 -162 -130 -201 61 -71 -11 -162 -150 285 37 118 -103 -163 -279 -40 -62 118 68
6037F8R2k79N06n04Q2l5j00J06r9J63J3k42K37n9M5q5K28k12J53O0j68j7j60L33
$$ 68 160 -119 387 -117 -35 -70 -170 -64 -163 0 13 -229 8 -51 -6 -91 137 -75 78 138 -30 -47 -207 126
6061A26L1M5p3k56J46j54J44J38k71J41NO1j01m3J75j42p5qL9j61K97k33L99l18
$$ 126 157 202 129 -127 19 -135 9 147 -124 17 22 83 -18 -61 114 -28 -103 -111 -72 -233 64 -169 230 -88
6085h8P2k24K52l5qJ47j09R2k74K66k66L31rj01K8P2k98j7J85j7J28k47k18K96
$$ -88 -16 -240 12 -23 -31 116 7 99 -175 91 -175 156 147 46 74 146 -152 -169 16 -1 127 -120 -338 -42
6109d2Q3J99k70RK55n27L21j83K35J1m5o2J51j6J0O4k7j52k53L84J00n3l89k5
$$ -42 41 240 -30 -21 234 -293 28 -155 80 91 46 -16 135 119 129 193 166 14 -239 145 245 192 -197 -222
6133b22J78Mj57L80j10k59K84j28J09k24K67j47J19j85m3L00r0j08K9k43J39j05
$$ -222 -44 -40 -197 183 73 -186 98 -30 79 -145 122 -25 94 -91 -134 166 76 -32 -3 -246 -107 -212
6155b12J18M6Q5J68k54j9J21k08K72n9r3K15q0r0K85j73p9K14j12q9n4jj27L83
$$ -212 -94 -48 37 205 -49 -68 53 -155 117 58 -35 180 100 10 295 122 43 257 145 56 2 1 -126 257
6179B57j94R7j99LK02O2l37K29k42K3J89k15J67r4q1J49j07L8J03R7j82M6j80
$$ 257 63 160 -39 -36 166 228 -109 120 -122 -99 90 -125 42 -52 -133 16 -91 -53 50 147 -35 11 -169
6202a69L91J3j01l33L21O7m45K54j12k3k14L11J33j14P2m05K66j34K28q2l00K62
$$ -169 222 235 134 -199 122 189 -256 -2 -114 -137 -351 -40 93 -21 51 -354 -88 -222 6 -76 -376 -114
6224a14K42l6J15j40k39oJ81P7j83L28m40J88L9J85k32j60R3O6J75j7m8k55L94
$$ -114 128 92 207 67 -172 -178 3 80 -103 225 -215 -27 12 197 -35 -195 -102 -36 139 122 74 -181 213
6247B13j03J5k61J36J34j45K33q6l06J58P2k4k0j18J69j83K13j13o8m8%J04k32
$$ 213 110 125 -136 0 134 -11 222 136 -170 -12 60 36 16 -102 67 -116 97 -16 -84 -132 -132 -28 -260
6270b60M46k06j26K52KJ5k51K16j77%K44r9L2m16K28J15O9q0j86P6J18l04M93
$$ -260 186 -20 -146 106 108 123 -128 88 -89 -89 155 56 88 -328 -100 15 84 4 -182 -106 12 -292 201
6293B01k87j16J97j01R5J12k13J18J17l56J60P4k09K60m0N4k37J23K3k62L56J10
$$ 201 -86 -202 -5 -106 -11 101 -112 6 123 -233 -73 1 -208 52 12 66 -171 -48 -25 -287 69 179
6315A79q0R6j85k08J08j28K14j7J20k53M00j2R0l01N5o9K12l9m8N6l91K58J9J46
$$ 179 99 195 10 -198 -90 -218 -4 -21 99 -154 246 234 324 23 78 9 221 182 134 190 -201 57 76 222
6339B22o1L8l67K17j39P5J56k17j8p3k1K59k09L61j91k68J49Qk1j0J54r8K23q8
$$ 222 161 199 -168 49 -90 -15 141 -76 -94 -167 -188 71 -138 223 32 -236 -87 -79 -100 -110 44 -54 169 81
6363H1k20K44k0L0j09OP4j30P5O5m0m53J70J85n2J53n4o9j9r9L50l89K38J78k35
$$ 81 -139 105 85 115 6 12 86 -44 31 96 56 -397 -227 -42 -94 59 5 -64 -83 -182 168 -221 17 195 -40
6388d0L79l90K3J02q5j48J83O4j96O9k48K64J15o5o8K43j60R1k82q6M28k18r5
$$ -40 339 -51 -28 74 -11 -159 24 88 -108 -39 -287 -23 92 27 -41 202 42 133 -149 -235 193 -25 -120
6411a20L87k89o0J94j65J18O3j77j34L54k57q7K30l17K28m08O11K2m75L35P3o0
$$ -120 267 -22 -82 112 -53 65 128 -49 -183 171 -86 -173 57 -260 -32 -440 171 193 -282 53 126 66
6433F6j90J28L8K7j86L01j60RK49k64n4j49K72p9J86k35j28K77J82l49L9l1K97
$$ 66 -124 4 42 69 -117 184 24 33 282 18 -36 -185 87 8 194 -41 -169 108 290 -59 -20 -51 246
6456B46m22K79r6P3j37M4J05PJ73k07J30l05R0J62k90K21J78q9l46K16j17L37
$$ 246 -176 103 7 80 -57 -13 92 99 272 65 195 -110 -20 142 -148 73 251 162 -184 32 -85 252
6478B52l16J58M8k46J97j43J30j12J66o1k83L0L24j92J32j43P5J12j33jL4J6M5
$$ 252 -64 94 142 -104 93 -50 80 -32 134 73 -210 -180 144 -48 84 -59 16 128 -5 -6 28 44 89
6501H9j87L52n25K96j2O5j19L77m10L8J39J80j85j60K76m10j1R4K01j52J35J08
$$ 89 -98 254 -271 25 13 78 -41 336 -74 -36 103 283 98 -62 214 -196 -207 -113 88 -64 71 179
6523A79r7M3o1k19K19N5k2j75J58O7j79qK6r8L7pK25p5n1j27J73j85K26K6j19
$$ 179 82 125 64 -155 64 119 97 -78 80 147 -32 -40 -14 -112 -75 -82 143 68 17 -110 63 -122 104 130 11
6548A1J59k22J73j30l4J38M4j40j00K99M4k60k9p1K89j03R9j05J11l4J06k68J66
$$ 11 170 -52 121 -9 -43 95 139 -1 -101 198 242 -18 -47 -118 171 68 167 62 173 139 245 -23 143
6571A43k67J32L2o4L7J41l14R0p9K24J7k61qL0L92k45j79N5J11pn5K1L73l81j3
$$ 143 -124 8 40 -24 13 154 -160 -70 -149 75 92 -169 -177 -147 245 0 -179 -124 -13 -20 -75 -54 319 -62 -75
6596g5m3m4Q1K14k02Q1j82N52n05K35j68K52k20j87K30j11R1O0J88k13q5j49K49
$$ -75 -118 -162 -81 133 -69 12 -170 382 -123 112 -56 196 -24 -211 19 -92 -1 59 247 34 -51 -200 49
6619D9p1J6r4rL3m2N8j25M82m68M21j55j38L51k05j79L5l69L00L12k56K2j91K25
$$ 49 -22 -6 -100 -109 -76 -118 -60 -185 297 -171 250 95 -43 308 103 -76 -41 -410 -110 202 -54 -32 -223 2
6643Bo6K02j88M8L3k1j44M4K19mJ0k37L23k19J15r9j7R5q7j1J83k77K3K61L8l47
$$ 2 -64 138 -50 -2 31 10 -134 -90 129 125 135 -102 221 2 117 18 1 96 9 -2 181 -96 -73 188 226 -121
6669a21M0K06m8k52J90L8O4j46j67M58j45j11Q9k1j73J26l74L84l15M16j59j04
$$ -121 -81 125 77 -175 15 53 117 -29 -196 262 117 6 95 74 -99 27 -347 37 -278 138 -21 -125
6691a25P1o1L7M6J02j59Q1J43j93K58j13r1J22k34n5J82j95M0N29n29L8J27K92
$$ -125 -54 -115 -78 -32 70 -89 -8 135 -58 200 87 -4 118 -116 -171 11 -184 -144 385 -144 -106 21 313
6714C13j48k48j11J50O8j52k9J18j44M34o2j59J28j2l27j9K93k5o6K17j44l20
$$ 313 165 -83 -194 -44 24 -128 -157 -39 -183 251 189 30 158 146 -181 -200 93 68 2 219 75 -245
6736b45P5N5J44q3o7K32n7k5l26J68L16k19j85L46j87k42J70L22k74j6k8L6N7
$$ -245 -170 -115 29 -54 -121 111 54 29 -297 -129 187 -32 -217 129 -58 -300 -130 192 -82 -98 -126 -90 -33
6759c3J34j21R9J51k23k17N29k45j88K80J65k75p5j67O6%L32l0j77J39j86k25
$$ -33 101 -20 79 230 7 -210 319 74 -114 166 331 56 -19 -186 -120 -120 212 182 5 144 -42 -267
6781b67K58j71M5K43j64N8k67K48M9J95n73K49J63M1J30n60O67j23lj56J78k4
$$ -267 -9 -180 -135 108 -56 2 -265 -17 32 227 -346 -97 66 107 237 -323 344 221 218 62 240 216
6803B16m41J63r5K29Q9j33j78J98l77L39J4j50K01J94k77n7n8L22k04j23K19k39
$$ 216 -225 -62 -157 72 161 28 -150 48 -329 10 24 -126 75 269 -8 -65 -123 199 -5 -128 91 -148
6825a48P9K02m0k01M5J25j10O6K20j34k04K79q3k04J92J67k67J4N2n3K58k07j14
$$ -148 -69 133 93 -108 -63 62 -48 18 238 104 -100 179 96 -108 84 251 -16 -2 50 -3 255 48 -66
6848f6O7J06m43K0K22M09m46J19K82j04l01J07o0LN39m47j4K6q3J0K62j65J10
$$ -66 1 107 -336 -316 -94 315 -131 -12 270 166 -135 -28 -88 -85 454 7 -7 19 -64 -54 208 43 153
6871A53l30K69j13j12K8J30l7K92j06l19J69j12J00J81l76L76p5k90P1K43k66
$$ 153 -177 92 -21 -133 -105 25 -12 280 174 -145 24 -88 12 193 -183 193 118 -172 -101 142 -124
6892a24K12k04J3oj09J30o9J05L42l33n7N7J04K62k78M9j86Q7j1L8j22rL23j89
$$ -124 88 -116 -103 -109 -218 -88 -157 -52 290 -43 -100 -43 61 323 45 94 -92 -5 -16 22 -100 -109 214 25
6916B5k60K03j59K29R6K3j08K8o7j36L36l70J29k28L83K29n33K59r3M5j0n0L6
$$ 25 -235 -32 -191 38 134 157 49 77 10 -126 210 -160 -31 -259 124 353 -180 79 -14 31 21 -29 7
6939GM2l9k50J57J69l2k25K30j17M7k11M28j16j36N3p0M06n42L05m91K20N36l32
$$ 7 49 10 -240 -83 86 54 -171 59 -58 -11 -222 206 90 -46 7 -63 343 -199 106 -385 -165 371 39
6962C9K9J04l41J57J36o9q5K18r8l22L14q9J89j76M0M6Jq5j61K34J5j9j11K90
$$ 39 68 172 -169 -12 124 55 -30 188 90 -232 82 -7 182 6 46 92 93 8 -153 81 96 77 -34 256
6986B56l29n2P7j01o9J9K69l2j59J86J23j2j77%p4q0M2MJ35K04k54j05J73k8N0
$$ 256 -73 -125 -48 -149 -218 -199 70 38 -121 65 188 176 -1 -1 -75 -155 -113 -109 26 230 -24 -129 44 16 66
7011F6n05P46l80Q7j60P0J95m22N71j29m5nk83J71l0L8k08M4K19k5j62j84K30
$$ 66 -439 307 -73 14 -146 -76 119 -303 268 139 94 89 -194 -23 -53 -15 -223 -179 40 15 -147 -331 -101
7034a01K01K39p1k3n10L95q8j76N8J5j11M5m1J33R2J39m64o2L77q1K00l2j44m
$$ -101 100 339 268 245 -265 130 42 -134 -76 -61 -172 -127 -168 -35 57 196 -268 -330 47 -34 166 134 -10 -14
7058a4q5k9J78J91J14j93m84K78k7k04J81l3J07N8l4p2q6n7J64j42l8J46J6j93
$$ -14 -99 -128 50 241 355 162 -322 -44 -71 -275 -94 -127 -20 38 4 -68 -154 -211 -47 -189 -227 -81 -65 -258
7082b58J97j85N00l62p9L24l5N2q5j14j53J29J34l01M73m36K60K1K55j05j67q6
$$ -258 -61 -246 254 -108 -187 137 102 154 69 -45 -198 -69 65 -236 237 -199 61 82 337 232 65 -21
7104b1k3K87j64N4k82M4J95J84j52K81l72j84J62j7k6j05J9j3J60j13K78J63n65
$$ -21 -44 243 79 133 -149 -105 90 274 122 403 31 -153 9 -8 -34 -139 -120 -133 27 -86 192 355 -210
7127b10J88O3j11J25n8L8J23j12J86l09K02q7J7Lk5L0j12K06j85R7j37J89k50
$$ -210 -22 41 -70 55 -3 35 158 46 232 -77 125 38 55 58 33 63 -49 157 -28 69 -68 121 -129
7150a29K73Kl6m8k32L70j26j31K59Qk89k51L83Nn7J0j01n8J22j21P4J60J48l57
$$ -129 144 146 110 62 -170 200 74 -57 202 210 -79 -330 53 58 1 11 -90 -148 -26 -147 -73 87 235 -122
7174a22J04L7J18J0k93N14k22m4J14l7k75K44j70K12q1l14K93J47k44j01R9J39
$$ -122 -18 19 137 147 -146 368 146 102 216 179 -96 148 -22 190 109 -205 88 235 -9 -110 -11 128
7196A28k61J00K50J6k59J40k66K8J43m5P9J99k42L0L5k97p1L55j11jJ5J90j65
$$ 128 -133 -33 217 233 -26 114 -152 -124 19 -26 53 252 10 40 75 -222 -293 62 -49 -50 -35 155 -10
7219a0J51k82K80j67k12M75j41j44k22M51n4k65J53p1K25r5J40l91K43R3l54J35
$$ -10 141 -141 139 -28 -240 235 94 -50 -272 179 125 -140 13 -58 167 72 212 -179 64 157 -197 -62
7241f2n5j90K46K08r8R1J8k99L2L96j98k51L07k63Q9q5L00j79q9R9lQ2K67j05
$$ -62 -117 -307 -61 147 49 140 158 -141 -109 287 89 -162 145 -118 -29 -114 186 7 -82 17 14 96 363 258
7265B58n24O7M04q5j80j65M61j66l6R7j03Q8P9j49L4j10M0J08j41K2j99M64j92
$$ 258 -266 -199 205 120 -60 -225 236 70 34 131 28 116 195 46 80 -30 10 118 -23 -1 -200 264 72
7288G2J49m70L04m2j17n2J88m6l7J25r3O9P0k93J61k10J45M67j67j44J12r2j28
$$ 72 221 -249 55 13 -104 -156 32 -14 -51 74 -19 50 120 -173 -12 -222 -77 390 223 79 191 99 -29
7311b9j32L61j12m2n2K8j79j06N03k56j22K35M3k69R8L13l58K2q4j14L73N8k67
$$ -29 -161 200 88 46 -6 22 -157 -263 240 -16 -138 97 140 -129 -31 282 -76 -54 -138 -252 121 179 -88
7334h8O7J04o2j7Qm97L66N7m4J24j35K74j34o7l17J67j8K84Jk75J99J7j44J37
$$ -88 -21 83 21 4 12 -485 -119 -62 -106 18 -117 157 23 -44 -361 -194 -212 72 73 -202 -3 14 -130 7
7358GJ3J07j45k6j82L27j03n8K8J07o6J8J41l43J12j5l9k65L65K69k96R9Jo3k2
$$ 7 20 127 -18 -44 -226 101 -2 -60 -32 75 9 27 168 -175 -63 -78 -117 -382 -17 252 -44 55 56 -7 -29
7383b9K0J65O8j93K77m23K01m8q5K42n32Q2K22j18J74k36K62o9j02j54J36J80
$$ -29 -9 156 224 31 308 -115 86 38 -47 195 -337 -255 -33 -151 23 -213 49 -20 -122 -276 -140 40
7405D0k14L12k92J11J21L0j99k57K17J29K7j67o6M43o0j73o9L31l68Q4Q8J3M9
$$ 40 -174 138 -154 -43 78 108 -91 -348 -131 -2 25 -142 -208 235 175 2 -67 264 -104 -20 68 81 130
7428A30k50p7j4M21l78K82p9l0p3K54k57P6k38L32O1r3k64o1J35Q9J2Q8K8j59
$$ 130 -120 -197 -211 210 -168 114 35 5 -68 186 -71 5 -233 99 160 67 -197 -258 -123 -34 -22 66 94 -65
7452f5J81l24Q8L57j72l6j34j91K57J21k36K83j48l64M54l00J28J36K4N6n4Q4
$$ -65 116 -208 -120 237 65 29 -105 -296 -39 82 -154 129 -19 -383 71 -229 -101 35 59 115 61 145
7474A45k67J95j43J95j33k34L31o9j09j10J11K25k15J41M1J9k12J43j82K12P6
$$ 145 -122 73 -70 125 -8 -242 89 20 -89 -199 -88 137 -78 63 104 123 -89 54 -128 84 160
7495A60j00J72j85j77J89ok86K98JO0m16L23l07M31L7m38K73m5J52k03P7M9j13
$$ 160 60 232 47 -130 59 53 -233 65 66 126 -290 33 -274 157 194 -244 29 -16 136 -67 10 59 -54
7518e4pK11j2p1o1L3R2k51L10j58M7l00O34l53k6K40m82J40r0K95k4k22Lj74K47
$$ -54 -61 150 138 67 6 39 131 -120 190 32 79 -221 413 60 34 274 -208 -68 -158 137 113 -109 -106 -280 -33
7543c3r9J55MK26o3mJ03k73J3q8K46k74LJ61m1K7j50K40L4j76L0o2j22L13j03
$$ -33 -132 23 27 253 190 186 289 16 29 -59 187 -87 -84 77 36 63 -87 153 187 11 41 -21 -143 170 67
7568F7nj13R7m7r0l9j02J93J6L55l94j04j57L76k61K52R8Kp2J28m5J96m81K5k72
$$ 67 62 -51 46 -1 -91 -130 -232 -39 -23 332 -62 -166 -323 53 -208 44 142 144 72 200 155 351 -130 -105 -377
7593c77K50M1K50Rk86j7J62mN2p0N7ql44Q0K39j83J92k65L73m35N64l01p6O7k09
$$ -377 -127 -86 164 173 -113 -130 32 28 80 10 67 59 -285 -205 34 -149 43 -222 151 -284 280 -21 -97 -30 -239
7618b39J76L7J93j47j81N4Q5j17NQ1K96m11J29J48l8j25j35L20N6j13p8J29l93
$$ -239 -63 -26 167 20 -161 -107 -22 -139 -134 -53 243 -168 -39 109 71 -54 -189 131 187 74 -4 125 -268
7641b68RK03p7J42P6O6j93l18K21Q9P9r6k0N3j48K69M7j02R9j43N4J99m56J10
$$ -268 -259 -56 -133 9 85 151 -42 -360 -139 -50 29 -67 -87 -34 -182 87 134 32 131 -12 42 241 -215 -105
7665a05J97m08L02K30m43M06j16j96Q6j27J26J59j48o6J40j26K20k24or0p9K33
$$ -105 92 -316 -14 216 -227 179 63 -133 -47 -174 -48 111 -37 -103 37 -89 131 -93 -99 -189 -268 -35
7687c5j75L46k71J60r6L2K3J00k2k09J31j00J34K25J14l82j4M2r0o1K88j05j21
$$ -35 -210 136 -135 25 -71 -39 -16 84 62 -147 -16 -116 18 243 357 -25 -39 3 -87 -148 140 35 -86
7710h6J68j56O7J01j88m0L17k30N5q6J36k4M6l7nnr0k9J16j10n0j24N22m41J85
$$ -86 82 -74 -7 94 -94 -134 183 -47 8 -78 58 34 80 43 38 33 -57 -86 30 -80 -130 -254 268 -173 12
7735A2Q1j49j12K25K57j19j6l03N7j37J66K42j51j80J74k26L79k49R1k1Ok10J00
$$ 12 93 -56 -168 57 314 195 179 -124 -67 -204 -38 204 53 -127 47 -179 200 -49 42 21 27 -183 -83
7758h3l4P7L22r3j24m04J39M73l26P3l3R1j84L97j27o29M25l8oQ4k59L82r6Q8
$$ -83 -117 -40 282 189 65 -339 -200 273 -53 20 -13 78 -106 291 164 -465 -40 -78 -84 0 -259 123 27 115
7782A15Rj6j77J96j35J26m2k02K20j36j20K91m86K46K01l0k84K08k30K82n7l2
$$ 115 124 108 -69 127 -8 118 76 -126 94 -42 -162 129 -357 -111 90 60 -224 -16 -246 36 -21 -53
7804e3l1P5o6O4m0P0j28K1J00L6l9K2l9q2J20r8j70L83k48O2J01oj46j36K61O1
$$ -53 -84 -9 -75 -11 -51 19 -109 -88 12 48 9 31 -8 -90 30 -68 -238 145 -103 -41 60 54 -92 -228 33 94
7830I4l3k34J74k2r0K36j69J10j6k77K68j88k2N5J34K06l07R2l18M18k31M1M9
$$ 94 61 -173 1 -21 -111 125 -44 66 50 -227 41 -147 -169 -114 20 226 -81 11 -307 111 -120 -79 -30
7853c0k85L70k98K72L7J5j06j00k5J41L7m2K88n39K25k42L22k7j87L7j27K33o
$$ -30 -315 55 -243 29 66 81 -25 -125 -150 -9 28 -14 274 -265 -40 -282 40 13 -174 -137 -264 -31 -37
7876c7n3RK40k98K5K4K04L2j5k2k36K65l43J02Q8J63k77K42l29K33J31M5j33M9
$$ -37 -90 -81 159 -139 -114 -90 114 146 131 109 -127 138 -205 -103 -15 148 -129 113 -216 17 148 193 60 109
7900A09l10J04K06k07Q5j37J05R9k48L36P1m76K60j97K73j3o7j07L30m63K25J14
$$ 109 -201 -97 109 -98 -13 -150 -45 54 -194 142 213 -263 -3 -200 73 60 -7 -114 216 -247 -22 92
7922I2l25J15K45k49L40l86L62j03k69O1K32P9j69j90J17k0M0L9j3J29k81J33
$$ 92 -233 -118 127 -122 218 -168 194 91 -178 -117 115 194 25 -165 -48 -68 -28 11 -2 127 -154 -21
7944b1J54K2l3n2k17L12p2j45k26L08O9j73J09l88K07PJ26k72J60LJ18K28k38
$$ -21 133 155 122 70 -147 165 93 -52 -278 30 99 -74 35 -353 -146 -139 -13 -285 -125 -122 -4 224 -14
7967a4l6j4R3M02p45J44L75j4j18l06O4j44M50lN3o6o9n1J38m19M67j70L55k01
$$ -14 -50 -64 29 431 -314 -170 205 191 73 -233 -169 -313 137 134 187 121 52 1 139 -280 187 17 372 171
7991A71k95j08K63j5J35k56K30p2k89L51l61J73J53j06k87K27K78j85k54K14n5
$$ 171 -124 -232 31 16 151 -105 125 53 -236 115 -246 -73 80 -26 -313 -86 192 7 -247 -33 -88
8012h8L49j65r7P5m1o6j61R1K9J48q3J23o7N2r6k05J28K2P9K2k17K3J26K07l97
$$ -88 261 96 -1 74 33 -33 -194 -103 -74 74 -9 114 47 99 3 -202 -74 -52 27 49 -168 -145 -19 188 -209
8037b09L17J5k46R5M06n86J99l6n9O9J02j2p9M3k9k61N7rL80j8j72J76j0K2l02
$$ -209 108 123 -123 -28 378 -208 -9 -45 -104 -35 67 55 -24 19 -10 -271 -214 -223 157 139 -33 143 133 155 -147
8062a47O5J39j08J58j66o7j38M67p2m47P7K73j33J44J2j71M55l66J54j95J47m7
$$ -147 -82 57 -51 107 -59 -126 -264 203 131 -316 -239 34 -99 45 57 -114 341 -25 129 -66 81 34
8084C4l19o0M76J61m89J32oK4Q9j16R1n0N3Jj11K05l24k6Q7K32j97K7K03r3J75
$$ 34 -285 -345 131 292 -197 -65 -71 -47 42 -74 17 -33 20 21 -90 115 -209 -235 -148 84 -113 -86 117 24 199
8109A99j93j53J25R0K05o41Q9K07K35m16J6l3J2K83k14J96R8L4k09r1J27j35J58
$$ 199 6 -147 -22 68 273 -368 -279 -72 163 -253 -237 -270 -258 25 -189 7 105 139 -70 -161 -34 -169 -11
8132a1P7ok27J10J84j87J18o6j75k9K06o8J97j40O2J3k1qj44J37j31O37l56j16
$$ -11 66 60 -167 -57 127 -60 58 -8 -183 -212 -6 -74 123 -17 45 58 37 29 -115 22 -109 528 172 56
8156E6J74N4l33O1J70j91K63j81j17J3J15m7O0j25K1j26Q5r8K88j88K24j76k2
$$ 56 230 284 -49 12 182 -9 254 73 -44 -31 84 37 97 -28 -7 -133 -48 -146 142 -46 178 2 -20
8179b0K72l94J28Q3J5j51R2j97K42j06O6L0
$$ -20 252 -142 -14 69 84 -67 25 -172 70 -36 30 60
8191F0
$$ Imaginary data points
##PAGE= N=2
##DATA TABLE= (X++(I..I)), XYDATA
0@%%%%%%%%%%%qJ6j6J6k4L2l8M6n6O4p2Q8j04J26j50J74k02K34k69L05l46L96
$$ 0 0 0 0 0 0 0 0 0 0 0 0 -8 8 -8 8 -16 16 -22 24 -32 32 -40 48 -56 70 -80 94 -108 126 -143 162 -184 212
33B12m50N08n72O44p24Q11r07J009j122J246j380J527j688J864k057K266k495
$$ 212 -238 270 -302 342 -382 429 -478 531 -591 655 -725 802 -886 978 -1079 1187 -1308
50a308K749l030L340l684M068m499M989n547O190o945P846q938J0293j2036J4370
$$ -1308 1441 -1589 1751 -1933 2135 -2364 2625 -2922 3268 -3677 4169 -4769 5524 -6512 7858
65G858j7670K2731l1564N1414j80998K0987K07866j84726M307R2096P326O289
$$ 7858 -9812 12919 -18645 32769 -148229 -127242 80624 -104102 -99795 -7699 -373 5916
77E916R1647m0748l3100O7020J2462r5537K9189M1346p2403j5254M9704p9118
$$ 5916 97563 56815 23715 90735 103197 7660 36849 78195 5792 -9462 40242 -38876
89c8876l5098P0111k2136p6824K2082L6485J7567J6571o515k093N5973L8454k6603
$$ -38876 -73974 -3863 -25999 -102823 -80741 -44256 -26689 -10118 -16633 -18726 37247 75701 49098
102D9098J063M6053l9063o1616L2772O051n4323L001k091l9754K1656K4651k9069
$$ 49098 50161 96214 57151 -4465 28307 34358 -19965 -16964 -19055 -58809 -37153 -12502 -41571
115d1571J1589L7707k3109k7977M4552M0005l4579j8411L1530N66k52K8990k3129
$$ -41571 -29982 7725 -15384 -43361 1191 41196 6617 -11794 19736 20302 20050 49040 25911
128B5911m0296J3294J2894j2428j5468j8457k172J3197Q410L411k095J2294K4242
$$ 25911 -14385 -1091 11803 -625 -16093 -34550 -36722 -23525 -15115 -11704 -13799 -1505 22737
141B2737m431r135J2956N258q178j4558j0579M382m50m051K040j4355m759K3474
$$ 22737 18306 9171 22127 27385 19207 4649 -5930 -1548 -1998 -6049 -4009 -18364 -23123 351
155C51J968j1238N227j515j762J0832L667m02K753L611L392l635j10K416j0448
$$ 351 2319 -8919 -3692 -5207 -6969 3863 7530 7128 9881 13492 16884 13249 13139 15555 5107
170E107m706n271j7331M386Q466j3323j37R191K423J5741R395j0682K38J1964
$$ 5107 401 -4870 -22201 -17815 -9349 -22672 -22809 -13618 -11195 4546 13941 3259 3497 15461
184A5461M284o495n138k32q436k437J1985q858j2263J2857k642j2947Q696j41
$$ 15461 19745 13250 8112 7880 -556 -2993 8992 134 -12129 728 -1914 -14861 -6165 -6306
198f306q730P552M405o509L089J3001O235o649K573R061p303k053N376j4558p515
$$ -6306 -15036 -7484 -3079 -9588 -6499 6502 12737 6088 8661 17722 10419 8366 13742 -816 -8331
213h331P587n978m717N256k354O45O550K346m13j35M244M79o439K362L660n478
$$ -8331 -744 -6722 -11439 -6183 -8537 -7892 -1342 1004 591 456 4700 5179 -1260 1102 4762 -716
229g16K936Q78o221N799L569p854j10L1l165J380j48j097O05J582N368J339j396
$$ -716 2220 3098 -3123 2676 6245 -1609 -1719 -1688 -4853 -3473 -3621 -4718 -4113 -2531 2837 4176 2780
246B780N560r31m667L542m001n649J619l360k724K144m93J826K765K97L081R3
$$ 2780 8340 7409 2742 6284 2283 -3366 -1747 -5107 -7831 -5687 -6180 -4354 -1589 -1292 1789 1882
262A882L11L749k548j725K706k450l58J799k379o0R54l291Q91j438l770O57r30
$$ 1882 2193 5942 3394 1669 4375 1925 1567 3366 987 927 1881 -1410 -519 -1957 -5727 -5070 -6000
279f000o15K135n10L219M345m89K904L381j533R75j380l359K43l770l068L25j965
$$ -6000 -6615 -4480 -4990 -1771 2574 2085 4989 8370 6837 7812 6432 3073 3316 -454 -3522 -3197 -5162
296e162M2J176j969K830J442j743K634J429j040K258j36N22K470r03R81J331k390
$$ -5162 -5120 -3944 -5913 -3083 -1641 -3384 -750 679 -361 1897 1761 2283 4753 3850 4831 6162 3772
313C772j87j249l540l59k253k970J213p79l00K806Q77K633K498k31K976P43k082
$$ 3772 3585 2336 -1204 -1563 -3816 -6786 -5573 -6352 -6652 -3846 -2969 -336 2162 1931 4907 5650 3568
330C568J548p18k563O20k196j000N31k319QN86j391L69p9j583J977O01q3K623
$$ 3568 5116 4398 1835 2455 259 -741 -210 -2529 -2521 -1935 -3326 -2957 -3036 -4619 -2642 -2041 -2124 499
348D99R73R05J948k69N36Q80k391l05j047l030k27j697j287J361o79J86K012J3
$$ 499 1472 2377 4325 4056 4592 5472 3081 2776 1729 -1301 -1528 -3225 -4512 -3151 -3830 -3644 -1632 -1619
366a619J172J025n22J841N84j376J397n96q80J694q92r03N91j489n53m50j952
$$ -1619 -447 578 56 1897 2481 1105 2502 1906 1026 2720 1828 925 1516 27 -526 -976 -2928
383b928L64Kp60J634k04K76K315M62N63J334n11L16m44j599m83p75m69J34n33
$$ -2928 -2564 -2562 -3322 -1688 -1892 -1616 699 1161 1724 3058 2547 2863 2419 820 337 -438 -907 -773 -1306
402a306o78J353q89K60J556j054M83N96q26J032L82p59J122O56l96O3m47k22j08
$$ -1306 -1984 -631 -1520 -1260 296 -758 -275 321 -505 527 909 150 1272 1928 1532 1595 1148 926 818
421H18j851l15r6j050J078p28m88K412K40M7J433j43l96R31j86p34l87n61N82
$$ 818 -1033 -1348 -1444 -2494 -1416 -2144 -2632 -220 20 67 1500 1357 961 1892 1706 972 585 24 606
440F06j128m91Q02p86P5J094j654k77J719p68p08J474l29R95J50K76L25l06N17
$$ 606 -522 -1013 -211 -997 -922 172 -1482 -1759 -40 -808 -1516 -42 -371 624 774 1050 1375 1069 1586
459A586K10j140k18j86j202L00l12j319J303O25o28Q23L45k77N78J63k98m78K82
$$ 1586 1796 656 438 252 -950 -650 -962 -2281 -978 -353 -981 -158 187 -90 488 651 353 -125 157
478A57R07r01k95M86L4j79Q78j051q97R48j08q62M80n17M30J72J80L85j08O13
$$ 157 1064 163 -132 354 388 209 1087 36 -861 87 -21 -883 -403 -920 -490 -318 -138 247 139 752
498G52N97q88l25N40j087J12M50j036L78N84l40K67P1j57J099p51j24L06n18k
$$ 752 1349 461 136 676 -411 -299 151 -885 -507 77 -263 4 75 -82 1017 266 142 448 -70 -72
518g2M15k88k07n6K37O78j070m30Q31l38k43K86n99L80J210n82j01O11O2J49l57
$$ -72 343 55 -152 -208 29 707 -363 -793 38 -300 -543 -257 -856 -476 734 152 51 662 724 873 516
539E16J19k30p31L10k20p47J88L11m35P94m72k24Q50K06o59Q68k77K3J16Q9k00
$$ 516 635 405 -326 -16 -236 -983 -795 -484 -919 -125 -597 -821 29 235 -424 444 167 190 306 395 195
560A95J07M47J06r20n0L92o86k89Q28j255l59J339m03l3O22K8Q5N36K21l25n87
$$ 195 302 749 855 -65 -115 277 -409 -698 130 -1125 -1484 -145 -548 -581 41 69 154 690 911 586 -1
581aP81N5j375M28M66p78M81R1o54J85O83j150M46M21l17j8K89J8k32M61M91m22
$$ -1 780 835 -540 -112 354 -424 57 148 -506 -321 362 -788 -342 79 -238 -256 33 51 -181 280 771 349
603C49j28O46n10o40P73r35m40J044l54n37L20J92K57j14J69J60m89O84Q3o19
$$ 349 221 867 357 -283 490 -445 -885 159 -195 -732 -412 -220 37 -77 92 252 -237 447 530 -89
623h9J87N17p82O0O54p58j06J44j57q3K6J83k09M20j62r3L25P95k65j28J7L81
$$ -89 98 615 -167 -107 547 -211 -317 -173 -330 -413 -387 -204 -413 7 -155 -248 77 872 607 479 496 877
645H77o88M6j73m44P0j00J64k44j16L29J13P7Rl1M9N56m33L36J19n8j23L14l86
$$ 877 189 235 62 -382 -312 -412 -248 -492 -608 -279 -166 -89 -80 -111 -62 494 61 397 516 458 335 649 263
668B63l27L48l33j04O0m81k4J11j8J35J44R3J47J21J25L27l10K72m29p8N42k92
$$ 263 -64 284 -49 -153 -93 -574 -598 -487 -505 -370 -226 -133 14 135 260 587 277 549 120 42 584 292
690B92j75oj84O1k02N0m71K20j69J39K84j10J32J83k01N30O5j36K46k58k2Qm93
$$ 292 117 111 -73 -12 -214 -164 -635 -415 -584 -445 -161 -271 -139 44 -157 373 438 302 548 290 268 276 -217
713b17K19k36k34K61k73J79p3L03j12L09J46l20J16p8J69J2mL79n2l64j46j37
$$ -217 2 -234 -468 -207 -480 -301 -374 -71 -183 126 272 -48 68 -10 159 171 167 546 494 130 -16 -153
735a53q8M32l89M7j41k94K06J58J37K67n47L91M06m30J12O2j40J51N0k70KK53
$$ -153 -241 191 -198 -151 -292 -586 -380 -222 -85 182 -365 26 432 2 114 176 36 187 237 -33 -31 222
757B22l45j70R3K4p5K13j9J09l14K23K74l93M22j32p6J35p4j69j26L17p3k43K76
$$ 222 -123 -293 -200 -176 -251 -38 -57 52 -262 -39 235 -158 264 132 56 191 117 -52 -178 139 66 -177 99
780I9n6j49Oq3J33pJ51k87L28L71q08M82k75J45R6r2L2J01j69k08J22J23L57q3
$$ 99 43 -106 -100 -183 -50 -57 94 -193 135 506 -302 180 -95 50 146 54 86 187 18 -190 -68 55 412 329
804C29l83jJ10k7J78j33J2L6J45m16L23k10j5o9O1M9j41K45k64L71l70O2J0J58
$$ 329 -54 -55 55 28 206 73 85 121 266 -150 173 -37 -52 -121 -60 -11 -152 93 -171 200 -170 -108 -98 60
828F0J23p2k16J31J9j36J7j11J3Q2J64j32n6j2R2k47K46o4p4M7K00k08J93L2l42
$$ 60 183 111 -105 26 45 -91 -74 -185 -172 -90 74 -58 -114 -126 -34 -281 -35 -99 -173 -126 74 -134 59 91 -251
853b51M65j36l50K87j11J93k78J03K6L12m63O2K98K2p9L8l2k19L70m03K84k29
$$ -251 214 78 -272 15 -96 97 -181 -78 -52 260 -203 -141 157 179 100 138 106 -113 257 -146 138 -91
875i1R4M3r9K67l58J44j37l3L84k50M1q2J06r6rJ1O0R7l3o5K47l64K30j56j53
$$ -91 3 46 -53 214 -144 0 -137 -170 214 -36 5 -77 29 -67 -76 -65 -5 92 59 -6 241 -123 107 -49 -202
900b02K88j01l5K2J45j92K14k09J19O4k6J3j23k45K22J0Q6k5Q0j63J85J8l60K1
$$ -202 86 -15 -50 -28 117 -75 139 -70 49 113 87 100 -23 -268 -46 -36 50 25 105 -58 127 145 -215 -194
924a94L98k24K45j88o5j11M37k44J34l76J86M4k32K57j9J39k73m2R7N1j20J32
$$ -194 204 -20 225 37 -28 -139 298 54 188 -188 -2 42 -190 67 48 187 -86 -128 -31 20 -100 32
946C2k94K25K05m8k03K98K8q2N9m74N1K15O3k8j51J20MN8k47K9J0j32M7K67m41
$$ 32 -262 -37 168 120 -83 215 243 161 220 -254 -203 12 75 47 -104 16 20 78 -169 -140 -130 -262 -215 52 -389
971c89P80m71J10p5q7Q8M8M2J37l88L04p6k09K72n5l4q9j25Q1L07k35k13M45l55
$$ -389 391 -80 30 -45 -132 -44 4 46 183 -205 99 23 -186 86 31 -3 -92 -217 -136 171 -64 -277 168 -187
995a87J51J82OP1l08R5j00Q0j88J54Q6l08O9K56k74K43j19J05K9l6j16K95j76
$$ -187 -36 146 152 223 -85 10 -90 -10 -198 -44 42 -266 -197 59 -215 28 -91 14 43 7 -109 186 10
1018A0Rj33J33L98j44R5j13k40R6j48N0j54p1R7J36M1j32J22K9m02N16k49J59
$$ 10 19 -114 19 417 273 368 255 15 111 -37 13 -141 -212 -115 21 62 -70 52 81 -321 195 -54 105
1041A05j29J84j47O9m7j95p0o2L96k73J39K73k93M01n01j58O06l95J21j4L40j82
$$ 105 -24 160 13 82 35 -160 -230 -292 104 -169 -30 243 -50 351 -150 -308 298 -97 24 10 350 168
1063A68j67%lj45J21l8K01r1j12J95k33R7n0K32j74J35j32l24M50k58L63k59J15
$$ 168 1 1 -2 -147 -26 -64 137 46 -66 129 -104 -7 -57 175 1 136 4 -320 130 -128 235 -24 91
1086I1j89J15O0k66r3K29k0p0J21L05l25ML29m43J85pJ70k69j40L81k6j50k47
$$ 91 -98 17 77 -189 -282 -53 -73 -143 -22 283 -42 -38 291 -152 33 26 196 -73 -213 168 142 -8 -255
1109b55L88j12j4o1J05k76J49K67j24on9m1J5J02K02l69J10k95M44k23K31M4j36
$$ -255 133 21 7 -54 51 -225 -76 191 67 61 2 -39 -24 78 280 -89 21 -274 170 -53 178 222 86
1132H6j56j18L16q2r7M1r4OK27l29M68m23J09J30j39L08k09r0J03j00Q4J08k49
$$ 86 -70 -188 128 46 -51 -10 -104 -98 129 -200 268 -155 -46 84 -55 253 44 -46 57 -43 41 149 -100
1155a00o5K19J37K1p8j64K84k58p0R8J23m25K58K49j64j80j39K07nP8p9j09L08
$$ -100 -165 54 191 212 134 -30 254 -4 -74 24 147 -278 -20 229 65 -115 -254 -47 -52 26 -53 -162 146
1178A46n8J08m06K58R5L1j04O7m25J20L89N0l83OJ45j85K23j81L50j06j68m0j26
$$ 146 88 196 -210 48 143 174 70 137 -288 -168 221 271 -112 -106 39 -146 77 -104 246 140 -28 -68 -194
1201a94J42N4L5l4J2k60K26n4J93j84kK06l47J78m6K19k74j36M79j27q2k19L55
$$ -194 -52 2 37 3 15 -245 -19 -73 120 -64 -66 140 -207 -29 -75 144 -130 -266 213 86 4 -215 140
1224A40R7l31j0K07k53R7r3K91k32kJ57j68L1k1r0K83k64m9L84j12l16M04k4j9
$$ 140 237 -94 -104 103 -150 -53 -146 145 -87 -89 68 -100 -69 -90 -180 103 -161 -210 174 62 -254 150 126 107
1248A07P7l7j89K65n4l55L42o3nJ37l30R6o6L20k27J88j43j53j04J99L44m10p0
$$ 107 184 147 -42 223 169 -186 156 93 88 225 -105 -9 -75 245 18 206 63 -90 -194 5 349 -61 -131
1271a31j1jM02j38R5q7m4j30m3o9L41m61n9M78J6q4j70K83l31M32l49RJ18n7r8
$$ -131 -142 -143 259 121 216 129 85 -45 -88 -157 184 -277 -336 142 158 74 -96 187 -144 288 -61 -52 66 9 -89
1296h9m5J78k13K10Q4lk83J07J15j51k7M04l80k43M28j37J2Q9l85L93j62J17k37
$$ -89 -134 44 -169 41 125 122 -161 -54 61 -90 -117 287 -93 -336 92 -45 -33 56 -329 64 -98 19 -218
1319b18R4K36k3j68J8K48K5j72l60L87j26K42j13mk9j49K13L65l35k59J26O4m4
$$ -218 -124 112 89 -79 -61 187 212 40 -320 67 -59 183 70 66 37 -112 101 466 131 -128 -2 62 18
1342A8j3j02M1L10k85N4l41K51k8J69l0mJ88l54J60N0R5j94M6l18L60M2j02Q3
$$ 18 5 -97 -56 254 -31 23 -318 -67 -95 74 44 40 228 -126 34 84 179 -15 31 -287 73 115 13 96
1366I6j9k00j66J70P9J03Q9l30L09k15M9K66m4l56K12k07j52L03k01l7J11R3q8
$$ 96 77 -123 -289 -119 -40 63 152 -178 131 -84 -35 231 187 -169 43 -164 -316 -13 -214 -251 -140 -47 -135
1389a35M1PkK29j42r0J90j81J95j38n8O9q2K1J53j04o1j39P1L10j11K42m52K70
$$ -135 -94 -87 -89 140 -2 -92 98 -83 112 -26 -84 -15 -97 -76 77 -27 -88 -227 -156 154 43 285 -167 103
1413A03J65m79L35k0q4%j47J79j44Oq6J08o5J07R8J83k43j64J18P9j34j06J10
$$ 103 268 -211 124 104 20 20 -127 52 -92 -86 -172 -64 -129 -22 76 259 16 -148 -30 49 -85 -191 -81
1436h1J93j60Q6nl57K62K77k07j70n7L30k44L03j98m1O0J66k04L2K5l6J00k37
$$ -81 112 -48 38 33 -324 -62 215 8 -162 -219 111 -133 170 -28 -69 -9 157 -47 -15 10 -26 74 -163
1459a63L37j34l0r7k4J87J50k38J12J64j51j94Q0j61J40q8J71J4k25Q8Q7j41J06
$$ -163 174 40 10 -87 -111 76 226 -12 100 264 113 -81 -1 -162 -22 -110 61 75 -150 -62 25 -116 -10
1482a0J9l62M50j87J56K39m70L09l38J99J18k15J0J89j64j28RJ16MJ99j82k32
$$ -10 9 -353 97 -90 66 305 -165 144 -194 5 123 -92 -82 107 -57 -185 -176 -60 -56 143 -39 -271
1504b71K38K5m2rK43P2q9m0J1K3N2m58L95m45o4L37j40J47L7K08j52k44L47k12
$$ -271 -33 -8 -50 -59 184 256 167 127 138 161 213 -245 150 -295 -359 -22 -162 -15 22 230 78 -166 181 -31
1528c1l8J85k03k7J72j16k25L40M1r7P2J2j27j24L04l01J18J82J61j82k63J40
$$ -31 -69 116 -87 -114 58 -58 -283 57 98 1 73 85 -42 -166 138 -163 -45 137 298 116 -147 -7
1550gp2J63k07K05j80q9o5P7K38p9j73K79j80J79l0k39J68n4J4n9J82J04j44Q9
$$ -7 -79 84 -123 82 -98 -187 -252 -175 63 -16 -189 90 -90 89 59 -180 -12 -66 -52 -111 71 175 31 120
1574A20k34n8K61j95K66J9l28K37k61N7J48j65K19p5n2L3J6K6J24j51J65j77K7
$$ 120 -114 -172 89 -106 160 179 -149 88 -173 -116 32 -133 86 11 -41 -8 8 34 158 7 172 -5 22
1597B2k0k58M76k03O3j61J80R3j45j30R9Q9P8j7j47j03J91J65m14K04L8o4J50
$$ 22 2 -256 220 17 80 -81 99 192 47 -83 16 105 183 166 19 -84 107 272 -142 62 100 36 186
1620A86j95mQ5j77k40L68l5K50q7j41mj6R8j37k25K63O1JK03k8m97M4M00l23P0
$$ 186 -9 -13 72 -105 -345 23 -12 238 151 10 6 -10 88 -49 -274 -11 50 51 254 226 -271 -227 173 -150 -80
1645h0j57L44j1r8J0K35l50J55j2j29K87j91M03n31K55J0j27l4N5j58J71J8o0
$$ -80 -237 107 96 -2 8 243 -107 48 36 -93 194 3 406 -125 130 140 13 -21 34 -124 47 65 5
1668EJ12l8k02J15l0Q2k11K20l01N07k47J70j72p3j0J4P6P5n3J21jj02j65L46
$$ 5 117 79 -123 -8 -38 44 -167 53 -248 259 12 182 10 -63 -73 -59 17 92 39 160 159 57 -108 238
1692B38m6j20jR0j14M2l2j14J60n15L06K89l8j72N8P3j99R7k07K64J7j84M2K13
$$ 238 192 72 71 161 47 89 57 -57 103 -412 -106 183 145 -27 31 104 -95 2 -205 59 76 -108 -66 147
1716A47n1J8K3p3q6J44o4Nl21K88P2K9l95J80J38l4j50Q3J09r3M32l88j56L65
$$ 147 96 114 137 64 -22 122 58 63 -258 30 102 131 -264 -84 54 20 -130 -47 62 -31 401 13 -143 222
1740B22m97o8M60j71R8j12l5Q2Q5k31K2L84k95J52j2j49J30l31M0L6M83l83J5
$$ 222 -275 -343 117 -54 44 -68 -103 -21 64 -167 -145 239 -56 96 84 -65 65 -266 -226 -190 293 -90 -75
1763g5P2L1J13j2j56L13l11J47J16l21J06m8J69J69j79j49M28m53K02o2k58J18
$$ -75 -3 28 141 129 -27 286 -25 122 238 -83 23 -25 144 313 134 -15 413 -40 162 100 -158 -40
1785d0J52J39k94L8l2l7J65n2k4M06m14q2M2l0J30k20L07j75K7RJ67l04N2k27
$$ -40 112 251 -43 -5 -37 -74 91 39 15 421 7 -75 -33 -63 67 -153 154 -21 6 15 182 -122 -70 -297
1809b97J89J20j67J68qr8J43k07J46K11k61J17k22K44j16j10R4J03j40J71k4n34
$$ -297 -108 12 -155 13 5 -93 50 -157 -11 200 -61 56 -166 78 -38 -148 -54 49 -91 80 56 -478
1831d78K20L95J3k64J59j15J7N1j67M21k09j02n9J21r9J28J2kj4n9R1K3j81K4
$$ -478 -258 137 150 -114 45 -70 -53 -2 -169 252 43 -59 -118 3 -96 32 44 42 28 -31 60 83 -98 -74
1855g4NJ09k0n4j03q0K91J8o9k9K10l07K16l3l36K95j3J0j75M57q1l09j59J04
$$ -74 -69 40 20 -34 -137 -217 74 92 23 -6 204 -103 113 80 -256 39 26 36 -139 318 237 -72 -231 -127
1879a27P1L36j42q5J33k86J92j21n8k34J99J48M4m95K87J09k80M67L1o6K9j49
$$ -127 -56 280 138 53 186 -100 92 -29 -87 -321 -122 26 70 -425 -138 -29 -309 158 189 123 152 3
1901Co3J54k61j0L31m2M4k12R4r6q1R4J38j01m0Q4j46N5k8j72J21o0J93k00N4
$$ 3 -60 94 -167 -177 154 112 156 -56 38 -58 -139 -45 93 -8 -48 36 -110 -55 -83 -255 -134 -194 -1 -201 -147
1926a47K02Q1k10M6J58l22J93k26K88jr9o4l0L37j26Q2j2j59MK00k30J45%j18
$$ -147 55 136 -74 -28 130 -192 1 -225 63 62 -37 -101 -131 206 80 162 150 -9 -5 195 -35 110 110 -8
1950hJ78k85Q2j31K57j4K8j69k00K24L25l09k66J98L1l7J13K1M9j60K33j4k76
$$ -8 170 -115 -33 -164 93 79 107 -62 -262 -38 287 -22 -288 -90 -59 -96 17 38 87 -73 160 146 -130
1973a30J84J9K28l19k89J0K59J19n8L04l24Mp1K00k16K6J55r1j53K79k26J80l15
$$ -130 54 73 301 -18 -307 -297 -38 81 23 327 3 7 -64 136 -80 -54 101 10 -143 136 -90 90 -225
1996b25J94P6j41J68j17J74j91K41k48M92n26j1K87j54m0l83K86j29Q2Q2j92K83
$$ -225 -31 45 -96 72 -45 129 -62 179 -69 423 -103 -114 173 19 -21 -404 -118 -247 -165 -83 -275 8
2018HRJ37k72N9O7J48j71j97K28J7J51l76K50m6j12rJ14o5O0J75k57n6M1K24R0
$$ 8 17 154 -118 -59 8 156 -15 -212 16 33 184 -192 58 12 -100 -109 5 -60 0 175 -82 -138 -97 127 217
2043B17k07J51k5j36l49M93k18j69O1J48m6rM0Q3n7J5j31J70o0Pp5J69k9J45k75
$$ 217 10 161 136 0 -349 144 -74 -243 -182 -34 -80 -89 -49 34 -23 -8 -139 31 -29 -22 -97 72 43 188 -87
2068h7K12k95QK31k57J22j57J22R9J64m2k4k0q0L03n54K31J30Q6k11l1q6L14l9
$$ -87 125 -170 -162 69 -188 -66 -223 -101 -2 162 120 96 76 -4 299 -255 -24 106 192 -19 -50 -136 178 139
2092A39j77R0K0n9oP0J5l19P9K59k4K4j75K37m0K46m69K94k24k9p9K54k88J84
$$ 139 -38 52 72 13 7 77 92 -227 -148 111 87 111 -64 173 133 379 -90 204 -20 -49 -128 126 -162 22
2116B2k14j5L34rj10M7O8j08k22P9j8L07j27j34K60l3j23j06o9K35l26L21k53
$$ 22 -192 -207 127 118 8 55 123 15 -207 -128 -146 161 34 -100 160 127 4 -102 -171 64 -262 59 -194
2139a94J53j24J04rrq5J09l0J91k77J47K05k87K82m28M89l19L25Q9j6l0l08j35
$$ -194 -41 -165 -61 -70 -79 -164 -55 -85 106 -171 -24 181 -106 176 -252 237 -82 243 332 316 286 -22 -157
2162a57K66l1k83J69Q6M1k64M66m53K63j82Q0K07k92J13l50M79k00O5p2Mq5R1
$$ -157 109 78 -205 -36 50 91 -173 293 -160 103 -79 1 208 -84 29 -321 158 -42 23 -49 -45 -130 -39
2185c9Q9p8J26l47N7K75J08j07l57L46k46K88j22j96K40k6N3j98j00K44J06k96
$$ -39 50 -28 98 -249 -192 83 191 84 -273 73 -173 115 -7 -203 37 11 64 -134 -234 10 116 -180
2207a80j04J82p4P9j15J37n4R9N8j71L32k47J57j73J45m8j44o4K11m33L30N4p0
$$ -180 -284 -102 -176 -97 -212 -75 -129 -30 28 -143 189 -58 99 -74 71 23 -121 -185 26 -407 -77 -23 -93
2230i3p2J34N3j33L62m12L10j54OO0j46O3j70K17q5J20j09k10K40j33L22k10K21
$$ -93 -165 -31 22 -111 251 -161 149 -5 1 61 -85 -22 -192 25 -60 60 -49 -259 -19 -152 170 -40 181
2253A81j70K05k5%l20J19m5J35k39L66l62m7J30j9N5l41J43Q0K93k70Q3Q5k37
$$ 181 11 216 191 191 -129 -10 -55 80 -159 207 -155 -202 -72 -91 -36 -377 -234 -154 139 -131 -48 37 -200
2276b00J17P0j12p5J64o3J1L56k42K10k74K93k70l5m6J3J83J35O1j70q8k21K11
$$ -200 -83 -13 -125 -200 -36 -99 -88 268 26 236 -38 255 -15 -50 -96 -83 100 235 296 126 38 -183 28
2299B8j29j9j81J96j57K76j0P2O8j81J36p1j55pL39j48k06L07j42J68L8m3l10
$$ 28 -101 -120 -301 -105 -262 14 4 76 144 -37 99 28 -127 -134 205 57 -149 158 16 184 222 179 -131
2322a31L89k36K58k53J3k38L16K04l20jj13K38j10J98j96J76k6k1k25J98l08J40
$$ -131 258 22 280 27 40 -198 118 322 2 1 -112 126 16 214 18 194 168 147 -78 120 -188 -48
2344d8r9M2K41j21P1K21n85K48P8J80k92K13j75J16J3pk64P2rK18j79K14o6j98
$$ -48 -147 -105 136 15 86 307 -278 -30 48 228 -64 149 -26 90 103 96 -168 -96 -105 113 -66 148 82 -116
2368a16Q8k9J39j16J9Q9j54J83M1l36M1K14j60K23L3J02l5k62O8K02j72j06j4
$$ -116 -28 -57 82 -34 -15 74 -80 103 144 -192 -151 63 -97 126 159 261 226 -36 32 234 62 -44 -58
2391e8J01K79k55m3m3J16q8P5l4J57k17j8j58J67q6K47k15J67m8K51j52j98q2
$$ -58 43 322 67 24 -19 97 9 84 50 207 -10 -28 -186 -19 -105 142 -73 94 46 297 145 -53 -135
2414a35j10J77j93K54P2p2K65m10P8J69k66R8j3N6j61K00m1n0K7J05J57n78L44
$$ -135 -245 -68 -261 -7 65 -7 258 -152 -74 95 -171 -73 -86 -30 -191 9 -32 -82 -55 50 207 -371 -27
2437b7j63K4N9J16j41M07m06L24k15Q0M8j20J40J89k84k3j78J32j11M84m67K9
$$ -27 -190 -166 -107 9 -132 275 -131 193 -22 58 106 -14 126 315 31 8 -170 -38 -149 335 -132 -103
2459a03J05l0j05K82k12J09k54J68j09nP0J1J50m14L55n3P8rj76J47N7j98R3J58
$$ -103 2 -28 -133 149 -63 46 -208 -40 -149 -154 -84 -73 77 -337 18 -35 43 34 -142 5 62 -136 -43 115
2483A15J02j7j20j04J36O2k54n5J57j49J78M7J72l71J63J7k02k5J45O5k33N46
$$ 115 217 200 80 -24 112 174 -80 -135 22 -127 51 98 270 -101 62 79 -123 -148 -3 62 -171 375
2505C75m74M28l38j13J62k62K09P0k71J22J29K29k01j98K66k75P3j07M98m19P4
$$ 375 -99 329 -9 -122 40 -222 -13 57 -214 -92 37 266 65 -133 133 -142 -69 -176 322 -97 -23
2526b3J15N7l47K59k54L03j95Q5L2j43R1j44J44q7Rn0o4L46k28j07K32j77K74
$$ -23 92 149 -198 61 -193 110 -85 0 32 -111 -20 -164 -20 -107 -98 -148 -212 134 -94 -201 31 -146 128
2549A28p4pl43M50l19K05L9l2l14M28l8l08j34L71J21j60qN7jP9m3Q1r9k7k4k22
$$ 128 54 47 -296 154 -165 40 79 47 -267 161 123 -185 -319 52 173 13 5 62 61 140 97 178 79 52 28 -194
2575a94K27j8r2j5p8L66m41K02J72j62j13R5J36m11J28L23R9l95J28K14p1k2j39
$$ -194 33 15 -77 -92 -170 196 -245 -43 129 -33 -146 -51 85 -326 -198 125 224 -171 -43 171 100 78 -61
2598f1l5K82r2m53M52j2j35j58L16jk4j9l4L5j36O4M5k2r8J37P8l67K92l7PM5
$$ -61 -96 186 94 -359 93 81 -54 -212 104 103 79 60 26 61 -75 -11 34 12 -86 51 129 -238 54 17 24 69
2624F9j19j33K46K08l41K08m6k28k94n8N00k23j05M01J13k01JJ13k24L13k09m
$$ 69 -50 -183 63 271 -70 138 92 -136 -430 -488 12 -211 -316 85 198 -3 -2 111 -113 200 -9 -13
2646a3k6j00m3n5N05j30r7j87P9nJ07k6j86K02j02M2j23J15R6j33J77N0j01N7
$$ -13 -39 -139 -182 -237 268 138 41 -146 -67 -72 35 9 -177 25 -77 -35 -158 -43 53 -80 97 147 46 103
2670A03l32L7K31K7K85n22J45J59p9qJ94l20J55k8k64O08n37L69m34K73M0r9p
$$ 103 -229 -192 39 66 351 -171 -26 133 54 46 240 -80 75 47 -217 391 -146 223 -211 62 102 3 -4
2693dO8k06O2K33%l37q3L94k50M48m22M8j86N34l80j50%K66j61K00j7j47Mp8K21
$$ -4 64 -142 -80 153 153 -184 -267 127 -123 325 -97 -49 -235 299 -81 -231 -231 35 -126 74 57 -90 -86 -164 57
2718E7K1m09O01k72J23p4Q0J57k77p9p5j31J28r0J92r3R5j35QR3m0J75K7J7r9
$$ 57 78 -331 270 -2 121 47 127 284 7 -72 -147 -278 -150 -240 -48 -141 -46 -181 -173 -80 -120 55 82 99 0
2743@J85p2P0r8k23J56j0j18K52j01k23M86k02l38O1K73k56j40K74k9q4j53J29
$$ 0 185 113 183 85 -138 18 8 -110 142 41 -182 304 102 -236 -175 98 -158 -298 -24 -53 -137 -290 -161
2766a61K84j63J44k40O8L17j86k73K14J07k02k8L7p2j81L87j90k65K58L29k43
$$ -161 123 -40 104 -136 -68 249 63 -210 4 111 -91 -119 -82 -154 -335 52 -138 -403 -145 184 -59
2787e9J38k60L7K9r7J49J46k34J48q9K44J10k59j42L58k21n1J9o8J71k7K20j71
$$ -59 79 -181 -144 -115 -212 -63 83 -151 -3 -92 152 262 3 -139 219 -2 -53 -34 -102 69 42 262 91
2810I1K1j56o3J5k1J11l46M15n06K90K82k39J46k19J82K42j83j42mL04n05J71
$$ 91 112 -44 -107 -92 -113 -2 -348 67 -439 -149 133 -106 40 -179 3 245 62 -80 -84 220 -285 -114
2832a14J09l1n9J47J31l03K1m6K33k10P6J29l20J10O0j03K64O2j95Q8m1NJ45k64
$$ -114 -5 -36 -95 52 183 -120 -99 -145 88 -122 -46 83 -237 -127 -67 -170 94 156 -39 49 8 13 158 -106
2856a06O9j73M53m6m92M67j73J13L4k19j58M55k78M10j25l04l2P4j27K25p0M4
$$ -106 -37 -210 243 197 -295 172 -1 112 146 -73 -231 224 -54 356 231 -73 -105 -31 -158 67 -3 41
2878D1j65J01P7l76M66j94j06M6N2J66j79j10J16M4O9L4j26j81K97J44q1K2L6
$$ 41 -124 -23 54 -322 144 -50 -156 -110 -58 108 -71 -181 -65 -21 48 82 -44 -225 72 216 135 157 193
2901A93j69R7R1j67R2j41j45M37l48K81l94J56k79L60J0j62K61l92J30k6r2J12
$$ 193 24 121 212 45 137 -4 -149 288 -60 221 -173 -17 -296 64 74 -88 173 -219 -89 -115 -207 -95
2923i5J29o7Rj78OR2r0K11r5L6l4J46j33j84J25J36l40K44K97l04K05k10J99l43
$$ -95 34 -33 -24 -202 -196 -104 -194 17 -78 -42 -76 70 -63 -247 -122 14 -326 -82 215 -89 116 -94 105 -238
2947b38J33J59j77L15j51n3J05k85K98J91k38m5n8j7j65P3K61q2j22J24r3O7L
$$ -238 -105 54 -123 192 41 -12 93 -192 106 297 59 14 -44 -61 -226 -153 108 26 -96 28 -65 2 5
2970EO5r8l20O5K82j32Q2L8O2K55l50J48M5j00l57L81J78Q4n00K63k23N7K8j30
$$ 5 70 -28 -348 -283 -1 -133 -51 -13 49 304 -46 102 147 47 -310 71 249 333 -167 96 -127 -70 -42 -172
2994a72R1J44o5L2N5J33j38j96j0kr4J95J13j92P0J05J39j66q2R1j49J08K07j82
$$ -172 -81 63 -2 30 85 218 80 -116 -126 -128 -222 -27 86 -106 -36 69 208 42 -40 51 -98 10 217 35
3018C5J23k16k7J31K18k53R1rj38l2M10k89l7j62L21l50j06J89r3L81k00k0K93
$$ 35 158 -58 -85 46 264 11 102 93 -45 -77 333 44 7 -155 166 -184 -290 -101 -194 187 -13 -33 260
3041B60j17j99L2K3k6j3J13j77j22K88Qj84K14k90Q1q0L47l39M30l30oo3O2L36
$$ 260 143 -56 -24 -1 -27 -40 73 -104 -226 62 70 -114 100 -190 -109 -189 158 -181 249 -81 -87 -150 -88 248
3065B48k62j48O3K26k74K01r8o6J03k7L1l2j59K36l8k5r5J53l26K39Q9k78J92
$$ 248 -14 -162 -99 127 -147 54 -44 -110 -7 -34 -3 -35 -194 42 4 -21 -116 37 -289 -50 39 -239 -47
3088d7J37j56N3J5k08J26J02q5m8J52J30k42r6J34J92kj92K09l84J12K57n0O5
$$ -47 90 -66 -13 2 -206 -80 22 -63 -111 41 171 -71 -167 -33 159 157 -35 174 -210 -98 159 109 174
3111A74j72J8j37M5kJ13j8l28O05j75k28J2j55N3K11j91M55j07L9k7j18R1k37
$$ 174 2 20 -117 -72 -74 39 21 -307 298 123 -105 -93 -248 -195 16 -175 280 173 212 185 67 158 -79
3134g9j67K69P0Qj70L98l84K4n3N6J54o2J27K7m23M8K29J2K9k21L79k29n2m4j3
$$ -79 -246 23 93 101 -69 329 -55 -31 -84 -28 126 64 191 218 -205 -157 72 84 113 -108 271 42 -10 -54 -67
3159f7J58k51L24l45J40K37J15k47p2j04j82L68L07m38m2J09k0o1J16j85QK59
$$ -67 91 -160 164 -181 -41 196 311 64 -8 -112 -294 74 381 -57 -99 10 -10 -71 45 -140 -132 127
3181A27n8j57J16JL32m17r4PK04R3j55M9j37m2K93K07k65j14o5J62j51j8p3L53
$$ 127 69 -88 28 29 361 -56 -150 -143 61 154 -1 48 -89 -131 162 369 104 -10 -75 87 -64 -82 -155 198
3205A98L9l03J21k21M20l37R8P2L7j31j0k04J47K35j74J98O9j60o3o7J07K4l47
$$ 198 237 -66 55 -166 254 -83 15 87 124 -7 -17 -221 -74 161 -13 185 254 94 31 -36 71 95 -252
3228b52K41pJ11k35l18O54Q6l14J56M3k99J49J89k20m1J30k88J23J1J62j0k80
$$ -252 -11 -18 93 -142 -460 194 280 -34 122 165 -134 15 204 -16 -57 73 -215 -92 -81 81 71 -209
3250b09L30l44L51k17jJ02K1J70j06l2L2j42P1kj00k06K40J41j91R5O9l34M4L02
$$ -209 121 -223 128 -89 -90 12 33 203 97 65 97 -45 26 24 -76 -282 -42 99 -92 3 72 -262 -218 84
3274H4J45j18o9K2P5j53P1k76L31N6K1n2O0l40p9P0K09j81J68m0j62O0K22n1l33
$$ 84 229 111 42 64 139 -14 57 -219 112 168 189 137 197 -143 -222 -152 57 -124 44 4 -158 -98 124 73 -260
3299b60L77l66J68J17rK12l95J93Nr2J06J71l54K48rr5o1J50j1k34L8J00J08j42
$$ -260 117 -249 -81 36 27 239 -156 37 42 -50 56 227 -127 121 112 17 -44 106 95 -139 -101 -1 107 -35
3323c5n2K18j81l9K8mN7k23J06K24k33J80k67K75l0k31K86k28J48l62L78R2j0
$$ -35 -87 131 -50 -89 -61 -65 -8 -231 -125 99 -134 46 -221 54 24 -207 79 -149 -1 -363 15 107 97
3346I7l05R0J47M0k08K23j36q9K16R1o4j52k94P13m42O3J31O6K42k84j92Q7n3
$$ 97 -208 -118 29 69 -139 84 -52 -141 75 166 102 -50 -344 369 -73 -10 121 187 429 145 -47 40 -13
3369a3J86m43L52P4j17j82R5n1J08L2j4J15L0j49j20L25j77j48P2J31k65M12l58
$$ -13 173 -270 82 156 39 -143 -48 -99 9 41 27 142 172 23 -97 228 51 -97 -25 106 -159 253 -105
3392a05M03k70q0P5JJ90m11K46k03K63j38J92q2J94k26J07k36K7Q5J57k75j38
$$ -105 298 28 -52 23 24 214 -197 49 -154 109 -29 163 81 275 49 156 -80 -53 32 189 -86 -224
3414b24R6Q2o3O1r7P5K27k32M5J0j6Q2J36l43K34j31M6j75O9O2K41l28l4M19m08
$$ -224 -128 -46 -109 -48 -145 -70 157 -75 -30 -20 -36 46 182 -161 73 -58 -12 -187 -118 -56 185 -143 -177 242 -166
3439a66K46O4n00M05J00k11r2L61k30K07j97K03j83p2J33j34K21k42J59J06J30
$$ -166 80 144 -356 49 149 -62 -154 207 -23 184 -13 190 7 -65 68 -66 155 -87 72 178 308
3460C08k96J21K6l22P7m8L22k31M5k05J58J12N1m9k62k1K9K24J83k50K34j90N0
$$ 308 12 133 159 -163 -86 -134 188 -43 2 -203 -45 67 118 69 -193 -214 -185 39 222 -28 206 16 66
3483F6j60J06J16l07L00jj86k0j89L21L95l36k45M61n42K30J09j54kO6j42R0J7
$$ 66 -94 12 128 -179 121 120 -66 -86 -275 46 441 105 -140 321 -221 9 118 -36 -38 28 -114 -24 -7
3506gj98Q9J72m3j9q9J8j35q6N36l5m45K59nk35M89l52q8J05K09j08j01l33P03
$$ -7 -205 -116 56 13 -6 -95 -77 -212 -298 238 203 -242 17 12 -223 266 -86 -174 -69 140 32 -69 -402 301
3530C01q7l07M81n05K99p7k65J07K78J63k91j19k2M8QJ50K4L8o4l94K61Q8j0j68
$$ 301 214 -93 388 -117 182 105 -160 -53 225 388 97 -22 -44 4 12 162 186 224 160 -234 27 115 105 -63
3554f3j72K93j82j78L27J3R3M4j80Q7n9k92K88j57K43l7M7k08J09j81N7J45k27
$$ -63 -235 58 -124 -302 25 38 131 175 -5 82 23 -269 19 -138 105 68 115 -93 16 -165 -108 37 -190
3577a90L36j79o5J46R5k61L7K77j57K0Q8n3k60L20l93K90k6M5m8q0K33J18k97
$$ -190 146 -33 -98 48 143 -118 -81 196 39 59 147 94 -166 154 -239 51 25 70 22 -58 175 293 -4
3600dj3oLJ26m16J21lJ94J11J19R3k77m19N26m82M40r2%o8J93k8J40j57J27O5
$$ -4 -17 -23 -20 106 -310 -189 -192 2 113 232 325 48 -371 155 -327 113 21 21 -47 146 118 258 101 228 293
3625B93k65J5k16K73l11L66j46k39K41P0r2N1j49k4J12J98l82M3J23Ok67M69j31
$$ 293 28 43 -173 100 -211 155 9 -230 11 81 -11 40 -109 -133 -21 177 -205 -162 -39 -33 -300 169 38
3648C8j00K41j54l75M65O5k11J25j58J59q7K42j21j31o0J9o9J19q4K40j54k47
$$ 38 -62 179 25 -350 115 180 -31 94 -64 95 8 250 129 -2 -62 -43 -112 7 -77 163 9 -238
3670b38J68R1J4j45J63pJ5l2J21K8l18L23k31J13q6J77l26M9P5j45O7L75k06q9
$$ -238 -70 21 35 -110 53 46 61 29 150 178 -140 183 -48 65 -21 156 -170 -121 -46 -191 -124 251 45 -44
3694d4K93l44M3J03P7j51LP6k28L59Ok50M1J2q0K17P6j18j38K51k97P1K8qK5N
$$ -44 249 -95 -52 51 128 -23 -20 56 -172 187 193 -57 -16 -4 -84 133 209 91 -47 204 -93 -22 6 -2 23 28
3720B8k17p5m7K09L3P0L69l84K88m55L27k36J37r2J75k41M53k30p8m3Qj58P3J43
$$ 28 -189 -264 -311 -102 -69 1 370 -14 274 -181 146 -90 47 -45 130 -111 342 112 34 -9 -1 -159 -86 57
3744E7o6qR3o9J07k45J97j61M1R6j50L0M3J18L1l13R4L24k53k08N8M95j51k8k96
$$ 57 -9 -17 76 7 114 -131 66 -95 -54 42 -108 -78 -35 83 114 -199 -105 219 -34 -242 -184 311 160 132 -164
3769a64K35j25j44M20k78o5J88p4J7J75m41K85J51j45L7k14M38j81P6k52r5K11
$$ -164 71 -54 -198 222 -56 -121 67 -7 10 185 -256 29 180 35 72 -142 296 115 191 -61 -156 55
3791E5q9J24l05K72q1K2k13K56J27l68K17p1J26l04J96J60Q9m30K53k16N02r9
$$ 55 -34 90 -215 57 -24 -2 -215 41 168 -200 17 -54 72 -232 -36 124 213 -217 36 -180 322 223
3813B23k6k86J41q2o1L17k76j31J57R0l1K17l20j2J68j21Q7q3N2k23J70o0j33
$$ 223 197 -89 52 -30 -91 226 -50 -181 -24 66 35 252 -68 -80 88 -33 54 -29 23 -200 -30 -90 -223
3836b23o4J85J37j85J09J05q7M9R3l61L62k34N0K67k03k8k32J78L28m52J05j13
$$ -223 -287 -102 35 -150 -41 64 -23 26 119 -242 120 -114 -64 203 0 -28 -260 -82 246 -206 -101 -214
3858b14J44R3k1P3K71m31J34l1j37K81k13J96k58L19j18jk4M6mN8j91J81k41J28
$$ -214 -70 23 2 75 346 -85 49 18 -119 162 -51 145 -113 206 88 87 63 109 105 163 -28 153 -88 40
3882D0J85l42J13P3J86k79m9O8k5K29qp0M7j53K43m58K12j10K81j55kj99J78N1
$$ 40 225 -117 -4 69 255 -24 -73 -5 -30 199 191 121 168 15 258 -200 12 -98 183 28 26 -173 5 56
3906E6n4p3j42K9K81k59K45j3m2l7K51l32n7L22j82j09J22J99j96j05J9j58L16
$$ 56 2 -71 -213 -184 97 -162 83 70 28 -9 242 -90 -147 175 -7 -116 6 205 9 -96 -77 -235 81
3929H1J58j64j7O0O0Lj06j46K39k46k3QJ7r7K42j8j41L8j6M2r6K01o1L97l84o3
$$ 81 239 75 58 118 178 181 75 -71 168 -78 -101 -93 -76 -173 69 51 -90 -52 -68 -26 -122 79 18 415 31 -32
3955c2K33l01j78J13J58Pp9L04l05R1k88M70k69K46p4k30j37M19j45p3Lj52Q4
$$ -32 201 -100 -278 -165 -7 0 -79 225 -80 11 -277 193 -76 170 96 -134 -271 148 3 -70 -67 -219 -135
3978a35Q5L72m60j4L57k01j53K13k39J99n7O6J07K46k28j3L0k98J85j89K27K08
$$ -135 -50 322 -138 -152 205 4 -149 64 -175 24 -33 33 140 386 158 145 175 -123 62 -127 100 308
4000C08m43K06k36L36r6k4l3p9J27K5l85K54J21j62L2K55l80J89m9j3j05J98K05
$$ 308 -135 71 -165 171 75 51 18 -61 66 91 -294 -40 81 -81 -49 206 -174 15 -34 -47 -152 46 251
4023B51l34j3O1J65M03m69k8j66K89j81k3n7L6R2Jj19k6N7J06j4j73K94j90j6
$$ 251 -83 -96 -35 130 533 64 36 -130 159 -22 -45 -102 -66 26 27 -92 -118 -61 45 31 -142 152 -38 -54
4047e4R7n1R4k26K20l98L34k40J23K75l33MQ9k05K81j17L8k9K9n2j31K50j13J41
$$ -54 43 -8 86 -140 80 -318 16 -224 -101 174 -159 -155 -66 -271 10 -107 -69 -98 -69 -121 -252 -2 -115 26
4071B6N3R7j26l8j06m0J9K77l83M63j34k37j16K33K46l77K26l09J18L17n03K81
$$ 26 79 176 50 12 -94 -134 -115 162 -221 242 108 -129 -245 -12 234 -143 83 -226 -108 209 -294 -13
4093a3j73K23P2J22k19j13j40K59m6J64j17j57mM8J6Q5J24M5l70q1R5L98j22p2
$$ -13 -186 37 109 231 12 -101 -241 18 -28 136 19 -138 -142 -94 -78 7 131 176 -194 -275 -180 218 96 24
4117B4L4j47j54O8J45k1l2LN6mj4k85K21J78m5KJ46j25n6m4k27L34J31l8J10q7
$$ 24 58 -89 -243 -175 -30 -51 -83 -80 -24 -28 -42 -327 -106 72 27 29 175 50 -6 -50 -277 57 188 150 260 173
4143A73j56l33K23L14k35K37k53lJ51k81R6M1L15k76o5K49m17K78k94L29k98J16
$$ 173 17 -316 -93 221 -14 223 -30 -33 118 -163 -67 -26 289 13 -52 197 -220 58 -236 93 -205 -89
4165h9j1j30K19J95k7j21l3k2m8J53j50O1j42j66K15j1J07O8r8q7J26J59j92J98
$$ -89 -100 -230 -11 184 157 36 3 -19 -67 86 -64 -3 -145 -311 -96 -107 0 68 -30 -117 9 168 -24 174
4189A74m46J95q2j9J24J10j03J50l17L35j51j33J48K5J9j90N9N5L9k06K92j5l00
$$ 174 -272 -77 -159 -178 -54 56 -47 103 -214 121 -30 -163 -15 10 29 -161 -102 -47 -8 -214 78 63 -237
4212b37N45l39J12j9J30k50j04N5l4L36j14M3l35J83K68l30M24j14k90J76l6J48
$$ -237 308 -31 81 62 192 -58 -162 -107 -141 195 81 124 -211 -28 240 -90 334 220 -70 106 70 218
4234B18l37k89O70l41J63k70K31J24J5k14R9l7J6j23L6j00Q6P7j40Rk48M40q5
$$ 218 -119 -408 262 -79 84 -186 45 169 184 -30 69 32 48 -75 -39 -139 -53 24 -116 -107 -355 85 0
4257@k5L38l09j6j53K47P6l48K88j02J59n12L12M1k32L41k63k53M71j50K34j57
$$ 0 -25 313 4 -12 -165 82 158 -190 98 -4 155 -357 -45 -4 -236 105 -158 -411 60 -90 144 -13
4279a3j53N26l48j35K72k7k80J84Q4O9m70K95j0j49M44l34L91n06M4m0Q0K73L0
$$ -13 -166 360 12 -123 149 122 -158 26 110 179 -291 4 -6 -155 289 -45 346 -160 -116 -156 -76 197 227
4302B27L6l14K70k72J09O6p9O6j01k3J81l39K54n9J27l14J12K16m7k2K60j85K6
$$ 227 263 -51 219 -53 56 122 43 109 8 -15 166 -173 81 22 149 -165 -53 163 116 94 354 169 195
4325A95O3j98Q3J12l19n2l9L41k42K43l05Q3K79j4j36k3k5L13k87J7Q4l5j81O5
$$ 195 258 60 143 255 -64 -116 -155 186 -56 187 -118 -35 244 230 94 71 46 359 72 89 173 138 -43 22
4349B2j03N4R6o6J47J32J7m40J26j43R8q2jN0J81p2R7j81J23K07j32k75K66k2
$$ 22 -81 -27 69 3 150 282 299 -141 -15 -158 -60 -142 -143 -93 88 16 113 -68 55 262 130 -145 121 99
4373I9K52m40J69j41j13J64J8j36M42j18m01J74K31l25J5M56j39m5m2k04J50Q5
$$ 99 351 -89 80 -61 -174 -10 8 -128 314 196 -205 -31 200 -125 -110 346 207 162 120 -84 66 151
$$ [...]
8191a43
##END NTUPLES=NMR FID
##END=
