##TITLE=1H_DE-82_TFA
 200.13MHz, CDCl3,
 8 sc
 
 4.3.2025
##JCAMPDX= 6.0         $$ Bruker NMR JCAMP-DX V2.0
##DATA TYPE= NMR FID
##DATA CLASS= NTUPLES
##ORIGIN= UXNMR, Bruker Analytische Messtechnik GmbH
##OWNER= pz
$$ XWIN-NMR		Version 3.5
$$ Tue Mar  4 16:10:37 2025 Russian Standard Time (UT+4h)  she@DPX200
##.OBSERVE FREQUENCY= 200.1313
##.OBSERVE NUCLEUS= ^1H
##.DELAY= (6, 6)
##.ACQUISITION MODE= SIMULTANEOUS
##.ACQUISITION SCHEME= undefined
##.AVERAGES= 8
##.DIGITISER RES= 18
##SPECTROMETER/DATA SYSTEM= spect
##.PULSE SEQUENCE= zg30
##.SOLVENT NAME= CDCl3
##.SHIFT REFERENCE= (INTERNAL, CDCl3, 0, 14.3821)
##AUDIT TRAIL= $$ (NUMBER, WHEN, WHO, WHERE, WHAT)
$$ ##TITLE= Audit trail, XWIN-NMR		Version 3.5
$$ ##JCAMPDX= 5.01
$$ ##ORIGIN= Bruker BioSpin GmbH
$$ ##OWNER= she
$$ F:/spectra/data/she/nmr/H-C/1/audita.txt
$$ ##AUDIT TRAIL=  $$ (NUMBER, WHEN, WHO, WHERE, WHAT)
(   1,<2025-03-04 16:09:34.62 +0400>,<she>,<DPX200>,
      <created by zg, POWCHK disabled, PULCHK disabled
       configuration hash MD5:
       00 E9 B6 7A A2 85 ED C7 34 08 36 98 17 FE 4E 26
       data hash MD5: 16K
       78 07 39 6B F5 F1 18 B3 79 EF 33 3B D3 1B 4E F8>)
$$ ##END=
$$ 
$$ hash MD5
$$ F5 78 20 71 53 D1 59 00 62 7F 77 BB 6D C3 1E E9
##$RELAX= 
##$RELAX= 
##$RELAX= 
##$RELAX= 
##$RELAX= 
##$RELAX= 
$$ Bruker specific parameters
$$ --------------------------
##$DU= <F:/spectra>
##$EXPNO= 1
##$NAME= <H-C>
##$PROCNO= 1
##$TYPE= <nmr>
##$USER= <she>
##$AMP= (0..31)
100 100 100 100 100 100 100 100 100 100 100 100 100 100 100 100 100 100 
100 100 100 100 100 100 100 100 100 100 100 100 100 100 
##$AQSEQ= 0
##$AQ_mod= 1
##$AUNM= <au_zg>
##$AUTOPOS= <>
##$BF1= 200.13
##$BF2= 200.13
##$BF3= 200.13
##$BF4= 200.13
##$BF5= 200.13
##$BF6= 200.13
##$BF7= 200.13
##$BF8= 200.13
##$BYTORDA= 1
##$CFDGTYP= 0
##$CFRGTYP= 5
##$CHEMSTR= <none>
##$CNST= (0..31)
1 1 145 1 1 1 1 1 1 1 1 1 1 1 1 1 1 1 1 1 1 1 1 1 1 1 1 1 1 1 1 1 
##$CPDPRG= <>
##$CPDPRG1= <>
##$CPDPRG2= <>
##$CPDPRG3= <>
##$CPDPRG4= <mlev>
##$CPDPRG5= <mlev>
##$CPDPRG6= <mlev>
##$CPDPRG7= <mlev>
##$CPDPRG8= <mlev>
##$CPDPRGB= <>
##$CPDPRGT= <>
##$D= (0..31)
0 0.7 0 0 0 0 0 0 0 0 0 0.03 0 0 0 0 0 0 0 0 0 0 0 0 0 0 0 0 0 0 0 0 
##$DATE= 1741090174
##$DBL= (0..7)
120 120 120 120 120 120 120 120 
##$DBP= (0..7)
150 150 150 150 150 150 150 150 
##$DBP07= 0
##$DBPNAM0= <>
##$DBPNAM1= <>
##$DBPNAM2= <>
##$DBPNAM3= <>
##$DBPNAM4= <>
##$DBPNAM5= <>
##$DBPNAM6= <>
##$DBPNAM7= <>
##$DBPOAL= (0..7)
0.5 0.5 0.5 0.5 0.5 0.5 0.5 0.5 
##$DBPOFFS= (0..7)
0 0 0 0 0 0 0 0 
##$DE= 6
##$DECBNUC= <off>
##$DECIM= 32
##$DECNUC= <off>
##$DECSTAT= 4
##$DIGMOD= 1
##$DIGTYP= 9
##$DL= (0..7)
0 120 120 120 120 120 120 120 
##$DP= (0..7)
150 150 150 150 150 150 150 150 
##$DP07= 0
##$DPNAME0= <>
##$DPNAME1= <>
##$DPNAME2= <>
##$DPNAME3= <>
##$DPNAME4= <>
##$DPNAME5= <>
##$DPNAME6= <>
##$DPNAME7= <>
##$DPOAL= (0..7)
0.5 0.5 0.5 0.5 0.5 0.5 0.5 0.5 
##$DPOFFS= (0..7)
0 0 0 0 0 0 0 0 
##$DQDMODE= 0
##$DR= 18
##$DS= 0
##$DSLIST= <SSSSSSSSSSSSSSS>
$$ [...]
##$SUBNAM0= <"">
##$SUBNAM1= <"">
##$SUBNAM2= <"">
##$SUBNAM3= <"">
##$SUBNAM4= <"">
##$SUBNAM5= <"">
##$SUBNAM6= <"">
##$SUBNAM7= <"">
##$SUBNAM8= <"">
##$SUBNAM9= <"">
##$SW= 18.0517328524113
##$SWIBOX= (0..15)
0 0 2 0 0 0 0 0 0 0 0 0 0 0 0 0 
##$SW_h= 3612.71676300578
##$TD= 16384
##$TD0= 1
##$TE= 0
##$TE2= 300
##$TE3= 300
##$TEG= 300
##$TL= (0..7)
0 120 120 120 120 120 120 120 
##$TP= (0..7)
150 150 150 150 150 150 150 150 
##$TP07= 0
##$TPNAME0= <>
##$TPNAME1= <>
##$TPNAME2= <>
##$TPNAME3= <>
##$TPNAME4= <>
##$TPNAME5= <>
##$TPNAME6= <>
##$TPNAME7= <>
##$TPOAL= (0..7)
0.5 0.5 0.5 0.5 0.5 0.5 0.5 0.5 
##$TPOFFS= (0..7)
0 0 0 0 0 0 0 0 
##$TUNHIN= 0
##$TUNHOUT= 0
##$TUNXOUT= 0
##$USERA1= <user>
##$USERA2= <user>
##$USERA3= <user>
##$USERA4= <user>
##$USERA5= <user>
##$V9= 5
##$VALIST= <valist>
##$VCLIST= <CCCCCCCCCCCCCCC>
##$VD= 0
##$VDLIST= <DDDDDDDDDDDDDDD>
##$VPLIST= <PPPPPPPPPPPPPPP>
##$VTLIST= <TTTTTTTTTTTTTTT>
##$WBST= 1024
##$WBSW= 4
##$XGAIN= (0..3)
0 0 0 0 
##$XL= 0
##$YL= 0
##$YMAX_a= 171278
##$YMIN_a= -204127
##$ZGOPTNS= <>
##$ZL1= 120
##$ZL2= 120
##$ZL3= 120
##$ZL4= 120
##$ABSF1= 10
##$ABSF2= 0
##$ABSG= 5
##$ABSL= 3
##$ALPHA= 0
##$AQORDER= 0
##$ASSFAC= 0
##$ASSFACI= 0
##$ASSFACX= 0
##$ASSWID= 0
##$AUNMP= <proc_1d>
##$AZFE= 0.1
##$AZFW= 0.1
##$BCFW= 1
##$BC_mod= 2
##$BYTORDP= 1
##$COROFFS= 0
##$CY= -3
##$DATMOD= 1
##$DC= 2
##$DFILT= <>
##$DTYPP= 0
##$F1P= 0
##$F2P= 0
##$FCOR= 0.5
##$FTSIZE= 0
##$FT_mod= 4
##$GAMMA= 1
##$GB= 0.15
##$INTBC= 1
##$INTSCL= 1
##$ISEN= 128
##$LB= 0.25
##$LEV0= 0
##$LPBIN= 0
##$MAXI= 10000
##$MC2= 0
##$MEAN= 0
##$ME_mod= 0
##$MI= 1.114404
##$NCOEF= 0
##$NC_proc= 0
##$NLEV= 6
##$NOISF1= 3.799351
##$NOISF2= 2.8
##$NSP= 1
##$NTH_PI= 0
##$NZP= 0
##$OFFSET= 14.38212
##$PC= 1
##$PHC0= -467.4274
##$PHC1= 10.99222
##$PH_mod= 1
##$PKNL= yes
##$PPARMOD= 0
##$PSCAL= 0
##$PSIGN= 0
##$REVERSE= no
##$SF= 200.129724274929
##$SI= 16384
##$SIGF1= 3
##$SIGF2= 2
##$SINO= 400
##$SIOLD= 16384
##$SREGLST= <1H.CDCl3>
##$SSB= 0
##$STSI= 0
##$STSR= 0
##$SW_p= 3205.1282051282
##$SYMM= 0
##$S_DEV= 0
##$TDeff= 0
##$TDoff= 0
##$TI= <>
##$TILT= no
##$TM1= 0
##$TM2= 0
##$TOPLEV= 0
##$USERP1= <user>
##$USERP2= <user>
##$USERP3= <user>
##$USERP4= <user>
##$USERP5= <user>
##$WDW= 1
##$XDIM= 8192
##$YMAX_p= 0
##$YMIN_p= 0
$$ End of Bruker specific parameters
$$ ---------------------------------
##NTUPLES= NMR FID
##VAR_NAME=  TIME,          FID/REAL,        FID/IMAG
##SYMBOL=    X,             R,               I
##VAR_TYPE=  INDEPENDENT,   DEPENDENT,       DEPENDENT
##VAR_FORM=  AFFN,          ASDF,            ASDF
##VAR_DIM=   8192,          8192,            8192
##UNITS=     SECONDS,       ARBITRARY UNITS, ARBITRARY UNITS
##FACTOR=    0.0002768,     1,               1
##FIRST=     0,             0,               0
##LAST=      2.2672688,     0,               0
##MIN=       0,             -204127,         0
##MAX=       2.2672688,     171278,          0
$$ Real data points
##PAGE= N=1
##DATA TABLE= (X++(R..R)), XYDATA
$$ [...]
1908F7M9k6K45l82K63j45j77J40K30j68k05J03P9j91L34k85J19Q4l6m4q8P0r4
1931e8M02j91l09O5J19j50N42l88J77k45L9l8l26L04q9K50l22K6K09Kj59K73r0
1954D3k80K08n1j54J95k57K78j9J02l8j3j54N4J97Pk36L58k48Q2j04j64N46m15
1977f3K2R0%l1L58k03j25p9l9K98l79K29k10J1K96r3k7J22l58L62j30j95J22J51
2001A29K11k53j31J58j92j31M07m95M17k85R2M17l30k54N23l20Rl2P7J55j72j82
2023a82L58Q5o7J6j30m6j59P2O8O4m9l24J26P1M14l44M84k56j06k27J42k23K65
2046E2J58k64J39j39Q4k16K16P3l5k7j3k9j1J3j95M86m29j67K57l75L79j46J43
2069d6m6n2n8K39o2k53M62m5q9J87l39j51J2J89J23m6k57J72K88j48O5j39l0p
$$ y = [67, 116, 90, 335, -47, 216, 71, -106, 34, 264, 96, -109, -6, 73, -118, 216, -69, 50, 134, 98, 54, -34, 36, -58, 344, 153, -156, -91, 28, -122, 420, 32, 209, -36, 3, -35, -361, -57, -146, 104, -218, -192, 17, 19, -140, 133, 43, -237, -29, -80, -234, -39, -296, -18, -37, 65, 27, 14, -140, -86, 111, 118, -118, 240, -8, 74, -30, -194, 352, -63, -41, 49, 49, 18, 376, 173, 48, -31, -70, 228, -151, 78, -132, -121, 175, 82, 55, 177, -181, 181, 51, -144, -22, 129, 340, 87, -44, 114, -78, -209, 198, -297, 120, -165, -73, 344, 14, -240, 283, -37, -28, -60, 17, 172, 0, -182, 176, 261, 194, 210, 80, 34, -125, -53, 15, 79, 30, -294, -168, -97, 317, -27, 457, 201, 95, -132, 10, -213, 52, 210, -54, 85, -54, 30, -186, 30, 103, 68, 41, 28, -1, -12, 1, -194, 292, -137, -304, -47, -422, -43, -189, -46, -92, -144, -202, 37, -25, -278, 184, 139, 50, 237, -102, -253, -241, -52, 71, 25, -232, -60, 228, 80, 145, 6, -24, -31]
2093c1K77j55k32l5m7N02j78J71r0k16K20l08J39J52l95M28j77K26l01J67k41
2114a24K15J4j19k22N9K71k26K03N9o3j77K03k56Q2j02l3L07r3N7O6p0j10M3l17
2138c33M27K47l21l1j16J3J14j32L36l83p8L70o7q9K14k37J85l25L81k6k9R7l36
2161a19K38l21K31k97K37O1J11K04l14j35n0M01k13j02K01j74J26j46J75k25M39
2182C28j86k8j23o9j7J63K3Q8k01K8J3k13K04M9r3l41J50K08K32k12q4J44J21
2205A84L0n58J91L89j06p6n7O0o5M1J49l09nK27j25J01p7j27j79L66R3l21J39
2228c5K93j97o8K8l53O2J59J72k30M60j88K8j35J90J3k56Lmk75M18R7o14L73K5
2252c4R6J56j58L3m3r1j8J03k41K89l47J53q5J3LM59m26J60j15K14j61N1n1Kq8
$$ y = [-31, 246, 91, -141, -176, -223, 279, 101, 272, 182, -34, 186, -122, 17, 169, -226, 202, 25, 251, -50, 117, -124, 91, 105, -14, -236, -177, 94, -132, 71, 130, 67, -110, 93, -163, -81, -183, -216, 91, -2, 55, 121, 51, -59, -16, -333, 94, 341, 20, -11, -127, -114, 0, -132, 204, -179, -257, 113, 46, -43, 171, -66, 119, -206, 175, 149, 120, 217, -119, 119, -202, 29, -268, -31, 30, 141, 345, 31, -104, -154, 247, 34, -68, 133, -41, 85, -61, 114, -111, 328, 142, 114, -9, -78, -95, 68, 91, 179, -22, 6, 19, -194, 10, 59, -34, -375, -225, -17, 215, 3, -81, 63, 184, 214, -344, -153, 236, 130, 54, -3, 57, -8, 33, 182, -127, -132, 95, -30, 71, -6, -133, -312, 54, 147, -174, -35, 258, 61, -7, 21, -332, -270, -111, 61, -169, 291, 103, 131, -4, 186, 199, -57, -54, -58, -333, 85, 182, -432, -59, -34, 62, 218, 60, 93, 50, -41, -59, 44, -197, 92, -255, -102, -187, -174, -171, 288, -138, 22, -93, 121, -40, 11, -40, -38, -126]
2277a26L65m45J85K77l72N0k1J42k35M45l81K55j11n4k85J52J26j65L3L86p4k70
2299a23k5q2J12Q4k5m6M05n01Q4n9J21j69K51J05J70l47K32K9j35N5j22J05m3
2322G6Q4Q4k89k06L51j35J05j85L05K71m59P2M7j18L0J28n8j77K25j94R2L2Q4
2345A65J9J4j4o8p6M2K0j15R1j65R2j68J41M5j23k04K38J51m8Qj2k04K57J54p5
2370A65q1j51K36j97p4K71q7j05o0J18k36K52k3j54J44q8k3O5R6j77l2J95R8J4
2394A66l1j50j5J56o3l85L24J22L9j89J4m7k0L18l88K96j06J35j92j0Q0n5k17
2417b18J43J77K0j53n3N1q3L77k44M2J8jk1q3J59p2Q4l9r8Qj85K68j62J69K07
2442C11m65K55j59P3j95K35l38M0L42k54K17l52K05J84k2l23J19p9M48k91k14
$$ y = [-126, 239, -206, -21, 256, -116, -66, -87, 55, -180, 265, -116, 139, 28, -26, -311, -159, -33, -198, -165, 221, 147, -123, -148, -230, -118, -34, -59, -105, 300, -201, -117, -176, -55, -224, 27, 132, 302, -45, 187, 216, 81, 136, 14, 119, 76, 160, 244, -45, -251, 100, -35, 70, -115, 190, 461, 2, 74, 121, 3, 33, 161, 103, -74, 151, -43, 49, 81, 165, 184, 198, 184, 116, 40, 82, 102, -13, 78, -87, 5, -163, -22, 23, -100, -304, -66, 85, 37, 45, 33, -171, 86, 240, 165, 84, -67, 169, -28, -102, 169, 82, -23, -83, 35, -201, 51, 28, -126, 18, -70, -93, -28, 68, -109, -141, 54, 152, 166, 135, -15, -30, 126, 63, -322, 2, 124, 163, -26, -12, -59, -79, 239, -149, 147, 41, 176, -16, -26, 54, -1, -218, -75, 102, 122, -31, -84, -33, -116, 261, 17, 59, 77, 76, 55, -28, 131, 59, 143, 104, 6, 14, -171, 97, -65, 104, 311, -154, 101, -58, 15, -180, 55, -283, -243, 99, -155, 62, -290, -85, 99, 77, -246, -127, -206, 242, -49, -263]
2463b63K56l6q6J58N8k30J70J24j49j64K96m22M68j29r8K88k56j01L99j39p4J04
2485A74j75P2j96J33j43j2M6M2J23L8l3P3r0k20p8Q9o0J58j30J47j26j04J32K77
2509A37l5j38Q1m1l5J60m0R0k0j16j70q1J13l9J98r7J99l76J36j56J84k36J41
2532a41O1o1M44m66K15m2j29k02K79j34J68k15J40K07j78J06m4p1P2k05J57J65
2554A26q6m0P4%k63K16P1r6M9l9j86L85k53j68J58k2R0j55Q4J8K17j34j22J13
2578C7N1l18k6J20J66j19K3L31l45N4N0K39m26J14J06j62K13K7l3l64K7M55m6
2601A74j67K77k95N1K34o13K97L5K7J07l7oj93l2p6J39p4K60j73RL17l22MJ44
2625H7p2m4ok48K70k02J22J05k65L2K17Q4j9J4J50j35J08k24j48J06K15k26Q4
$$ y = [-263, -7, -43, -129, 29, 87, -143, 27, 151, 2, -162, 134, -288, 180, 51, -47, 241, -15, -116, 283, 144, 70, 174, -1, 71, -125, 8, -135, -147, -101, -59, 64, 102, 69, 142, 52, -168, -246, -157, -217, -59, -189, -42, -168, -272, -140, 137, 102, -36, 45, 4, -31, 129, 89, 179, 159, 43, -127, -208, -95, -134, 64, -33, 166, -210, -74, -230, -46, -282, -141, -80, -141, 303, -163, 52, 10, -119, -321, -42, -176, -8, -223, -83, 124, -54, 52, 8, -63, 9, -196, -39, 126, 40, 0, 74, 74, -189, 27, 98, 2, 51, 12, -174, 211, -42, -210, -52, -74, 16, -139, -55, -37, 180, 46, -76, 37, 88, -230, -256, -136, 30, -89, -66, 265, -80, -26, 24, 263, -163, -49, 57, -105, 108, 135, 102, -262, -235, 220, 174, 7, 284, -11, 40, 274, -339, -42, -7, 20, 127, 90, 84, -109, -141, -217, -78, -152, 108, -65, -56, 261, -61, -57, 87, 15, -29, -35, -283, -13, -215, -93, 12, -253, -221, -4, 80, 61, 75, 225, 90, 198, -26, -174, -68, 147, -79, 5]
2648El0K1j30J15j2k16K73M5k00N2Q0m5J0Q1j29j59K35Q4j17K3Q2l9jj55K9j6
2674a14K70J03r4m78O14m30L40j67P1N4k57L51j82M1L5J60k66J27k98M0K37k94
2696a37M0O7j17q3L78j34L0r5P2j25J00J33jj48l61L55j36N07n8o2m28K86lkk05
2721a27J74r4N1J30r1J54n3N5l55K46j47j06J26J1P8n6oM0J05l07K52k49J69q8
2745h8P6Ln6j46q1K20J24k62L50j25P6k00K8j28K44k7k27K80L2j19k9K24j43j0
2769A6r8K26k08LK6J68n1Q5m45L65j00L4p5rR9k13L59L6m81N19n23J98M64k48
2793A47m6k23J73J2j16LM1j51k6J01q1lJ23L65l98p8K14J41O9n12L17n1l86K00
2817a65M48j89r8o1j78Q5L5J23R5m3j22J18j5P2k47J91m7J43r1j72o6L45k76M9
$$ y = [5, -25, -4, -134, -19, -31, -247, 26, 71, -129, -77, 3, -42, -32, 49, -80, -239, -4, 80, -37, -14, 68, 29, 28, -127, -98, -114, 156, 259, 165, -313, 301, -129, 211, 44, 115, 169, -88, 263, 81, 122, 157, 317, 51, 178, -120, -80, 157, -137, -97, -30, -147, -230, 148, 14, 44, -51, 21, -104, -4, 129, 128, -20, -381, -26, -162, 345, 287, 225, -203, 83, 80, 78, -127, 47, -47, 4, 134, 43, 197, 144, 199, -156, 90, -57, -163, -37, -26, 52, -4, -10, 30, 135, -172, 80, -169, 0, -88, -12, -9, -65, -211, -292, -72, 52, -210, 140, 15, 91, -109, -81, -209, 35, 8, -219, 61, 93, -26, -55, 169, 26, 16, -82, 144, -64, -61, -35, 133, 82, 167, -278, 87, -13, 21, -54, -63, 36, -177, 182, 218, -263, 256, -267, -69, 395, 147, 101, -122, 51, 63, -53, -50, -9, -160, -186, -85, -166, -169, -46, 319, -79, -157, 57, 198, 267, -245, 72, 21, -365, -165, 283, 94, -4, -65, -243, -158, -123, 0, 95, 52, -70, 48, 33, 105, -142, 49, 2, 145, 54, -118, -184, 161, -115, -66]
2841f6Q3K06l29kK81l16R4j82K07l27L82n6J13j34J3J83k52L49m02Q5r5L1K24
2864I0k29L84n22K65pn4p8J79r5m1J41j99L87o2j44j01J98J50j25P9k99o4L44
2887A97j56j2J31l34M2K70K6l41p7K25k3l4L30j77m4L2o2J51l03J31K34j90j39
2910a23k0L95l20j36J75j83K18L30J15l70K02o33L51j27P3p0K97j67j30l1K71
2931A17k08j35K40o9m3j07M2K16N1n1J98k58P8j99P0J68j88J08j12J76K5r8K9
2954E0l11L10r5J51o2k7k9Q8j69J14J24k48pM19j87j2l9P5p1k57J01J42l4Rl9
2979dj05J9K28j23J32k80L39j61n2K34l44%L49n4j85j8o2N3J54k56J71m9M0j29
3003a03K10P4q0j3j47J21j44M05l76j72M65k22P3k3j67Mj2K12l9J00k1N2k15O0
$$ y = [-66, 17, 223, -106, -108, 173, -143, -49, -231, -24, -351, 31, -25, 88, -46, -33, 150, -102, 247, -155, -70, -165, -134, 90, -139, 245, -277, -12, -19, -73, -151, 28, -67, -108, 33, -166, 221, 159, 15, -86, 112, 262, 137, 216, -83, -147, 197, 41, 29, 160, -174, -132, 138, 164, -177, -254, -29, -52, -86, 244, 67, 23, 55, -7, 144, -159, -28, 206, 16, -123, -143, 252, -68, -204, -29, -212, 6, 336, 451, 81, 283, -350, 1, -126, -53, -123, 174, 7, -123, -154, 117, -91, -226, 14, -55, -98, -205, -163, 53, 104, 53, 251, -7, 71, -128, -58, 110, -78, 30, -82, 94, 119, 21, 50, -261, 49, -46, 105, 43, 16, -13, 75, -94, 20, 144, -104, -111, 308, 121, 109, 70, 145, 74, -183, -82, 60, 26, 35, -4, -109, -90, 138, 15, 147, -133, 206, 45, -7, 227, -117, -117, 232, 178, -7, -25, -87, -34, 120, -136, 35, -14, 26, -103, 107, 181, 101, 88, -59, 62, -82, 323, -53, -225, 240, 18, 91, 68, -99, -95, -107, 105, 66, 166, 145, 197, -18, 42]
3027D2N0n0L96n79L14P8l34K37o4j19j51K88j32m3J45j21K30nl2j03q8o6J6L01
3051B10r6j13p5J41p4M9p8l8J36P3q4j09j04L35o9j29L37l52P5j79L83j88r0M
3075c5L5J74j70j85n2L38%j15k81M49j50N2l36J61J18k53k9M17r5N5j24j86J33
3098g9j12K87O9j22k22R2Q5m6lO5R7m7j29r2p7o3O84m01p9O4j51J05K54k85p4
3123a80J12J01Kj09K24j49K3J36m81M55j24q6J78rJ23j65k88K92j73K25JqJ80
3146B80M7m46L39k85L04k44J13j53j22K27jO6j21kL44l53j81J10k10K58J2J64
3168A46k16k34L25Kj6N9J84j86J6J41k70J99j15K14p6k4M2Kj01k04L64l88J81
3191D5q7j05K15k10j28L01k1J77j97m4p8J93J05o4r8O2k21l9K64L2j9l19k3K28
$$ y = [42, 92, 42, 438, -141, 173, 251, -83, 154, 90, -29, -180, 108, -24, -67, 78, -43, 187, 182, 150, 47, -41, -107, -91, 210, 114, 1, -74, 67, -7, 42, -36, -74, 62, 135, 51, -58, -162, 173, 104, -25, 312, -40, 35, -144, 239, 51, -39, -35, 0, 174, 4, -181, -233, 105, 105, -10, -291, 158, 8, 60, -276, -115, 3, -250, -279, 138, 43, 98, -26, -212, -79, -191, 96, 165, 43, -179, -87, -2, -48, -51, 14, 111, 64, -65, -157, -234, -297, 387, -14, -93, -29, -180, -75, 179, -106, -180, -68, 33, 35, -74, 150, 1, 24, 160, -321, 134, 10, -76, 102, 93, 216, 51, -237, 55, -118, 107, 108, 100, 280, 327, -119, 220, -65, 239, -5, 108, -45, -167, 60, 59, 125, 4, 2, 346, -7, -188, -78, -288, -30, -18, 146, -70, -304, 21, 23, 7, 66, 250, 64, 80, 221, -49, 150, 35, 249, 173, 149, 191, 193, 92, -112, 252, -136, 45, -42, -147, 68, -142, -270, 31, 10, 187, -10, -54, -132, 61, 166, 102, 4, 66, -155, -194, 70, 102, 83, -236, -259, -31]
3215c1k5j35K55j23O7J71j99j32J51jK98l79j64L35j93M3J99k36K92j3l43K49
3237H6k78J96k22RK48j55N8K2j11M29nk80LK77oj11r2m05N23m12J55l5R5Q5k53
3262a79M45j82j00L73j98m66J12L46k99J97J88j92j4p0Q8P8j72P1q1K25r3m8L
3285C2J14j02j09N2j07P2O5J21k70K44j54K46m38K87j79nL29k41J93j88k50K68
3307b0j43J56K26l34K00j15j89K26m2J3Q6j94J20KJ58k50j1J62m18K88J14n5L38
3330C18J8m33K70m45L35M9j84j27J31J4J40k55L92k69l50K87L36j87K01Q6k03
3351A24k99J84O8l55L88j54O3J42k6ll52L17K1J86j34l21J8L52k87j33N06m34
3373a29J58l01M67n7m01L2J60L23k74M77n79K28Nl75K55J93k39K75R8l27R6L5
$$ y = [-31, -56, -191, 64, -59, 8, 179, -20, -152, -1, -2, 296, -83, -247, 88, -105, -62, 137, -99, 193, 180, -163, 86, -192, 4, -218, -209, 39, -116, -58, -36, -147, 282, 277, -3, 0, 277, 271, 160, 68, -337, 186, -226, -71, -106, -11, 74, -179, 266, 84, -16, 357, 159, -307, -195, 151, -148, 49, 237, 45, 31, -39, 49, 127, -45, 26, -55, 170, 77, 29, 32, 146, 44, -65, -13, -120, -48, 17, 138, -132, 112, -42, 204, -234, 53, -126, -131, 198, -43, 150, -38, -288, -20, -163, -7, 219, -115, 85, -30, -219, 7, -35, -22, 64, -130, -10, -8, 150, -100, -111, 51, -367, -79, 35, -20, 318, 336, -97, 173, -272, 63, 112, -72, -199, -68, -54, 86, -169, 223, -46, -396, -109, 227, 40, 241, 327, 124, -175, 9, 77, -278, 110, -44, 19, 161, 135, 132, -220, 97, 118, 304, 170, -151, -133, 219, -68, -201, 305, -129, 29, -272, 195, 138, -263, -231, -71, 252, -22, 455, -124, 104, 109, -266, -11, 182, -57, 218, 316, -11, 85, 120]
3395A20j08J07o4l48L29j5j90L00l20n0K43K48q9k38J59k95J38J58j53OK41j12
3417F7m3K5j29j55L37k50J55j61K64j23j13R4J01j64K65j89J00M2l42J27P7P3
3439E8k94J72J52j66Q6J28j60M2K35j87J88l54j16K53J46r2j00L1NJ47l85J83
3461b8r2J05o6r4J8J45j09L32Q1k43j48K67k85l3K01R8m10N96l13j87K22J59k94
3484g8K58j31Q0k9J64k19N3l8J20m06L10K2j57J41k91m2K1J05j95J46K19J01j31
3507B3m9K94m47N04m82J04L3N8j25rK73k79P2M0N7J16k31J68J79m80N63l00j61
3530g9P9j4k6J20l5j6o6P4J21j62Pj78lJ92k08j0L0J21Lj73J72PJ63j58K00j47
3556A4j16K8L02j53J72j57k65J51J23m2O2k77K97m4k55M7K22k6J42j05k75K77
$$ y = [120, 12, 119, 55, -293, 36, 21, -169, 131, -189, -239, 4, 252, 163, -75, 84, -211, -73, 85, -68, -62, 179, 67, 24, 49, -80, -235, 102, -148, 7, -154, 110, -13, -126, -32, 69, -95, 170, -19, 81, 123, -219, -92, -15, 58, -236, -64, 88, -78, 8, 136, -24, 18, 253, 66, 254, -100, -216, 37, 183, 91, -9, 22, 27, 174, -211, -28, -120, -15, -81, -175, -157, -12, -121, 211, 292, 49, -99, 168, -117, -150, 51, 149, -261, 335, 22, -165, 57, 216, -78, 180, 49, 129, 100, 264, 45, 98, 60, 180, -226, 84, 106, -51, 90, -201, -243, -222, -117, -312, -166, 53, 154, 23, -26, 268, -179, 325, -157, -53, -20, 38, -87, -96, 177, -102, -30, 10, 67, 183, -48, 120, 299, -181, 382, 82, -79, 0, -14, -40, 80, 45, 29, -37, 37, 158, -4, 3, -175, -178, 14, -194, -204, -174, -53, -50, -223, -51, -44, 119, -39, 161, 14, -102, -74, 228, 75, 247, 90, -175, -24, 99, 57, 119, -158, 139, 95, -160, -113, 109, 83, 225, 120, -155, 122]
3578A22M0j20j22p2L83M3r5O2j60k09J96K16j84o9K93l69K14j47j23L76j58j16
3600AJ92j32k81K92n7n4J18k35M0K14K9l56R9L58k40M1l11M16r0j22J2k4J35k56
3624b11L89j20l50K79j45L52l89M0P0J14P0j7J03k64P8O9j58M0j29L99k89K17
3646A48kl90M20l45N09k85MJ33j33j21n4j08O00n89K71O8k37l4J62N4q2JK39l16
3670h7j02m5J21n0J48o8J55P9j1p9p8J05j17J35J9l56J04K27r7O4j93J23l4L19
3694B82k80K95k83k26J30J36j00J28J60k58j75R5n7O3o1L46j93K0o7K28k82j47
3716b46K65m1j39K44O6R7j61r2K3N8n0j25J04k5K79k03K40k10o0l0O8P3N7j24
3740F8n3k35Q9K35k95K10m3J67K8j51l16L52N8k7l6j28Q3j72K51M4l04K06K98
$$ y = [122, 162, 42, -80, -152, 231, 274, 179, 241, 81, -128, 68, 284, 100, 31, 324, -45, 169, 22, -101, 275, 117, 1, 193, 61, -220, 72, 15, -39, 79, -156, -116, 98, 127, -229, -130, 228, -12, 29, -282, 134, 44, -78, -66, -90, 45, -211, 178, 58, -292, -13, -158, 194, -195, -155, -85, 29, 99, 82, 185, -79, -1, 68, -90, -50, -179, 220, -69, 148, 146, -244, 176, -169, 340, 55, 59, 192, 59, -62, -116, -224, 376, -213, 58, 126, -111, -145, 17, 71, -11, -10, 229, -87, -189, -234, -113, -163, -15, -83, 72, 151, 140, 61, -17, 88, -29, 106, 125, -231, -127, 100, 3, 67, -126, -3, -37, 282, 2, 297, 14, -212, -82, 54, -46, 82, 242, -16, -191, -96, -153, -90, -151, 195, 2, 22, -45, 183, -99, -246, 19, -22, -161, 83, 149, 246, 85, -7, 16, 74, 24, -101, 3, -22, 257, 54, 294, 84, 24, -6, 62, 135, 192, 68, 15, -220, -131, 104, -191, 19, -24, 143, 171, 20, -296, 56, 114, 87, 51, -77, 6, -166, 85, 129, -175, 31, 329]
3763C29k12l3p3J4m7j31M05l24J12k21K88j42K39k14j20K13l68M46k90M1r7K22
3785C7n9L68m78L28k26K04m7j83J41m9r4K37k06P7j23l5L91l37j95J58N5K31q0
3808A15k39j68K29N4K95k57l6m7J83j36P6J79k44J33M7r7p8J20l21L51n6K4k54
3831a27L41l20J75j85m3J65k84J67J01p5K4Jj41J69J23j47J26J71k70j64pR0J73
3854F3k80M8K47k05l5K48j97J04k6J71n2k33mM5L11J95j24k57k70K29K11J41r3
3877B37j82j12K12K40k24k79L1RL51n70M32k3J9m78L59k66J53p1N9j83M4K15l5
3900f2P5j80J23Q0k38K22k6R1n17N34n0J07r4k99N76k56J32m08K52P9l5O3k31
3923f2Q0m9J40j33NK87l03j12J15K45m14J2K17Pj20K83k92QMj05J79M2L84l38
$$ y = [329, 117, 84, 11, 25, -22, -153, 252, -72, 40, -181, 107, -35, 204, -10, -130, 83, -285, 161, -129, -88, -185, 37, -22, 346, -132, 196, -30, 174, 127, -56, 85, 36, -58, 179, -27, 50, -73, -108, 283, -54, -249, -91, -36, 195, 115, -124, -292, -63, -9, 286, 29, -7, -54, 129, -7, 69, 248, 4, 137, 184, 87, 9, 129, -192, 159, 103, 127, -127, 214, -106, 69, -116, -159, 6, -278, -111, -10, -85, -61, -60, -201, -32, 91, -56, 70, 241, -29, -193, -200, -110, 63, -217, -169, 78, -127, -162, 86, -111, -7, -33, 138, 86, -147, -151, -106, 205, 400, 276, 19, -251, -22, 189, 330, 237, 55, -57, 155, 395, 171, -108, -77, -68, 283, -287, 145, 122, 141, -337, 22, -244, -91, -162, -103, -286, -242, -27, -62, 13, -167, -44, 36, -202, 20, -6, 85, -432, 102, 52, 159, 65, -234, 342, 86, 218, -190, 62, 141, 106, 169, -62, 18, -31, 109, -24, -19, 268, -35, -147, -32, 213, -201, -189, 28, 35, -85, 198, -94, -86, -82, -187, -8, 34, 418, 80]
3947H0P1k53kJ91l97Q3J35J35oj66J18J2j64JJ88J29j96l1J77k40J12J69K1o9
3971I8k68J4Q2J68J60o3L7j3N6l38J84k05Q2RK25l39K50k37J13j08K60q5J44l71
3995a45J22l40L49o5j3m1J28J07%j80K3rQj73L88l90J86r2N05l12j83J26%q6J75
4020H8M6k33J6n8K3j28N53j47j92j39J90m1o9J27K10m4j64LM0m0J71k61J64N4
4044A69j72o0J36j44K17q4p3J76j92P6k47L19j25K16n14M55j12j26rk7P4l0J82
4067A05k45K15K3Q3k93O5pJ08p2J45m5J3K3K06k70k21K80J62l33k67M88j58J72
4090A77j67K09m46L37l20M30l88J12K08p3J34k7j43j25K91k71K53n38L67o1O7
4111B6l07J65q5J73J23L26m88J13k61j68N96l77J68J7q9M5K65j90l15K27J57l72
$$ y = [80, 151, -102, -104, 87, -310, -227, -92, 43, 37, -129, -11, 1, -163, -162, 26, 155, -41, -72, 105, -135, -23, 146, 167, 98, -170, -156, -74, 94, 254, 191, 228, 215, 271, -67, 117, -88, -6, 3, 228, -111, 139, -98, 15, -93, 167, 82, 226, -145, -23, -363, -14, -79, -92, -133, -5, 102, 102, -78, -55, -64, -56, -229, 159, -231, -45, -137, 368, 56, -127, -1, -1, -87, 88, 134, -99, -83, -141, -118, -246, 307, 160, -32, -171, 19, -22, -91, 36, 246, 202, 38, 41, 81, 41, 212, -49, 115, 169, -3, -63, 73, -71, 146, 62, -11, 165, -27, 49, -198, 121, -4, 212, -302, 153, 41, -85, -94, -121, -47, -77, 105, -140, 75, 98, 181, -112, -47, -54, 54, -18, 127, 82, 95, 118, 324, 54, -167, 113, 275, -58, -325, 163, 5, 177, 10, 219, -227, 110, -210, 220, -168, -56, 152, 79, 213, 186, 43, -82, 209, -62, 191, -347, 20, -41, 26, -281, -116, -201, -28, 95, 421, -67, 46, -215, -383, 213, -164, 4, 21, -68, -23, 242, 52, -263, -36, 121, -251]
4133b51K64N7l7J57j18j6k0k06J80k56J00J81K63k20k11Q8j99K68k5qj99L33L6
4156A61j82J61K9N1J64l29p2J87k03L37k65m47K56p4J85j25K47L3J04j89k24K7
4178a68J76m9J50k21M20m45J58O8j40L5M0r4L71k63n4N5k8L3Kn5j06K37k28K71
4202A65L8k28kJ39k4m34M74j93M2J10R7l6N3k85j03K7M39j79j70J25j27R5n6j11
4226a44q4J08J43N3j61R9p6M5k09L94j15J40k40Rj29J61j69L32l31J83L3K23k70
4249ek49L2K99qm39N46k27J51m09L13k03K73j43K49j81R4J77k48J64k70K01k05
4271h8K38M7o5K39m29QN3k57J54L85j50O8l03J97l09K69j25K04qk43J24j2J91
4294A88l53j21M7LL04k44N32m32O8lm0m14K47L46J59k90N9M8j13J69j07m0kL5
$$ y = [-251, 13, 70, 33, 190, 72, 56, 36, -170, 10, -246, -146, 35, 298, 78, -133, -45, -244, 24, -1, -9, -208, 125, 161, -21, 140, 169, 220, 384, 55, -17, 170, -33, 304, 39, -408, -152, -226, -41, -166, 81, 114, 218, 29, -195, -168, 8, -41, 109, -112, 308, -137, 21, 89, -51, -16, 24, -70, 301, 38, -16, 39, 11, 44, 46, -9, -115, 122, -106, 165, 203, -25, -27, 112, 88, -346, 128, -65, -23, 87, 184, 148, 201, -84, -187, -160, 279, 100, -70, 55, -72, 23, -33, -144, -228, -120, 23, 76, -85, 14, -62, -17, -226, 168, 53, 193, -47, -38, -167, -6, -175, 157, -174, 9, 42, 265, -5, -254, -222, 77, 69, -370, 176, -51, 100, -309, 4, -199, 74, -69, 180, -1, 93, 270, 22, 186, -84, 117, -88, 150, 197, 132, 371, -58, -50, 3, -254, -100, 285, 135, 203, -100, 97, -212, 57, -68, 136, 128, -115, 9, -3, 188, -165, -286, -239, -236, 68, -176, 356, -76, -8, -11, -51, -465, -218, 128, 287, -3, 56, 104, -9, 160, 53, 13, 11, 46]
4318D6j17L3J28k96K34J71m2k56L03o7k97k4R8l0K46j29n4L05l60K50l05L24k45
4341h4n7o2K08K8R7j91k2L6J52K11k07k70J35m7L41k41L5J29o9k11K27r3k41K67
4365G1O4q9j27J12n4J61j40k47L00o9K0k46J21K48jK21l21J7j06J84k18L50j71
4388H0o9j13o0L56J6m41J20O1J70j68J15j33J50m20L77j1p2O0R7k81K7M30k21
4411G0r2K8J88J3p9l23L13k25Lp3p0K55K34m00L61m4j42j44J15p0J28j96K07P2
4435A29J7k03K4J26O8k5J54k32K7n18P61k10j01K4j1j30j28J94R4M2n2J57k48
4458d1r6j61L77j79J99j19p9k08J59P5L71k17n8k95J16n7K64j56J95k97Q8K79
4480A60l94QK76M4k28R6K53K6j05j29k18K24j67J33j76L68j63n6K4J4R1j07R1
$$ y = [46, -71, -38, 90, -206, 28, 199, 157, -99, 204, 137, -160, -184, -86, -116, 130, 1, -53, 252, -108, 142, -163, 161, -84, -141, -203, 5, 33, 130, -61, -83, -47, 105, 316, 109, -161, -26, -73, 268, 27, 62, 191, 122, -89, 138, 45, -196, 71, 135, 46, -81, 31, -23, 138, -2, -249, 51, -18, 2, -244, -123, 125, 124, 345, 24, 41, -65, 119, -99, 251, 80, 11, -102, -162, 194, 210, -231, -111, -50, 120, -48, 67, -66, 84, -336, 41, 30, -42, 18, 115, -166, -139, 291, 70, -22, 6, 194, 207, 128, -195, 118, -107, -104, -177, -247, 8, 242, -158, 203, 159, 17, -127, -12, -82, 46, -150, 57, 129, 146, -57, -33, 93, 161, 136, 290, 58, 85, -433, 328, 118, 17, 41, 30, -100, -228, -34, 60, 102, 50, 207, -41, -137, -298, 79, -100, 99, -20, -99, -307, -148, -73, 298, 81, 23, -272, -156, -213, 51, -105, 90, -207, -119, 160, -234, -226, 50, 94, -134, -38, 215, 241, 136, 7, -211, 13, -154, -21, -197, 171, 8, -48, -24, -10, 81, -26, 65]
4503F5J2j73L4l1lQ7j7K86j86m3J66j70R9l3M8k16J01m8n8qK14m2J34r8jpj10
4530BP8j19J09q3l0R2J77j65J17k08o6K85k26K12j61j22L07k05p4N0L24m43K73
4553A24j53m2pk12J82J77q4J34k11R4J9J1L07k89J67j52j19J68j85p1K27k92r3
4576c00L12l27M45j41J46o7J7j10Q3J38k48M8L4K7L0q4j0j64J59jm8N9J67l37
4600a72J76JL3o0J4j76J72J32k47L93n07M36l20m2L14k20p7J60N4K26n24K92O6
4623A24Kl8j51M0J40k0k43J88j92J44ro3m7O1J14n0k34J41q2K65P5k11L65l38
4647a9K63l03Q7L7M0l84L65j47M5J15l16K17N1m2j03J67J53k92J6N0k7K1Nk16
4671b17l2n6M91j11j27l1k44L86J38l51p7K49k66K08Q3j3j87K52J11m08K85k17
$$ y = [65, 77, -96, -62, -93, -96, -9, -26, 260, 74, 31, 197, 27, 126, 93, 141, -75, 26, -22, -80, -88, 126, 84, 218, 120, 119, 112, 2, 80, -39, 70, -13, -43, 49, 226, 61, 178, -30, -96, 189, -37, 175, 14, -108, 199, -6, -80, -30, 294, -149, 124, -29, -71, -78, -290, -108, 69, -15, 119, -92, 2, 21, 32, 339, 50, 217, 65, -54, 114, -71, -142, 85, -207, -300, 12, -315, 130, -11, 135, 68, 85, -25, 58, 196, -52, -4, 30, 57, 87, 3, -7, -171, -12, -13, -61, -2, 165, -172, 4, 5, 38, -22, -8, -184, -12, 120, -127, 266, -241, 195, -125, -167, 147, -73, -150, 10, 64, 290, -234, 58, 124, 126, 88, -63, -23, 117, 97, -146, 42, -150, -6, -15, -78, -125, -64, 50, 0, -234, -93, -175, 90, 165, -46, 319, -19, 244, -59, 28, 65, 105, -279, 86, -61, -16, 99, -217, 0, 51, 9, -94, 73, 226, -66, -50, 0, -27, -6, -1, -217, -249, -305, 186, 75, -52, -83, -327, 59, 197, -154, -231, 18, -248, -40, 43, 30, -157, 95, 206, -202, 83, -134]
4693a34o2J59j17J32K4O8k3k76M41k34M7J2k19j71M25j16L30k90r0k4J09J24k65
4716a50rj24J75J82k46K56j23k9K38j74K74k90j89K95Q6m01K57j64J35K8k7q2
4738h2Q9J95j48k96L16r1j77K30J7nj66K53j55K3j65Q5M9P3k57J89k3J67k94K59
4762H6j64q2R4pj56J21R8p6l9N5J3K10k41O8J12J67o68P08j67j22J99j26K78l69
4786hpj60K20J7o1l86K75N5J50R6l43O9N6j09K41R5k01k65M53j17j94n2N66l46
4810D4K6k34L0J69r2J87j26l5J59J31k20k19OK34m73O44j15j66j15K81j5j29k68
4833b96N00l10J55l0j46J44k1R4k22O6j89M12J88l98j93L71m65M44j3j78J45k30
4855a72L86k56K3j9j98M58l34J64l50L58K29k54j84J19L3m9O1q6o6J52j3P1Pj62
$$ y = [-134, -196, -37, -154, -22, 2, 70, 47, -229, 212, -22, 25, 37, -182, -353, 72, -44, 286, -4, -94, -118, -9, 115, -150, -159, -283, -108, 74, -172, 84, -39, -68, 170, -4, 270, -20, -209, 86, 172, -229, 28, -136, -1, 27, 0, -82, 7, 202, 54, -242, 74, -17, -194, 36, 53, 48, -118, 135, -20, 3, -162, -77, -28, 45, -212, -23, -46, 121, -173, 86, -78, -160, -66, -73, -229, -108, -10, -86, -125, -70, -57, 153, -88, -20, 92, 259, -409, 299, 132, 10, 209, 83, 361, -8, -15, -175, 45, 62, 1, -385, -110, -55, 95, 191, -152, -83, -27, -136, 105, 200, -1, -266, 187, 70, -124, -176, 390, 44, 70, -164, -134, 35, -57, 130, 4, -31, 128, 259, 39, -180, -174, 60, -413, 231, 116, -50, -165, 116, 101, -28, -296, 204, -106, 49, 19, -127, 17, -4, 90, -132, -66, -255, 157, 345, -53, -246, 125, -340, 104, 91, -87, 58, -172, 214, -42, -19, -38, -236, 222, -112, 52, -298, 60, 289, 35, -149, -30, 3, -46, 15, -71, -137, 15, 2, 73, 80, -82]
4879h2j07L34kO0k26J52k74J13m6o0L3j71K78m6j49K94k11L97M5l61J63k15j60
4902b41K24K89k10j26J06J0p7NK35l10J99j90j87M30j99m1P8j63K02p6L44k92
4924A0J02j32P5j57K21k57J82m3l59N77l73Q6N7N3N0n7k2J07j77J60n6r5K03k49
4948i4K6O8J25M2j98m6r0J91j58k00K8L95k9j55J07O6p5K01m86L31l90L02J81
4971A42j42J74J63J3p3q3n28K27J4m0L6J55%q5K80k58q0J36k43OL13m8L4J61j95
4996G9J09o34K09K35P3R8L9n39Q2K04r2M63n64K74p7p6J43j7J97m03L24o8j78
5019a19J76l28K75k20K2K72m10K63K03k82M5K72k29J18J78m27K76j31k54L53k93
5040b40L04K9q9O2k61J43J94Mj60j75RM7K01j4o1j73J02j03K49k06N8J13L8l92
$$ y = [-82, -189, 145, 143, 203, -23, 129, -145, -32, -78, -138, -105, -276, 2, -44, -193, 101, -110, 287, 332, -29, 134, -81, -241, -17, 272, 62, -64, 42, 52, -25, -20, 215, -95, 104, -86, -273, 157, -42, -83, -5, -168, 34, -42, 302, 10, 112, -20, 55, -102, 119, -138, 44, 1, -358, 219, -154, -68, -11, 42, 92, 35, 13, 120, -57, 103, 47, -48, 155, -94, -68, 0, 125, 167, -31, -77, -167, 24, -134, -334, -306, 89, 60, -95, 12, 78, 3, 204, -282, 49, -341, -39, 142, 0, 174, 337, 350, 277, 194, -334, -107, -93, -133, -97, 58, 58, -27, 253, -5, -85, 51, -192, -186, 127, 79, 113, 274, 79, 188, -446, -237, -2, 71, 169, 208, -331, -249, -45, -137, 326, -238, 36, -41, -117, 26, 9, 206, -197, 127, 59, -119, 57, -271, 4, -216, -194, 78, -332, -69, 134, -148, -103, 169, -60, 58, 236, -191, 85, -46, -300, 53, -240, 64, 93, 4, 66, -195, -52, 142, 146, -14, -189, -180, -133, 68, 54, -7, -180, -78, -181, 68, -138, -80, 33, 71, -321]
5064c21K08L55k51J23J0j64L5O3j68K00k76N0K18j88K08K24m50J62p9J17j87J86
5086G5P1k54O1J77l9Q1k93m9K47j57j57q6K63M7j23j2L26j56NJ19n0j25k5J49
5110I5j53j6k62K34J48j47Q5J81k42J59k34J67K51l75L06k96M2J23j68n8M60q3
5132B17j02k25J53K1k25j57J68o1K02K64k11P5k92R6Q8j51J62l5l27L07q3K58
5154A42J49k09Q0k74K03j74J97r0l24J84J4J20m6K53k30j4N3k07L8j27M47k56
5176g1k6m9m7J00L94k93q4J93k65K17K7q9K4j40J07M2k65K34j08j68L58J20l67
5199a56K38L3n9J29N0l48L90N8l09j48J12n7%J03N0j21R9j26K12m1k60K54on4
5223D3j08J47j43R8j42L43n77O22m04J31j58N5L58L1n12J37J14l6k00J14j19k2
$$ y = [-321, -113, 242, -9, 114, 124, -40, -5, 58, -110, 90, -186, -136, 82, -106, 102, 326, -124, 38, -41, 76, -111, 75, 146, -108, -47, 130, 91, 172, -121, -170, 77, -80, -237, -323, -60, -13, -136, -148, 178, 22, 27, 146, 96, -29, -54, 95, -58, -74, -336, -102, 46, -101, -16, 165, -77, 82, -152, 15, 266, -109, 197, -99, -57, 66, -102, -160, 300, 217, 115, -110, 43, 64, -161, -318, -150, -211, -9, 255, 44, 119, -173, -77, 11, -140, 22, -13, -340, -33, -116, 142, 291, 82, 162, -112, 91, -83, 114, 24, -300, -116, -102, 18, -28, 225, -5, -19, 34, -173, -135, -262, 185, -71, -97, -146, -193, -93, 301, 8, -76, 117, -148, 69, 96, 7, 31, -109, -2, 40, -225, 9, -99, -267, 91, 211, -156, 82, 115, 56, 185, 235, -113, 277, 335, 26, -122, -10, -67, -67, 36, 86, -35, 64, -62, 150, 109, -151, 103, 97, 43, -65, 82, -61, 37, -105, 238, -339, 283, -121, 10, -148, -93, 265, 296, -216, -79, 35, -1, -201, -87, -206, -228]
5245b28M19k39k7K01j73K17j34j36O9q3J17j13O0M5N39n96K29l7j67l3N2k10M3
5268a85J99L7k87L51j14p8R1J11l13K54L5r6l04M90K7j99p7J89o4J65l00o7K0
5291a15k60M47j62P2J56j46J6J14k79N25l55j68K47p0q4O3K9j03J20j84J78l9
5313Bj17q8J65K04m6l44K28L0j66J01R5p5R8M8k18r2K76j81J55k1j24R5k17K34
5337D2J00l47j5K0K18J42k33p2J38n7n4J49N1k76K07K4J80m20k3M07l1l76P6M2
5361a08M23k88j97j59M05rj43P9j40K32j82M01j53l59K75N6n07L83k57K62J31
5382A45k11J31J54j80j1j36J18L28l31q3O3o7q7L48j50k9j43J2J01L14j45k11
5404g0J02l12K05J44m7J1J24k18L7R9K4j88j54j50N86n2n2m9j39p1J68k5k86K36
$$ y = [-228, 191, -48, -75, 126, -47, 170, 36, -100, -31, -114, 3, -110, -50, -5, 534, -62, 167, 130, -37, -70, -18, -228, -185, 14, 51, -236, 115, 1, -77, 14, 125, -188, 66, 101, 5, -299, 191, 218, 19, -58, 131, 67, 232, -68, -135, -115, -375, 72, -90, -18, 138, -8, 8, 122, -157, 368, 13, -155, 92, 22, -62, 1, 30, -73, 47, -137, 41, 2, -115, -203, -38, 166, 120, -224, 4, 34, -132, -31, 64, -11, 87, 135, -83, -175, 101, -80, 75, 54, -70, 25, -192, 42, 142, -205, -220, -200, 18, 160, -73, -145, -7, -64, -118, 31, 82, -194, 13, 37, 217, -203, -226, 181, 150, -226, -150, -108, 315, 27, -170, -329, 76, 67, -76, 3, -137, 95, -87, 314, 161, -198, 77, 133, -374, 9, -248, 14, 145, -66, 65, 219, 39, 28, -108, 10, 338, 7, -76, -13, -80, -167, 181, 31, 2, -141, -129, -28, 286, 141, -70, 32, -280, -75, 69, 22, 33, 157, -61, -24, 75, 99, -89, -243, -393, 193, 141, 89, 40, -99, -170, -2, -27, -313, -77]
5428g7L6L04k05K41l39o8%M7J6l6j06%L44l68P5q7J83q1J70Q7j20M7l14K90j7
5453B2l61M75k28K50m31K02J78m42L93j91J19p6J02J33m76M91J7k43j24J35M5
5474a0n7J04K04l8l3j06j20J6O7J22j62l25L27P3J8L7j11K37l21K8K1m5O0Q1P0
5499A37n1j20J61k99m0N69k80j08N8j2QJ85j18k75L33o4j81K09m0k7P7K03m39
5522a14O1K76m76J58J96J09j69J21m44L88k1ok06R5k38J73K43j89k2J41j75r3
5544a92P5pO7Q5Q7O8m53L19R2m6J21j75k43K97k75O5J54q2M5K1j52j96K35L2k
5569f0n2N4j49K15m6k86K27O3mM22l28m4J10QJ6j33L46k29p8k05J21Lk27r5J81
5594a70J06j41K68K1n6k00J38K93n9j65P5j24N1r0P8K88k61j55K19k67J57j20
$$ y = [-77, -41, 263, 58, 299, -40, -108, -108, -61, -45, -81, -187, -187, 157, -211, -136, -223, -40, -121, 49, 136, 16, 63, -251, 39, 22, -339, 136, -92, 158, -273, -71, 107, -335, 58, -133, -14, -90, 12, 145, -331, 160, 177, -66, -190, -55, -10, -67, 37, 241, 203, 170, 64, -56, -40, 27, 149, -13, -338, -11, 62, 80, 117, 6, 243, -78, -50, -29, -74, -14, 67, 137, 86, -34, 127, -172, -212, 357, 77, -31, 27, 15, 23, 208, 90, -185, 148, 84, -97, 112, 72, 45, 122, 325, -114, -53, 223, -253, -95, 101, 210, 41, 162, -282, 106, 85, 79, -127, -32, -270, -97, 146, -43, -65, 76, -99, -192, -117, -124, -57, 28, 115, 183, -270, 49, 141, 95, 216, 41, -202, 95, -180, -115, 39, -43, 2, 23, -129, -325, -90, -58, -60, -112, -58, -207, 8, -38, -324, -97, -34, -38, 384, 56, 12, 122, 130, 146, 13, 359, 130, 52, -153, -32, -29, -256, -351, -170, -64, -205, 63, 84, 28, -172, -34, 259, 200, 35, 110, -14, 37, -53, 25, 313, 52, -103, 116, -151, 6, -114]
5616a14O6j47L04r1K60k75j67N37m01L25q8k81J29k58K72k99J76j7P8k22J11P4
5638b8j19J10o1Q8j17L12j19j35K42N8k92r9P5J21R0J05j42l9k30k8K40J0j32
5661i0K88j41n6j95L33J76l67j17J73M6l4J37j75J55j26j67K72r4L33n28L06j37
5683hk0q9J18j43J76k31RK48J3r6N4P5k36L25k37j96J90J26j62p3k9K00J11l46
5707b21L3K01rL50l25q1j5J03j62M4L4J61j47j81K28k26M26r3p5J5j25O1k49K86
5731C3J26j97n2N9l7K29l2j16J36r0P4J16k30l1J13j65K56l44K22j42m1K37k59
5754a35RR9j01l3L04j03j88R0J62k28L4q0J36l0lJ04K38l41K29j94J82Jj29r3
5778g0j49J32N8M5J81l11K33m1j58K2R1j75m2J89m5K20l25K36j10n8R7J43j01
$$ y = [-114, -48, -195, 109, 18, 278, 3, -164, 373, -28, 297, 209, -72, 57, -201, 71, -228, -52, -69, 9, -213, -102, -28, -147, -37, -98, -10, -127, 185, 66, -69, 173, 231, -61, -160, -85, 36, 126, 231, 89, 50, -180, -208, 32, 42, -90, 198, 57, 1, -194, 139, 315, -52, -169, 4, 50, 16, 153, -22, 133, 7, -160, 112, 18, 351, -177, 129, -8, -28, -117, 1, -142, 34, -197, -188, 60, 73, -23, 31, 106, -130, 195, -42, -238, -48, 78, -84, -157, -186, 14, 125, -221, -188, 13, 4, 354, 29, -52, -67, 36, -126, -82, -48, 113, -34, -215, 13, -213, 213, 120, 45, 60, -65, -4, -253, 33, 159, -38, -90, -31, -68, 161, 129, 13, 149, 59, 133, 249, 19, -12, 101, -64, 192, -152, 70, -72, -113, 124, -135, -126, -27, -128, -161, 143, 40, -148, -58, 104, -124, -90, -170, -34, -64, -67, 37, 275, -66, 163, -31, 151, 152, 23, -70, -219, -87, -29, 16, 197, -114, 119, 78, -80, -58, 33, -142, -184, 5, -40, 180, -145, 91, -19, -77, 20, 163, 62]
5801F2J11k95L93m75n2L79o7P3j3J85k13k73J62J2j5j71J38j08K32J9r6Q0N3k25
5825a04j17L29j85K02k25J57J03l8l79K37J39K5j35l5p2J30k40O6p8L24k33p0
5847a99J14L9L75m36R4K35j71L3k74O7O9K4p4K03J48j58k10J15j70O1qQL6K00
5871A21n1j34M95l92nJ17J2k21j20L75j65q5J78m26L01Q3q4K58J01m36K88l99
5893a89K6O7J32j35J63j31J27j51L52n39J82j70J8L75J04j98q2k2K89j80K4M4
5915A06r4N46p00q7K09J43k89jJ85N0j66k5J78j43J7R7k94M40k30nj40K01o9O
5939f5r4N1j77N91l36k85L27l37L13L5k93R8K39j62M7N7r1j9O9O4q7P3k26M17
5963B09l66K13j28m3j49M53p1o7j22J11k7Q4J79j19j83n2p6M45k38M2k60N8o5
$$ y = [62, 173, -122, 271, -204, -256, 123, 56, 129, 116, 301, 88, -185, -23, -11, -26, -197, -59, -167, 65, 84, -12, 68, 121, -104, -221, 108, -77, 125, -100, 57, 160, 122, -257, -20, 119, 144, 9, -26, -98, 32, -208, -142, -220, 104, -129, -199, -85, -46, 329, -107, -13, 222, 51, 84, -190, -123, -54, -30, -104, 99, 247, 89, -121, -6, -176, -115, -123, -115, -79, 121, 70, -64, 431, 39, 34, 151, 163, -58, -178, 197, 32, -53, 125, -301, 0, 83, -1, 257, 358, -78, 210, -189, -163, -96, 36, -99, 64, -67, 60, -91, 261, -278, -96, -266, -248, 127, 231, 33, -49, -71, 218, 38, 62, 106, 12, 558, -142, -229, -20, 123, -166, -167, 18, 68, -98, -123, 55, -88, -71, 26, -268, 172, -58, -63, -203, -2, -71, -65, -159, -108, -285, 306, -30, -315, 12, -325, -12, 23, -270, -172, 67, -95, -48, 9, -82, -101, -32, 32, -55, 18, -208, 209, -157, 56, -72, -115, -264, 189, 118, 51, -71, 40, 13, 97, 276, 157, -26, -78, -154, 291, 53, 95, -165, -107, -172]
5986a72K12K4j43J6k1K0K52l30rK36j76nR0k9J65j13J24k03j35J97K66k17J15
6009A64j41K32j42o4m7k69M31j44J80J6k04K5M6L4n25jM85j60Q6q2k5K15j42l5
6033f7K10p2j40j04K02r7P7n6R1j08K25J48l59m8K6m6l8L70k79j26RR5K02K0k82
6058a47J99K67m31J91K79l13Nl27K51R2k51L31ql70J88l5K06k65k4K52m6J7k43
6081a82P8j09K41J06q3J99N3k7l86r8K67l70M11P0L0j29J60j11J19m26J87R2j8
6104G4j60j50K11J12j80M6L5k02L68k08nJ58k6k44J0P8J71k4q4k32L64k03J32
6127D1J78lk3K6n54K62j3j41K94k54K42J57J05k30j21K15J32n44L83k95N4j3J54
6150E2K04l08N3J61m9j12l9p3J0o0J84j43K38j10q0Q5j68L34l15j9K08j24K06
$$ y = [-172, 40, 64, -79, -63, -84, -64, 188, -142, -151, 85, -91, -96, -6, -35, 130, 17, 141, -62, -197, 0, 266, 49, 164, 23, 255, 113, 49, 2, -267, 164, 20, 200, 216, 12, 37, 83, 117, -408, -409, 76, -84, 2, -80, -105, 110, -32, -67, 143, 71, -69, -173, 29, -68, 9, -47, 44, -64, 161, 309, -50, -98, -72, -118, -156, 214, -65, -191, -182, -87, 115, 135, -147, 52, 319, -112, 79, 358, 45, 50, -277, -26, 66, -185, 146, 138, -232, -44, -79, 127, -138, -162, 90, 44, 61, -182, -104, -213, 28, 134, 51, 250, 303, 276, -110, -208, 59, -311, 100, 170, 200, 71, 231, 120, 239, -187, 0, 92, 74, -86, -236, -25, 87, -93, -47, -12, -214, 154, -54, -59, 99, 73, -171, -161, -83, 88, 64, -20, -252, 112, -91, 41, 219, 216, 193, 219, -335, -73, -86, -227, 67, -187, 55, 212, 317, 87, -34, 181, 313, -231, 152, -143, -89, -102, 52, 256, -52, 1, 162, 113, 1, -38, -111, -101, -161, 23, -120, 118, 8, -72, 13, -155, 179, -136, -155, 53, -71, 135]
6173A35J55n21L12K4l11M8L07j38j90K93J39k43J57j81pJ25j01r4N43o21K26j54
6195i7MK31k99j63K09o0Q5R8j12J06O9p3j81R7M6K55n57L41N2k75Q3L06j79m0
6219e4J74k5q9%o8K7J76j29J4N5k52K08M5q4J4j4N3k74K39J10j62o5Mn3K70j49
6245b9J78p3J02p6j86j36K18O6j5l71O2K21j78J37J71p7k30L36j81J26N4l38K41
6268B2p6N9j85QL13q3r4QPJ73k08lJ93j86K26l80J74OK49j16j90J07j51m6J18
6293e5L5M6n3rJ37k37K33l14O2K63j21J37j23j27o6J08J83K12m42K17j35k73M04
6316H2l00J59ln8L14k36o4J11K5n9p8J10j62L74k11j00N6j05J26o6K60m3j72J40
6340A00Mk67J07Q0q8j24J89N2j22j02K82k95L68j22j80J96k30P8J39j51O5J4k23
$$ y = [135, 290, -231, 81, 105, -206, -158, 149, 11, -179, 114, 253, 10, 167, -14, -21, 104, 3, -91, 452, -169, 57, -97, -93, 138, -161, -324, -115, -175, -90, 8, -104, 2, 71, -2, -183, -86, -40, 215, -342, -1, 51, -224, -141, 165, -14, -54, 120, 95, 6, 6, -62, -35, 141, 12, 26, 81, -171, 37, 82, -2, 12, -2, 51, -223, 16, 126, -36, -101, -97, -150, 120, -29, 149, 76, 178, 102, -84, -220, -2, 64, 49, -322, -260, -39, -217, -80, 91, 14, -216, 120, -61, 65, 119, -219, 22, -54, 5, -180, -172, 141, 58, -36, -28, -21, 152, -56, -59, 134, -52, 174, -206, -32, -26, 223, 107, -83, 24, -127, -173, -55, -20, 26, -27, -36, 101, -136, 97, -217, -155, 108, -13, 124, 1, -126, -192, -84, 99, 311, -131, 86, -49, -322, 82, -218, -59, -62, -120, 194, -42, -106, 5, 30, -29, -107, 3, -159, 215, 4, -96, -40, -145, -19, -85, 175, 132, -40, 100, 104, -163, -56, 24, -64, -188, 1, 53, -69, -171, 111, -184, 184, 62, -118, 78, -152, -74, 65, -86, -21, -7, -230]
6363b30K37K63l22N6r3R9J34l19M17j76l45N23l91L90n08K41j73J53K59j58Qk4
6385D1n1J15l38M39k93L4R0p6K4j9J18r7O5J82j29o3k63R3N2J95p7j06K59j59
6409C6K3Rj20l22J77L74k45J2qK5kl64L74k8L67l06o4J08q6J51nk83L50j30k36
6434a93r3K65k7J2j62K40k87L19J2j58P3k6J55j13j11J05j62K29Q4l84K42J36
6456A56k14O2J2j81J80q6N0m1J38j67l87M71l6L07l52J46m0o5l71M45M0k14L23
6479A76o2k34J36k33K33k59M0K62j9j75K03k9j06N4j29P4K26j58J6j3Rj84Q7J31
6503D6J13j18K20k84P4M8j00J12j39j13j0j27L27j52l83O98j34q5J95l03K68J03
6525B56r9k44Q1p8J5J88k86K01j09k02L39k30J80l0N1M7r9l1M3n2j0Q7j20J51
$$ y = [-230, 7, 270, -52, 4, -89, 10, 144, -175, 242, 66, -279, 244, -147, 243, -265, -24, -197, -44, 215, 57, 65, 41, -10, 105, -233, 206, -87, -53, 37, -39, -15, -34, 84, -13, 52, 234, 105, 42, -221, -128, -76, 119, 42, -64, 195, 36, 59, 68, -52, -374, -197, 177, -68, -56, -64, -39, -41, -405, -31, -59, 308, 2, -62, 46, -40, 111, 106, -177, 173, 43, -193, -286, -21, -48, -36, -198, 42, -245, 74, 86, -72, 1, -25, 130, 17, -94, 11, -151, 78, 162, -222, 20, 156, -58, 4, 16, -165, 15, -71, -21, -62, 76, -91, -478, -7, -43, 264, -88, 58, 18, -47, -418, 27, 67, -147, 176, 114, -120, 16, -217, 16, -243, -203, 59, 40, -135, 68, 39, -67, -13, -142, -68, 158, 0, 16, 3, 12, -172, -85, 46, 159, 41, 261, -23, 51, 99, -1, 111, -28, -141, -151, -278, 49, -103, -486, 212, 78, -7, 188, -115, 153, 256, 157, -87, -6, -84, -69, 119, -167, 34, -75, -277, 62, -168, 12, -18, 33, 80, -19, -50, -7, -59, -69, 18, -102, 49]
6549D9o8P8j59N6J48n29L54R5J05j43K3k97L65K50n13L80j73l10L05%r3J49j95
6572a23R4K41m36J29N1OK46J35n53N13k99L3om9l9j43J37j62O7K20m9r8K05j98
6596g8O6k19J74K60j95L7n6J46L0j31j00L1K42l36K8O5J42j54J43p1j52J97M9
6619A18l49L5K51k81N60l80k85N47m92K25j47J93j21J53J44M5k57n6R9J69k61
6640i0K79K0k37M03l96M2o3K28m10L75k60m1J11k7J85l3j63R1j39J79L4j32P0
6663B6J47n3m30R2J67L17l89j2J63j03L9LJ81k08PM8oK43n9k36qJ42k19K3O1K22
6689A58l58L73k20q0K75l56oJ44K66l76o2K57p5J70j38M4j98J23k9J81M1O8l04
6712a02J70j85N5J18p8P2o0PJ75j91L41k50l04J75Ml3L11j77J2q5L41k14o0o7
$$ y = [49, -19, 59, -100, -44, 104, -425, -71, 24, 129, -14, 9, -288, 77, 327, -186, 194, 21, -289, 16, 16, -77, 72, -123, -29, 212, -224, -95, -44, -38, 208, 343, -210, 303, 4, 37, 31, -18, -57, -200, -63, -225, -158, 62, 13, -85, 120, -78, -12, -231, -57, 203, 8, 45, -11, 135, 165, 34, -66, -35, 207, -129, -101, -36, 106, -48, 95, 24, -128, 69, 118, -231, -196, 55, -226, 334, -46, -331, 216, -276, -51, -198, -5, -126, 27, 171, 216, -41, -97, 2, 171, -90, 189, 209, -28, 375, -21, 21, -42, 186, -224, 151, -109, -150, -39, -66, 119, 86, -77, 14, -125, 54, 88, -44, 26, 173, 120, -310, -218, -51, 266, -123, -135, 28, -75, -36, -33, 148, -60, -53, -5, -11, 232, 173, -63, -71, 71, -148, -125, -64, 158, -200, 173, -47, -127, 148, -208, -214, -70, 196, -180, -242, 15, -60, 110, -28, 16, -182, -59, -88, 93, 134, 202, -102, 68, -117, -62, 56, -22, 50, -10, -3, 172, -19, 322, 72, -232, -57, -53, -86, 225, 48, 60, -25, 316, 102, 42, -25]
6736b5k6L4J85j35p3P5L4l7J58l34J05K51r5K26l05l9K60l03k4m3M41l88K40k57
6760g5L0k53M66j67L1o5J84k05j28J56k10K76J5L2q8j49L5p8PJ69K27l73j28J11
6784a80M24k11n4nJ9P8J0l09J95j69p8O1L06Q3k99J30j25J30K10j71N4Or2l37
6808c24K69J86j15q2J49J64k11l0j05o7K07k8j61P1J27M3n4p5rn1j26NN9M7K6
6833h5j7j32K62q1m1r2N32l39n1n3j22K71k55K53J95j27J16k00j12j8J0R1j14
6856a09j2J03j94K80j85j03M20r2Q4l44L53m15K77mO3l13J09K84q0Nk28l4QK20
6880I3j98J16L0j9J02k02P8N7J5K66k83M0j30K85j73k83R7NK44m38L16M7l9J24
6904A50j56J92l24L28k47J46k15J02l2n4K64q1k8k98M14k70qK15N0j21Pj92J50
$$ y = [-25, -51, -17, 168, 33, -40, 35, 69, 32, 190, -144, -39, 212, 117, 343, 38, -1, 259, -44, -68, -111, 330, -58, 182, -75, -45, -298, 168, 1, 32, -33, 151, -54, -182, -26, -236, 40, 55, 87, -1, -150, -115, -193, -186, -17, 210, -163, -291, -180, 244, 33, -21, -26, -7, 71, 81, -228, -33, -202, -280, -219, 87, 170, -129, 1, -124, 6, 216, 45, 99, 105, 13, -324, -55, 131, 16, -66, 83, 247, 36, 6, -99, -166, 41, 13, -148, -77, 50, 93, 39, -36, -45, -96, -222, -217, -158, -111, -85, -102, -234, 28, -53, -94, -186, 346, 7, -44, -97, -219, 52, -203, 50, 245, 118, 234, 34, -78, -96, -86, 5, -109, -121, -18, -212, 68, -117, -220, 200, 108, 192, -152, 201, -214, 63, 59, 122, -191, -82, 202, 122, 127, -101, -135, -127, 93, -105, 11, 41, 22, 124, -78, 0, 57, 72, 338, 55, 95, -35, 250, 77, -206, -109, -104, 140, -298, 18, 65, 26, 150, -6, 186, -138, 190, -57, 89, -126, -24, -56, -110, 154, 73, 45, -253, 161, -109, -117, 98, 148, 27, 34, -158, -8]
6927hO6J8j26J70j93l4P4M8J8N3J05n2m42L63r0J48j55P6l78K00K54j35j67M5
6951a42J64Jk02J90p9L26k27L1k7j07j10j85N59l94K58N9m1j04Q1j97J55N0j40
6974h1j26O07m18k23O44l47j17K38J16m64K08q3j19q6L18j23J0n6J52R8k42J67
6996G3J11J95k97K44k93n4j71M04k20m6j22M07k18J12k46M1K34k08J85k4j19K1
7018In6J75j86%o5J59j94L98j01l9k13J98j1J49k4l60J94Q9j33k62K06Q0p8L5
7042c0k8j65J40M5j27K42q1j51J34k17L08j60J31j97j07L29k73L47k29K66j18
7063E9J76q2l45J48J21q7k8J44j25K27j74p1J66j37jJ5OpJ46j35O7k25j47K76
7087a3nK14k2%N9k81N9R0p2o3J26r1j4J31k51J23K47l49J99J26j70j2j96M9K83
$$ y = [-8, 58, 76, -50, 120, -73, -107, -33, 15, 33, 86, 191, 139, -303, 60, -30, 118, -37, 39, -339, -139, 115, -20, -187, -142, 22, 23, -179, 11, -68, 258, 31, 62, 35, -72, -182, -367, 192, -202, 56, 115, 74, -30, 51, -146, 9, 59, -81, -207, 400, -18, -241, 403, 56, -61, 177, 293, -171, 37, -46, -165, -251, 67, -56, -46, -102, 50, 148, -94, 73, 184, 379, 82, 326, 33, -21, -192, 212, -8, -54, -176, 231, 13, 125, -121, -80, 154, -54, 131, 107, -12, 9, -47, 128, -58, -58, -123, 36, -158, 240, 139, 100, -113, 85, 74, 223, 199, -161, 33, 122, -11, -273, -67, 13, -65, -30, -58, -223, -83, -38, -165, 77, -4, -155, -21, -238, 70, -90, 41, -156, -263, 66, -207, 140, -89, 177, 59, 235, 153, -192, -44, 77, -10, -38, 106, -19, 208, 34, -37, 129, -8, -9, 6, 12, 5, 151, 16, 83, -142, -289, -13, -18, 196, 174, 174, 233, -48, 11, 101, 29, -34, 92, 1, -13, 118, -133, -10, 237, -112, 87, 213, 43, 31, -165, -116, 167]
7112A67k66J28J44r6M0N8l47K50k60j3mL0J55k00J17N1j42K73Q4l34Nr3K34k30
7136b49K45q6J29O0l65K65K25m48L48k1J21k0n04M25m5Nj26R0j48k21M68m8k5
7159G5j27M9l4R2l6m7J16n5j10Q2p9N7P6j79K24J27k12k64K88l78J19K69j16J65
7183A02k23J87j0m17O42k45J7J2j15o6L20m53M32R1m42J49oO1j36J81j06K71k99
7206e3k7J35K63k76L06o07O4J34k2J02m0O7k82M77l90J29m5j03L83k49J01J05
7228A72n3l17L1M7j21L72j2k90K17m37M74j41K64l40J94Qr0J18j94RK66k41J24
7251F0j5j32K43n09M61k69o1K57J15j69K3j61J18R2O8p6L9k4j66K6J04j01L01
7274B24k49K5O9j26J07l13K2N0K04J44%m4k3j51J68k15M3J85N9j86j8j35N26l06
$$ y = [167, -99, 29, 173, 77, 117, 175, -172, 78, -182, -195, -199, -169, -14, -214, -97, -46, -188, 85, 169, -165, -160, -253, -19, -249, -4, -90, 39, 99, -266, -1, 224, -224, 124, 103, 224, 204, -300, 125, 80, 85, -41, 49, -99, -320, 148, 100, 75, -52, -3, -37, 55, 19, -28, 88, 33, -77, 5, -74, -17, 59, -120, 104, 231, 19, -245, 43, -335, -216, 53, -63, 102, -121, 66, 56, -361, 281, 36, 53, 65, -50, -116, 204, -249, 183, 274, -168, -19, -25, 36, -100, 81, -25, 246, -53, -80, 55, 318, 42, 348, -259, -195, -61, -83, 19, -21, 46, -236, 241, -149, -20, -65, -168, 215, -34, 67, 172, 119, -198, -167, -120, -241, 131, 119, -171, 46, -391, 83, -58, 206, -134, 60, 68, -22, 96, -98, -89, 177, -64, 60, 45, -87, 156, -353, 108, -161, -222, 35, 150, -19, 4, -157, -39, 53, 121, 45, 84, 60, -106, -80, 24, -77, 224, -25, 0, 69, -57, 50, -263, -241, -191, 13, 157, 157, 113, 90, -61, 107, -108, -65, 120, 179, -7, -25, -160, 366, 60]
7298F0O4m7j58j5MM1L9lQ9r4k8K2k72K13J09r7K51n27J05L29l08J75M09l50r5
7323h4J69J47j61K41m28K23L8K3j76O8J38m6Q3Jr1R0j89l12K16P5J54j4k65J14
7347A4J98R6l44p4J59n3o9N7k76J58L58k50K76j44j12j01K6K70k35Q1j60J81k03
7370a47L8Q9k5K53j67m51L41K00k4j29R3J83j37l90M17p1N7j74J91J03n29J14
7392a65M6J45o0j61P4K31K5n0J03J91k53j30o5M2o3j25L46j7m3l9L26j31j43R5
7416A79l36J83Ok80J58j0Q1Q4j36J59n9k82K96j7mk00K02Q0j14J01J44j48k15
7439a28Q3J58p9k5L03m56J51q7J64l00L15j37j0K65k82j14j09p1J77J29l1K4k83
7462c43L90j5k63K23K9Jr1j59J65L5M0q3L45m75L13k29k00L01j24K07p6l9J42
$$ y = [60, 124, 77, -81, -96, -92, -51, -12, -15, 74, -20, -48, -26, -298, -85, 24, -73, 178, -349, -244, 85, -223, -48, 361, 11, -84, 85, 232, 71, 312, -116, 107, 145, 168, -8, 60, 198, 152, 235, 236, 145, 235, 46, -266, -50, 25, 179, 165, -100, 14, 212, 308, -36, -110, 49, -4, -73, -16, -292, -134, 224, -26, 250, 106, -6, -107, -81, 189, -46, 35, -125, 56, -147, -109, -20, -45, 208, 41, -410, -69, 131, 107, -22, 71, 254, 117, -273, 144, 73, 130, -44, 147, 250, -279, -165, -119, 26, -34, -195, -121, 110, 135, 85, 188, 379, 126, -4, -69, -27, -90, -215, 131, 114, 71, 32, 358, 227, 84, 179, -157, 26, 32, -248, -90, -100, -19, 65, -71, 88, 29, -253, 43, 26, 22, -178, 24, 104, -10, 91, 235, 87, -128, -45, 113, 34, 9, 312, -144, 7, -80, 84, -216, 99, -38, -48, 217, -65, -179, -288, -359, -182, -53, -84, -60, -343, 47, 32, -231, -8, 21, 22, -69, -228, -63, -28, 12, -71, 274, -201, 112, -117, -317, -16, -140, 67, -9, -48, 94]
7485I4k40K50k34M27m68J77KK71j29l63j68L24Q4Q2L8j67n8J76Q6j48k49L0K13
7508C0k2J22m41J91J20P0m5j3J41k1j17r7l3j39J95P1p9K08j91K66m48L70Q9n8
7532A69m57J74N4%j07Q7N9n5K68n9l01L72m10K77J55l13j08L6Q6m7J21o3o2L06
7556A82k61K49K49l78j42L33p3Pp6L2M7j49J37k40N0mj5J02J52m3O0k32j8r5l6
7581a62J77L0j18J24%M3j82O3P9j28J34M2J60L1m05J52j59R2N4j9j4K4j58o4J36
7606f8k41J03K44j80q4L26r8q6k4K13l6j94J29L7j1q2J12l41L61j11L7r6N3J77
7630A40j41k1J89k72J58j7L46l63n0J08l11M21k01M5J17l38K71J67j54J73l96
7651a29K94k12J76k02R7k27L56m53K72j70L5L25l34J26Q3k04R9j21L69Q6j71n2
$$ y = [94, -146, 104, -130, 297, -171, 6, 8, 279, 150, -213, -381, -57, 27, 109, 147, -20, -78, 98, 184, 36, -213, -183, 30, 8, 130, -311, -120, 0, 70, 25, 12, 153, 132, 15, -82, -115, -254, -59, 12, -67, 141, -50, 216, -232, 138, 227, 169, -288, -114, -60, -60, -167, -80, -21, -76, 192, 133, -168, 204, -206, 71, 226, -87, -195, -159, -73, -120, 1, -62, -124, 182, -79, 170, 419, 41, -101, 232, 159, 166, 90, 122, 169, 20, 157, -83, -33, -37, -52, 50, 202, 159, 219, -13, -31, -126, -162, 15, 45, -73, 51, 51, 94, -88, -25, 54, -74, 60, 102, 262, 293, -112, 40, -119, -27, 27, 8, -6, 18, -140, -204, -68, -309, -206, 38, -142, -226, 100, 2, -84, -108, 105, 69, -125, 4, 41, 30, -52, 60, -281, 80, -31, 6, -90, -37, 140, -1, -22, 167, -105, 53, 36, 382, 19, -31, 77, -234, 187, -14, 31, 148, -190, 81, 248, 94, 267, -129, 165, -47, 129, -73, 24, -203, 153, -300, -28, -198, -163, 162, -172, -46, 37, -167, -68, -189, 180, 266, 95, 43]
7673D3l0j1k91L2K50j45O5J85q4K3p2j05K5J23k98K42j47J18K8L0k08J26K88k49
7697f2l3J81r8m4j1j17K44N9j13K3o2j49L63l80o0K68q5L1j20K02o9Q5j16j09
7721a72J18J73K17j56L0j07k41R0K46k21j21K1J88k8k82j9R2L02M3J56l97j14
7743a82J85J73k23J00m7n5k80J84K23m0j30K1J14j19j9J57k29L15j51k40K68j78
7765a53K07j29K42p6j04J85n38K79k5K72m4k5l8m4j96J49j32J15o3n8O1k58M55
7788H2k21M7J18M0j74P8J14o1J5Q7l42J29Mn0L02j73l92M03jK53m96J33K2nn3
7813a41J13j8l00L48M6L8k9j94J8L07j47O3j87P5j14J54j21K68K8N0m11J23M60
7836D29n41j90M38j32R6m34M36j26j42K31L1m5J05j20j57p5K82J12k36L0k7p8
$$ y = [43, 13, 2, -289, -257, -7, -152, -87, 98, 14, 37, -35, -140, -115, 8, -290, -48, -195, -77, -49, -19, -227, -101, 187, -62, -95, 86, -12, -56, -67, -184, 60, 119, 6, 29, -33, -182, 181, -199, -259, 9, -76, -45, -165, 37, -32, 53, -63, -172, -54, 119, 336, 180, 210, 103, -138, -48, 198, -23, -144, -123, 65, 37, -245, -264, -172, 130, 173, 329, -68, -182, 3, 176, -47, 53, 6, -49, -329, -145, 78, 38, -92, -71, 43, -76, -95, 62, -167, 148, -3, -243, 25, -153, 54, -75, 167, 91, -13, 172, -366, -87, -112, 160, 116, 91, 53, 9, -187, -38, -170, -55, -118, -176, -115, -373, 82, -139, -92, 26, 66, -108, -30, 84, 23, 38, 125, -217, -88, -84, -134, 168, -5, -397, 6, 5, 258, -238, -105, -83, -88, -141, -28, -46, -346, 2, 48, 86, 57, -137, -119, 188, 41, 104, -83, -8, -122, 32, -89, 179, 207, 257, -154, -31, 429, -112, -302, 136, 4, 100, -334, 102, -24, -166, 65, 96, 51, 156, 36, -121, -196, 86, 198, -38, -8, -35, -113]
7858a13R5j32j34K17Q8m20L56O5L2r9j07J78n5p5J79j54M0n5l4K17r9j70J7k21
7882c84L74p7n2K98m43L01Q7O1k13J30J22j90p0J94n1k63J14o0K87k56j33J19
7904a05J96k70J59N4l1o2l82M79pP2j65j21K99r6q6L38l24j90R6PQ2O8k3O7k16
7929a61Q8j31L66k14k12M47M3j61o4l10L98r4M2J41j71J98j42l0Lr2l4J33J79
7952B22j03ml79J68L9j13N38l45r3J92k84L41m33J15M7L53m94Q7k1J67Q3k04n4
7975a75l6L25J57n25M91j13p2k11j30K08K38r8n6k66L54K5J9j03j48K13l11J87
7997b7O7K0n1o2J28j87%J89Mok77J45Q9m4m5mJ17k03J7J62M0k34K01j20k28K76
8023c3M35k39J34p04L46K81l19o8J56q7J27j05j49O09k85k03N9j08M5J91o7k3
$$ y = [-113, -18, -150, -284, -67, 21, -399, -43, 22, 54, -45, -152, 26, -29, -104, 75, -79, -39, -94, -128, 89, -10, -180, -163, -384, -10, -87, -139, 159, -284, 17, 104, 165, -48, 82, 204, 14, -56, 138, 87, -176, -62, -122, 165, -91, -224, -105, 91, -179, -20, 34, 3, -59, -441, 38, 31, 103, -62, -183, 116, 20, -66, 272, -52, -242, -146, -139, -57, 11, -12, 55, -161, -73, -204, 162, -52, -264, 183, 226, 65, 1, -309, 89, -5, 37, 178, 7, 205, 63, 33, 36, -56, -90, 43, 222, 119, 115, -264, -96, -57, -170, 368, 23, -70, 122, -162, 179, -254, -139, -92, 261, -233, -146, -167, 0, 83, -121, -175, -211, 114, 271, -254, 237, 124, 52, -159, -289, -81, 157, 59, 3, -263, 91, 116, 135, 32, -116, 97, -214, -27, 40, 60, 9, -53, 75, -112, -112, 77, 81, 75, -202, -57, 32, -12, -57, -61, 56, -147, -130, 32, 72, -162, 39, -81, -309, -33, 402, 163, 297, -407, -61, 220, -99, -167, -11, -98, 29, -76, -225, 384, 99, -104, -45, -153, -108, 83, 16, -7]
8045gj3J93k95J06O9N6j42j24J47q8m2J91K1J33k79J30J32m26M45m90K82L97o86
8068b90K43p6J41o8O7j31L2L13m86n3K9L05j40q0J22M30k18m51K12K06k15M1j42
8091b09K21J14j39j19J62k21P7R8M01n57O8kP6O4j67R4N2m38L42N4j97K17J41
8114A32j81N2j05Q0J36j95L09j49k05J89O7k62K15N8k7k5j45K52k36k40N00O4
8136B84n60J80K67j36k77J44J16r2K25k48J79l73N39k38Q5m40K86QK30k51J18
8157D6J67k67J01J88k53M3j06K70j94J61p9j57K0L8j44Q1o2J64k33J87j50l1J74
8180c6K06j34l00K56l8J42l78J74J99J58k51
$$ y = [-7, -20, 173, -122, -16, 53, 109, -33, -157, -10, -98, -140, 51, 72, 205, -74, 56, 188, -238, 207, -283, -1, 396, -290, -47, -123, 18, -50, 17, -114, -82, 231, -255, -308, -279, 26, -114, -194, -72, 358, 140, -311, -99, 107, -108, -67, -209, 12, 126, -13, -132, 30, -191, -114, -16, 385, -172, -104, -106, -30, 34, -133, -39, 13, -425, -83, -29, -226, -9, 132, -49, 3, -102, -22, 114, -81, 228, 79, -126, 63, 130, -132, 83, 141, 114, 89, -56, 196, -40, -280, 220, 284, -276, -96, 171, 35, -242, -98, 18, -74, 151, -97, 82, -291, 248, 10, 95, -345, -59, -51, 179, -72, 46, 213, -54, 47, 235, -18, 25, -81, 189, -5, 156, 77, -80, -60, -22, -166, -85, -147, 17, -216, -29, -179, -210, -36, 170, 36, -264, -8, -46, 96, -282, -108, 91, 249, -2]
8191b
$$ Imaginary data points
##PAGE= N=2
##DATA TABLE= (X++(I..I)), XYDATA
0@%%%%%%%%%%Qj6J6j6K4l2M0m9N7p2Q8j04J27j51J76k08K40k78L24l72M23m82
32b57N51o27P08p98Q95j001J120j254J398j554J727j913K116k339K584k849L138
49A645l457L809m198M627n104N638o235O911p687Q584r633J0882j2401J4292j6719
64i046J9971k4577L1655m4039P1883k49974L2716L42689k93085n1029K12782K6651
76F6597j20764J33798N5406r2285p564P3015o0279m1882J0809j3284k9869M770
88b1532k9939n273K3365m922j4426J9307k0306O642Q0615J4800p3820K7127P9342
101H0980k6260m1612M3408P747m8345j4855m060k9268oP510j4518P298P715k7068
115e1334K3652P4195j647n2638J5676L8404r518o514N13l6572j9016L1521M331
$$ y = [0, 0, 0, 0, 0, 0, 0, 0, 0, 0, 0, 8, -8, 8, -8, 16, -16, 24, -25, 32, -40, 48, -56, 71, -80, 96, -112, 128, -150, 174, -198, 225, -257, 294, -333, 375, -423, 472, -529, 591, -663, 735, -819, 908, -1005, 1111, -1228, 1356, -1493, 1645, -1812, 1997, -2201, 2426, -2678, 2960, -3275, 3636, -4051, 4533, -5100, 5782, -6619, 7673, -9046, 10925, -13652, 18003, -26036, 45847, -204127, -171411, 171278, -121807, -172836, 39946, 66597, -54167, 79631, 135037, 42752, 35188, 108203, 47924, 6042, 16851, 3567, -26302, -21532, -51471, -56744, -33379, -38301, -52727, -33420, -53726, -47084, 33531, 48331, -25489, 1638, 80980, 54720, 13108, 56516, 64263, 15918, 1063, -2997, -32265, -32271, -24761, -39279, -31981, -24266, -51334, -27682, 46513, 44866, -7772, 7904, 46308, 36790, 30276, 30789, -5783, -24799, 6722, 11053]
128A1053l5120p73K2333j1616j2855K4607J9333j5141q616J6816M407j3222N989
141G195J5976j3068j9291R917O862j6080k431Q928j3202j0258J6654O470j1017
154a3345O456J4689l123P09J1995q76o227O562N89j2777r568j98M138P76j2031
169a2231j3992Q254J5663j009m893L000K256O272R885l026p572Q210L703j1065
183C455r60P589p705q768M107j385o900N723L848q022R55R914j220j879P317P12
199F781n768K981K865n480L6K491n720k651N371J10n444J966L384k24j59j441
215i02j969M091L611m862l823M060K455j733k24j549j640L736R05n528q71M738
231D95q45l388L268K778j740J203K980k591n83K852j230m462K2K02k849j141J600
$$ y = [11053, -24067, -24840, -2507, -14123, -26978, -2371, 16962, 1821, -6795, 10021, 14428, 1206, 7195, 23171, 10103, -9188, 729, 7591, -8489, -10920, -1992, -15194, -25452, -8798, -2328, -13345, -6889, 7800, 4677, 5386, 17381, 16505, 10278, 16840, 17429, 4652, -4916, -5114, -976, -200, -12231, -26223, -17969, -2306, -3315, -8208, -5208, -2952, 3320, 13205, 10179, 2607, 10817, 14520, 3455, 2495, 10084, 2379, -6389, -2282, -3667, -10567, -4844, -996, -9018, -8063, 1851, 631, -1248, 6069, 6781, 1013, 3994, 6859, 1379, 1415, 3906, -1814, -4465, 906, 1016, -4428, -2462, 922, 698, 539, -902, -2871, 1220, 4831, -31, -3854, 206, 2661, 928, 704, -845, -2485, 1251, 2156, -3372, -4243, 495, -350, -3738, -470, 2308, 568, 1771, 4751, 2160, 1577, 4429, 3199, -1263, -1241, -1039, -3888, -5029, -3429]
248c429j95K1K477J132JJ959J737q95r46J084L89k016k334K32J038j5k099l30
266b189J883O98j406r09M52J219L11j809r54K359K081j631m83K651J313j297m43
283A846J18n34r86o99r51j140J45N21o20L29J530M45Q6J207k81l34N67O31j517
302C63j046J128J82q88o37J131O91m01n34l37P17O2j079j423N57J451n24j107
320a694J204J712n5n52j2J201K82j201o67j46N3k32j004o15J118o4l16NJ041K49
340C07j79J56k4P0N8J74l63K18r4J84R9l35l48J10J99l89l09o03O92N6o16L19
362f18O52O70o42j75Q20P61n49r27L3Q04k85r43k19J40O98m98n95M50N16K28r60
383f39M73P08R3m75NK10l8n19K31P3k30R8M3k65k60L90O2Q4R3n9L68n4ol47k80
$$ y = [-3429, -3624, -3603, -1126, 6, 7, 1966, 3703, 2808, 1862, 2946, 3335, 1319, -1015, -783, 255, 240, -1859, -2189, -306, 392, -1014, -1923, -1471, -252, 59, -1750, -2704, -345, 1736, 105, -378, 2273, 3586, 2289, 1846, 1964, 1430, 444, -255, -1206, -2346, -2201, -1680, -2300, -1971, -441, 4, 90, 1297, 1016, 682, 1249, 1880, 363, -683, 445, 627, -261, -898, 233, 924, 523, -11, -348, 369, 431, -648, -2071, -1514, -63, -587, -1694, -490, 1222, 1167, 615, 603, 1804, 2086, 885, 218, 72, 125, -107, -1111, -1726, -608, -672, -988, -983, 58, 307, 128, 284, 260, 330, 388, 562, 199, 417, 323, 507, 606, 271, -77, 33, 232, -157, -466, -1069, -377, -321, -937, -618, 34, 704, 62, -113, 707, 1468, 919, -8, 25, 829, 544, -399, -618, -478, 220, -278, -873, -423, 93, 321, -639, -166, 542, 635, 160, 165, 375, 337, -182, 49, 122, -108, -10, 33, -232, -492, -102, -40, 44, 137, 78, 446, 392, 386, 39, -241]
408b41K02J97j56l80J65L86k69n00L26N88n07k92M85M85K1m50J91R3K00j30n12
429i8j59L08K98q63l02N91J22l25j64O46l92L55K56M2M4J16O54o52l73L11k36
450A79l08l25L19p72K72K14o4m3L85M55k73p8O19o0o6j79J08j72j90m0p6j22L53
473A36k79n3m19J89L56n61K2O23M23q19Q19j53J14j38O4j84j91J97o4l51J18J60
495Ij90l76L94L27m12L60M1J14j91J30O2j38J8R0k30k72j24L71m9K3m7o0m5j13
519c08J79j12J34M88l07k93K17M77l38k44J25J81m52L3L73k49l91L84j67o1K67
540f4L10l45K26K03m05K19K45o1r0m41K20pk99K82J63k45L9p2K16r6k01J15M13
563C25k78J71k85Mo4N34k76l8P2k37O6m10N43k83J82k2J28j47k74J41q2J84q8
$$ y = [-241, -39, 158, 2, -378, -213, 173, -96, -596, -270, 318, -189, -481, 4, 489, 510, 60, 251, 344, 544, 414, -98, -257, 51, 349, -514, -816, -225, -103, -428, -592, 54, -338, 17, 273, 315, 359, 475, 1129, 477, 104, 415, 179, -129, -454, -135, -907, -635, -421, -485, -528, -143, 312, 39, -39, 580, 520, 454, 275, 383, 211, 21, -19, -95, -217, 136, -143, -196, -615, -426, -70, -631, -609, 14, 437, -382, 437, 284, 398, 260, 324, 140, -51, 146, 82, -269, -151, 9, -181, -557, -163, 164, -248, 112, 153, 267, 76, 206, 268, 130, 148, 238, 8, -264, -388, -17, -66, -43, -90, -150, -195, -308, -129, -241, -107, 381, 74, -219, -2, 475, 137, -107, 18, 199, -253, -220, 153, -96, -487, -103, -270, -331, -64, 246, -99, 127, 330, -75, 144, 389, 328, 238, -203, 17, 10, -289, -7, 156, -89, -50, -122, 94, -2, -203, -88, 325, 47, 218, -67, -63, -127, 407, 131, 93, 165, -72, -6, -416, 127, -156, 26, 4, 132, -15, -289, -148, -230, -46, -134]
586a34r9Q2J46LK25k10l6J45j86L98k13l14K83j1J32o22L16O5L6j59R7k03K93
609C4j73L20M1j86r2M3q3Q4k16M10j03l35N89k85p2o1o9K81k61o5K79l29M40j68
633B3J00l07L33Ok38M8j47L42l01K22L7k27j95K72mj86K82j4O6k42K7J39J06j57
657a5J60k28k64K38j4J08N4j51K39n6kj09N7j35K39q3j72J28k38L72Lj19k36K55
681C1r4q4M62l20K13L9k99J65j7j51K39k28k0j76K19PK09l54J54k9K91j07q9j21
705f0L2J4q1K19j29L7q0j81L0N6J39K2r1N5J19J70l24J69N3r1J79k57m18L66K5
730b7j43N16o20M33j88L47k64p6J97k46J22o2K0j9J4j71K97j66J56k50M7m7K56
753A26m4r3K21l66L9J99p8J49N2Qk78J96k98J12J1J17j4J16k17k00L29K31l08
$$ y = [-134, -233, -151, -5, -2, 223, 13, -23, 122, -64, 334, 121, -193, 90, 79, 211, -411, -95, -30, 6, -153, -56, -259, 34, -139, 181, 222, 36, -56, -13, -96, -12, -228, 182, 79, -256, 333, 48, -24, -85, -154, 127, -134, -199, 80, -249, 191, 23, 123, -184, 149, 155, -83, -35, -182, 160, -141, 81, 118, -109, -304, -32, -36, -222, 60, 46, 112, -130, -103, 36, 142, -15, 145, -83, -347, -109, -123, -15, 39, -112, 127, 71, 69, -40, 17, -118, 121, 38, -134, -6, -244, 128, 131, 12, -224, 31, -63, -147, 315, -5, 208, 247, -52, 113, 96, -55, 184, -44, -64, -240, -21, -14, 195, -159, -5, -34, 257, 150, 61, -60, -28, -14, -95, 124, -5, 32, -48, -229, -199, -143, -4, 18, -73, -18, 101, 271, -53, 116, 169, 78, 257, 0, -418, -52, -27, -170, 346, -274, 159, -29, 318, 54, -22, 175, -71, 51, -11, 9, -10, 4, -167, 130, -36, 120, -130, -83, -130, 126, 82, -11, 210, -156, -117, 82, 4, 153, 205, 213, -65, 131, -167, -55, -44, 73, 59, 175, -42, -242, 87, 318, 10]
776A0Q2L51n60J42L0R9p1q4n4K35j47M8o2J45j08j42o4L43j45j27J19j1K25k86
800c2K07k39J83J09l18lJ32J3J1k56n8M43k07N7N3j33J5K78k56k14J33j42L01
823G7r5Q7j23r4J57K29k0k79Q5K76N2n85R6q2L08j00l06J54K55j15j0RK11M6m4
848A89j85k9J47qJ9j08j51J06j2KLJ17j31L24l38L2K39j88R6j16M7J23k27rN0
873hQ9n07L98n1M43m12J89L7j95J2MJ6K74k67q5K55k70j14J82J88k44J73j57J23
897G3J44k21K37m69j9J96P1J56k26N2Qo6l4m7m5J72k0J25n5k00K56K5l42K71q3
922d1k29N55k8j91K16j52J31l89l8J94K4J12l47R0J85R4l52J41j61K12J64k53
944f3j00K66n4R5j84L06j93O9n2J3j70K04j49m10L57j11j06N39k97p3M01l32J78
$$ y = [10, 92, 443, -117, 25, 55, 154, 83, -1, -55, 180, 33, 81, 19, 164, 56, -86, -150, 193, 48, -79, 40, 29, 254, -32, 175, -64, 119, 228, -90, -93, 39, 52, 63, -193, -251, 192, -15, 42, 95, -38, -23, 255, -1, -215, -82, -224, 77, -18, 69, -54, -148, 9, 238, 218, -61, 24, 300, 352, -233, -137, -219, 89, -11, -317, -163, 92, -23, -33, -24, 187, 233, 189, 4, -25, 122, 114, 133, 25, -126, -20, -32, -30, -27, 90, -41, 283, -55, -23, 216, 28, 124, 8, 55, 178, -49, -58, -8, 81, -426, -28, -79, 364, -48, 141, 178, -17, -5, -1, 15, 289, 22, -63, 192, -78, -192, -10, 178, -66, 107, -50, 73, 217, -4, 233, -236, -255, -59, 12, 168, -58, -6, 2, -64, -98, -145, -190, -18, -38, 87, 32, -168, 88, 113, -229, 42, -41, -270, 285, 257, 66, 282, 130, 261, -128, -166, 28, 52, 164, -183, -93, 92, 186, -166, -25, -186, 26, 190, -63, -163, 103, 49, 144, -40, 266, 73, 142, 90, 103, -67, 137, -12, -422, -65, -176, -282, 257, -40, -113, 288, -44, 134]
967A34Pl26K14n2l4J91K09m53J22j55N41l23j26P1P1r1p8k80L50l02L56J29m06
990b31J88J26m8r8K18M0j03j70N3N7J76j79J09j74l7J13L03j77Lj66Q3n64N18
1013D0K2J38l31Q1L7j7r9K56j65q5K72k15J94p2J26j87q4K28r1j3J44j92K0J51
1037A58k83M7K41j45J70l70K05J69l17M8l28N60o2j27m2k89L50k21L57l66K06
1058c9J29j74M0kM8q1R7j31k0M78l09k30L44M9k69J00K34k03J22j80p7K55j48
1081C3q5j87K41k46L41P8M2l33K21q5L6l08J70P3Q5NM0j88p3K86L68n38k8L11
1105B59m61K72k09O4j16R1r1K89l73L32j63%J07NL87m55O3N7k41j04L40N6k53
1128a44K74J4j36j29J01J40j06K33k51O0O0M2J13j00l55M76j63m2j8n3N8N0j56
$$ y = [134, 141, -185, 29, -23, -57, 134, 343, -110, 12, -143, 398, 75, -51, 20, 91, 0, -78, -358, -8, -310, 46, 175, -231, -43, 83, 35, -63, 155, 195, 92, -78, -25, 32, 208, 29, 138, -36, -73, 40, 343, 166, 169, 3, 86, -478, 40, 62, 200, -131, -50, -13, -30, -129, 127, -38, -123, 149, -66, 128, 56, 182, -5, -89, 139, 48, 35, 179, -13, 7, 158, -125, -78, 163, 18, 188, -182, 23, 192, -125, -77, -405, 155, 93, -34, -76, -365, -15, -236, 121, -245, -39, 90, -84, -44, -46, 2, -79, 18, -113, -133, 345, 36, -194, 150, 199, -70, 30, 264, 61, 183, 3, -74, 181, 33, -52, -239, 2, -244, 97, 175, 217, -116, 105, 20, 56, -252, -82, -9, 76, 81, 121, -67, -140, 146, 514, -24, -52, 259, -202, 70, -139, -75, -191, -100, -191, 98, -275, 57, -106, -106, 1, 6, 393, -62, 1, 58, -183, -287, 53, 109, -144, 130, 144, 8, -121, -20, 120, 14, 247, -4, 56, 116, 158, 271, 171, -184, 292, 129, 87, 69, 16, 74, 124, -32]
1151c2J40q8k93L3L67k5j93P2J8j09mk7p5N6Q8L3P3k27J78K0kl9Q6j76J45j0j32
1178a23J40K55k85p6J94k25L29l63J8K55k40J36J63j49j2j44L43r6j87N2j8j82
1200b15K71k45mM42j94j92L27L2j60jj67J84j95J13J29k12L9J09O3o2p8nm8J70
1224A01j51KK8q2m4K21Qj9J36n0p6q2k42J85K0K71k58K14l32N20l80MJ87k44m2
1249a05rK69j83j72K39o7P5k9p2P6l1J14K6j3j86J97j01P1o6k49J0K7M8K39j7
1274I1J3j56o8L63ll67K65k64J30J19l55L16j00J18k69K62N5l87L53k23R1lR5
1297G6r4k4K69r3l27J08O5p6l5J24J73k29j66L65J17k4j05k90K18j45n3K6J82
1320F2o7j96K66j63m8J27L0J75km17K75l54K47J06K0k09N2K77q9p9L54m88J91
$$ y = [-32, 108, 20, -273, -240, 127, 102, -91, -19, -1, -110, -114, -141, -216, -160, -72, -39, 34, -193, -15, 5, 3, -36, 50, -126, 19, 9, -123, 17, 272, -13, -89, 105, -120, 209, -154, -136, 119, -121, 15, 178, 29, 17, -127, 216, 120, -67, -15, -33, -215, 56, -189, -193, 249, 55, -137, 190, 222, 62, 61, -106, 78, -117, -4, 125, -87, -48, 61, 124, 62, -16, -21, -69, 101, -50, -48, -20, -102, -146, 75, 83, 64, 200, 150, 74, -8, -250, -65, -45, 226, -32, 182, -150, 370, -10, -6, 181, -63, -105, -114, 155, -28, -200, 39, -28, 47, 18, -54, 22, -9, 105, 131, 118, -68, 129, 28, 99, 33, -216, -206, -179, -131, 108, 91, 104, -52, -120, 243, 240, -127, 138, -126, 4, 123, -232, 84, -16, 102, -167, 95, 150, -237, 116, -107, -16, -19, 76, -18, -42, 227, 134, -193, -85, -20, -96, -131, -7, 166, -63, -229, 136, 253, 229, 124, -166, 52, -93, -146, -120, 62, -5, -201, 65, -98, -146, -19, 11, 186, 184, -233, 42, -312, -65, 41, 61, -148, -96, 181, 92, 13, 367, -121, 70]
1343G0j57K07M5jk06J49k32L4M60l84j0Q9m9k06O5J75kl65N3M15k73l6K58j09
1367a0J10r5r4K14p0o8J85l48M23j44k43K13o0m7k16N21j98l1l31J74k06J95J08
1390a8o0J5j37qR2J17m5K91k58J07j11R3j47JO9j06k38M72k87J78k1KJ41l91L66
1415A17m2J15k45J96j73p7R6j25J26m1l96P96j22n23K50j36J5R6k43J30J24J4
1437d8n6J42j05K22n8k94J49J42j03J80l08J29J19j63qQ0j18K33o4p6m2K21j92
1460a8p1j0J44k5%j93L4J83p6RP0Kl48K86j09J56K8j53J58K7k47K45n7k53K80
1485F2K09n10J28L90M4k7l99L22l73K80J2j80Mm1k3J83J07j93J36j19L2L4R3k91
1509a20j2K30j00K96j70m55M80l11L81l47lj35K96j03o7L51l67N3p0L60k98J37
$$ y = [70, -87, 120, 165, 164, -42, 107, -125, -91, 369, -15, -25, 64, 15, -191, -126, 49, 47, -318, -265, 150, -123, -159, 99, -10, 100, 5, -89, 125, 55, -13, 172, -176, 247, 103, -140, 73, 13, -34, -250, 271, 73, 42, -289, -115, -321, -126, -18, -78, -63, -200, -208, -116, 1, -44, 247, -11, 96, -15, 78, -69, -68, 1, -105, -343, 129, -158, 20, -1, 1, 142, -249, 117, 75, 190, -55, 141, -32, -109, -13, -138, -12, -53, -449, 347, 225, -298, -48, -184, -169, -73, -316, -186, -62, -48, -104, 38, -67, 155, 97, -197, -48, 94, -9, 171, -137, -8, 111, -52, -60, 20, -98, 135, 71, -5, -47, 174, -18, -89, -99, 45, 20, 20, -173, -139, 44, -32, -23, 47, 49, -299, -13, -122, 34, 62, -91, 67, 94, -153, 92, 35, -218, 62, 271, -239, -111, 279, 323, 296, -103, 219, -154, 126, 138, -42, -38, -79, -102, 81, 188, -5, 131, 12, 44, 78, 171, -120, -132, 98, -2, 294, 124, -331, 149, -162, 219, -128, -131, -266, 30, -73, -140, 211, -156, -103, -173, 187, -111, 26]
1531B6q1j33L49k34JK04m2j4N8k84K97m5lk80K58N1k63K2J76k48M3L8L03m07j5
1556b23J93J36J43l19K11l76L42J2m9l61K70k10L01n0K0k81Q1J37q6r8J66j4K41
1579A86l76K26k50M6L83l39k9M2M5j03J61q8L73j26j74q7p3K17J07n9p5R0m9k3
1603B5K61l63L85l41k34M94j89o6j6J30l01J98j64J85j96L28Rj87O3N3K56k74
1625E6k40M7Q8J8R8J08k69J02Ll2J22n25M56j26R3O2j55J92l05J92j62J49k9q9
1649a46M1J06j60N4R6mK0K99k91R2l80L65k03J79j84J49m9J83k04o9J93k28QJ79
1673D6j25k65L82j36K72j09J18m34L99n11M99j49J35k98n8L93J26%r4l64L05k5
1695A07k18J28qj1k13J98j62L10k98J78p7k2J1J7l0q0PK00q7L62k39J47l49L23
$$ y = [26, -55, -188, 161, -73, -72, 132, 90, 76, 134, -150, 147, 102, 99, -181, 77, 128, -135, -113, 63, -185, -142, -104, 199, -208, -223, -30, 106, 249, -70, 141, -235, 107, 119, 70, -291, -21, -231, 70, 20, 40, -241, -160, -23, -109, -207, -41, -55, 186, -190, 36, -214, -168, 215, -124, -153, -111, -66, -169, -8, -96, 277, 151, -23, -110, -183, 34, 141, 82, 7, 97, 48, 25, 286, -77, 308, -33, -267, 227, 38, -28, -44, 86, -215, -17, -181, 4, -192, 136, 145, -42, 21, 74, 330, 56, -184, -137, -49, -31, 67, 175, -94, 8, 11, -21, 101, -424, 32, -94, -1, 61, -94, 98, -207, -15, -177, -28, -57, -146, -105, 1, -159, -105, -9, -13, 7, 306, 15, 107, -273, 92, -111, 68, -116, 33, -16, 167, -37, -106, 87, -141, -133, 46, -79, -344, 38, -98, 174, 65, 183, -251, 148, -363, 136, -13, 122, -176, -234, 159, 285, 285, 191, -173, 132, 107, -111, 17, 9, -2, -215, -17, -179, 131, -167, 11, -66, -88, -77, -60, -90, -170, -163, 37, -50, 312, 73, 220, -129, 194]
1719A94j6l10L29j88Q2k44N03k55j93J18oj91K37j51K17j62j57l1K86j5M3j44
1741e4J46j31K98o0k95J37m6J22l67Q5Q9J23jN9m6j7J7N7l36L90n7j66mJ07P7
1766A27j49j66L87k49J48j27j76M58j60o2K15k81M9pj03L4j57K89j34K14j66m4
1788f0J00J80j93L7J01k9j66K03j6k32j08k84L66L63l64L08j46l14K29K1r4J54
1810E6o0m6P0J3K4K28k55J31k85j15J62J16p7j93K47l06K34K70k98P8P4r7j36
1833a65L68l14P2K4J6k78j23J73J29m1K06k9l0J31k97L07j23P6r5J99l25j38K48
1856il1N5o3k3K65m15J68j03J65K9j23J77J2N1k38K07j12P6k09kR7K42n00J51
1880a33K3P6J61k29N9O4M4J23K4k02q1J96l10J85P9n8j53J0M5L36k33j43j3K31
$$ y = [194, 178, -132, 197, 9, 91, -153, 350, 95, -98, 20, 14, -177, 60, -91, 126, -36, -193, -224, 62, 47, 90, -54, 92, -39, 259, 199, -96, 41, -5, 117, -250, -165, -76, 47, 46, 105, 59, 42, 59, 116, -220, 170, 113, -53, -57, 50, 127, -22, -188, 199, -50, 98, -29, -205, 253, 93, 31, 246, -35, 14, 7, -96, -62, -219, 70, -64, 150, -16, -60, 40, 220, 27, 64, 165, 136, -30, 173, 157, -75, -183, -467, -101, 262, -102, 206, 60, -254, -25, -4, -98, 56, -4, -50, 20, 33, 57, 285, 30, 161, -124, -239, -77, 39, -38, -231, 16, -290, -56, 214, -84, -6, 68, -29, -165, 203, -111, -39, -15, 1, -277, -400, -227, -98, -139, 67, 38, 8, 139, -158, 149, 26, 102, 7, 206, -119, -257, -9, -40, 15, -48, -71, 194, -221, -53, -156, 9, 38, -85, 92, 104, 155, -83, 124, 12, 88, -121, -123, -26, 216, -284, -133, -110, -34, 127, -102, -43, 21, 65, 188, 212, 10, -71, 125, -185, 0, 79, 21, -132, -122, -77, 259, 26, -117, -130, 101]
1904A01Jj34N9R0k88J95K24m84K57P3j57J48l82M8K93j58N0J03l27J96P8j22J38
1927Bk61J09K64O3k71J6K14j11Q9L0K9l48K85m7j33K01o7j97k0K25l9q8q3K4O9
1952d5J50O2p1k51R4l6q1J66lj00J80j71L3K49j81j6J46n35K91J37k03J50J15
1975H0j9j72J58j99O8M39l45J0O1l08L75k06n7J9j48M84j43j89l7L2N7n4J38q3
1999c9J81k05n9k3K41k0n0J34l66J48P7m8lK40k45kj9k6L38l44K27j28J60l08
2023a39l4L38j58Mj33L51m11N7K33k60P5J46j48O0O4j31J09K81k73r8J84k8L9
2046A28j01j48K49k88K16n6j09L7K14j31K09p8l33K4Q4J51n5K72k19l54K14K98
2068B24j74j73k4K29N9n5R9J39k40k4j74L15j16k75P3M15l33m7K7K6P4K81j88
$$ y = [101, 102, -32, 27, 117, -171, 24, 248, -236, 21, 94, -63, 85, -297, -249, 44, -114, -64, 39, -288, -92, -14, -136, 2, -259, -150, 114, 177, -94, -78, 136, 25, 114, 144, 173, -175, 110, 63, -70, 131, 64, -133, -153, 72, 33, -55, -138, -114, -45, 105, 167, 96, -155, -61, -97, -178, -12, -15, -115, 65, -106, -73, 176, -5, -21, 125, -410, -119, 18, -185, -35, 80, 61, -111, 47, -152, -84, 355, 10, 20, 81, -227, 148, -58, -115, -96, -244, 240, 97, -92, -129, -97, -40, -94, 44, -39, 142, -63, -122, -145, 96, 76, 26, 160, -206, -58, 19, -29, -32, 208, -37, -39, -58, -84, 254, -90, 137, 9, 169, -139, -173, 165, 7, 11, -122, 229, -182, -125, 108, -152, -77, 69, -79, -19, 45, -86, 23, 304, 31, -67, 117, 89, 128, 27, -121, 128, -160, 56, 0, -109, -72, 142, 11, 220, 142, -191, -167, -83, 68, 13, 285, 66, -288, -74, 224, 50, -123, -147, 82, 141, 86, 185, 324, 84, 60, -114, 201, 85, -190, -117, 298, -35, -82, -55, -29, 45, 326, 138]
2091A38p2k19j55J98O8n3Po4R2O0J14j49o7n7L30q1l5l16K45j66K29l61J82J53
2115B1Pj36m7L39j79P1q0R2k31J19r2J3P7jK7J33K4%kk43o7J90L10m09K30l18
2141a52Q8K59l79K52k07J15O0K02j07l8l14N4l2L21r9N0k50J95j3j74L92j88j62
2164a27k0L8P2l9K77k60L40n12L59q6J38l42K49k7q5q2J00M4p0L9j06L8M8J1J96
2189A93o00N16l69L57j99J19j37%M8J05p3j93K73k60L30j73K81j49K1m03L79j74
2211a08rJ39R6M2k46J99r8j62J35Q8J43k56P8k02n8P8K54j72J61M8k68K72j28
2234B6j10J79k7j2o0o0O2o4q6L06J05k59j1J28M9k25j99M96j69k6j05O1o4K12
2258A47q7K33n18J94K72k09k61M81k86J09K9J92k73p3K29m10L02K1k32K95j90
$$ y = [138, 66, -153, -308, -110, -42, -95, -88, -152, -60, 0, 114, -35, -102, -159, 171, 90, 55, -261, -16, -182, 47, -314, -132, 21, 28, -108, -155, 184, 5, 76, -4, 88, -143, -24, -116, -103, -26, -27, 0, 133, 157, 157, 155, -88, -155, 35, 345, -64, 166, -152, -64, 195, -184, 68, -139, -24, 36, 238, 131, 93, -221, -167, -199, 122, 23, 73, -177, 18, 5, -169, 223, 35, -127, -147, -109, -37, -76, 201, -59, 281, -231, 128, 42, 180, -162, 87, 60, -25, -107, -7, 37, -33, 6, -100, -62, -14, -3, 193, -407, 109, -260, 97, -102, 17, -120, -120, -72, 33, -40, -233, 40, -220, 110, -63, 218, 69, 90, -313, 66, -108, -117, 22, 118, 160, -86, 113, 15, -147, -12, 76, 219, -37, 41, -161, -219, -141, 113, -59, 102, 150, -118, 154, 26, -84, 95, 68, 56, -4, -64, -2, -66, -152, 154, 259, 0, -11, 117, 166, -59, -258, 238, 69, 43, -62, -1, -65, 147, 60, 293, -225, -31, 241, 32, -229, 252, -34, 75, 104, 296, 23, -50, 179, -231, 71, 92, -140, 155, -35]
2279c5OJ02m18L21K55j77J31k84j32K11N2J28J1j90q4K67L5l92JJ88k16J71J21
2302G2j43j1o2L14l33J17o5K81l64K07k16lj2K30m7K30j94Q4R5l46J44J4j5K1
2326bj46L75j11J8k72K76q6k46M4P7J80L4n8l3k08P4J74k73K19Pj71N7j09J60
2350b0J62q5j54j26J37j88L73q4oJ07q7l3J08l67Q7l4J28N9J31J6j51J28q5q6
2374g0J42mj77J68j2j67j28J60L11k07Jl0m8L4K85pn32R8K34N8O7j10J01q9n39
2399d61K88K15Lj84RJ36K9K92m42K44j36K19k45J90j01J33p7k51K43l12L52k04
2421f0Rj89L05m02K93K97j27r4l52L93lPJ49l4k62K72k78K9j78J70J24Oj14Q1
2445D2j22L2Mm7J74J36j76J03k25j07M63m23J6P0L61l05JQ1j69K44k49J54kP1
$$ y = [-35, -29, 73, -345, -24, 231, 54, 185, -99, -231, -20, 32, 160, 171, -19, -103, 164, 199, -193, -192, -4, -220, -49, 72, -71, -82, -144, 170, -163, -46, -111, 170, -194, 13, -203, -206, -218, 12, -35, 195, 1, 85, 180, -166, -22, -8, -23, -2, -148, 227, 116, 134, -138, 138, 52, -194, -150, -73, 107, 141, 83, 50, -158, -84, 90, -183, 36, 43, -128, -71, -180, -20, 142, 57, -97, -223, -86, -274, 99, 15, 9, 116, 29, -4, 104, -263, -176, -210, -82, -23, 108, 124, -27, 101, 16, -70, 72, 68, -109, 59, 47, -120, -248, -88, 223, 16, 17, -13, -61, -27, 258, 251, -281, -183, 51, 109, 176, 66, 167, 78, -461, -173, 42, 45, -139, -130, 6, 35, 327, -115, 129, -7, 212, -33, 157, 56, 189, 112, -139, 104, -208, 144, -60, -51, -240, 65, -337, -44, 253, 126, 32, -320, 73, 70, 77, 226, 192, -70, 202, -76, -47, -225, -55, 69, 75, -39, 42, -80, -48, -44, -91, 83, 219, 43, 146, -79, -186, 277, -146, -130, -60, 301, -4, -3, 78, -91, 153, -96, 58, 56, 127]
2469A27J47l42J28N9O0p4J0k3l1k33j5L06j36m0P0k0J61j68R0m0k56L03l10J23
2493a04J05J42k0o6K1K8k2l3K1J44j18o1K91k78k07M3K75k60o7L7J37K63j83j96
2517a08Q5K62k31N3j81K57j09j08L53k78r6O0o6K84j70N8k00q2J91J4o0P6J5J33
2541A52j44J83j00N3j15Q0j41j9R4m6L56l98L77l43q6P5J42k20QK20l32K21k00
2564a83K53M5l75L60j67k2K7K90k34j70L80Oj02j74K37k53j91K46J17k6j20J52
2586I6q5k71L14L01n87N7p0K58J09l15R6K01p7O9k96J72K35j18p5j57K93j08j19
2609g7J21j9R3K58m68K4q6L6O8J96k60oJ7l76O71o2o8m4J99j10k48M27l96P3R0
2634E3q0K6K06k77p0L09O8j48l1m1J15j22K46Jk51P7M5j0l7l04L31O1j17k28K70
$$ y = [127, 274, -68, 60, 119, 179, 105, 115, 92, 61, -172, -187, 119, -17, -57, 13, -7, 154, -14, 76, 36, -220, 83, -227, -104, 1, 143, 123, 57, 78, 106, 84, 51, 72, 216, 98, 37, 328, 50, -157, -114, 161, -99, -166, -129, 8, 271, 88, -108, -23, 239, 8, 61, -120, 137, 28, -80, 273, -5, -101, -41, -107, 177, 7, 65, -135, -217, -26, -12, -72, 4, 19, 152, 8, 191, 91, 144, 29, 109, -32, -51, 43, -3, 353, -45, 332, -11, -97, -22, 120, -100, -92, 128, -204, 17, -183, 70, 115, -260, 100, -67, -89, -62, 228, -6, -176, 204, 210, 108, -66, 171, -82, -273, -27, 90, 64, -56, 96, 11, -260, 54, 355, -232, -175, -245, 13, 122, -193, -97, 104, 27, 96, -200, -28, 207, 89, 14, -143, 150, 42, -77, 44, 25, 118, 376, -92, -68, -154, -118, -50, 146, -114, -120, -103, -479, 192, 130, 62, 18, 217, 107, -141, 286, -110, -37, 53, -27, -1, 205, -72, -142, 167, 235, 87, 56, 15, 130, 8, 254, 255, 4, 81, 126, 116, 79, -225, 106, 167, 50, -178, 92]
2659I2n4K43r5l24J04k04R7N4K27m84K14J95k70K93O2k60r4K26J28Q6j77p9M5
2682B5K61k28k1j46k2Q0j43M10j07k5J07k09J56j19j34M1R4N1k72K04m9l98N19
2705G5p7l96N15r5m32P18m28J4Q6m9J58l7k4l6o8J60j12J64k9m1R3Nj46J35j03
2730E0M8j40J50q3l51J85P6J47k71J62o0J41p3O0p9J77n4n5n9J06J22r8j71J08
2754C8q0j4j4J13o7L35k72j96m3J11J35m9j29K03l95K63j24K62j21k9j02J40j90
2777b25O8L54k14P8k49J66j60K09q9L7R3p3N9k75J57M7J98m23L72o2j51J63j57
2800g7j65L81j51m0p4K58n6N9O2l44K10l8Q9j75K32l65M60j95k7K07k68R1P4r7
2824E1j94J8l2J28m14M24l3N9J3j34O7k1j87M01r3j24r8L18k80K83k3J08j58k42
$$ y = [92, 38, 281, 186, -138, -34, -238, -141, -87, 140, -344, -130, 65, -205, 88, 150, -110, -204, 22, 150, 236, 59, -20, 25, 286, 58, 37, -109, -131, -51, -194, 216, 109, 84, 191, -18, 138, 19, -115, -74, 20, 71, -201, 3, -46, -444, 75, -2, -398, 117, 22, -410, 308, -120, -106, -20, -69, 89, 52, 28, -8, -76, 84, -28, 136, 107, 66, 159, 164, 18, 153, 50, 98, -42, 108, 25, -326, -141, -65, 82, -189, -27, -87, 54, -19, 41, -38, 139, 85, 30, -29, 77, 199, 101, -70, 38, -42, -56, -70, 43, -24, 311, 39, -157, -200, -89, 46, -3, -132, 71, -324, -61, -185, 77, -44, -73, -175, -35, -225, -157, 197, -17, 61, -188, -22, -182, 27, -62, -25, 68, -5, 54, -221, -64, -17, 181, -242, 130, 68, -83, 80, -77, -242, 139, -12, -52, -126, 132, 76, 135, 197, -147, 63, 25, 114, -61, 171, -194, 266, 71, 44, 251, -17, 74, 148, 51, -143, -125, -157, -29, -443, -19, -52, 7, 20, -114, -47, -68, -255, 146, 53, -71, -169, 149, -131, 152, 129, 237, 79, -163]
2848a63N03Jl35o5MN6j01J97j49K17l42J41Q4J15k51n9M13k59J84k32J10J31J88
2871C88l21o0j36K16l4j51J09p0J97j19k87J33K13j79mN1L5o8RJ06Q7m15K62O8
2895C0k19MK65K1K22l36n6j55o2L80k20m1J83J12lj85R0J32k68J55P7k10o5Q5
2919f4J32j64nK33q8q0l2P0j09O2N3j71J64m5O7Q5j21j05M5J84l02M39j27k53
2943a32J57q7M9K40j26o3P9l9j7q7R4R2j61K43pn6k53o7m3J75K33k41J33n1kj39
2969g6P0O8k07pJ18m9J64J16j13K5l51K47Q6k89n7J08K92l40K98p5r7P3j65J58
2993cj54L14P6l03M30m83P2l8J31k87K54j0j15Q2P6P1Nj48J24l0j25L3J13p2l4
3018b1N0j06P1j55J58k5o5j5O8J98j41k8J83M8m6j8R4k36O5j73K26J1l62M13j62
$$ y = [-163, 340, 341, 6, -59, -55, 1, -100, 97, -52, 165, -177, -36, 48, 163, -88, -147, 266, 7, 191, -41, 69, 200, 388, 67, 7, -129, 87, 53, -98, 11, -59, 138, 19, -268, -135, 78, -101, -105, -54, -19, -87, -78, 28, 115, -300, -38, 30, -189, -185, 80, 101, 323, -13, -69, -224, -286, 94, -126, -167, 16, 128, 125, -60, 30, 162, -106, 49, 126, -84, -149, -64, 68, -96, -101, 132, 44, -36, -68, 2, -107, -45, 8, -163, 1, -44, 23, 108, -13, -118, -73, 111, -191, 248, 121, -132, 25, -62, -13, 227, 101, 38, 117, 78, 61, -26, 68, 160, -1, 242, 235, 179, -74, -141, -184, -9, 224, -17, 116, 65, 63, -76, -6, 62, -145, -152, -34, -83, 81, 197, 84, 109, -242, 5, 91, -198, -255, -147, 145, -195, 103, 28, -69, 4, -161, -3, -157, 157, 233, -70, 360, -123, -51, -89, 42, -245, 9, -1, -116, -34, 42, 113, 118, -30, 94, 64, -61, -28, 85, 13, -21, 29, -77, -6, -161, -3, -28, -93, -108, -40, 158, 17, -11, 172, 220, 174, 156, 250, 14, 79, -94, 132, 143, -219, 194, 32]
3043C2J3p3K02Ol22K81j37J11JN4k67J10J85j53P6k29K94K7j68j58P7j32K36Q
3067G4j36K75r9n2O0k04K76j51Q2R1k88J08J46j2k69K04j04P5J53k11K6J09M0
3090A93k37j30J38Ln7K86n4k48L3o4L45j56n2J4k1J17l57K53L8m7K85m48L2L30
3114A96k72L20m42J45J59l13K21j42j58L63j95J04n5K80j26k2J32k21j04L4M12
3135C16k18k36K37J49m8j01k46L71Jk1j61k69L47k66L53m30J41K92j50oP5j0n4
3158F6l66K57K10l29M2j53K74k14J24O4J90k49K14k41K72j82N6j27j61J59J52
3179E8j54R6r6L06l67R5K07j33K8l55K97K5J04j39J05N6j24J63k06p2K51j71m
3202c0k5J03m5J28Nk50J72k21L1Q9j1N7J15j60M1K04K3M0k41j0k18P1L85K0m26
$$ y = [32, 45, -28, 174, 180, -142, 139, 2, 113, 114, 168, -99, 11, 196, 43, 119, -110, 184, 211, 43, -115, -38, -170, 66, 74, -62, 213, 114, 62, 122, -82, 194, 43, 125, 216, -72, 36, 182, 170, -99, 105, 1, 76, 229, 18, 44, 153, 193, -44, -174, -36, -33, -90, 196, 142, -106, -73, -137, 208, 52, 0, 14, -7, 110, -247, 6, 44, -3, 282, -166, -134, 196, -76, 244, -198, -53, 106, -207, 14, -128, -286, 77, -118, -14, -69, 211, 85, 63, 195, -26, -130, -96, 316, 98, -138, 99, 248, 200, 99, -147, 224, 225, 204, 43, -226, 121, -145, 208, -222, -81, 211, 61, 55, 130, 120, 66, -300, -43, 167, -162, -120, -273, 1, -213, -89, -25, 165, -84, 130, -111, 161, -21, 35, -92, -253, -94, 58, -96, 0, -96, 210, -157, -62, 145, 12, 40, -315, -18, 7, 111, -28, 77, 133, 9, 172, -34, -106, 145, -26, -30, -55, 48, 3, 131, 136, -114, 58, -163, -132, -43, -54, 3, 118, -42, -1, 203, 226, 266, 25, 15, -203, -132, 253, 273, -153]
3227a53J66m9K4nL47k33o9k66J73L61k74K14k1r3K9j13pj9j04K9J91l4j13n7M4
3252c2J0Q8j04n8j08Q5R3J26P4l52J78M9k51j8P2Q9j79L0J96l14N29j48K2k71
3276a94L48j78M3L2j71J33j8R4n4j84r7J87O9k71L50j01j44J65J83j51N1J72k64
3299@J50L1o3q7j7QJ81k26K13l54n6K42j8j57L24k87oL22O9l79J47j48K0J64K98
3324C71m11q6K82j30l6k3J0K2k85J26M6K09j98mK27q1n7j5p7R1Q4j01K48k89K01
3349A24k73L62q9j84K56k44K39j00j99L2J48J77j79J47k91J33p6r7K32o3j16J73
3371A12k74K24k6L3k7r9L98l28M5k78M01m56K73k74K57M0p2N7R5j89K16j84r3
3394a49J50m7lj9Ml0L76j66k60q6L45p9Lj13K76k64k51M61j09L8p6l1K24j60q7
$$ y = [-153, 13, -36, -12, -17, 330, 97, 28, -238, -65, 296, 22, 236, 215, 122, 151, 38, 31, 12, -92, -63, 128, 94, -19, -76, -32, -22, 66, -38, -96, -204, -119, -26, 100, 174, -178, 0, 49, -202, -220, -148, -59, -238, -208, -12, -326, 203, 55, 77, -194, 154, -24, 19, 51, -120, 13, -5, 89, 35, -149, -246, -59, 10, -261, 89, -12, -156, 9, 192, 41, 92, 264, 0, 150, 181, 118, 31, 14, 22, 203, -23, 190, -164, -220, 22, 4, -153, 171, -116, -122, 200, 269, -110, 37, -111, -91, 73, 371, -40, -126, 156, 26, -10, -33, -23, -1, -286, -160, -114, 95, -103, -107, 120, 39, -18, -33, -110, -19, 65, -36, 212, -77, 124, -149, 213, 124, -60, 196, -48, 191, 91, -108, -76, 72, 249, 70, 217, -74, 59, -17, -114, 118, 55, -61, 112, -162, 62, 36, 69, 42, -57, 341, 13, 58, -220, 181, -275, -2, -276, -19, 21, -51, 6, 101, -88, 128, -56, -149, 1, -46, -49, -68, -64, -94, 282, 116, -144, -230, 115, 36, 39, -74, 202, -62, -313, 148, 39, 77, 1, -30, 194, 34, -53]
3419e3L12m33L73k20L24k31q8r1k9J90l1o5K44k04O5q8n3Rk2J62l9j7j02K19k84
3444a52K63j41NK7M6k12P6L6K04l47L38k2j03L6k02L8L5J00j43J99K06m15J76
3467D8l1j5K01k08J92l46L58j96K71m7j17n5j71K52l03J73K80m18L30O1k47J34
3489A46o2j14P8o7n1J10j75L49k15p0k2K26L3o4k60Q7K55j74Q5j01J90k7N2j94
3513A5k7J23j5p5M4K33k32K46k43K62k48j02j47L87l52J33P5l29J66J02JJ06o6
3536E7k59K52J36R1k65j43J19j00L27j46M6j34K22l17J67j77K30l41N28j30j65
3557bO1j52J94j52j6n9K66l45L60j42K42k40o9M42l01J8M1j95K80l40K43k00k7
3580i3j5k63N32k10k91J54K74l48J61J77m23K79J68K7M2j15K69j50K4l56L23j91
$$ y = [-53, 259, -174, 199, -21, 303, 72, -16, -107, -136, 54, 23, -42, 202, -2, 63, -25, -78, -69, -91, 71, 32, 15, -87, 132, -152, 111, -30, -25, 2, 48, -164, -88, -52, 152, -195, 143, 121, 18, 54, -148, -110, -75, 25, -118, 81, 287, -128, 48, 17, 2, 203, -5, 187, -159, 199, 3, 274, 227, 110, 55, -116, 136, -167, 6, 286, -132, 198, 259, 12, 146, 84, -30, 48, -19, -70, 40, -135, 214, -1, -71, -93, 133, 166, 102, -158, -71, 184, 10, 95, -6, 184, 157, 209, 15, -12, 111, 96, 21, 65, 298, 66, 312, 69, 331, 83, -19, -166, 221, -131, 2, 77, -252, -86, 16, 17, 123, 57, -202, 50, 186, 277, 12, -131, -12, -112, 215, 69, 115, -19, 203, -114, 53, -124, 106, -235, 293, 163, -2, 59, -93, 101, -51, -67, -126, 140, -205, 155, 13, 255, 15, -54, 388, 87, 105, 146, -49, 231, -109, 134, -66, -93, -108, -371, 161, -49, -340, -186, 88, -260, -99, 78, -345, -66, 102, 129, 171, 56, 325, 175, 199, -157, 166, -25]
3602b5j32j5K41k7o0k60M18j9k90J86k25J90l1J37K27l66oKJ53l0N1o2P3k59L25
3627A96k11R0k94M46k49Pnj42M04n45J73J60mO6k8J91l28J27K19l76L03P3m3j64
3651F6R3j75M8K56k56L5QqjJ11j64J54k49K03k03J49L28o31J43K47k97K41k28
3674a30l8L27k48j21m9J50m0K67j84N2j38Pn2J16L22m56M00j84L8K69l81O3n7
3697f7J99q5j68Q5R4Kj79j4N4O8j67K63Kj34j98L80K4J46l7l43J02J63j30k2J66
3722B04l32j40J97J10j64K30O0Q1k36n3J00j80J70J64j78k6j62L58L2k19K38l68
3744a14L6J07j43KK66jj98J59j20J56m37J58L2K89j97O2j93R4N2J98r9mJ36j36
3768A05k74j90J96M7L82j94j36K4l50L66k4R7J83o6o1L7Rl51L74k79K24m1l6M3
$$ y = [-25, -157, -172, 69, 42, -18, -278, 140, 121, -169, 17, -208, -18, -49, 88, 315, -51, -57, -55, 98, 68, 119, 57, 130, -129, 196, -15, 75, -219, 227, -22, -15, -20, -162, 242, -303, -130, 30, 26, 92, 64, 255, -73, 54, 273, -103, 200, 273, 230, 66, 159, -16, 32, 288, 32, 67, 75, 67, 66, 177, 13, 167, -82, 121, -82, 67, 395, -236, -93, 154, -143, 98, -130, -168, 159, -89, -210, -259, -109, -149, 118, -66, -14, -152, -145, -197, -81, 241, -215, 185, 1, 39, 308, -73, -10, -67, 132, 47, -121, -36, 58, 60, -119, -133, -79, -11, -178, 85, 87, -47, -245, 135, 159, 305, 268, -75, 27, 190, 60, 38, 204, -128, -268, -71, 39, -125, 105, 165, 246, 10, -43, 57, -123, 47, 211, 33, 7, -155, 203, 235, 16, 254, -114, -78, 29, -114, -112, 154, 153, -45, 114, -6, 150, -287, -129, -97, 192, -5, 57, -136, -42, 10, 208, 109, 105, 241, 105, -169, -359, -163, -116, 266, 72, -64, -40, -390, -24, -48, 49, 232, 166, 105, 142, 151, -200, 174, -105, 119, 78, 42, 85]
3792H5k58L7O2K39l88L52l41K25mJ67l04K5K20m29M43p0j28l0J21j02j12L59q2
3815H7rO0j30r0j02o9K39l4J39K2j31k62L86j19k3P1lj1k01K44k08J36k04L28
3839A16j43j62J65M72l39k21K27l29M31j68oL9R3k35J23k22M8J04J18l1o7j31
3861a18p3J07K93l83K02r8K33r1j83P5Q8R2k73n6K25j08o7R9N5m26L00K66k40
3884h1K8k9K5O5j69k15N0J18J57n1l3q0K48l3J16k43J21q3J8N3J96k23J35j05
3908a5p1Mq3R9N6j25J79J28k60k92J55M26j69j25o2M29r7k64j64M45k8p1n6K62
3932C01k75n07N87J03J2k54K20n7j57K39l09O9k26M63j58j29M3K27j71J0j31L0
3954g0nJ43n4J02k00p1J47q4M0R8J03Qk01L08j83J51Q2m08R2J42K5o6p0j31J85
$$ y = [85, -173, -136, -74, 165, -223, 129, -212, 13, 9, 176, -128, -103, 117, -312, 131, 61, -67, -97, 24, -78, -190, 169, 87, 78, 138, 8, -82, -184, -253, -14, -48, 91, 113, -18, -280, 106, -13, -36, 35, 32, 21, -180, 64, -144, -8, -212, 116, -27, -189, -24, 448, 109, -112, 115, -214, 217, 49, 43, 82, 175, -60, 63, -159, -111, -7, 111, 80, 13, -118, -191, -84, 209, -174, 28, -70, 163, 72, -111, -36, 52, 144, -129, -185, 40, -68, -135, -36, 19, -407, -107, 159, -81, -53, -82, -57, 8, -161, -376, -326, -208, -51, -102, -135, -215, 33, 0, 116, -127, -6, -89, -71, -18, 178, -45, 90, -15, -86, -82, -165, -66, -10, -135, 44, 172, -88, -380, -225, 201, 32, -93, -155, 274, 177, -87, -251, 194, 166, 95, 39, 301, 26, -481, 106, 209, 221, -33, 187, 130, -27, 212, -97, -28, -254, 209, 51, -78, -35, 192, 21, 31, -100, -70, -75, 68, 14, 116, -84, -155, -8, -92, -52, 46, 149, 157, -44, 264, 81, 232, 314, -94, -2, 140, 165, 99, 29, -102, 83]
3979H3m2j3j10K09k8j09L20l49J19j0o10N04J1k81J99J92n4j66J48l5L8q0j7J07
4003B6k43K40L44m60J41J03l62K11P8j4j59J35L20l21R0l34K87j07M0j93K9K50
4025A01l45N27l21k0J16J6k20K92j18l51M78Ml25%M1K05r9J24k92J02J32j24M79
4048D02j51j41qj35j41K31j37L13k86l9M05j27j6j72J19o3p8R1j07N9k05J69m
4071b1J0nm6K70k58J1L03o97M21N2j67p4j13K14K04p6m4J41j09k17K60k1j17K27
4095A48j88n3r9J53p1J12r7R8k2nK7n2J2j42Q0J50J93k35m4j81J82J79j25J16
4119A36j04r0k6J64J30j77J64j68P0m8k41K37j80k43L37j0K21j80q1K37kk86K44
4142A04J8k08R1j17j09M51l84J12k27M31m03L60j21J33m4n9o9J24k63K47J59k66
$$ y = [83, 41, 28, -82, 127, 99, -10, 310, -39, 80, 70, -540, -36, -25, -306, -107, 85, 31, -135, 13, -22, 16, -64, -81, 26, -217, 23, 367, -93, 48, 151, -211, 0, 78, 64, -95, 40, 360, 39, 129, -205, 82, -25, 15, -178, -149, 101, -244, 283, -38, -58, 58, 74, -146, 146, 28, -323, 155, 159, -166, -166, -125, 80, -19, 105, -187, -85, 47, -77, 402, 251, 110, 102, -33, -174, 57, -80, 233, -53, -92, 313, 186, 170, -2, 117, 54, -24, 67, -40, 19, -186, -17, -21, -11, -16, -62, 208, -50, -39, 264, -433, -12, 40, -127, -201, -314, -100, 104, 28, -16, 125, 16, -201, 59, 38, -79, 148, -40, -93, -192, -39, -110, 2, -95, 3, -19, -24, 3, -49, -37, -179, -99, 51, 244, 9, -35, -216, -34, 145, 20, 136, 32, -58, -84, 80, 210, 33, 197, 29, 99, 51, -190, 47, -133, -376, -39, -49, 172, -8, -89, 148, 146, -140, 104, 122, -86, 5, -112, -221, 230, -154, -42, -269, 162, -241, 119, -2, 131, 87, 28, -41, 83, -180, 67, 226, -40]
4164d0L42k23L8j12L6j23m4J61l10J82Q2N5J03j40J81R0m00J49p5j58J30j27K79
4187G6N7k12p4J24R1k31L16j96Q6N4j71L2J21J0q9m6j99J27Q0K49m31J99K79j78
4211G4k56K25K21l24L55l86k16N03q8r0k67L39l00J24R4k54K68J34j14J01m7l11
4233b15L18j17K65m06K42M4j78J18J29k28j51L87k29k6j57L15p1j19J86k24j12
4254b29K60Jj69L21l09J64M3j07L7J65j16n2M0J13Rq4j11qQk7O5j17L53k90o3
4279a03j41P3K93J94l06J68l56M20j34k17L5o3K23j74J70j10K57l05MJ28O7k04
4301h1l6qP5j4P4P4K4l07K75l9M1m2J34l37P8m0M69j30k22J51p1k3j64M1J4L41
4327B77k99m37L52nK68j26m1j24K72P0l77J41J30k18Q4K7P9o1k07L24l20M4J88
$$ y = [-40, 302, 79, 117, 5, 41, -82, -126, 35, -275, -93, -11, 44, 147, 7, 188, 278, -122, 27, -48, -206, -76, -203, 76, 133, -79, -153, -29, 62, -169, 147, -49, 37, 91, -80, -48, 73, 83, -6, -52, -251, -124, -44, 205, -226, -27, 252, 74, -182, 43, 264, -60, 295, -91, -307, 196, 108, 18, -249, 90, -210, -86, 8, -246, 22, 156, 42, 143, 96, -215, 103, -14, 251, -155, 87, 131, -47, 71, 200, -28, -179, 208, -21, -47, -204, 111, 40, -79, 107, -117, -229, 31, 32, -137, 184, -125, 39, 82, -25, 12, 177, 61, 9, 49, 162, 171, 87, -24, -32, -24, -51, 14, -103, 250, -40, -103, -244, -171, 122, 316, 10, 178, -178, 242, 108, -109, -74, -137, 86, -88, 82, -28, 229, -76, -72, 56, 123, -81, -117, -125, -50, -64, 10, 84, 108, -199, 76, 37, 78, 36, 170, -167, -89, -129, 340, 210, -12, 139, 68, 45, -119, -78, -64, 277, -22, -459, -107, -112, 156, 30, -11, -135, 137, 207, -170, -29, 101, -117, -33, -6, 73, 12, -195, 129, -191, -147, 41]
4350D1j5j2l23K52k50n1J68N1J66j68O5L33k13m5K91l31P7l35K48J66k15n9J07
4373e2m7L87o6l54J18j51j31M08k88J88k1P1l05M22l25J15o4O8k6%j04q0K96o0
4397ak5J30k90J6%K12K58l10P4k6j00K41l00N5Q4j84N2J14N5k5j7p1l0J52l3P5
4423A06J53k92J25M3j43j58J93r9K14l36J07L19l35J80l63L50n5o8j43M99l55
4444e8l36P69n06K0o5P5lJ89k34K41j03J66l50J72l31L71K80l44K7J10l30K18
4466b2lP3J63j32ll27M06j51j37J31o8nmJ72O4j50j36K17q1l6K28m0k39K4%k5
4492h1J65Q1l20N56l81Q6M6P5n42J48J69n1J64q1Q7j67N6q0o9Q6J85o2j62j88
4516b80L37k55L36R6l33K00J00k64R8P4O0j27q8j00K19l13K50K4o0M9k6j20J3
$$ y = [41, 26, 14, -309, -57, -307, -358, -190, -139, 27, -141, -76, 257, 44, -1, 290, -41, 36, -299, -51, 115, -100, -159, -52, -99, 288, 222, -132, -14, -165, -296, 112, -176, 12, -9, 62, -243, 179, -146, -31, -95, -27, -53, -53, -157, -237, 59, -1, -26, 104, -186, -170, -170, 42, 300, -10, 64, 38, -62, 179, -121, -66, 18, -166, -114, 0, 55, 30, 13, -58, -88, 64, 31, 106, 259, -33, 92, 135, -8, -166, 27, -72, 142, -194, -87, 232, -103, 77, -286, 64, 9, -59, -202, 297, -58, -394, 375, -131, -111, -176, -101, -104, 85, -149, 92, -11, 155, -195, -23, -354, 17, 297, -47, -20, 90, -240, -22, -25, 48, 211, 79, 76, -251, 155, 4, -133, -2, -70, -75, -79, 93, 157, 7, -129, 88, 7, -29, 199, 159, -80, -56, -56, -81, 84, 165, -155, 401, 20, 106, 152, 227, -315, -167, 2, -49, 115, 34, 121, -46, 10, -70, -139, -53, 132, 70, -92, -280, 57, -198, 138, 234, -99, 101, 201, -63, 35, 109, 169, 42, -46, -146, 73, -240, 10, 34, -26, 23, -3, -123, -110]
4539a10M1q6K18m1k6P5j56l9K08R1j45o9J19n3j14K28j62r3M4Q3J32j45p2m9J54
4564C3nJ81m96K97N4L7p1P6q8J63l44K76J11k80k32J85k37L51J17m8j12j84M23
4587B07R9q2l96OL28q2k20K45j87J56j0j42rJ54k14L9K88n9k94K74O4j53k9k7
4611d4k01O0L4J99J8j89J39r4J16j35l4K17k20J93l15J81j31L40k10j28L52J43
4633B91l30J15Qj57j3M5J03l3j09n5J76J8j66J72j96J80J0N1m2O2J7m0l13J50
4657e6N2O2K9k72q7K17L6k51M23k39J93Jj28J29m1o9L2%K79k64j74K96M1m66L61
4682A04M9k89J31o5L09k62o8P7kn1R7P5k29N9L4m4J53j59L67l7k80m9O8o2L26
4707B52l49K94j37l49K54pK3K52k84L05j69rJ4K5J6k66q5M41j94k7J14j95J98
$$ y = [-110, -69, -155, 63, 22, -4, 71, -85, -124, 84, 175, 30, -39, 80, 27, -87, 141, -21, -114, -70, 13, 145, 0, -72, -121, 33, 28, 209, -287, 10, 64, 101, 30, 106, 18, 181, -163, 113, 224, -56, -288, -103, -340, 11, 128, 80, -32, -216, 207, 306, 224, -172, -166, 162, 80, -140, 105, -82, 74, 64, -78, -87, 67, -147, -108, 180, 121, -173, 101, 165, 12, -17, -44, -245, -185, -151, 48, 66, -123, 16, -78, 38, -97, -131, 86, -134, 59, -256, -75, -206, 134, -76, -204, 148, 291, -39, 76, 84, -73, -86, -41, 62, 29, -80, -135, 41, 59, -107, 65, -131, 49, 59, 110, 68, 130, 147, 107, -206, -56, -4, 58, 87, -185, -272, -55, -19, -270, 153, -86, 107, 108, -20, 109, 68, -1, 31, 31, 310, 46, -128, 168, 209, -257, 104, 153, -136, -5, -70, 239, -23, -91, -14, -16, -67, 30, 105, -124, -65, -31, -75, 78, -81, 286, 249, -31, -80, -12, -74, 252, -97, 197, 60, -289, -35, -42, -19, 233, -51, 254, 85, 76, 90, 115, 131, -135, -220, 221, 27, 0, 114, -81, 117]
4730A17M0k01L0q3P6K33j17o7K01k10j4j55L72k4l03M15k56j22K36l6J0J7k32
4753g3L3J46j98%J85j52J24k37M9K73r5k52J53p8PJ51o5J36J02p3n9k5j97J70
4777B5j71Q9j12J76M2k2j16J45n3j12n5O4K48o9n1k21L48q7j35o0K24j60J86j85
4801f2K85m47K98n2j40K52q4ok49M67k85o2p3K82r8m9J62p7j20j86K80JJ55k37
4825d5p7M2j41o6J86J21j15P2j31J5qJ55j52L09l70Q7K90k64n2r0L60m9p5q6R4
4850A0nK56k70J72j03j13O7p4k9k55K63j5k7J34L05l66OJ4j77L83r4J38j57qJ6
4875G1k55K16k78K73q1j8P5J64M1l66O7j73M27j73R4J0j68N5J16j51qqj70L30
4899I0l32L42l03J53L89m66K83j62L1j9K90n55K27j38J55Pl5k01l3r1L41O9l2
$$ y = [117, 157, -44, -14, -97, -21, 212, 95, 28, 229, 19, 5, -150, 222, 198, -105, 310, 54, -68, 168, 132, 142, 159, -73, -40, 106, -92, -92, 93, -59, 65, -172, -123, 150, 55, -197, -44, -122, -115, 36, -29, 107, 209, 136, 77, 52, -145, 25, -146, -57, -169, 7, 49, 27, -89, 56, 3, -109, -164, -100, 148, 79, 28, -193, 155, 68, -67, -127, 97, -63, 123, -62, 223, -224, 74, 22, -118, 134, 50, 44, -205, 262, -23, -85, -158, 124, 26, -23, 139, 62, -58, -244, 36, 37, 192, -45, -122, -80, -221, -287, -101, 20, -95, -23, -154, -139, -147, 8, -144, 165, -205, -118, 172, -92, -144, -234, 126, 77, 2, -84, 10, 5, 261, -9, 163, 60, -53, 14, -60, -89, -344, -81, -96, -123, 11, 316, -50, -44, -30, -207, 176, 82, 220, 63, 55, 71, -184, 32, -246, 27, -54, -72, 3, 167, 208, -158, -91, -264, 163, -10, 84, 94, -74, -19, 97, -54, -62, -70, -240, 90, -242, 100, -203, -50, 339, -127, 156, -6, 25, 6, 296, -259, -32, -170, -15, -8, -43, -244, -277, -368, -27, 42, 10]
4922A0K08l50J80k77M64m13M73j47%nj45K77j77p5mK26j52k22L39O9q3J57n15
4945a62N1K01m5j00J33n4kJ6r8m8J94m61K37K08j87J47K19l53J04l0Q5k70J87
4968b8k71K94R8j17MRK44k79j40Q3K00q5J46m70L91j72J15mm7J14j10j56K62j25
4992d4j32J97k5j5k44K52KO0k15R3J83m0L0j20J18M6k48Q0j2k40K86J70q4k72
5016a74L6n1M17o5m69K64K31k27j2J6L24l55K26n13Q62n76mL0Q6k49K23l4j23
5039a37K67m74M02j34K5m3J83rL6o0K4o3oLK0j21K7j27LK77m47K54K11P3j15K0
5065H9J27j99J56m01Q9J26j24Q1m0O0L92m61J72J61m80J66qJ39R7k83P0o8K11
5088G2n5L10n84J88m3K13m4k44K10K39m23K63j67k96R4L80O7j62m1k1p0L19o3
$$ y = [10, 218, -132, 48, -229, 235, -178, 295, 148, 148, 143, -2, 275, 98, 23, 19, 245, 93, -129, 210, 279, 196, 353, -162, -111, 90, 45, -55, 78, 24, 22, 38, -60, -108, 86, -375, -138, 70, -117, 30, 249, -104, 0, -30, 55, -215, -28, -299, -5, 93, -24, -20, -11, 233, -46, -186, -103, 97, 12, 158, -312, 79, -93, 22, 18, -29, 85, -25, -181, 81, -44, -176, 21, -4, -19, -263, -11, -9, 51, -164, -71, 112, 72, 102, -18, 100, 146, -102, -22, -34, -274, 12, 182, 98, -174, -138, -189, 228, 163, -306, -42, 189, -38, -50, -34, 290, -65, 161, -352, 510, -66, -70, -40, 46, -203, 20, -14, -137, 130, -344, 58, -76, -51, -94, 89, 80, 116, 56, 80, 17, 11, 14, 34, -87, -60, -187, -184, 93, -354, -100, 111, 184, 69, 89, 216, 17, 173, -228, -139, -13, -137, -56, -96, -36, 356, -105, 67, 228, -252, -86, -94, 45, 142, -141, -71, -139, 72, 17, 327, -257, -69, -112, 101, 57, -187, 23, 262, -161, 102, -65, -361, -267, 113, 180, 18, -23, -44, -114, 205, 142]
5111A42l15K56Jk15K60j1p1Q2k98M5L57l21J75K3j93L8J11j33J30R4l16K78m9
5134G0L4k35L44j57j29j22MK67j08rj53L42k79L90m25Q5j30K76MM0l30K53Q4j15
5158AK77k4j34j25o9K28J7j94K00l75J23J43j49p1K7R6m7M6n9lL16j16q6R2k96
5183a82O9J22j46K44lJ22j66j51N0L4l41L91j35L70k80p7j3o2K14l36PK69k2M
5207a8L8L0j37L22l95K69k81m9K64m4J05j13j45K06r3K04j37j09K0L19j63k41
5229a48J36M9m0O1J60k75L7l13L38J77q4j73K21lk21l5L24l32R9J79j21k73K82
5252D5j27k2P7J08j07l4K34k28pM1L1L8Jj00K6N5j1j16q5J45P9l1l62L86j09R7
5278B4L4k60L0K83J79o3k77q5O9mm5k6J36k14K47J41k55NM4J30q8j07J57k93K40
$$ y = [142, -173, 83, 84, -131, 129, 118, 47, 129, -169, -124, 233, -88, 87, 110, -83, -45, 66, -67, 63, 157, -159, 119, 70, 104, -131, 213, 56, -73, -195, -191, 76, -32, -41, -194, 148, -131, 259, -166, -81, -211, 65, 69, 109, -221, 32, 116, 1, 278, 254, 120, -5, -74, 154, 171, -23, 177, -198, -75, 68, -81, -152, -125, -29, -76, -30, -89, -92, 224, 108, 22, 114, -182, -113, 9, -137, 107, 104, 226, 60, -91, -41, -7, -348, 43, -92, 278, -2, -79, -92, -154, 60, -276, -269, 0, -22, -18, 20, 50, -87, 235, -160, 109, -172, -221, 43, -1, 104, -9, -154, 52, -41, 163, 26, -83, -63, 256, 93, -148, -12, 37, -3, 58, 218, -57, -20, -333, 5, 182, 98, -75, 146, 143, -78, -113, 211, -121, -22, 157, 36, -237, 45, -82, -104, -27, 81, -26, -60, 174, -54, -61, -20, 11, 49, 50, -50, -24, 31, 20, -96, -181, -36, 43, 12, -350, 36, -73, 24, 58, -202, -172, 111, 290, 227, -50, -135, -66, -70, -115, -141, -5, -219, 28, 169, -86, -81, -37, 93, 5, -102, 55, -238, 2]
5303BQ5j05o2KJ47j26K1k32N17k04j24K09j49K68r3l41J27l9P8l6r3J72K15j24
5327A15k79O6P7r6R4R7k52M79l83J84k12R0K42k33j78K26N7M2K6l26K79l04M08
5350B19j45l1l5K78j1k86JN6k4P3j13kj19L86m63P5K31q0j19L71m38K82q1k95
5374b70L54j48K44j15k2l3j17J56n0J61j14j50QkJ24O1k54M61k98o5K56l66L47
5397A68j81O2j23J61L7o6p3R6k24L91j90k0j32K27J1j23j49N1L82j48j42o0j03
5420a48K63l4j83K1Q7k9r4J82J43l0k81Q7j1J08r8j3o3K7J85k38nK85q3p8k3k20
5446b43P4L3Q0K04k18K63l76L18l25J6O8N1m2L5K75j27R8j03k08J2J57J27l70
5469b01K80qN4j88K25k53o3MM4R2N8o0oM5j15K95r9j61L16j56p5L27m44K37m02
$$ y = [2, 87, -18, -80, -78, 69, -57, -36, -268, 249, 45, -79, 130, -19, 249, 156, -185, -58, -97, -19, -55, -148, 24, 239, 115, -164, -98, -21, -117, -23, 74, -178, 301, -82, 102, -110, -20, 222, -11, -189, 37, 94, 136, 162, -164, 115, -189, 219, 74, 43, 8, 286, 275, -11, -10, 46, 22, 95, -18, -20, -139, 247, -216, -141, 90, 10, -109, 262, -176, 106, 25, -270, 84, -64, 180, 65, 43, 10, -107, 49, -1, 160, 46, -104, -96, -98, 26, 87, -167, 294, -4, -69, 187, -179, 168, -13, 49, -74, 87, 124, 58, -15, 81, -143, 248, 58, 38, -94, 133, 144, 21, -128, -77, 305, 157, 15, -45, -148, 115, 81, -102, -81, 6, -23, -117, 65, 208, 178, -103, -16, -27, 81, -17, -30, -93, -66, 119, -119, -124, 161, 78, 0, -23, -243, -169, -136, -56, 148, -70, 193, -183, 135, -190, -174, -106, -55, -97, -62, 213, 86, 184, 81, -127, -115, 42, 169, -201, 79, 71, 125, -63, 162, -91, -154, -150, -106, -14, 44, -16, -22, 23, -92, 203, 104, -57, 259, 103, 28, 355, -89, 148, -254]
5494b54P7J43n8j96K41j03n0j8K18k09J4M09j92L8M7j28M6J81j80k01M47m92L3
5517a87J17N7K14j70k20J59o2k9l3L63Q8l71n9J95QJ56j3J0k20j53Q8J33j18q9
5541a36J94J38k45J0J56l29L84J34l25k0j3K07j39j07J77N7j42J4l8j29J45J3
5563FPj71J80j12J90m9r0L61n15N11k31j89P0L84l75L5n5J92J92k42j88J43j67
5586a13Q0J86m32k9P9J91J82n6l61K39j00P4K53P7m36m1j12K74L4J08k50K13l44
5609b84M66m41M38k73J83k75K70K45l32j40J60J98k37J27r9k41K50J87l64K78
5629A16k56K30nP6K21k63k24K11J04j93R8r4O8l76K89q5l5j31J58J75l05k1M36
5652A94p6k14l9J06K95l35J80Pj28j9K1O5n0L92l85J09k85J1l8K34J13j13n2K74
$$ y = [-254, -177, -34, -92, -288, -47, -150, -200, -218, 0, -209, -195, 214, 22, 60, 107, -21, 25, 206, 26, -175, 272, -220, -187, -70, -13, 201, 31, -189, -30, -92, -121, -154, 209, 297, -74, -133, 62, 70, 226, 213, 223, 3, -150, -62, 71, -47, -136, 58, 196, -49, -39, 117, -212, 172, 306, -19, -39, -52, 155, 16, -91, 86, 143, 1, 15, -23, -152, -7, 6, 13, -158, 22, -90, 100, 51, -39, 322, -193, 318, 87, -102, -32, 352, -23, 12, -43, 149, 341, 99, -89, 54, -113, -33, 153, -279, -308, -229, -38, 144, 88, -273, -34, -134, -60, 193, 270, -166, -207, -319, -45, -11, 97, -153, 60, -284, 182, -259, 179, -94, 89, -186, 84, 329, -3, -143, 17, 215, -22, 105, 6, -235, 15, 202, -162, 116, -140, 90, 85, 161, 382, 119, -105, 106, 210, 17, 115, 21, 89, -287, 2, -83, -118, -249, -91, 84, -221, -242, 194, 118, -96, -135, -29, 266, -69, 111, 118, -10, -29, -8, 57, 7, 399, 14, 123, -162, -151, -189, 45, 158, 45, -7, 267]
5676B67k43k9J82l67J85J79j89m0k3o0J60j14K43k20K13k94K07O8r6q5J10Q2r3
5699D3j07O2K62l77N4k24L36k56N6J97j66L27r3l99J69J34l20N61k7m04J49m6
5721f9n1p0L10j06k59J47K82l11K24L32l94K1q2O7J00Oj65k12M01n7j6l4Lj22
5745e5k18K50k58K56J47j80jK21k05J10q9L1k28O7K61m5J35L8k98J02k52N71l74
5768a4J59q5p5K51J28l15M5j15N8K4K40j97k47K55n7L3k48k4j8L16j07k69M37
5791A75l17J54j72R5k1N2R1NK1J44l87N20o55J49M22k5l50L81l91KK45p0l60K30
5815f2N0kJ20k65J39k15M29j02j68K48l14J06J02k2k2K35n6j95j67k4J01K26r6
5838D6q8J1k02L68k9k76K61J03m6k67K20R7j4R4m13J49l1P1j95J00J95l46J74
$$ y = [267, 24, -5, 177, -190, -5, 174, -15, -55, -78, -138, 22, -92, 151, -69, 144, -150, 57, 125, 29, -56, 54, 136, 43, -64, -2, 260, -117, -63, -287, 49, -207, -151, 46, -120, 207, 114, -285, -116, 18, -302, 259, 232, -172, -23, -69, -120, -190, 120, 14, -245, -98, 184, -127, 97, 429, 35, 56, -26, 41, 141, 147, -18, -230, 171, 114, 98, 64, 67, -55, -273, -23, -281, -25, 122, -58, -59, 162, -43, 67, -22, 9, -219, -152, 109, 64, 199, 237, -61, 41, -211, 360, -14, 145, 60, -15, 236, 364, 49, 94, -21, 37, 61, 301, 104, -143, 112, 55, 88, -160, -184, -202, 114, 7, -262, 175, -142, 12, -160, -65, -86, -34, 57, 62, 83, 227, -160, 360, -295, -146, 276, 251, -99, 282, -109, -107, 138, 68, -292, -62, -12, -14, 106, -159, -20, -235, 194, 92, -76, 172, -142, -36, 66, 44, 22, 257, 201, 6, -161, -185, -84, 142, 46, -42, -31, -233, 135, 106, -170, 91, 194, 148, -119, 101, 198, 184, 278, -135, 14, -17, 54, -141, -41, 154, -192, -18]
5861a8P9j28n7K47r3j52q1J20M6j89K98N9J05l38K98k07J19J52j91P6j33O8k71
5884a91J5P1J54N1J0Q9j83j79K48j43j59L91l30J46j10P9k9N2J47Oj84K10M2k49
5908d6L25k33J37k48J18K45j94l55m4N69m63J67L6J40j44l15O67l17j32l2K74
5929A55l54M13n47M64k26L22P4l33l0j46P1J39K3j14N5j98J37J80R2k32O6pN6
5952F0j25o2K27q6rJ24p2l74L97P4k01k36L66Pkk89K73o2J94j77P8k11k26M76
5976A44j18J16l73L5R1J14l42L80k71J47L6O6k81K47Jq9J23J4J69l78p0K35k62
5999b66K42j03N3L96j93m6Ll75L67K6m4R6j62l27J13K72kr0k5R3n2LK19j97oL
6025bK58m12J32J38J71m73L11J79m11K28l57k9K71L6J23k9k29R6l84L95o7M4J89
$$ y = [-18, 61, -67, -124, 123, 30, -122, -203, -83, -37, -226, 72, 131, 236, -102, 196, -11, 108, 260, 69, 145, 12, 80, -191, -176, -105, 49, 100, 110, 199, 16, -163, 85, -58, -217, 174, -156, -10, -120, -41, -70, -18, 129, 135, -49, 161, 203, -46, 279, 46, 183, -65, 53, 298, 104, -251, -295, 274, -189, -22, 14, 154, 10, -305, 362, 45, -87, -119, 155, -199, 214, -333, 131, -95, 227, 301, -32, -62, -208, -137, 2, 25, -89, -34, -232, -95, 85, 177, -55, 11, 4, 60, -65, -127, 100, 14, 5, 129, 57, -317, 80, 154, -47, -283, 83, 90, 88, -201, 72, 10, 204, 27, 105, -106, -332, 144, 26, 142, -231, -196, -105, 9, -333, 47, -224, -77, -41, 25, -256, -9, -8, -97, 26, 40, 209, -169, -239, -4, -266, -24, -127, -74, 322, 129, 83, 86, -289, 78, 104, 60, 156, -6, -333, -220, 52, 50, -40, -65, 28, -24, -21, 198, 1, -5, -2, 256, -156, -24, 114, 285, -188, 123, 302, -109, 119, -238, -267, 4, 40, 163, 134, -95, 1, -383, 12, -55, -11, 178]
6048A78j52J76k64J48j75O0k10L77k01k33L25k45K15l5K49k6l41L5K58o7K64n89
6070b53L62j78O7J59k68J15J46Q6n6l34j2N7M6q6J58j97L3J0J32J25j79M2J45
6093A20j69J74o8Lk02K23N3k79J17j01R3L34m71P4R1j35K83l06K96j25k08J57
6115d6L3J20R5j28P5l58J16J22J73j85J42q2k56K30J24p7m8J32j09m8j13NJ09
6138B6K86m48K69K1j56pJ4J76k43K68k93n0M28k87q0K20o7K25l77j38K27k2m2
6161e0M2n4J87j49N7l51N79j82J53Jj94J28l30N2L01j10l03N04l37j31J31K65
6183B09k35q9J79k7j50k51M47O1j58j3j52J54K98j66j55L76k64j07l69M31m8j76
6205b05M9K84k20n6J10l51L92q2q0L1K3L66l42j49K90P1K2j72o3J60j17n7RJ18
$$ y = [178, 26, 202, -62, 86, -89, -29, -239, 138, -63, -296, 29, -216, -1, -36, 213, 187, -154, -119, 139, 72, 336, -253, 109, -69, -2, 157, -111, 4, 150, 236, 180, -154, -166, -109, -63, -149, 9, -188, -155, -145, -13, 112, -67, -25, 120, -49, 125, 57, 60, -142, 81, 134, -145, -28, -129, -36, 298, -173, -99, -8, -143, 140, -166, 130, 5, -203, -46, -13, 107, 202, 74, 149, -209, -93, 29, 202, 17, 159, 77, -179, 51, 175, 98, 50, 182, 73, 25, -88, -83, 26, 312, -136, 133, 154, -2, -9, 5, 181, -62, 206, -87, -137, 291, 4, -76, 144, 77, 302, -75, -213, 14, -8, -50, -8, -62, 125, -24, 33, -318, 261, 79, 232, 233, 39, 167, -163, -111, 190, 80, -223, 281, -56, -187, -56, 209, -26, -115, 64, 37, -113, -364, 83, 144, -14, -27, -179, -25, 273, 107, -48, 328, 64, -43, -412, 19, -29, -205, -156, 128, -92, -148, -38, -389, 3, -79, -159, -128, -105, 261, -81, -230, 60, 131, 153, -19, -82, 78, -39, -96, -87, 31]
6229C1j58P5o3J14o3l5m7K14k83J64j28J9k6L34k29L89j24Q5k39k4Ok3K7j28L25
6254B13k27K47l91M8J29P2j25K7K85m15J29K03j02k06L38j39j93K31j86j1j2K42
6276A57j91l5K55j42k1Q2j08j51JJ41N5k59J87q2J93j17J45K6j26j76K34q1J45
6299A32J68q5n1m68K70k81O18k50j7o5j97L55l89J04N5P0J62k60P8N9L6j02J12
6322E4K0j40o1O5J50j40k5J30M8j32J22j15j24K13n6N5p4k05M7K78j54J3J53k34
6346a12K42l9q8j69N1J94Q0l21l1L13j62k8J41o3J18l1Nk69lL02l68L10J48l09
6370h9K02j71L5p8J05r3j35L25j89P0J41k90J91j58J18K03l45J80J38o5j61l05
6392c71J51L30N9q7r7Q1k86L58J36l54O6m9J62j15o8j16M81j70j28J11m5N0J86
$$ y = [31, -127, -52, -115, -1, -64, -99, -146, 68, -215, -51, -179, -160, -186, 148, -81, 308, 184, 269, 30, 6, 12, -11, 16, -112, 213, -14, 233, -158, -110, 19, 91, -34, -7, 278, -137, -8, 195, 93, -113, 225, 86, -107, 124, -62, -73, -85, 157, -34, -69, 186, 44, 23, 105, -3, -154, -153, -12, 43, -216, -29, -111, 82, -35, 110, 136, 10, -166, 68, -13, 132, 300, 215, 164, -304, -34, -315, 303, 53, 36, -29, -226, 129, -260, -156, -101, -31, 131, -129, -51, 8, 44, -58, 54, 74, -66, -127, -62, 88, -52, -77, 53, 101, -31, 91, -24, -148, 65, 9, 64, -10, -215, -168, 110, -44, -31, 122, -112, 130, 91, 3, -166, -115, 79, 159, -162, -193, 120, -42, -70, 71, 8, 126, 95, 100, -169, -172, 130, -238, 72, 220, -89, 113, -58, -23, -101, 4, -89, -224, 101, -88, -18, 123, -167, 24, -134, -16, 187, -158, 22, 160, 95, -66, -371, -220, 110, 169, 82, -15, 66, -220, 138, 274, -80, -14, -63, 99, -16, -84, -200, 281, 111, -17, 94, 49, 99, 285]
6415B85l50J93k34R1J68m80J41L6K04ql4o2R5j15J49k4j57O1p3j54P12m15J12
6438A41j79K36k46L0M9l7m2O1r5k30K93K57k23k8L3L7m20M40J1J59l50J82j38
6461e9J43k17K4K37k8j54Q1j38P2n5J62Oj90K3L25j71l35J89K78l6k6Q7m39J76
6485d5P0n9j22N7L33l39r2J78o5K40j11l28J23J89j58l6LK33k47L72k75N3K25
6508A99Q8k19J76o1k11j40M7K38k45J88j43K69k99K68r3R5j79j76L33j54o8P6
6530a1mm1K84j17ol29J10K23mj05j86J80j41l9K11j08J68p2j5R5j70k9n7J92J32
6555A61J57m19K57J33k26K81l39j7P1kK2j99J13K10l31P9L62k89j14n7J4K6J16
6578IL39m47Q6L07o53L35L4L4m40O29n62P7L57n0J79m77L16J31M4l47M47r6l93
$$ y = [285, -65, 128, -106, -15, 153, -327, -186, -150, 54, 46, 12, -50, 45, -70, 79, 55, -102, -41, -114, -268, 444, 29, 141, -38, 198, -48, -18, 31, -6, -48, 13, -82, -312, -19, 238, 15, -13, 20, 57, -363, 77, 88, 247, -103, 79, -59, 84, -133, -109, 128, 100, -54, 27, -111, -39, -94, 68, 74, -116, -93, 232, 61, -274, -85, 193, 157, 131, 218, -221, -45, 25, -34, -156, -99, 234, -105, -197, -19, -84, 156, 45, -283, -160, 29, -129, -165, -162, 71, -176, 196, -79, -26, 199, 287, 68, 244, 183, -28, -168, -121, 117, -128, 60, -83, 186, -113, 155, 62, 157, -22, -198, 135, -19, -87, -11, -15, -56, 228, 111, 105, -224, -114, 109, 105, 0, -186, -6, -147, -186, 25, -83, 85, 13, -2, 93, -77, -106, -163, 29, 161, 318, -101, 156, 289, 63, 344, 5, -12, 59, 57, 79, -120, -7, 203, -128, -49, 313, 24, -90, -147, -133, -107, 9, 348, -99, -13, 294, -359, -24, 10, 44, -396, 233, -329, -252, 105, 55, 234, -243, 73, 204, 248, -99, 348, 252, -141]
$$ [...]
8191B3
##END NTUPLES=NMR FID
##END=
