##TITLE=1H_DE-82K_TFA
 200.13MHz, CDCl3,
 8 sc
 
 27.3.2025
##JCAMPDX= 6.0         $$ Bruker NMR JCAMP-DX V2.0
##DATA TYPE= NMR FID
##DATA CLASS= NTUPLES
##ORIGIN= UXNMR, Bruker Analytische Messtechnik GmbH
##OWNER= pz
$$ XWIN-NMR		Version 3.5
$$ Thu Mar 27 16:20:29 2025 Russian Standard Time (UT+4h)  she@DPX200
##.OBSERVE FREQUENCY= 200.1313
##.OBSERVE NUCLEUS= ^1H
##.DELAY= (6, 6)
##.ACQUISITION MODE= SIMULTANEOUS
##.ACQUISITION SCHEME= undefined
##.AVERAGES= 8
##.DIGITISER RES= 18
##SPECTROMETER/DATA SYSTEM= spect
##.PULSE SEQUENCE= zg30
##.SOLVENT NAME= CDCl3
##.SHIFT REFERENCE= (INTERNAL, CDCl3, 0, 14.3821)
##AUDIT TRAIL= $$ (NUMBER, WHEN, WHO, WHERE, WHAT)
$$ ##TITLE= Audit trail, XWIN-NMR		Version 3.5
$$ ##JCAMPDX= 5.01
$$ ##ORIGIN= Bruker BioSpin GmbH
$$ ##OWNER= she
$$ F:/spectra/data/she/nmr/H-C/1/audita.txt
$$ ##AUDIT TRAIL=  $$ (NUMBER, WHEN, WHO, WHERE, WHAT)
(   1,<2025-03-27 16:19:25.82 +0400>,<she>,<DPX200>,
      <created by zg, POWCHK disabled, PULCHK disabled
       configuration hash MD5:
       00 E9 B6 7A A2 85 ED C7 34 08 36 98 17 FE 4E 26
       data hash MD5: 16K
       B6 A6 E5 9F 3A 41 D4 6B 5F F8 8B 51 7D C6 AA 80>)
$$ ##END=
$$ 
$$ hash MD5
$$ 7F 7E 57 74 12 58 72 74 A3 8B C3 86 C1 DE 99 AA
##$RELAX= 
##$RELAX= 
##$RELAX= 
##$RELAX= 
##$RELAX= 
##$RELAX= 
$$ Bruker specific parameters
$$ --------------------------
##$DU= <F:/spectra>
##$EXPNO= 1
##$NAME= <H-C>
##$PROCNO= 1
##$TYPE= <nmr>
##$USER= <she>
##$AMP= (0..31)
100 100 100 100 100 100 100 100 100 100 100 100 100 100 100 100 100 100 
100 100 100 100 100 100 100 100 100 100 100 100 100 100 
##$AQSEQ= 0
##$AQ_mod= 1
##$AUNM= <au_zg>
##$AUTOPOS= <>
##$BF1= 200.13
##$BF2= 200.13
##$BF3= 200.13
##$BF4= 200.13
##$BF5= 200.13
##$BF6= 200.13
##$BF7= 200.13
##$BF8= 200.13
##$BYTORDA= 1
##$CFDGTYP= 0
##$CFRGTYP= 5
##$CHEMSTR= <none>
##$CNST= (0..31)
1 1 145 1 1 1 1 1 1 1 1 1 1 1 1 1 1 1 1 1 1 1 1 1 1 1 1 1 1 1 1 1 
##$CPDPRG= <>
##$CPDPRG1= <>
##$CPDPRG2= <>
##$CPDPRG3= <>
##$CPDPRG4= <mlev>
##$CPDPRG5= <mlev>
##$CPDPRG6= <mlev>
##$CPDPRG7= <mlev>
##$CPDPRG8= <mlev>
##$CPDPRGB= <>
##$CPDPRGT= <>
##$D= (0..31)
0 0.7 0 0 0 0 0 0 0 0 0 0.03 0 0 0 0 0 0 0 0 0 0 0 0 0 0 0 0 0 0 0 0 
##$DATE= 1743077965
##$DBL= (0..7)
120 120 120 120 120 120 120 120 
##$DBP= (0..7)
150 150 150 150 150 150 150 150 
##$DBP07= 0
##$DBPNAM0= <>
##$DBPNAM1= <>
##$DBPNAM2= <>
##$DBPNAM3= <>
##$DBPNAM4= <>
##$DBPNAM5= <>
##$DBPNAM6= <>
##$DBPNAM7= <>
##$DBPOAL= (0..7)
0.5 0.5 0.5 0.5 0.5 0.5 0.5 0.5 
##$DBPOFFS= (0..7)
0 0 0 0 0 0 0 0 
##$DE= 6
##$DECBNUC= <off>
##$DECIM= 32
##$DECNUC= <off>
##$DECSTAT= 4
##$DIGMOD= 1
##$DIGTYP= 9
##$DL= (0..7)
0 120 120 120 120 120 120 120 
##$DP= (0..7)
150 150 150 150 150 150 150 150 
##$DP07= 0
##$DPNAME0= <>
##$DPNAME1= <>
##$DPNAME2= <>
##$DPNAME3= <>
##$DPNAME4= <>
##$DPNAME5= <>
##$DPNAME6= <>
##$DPNAME7= <>
##$DPOAL= (0..7)
0.5 0.5 0.5 0.5 0.5 0.5 0.5 0.5 
##$DPOFFS= (0..7)
0 0 0 0 0 0 0 0 
##$DQDMODE= 0
##$DR= 18
##$DS= 0
##$DSLIST= <SSSSSSSSSSSSSSS>
$$ [...]
##$SUBNAM0= <"">
##$SUBNAM1= <"">
##$SUBNAM2= <"">
##$SUBNAM3= <"">
##$SUBNAM4= <"">
##$SUBNAM5= <"">
##$SUBNAM6= <"">
##$SUBNAM7= <"">
##$SUBNAM8= <"">
##$SUBNAM9= <"">
##$SW= 18.0517328524113
##$SWIBOX= (0..15)
0 0 2 0 0 0 0 0 0 0 0 0 0 0 0 0 
##$SW_h= 3612.71676300578
##$TD= 16384
##$TD0= 1
##$TE= 0
##$TE2= 300
##$TE3= 300
##$TEG= 300
##$TL= (0..7)
0 120 120 120 120 120 120 120 
##$TP= (0..7)
150 150 150 150 150 150 150 150 
##$TP07= 0
##$TPNAME0= <>
##$TPNAME1= <>
##$TPNAME2= <>
##$TPNAME3= <>
##$TPNAME4= <>
##$TPNAME5= <>
##$TPNAME6= <>
##$TPNAME7= <>
##$TPOAL= (0..7)
0.5 0.5 0.5 0.5 0.5 0.5 0.5 0.5 
##$TPOFFS= (0..7)
0 0 0 0 0 0 0 0 
##$TUNHIN= 0
##$TUNHOUT= 0
##$TUNXOUT= 0
##$USERA1= <user>
##$USERA2= <user>
##$USERA3= <user>
##$USERA4= <user>
##$USERA5= <user>
##$V9= 5
##$VALIST= <valist>
##$VCLIST= <CCCCCCCCCCCCCCC>
##$VD= 0
##$VDLIST= <DDDDDDDDDDDDDDD>
##$VPLIST= <PPPPPPPPPPPPPPP>
##$VTLIST= <TTTTTTTTTTTTTTT>
##$WBST= 1024
##$WBSW= 4
##$XGAIN= (0..3)
0 0 0 0 
##$XL= 0
##$YL= 0
##$YMAX_a= 339375
##$YMIN_a= -335004
##$ZGOPTNS= <>
##$ZL1= 120
##$ZL2= 120
##$ZL3= 120
##$ZL4= 120
##$ABSF1= 10
##$ABSF2= 0
##$ABSG= 5
##$ABSL= 3
##$ALPHA= 0
##$AQORDER= 0
##$ASSFAC= 0
##$ASSFACI= 0
##$ASSFACX= 0
##$ASSWID= 0
##$AUNMP= <proc_1d>
##$AZFE= 0.1
##$AZFW= 0.1
##$BCFW= 1
##$BC_mod= 2
##$BYTORDP= 1
##$COROFFS= 0
##$CY= -3
##$DATMOD= 1
##$DC= 2
##$DFILT= <>
##$DTYPP= 0
##$F1P= 0
##$F2P= 0
##$FCOR= 0.5
##$FTSIZE= 0
##$FT_mod= 4
##$GAMMA= 1
##$GB= 0.15
##$INTBC= 1
##$INTSCL= 1
##$ISEN= 128
##$LB= 0.25
##$LEV0= 0
##$LPBIN= 0
##$MAXI= 10000
##$MC2= 0
##$MEAN= 0
##$ME_mod= 0
##$MI= 1.114404
##$NCOEF= 0
##$NC_proc= 0
##$NLEV= 6
##$NOISF1= 3.799351
##$NOISF2= 2.8
##$NSP= 1
##$NTH_PI= 0
##$NZP= 0
##$OFFSET= 14.38212
##$PC= 1
##$PHC0= -467.8698
##$PHC1= 11.59221
##$PH_mod= 1
##$PKNL= yes
##$PPARMOD= 0
##$PSCAL= 0
##$PSIGN= 0
##$REVERSE= no
##$SF= 200.129724274929
##$SI= 16384
##$SIGF1= 3
##$SIGF2= 2
##$SINO= 400
##$SIOLD= 16384
##$SREGLST= <1H.CDCl3>
##$SSB= 0
##$STSI= 0
##$STSR= 0
##$SW_p= 3205.1282051282
##$SYMM= 0
##$S_DEV= 0
##$TDeff= 0
##$TDoff= 0
##$TI= <>
##$TILT= no
##$TM1= 0
##$TM2= 0
##$TOPLEV= 0
##$USERP1= <user>
##$USERP2= <user>
##$USERP3= <user>
##$USERP4= <user>
##$USERP5= <user>
##$WDW= 1
##$XDIM= 8192
##$YMAX_p= 0
##$YMIN_p= 0
$$ End of Bruker specific parameters
$$ ---------------------------------
##NTUPLES= NMR FID
##VAR_NAME=  TIME,          FID/REAL,        FID/IMAG
##SYMBOL=    X,             R,               I
##VAR_TYPE=  INDEPENDENT,   DEPENDENT,       DEPENDENT
##VAR_FORM=  AFFN,          ASDF,            ASDF
##VAR_DIM=   8192,          8192,            8192
##UNITS=     SECONDS,       ARBITRARY UNITS, ARBITRARY UNITS
##FACTOR=    0.0002768,     1,               1
##FIRST=     0,             0,               0
##LAST=      2.2672688,     0,               0
##MIN=       0,             -335004,         0
##MAX=       2.2672688,     339375,          0
$$ Real data points
##PAGE= N=1
##DATA TABLE= (X++(R..R)), XYDATA
$$ plain form
0 0 0 0 0 0 0 0 0 0 0 0 0 0 0 0 0 -5 8 -8 8 -8 13 -16 16 -20 24 -29 33 -38 44 -52 59 -67 76 -86 95 -109 122
37 122 -137 154 -170 191 -210 234 -260 287 -316 350 -387 426 -469 516 -570 629 -692 764 -847
56 -847 938 -1044 1168 -1310 1484 -1693 1956 -2295 2753 -3405 4427 -6237 10458 -42113 9644
71 9644 25776 -64252 137356 271632 1508 -103286 251901 239398 -166457 -64511 259870
82 259870 -42786 -321495 19484 107792 -299861 -228637 169594 3168 -280414 19471
92 19471 270165 21200 -86491 151111 166870 -24172 33664 175112 21505 -146340 3440
103 3440 112351 -99410 -181840 61893 90440 -173933 -130565 127099 18552 -159501 61549
114 61549 175722 -104304 -122430 197162 151775 -132446 -29669 160655 -16836 -130508
$$ packed form
0@%%%%%%%%%%%%%%%nJ3j6J6j6K1k9L2l6M4n3O2p1Q2r6J11j26J43j62J81k04K31
37A22k59K91l24L61m01M44m94N47o03O66p37Q13q95R85j086J199j321J456j611
56h47J785j982K212k478K794l177L649m251N048o158P832j0664J6695n2571N1757
71I644J6132r0028K01608J34276k70124j04794L55187j2503m05855J01946L24381
82B59870l02656k78709L40979Q8308m07653P1224L98231j66426k83582K99885
92A9471K50694k48965j07691K37602J5759j91042N7836J41448j53607j67845J49780
103C440J08911k11761q2430K43733K8547k64373M3368K57664j08547j78053K21050
114F1549J14173k80026j8126L19592m5387k84221J02777J90324j77491j13672
$$ plain form
124 -130508 68853 76921 -159414 -118142 98054 12556 -147994 3623 139723 -21063 -82795
135 -82795 111594 131301 -52569 -17125 128130 12061 -124883 11712 88972 -82121 -126098
146 -126098 31231 26649 -97916 -31305 82705 -6299 -79994 43811 100291 -25127 -45268
157 -45268 88285 73371 -67792 -33492 83227 7904 -89516 5641 45749 -88798 -87435
168 -87435 61926 24922 -104425 -21600 87060 -1636 -40962 74573 72038 -40076 -1499
179 -1499 91443 21055 -62012 2768 43215 -39500 -69266 7526 20955 -50780 -42928 30873
191 30873 8540 -52258 6055 69367 -6917 -50692 44281 63643 -36239 -22421 65226 9269
203 9269 -63621 14759 49996 -50462 -56366 41214 14636 -67518 -12904 54059 -2742 -35016
$$ packed form
124a30508J99361Q068k36335M1272K16196q5498j60550J51617J36100j60786o1732
135h2795J94389J9707j83870L5444J45255j16069j36944J36595P7260j71093m3977
146a26098J57329m582j24565O6611J14010q9004p3695J23805N6480j25418k0141
157d5268J33553j4914j41163L4300J16719p5323r7420R5157M0108j34547J363
168h7435J49361l7004j29347Q2825J08660q8696l9326J15535k535j12114L8577
179a499R2942p0388q3067O4780M0447q2715k9766P6792J3429p1735P852P3801
191C0873k2333o0798N8313O3312p6284m3775R4973J9362r9882J3818Q7647n5957
203I269p2890P8380L5237j00458n904R7580k6578q2154N4614O6963n6801l2274
$$ plain form
215 -35016 30073 40763 -18970 -7600 44092 11952 -43120 -10826 31134 -12860 -46322 5426
227 5426 28127 -26354 -25033 41546 26483 -33456 4484 54083 -4542 -39687 25095 33396 -37989
240 -37989 -27165 32006 -1811 -44810 3805 27421 -29496 -32210 26174 14740 -34191 -5303
252 -5303 38837 6354 -19510 23766 41380 -2982 -10002 29886 16657 -30337 -16201 14982
264 14982 -18907 -47746 -8112 9626 -28558 -23219 25867 17251 -16232 14133 44944 8130
276 8130 -10934 26781 26041 -18974 -12533 21725 -1779 -32860 -4531 14397 -18109 -27001 6870
289 6870 6128 -23639 -12054 16382 1194 -15429 10561 25478 1350 -1371 26349 20870 -8540
302 -8540 -774 18050 -4467 -27308 -7129 3578 -22870 -25288 5050 5521 -15098 -304 23934
$$ packed form
215c5016O5089J0690n9733J1370N1692l2140n5072L2294M1960m3994l3462N1748
227E426K2701n4481J321O6579j5063n9939L7940M9599n8625l5145O4782Q301p1385
240c7989J0824N9171l3817m2999M8615K3616n6917k714N8384j1434m8931K8888
252e303M4140l2483k5864M3276J7614m4362p020L9888j3229m6994J4136L1183
264A4982l3889k8839L9634J7738l8184N339M9086q616l3483L0365L0811l6814
276H130j9064L7715p40m5015O441L4258k3504l1081K8329J8928l2506q892L3871
289F870p42k9767J1585K8436j5188j6623K5990J4917k4128k721K7720n479k9410
302h540P766J8824k2517k2841K0179J0707k6448k418L0338M71k0619J4794K4238
$$ plain form
315 23934 9050 -5395 15753 21505 -4613 -6722 14077 3416 -19390 -5447 11097 -8990
327 -8990 -19459 4055 8749 -14330 -11616 11070 2469 -15667 383 14737 -2164 -7402 13729
340 13729 14612 -4972 733 16817 3149 -12920 808 7180 -12018 -15502 3534 2000 -13981
353 -13981 -3431 13363 2192 -7707 8707 14821 -3448 -5610 9266 3836 -11605 -3846 7030
366 7030 -4570 -11014 3119 6537 -6698 -4506 9509 3569 -7621 2010 9854 -2205 -6334 6680
380 6680 7370 -6673 -3698 8397 1019 -8997 -1020 4779 -4780 -7030 2895 2969 -4371 -98 9056
395 9056 4310 -1606 5393 9545 62 -4496 3679 2328 -9136 -7419 2013 -4292 -12615 -2335 3983
410 3983 -5241 -5702 6290 5387 -2901 3517 9815 2511 -120 8610 7069 -2170 -883 4687 -1049
$$ packed form
315B3934j4884j4445K1148N752k6118k109K0799j0661k2806J3943J6544k0087
327h990j0469K3514M694k3079K714K2686q601j8136J6050J4354j6901n238K1131
340A3729Q83j9584N705J6084j3668j6069J3728O372j9198l484J9036j534j5981
353a3981J0550J6794j1171r899J6414O114j8269k162J4876n430j5441P759J0876
366G030j1600o444J4133L418j3235K192J4015n940j1190R631P844j2059m129J3014
380F680O90j4043K975J2095p378j0016P977N799r559k250R925P4p340M273R154
395I056m746n916O999M152r483m558Q175j351j1464J717R432o305q323J0280O318
410C983r224m61J1992r03q288O418O298p304k631Q730j541r239J287N570n736
$$ plain form
425 -1049 -7927 -5038 -2488 -6908 -9222 -4209 -1411 -4985 -3994 4977 6516 418 3520 11174 6074
440 6074 -615 4728 6498 -3272 -4286 2253 -3066 -10509 -3892 585 -7350 -8073 913 835 -5467 -1045
456 -1045 5028 1732 -1186 5379 9224 3274 343 5986 6474 -1070 -2936 1633 -2358 -8564 -4150
471 -4150 -989 -8329 -7841 3104 2350 -5493 1904 10187 2514 -887 7739 6198 -3475 -126 5693
486 5693 -2766 -7701 -45 1388 -5249 -3753 1380 -469 -3086 1111 2423 -2160 -829 5102 4465
501 4465 -476 526 5336 4005 154 1439 1820 -3580 -3923 -347 -3936 -8458 -4605 -572 -3282 -2793
517 -2793 2444 2995 2620 5429 5663 3213 4532 5308 1042 -1366 -826 -1857 -2596 -2157 -4229 -4769 -923
534 -923 -446 -3358 -2302 250 -768 -523 2012 967 -141 2801 5794 3959 1840 2955 4155 2422
$$ packed form
425a049o878K889K550m420k314N013K798l574R91Q971J539o098L102P654n100
440F074o689N343J770r770j014O539n319p443O617M477p935p23Q986p8o302M422
456a045O073l296k918O565L845n950k931N643M88p544j866M569l991o206M414
471d150L161p340M88J0945p54p843P397Q283p673l401Q626j541r673L349N819
486E693q459m935P656J433o637J496N133j849k617M197J312m583J331N931o37
501D465m941J002M810j331l851J285L81n400l43L576l589m522L853M033k710M89
517b793N237N51l75K809K34k450J319P76m266k408N40j031p39M39k072n40L846
534i23M77k912J056K552j018K45K535j045j108K942K993j835k119J115J200j733
$$ plain form
550 2422 175 -44 -1897 -5923 -4710 -980 -4311 -7926 -2324 1345 -2346 -1048 5082 2710 -810
565 -810 4461 5597 -422 799 4767 107 -3306 2004 3395 -2128 -2138 1066 -1216 -3898 -2038 -411
581 -411 -3443 -5371 -2065 701 -1548 -1784 2310 3597 1330 4052 6364 963 -161 5553 3360 -3865
597 -3865 -1850 1402 -3243 -3934 1037 -1983 -6461 -1481 1884 -2313 -2687 520 -590 -933 2350 2458
613 2458 652 2516 3643 2567 2851 2917 1300 536 -681 -2449 -1439 -1391 -4317 -4493 -2139 -2696 -2592
630 -2592 766 759 -1093 1352 3397 1958 1746 2989 1365 1154 3213 1194 -1912 -658 749 -1324
646 -1324 -2033 -2017 -3596 -2549 -210 -1414 -2623 -148 1202 416 1754 3707 1527 976 2449 2067 174
663 174 304 158 -1804 -2167 -1262 -1300 -1860 -1351 -1235 -1692 -814 653 1209 517 -201 1345 2463 1590 839
$$ packed form
550B422k247k19j853m026J213L730l331l615N602L669l691J298O130k372l520
565h10N271J136o019J221L968m660l413N310J391n523j0L204k282k682J860J627
581d11l032j928L306K766k249k36M094J287k267K722K312n401j124N714k193p225
597c865K015L252m645o91M971l020m478M980L365m197l74L207j110l43L283J08
613B458j806J864J127j076K84O6j617p64j217j768J010M8k926j76K354n57J04
630b592L358pj852K445K045j439k12J243j624k11K059k019l106J254J407k073
646a324p09J6j579J047K339j204j209K475J350p86J338J953k180n51J473l82j893
663A74J30j46j962l63R05l8n60N09J16m57Q78J467N56o92p18J546J118q73p51
$$ plain form
682 839 1503 1624 141 225 531 -827 -2114 -1092 -783 -2500 -2214 -870 -688 -331 1151 1805 715 1169
700 1169 3254 2256 252 432 909 -713 -1750 -185 -446 -1944 -1433 -139 -733 -1262 287 -173 -950
717 -950 -36 985 -173 -126 1181 1253 283 770 1809 1149 271 71 169 -507 -991 -894 -1258 -1455 -1089 -883
737 -883 -93 -175 359 978 624 575 595 1118 9 -101 333 -524 -1090 7 272 164 74 399 83 54 369
758 369 2 -844 -274 -525 -1312 -688 -377 -715 -157 1051 743 490 1602 943 75 768 1028 -285 -326 204
778 204 -1014 -1214 -102 71 -552 -211 90 -570 -769 -483 -37 -546 -159 149 79 284 1078 1006 983 1127 1111
799 1111 811 354 -406 -455 -907 -1402 -1398 -950 -1352 -1329 -711 -50 146 753 1423 999 955 1340 994 -142 375
820 375 421 -164 -664 -376 -620 -866 -962 -840 -891 -684 -642 -782 -493 -229 297 569 672 1018 1408 1216 1115 1040
$$ packed form
682H39O64J21j483Q4L06j358j287J022L09j717K86J344J82L57J482O54j090M54
700A169K085r98k004J80M77j622j037J565k61j498N11J294n94n29J549m60p77
717i50R14J021j158M7J307P2r70M87J039o60q78k00R8o76m84R7l64j97L66K06
737h83P90q2N34O19l54m9K0N23j109j10M34q57n66J097K65j08r0L25l16k9L15
758C69l67q46N70k51p87O24L11l38N58J208l08k53J112o59q68O93K60j313m1N30
778B04j218k00J112J73o23L41L01o60j99K86M46n09L87L08p0K05P94p2k3J44j6
799A111l00m57p60m9m52m95MM48m02K3O18O61J96O07O70m24m4L85l46j136N17
820C75M6n85n00K88k44k46r6J22n1K07M2j40K89K64N26K72J03L46L90j92j01p5
$$ plain form
842 1040 816 262 -103 -362 -956 -1439 -1189 -1317 -1355 -832 -951 -429 236 760 465 1105 1399 830 1027 1187
862 1187 680 409 -22 231 -481 -593 -702 -1405 -1013 -612 -889 -826 -589 -34 7 280 252 545 848 1064 688
883 688 961 921 357 316 185 76 -458 -543 -574 -1229 -986 -544 -723 -358 -155 -93 -195 497 730 613 789 487
905 487 746 449 461 7 -59 -102 -284 -185 -271 -658 -282 -127 -217 -507 -133 -212 -645 236 182 49 129 650 124
928 124 31 902 461 46 567 635 -15 -281 120 -329 -826 -278 -303 -462 -420 -679 -37 -14 23 -392 583 154
950 154 125 1028 590 -324 65 771 45 266 823 -269 -1000 284 366 -1023 -705 246 -457 -1028 207 239
970 239 -746 193 1096 -50 330 1247 886 -29 552 679 -363 -414 154 -491 -1007 -311 -617 -849 -567 -429
990 -429 -139 -90 481 70 283 813 1130 1089 302 94 497 721 29 -381 -221 -633 -893 -421 -578 -1531 -690
$$ packed form
842A040k24n54l65k59n94m83K50j28l8N23j19N22O65N24k95O40K94n69J97J60
862A187n07k71m31K53p12j12j09p03L92M01k77O3K37N55M1K73k8K93L03K16l76
883F88K73m0n64m1j31j09n34q5l1o55K43M42j79L65K03O2j02O92K33j17J76l02
905D87K59k97J2m54o6m3j82R9q6l87L76J55r0k90L74p9m33Q81n4j33Q0N21n26
928A24r3Q71m41m15N21O8o50k66M01m49m97N48k5j59M2k59O42K3L7m15R75m29
950A54k9R03m38r14L89P06p26K21N57j092p31J284Q2j389L18R51p03n71J235L2
970B39r85R39R03j146L80R17l61r15N81J27j042n1N68o45n16O96l06k32K82J38
990d29K90M9N71m11K13N30L17m1p87k08M03K24o92m10J60m12k60M72j57r53Q41
$$ plain form
1011 -690 114 -313 -482 680 581 -57 959 1591 633 240 1118 734 -450 -226 155 -972 -1200 -378 -1028
1030 -1028 -1539 -749 -85 -778 -602 539 716 100 644 1160 917 736 1274 707 -337 -179 494 -411 -1130
1049 -1130 -649 -660 -1134 -522 -293 -996 -942 332 278 -237 285 948 593 808 870 602 262 287 90 -211 -796
1070 -796 -878 -518 -962 -1179 -768 -550 -544 -170 359 396 183 862 1433 121 -68 985 307 -42 499 211 -685
1091 -685 -395 251 -643 -1155 320 -323 -872 92 380 -832 -83 1047 -112 -4 536 872 122 709 425
1110 425 -228 -221 141 -542 -761 -738 -695 -590 -183 -352 -117 266 286 -2 420 541 212 487 611 -64 -306 492
1132 492 237 -443 -30 192 -519 -26 88 -708 -424 124 -254 -505 -249 393 -255 320 664 282 -77 236
1152 236 570 -71 -22 -55 30 -182 -353 -148 -540 -429 -209 -73 -251 -567 108 240 -141 86 207 220 -19
$$ packed form
1011f90Q04m27j69J162r9o38J016O32r58l93Q78l84j184K24L81j127k28Q22o50
1030a028n11P90O64o93J76J141J77o16N44N16k43j81N38n67j044J58O73r05p19
1049a130M81j1m74O12K29p03N4J274n4n15N22O63l55K15O2k68l40K5j97l01n85
1070g96q2L60m44k17M11K18OL74N29L7k13O79N71j312j89J053o78l49N41k88q96
1091f85K90O46q94n12J475o43n49R64K88j212P49J130j159J08N40L36p50N87k84
1110D25o53PL62o83k19K3M3J05M07j69K35L83K0k88M22J21l29K75J24o75k42P98
1132D92k55o80M13K22p11M93J14p96K84N48l78k51K56O42o48N75L44l82l59L13
1152B36L34o41M9l3Q5k12j71K05l92J11K20J36j78l16O75J32l81K27J21J3k39
$$ plain form
1173 -19 84 -35 169 483 322 177 -186 -186 133 -371 -245 45 -432 -82 -52 -3 -319 3 132 23 -87 233
1195 233 244 154 71 667 239 -70 -13 346 -99 -149 125 -253 -373 -207 -263 -417 -110 18 43 73 300 266 -51
1218 -51 420 110 27 279 483 121 98 10 -103 -314 -320 -380 -615 -209 -354 -321 -318 -31 -146 148 244 176 425 92
1242 92 294 256 417 159 -258 201 -98 -381 -384 -267 -324 -209 -275 -485 -236 -122 -196 -241 44 458 475 551 376
1265 376 393 259 146 233 34 44 -115 -134 -250 -110 -231 -480 -643 -161 -289 -153 -130 354 33 303 151 403
1287 403 334 474 402 359 143 75 135 -162 -467 -340 -154 -365 -381 -202 -154 -41 -70 382 -50 3 173 108 160 284
1311 284 475 -105 -92 -124 -6 -523 -111 -268 -163 -372 -230 -256 -360 110 -74 341 289 167 199 267 240 -114
1333 -114 -33 -110 63 -298 -391 -110 -292 -3 -187 -348 -322 -239 -348 243 -261 117 102 25 -97 124 212 50 219
$$ packed form
1173a9J03j19K04L14j61j45l63%L19n04J26K90m77L50L0M9l16L22J29j09j10L20
1195B33J1r0q3N96m28l09N7L59m45n0K74l78j20J66n6j54L07J28K5L0K27l4l17
1218e1M71l10q3K52K04l62k3q8j13k11oo0k35M06j45L3LK87j15K94R6o8K49l33
1242I2K02l8J61k58m17M59k99k83lJ17n7J15o6k10K49J14p4m5K85M14J7P6j75
1265C76J7j34j13Q7j99J0j59j9j16J40j21k49j63M82j28J36K3M84l21K70j52K52
1287D03o9J40p2m3k16o8O0k97l05J27J86k11j6J79M8J13k9M52m32N3J70o5N2J24
1311B84J91n80J3l2J18n17M12j57J05k09J42k6j04M70j84M15n2j22L2O8k7l54
1333a14Q1p7J73l61r3K81j82K89j84j61K6Q3j09N91n04L78j5p7j22K21Q8j62J69
$$ plain form
1356 219 -221 -102 134 45 -146 -34 -281 -97 -608 -520 -122 54 58 134 3 -154 240 145 82 279 -69 65
1378 65 -22 17 455 28 1 72 -157 45 -60 -335 29 -78 -382 -113 -87 81 121 116 229 341 132 513 -46
1401 -46 304 14 72 -59 -103 -35 -90 -209 -194 96 -61 -243 -16 167 -88 -94 166 67 123 314 319 218 181 434
1425 434 -83 305 90 159 -284 -335 -129 125 -26 9 -150 -336 115 -3 -25 -54 2 351 -133 5 320 56
1447 56 -44 260 120 -17 -80 86 -348 -389 -7 -202 -366 -47 93 -19 180 206 -28 354 -5 451 404 -56
1469 -56 141 65 -180 0 84 54 -494 34 -207 -21 -303 -126 102 -227 -10 346 -10 -216 311 446 245
1490 245 460 249 117 -152 222 -102 -423 -235 -61 -342 -481 161 -62 -155 -160 222 -111 342 -11 171 12
1511 12 215 247 98 -86 -77 204 191 218 -12 -228 -7 246 -202 -364 -15 -210 -20 -81 105 -179 19 80 547
$$ packed form
1356B19m40J19K36q9j91J12k47J84n11Q8L98J76MP6j31j57L94r5o3J97l48J34
1378F5q7L9M38m27k7P1k29K02j05k75L64j07l04K69K6J68M0nJ13J12k09L81n59
1401d6L50k90N8j31m4O8n5j19J5K90j57j82K27J83k55oK60r9N6J91Nj01l7K53
1425D34n17L88k15O9m43n1K06K54j51L5j59j86M51j18k2k9N6L49m84J38L15k64
1447E6j00L04j40j37o3J66m34m1L82j95j64L19J40j12J99K6k34L82l59M56m7m60
1469e6J97p6k45J80Q4l0n48N28k41J86k82J77K28l29K17L56l56k06N27J35k01
1490B45K15k11j32k69L74l24l21J88J74k81j39O42k23r3nL82l33M53l53J82j59
1511A2K03L2j49j84RK81j3K7k30k16K21K53m48j62L49j95J90o1J86k84J98O1M67
$$ plain form
1534 547 95 101 154 -87 107 207 113 -97 -407 -26 16 -236 -109 136 61 -104 88 82 -7 -88 120 73 -99 167
1558 167 230 -154 84 198 230 90 92 -249 -101 -265 -125 -87 -80 63 101 138 401 204 -48 420 243 248 234 -283
1582 -283 56 426 43 -65 -94 -12 -195 -163 -144 -116 -256 108 -73 -350 189 176 154 69 108 205 220 396 -50 -119
1606 -119 68 184 45 -238 -487 97 -318 -329 -462 35 -389 72 145 155 172 326 359 213 27 98 31 45 172
1629 172 140 24 31 -226 -342 -148 -203 -309 -330 117 -122 3 -70 35 502 438 83 229 152 -20 0 -74 -170 74
1653 74 -134 318 -291 -79 -91 -121 57 -28 162 -8 6 367 236 -93 60 140 -15 136 309 144 -77 -65
1675 -65 159 -141 133 -137 144 -162 -104 -319 71 149 146 -92 208 310 -164 138 -86 116 -28 280 -31 319
1697 319 223 -102 28 -270 56 -420 0 151 317 11 -204 -101 -62 -149 -224 -168 146 284 72 91 236 -194
$$ packed form
1534E47m52ON3k41J94J00r4k10l10L81M2k52J27K45p5j65J92oq9q1K08m7j72K66
1558A67O3l84K38J14L2j40Kl41J48j64J40L8PJ43L8L7K63j97k52M68j77Nj4n17
1582b83L39L70l83j08k9Q2j83L2J9K8j40L64j81k77N39j3k2q5L9R7J5J76m46o9
1606a19J87J16j39k83k49N84m15j1j33M97m24M61P3J0J7J54L3j46j86P1o7J4J27
1629A72l2j16Pk57j16J94n5j06k1M47k39J25p3J05M67o4l55J46p7j72K0p4r6K44
1653G4k08M52o09K12j2l0J78q5J90j70J4L61j31l29J53Q0j55J51J73j65k21J2
1675f5K24l00K74k70K81l06N8k15L90P8lk38L00J02m74L02k24K02j44L08l11L50
1697C19r6l25J30k98L26m76M20J51J66l06k15J03L9q7p5N6L14J38k12J9J45m30
$$ plain form
1719 -194 65 -128 -106 -92 -261 282 -177 341 -164 -6 -313 141 -139 -192 120 -72 258 242 -85 109 277
1740 277 180 357 -32 32 -65 -226 -248 -129 54 -167 231 52 136 59 99 97 187 48 -139 147 226 278 285 -31 20
1765 20 147 -23 121 -194 -136 -110 -5 -95 198 -249 -70 -128 -212 192 129 111 365 489 75 166 259 29 176
1788 176 19 55 -63 -253 -133 -169 -156 -331 -147 85 36 -27 27 51 218 111 323 230 -11 -83 -121 -43 344 -52
1812 -52 -130 -178 -259 -167 -107 -304 -55 -62 -213 182 -246 143 338 312 82 81 -1 -73 181 -105 -320 -122 82 27 68
1837 68 -173 -35 -33 -118 8 111 103 57 -78 -31 193 50 -49 228 -269 27 61 43 -116 -108 -42 -48 259 -184 -139 91
1863 91 -96 -15 -124 384 -44 55 197 97 222 -20 -47 106 197 77 -294 7 115 -191 -182 73 -22 43 45 -39
1887 -39 121 -93 149 184 66 35 398 408 -102 245 -86 33 -11 -194 144 -109 140 -115 -7 9 -55 114
$$ packed form
1719a94K59j93K2J4j69N43m59N18n05J58l07M54k80n3L12j92L30j6l27J94J68
1740B77r7J77l89O4r7j61k2J19J83k21L98j79Q4p7M0kR0j39j87K86P9N2Pl16N1
1765B0J27j70J44l15N8K6J05r0K93m47J79n8q4M04o3j8K54J24m14R1R3k30J47
1788A76j57L6j18j90J20l6J3j75J84K32m9o3N4K4J67j07K12r3k41p2l8P8L87l96
1812e2p8m8q1R2O0j97K49pj51L95m28L89J95k6k30jq2p2K54k86k15J98K04n5M1
1837F8k41J38Kq5J26J03qm6j35M7K24j43r9K77m97K96L4j8j59QO6oL07m43M5K30
1863I1j87Q1j09N08m28R9J42j00J25k42k7J53R1j20l71L01J08l06RK55r5O5Kq4
1887c9J60k14K42L5j18l1L63J0n10L47l31J19m4j83L38k53K49k55J08J6o4J69
$$ plain form
1909 114 -5 -57 -77 235 106 14 168 106 71 312 -138 264 330 -205 -54 -137 160 41 -131 -93 -87 -263 81
1932 81 -81 -143 154 407 71 175 128 -68 72 -158 -131 -8 4 102 -135 -119 -115 46 -228 -88 85 -229 11
1955 11 -203 -222 -24 -116 192 304 73 186 286 80 29 40 158 74 56 6 16 -91 -138 46 13 -139 -329 186
1979 186 18 27 183 88 368 -151 137 55 76 242 72 -292 -18 200 -91 -244 -194 -356 -271 25 266 -55
2001 -55 196 84 204 15 -15 200 199 78 -130 248 85 77 90 252 -191 3 -13 -149 -304 68 323 13 -95
2024 -95 -180 160 -138 137 93 -104 170 97 107 49 -306 221 -361 -348 -70 -59 98 -19 -41 6 253 171 -161 108
2048 108 160 67 -108 108 100 152 -157 -393 -115 -86 -349 163 102 -328 -40 -99 66 280 155 111 148 143 206 -28
2072 -28 123 267 13 -112 185 -72 -20 -125 -67 298 -95 -80 304 -126 140 -149 -19 -72 -170 -62 119 4
$$ packed form
1909A14j19n2k0L12j29r2J54o2l5K41m50M02O6n35J51q3K97j19j72L8Oj76L44
1932H1j62o2K97K53l36J04m7j96J40k30K7J23J2R8k37J6MJ61k74J40J73l14K40
1955A1k14j9J98r2L08J12k31J13J00k06n1J1J18q4j8n0J0j07m7J84l3j52j90N15
1979A86j68RJ56r5K80n19K88q2K1J66j70l64K74K18k91j53N0j62Q5K96K41l21
2001e5K51j12J20j89l0K15jj21k08L78j63qJ3J62m43J94j6j36j55L72K55l10j08
2024i5q5L40k98K75m4j97K74p3J0n8l55N27n82J3K78J1J57j17k2M7K47q2l32K69
2048A08N2r3j75K16qN2l09k36K78K9k63N12o1m30K88n9J65K14j25m4L7nO3k34
2072b8J51J44k54j25K97k57N2j05N8L65l93J5L84m30K66k89J30n3r8J08J81j15
$$ plain form
2094 4 -174 28 47 36 -118 120 76 -191 93 -222 -5 -402 109 -89 -62 99 94 194 243 -89 39 210 150
2117 150 28 -5 -245 -36 188 21 -78 54 101 -98 88 45 138 35 -151 -59 92 -235 121 37 -28 -5 46
2140 46 64 -66 -104 225 -33 32 -22 57 -77 81 -119 76 -39 -331 -105 -192 118 88 -123 -124 -320 65 154 -44
2164 -44 227 44 186 301 30 16 207 -40 -81 51 242 77 -6 27 66 64 -10 -191 78 -246 68 131 176 87
2188 87 145 -153 -5 160 -112 248 -65 -270 -244 -74 -106 -74 -109 25 -132 66 297 111 12 118 144 53 -173
2211 -173 137 -12 23 -205 -118 43 -169 86 6 -202 -220 12 161 35 21 79 -273 -2 18 233 64 64 -59
2234 -59 -209 405 172 75 106 -80 -45 54 216 -305 -211 14 36 31 366 -96 -125 86 180 -119 -186 9 -101 15
2258 15 33 16 -221 -7 -42 -45 -28 109 92 304 -257 -43 -147 151 95 -37 10 -108 196 -1 244 259 -38 -9
$$ packed form
2094Dj78K02J9j1j54K38m4k67K84l15K17l97N11j98K7J61nJ00M9l32J28J71o0
2117A50j22l3k40K09K24j67r9J32M7j99J86m3R3j03j86R2J51l27L56q4o5K3N1
2140D6J8j30l8L29k58O5n4P9j34J58k00J95j15k92K26q7L10l0k11jj96L85Q9j98
2164d4K71j83J42J15k71j4J91k47m1J32J91j65q3L3L9kp4j81K69l24L14O3M5q9
2188H7N8k98J48J65k72L60l13k05K6J70l2L2l5J34j57J98K31j86r9J06K6r1k26
2211a73L10j49L5k28Q7J61k12K55q0k08j8K32J49j26j4N8l52K71K0K15j69%j23
2234e9j50O14k33r7L1j86L5R9J62n21R4K25K2nL35m62k9K11R4k99o7J95j10J16
2258A5J8j7k37K14l5lJ7J37j7K12n61K14j04K98n6j32M7j18L04j97K45J5k97K9
$$ plain form
2282 -9 -213 156 -98 -39 129 192 -2 -55 41 -132 -8 54 -362 120 116 4 -214 -123 115 171 43 21 47 161
2306 161 199 -137 53 -208 -8 37 -263 147 -4 -38 37 -133 -130 -17 -2 -155 -191 -58 -98 219 -181 -194 -129 -345
2330 -345 201 192 -94 -14 -93 170 104 -152 186 170 -34 -102 -27 43 136 261 -59 15 82 170 111 -75 16 32 -17 -105
2356 -105 -228 54 -99 -155 -95 -100 -125 94 394 52 120 125 55 86 17 12 28 -114 201 -18 116 -115 -16 -157 246
2381 246 166 -295 -178 -144 288 215 204 27 249 135 71 387 179 -50 -54 144 -41 239 82 -76 58 -23 47
2404 47 66 41 -9 -133 -275 206 -43 22 177 47 60 -22 112 -132 -284 169 -162 -82 -22 -282 -6 -71 6 41
2428 41 206 -89 -23 19 -53 -130 200 17 133 -31 221 -33 -25 67 41 136 -146 -45 182 -103 -71 -33 -76 162
2452 162 274 80 -22 61 -207 132 6 163 161 346 28 -111 135 18 68 46 32 -15 200 110 -99 -67 17
$$ packed form
2282ik04L69k54N9J68O3j94n3R6j73J24O2m16M82mj12k18R1K38N6j28k2K6J14
2306A61L8l36J90k61K00M5l00M10j51l4P5j70LJ13J5j53l6J33m0L17m00j3O5k16
2330c45N46rk86Q0p9K63o6k56L38j6k04o8P5P0R3J25l20P4O7Q8n9j86R1J6m9q8
2356a05j23K82j53n6O0nk5K19L00l42O8Np0L1o9nJ6j42L15k19J34k31R9j41M03
2381B46q0m61J17L4M32p3j1j77K22j14o4L16k08k29mJ98j85K80j57j58J34q1P0
2404D7J9k5n0j24j42M81k49O5J55j30J3q2J34k44j52M53l31Q0O0k60K76o5P7L5
2428D1J65k95O6M2p2p7L30j83J16j64K52k54QR2k6R5k82J01K27k85L2L8m3K38
2452A62J12j94j02Q3k68L39j26J57kJ85l18j39K46j17N0k2j4m7K15r0k09L2Q4
$$ plain form
2475 17 207 -287 131 -48 -136 -314 93 -73 228 -123 -250 -156 -199 117 -123 -60 63 21 193 148 34 103 -237
2498 -237 187 -20 -9 230 -365 42 -388 91 58 -74 127 138 -67 185 -35 68 339 87 198 -159 -121
2519 -121 18 -104 -320 13 123 54 50 70 65 -5 110 69 4 -103 -75 -126 85 -138 30 -64 -116 61 0 177 14
2544 14 -8 115 86 -156 122 101 196 86 81 140 -197 -164 -43 30 195 -241 73 62 -47 203 62 72 184 156
2568 156 92 -70 -65 -67 206 234 0 8 -37 -19 89 -103 -152 45 -174 116 -140 -132 -281 -68 -44 -246 139 26 -46
2593 -46 98 -327 34 21 112 189 -77 291 67 -169 209 -4 -67 -32 186 -126 -198 -250 -182 -65 -107 9 150
2616 150 -7 193 -102 145 -162 -78 -18 -243 177 -48 -215 -27 89 -126 -90 48 103 68 38 226 196 68
2638 68 365 71 77 -35 101 22 180 47 -70 -126 32 -85 -305 9 86 -306 -354 -230 -92 203 45 -2 -171
$$ packed form
2475A7J90m94M18j79q8j78M07j66L01l51j27R4m3L16k40O3J23m2J72m5j14O9l40
2498b37M24k07J1K39n95M07m30M79l3j32K01J1k05K52k20J03K71k52J11l57L8
2519a21J39j22k16L33J10o9mK0np0J15m1o5j07K8n1K11k23J68r4n2J77o1J77j63
2544A4k2J23k9k42K78k1R5j10nN9l37L3J21P3J65m36L14j1j09K50j41J0J12k8
2568A56o4j62NkK73K8k34Qm5J8J08j92m9J97k19K90k56Qj49K13K4k02L85j13p2
2593d6J44m25L61j3R1P7k66L68k24k36L78k13o3L5K18l12p2n2O8J17m2J16J41
2616A50j57K00k95K47l07Q4O0k25M20k25j67J88J16k15L6J38N5l5l0J88l0j28
2638F8K97k94Oj12J36p9J58j33j17n6J58j17k20L14P7l92m8J24J38K95j58m7j69
$$ plain form
2661 -171 -182 76 277 73 -205 -225 -13 -172 232 44 -276 -28 -66 -71 63 169 -37 233 205 -145 89 -31
2683 -31 25 -40 109 77 -47 114 141 130 -80 -229 -42 -164 -232 -92 11 -164 -242 10 164 -118 25 115 8
2706 8 193 -71 242 -80 -100 149 -143 50 43 -37 -103 -69 218 -73 59 83 219 78 -14 108 82 1 -99 349
2730 349 232 210 110 76 36 100 -277 242 22 -106 -64 -164 140 132 -138 -17 54 155 -93 -161 -122 283 90
2753 90 131 -108 135 108 48 47 -240 -155 143 -18 196 -202 127 43 156 342 -78 137 -151 45 -65 -221 183
2776 183 128 53 166 -50 -11 125 -48 -263 -170 90 -130 -103 -18 -33 -12 254 32 8 174 72 172 -8 173
2799 173 265 71 40 -126 112 -307 122 -13 20 68 -92 -139 -131 120 -8 38 -2 112 312 183 -138 -83 212
2822 212 75 -25 4 -38 -227 -223 40 88 -160 105 -21 -112 135 41 160 65 -177 107 -18 -47 -59 224 -114
$$ packed form
2661a71j1K58K01k04k78k0K12j59M04j88l20K48l8nJ34J06k06K70k8l50K34j20
2683c1N6o5J49l2j24J61K7j1k10j49J87j22o8J40J03j75p8K52J54k82J43R0j07
2706HJ85k64L13l22k0K49k92J93pq0o6L4K87k91J32K4J36j41r2J22k6q1j00M48
2730C49j17k2j00l4m0O4l77N19k20j28M2j00L04qk70J21P1J01k48o8L9M05j93
2753I0M1k39K43k7o0jk87Q5K98j61K14l98L29q4J13J86m20K15k88J96j10j56M04
2776A83n5p5J13k16L9J36j73k15R3K60k20K7Q5j5K1K66k22k4J66j02J00j80J81
2799A73R2j94l1j66K38m19M29j35L3M8j60m7QK51j28M6m0J14K00j29l21N5K95
2822B12j37j00K9m2j89MK63M8k48K65j26r1K47r4J19r5k42K84j25k9j2K83l38
$$ plain form
2845 -114 68 87 58 -335 -3 50 6 -19 -36 58 -32 20 259 -11 21 163 -207 185 -150 177 66 -26 101 -191
2869 -191 12 -107 177 -71 -189 168 -281 -107 25 -20 -95 113 -51 -37 229 196 -49 186 78 -95 164
2890 164 -45 40 16 -192 -14 -38 137 -206 75 104 15 -18 -321 96 29 -151 103 -118 64 171 215 163 98
2913 98 242 -105 -55 101 22 19 72 166 107 118 177 -180 179 91 48 90 63 156 189 -62 -35 87 62 49 -56 48
2939 48 119 -28 -229 65 -7 -31 29 97 -102 -86 199 2 -52 -18 235 -35 190 57 35 8 190 -122 37 -128
2963 -128 -279 -64 67 -92 164 -160 206 -46 -28 -18 205 255 50 67 39 -205 -95 -119 103 -161 -68 298
2985 298 -241 77 41 -188 164 106 -44 -80 102 250 339 -112 -55 10 -159 16 -229 -168 -164 96 310 97 68
3008 68 -3 -55 -27 21 -197 -57 16 -112 -53 -95 -155 28 -35 93 -84 -9 -123 123 103 3 46 -116 -138 -113 126
$$ packed form
2845a14J82J9k9l93L32N3m4k5j7R4r0N2K39k70L2J42l70L92l35L27j11r2J27k92
2869a91K03j19K84k48j18L57m49J74J32m5p5K08j64J4K66l3k45K35j08j73K59
2890A64k09Q5k4k08J78k4J75l43K81K9q9l3l03M17o7j80K54k21J82J07M4n2o5
2913I8J44l47N0J56p9lN3R4n9J1N9l57L59q8m3M2k7R3L3k51K7J22k5j3j05J04
2939D8P1j47k01K94p2k4O0O8j99J6K85j97n4L4K53k70K25j33k2k7J82l12J59j65
2963a28j51K15J31j59K56l24L66k52J8J0K23N0k05J7k8k44J10k4K22k64R3L66
2985B98n39L18l6k29L52n8j50l6J82J48Q9m51N7O5j69J75k45O1MK60K14k13k9
3008F8p1n2K8M8k18J40P3j28N9m2o0J83o3J28j77P5j14K46k0j00M3j62k2K5K39
$$ plain form
3033 126 -136 14 -187 17 -151 -57 -100 31 80 9 99 160 15 -102 -43 155 229 204 165 -60 68 -44 -1 127
3057 127 -21 -89 110 -51 -245 -133 -52 185 112 -47 232 -6 27 -76 277 -167 165 192 -135 30 -117 -179
3079 -179 -212 -28 56 -152 64 133 -83 111 2 113 98 120 6 -48 -51 162 -55 -185 -150 -41 166 -173 19
3102 19 -130 -59 4 135 63 125 -53 -30 149 111 -54 88 -11 63 280 -166 -205 325 -145 254 -67 -47 -111 -42
3126 -42 86 -48 -146 161 41 119 3 -14 13 -16 53 229 118 93 -35 -16 -247 -190 -41 -42 166 158 84 -45 -74
3151 -74 108 79 41 74 6 -54 30 234 64 17 11 -37 -55 -71 -58 60 -7 49 19 -156 7 -50 -80 149 12 237
3177 237 89 99 203 -328 42 -229 -339 -115 -170 -265 221 -139 -246 139 -192 -234 -54 122 -36 -158 -158 28
3199 28 -31 -214 -92 113 -214 -119 61 169 -189 -241 285 -126 -81 -149 111 140 -96 206 44 1 -24 91 -49
$$ packed form
3033A26k62J50k01K04j68R4m3J31M9p1R0O1j45j17N9J98P4k5l9k25J28j12M3J28
3057A27j48o8J99j61j94J12Q1K37p3j59K79k38L3j03L53m44L32K7l27J65j47o2
3079a79l3J84Q4k08K16O9k16J94j09J11j5K2j14n4lK13k17j30L5J09K07l39J92
3102A9j49P1O3J31p2O2j78K3J79l8j65J42r9P4K17m46l9N30m70L99l21K0o4O9
3126d2J28j34r8L07j20P8j16j7K7k9O9J76j11k5j28J9k31N7J49jK08qp4j29k9
3151g4J82k9l8L3o8o0Q4K04j70m7om8j8j6J3J18o7N6l0j75J63n7l0K29j37K25
3177B37j48J0J04n31L70k71j10K24n5r5M86l60j07L85l31m2J80J76j58j22%J86
3199B8n9j83J22K05l27R5J80J08l58n2N26m11M5o8K60K9k36L02j62m3k5J15j40
$$ plain form
3222 -49 116 350 27 94 28 14 -177 -42 59 144 30 -40 -197 -65 -259 198 276 162 31 -57 38 -46 -127 125
3246 125 119 159 2 -158 -76 2 -107 107 45 -158 177 -159 123 143 181 -41 13 39 19 -101 0 14 -37 117
3270 117 -184 -115 -161 32 171 -113 12 -145 130 133 149 -299 -90 163 236 -103 -202 246 -360 -52 164 276
3292 276 60 41 15 -223 -164 -45 197 -77 -245 -27 -158 117 100 -12 82 100 -62 -15 -32 5 137 267 -287
3315 -287 57 347 -173 -337 44 178 73 34 -249 -41 -47 -51 57 -166 14 113 -114 122 -10 180 9 -188
3337 -188 111 -67 50 25 -237 153 223 101 -148 -79 -172 -27 52 -123 160 306 -22 -188 -31 25 -27 205
3359 205 48 199 80 -210 131 260 -326 -106 -160 77 -79 82 123 31 54 -108 101 -96 -30 -32 146 -52
3381 -52 144 48 -13 87 48 16 254 -52 33 -210 199 32 -6 -169 185 9 44 70 -65 278 284 219 -21 -42
$$ packed form
3222d9J65K34l23O7o6j4j91J35J01Q5j14p0j57J32j94M57P8j14j31q8R5q4q1K52
3246A25oM0j57j60Q2P8j09K14o2k03L35l36K82K0L8k22N4K6k0j20J01J4n1J54
3270A17l01O9m6J93J39k84J25j57K75LJ6m48K09K53P3l39r9M48o06L08K16J12
3292B76k16j9k6k38N9J19K42k74j68K18j31K75j7j12R4J8j62M7j7L7J32J30n54
3315b87L44K90n20j64L81J34j05l9k83K08omJ08k23J80R9k27K36j32J90j71j97
3337a88K99j78J17k5k62L90P0j22k49O9r3J45P9j75K83J46l28j66J57N6n2K32
3359B05j57J51j19k90L41J29n86K20n4K37j56J61M1r2K3j62K09j97O6kJ78j98
3381e2J96r6o1J00l9l2K38l06Q5k43M09j67l8j63L54j76L5K6j35L43Oo5k40k1
$$ plain form
3405 -42 -25 95 3 201 -37 168 81 -50 -76 64 -4 58 -144 -36 137 219 -22 -6 112 14 -60 -124 146 -102
3429 -102 -77 -104 175 60 111 42 119 219 -341 107 -112 69 -117 -10 159 132 77 191 111 -33 -60 -318 -171
3452 -171 219 -42 311 75 -105 167 -91 182 -118 -225 -299 -2 72 -115 -80 81 117 -127 132 66 22 -143
3474 -143 97 -101 201 17 183 157 63 -102 -9 -121 -117 73 -201 -78 -372 86 -136 -205 -131 -266 292 125
3496 125 235 4 275 -31 2 50 19 12 129 -146 154 -223 -21 215 -133 92 136 326 117 76 -63 -32 -46
3519 -46 -43 72 37 -63 174 -171 -140 60 -172 -54 76 -55 -134 -107 104 93 -213 97 -38 98 -62 -64 126
3542 126 3 -55 60 -112 -76 27 -131 14 52 -101 62 18 173 -230 -181 361 37 -4 22 -181 31 142
3564 142 50 139 -40 -15 32 93 323 -103 -5 167 -306 49 97 -10 -194 -24 174 -198 -35 -170 188 -101
$$ packed form
3405d2J7J20r2J98k38K05q7j31k6J40o8O2k02J08J73Q2k41J6J18r8p4o4K70k48
3429a02K5k7K79j15N1o9P7J00n60M48k19J81j86J07J69k7n5J14q0j44k7k58J47
3452a71L90k61L53k36j80K72k58K73l00j07p4K97P4j87L5J61L6k44K59o6m4j65
3474a43K40j98L02j84J66k6r4j65R3j12MJ90k74J23k94M58k22o9P4j35N58j67
3496A25J10k31K71l06L3M8l1pJ17k75L00l77K02K36l48K25M4J90k09m1j39L1j4
3519d6LJ15l5j00K37l45L1K00k32J18J30j31p9K7K11j1l06L10j35J36j60kJ90
3542A26j23n8J15j72L6J03j58J45L8j53J63m4J55m03M9N42l24m1K6k03K12J11
3564A42r2Q9j79K5M7O1K30m26R8J72m73L55M8j07j84J70J98l72J63j35L58k89
$$ plain form
3586 -101 312 304 59 -4 26 -132 109 -59 -191 -12 -228 27 -50 99 37 -117 -201 -78 171 218 209 -5 -84 -56
3610 -56 -83 -185 27 88 -140 249 28 -129 -246 148 40 -257 125 215 46 -252 102 253 112 106 147 9
3632 9 47 110 99 -143 -72 -89 -137 -135 -127 -30 -166 19 15 222 -119 9 -136 244 150 184 -160 22 -81 154 -46 -236
3658 -236 317 -139 -111 -10 -92 31 -105 -188 103 -150 120 -212 -51 131 54 -93 244 189 90 33 -288 -8
3680 -8 -111 -24 66 -4 -156 68 -250 -178 -129 -204 -306 262 291 -65 202 264 182 259 -43 359 46 -10 -67 80 194
3705 194 -105 68 -344 13 -111 62 -185 -36 -79 144 -69 135 54 -228 -143 -20 -116 120 -12 26 119 -9
3727 -9 -40 -344 208 137 187 -31 -170 -13 -50 -124 92 188 -17 95 134 130 63 -169 346 60 -100 247 28 86
3751 86 -89 114 -36 13 367 1 49 163 136 36 78 -2 -205 -14 -77 -21 54 52 204 -299 219 61 69 -147
$$ packed form
3586a01M13qk45o3L0j58K41j68j32J79k16K55p7J49o2j54q4J23K49M7rk14p9K8
3610e6k7j02K12O1k28L89k21j57j17L94j08k97L82R0j69k98L54J51j41oM1j38
3632IL8O3j1k42P1j7m8KQR7j36J85mK07l41J28j45L80r4L4l44J82j03K35k00j90
3658b36N53m56K8J01q2J23j36q3K91k53K70l32J61J82p7j47L37n5r9n7l21K80
3680hj03Q7R0p0j52K24l18P2M9p5j02N68K9l56K67O2q2P7l02M02l13n6n7J47J14
3705A94k99J73m12L57j24J73k47J49m3K23k13K04q1k82Q5J23r6K36j32L8R3j28
3727il1l04N52p1N0k18j39J57l7p4K16R6k05J12L9mo7k32N15k86j60L47k19N8
3751H6j75K03j50M9L54l66M8J14k7j00M2q0k03J91o3N6P5kJ52n03N18j58Qk16
$$ plain form
3775 -147 -118 -136 -209 -285 -237 98 -258 -124 -73 109 49 -38 -139 -94 -17 140 -80 47 -144 79 208 -2 -178
3798 -178 31 -214 -27 -100 -128 -3 -132 35 67 -101 72 87 274 110 198 16 48 -163 68 38 -168 -6
3820 -6 -231 -82 -293 166 -152 -64 59 -43 107 242 -1 230 -192 -108 161 -44 173 -167 -18 252 -327
3841 -327 -56 -103 -188 209 -146 208 271 -68 207 -51 48 -88 135 -160 -109 156 46 37 326 -217 -108 -63 -36
3864 -36 61 -48 -93 -4 -108 183 -133 -149 103 200 110 -132 96 5 149 191 -125 196 -108 -223 -183 -315 104
3887 104 1 -166 98 -137 32 21 -52 -98 -206 14 227 10 150 -208 16 75 -247 -100 -164 -226 -109 -91
3909 -91 -85 46 -2 65 180 66 -186 136 202 -36 -166 -50 282 -35 56 98 154 91 133 -1 -184 -138 -3 -178
3933 -178 142 -177 -147 40 67 -87 -52 -165 -116 72 9 -60 -185 209 -53 -128 29 -2 160 147 143 -161 -156 30
$$ packed form
3775a47K9j8p3p6M8L35l56J34N1J82o0q7j01M5P7J57k20J27j91K23J29k10j76
3798a78K09k45J87p3k8J25j29J67L2j68J73J5J87j64Q8j82L2k11K31l0k06J62
3820fk25J49k11M59l18Q8J23j02J50J35k43K31m22Q4K69k05K17l40J49K70n79
3841c27K71m7q5L97l55L54O3l39K75k58R9j36K23k95N1K65j10rK89n43J09M5K7
3864c6R7j09m5Q9j04K91l16j6K52R7r0k42K28r1J44M2l16L21l04j15M0j32M19
3887A04j03j67K64k35J69j1p3m6j08K20K13k17J40l58K24N9l22J47o4o2J17J8
3909i1OJ31m8O7J15j14k52L22O6k38j30J16L32l17R1M2N6o3M2j34j83M6J35j75
3933a78L20l19L0J87K7j54L5j13M9J88o3o9j25L94k62p5J57l1J62j3ml04NJ86
$$ plain form
3957 30 -160 -28 -130 151 -11 -372 71 324 101 -35 227 -20 -217 -271 86 -136 74 -77 -242 150 -103
3978 -103 7 -97 61 48 48 83 96 187 264 90 -230 319 198 -261 -130 -52 203 -39 112 -13 -243 107 -144
4001 -144 -123 -210 -320 248 -123 148 -99 75 27 65 47 36 -14 125 119 26 133 -75 179 -224 111 14 67 -89
4025 -89 -2 100 -67 96 -29 390 -161 281 256 -123 97 17 -39 6 -214 -131 57 176 169 -175 275 86 6
4048 6 -208 259 79 -90 69 114 39 -98 262 -196 148 -66 -45 4 -22 -138 -33 -69 -28 -14 -248 -80 -184
4071 -184 -3 -211 -65 -45 -178 -71 -43 -55 -239 -39 -178 368 219 1 -80 4 -159 91 235 -418 129 225
4093 225 -94 -140 -49 -56 -335 141 101 -111 -61 99 139 -302 160 71 -294 88 -370 -52 -119 15 -24 159 -155
4116 -155 150 -228 177 -35 119 266 -143 10 57 367 -22 -46 196 64 113 1 -22 -76 50 -53 88 -108
$$ packed form
3957C0j90J32j02K81j62l61M43K53k23j36K62k47j97n4L57k22K10j51j65L92k53
3978a03J10j04J58j3%L5J3R1P7j74l20N49j21m59J31P8K55k42J51j25k30L50k51
4001a44K1q7j10N68l71K71k47J74m8L8j8j1n0J39or3J07k08K54m03L35r7N3j56
4025h9Q7J02j67J63j25M19n51M42k5l79K20q0n6M5k20Q3J88J19pl44M50j89q0
4048Fk14M67j80j69J59M5p5j37L60m58L44k14K1M9k6j16J05l6M1J4k34J68j04
4071a84J81k08J46K0j33J07K8j2j84K00j39N46j49k18q1Q4j63K50J44o53N47R6
4093B25l19m6R1pk79M76m0k12N0J60M0m41M62q9l65L82m58L18o7J34l9J83l14
4116a55L05l78M05k12J54J47m09J53M7L10l89k4K42j32M9j12k3n4J26j03J41j96
$$ plain form
4138 -108 -172 81 263 219 -305 -329 12 247 281 27 -31 -16 -28 -154 -121 222 332 -76 -172 -70 -30 -90 210 -62
4162 -62 -74 210 202 62 9 126 128 -323 -166 -54 24 123 3 242 14 -36 -336 -157 -206 128 -129 -248 214 67
4186 67 21 -60 -28 260 -67 -246 -33 -300 60 69 5 -93 -278 -20 -160 -16 -110 -93 -126 214 -44 53 23 -106
4210 -106 -58 35 -268 245 303 -182 274 248 36 -141 -7 -166 222 -30 -66 -57 110 24 -12 -50 170 -137 -35
4233 -35 26 82 362 20 14 217 108 -122 -42 30 -314 -39 -128 85 29 -431 155 -190 203 197 45 -69 -15 131
4257 131 134 -136 -37 -2 -474 335 84 -94 -121 -148 12 -86 -152 -26 -81 -183 223 124 -151 24 -21 -27 145 56 -252
4282 -252 115 5 -22 35 113 -64 -301 15 -231 -182 -34 320 -323 -105 25 -49 81 -31 53 152 -21 83
4304 83 -3 -198 -184 -186 -11 116 43 -246 -93 -370 -93 135 18 48 -46 62 36 3 -6 -168 186 154 236 101 40
$$ packed form
4138a08o4K53J82m4n24k4L41K35L4k54n8J5j2j26L3L43J10m08r6J02M0o0L00k72
4162f2j2K84qj40n3J17Km51J57J12P8R9j20K39k28n0l00J79m9L34k57j19M62j47
4186F7m6q1L2K88l27j79K13k67L60Ro4r8j85K58j40J44r4J7l3L40k58R7l0j29
4210a06M8R3l03N13N8m85M56k6k12j77J34j59L88k52l6RJ67q6l6l8K20l07J02
4233c5O1N6K80l42oK03j09k30Q0P2l44K75q9K13n6m60N86l45L93oj52j14N4J46
4257A31Lk70R9L5m72Q09k51j78k7k7J60r8o6J26n5j02M06r9k75J75m5oJ72q9l08
4282b52L67j10k7N7P8j77k37L16k46M9J48L54o43K18J30p4J30j12Q4R9j73J04
4304H3q6j95J4kJ75J27p3k89J53k77K77K28j17L0r4J08k6l3rj62L54l2Q2j35o1
$$ plain form
4329 40 -114 -92 -44 -155 73 -208 -34 164 -61 -112 237 -336 388 -71 40 158 -70 415 19 285 134
4350 134 -80 52 30 -33 -56 -171 33 208 -44 -42 164 83 239 -42 287 58 235 -214 -3 -6 -102 305 -115
4373 -115 -119 285 152 39 -129 -80 102 92 -35 29 -222 -4 -30 349 53 -56 29 -52 104 145 219 208 -9 81
4397 81 323 -83 -43 263 12 -36 38 176 -22 26 134 102 -21 29 64 216 165 129 254 -23 -14 -57 94 -198
4421 -198 3 137 220 -41 -62 77 45 -197 24 16 245 49 -137 -271 6 -32 236 244 241 108 -370 -114 14
4444 14 -191 -213 -326 76 17 198 -200 8 166 -14 306 62 222 -140 155 24 -54 85 -128 37 -42 -100
4466 -100 -116 -81 71 -83 -27 73 18 -246 -208 -77 103 45 134 -19 100 333 -191 -13 192 156 -50 91 67
4489 67 27 -1 111 128 -62 98 -85 -198 -206 -115 -55 -45 58 -38 -165 182 84 154 232 -73 284 81 -176 108
$$ packed form
4329D0j54K2M8j11K28k81J74J98k25n1L49n73P24m59J11J18k28M85l96K66j51
4350A34k14J32k2o3k3j15K04J75k52KK06q1J56k81L29k29J77m49K11lr6M07m20
4373a15mM04j33j13j68M9J82j0j27O4k51K18k6L79k96j09Q5q1J56M1P4j1k17R0
4397H1K42m06M0L06k51m8P4J38j98M8J08l2j23N0L5J52n1l6J25k77Rm3J51k92
4421a98K01J34Q3k61k1J39l2k42K21qK29j96j86j34K77l8K68Qlj33m78K56J28
4444A4k05k2j13M02n9J81l98K08J58j80L20k44J60l62K95j31p8J39k13J65p9n8
4466a00j6L5J52j54N6J00n5k64L8J31J80n8Q9j53J19K33n24J78K05l6k06J41k4
4489F7m0k8J12J7j90J60j83j13qR1O0J0J03r6j27L47r8P0P8l05L57k03k57K84
$$ plain form
4513 108 29 -45 -41 -122 -466 89 19 119 116 103 42 -36 -201 212 -265 143 24 -131 114 -120 -17 -62 179 -204
4537 -204 64 116 -174 -231 13 -170 -66 124 177 -50 88 -146 7 -178 81 73 -30 24 50 -165 24 -312
4559 -312 260 -169 52 -60 103 138 -126 -23 -133 -38 253 88 178 112 40 -5 39 -111 -8 -56 44 -56 84
4582 84 -93 102 -140 -103 -282 51 282 184 97 20 -34 -236 151 -164 -62 113 134 -25 119 -161 48 -205
4604 -205 -30 70 64 -43 -288 145 -4 -96 -188 -51 -33 78 160 103 -35 98 -233 107 -155 96 176 365 -54
4627 -54 215 59 -37 227 19 288 65 -140 -147 -117 -52 258 202 93 -59 29 -7 46 -54 -109 56 -95 -38 -23
4651 -23 -153 -35 -95 -202 -57 -339 72 -31 258 147 -249 -167 99 368 55 96 -80 -26 -133 120 -152 -158
4673 -158 -10 -39 99 -77 114 95 61 99 -325 -109 -136 342 224 148 -66 281 208 -44 364 179 203 206 -47
$$ packed form
4513A08p9p4Mq1l44N55p0J00lj3o1p8j65M13m77M08j19j55K45k34J03m5K41l83
4537b04K68N2k90n7K44j83J04J90N3k27J38k34J53j85K59qj03N4K6k15J89l36
4559c12N72m29K21j12J63L5k64J03j10R5K91j65R0o6p2m5M4j50J03m8J00j00J40
4582H4j77J95k42L7j79L33K31r8q7p7n4k02L87l15J02J75K1j59J44k80K09k53
4604b05J75J00oj07k45M33j49r2r2J37J8J11Q2n7j38J33l31L40k62K51Q0J89m19
4627e4K69j56r6K64k08K69k23k05pL0O5L10n6j09j52Q8l6N3j00n5J65j51N7J5
4651b3j30J18o0j07J45k82M11j03K89j11l96Q2K66K69l13M1j76N4j07K53k72o
4673a58J48k9J38j76J91j9l4L8m24K16k7M78j18p6k14L47p3k52M08j85K4Lk53
$$ plain form
4696 -47 7 21 232 -180 142 6 174 171 -23 185 -84 -53 95 188 -33 -76 -13 -88 -75 -209 -187 -54 64 87
4720 87 361 -210 -117 119 298 11 -330 391 179 22 -181 99 44 -41 182 66 -16 73 -79 -376 258 -216
4742 -216 83 -138 -45 -55 347 -423 -341 173 -84 155 -371 -8 -191 -113 188 -40 -89 202 143 115 12 -15 273
4765 273 -47 -91 -158 58 315 312 -125 -44 7 321 -74 -95 -9 -173 -83 156 -96 -57 299 -240 -189 -151 55 -10
4789 -10 65 67 -63 380 -143 -41 -153 -59 291 -28 -26 33 -5 -168 118 142 -178 40 219 253 -57 25 -32 -83 -69
4814 -69 -45 -173 53 233 -221 -214 -63 -129 -265 -104 45 225 -165 -195 103 -129 25 -66 -45 141 15 29 -137
4837 -137 23 125 -12 -29 115 60 152 -166 170 -175 -209 164 -127 135 18 -4 74 -105 -133 -364 47 -142
4859 -142 22 178 -200 -22 80 -228 -68 130 -186 8 95 -207 63 -73 -92 -82 -56 -157 -191 56 -35 98
$$ packed form
4696d7N4J4K11m12L22j36J68lj94K08k69L1J48R3k21m3O3p5J3j34K2J33J18K3
4720H7K74n71R3K36J79k87l41P21k12j57k03K80n5q5K23j16q2Q9j52k97O34m74
4742b16K99k21R3j0M02p70Q2N14k57K39n26L63j83P8L01k28m9K91n9k8j03k7K88
4765B73l20m4o7K16K57lm37Q1N1L14l95k1Q6j64R0K39k52L9L56n39N1L8K06o5
4789a0P5Kj30M43n23J02j12R4L50l19KN9l8j63K86K4l20K18J79L4l10Q2n7n1J4
4814f9K4j28K26J80m54PJ51o6j36J61J49J80l90l0K98k32J54r1K1J86j26J4j66
4837a37J60J02j37j7J44n5R2l18L36l45l4L73k91K62j17k2P8j79k8k31M11j89
4859a42J64J56l78J78J02l08J60J98l16J94Q7l02K70j36j9J0K6j01l4K47r1J33
$$ plain form
4881 98 187 258 -34 -59 141 -171 20 125 114 -7 -84 29 -132 -33 65 -125 -46 164 25 -96 172 160 4
4904 4 -182 21 -93 83 -79 -103 -136 24 158 -170 533 -282 -101 -179 379 -117 32 -331 -131 -48 -12 289
4926 289 -90 11 33 -378 174 -20 248 -181 154 101 -151 -101 4 39 -12 22 209 -38 -193 6 23 125
4948 125 3 162 35 86 -311 182 61 -103 -6 114 153 64 -155 202 228 -63 -47 -85 -137 224 226 -177 -85 55
4972 55 -335 -140 120 -118 -164 -14 16 -46 283 96 28 92 -55 231 62 203 85 131 -39 78 31 -27 89
4995 89 -89 1 -159 -180 -31 8 -72 -342 -268 207 -12 -55 140 268 -64 -57 249 -151 -149 26 -121 -90 209 248
5019 248 126 -42 -127 -79 57 -101 173 -5 -27 -123 -41 184 96 -30 166 99 -199 -298 -83 -159 36 -55 107
5042 107 119 -235 70 -242 -76 -52 62 124 228 -135 179 142 126 -74 -135 128 72 57 -267 -246 50 85 177 147
$$ packed form
4881I8Q9P1k92k5K00l12J91J05j1j21p7J13j61R9R8j90P9K10j39j21K68j2j56
4904Dj86K03j14J76j62k4l3J60J34l28P03q15J81p8N58m96J49l63K00Q3L6L01
4926B89l79J01K2m11N52j94K68m29L35n3k52N0J05L5n1L4J87k47j55J99J7J02
4948A25j22J59j27N1l97M93j21j64R7J20L9q9k19L57K6k91J6l8n2L61Km03R2J40
4972E5l90J95K60k38m6J50L0o2L29j87o8O4j47K86j69J41j18M6j70J17m7n8J16
4995H9j78R0j60k1J49L9q0k70P4M75k19m3J95J28l32PL06m00KJ75j47L1K99L9
5019B48j22j68q5M8J36j58K74j78k2r6Q2K25q8j26J96o7k98r9K15p6J95r1J62
5042A07J2l54L05l12J66K4J14O2J04l63L14l7j6k00o1K63n6j5l24K1K96L5R2l0
$$ plain form
5066 147 175 -194 -68 46 -175 115 -29 -166 100 -118 -253 -115 -60 56 87 77 -81 8 -188 218 37 101
5088 101 55 -109 40 163 -320 27 0 35 224 114 138 -108 176 -25 88 -70 11 -51 -258 -77 -197 -148
5110 -148 221 -137 62 96 -44 -36 -176 -9 -103 -210 -28 -90 50 -77 68 16 -251 5 -251 -58 270 -258
5132 -258 90 164 -181 -26 -71 -114 -515 99 86 12 264 -63 -50 2 24 -137 -158 -88 -94 302 194 -168 130 120
5156 120 27 -325 7 149 -147 116 238 -138 -130 156 114 -186 -43 -107 -228 -59 -182 2 177 182 -68 58
5178 58 -101 116 -11 77 -226 -192 -138 -372 -3 140 -2 176 233 -30 -79 -86 198 -53 -48 172 86 -75 -75 -24 128
5203 128 -112 -78 -73 67 187 -245 -179 -187 12 -188 -85 10 -128 183 296 51 -118 109 -210 271 148 -160
5225 -160 47 148 -169 -323 81 112 218 67 -208 -15 -55 -150 240 68 -125 -162 -7 11 222 95 -14 -41
$$ packed form
5066A47K8l69J26J14k21K90j44j37K66k18j35J38N5J16L1j0j58Q9j96M06j81O4
5088A01m6j64J49J23m83L47k7L5J89j10K4k46K84k01J13j58Q1o2k07J81j20M9
5110a48L69l58J99L4j40Qj40J67r4j07J82o2J40j27J45n2k67K56k56J93L28n28
5132b58L48P4l45J55m5m3m01O14j3p4K52l27J3N2K2j61k1P0oL96j08l62K98j0
5156A20r3l52L32J42k96K63J22l76QK86m2l00J43o4j21J69j23J84J75Nk50J26
5178E8j59K17j27Q8l03L4N4k34L69J43j42J78N7k63m9pK84k51NK20q6j61%N1J52
5203A28k40L4NJ40J20m32O6qJ99k00J03R5j38L11J13k45j69K27l19M81j23l08
5225a60K07J01l17j54M04L1J06j51k75J93m0r5L90j72j93l7J55J8K11j27j09k7
$$ plain form
5247 -41 103 -322 110 -63 -175 58 -83 -4 291 60 -146 -181 -23 -21 118 -203 59 28 62 -211 -26 -92 87
5270 87 -155 31 -137 -57 -26 28 59 49 90 155 -147 345 104 97 86 -12 -137 19 -89 -211 -13 14 45 41 20 57
5296 57 -21 -5 -93 5 73 137 -56 122 61 86 55 -56 -71 96 -259 -189 108 11 15 132 -14 -98 -22 -98 -58 -228
5322 -228 -352 90 113 199 -91 -76 -133 33 288 -23 -117 237 -151 -18 -163 -9 107 199 37 124 40 19 153
5345 153 54 219 85 139 70 -89 -64 239 -305 50 25 -112 -172 -23 -79 93 121 -191 -153 -137 6 -120 92
5368 92 13 -15 57 266 -6 286 61 -138 -72 -3 -111 101 24 -63 -43 -67 -168 128 -9 100 261 128 21
5391 21 162 211 -184 187 205 -102 -257 -128 146 43 82 283 92 -189 198 -180 92 -186 -66 -5 132 -33
5413 -33 88 121 166 -23 33 -166 -135 -9 81 27 206 144 27 51 140 -223 98 -67 157 -66 -289 58 -41 106
$$ packed form
5247d1J44m25M32j73j12K33j41P9K95k31k06l5J58KJ39l21K62l1L4k73J85o6J79
5270H7k42J86j68Q0L1N4L1j0M1O5l02M92k41pj1r8j25J56j08j22J98K7L1mk1L7
5296E7p8J6q8R8O8O4j93J78o1K5l1j11j5J67l55P0K97r7MJ17j46q4P6p6M0j70
5322b28j24M42K3Q6k90J5n7J66K55l11r4L54l88J33j45J54J16R2j62Q7q4k1J34
5345A53r9J65j34N4o9j59K5L03n44L55k5j37o0J49n6J72K8l12L8J6J43j26K12
5368I2p9k8P2K09k72K92k25j99O6O9j08K12p7q7K0k4j01K96j37J09J61j33j07
5391B1J41M9l95L71J8l07j55J29K74j03L9K01j91k81L87l78K72k78J20O1J37j65
5413c3J21L3M5j89N6j99L1J26R0n4J79o2j17K4Q9l63L21j65K24k23k23L47r9J47
$$ plain form
5437 106 -256 37 35 87 280 -15 -11 17 2 161 117 -157 -52 -112 -40 -75 102 -17 -25 133 -38 37 166 114 60
5462 60 89 99 113 -184 89 -198 -3 36 11 -169 -204 -239 -169 232 -62 -145 -214 -103 -88 248 -70 345 -215 73
5486 73 58 -97 -95 -80 -117 7 -60 180 -11 -226 289 -136 -2 -182 -45 -56 -220 -143 71 -135 76 156 201 -67
5510 -67 -21 49 -37 161 -71 88 128 -189 106 81 -173 -155 214 112 83 92 -100 10 25 148 123 204 103 -147
5534 -147 -96 105 -225 160 145 -44 -101 264 -46 -59 165 -94 -59 -202 328 61 41 -410 95 -9 147 30
5556 30 106 180 -87 14 -296 44 -148 -25 119 194 -53 100 -230 147 246 -43 136 -203 -12 -11 -225 -22
5578 -22 -315 -152 74 -50 -93 -208 72 2 -6 43 -291 -258 39 -188 315 102 -68 61 3 91 226 -268 208
5601 208 -36 -42 -9 -86 -159 11 117 126 267 -96 239 32 -97 124 -336 -103 -60 -55 -34 -188 184 157 38 -396
$$ packed form
5437A06l62K93kN2J93k95MK8j5J59m4k74J05o0P2l5J77j19qJ58j71P5J29n2n4
5462F0K9J0J4k97K73k87J95L9k5j80l5l5P0M01k94q3o9J11J5L36l18M15n60K88
5486G3j5j55KJ5l7J24o7K40j91k15N15m25J34j80J37j1j64P7K14k06K11Q0M5k68
5510f7M6P0q6J98k32J59M0l17K95k5k54J8L69j02k9Rj92J10J5J23k5Q1j01k50
5534a47N1K01l30L85j5j89n7L65l10j3K24k59L5j43N30k67k0m51N05j04J56j17
5556C0P6P4k67J01l10L40j92J23J44P5k47J53l30L77R9k89J79l39J91Jk14K03
5578b2k93J63K26j24m3j15K80p0qM9l34L3K97k27N03k13j70J29n8Q8J35m94M76
5601B08k44oL3p7p3J70J06RJ41l63L35k07j29K21m60K33M3NK1j54L72k7j19m34
$$ plain form
5625 -396 161 -112 -58 -124 -129 -93 55 280 -185 -78 -25 138 -23 -2 255 -74 -31 96 47 83 153 101 -40 -15
5649 -15 -135 53 101 -105 288 18 72 110 -292 -250 30 77 147 -205 66 -68 249 6 26 -56 -95 -59 118 75
5673 75 -11 46 343 -181 -124 -166 23 -50 60 112 76 -55 37 54 -165 -175 -171 37 -134 127 -51 34 -36 -175 -93
5698 -93 314 -78 170 -65 -183 -122 208 251 114 129 -204 -111 26 -155 -96 -218 -261 24 51 156 -177 -37 -276
5721 -276 -252 39 -112 -133 -4 13 38 -116 -33 5 -239 -134 -182 -131 158 -230 -133 -76 -29 160 121 -178 -37 -253
5745 -253 -44 23 1 72 -454 70 148 144 -115 35 129 145 -159 -149 -10 -257 49 -168 -44 -102 -131 -17 250 107
5769 107 216 -78 24 -75 146 -177 138 84 -36 79 -164 96 136 -27 -202 -229 -164 45 -14 37 -314 206
5791 206 26 96 -206 455 159 223 178 -157 195 -67 21 27 205 100 18 -224 -105 31 -53 64 -232 -38 110
$$ packed form
5625c96N57k73N4o6nL6J48K25m65J07N3J63j61K1K57l29M3J27m9L6P0n2j41K5
5649a5j20J88M8k06L93k70N4L8m02M2K80M7P0l52K71j34L17k43K0q2l9L6J77m3
5673G5q6N7K97n24N7m2J89p3J10N2l6j31R2J7k19j0MK08j71K61j78Q5p0j39Q2
5698i3M07l92K48k35j18O1L30M3j37J5l33R3J37j81N9j22m3K85K7J05l33J40k39
5721b76K4K91j51k1J29J7K5j54Q3L8k44J05m8N1K89l88R7N7M7J89l9k99J41k16
5745b53K09O7k2P1n26N24P8mk59J50R4J6l04J0J39k47L06k17J24n8k9J14K67j43
5769A07J09k94J02r9K21l23L15n4j20J15k43K60M0j63j75k7O5K09n9N1l51N20
5791B06j80P0l02O61k96O4m5l35L52k62Q8OJ78j05q2k42J19J36q4J17k96J94J48
$$ plain form
5814 110 64 28 -48 -88 24 -54 -34 92 -35 -167 -118 -239 -77 -119 -4 -151 249 1 -245 -251 105 -22 -141
5837 -141 -12 215 32 153 -115 -341 27 -48 207 -53 203 79 49 185 -10 -185 63 49 -28 22 -9 124
5859 124 117 -67 236 144 109 -60 -100 -27 -71 -196 264 153 208 -128 -50 -250 -223 112 30 265 26 9 -141 272
5883 272 46 -253 -28 79 56 102 193 8 -35 -34 51 -86 -227 -186 1 -62 60 45 218 20 -4 112 63 35
5907 35 80 17 156 82 131 283 -36 25 109 354 -182 -99 -165 108 -191 -290 207 -66 32 0 -106 88 -150 94
5931 94 116 312 111 -105 -164 152 -158 -104 -8 -205 37 151 15 -11 -7 189 380 122 0 -271 148 76 13
5954 13 90 43 -184 -276 -103 -79 -4 78 348 6 -114 210 -125 -41 -128 -100 221 125 330 -24 60 -68 88 93 21
5979 21 111 -126 -134 -124 26 42 97 99 -26 104 -35 -309 73 -243 127 -202 48 -1 29 -53 -239 161 -39 195
$$ packed form
5814A10m6l6p6m0J12p8K0J26j27j32M9j21J62m2J15j47M00k48k46oL56j27j19
5837a41J29K27j83J21k68k26L68p5K55k60K56j24l0J36j95j75K48j4p7N0l1J33
5859A24pj84L03r2l5j69m0P3m4j25M60j11N5l36P8k00K7L35q2K35k39j7j50M13
5883B72k26k99K25J07k3M6R1j85m3JQ5j37j41M1J87o3J22j5J73j98k4J16m9k8
5907C5M5o3J39p4M9J52l19O1Q4K45n36Q3o6K73k99r9M97k73R8l2j06J94k38K44
5931I4K2J96k01k16n9L16l10N4R6j97K42J14j36k6MJ96J91k58j22k71M19p2o3
5954A3P7m7k27r2J73K4P5Q2K70l42j20L24l35Q4q7K8L21r6K05l54Q4j28J56Np2
5979B1R0k37qJ0J50J6N5Kj25J30j39k74L82l16L70l29K50m9L0q2j86M00k00K34
$$ plain form
6003 195 282 73 143 18 151 -28 -129 205 -143 62 -53 65 303 189 -340 34 34 -147 -179 14 239 -118
6025 -118 205 275 6 -308 -126 118 222 168 178 88 100 267 -101 -262 107 35 -219 55 108 -133 -15 -184
6047 -184 151 168 74 -189 38 286 -205 -16 -31 -240 23 57 87 -130 -197 -21 -247 -197 224 -60 -167 -16
6069 -16 -214 232 194 40 -186 47 -2 -79 -235 -52 111 -55 -4 43 54 161 84 28 239 -191 -51 60 154
6092 154 -44 -195 74 -62 320 311 -107 122 52 -26 -25 363 361 55 77 -64 202 97 148 -12 256 103 -61
6115 -61 290 79 -136 140 -79 -277 278 12 -90 223 108 -3 -58 45 89 -82 -206 65 -27 -176 8
6136 8 12 -120 -6 130 27 99 -343 161 208 164 -25 -39 227 -257 277 -114 -226 157 176 125 -15 -182 -87 -77
6160 -77 175 90 -16 -167 -137 80 266 250 207 53 -392 138 -66 151 11 35 -80 -181 72 -137 15 247
$$ packed form
6003A95Q7k09P0j25J33j79j01L34l48K05j15J18K38j14n29L74%j81l2J93K25l57
6025a18L23P0k69l14J82K44J04n4J0r0J2J67l68j61L69p2k54K74N3k41J18j69
6047a84L35J7r4k63K27K48m91J89j5k09K63L4L0k17o7J76k26N0M21k84j07J51
6069a6j98M46l8j54k26K33m9p7j56J83J63j66N1M7J1J07p7n6K11m30J40J11R4
6092A54j98j51K69j36L82rm18K29p0p8JL88kl06K2j41K66j05N1j60K68j53j64
6115f1L51k11k15K76k19j98N55k66j02L13j15j11n5J03M4j71j24K71r2j49J84
6136HMj32J14J36j03P2m42N04M7m4j89j4K66m84N34l91j12L83J9n1j40j67R5J0
6160g7K52q5j06j51L0K17J86j6m3j54m45N30k04K17j40K4j15j01K53k09J52K32
$$ plain form
6182 247 33 -4 16 213 -82 -140 -19 17 11 143 56 371 31 -211 225 -92 -42 -139 6 30 -135 -77 85 175
6206 175 -204 -115 135 -3 130 -153 255 -62 -210 -153 90 124 -17 132 -65 5 -4 174 216 -228 -117 -79 10
6229 10 62 -128 138 -95 166 -37 132 230 -86 -103 7 87 49 -65 58 51 5 21 -87 67 -170 -144 96 146
6253 146 -172 119 -24 -132 -131 -35 -76 93 185 48 113 -218 -208 -227 -154 190 109 -46 20 133 -14 27 -293 307
6277 307 -310 31 -12 -133 13 -201 182 -170 -19 109 40 -40 58 97 -120 -167 -212 -107 195 -108 181 82 8
6300 8 -280 27 -95 -2 34 88 63 -188 -130 -86 90 -15 261 240 -68 4 -1 -155 -107 -103 185 228 -226 -19 -18 141
6326 141 49 -232 62 -120 167 71 -133 56 70 5 26 102 -109 130 7 -218 221 75 -103 75 -51 -268
6348 -268 177 262 -51 -164 86 -115 -139 150 -98 130 40 -88 -44 -228 49 4 321 149 -127 26 -128 25
$$ packed form
6182B47k14l7K0J97k95n8J21L6oJ32q7L15l40k42M36l17N0r7J45K4j65N8J62R0
6206A75l79Q9K50j38J33k83M08l17j48N7K43L4j41J49j97P0rJ78M2m44J11L8Q9
6229A0N2j90K66k33K61k03J69R8l16j7J10Q0l8j14J23pm6J6j08J54k37K6K40N0
6253A46l18K91j43j08JR6m1J69R2j37O5l31J0j9P3L44q1j55O6J13j47M1l20O00
6277C07o17L41m3j21J46k14L83l52J51J28o9q0R8L9k17m7m5J05L02l03K89r9p4
6300Hk88L07j22R3L6N4k5k51N8M4J76j05K76k1l08P2nj54M8MK88M3m54K07JJ59
6326A41r2k81K94j82K87r6k04J89J4o5K1P6k11K39j23k25M39j46j78J78j26k17
6348b68M45Q5l13j13K50k01k4K89k48K28r0j28M4j84K77m5L17j72k76J53j54J53
$$ plain form
6370 25 44 253 123 -135 -118 47 -123 -251 -118 225 234 -18 51 -49 -106 -73 -293 88 36 43 -57 49 64 -46
6394 -46 -135 -95 49 -30 86 -232 138 22 51 -317 257 -172 -115 -287 -184 204 56 0 26 203 -40 36 -136
6417 -136 106 168 -87 61 80 10 27 100 -33 55 -51 136 93 -239 -24 120 78 175 -117 85 -240 -84 253
6440 253 41 -118 -40 91 -15 170 -246 -85 -258 -132 350 -76 98 -7 119 -50 -116 111 -31 -271 -220
6461 -220 -170 140 -40 -14 87 164 -52 -104 -339 19 85 -68 6 132 130 85 387 -340 58 -58 -8 -110 -250
6484 -250 -212 172 92 49 -2 -65 189 72 -213 286 -122 30 52 124 -185 -115 -34 -313 56 60 -254 3 -62 -50
6508 -50 -24 7 364 -19 -133 -164 33 -59 -115 -5 -21 -84 4 -70 -63 -240 141 -133 -92 114 -73 236 54 148 119
6533 119 85 -127 -41 -83 450 -21 -52 176 -71 -315 115 1 26 -21 -98 236 178 -59 -30 198 10 -36 -119 54
$$ packed form
6370B5J9K09j30k58J7J65j70j28J33L43Rk52O9j00n7L3k20L81n2Pj00J06J5j10
6394d6q9M0J44p9J16l18L70j16K9l68N74m29N7j72J03L88j48n6K6J77k43P6j72
6417a36K42O2k55J48J9p0J7P3j33Q8j06J87m3l32K15J44m2R7k92K02l25J56L37
6440B53k12j59P8J31j06J85m16J61j73J26M82m26J74j05J26j69o6K27j42k40N1
6461b20N0L10j80K6J01P7k16n2k35L58O6j53P4J26km5L02p27L98j16N0j02j40
6484b50L8L84q0m3n1o3K54j17k85M99m08J52K2P2l09P0Q1k79L69Ml14K57o5J2
6508e0K6L1L57l83j14l1J97r2n6J10j6o3Q8p4Pj77L81k74M1K06j87L09j82R4k9
6533A19l4k12Q6m2N33m71l1K28k47k44M30j14K5m7p7L34n8k37K9K28j88m6q3J73
$$ plain form
6557 54 -66 -1 118 69 -27 -31 -224 14 -94 28 -36 -98 -14 287 164 142 258 2 -76 -124 46 130 86 -61 106
6582 106 -57 67 93 -91 -332 -78 -54 103 -23 124 302 20 23 3 59 -139 105 39 96 -165 -149 156 -9
6605 -9 15 -125 5 -51 -161 -54 -55 -135 -58 70 -41 41 -316 185 33 -23 -175 -62 61 -164 -76 -332 -63 -108
6629 -108 -129 145 -62 -157 63 20 -127 28 -55 -3 14 -167 -136 150 -149 -47 114 -241 111 81 131 386 -46
6652 -46 -162 46 192 2 -169 -28 95 13 -116 99 2 -86 -101 -115 123 122 1 -34 -53 198 279 -148 44 -71
6676 -71 138 -313 -130 106 264 -194 252 57 66 -30 7 -61 -213 120 -32 -269 151 -105 37 3 67 120 -301
6699 -301 -52 69 -173 -297 -58 56 -171 -91 -136 -85 61 107 -55 -11 -32 -48 -257 -108 -19 33 72 111 -51 82
6723 82 84 -19 -18 33 57 67 103 -257 -124 -261 168 77 205 -235 3 42 -265 370 72 -248 324 -115 -179 72
$$ packed form
6557E4j20O5J19m9r6mj93K38j08J22o4o2Q4L01j23k2J16k56p8m8J70Q4m4j47J67
6582A06j63J24K6j84k41K54K4J57j26J47J78k82Lk0N6j98K44o6N7k61J6L05j65
6605iK4j40J30n6j10J07jq0P7J28j11Q2l57N01j52n6j52J13J23k25Q8k56K69m5
6629a08k1K74k07r5K20m3j47J55q3N2J7j81L1K86k99J02J61l55L52l0N0K55m32
6652d6j16K08J46j90j71J41J23q2j29K15r7q8j5j4K38jj21l5j9K51Q1m27J92j15
6676g1K09m51J83K36J58m58M46j95Rr6L7o8j52L33j52k37M20k56J42l4O4N3m21
6699c01K49J21k42j24K39J14k27Q0m5N1J46M6j62M4k1j6k09J49Q9N2L9L9j62J33
6723H2Kj03JN1K4J0L6l60J33j37M29r1J28m40K38L9l07O35k98l20N72m39o4K51
$$ plain form
6747 72 -145 94 -258 -27 28 106 -154 -85 295 262 -118 -71 -191 -184 -17 -11 1 -90 118 -252 81 -203 -26 -111
6771 -111 -131 -249 -241 -46 38 96 -105 30 77 34 -35 12 -202 83 -329 -123 -105 -132 75 38 272 -79 -56 -26 -105
6796 -105 -64 -17 25 74 -242 149 -174 -32 -31 -32 -36 -239 -118 289 250 14 -225 162 122 58 -72 80 -21 159
6820 159 -92 75 157 -35 -185 -148 117 -54 18 -33 57 -189 -104 0 5 -2 26 168 -265 31 60 91 236 68
6844 68 57 204 -53 50 128 -271 -157 -372 -261 53 -63 -150 211 66 17 165 327 -46 -170 58 31 75
6866 75 226 3 89 -130 -179 -73 -171 -48 -117 65 -164 -121 -237 -204 44 -89 72 -43 -153 -36 3 41 -147
6889 -147 -83 -202 -86 -50 -76 17 -45 89 29 273 15 43 70 39 232 -252 -2 236 155 -273 67 47 121 56
6913 56 -17 61 -26 222 277 -197 19 118 42 126 -37 54 -239 -30 -40 5 -29 -192 -62 78 -169 -6 -188 -5
$$ packed form
6747G2k17K39l52K31N5P8k60O9L80l3l80M7j20PJ67OJ2r1K08l70L33k84J77q5
6771a11k0j18QJ95Q4N8k01J35M7m3o9M7k14K85m12K06J8k7K07l7K34l51K3L0p9
6796a05M1M7M2M9l16L91l23J42Jjmk03J21M07l9k36k39L87m0o4j30J52j01J80
6820A59k51J67Q2j92j50L7K65j71P2n1R0k46Q5J04NpK8J42m33K96K9L1J45j68
6844F8j1J47k57J03P8l99J14k15J11L14j16q7L61j45m9J48J62l73j24K28k7M4
6866G5J51k23Q6k19m9J06r8J23o9J82k29M3j16L3K48j33J61j15j10J17L9L8j88
6889a47O4j19J16L6k6R3o2J34o0K44k58K8K7l1J93m84K50K38q1m28L40k0P4o5
6913E6p3P8q7K48N5m74K16R9p6Q4j63R1k93K09j0M5l4j63J30J40k47J63j82J83
$$ plain form
6937 -5 69 -221 159 238 -127 11 42 44 -27 2 74 -85 -168 191 -269 -133 93 -3 24 -275 140 -74 184 -164
6961 -164 -289 19 -104 168 148 -81 125 179 -150 -166 4 -149 -112 -38 -56 211 -155 38 206 86 -105 -142
6983 -142 199 33 91 -58 113 -4 2 241 115 94 120 219 -76 -96 -156 159 -179 23 -95 -1 1 216 -66 245
7007 245 107 -125 117 37 -231 128 103 -10 211 -24 17 -413 -131 -33 -79 -152 -150 53 95 -275 70 -268 -76
7030 -76 -55 17 181 129 -57 26 -87 25 -246 -1 72 -25 -230 -94 -97 -135 -66 -154 136 132 -4 -328 -13 -36 -134
7055 -134 -17 52 297 267 -11 -232 53 113 159 -123 175 20 335 26 80 270 115 -133 -84 72 -127 -202
7077 -202 -31 -93 199 -41 -294 -60 -169 -50 -12 -44 118 16 -17 40 -33 -67 -43 163 -35 85 -106 122 -59
7100 -59 -127 -108 55 92 244 8 153 -71 -57 91 -248 -94 125 -178 -31 -26 24 -41 16 200 -223 32 16 -240
$$ packed form
6937eP4k90L80P9l65J38L1Kp1K9P2j59q3L59m60J36K26r6K7k99M15k14K58l48
6961a64j25L08j23K72k0k29K06N4l29j6J70j53L7P4j8K67l66J93J68j20j91l7
6983a42L41j66N8j49J71j17OK39j26k1K6R9k95k0o0L15l38K02j18R4KK15k82L11
7007B45j38k32K42q0k68L59k5j13K21k35M1m30K82R8m6p3KK03M2l70L45l38J92
7030g6K1P2J64n2j86Q3j13J12k71K45P3r7k05J36ll8O9q8K90mj36l24L15k3r8
7055a34J17O9K45l0k78k21K85O0M6k82K98j55L15l09N4J90j55k48M9J56j99p5
7077b02J71o2K92k40k53K34j09J19L8l2J62j02l3N7p3l4K4K06j98J20j91K28j81
7100e9o8J9J63L7J52k36J45k24J4J48l39J54K19l03J47NN0o5N7J84m23K55j6k56
$$ plain form
7124 -240 62 -309 -387 15 37 -14 20 -73 -17 39 -190 -148 -88 -95 -5 -30 -41 -77 -104 27 -39 84 -233 -321 12 17 -155
7151 -155 -10 19 63 -86 117 182 -12 135 -8 36 -269 88 -219 -65 79 -85 -65 41 -153 -44 8 -111
7173 -111 -6 -147 -209 -3 -206 -118 95 -3 43 172 107 -62 219 -160 55 -83 27 -57 -58 -69 -21 -43 158 -11
7197 -11 19 -147 -159 -131 176 54 146 159 -35 257 -109 61 22 267 187 133 13 178 64 -101 -206 31 -273
7220 -273 -83 -179 -39 128 111 132 161 -16 57 -88 -97 -141 131 -77 -74 -105 -124 -58 -233 -11 291 188 272 -213 -74
7245 -74 -81 35 -131 -19 -100 -289 -40 149 -85 -23 -92 291 27 -76 67 -34 -62 -114 255 -22 -95 -28 -54 20
7269 20 206 -103 207 -110 -29 -137 -129 223 -243 234 181 39 117 33 45 59 -113 24 -82 193 206 -60 184
7292 184 -130 177 -53 -185 -195 119 -59 -90 216 88 81 -24 66 -152 -34 -16 25 -65 -4 -30 -294 135 -1
$$ packed form
7124b40L02l71p8M02K2n1L4r3N6N6k29M2O0pR0k5j1l6k7J31o6J23l17q8L33Nj72
7151a55J45K9M4j49K03O5j94J47j43M4l05L57l07J54J44j64K0J06j94J09N2j19
7173a11J05j41o2K06k03Q8K13r8M6J29o5j69K81l79K15j38J10q4jj1M8k2K01j69
7197a1L0j66j2K8L07j22R2J3j94K92l66J70l9K45q0n4j20J65j14j65j05K37l04
7220b73J90r6J40J67j7K1K9j77P3j45rm4K72k08Ll1j9O6j75K22L02j03Q4m85J39
7245g4pJ16j66J12q1j89K49J89k34O2o9L83k64j03J43j01k8n2L69k77p3O7k6P4
7269B0J86l09L10l17Q1j08QL52m66M77n3j42P8q4J2J4j72J37j06K75J3k66K44
7292A84l14L07k30j32j0L14j78l1L06j28pj05R0k18J18J8M1r0O1k6k64M29j36
$$ plain form
7315 -1 -143 66 -146 -257 219 -159 294 59 -17 386 244 109 -226 -79 37 316 196 89 -59 355 34
7336 34 116 42 -212 183 -23 77 -47 -138 -342 -134 48 43 7 98 -102 -60 -51 -27 -6 -173 -17 -218 198 -17
7360 -17 -14 89 -126 327 220 -163 -129 -90 38 144 -108 224 -161 -221 25 123 -166 229 193 121 111 190 -152 -79
7384 -79 -32 -95 14 -113 42 87 91 63 58 60 -41 -32 62 -243 -45 -10 22 -294 436 -208 -153 27 302 -135 24 142
7410 142 -241 -72 -21 -61 -295 116 -152 125 -212 -118 -9 -225 -34 24 104 234 86 -240 210 25 30 128 178
7433 178 -38 -28 -158 158 -76 209 -78 17 7 151 -18 -107 57 -125 -95 144 -32 75 105 62 -28 258 -91
7456 -91 -236 116 242 -79 -12 -25 -45 124 100 79 -38 139 -29 210 -78 -48 -261 -16 -168 64 -228 87
7478 87 105 201 -145 207 -131 57 -348 97 -142 13 65 85 234 -152 -95 2 144 -24 -78 -155 -84 -277 -28
$$ packed form
7315aj42K09k12j11M76l78M53k35p6M03j42j35l35J47J16K79j20j07j48M14l21
7336C4Q2p4k54L95k06J00j24r1k04K08J82nl6R1k00M2RK4K1j67J56k01M16k15
7360a7LJ03k15M53j07l83L4L9J28J06k52L32l85o0K46R8k89L95l6p2j0P9l42P3
7384g9M7o3J09j27J55M5Mk8nKj01RR4l05J98L5L2l16P30o44N5J80K75m37J59J18
7410A42l83J69N1m0k34M11k68K77l37R4J09k16J91N8Q0J30j48l26M50j85NR8N0
7433A78k16J0j30L16k34K85k87R5j0J44j69q9J64j82L0K39j76J07L0m3r0K86l49
7456i1j45L52J26l21O7j3k0J69k4k1j17J77j68K39k88L0k13K45j52K32k92L15
7478H7J8R6l46L52l38J88m05M45k39J55N2K0J49l86N7R7J42j68n4p7P1j93K49
$$ plain form
7501 -28 -159 95 36 91 -125 -20 -99 108 174 22 -71 -19 -107 -11 178 41 35 -88 -60 -181 -157 -43 244 69
7525 69 30 57 -316 47 157 16 344 -100 -50 -143 15 270 -82 95 111 -107 118 -196 -80 127 121 42 -125
7548 -125 98 -39 -55 129 90 -17 49 3 18 0 -4 -28 17 186 -176 112 -44 -328 154 178 -107 -244 -11 184
7572 184 79 192 148 11 78 95 -141 -148 104 -3 258 -197 20 117 -29 -27 14 -144 35 -133 61 -233 266
7595 266 -95 -4 -54 -316 -115 278 202 -34 22 -184 -229 75 -93 -390 89 230 41 -368 -11 -192 200 109
7617 109 -213 -30 -127 147 180 283 267 -49 -57 94 -181 240 99 58 -22 -15 -61 155 -49 9 -128 -11 -86 140
7641 140 -12 -297 -89 -23 -7 26 -44 265 -246 -157 -213 -95 -39 -247 311 -41 194 70 46 -12 33 127 -289 116
7665 116 -66 -340 24 152 2 13 -11 64 75 -160 24 92 95 242 -60 118 -70 -7 74 234 64 237 68
$$ packed form
7501b8j31K54n9N5k16J05p9K07O6j52r3N2q8R6J89j37oj23K8j21K4J14K87j75
7525F9l9K7l73L63J10j41L28m44N0r3J58K55l52J77J6k18K25l14J16K07op9j67
7548a25K23j37j6J84l9j07O6m6J5j8mk4M5J69l62K88j56k84M82K4k85j37K33J95
7572A84j05J13m4j37O7J7k36pK52j07K61m55K17R7j46KM1j58J79j68J94k94M99
7595B66l61R1n0k62K01L93p6k36N6k06m5L04j68k97M79J41j89m09L57j81L92r1
7617A09l22J83r7K74L3J03j6l16qJ51k75M21j41m1q0Pm6K16k04N8j37J17p5K26
7641A40j52k85K08O6J6L3p0L09n11Q9n6J18N6k08N58l52K35j24k4n8M5R4m16M05
7665A16j82k74L64J28j50J1k4P5J1k35J84O8LJ47l02J78j88O3Q1J60j70J73j69
$$ plain form
7688 68 -18 -22 138 51 49 -40 -6 -101 3 -114 -44 -201 -74 36 37 -34 120 141 165 -148 -65 -39 -116 -71 -31 383 -100
7715 -100 172 -73 -111 236 8 72 -127 6 54 57 -138 122 -219 261 -74 -102 -171 -17 19 108 -5 -198 -77
7738 -77 -117 -5 -105 -107 -201 -221 -139 118 121 -141 19 109 43 209 -189 187 3 13 5 266 260 -80 46 36 358 59
7764 59 -125 95 -61 -8 68 -11 296 -139 -373 -76 132 325 92 66 38 -24 292 239 -12 95 226 4 -186
7787 -186 25 27 -142 -96 -192 -50 62 13 102 9 75 125 -213 -99 13 56 77 -33 120 80 66 -145 -25 -111 56
7812 56 138 -25 81 -20 -320 -164 88 120 -29 241 -292 -266 249 34 107 104 142 -148 -71 -38 253 17 -16 -97
7836 -97 -51 122 -232 -67 41 252 80 41 26 -22 -42 -27 -249 -189 33 -26 -100 273 36 -26 80 106 -162 129
7860 129 -372 -171 -295 3 -43 135 -307 77 -53 -116 -185 38 274 -127 -156 -33 87 -50 36 -18 -368 -19
$$ packed form
7688F8q6mJ60q7kq9L4r5J04j17P0j57J27J10Jp1J54K1K4l13Q3K6p7M5M0M14m83
7715a00K72k45l8L47k28O4j99J33M8Lj95K60l41M80l35k8o9J54L6Q9j13j93J21
7738g7m0J12j00kr4k0Q2K57Lk62J60R0o6J66l98L76j84J0qK61ol40J26j0L22k99
7764E9j84K20j56N3P6p9L07m35k34K97K08J93k33k6k8o2L16n3k51J07J31k22j90
7787a86K11Kj69M6r6J42J12m9Q9r3O6N0l38J14J12M3K1j10J53m0j4k11J20q6J67
7812E6Q2j63J06j01l00J56K52L2j49K70n33K6N15k15P3lL8k90P7L3K91k36l3q1
7836i7M6J73l54J65J08K11j72l9j5m8k0J5k22O0K22n9p4L73k37o2J06K6k68K91
7860A29n01K01j24K98m6J78m42L84j30o3o9K23K36m01k9J23J20j37Q6n4l50L49
$$ plain form
7882 -19 80 -25 57 -160 43 29 61 319 3 112 32 -187 -83 -343 294 -32 82 -26 -53 -155 -184 -80 30
7905 30 155 151 78 -198 -28 -100 -11 -56 138 45 -1 105 11 -271 -165 74 -17 63 -47 123 -66 58 247 285
7929 285 -81 -159 -119 -98 -78 157 -170 -134 45 -153 -65 -47 -82 -187 164 -301 42 71 316 -74 70 -191 96
7952 96 57 132 151 173 147 31 -20 125 -208 -13 123 -170 74 -13 -10 -39 -256 92 -62 -54 37 273 -121 80 -64
7977 -64 -75 151 -196 94 -166 -60 169 -144 198 -10 186 -110 202 -187 -40 -162 204 170 10 33 117 154
7999 154 313 195 -123 278 76 -34 47 74 -79 120 -350 153 65 41 -92 -257 150 -243 150 2 -13 105
8021 105 -169 -27 11 45 103 -145 89 -88 -54 -16 -3 -75 35 301 -140 68 -6 123 159 39 104 -1 -79 -188
8045 -188 169 -22 -88 -226 37 167 108 -100 -227 -124 187 115 -207 -66 -235 255 175 105 -40 55 -130 -77
$$ packed form
7882a9R9j05Q2k17K03j4L2K58l16J09q0k19J04k60O37l26J14j08k7j02k9J04J10
7905C0J25mp3k76J70p2Q9m5J94r3m6J06r4k82J06K39r1Q0j10J70j89J24J89L8
7929B85l66p8M0K1K0K35l27L6J79j98Q8J8l5j05L51m65L43K9K45l90J44k61K87
7952I6l9P5J9K2k6j16n1J45l33J95J36k93K44q7Lk9k17L48j54QR1K36l94K01j44
7977f4j1K26l47K90k60J06K29l13L42k08J96k96L12l89J47j22L66l4j60K3Q4L7
7999A54J59j18l18M01k02j10Q1K7j53J99m70N03q8k4j33j65M07l93L93j48j5J18
8021A05k74J42L8L4N8k48K34j77L4L8J3p2J10K66m41K08p4J29L6j20O5j05p8j09
8045a88L57j91o6j38K63J30n9k08j27J03L11p2l22J41j69M90q0p0j45R5j85N3
$$ plain form
8067 -77 -147 44 139 128 -255 -92 -22 -33 -20 99 103 91 74 162 -23 108 -241 -71 313 -169 194 61 38 10 101
8092 101 203 62 9 -18 187 -56 -106 161 -87 446 171 -167 -29 28 205 -68 -111 -107 -189 98 386 4 11
8115 11 7 145 -35 55 199 79 -108 -238 64 66 319 92 -175 -61 336 -115 -77 207 -117 -245 45 216
8137 216 169 -6 43 -255 -27 27 79 75 -17 185 77 165 82 -25 -118 -97 68 327 -116 74 -134 -105 -143 -14
8161 -14 -12 188 171 233 -181 38 118 82 -41 129 121 -190 -102 19 4 202 75 -144 -10 57 187 0 73 26 162
8186 162 111 199 -62 -119 333
$$ packed form
8067g7p0J91R5j1l83J63P0j1J3J19Mj2j7Q8j85J31l49J70L84m82L63j33k3k8R1
8092A01J02j41n3k7K05k43n0K67k48N33k75l38J38N7J77k73m3Mq2K87K88l82P
8115A1mJ38j80R0J44j20j87j30L02KK53k27k67J14L97m51L8K84l24j28K90J71
8137B16m7j75M9k98K28N4N2mr2K02j08Q8q3j07r3K1J65K59m43J90k08K9l8J29
8161a4KK00j7O2m14K19Q0l6j23J70ql11Q8J21j5J98j27k19J34O7J30j87P3m7J36
8186A62n1Q8k61n7M52
8191C33
$$ Imaginary data points
##PAGE= N=2
##DATA TABLE= (X++(I..I)), XYDATA
$$ plain form
0 0 0 0 0 0 0 0 0 0 7 -8 8 -8 16 -16 23 -24 32 -40 48 -56 72 -87 99 -120 138 -160 188 -216 250 -288 329
31 329 -375 426 -482 545 -612 689 -771 865 -962 1070 -1189 1321 -1462 1618 -1787 1971
47 1971 -2174 2395 -2637 2905 -3201 3527 -3894 4304 -4765 5289 -5891 6593 -7421 8414
61 8414 -9634 11171 -13178 15921 -19910 26265 -37997 66840 -292723 -212997 339375 -193938
73 -193938 -335004 121766 182800 -190529 19510 303459 88011 -103641 159396 223911
83 223911 -36097 -101849 121588 98425 -130491 -115613 79702 -28605 -198333 -23017 98872
94 98872 -177554 -209481 160134 157886 -186864 -58549 253888 70038 -125554 132377 213172
105 213172 -70697 -79083 131636 941 -198975 -40192 94956 -90992 -182565 -3484
$$ packed form
0@%%%%%%%%Pj5J6j6K4l2L9m7N6p2Q8j04J28j59J86k19K58k98L48m04M66n38O17
31C29p04Q01r08J027j157J301j460J636j827K032k259K510k783L080l405L758
47A971m145M569n032N542o106O728p421Q198r069J0054j1180J2484j4014J5835
61H414j8048K0805k4349K9099l5831M6175o4262J04837l59563P9726N52372n33313
73a93938j41066M56770O1034l73329K10039K83949k15448j91652K63037O4515
83B23911k60008o5752K23437k3163k28916J4878J95315j08307j69728J75316J21889
94I8872k76426l1927L69615k248l44750J28315L12437j83850j95592K57931Q0795
105B13172k83869q386K10719j30695j99916J58783J35148j85948r1573J79081
$$ plain form
115 -3484 64482 -52238 -22363 112777 45642 -76240 49674 175719 13996 -109510 43801
126 43801 95807 -81598 -82366 83206 13606 -138196 -22222 93333 -47804 -100054 73408
137 73408 84227 -83359 -39740 126606 55452 -71909 35267 111999 -40183 -80765 81396
148 81396 57027 -128881 -77290 72678 -27486 -132404 11570 78210 -61773 -51110 100252
159 100252 53289 -57359 44171 127071 -5703 -71362 47203 64590 -55392 -54843 34701
170 34701 -11550 -93939 -16224 61676 -33009 -90255 28749 72381 -40414 -33229 85592 38957
182 38957 -61846 26493 96015 -24308 -57221 64006 36238 -92791 -36306 60653 -25080
193 -25080 -86099 10817 35203 -50610 -26767 61979 25388 -40727 14304 67029 5745 -35923
$$ packed form
115c484O7966j16720K9875J35140o7135j21882J25914J26045j61723j23506J53311
126D3801N2006j77405p68J65572o9600j51802J15974J15555j41137n2250J73462
137G3408J0819j67586M3619J66346p1154j27361J07176P6732j52182m0582J62161
148H1396k4369j85908N1591J49968j00164j04918J43974O6640j39983J0663J51362
159A00252m6963j10648J01530Q2900j32774o5659J18565J7387j19982N49Q9544
170C4701m6251q2389P7715P7900r4685n7246J19004M3632j12795P185J18821m6635
182C8957j00803Q8339O9522j20323l2913J21227k7768j29029N6485R6959q5733
193b5080o1019R6916K4386q5813K3843Q8746l6591o6115N5031N2725o1284m1668
$$ plain form
205 -35923 21363 39572 -27977 -36661 26890 12035 -50752 -11593 45674 -15763 -57433 26134
217 26134 50288 -37785 -33919 48684 16620 -47329 11747 52113 -23050 -39048 35881 23447
229 23447 -45323 -17002 32651 -10774 -42297 10033 28384 -17771 -13691 37442 26487 -17702
241 -17702 5987 44237 6375 -34055 650 21052 -28889 -42142 6437 2493 -41582 -14695
253 -14695 30810 -208 -24202 25324 39755 -10098 -6589 39363 17656 -23760 4519 29689
265 29689 -11227 -27500 12154 12572 -29963 -22499 12690 -6059 -35555 -8490 15738 -11713 -19966
278 -19966 19447 27020 -3898 5646 38155 19490 -10132 11372 24074 -14342 -27821 3886
290 3886 -2107 -37554 -21866 11989 -7385 -26152 7957 25609 -4282 -5714 26879 18707 -11123
$$ packed form
205c5923N7286J8209o7549q684O3551j4855o2787L9159N7267o1437m1670Q3567
217B6134K4154q8073L866Q2603l2064o3949N9076M0366p5163j5998P4929j2434
229B3447o8770K8321M9653m3425l1523N2330J8351m6155M080N1133j0955m4189
241a7702K3689L8250l7862m0430L4705K0402m9941j3253M8579l944m4075K6887
253a4695M5505l1018k3994M9526J4431m9853L509M5952k1707m1416K8279K5170
265B9689m0916j6273L9654M18m2535P464L5189j8749k9496K7065K4228k7451q253
278a9966L9413P573l0918R544L2509j8665k9622K1504J2702l8416j3479L1707
290C886n993l5447J5688L3855j9374j8767L4109J7652k9891j432L2593q172k9830
$$ plain form
303 -11123 3975 24085 -1147 -16433 9534 13120 -15716 -12120 12677 -1127 -24113 -5684
315 -5684 9887 -13317 -21174 5895 10269 -11187 -3154 21792 12088 -4818 10474 21001 -893
328 -893 -9926 7149 3017 -19061 -12636 4677 -7288 -18394 874 11859 -4847 -5889 15078
341 15078 12858 -6230 835 15080 1491 -11230 2787 8890 -8104 -9574 6733 3250 -11503
354 -11503 -3934 8028 -3637 -12026 1851 6529 -8209 -6105 10133 5638 -7408 2714 13361
367 13361 205 -7919 5761 6756 -9457 -7983 5848 213 -11217 -690 9388 -448 -4587
380 -4587 8117 9096 -3342 -1063 8851 671 -10023 -268 5657 -8304 -11088 3963 3249 -10172
394 -10172 -3683 8639 202 -7004 5231 9542 -2318 -806 10625 5749 -3500 2276 7354 -1916
$$ packed form
303a1123J5098K0110k5232j5286K5967L586k8836L596K4797j3804k2986J8429
315e684J5571k3204p857K7069M374k1456Q033K4946r704j6906J5292J0527k1894
328h93r033J7075m132k2078O425J7313j1965j1106J9268J0985j6706j042K0967
341A5078k220j9088P065J4245j3589j2721J4017O103j6994j470J6307l483j4753
354a1503P569J1962j1665q389J3877M678j4738K104J6238m495j3046J0122J0647
367A3361j3156q124J3680R95j6213J474J3831n635j1430J0527J0078r836m139
380d587J2704R79j2438K279R914q180j0694R755N925j3961k784J5051p14j3421
394a0172O489J2322q437p206J2235M311j1860J512J1431m876r249N776N078r270
$$ plain form
408 -1916 -6406 436 -293 -9586 -8068 402 -2253 -9040 -2318 7482 2366 -2060 7723 11680 2214
423 2214 1932 11268 5325 -5166 1434 5965 -6042 -9553 780 -1468 -10852 -5484 1203 -5907 -7936
438 -7936 1901 3460 -3075 966 9100 6449 2114 5739 9109 4486 335 2229 1793 -4678 -6679
453 -6679 -2907 -4420 -9545 -6226 -233 -2929 -3782 3126 4125 -664 3204 8469 3030 -1637 3888 4947
469 4947 -1766 -2776 378 -849 -2970 -2265 -2532 -3608 -3106 -2726 -1944 -1229 -2161 -202 3460 3107 643
486 643 3925 6467 2821 1798 4293 279 -4907 -1443 -412 -7660 -8393 -562 -24 -5127 -1765 3341
502 3341 2472 2196 5876 5783 726 886 5157 2519 -3776 -2335 1930 -1763 -5543 -1110 536 -5337
518 -5337 -3780 2415 -2192 -6544 1635 5118 -2972 -2111 7431 5643 185 5330 7287 199 19 4977
$$ packed form
408a916m490O842p29r293J518Q470k655o787O722R800n116m426R783L957r466
423B214k82R336n943j0491O600M531j2007l511J0333k248r384N368O687p110k029
438g936R837J559o535M041Q134k651m335L625L370m623m151J894m36o471k001
453f679L772j513n125L319N993k696q53O908R99m789L868N265n439m667N525J059
469D947o713j010L154j227k121P05k67j076N02L80P82P15r32J959L662l53k464
486F43L282K542l646j023K495m014n186L464J031p248p33P831N38n103L362N106
502C341q69k76L680r3n057J60M271k638o295J441M265l693l780M433J646n873
518e337J557O195m607m352Q179L483q090Q61R542j788n458N145J957p088j80M958
$$ plain form
534 4977 -481 -7672 -3934 -917 -5462 -7923 -2830 -1106 -2918 -383 3738 2355 -573 4229 7420
549 7420 2046 -464 3633 2843 -1344 1475 3354 -2979 -3370 2334 210 -5016 -2757 -514 -4661 -4490
565 -4490 -1075 -1481 -1967 194 1448 1032 3810 5205 4039 3264 2968 1829 1794 638 -1516 -2214 -2192 -3075
583 -3075 -1722 -1365 -3065 -2965 -635 -332 -1287 -715 -893 -835 2249 2080 -621 1582 4354 1941 2770 5217
601 5217 1241 -1901 2464 2186 -3642 -3697 -1159 -4903 -4850 -50 -1780 -4690 -291 2525 -538 424 4408
618 4408 2756 639 2131 3198 1929 1629 1440 378 -327 -920 -696 -648 -3196 -4148 -1678 -1286 -3703
635 -3703 -2045 107 -1618 -535 4357 3142 -751 2791 6004 1859 -123 1931 746 -1792 404
650 404 -170 -3989 -3455 -375 -1548 -3094 -1054 -330 -1616 -327 1762 1830 1040 1155 1814 2234 1149 1190
$$ packed form
534D977n458p191L738L017m545k461N093J724j812K535M121j383k928M802L191
549G420n374k510M097p90m187K819J879o333l91N704k124n226K259K243m147J71
565d490L415m06m86K161J254m16K778J395j166p75k96j139l5j156k154o98K2q83
583c075J353L57j700J00K330L03r55N72j78N8L084j69k701K203K772k413Q29K447
601E217l976l142M365k78n828n5K538l744N3M800j730k910M399K816l063R62L984
618D408j652k117J492J067j269l00j89j062p05n93K24M8k548r52K470L92k417
635c703J658K152j725J083M892j215l893L542L213m145j982K054j185k538K196
650D04n74l819N34L080j173j546K040P24j286J289K089O8p90J15O59M20j085M1
$$ plain form
668 1190 1600 137 -1660 -1417 -779 -1735 -2649 -1999 -2029 -1932 -82 1126 -149 373 2218 2216 1242 1534 1760
687 1760 672 101 586 266 -1235 -1420 -617 -743 -1387 -1217 -1225 -873 -132 55 -568 -197 1008 947 964 1591
707 1591 1811 1106 1278 1252 535 -244 -856 -1392 -1752 -1073 -1384 -1798 -1095 -29 -1 225 1313 1521 457 796
727 796 1080 360 294 423 -226 -690 -148 502 -8 -366 303 19 -561 -377 -340 -402 -695 -1213 -347 -332 -485 -368
749 -368 1324 949 412 1201 1109 325 459 630 -117 -1051 -8 284 -1264 -517 489 -177 -838 600 467
768 467 -1085 -480 -57 -1008 -899 101 70 -640 282 829 465 895 1503 830 631 108 43 -513 -725 -1255
788 -1255 -1369 -897 -1010 -986 -199 471 59 527 1117 807 572 831 567 308 476 649 -59 45 226 -448
808 -448 -452 -538 -618 -661 -1111 -1074 -726 -560 -607 -253 475 966 867 1077 1550 1491 1242 1064 759 -18 -85 -605 -1520 -1422
$$ packed form
668A190M10j463j797K43O38r56r14O50l0R7J850J208j275N22J845kr74K92K26
687A760j088n71M85l20j501j85Q03j26o44J70qL52P41J87o23L71J205o1J7O27
707A591K20p05J72k6p17p79o12n36l60O79l11m14P03J066K8K26J088K08j064L39
727G96K84p20o6J29o49m64N42O50n10l58O69k84n80J84L7o2k93n18Q66J5j53J17
749c68J692l75n37P89r2p84J34J71p47r34J043K92j548P47J006o66o61J438j33
768D67j552O05M23r51J09J000l1p10R22N47l64M30O08o73j99n23o5n56k12n30
788a255j14M72j13K4P87O70m12M68N90l10k35K59k64k59J68J73p08J04J81o74
808d48mq6q0m3m50L7L48J66m7L54P28M91r9K10M73n9k49j78l05p77o7n20r15R8
$$ plain form
832 -1422 -1388 -1290 -1391 -871 74 -222 263 866 1036 799 1206 1260 953 710 229 667 -143 -315 -195 -561 -1063
853 -1063 -894 -734 -918 -1035 -559 -425 -615 -129 727 709 858 1265 1335 1210 905 608 527 318 -202 -294 -539
874 -539 -1270 -1233 -964 -729 -1054 -561 -123 -477 296 938 761 632 1046 977 566 451 525 223 -169 -330 -118
895 -118 -400 -393 -484 -681 -588 -403 -611 -502 -426 -334 332 241 -62 411 774 505 372 545 364 194 319 -154 -682
918 -682 -288 -397 -986 -360 -57 -768 -908 137 -186 -375 266 73 23 528 606 161 211 528 297 -14 543
939 543 324 -67 -56 -278 -372 -17 -167 -888 -767 -833 -399 -324 -1 -570 -454 696 442 24 1297 598 -232
960 -232 884 978 -526 -584 565 -143 -1024 -235 -27 -1323 -482 -42 -599 -730 401 357 -747 611 1229
979 1229 334 67 1112 437 -84 490 554 -302 -427 -208 -460 -742 -766 -706 -851 -541 -203 -123 -127 -123 328 1199
$$ packed form
832a422L4R8j01N20R45k96M85O03J70k37M07N4l07k43m81M38q10j72J20l66n02
853a063J69J60j84j17M76J34j90M86Q56j8J49M07P0j25l05k97q1k09n20r2k45
874e39p31L7K69K35l25M93M38l54P73O42j77j29M14o9m11j15P4l02l92j61K12
895a18k82Pr1j97R3J85k08J09P6R2O66r1l03M73L63k69j33J73j81j70J25m73n28
918f82L94j09n89O26L03p11j40J045l23j89O41j93n0N05P8m45N0L17k31l11N57
939E43k19l91J1k22r4L55j50p21J21o6M34P5L23n69J16J150k54m18J273o99q30
960b32J116R4j504n8J149p08q81P89K08j296Q41M40n57j31J131m4j104J358O18
979A229q95k67J045o75n21N74O4q56j25K19k52k82k4O0j45L10L38Q0mMM51Q71
$$ plain form
1001 1199 915 460 907 998 492 608 227 -705 -786 34 -518 -1355 -542 -519 -1390 -476 328 -55 -585 691
1021 691 1049 56 738 1543 155 115 986 422 -550 -57 58 -878 -897 -211 -662 -1182 -723 -507 -577 -434 588
1042 588 797 147 393 1493 806 301 954 928 40 -28 -84 -805 -1150 -450 -790 -1402 -875 -464 -101 -87 546
1063 546 445 135 683 701 838 415 739 610 851 79 -57 69 -199 -947 -261 -482 -1105 -507 -88 -825
1083 -825 -602 519 389 -43 668 1030 251 438 1750 455 -506 406 255 -1139 -679 -486 -1180 -731 106
1102 106 -480 -708 211 538 280 224 770 205 690 571 118 -47 59 102 41 57 -470 -52 -336 -90 -646
1123 -646 -380 -157 -506 -44 303 -395 -270 892 377 -28 579 478 172 189 245 -21 -539 116 -44 -483
1143 -483 -522 -17 -67 -218 4 -186 -216 43 354 49 166 -13 241 -29 -116 77 -14 210 410 167 -148 -185
$$ packed form
1001A199k84m55M47R1n06J16l81r32q1Q20n52q37Q13K3q71R14Q04l83n30J276
1021F91L58r93O82Q05j388m0Q71n64r72M93J15r36j9O86m51n20M59K16p0J43J022
1042E88K09o50K46J100o87n05O53k6q88o8n6p21l45P00l40o12N27M11L63J4O33
1063E46j01l10N48J8J37m23L24j29K41p72j36J26k68p48O86k21o23N98M19p37
1083h25K23J121j30m32P11L62p79J87J312j295r61R12j51j394M60J93o94M49Q37
1102A06n86k28R19L27k58n6N46n65M85j19m53j65J06M3o1J6n27M18k84K46n56
1123f46K66K23l49M62L47o98J25J162n15m05O07j01l06J7N6k66n18O55j60m39
1143d83l9N05n0j51K22j90l0K59L11l05J17j79K54k70q7J93r1K24K00k43l15l7
$$ plain form
1165 -185 -92 -171 -505 -209 -254 -1 -434 95 57 -201 253 403 52 215 197 331 -66 137 269 371 255 259
1187 259 -70 -278 -302 -115 -226 -375 -472 -28 -197 -20 -65 -253 19 414 413 202 253 534 519 176 468 101
1209 101 -118 -111 59 -222 -608 -359 -174 -246 -347 -17 -203 103 104 168 408 216 478 363 452 400 243 121 -24
1232 -24 15 5 -157 -435 -246 -180 -362 -334 -226 -4 61 -44 -55 291 351 439 270 310 562 344 117 -129 -123 -226
1256 -226 -368 -179 -194 -502 -267 74 -421 -175 -163 -6 -28 327 418 144 605 375 -51 1 -93 -81 -184 -364
1278 -364 -66 -617 -316 -285 -204 -435 -90 -206 -196 -161 144 190 295 227 290 292 186 256 6 57 36 -112 94 -319
1302 -319 -456 -410 -474 -250 -113 36 16 186 82 180 454 417 214 136 479 -139 -186 5 -75 -218 -265 -134 -279
1325 -279 -94 -140 -121 -113 -211 -264 -26 76 2 -193 232 183 218 76 232 -50 -164 -41 -133 -165 -125 -174 -80 -343 -136
$$ packed form
1165a85R3p9l34K96m5K53m33N29l8k58M54J50l51J63j8J34l97K03J32J02j16M
1187B59l29k08k4J87j11j49r7M44j69J77m5j88K72L95jk11N1K81j5l43K92l67
1209A01k19PJ70k81l86K49J85p2j01L30j86L06JO4K40j92K62j15Q9n2j57j22j45
1232b4L9j0j62k78J89O6j82K8J08K22O5j05j1L46O0Q8j69M0K52k18k27k46Oj03
1256b26j42J89j5l08K35L41m95K46J2J57k2L55R1k74M61k30m26N2r4J2j03j80
1278c64K98n51L01L1Q1k31L45j16J0L5L05M6J05o8O3Kj06P0k50N1k1j48K06m13
1302c19j37M6o4K24J37J49k0J70j04R8K74l7k03p8L43o18m7J91q0j43m7J31j45
1325b79J85m6J9Qr8n3K38J02p4j95M25m9L5j42J56k82j14J23r2l2M0m9R4k63K07
$$ plain form
1350 -136 -19 186 -116 -103 276 159 79 223 -62 66 163 22 -83 -27 -138 -202 84 32 -227 -152 134 -130
1372 -130 -375 -100 -59 -165 -300 35 143 272 -326 -58 0 292 134 116 363 -18 78 0 -184 152 -36 -182
1394 -182 -264 -217 -296 -74 -29 -29 -107 -10 -191 307 239 160 11 65 466 300 195 17 -7 67 -217 -125 -182 -294 -120
1419 -120 -4 -319 70 12 -22 57 122 136 455 121 126 85 167 34 137 -158 -289 -44 -121 -352 -373 -167 -162 -345
1443 -345 82 -241 206 46 -19 380 153 98 439 377 -197 119 167 -336 -385 0 -349 19 -272 -286 -292 -172 157
1466 157 86 247 60 -190 149 270 343 587 -58 17 190 285 -70 -153 -163 -79 -319 -523 -250 -149 -48 -96 -94
1489 -94 110 272 121 14 225 212 59 184 93 282 172 311 -34 -165 -145 114 -132 -371 -195 -41 -412
1510 -412 68 -127 -62 55 282 373 167 141 180 155 110 74 58 -259 -231 -72 -303 -225 -60 -99 -273 -241 -30 122
$$ packed form
1350a36J17K05l02J3L79j17q0J44k85J28R7j41j05N6j11o4K86n2k59P5K86k64
1372a30k45K75M1j06j35L35J08J29n98K68N8K92j58j8K47l81R6p8j84L36j88j46
1394a82q2M7p9K22M5%p8R7j81M98o8p9j49N4M01j66j05j78k4P4k84R2n7j12J74
1419a20J16l15L89n8l4P9O5J4L19l34Nm1Q2j33J03k95j31K45p7k31k1K06Nj83
1443c45M27l23M47j60o5L99k27n5L41o2n74L16M8n03m9L85l49L68k91j4oJ20L29
1466A57p1J61j87k50L39J21P3K44o45P5J73R5l55q3j0Q4k40k04K73J01J01m8K
1489i4K04J62j51j07K11j3j53J25r1J89j10J39l45j31K0K59k46k39J76J54l71
1510d12M80j95O5J17K27R1k06k6L9k5m5l6j6l17K8J59k31P8J65l9j74L2K11J52
$$ plain form
1534 122 -193 -297 99 -23 379 207 140 -232 31 238 -258 -58 -61 -49 -189 -267 -381 -529 -403 -409 -150 -291
1556 -291 210 68 -58 40 124 367 111 43 56 147 -41 -214 13 -286 -288 46 -64 69 -348 -154 -391 38
1578 38 185 -126 -282 51 262 -96 -108 212 -158 187 456 236 152 -82 99 26 -350 -215 -133 -276 -302 34
1600 34 498 26 298 -162 122 104 163 156 111 34 238 71 81 -116 219 -447 -503 23 -263 -426 -111 20 -170
1623 -170 -48 299 214 -38 252 341 149 193 369 -204 193 -124 -222 -205 -205 -37 -300 -224 -323 -19 79 119 103 -99
1647 -99 126 -19 121 146 112 55 -132 9 310 36 -57 -17 -93 -258 -109 -407 -156 -95 -275 90 59 -180 -38
1670 -38 125 -102 9 209 281 277 6 0 51 84 131 84 -320 91 -393 -154 50 -294 -194 173 -104 136 32
1693 32 25 294 168 283 3 -27 11 324 -214 148 212 -118 -120 -57 -57 -224 139 67 138 357 133 -137 -90 30 79
$$ packed form
1534A22l15j04L96j22M02j72o7l72K63K07m96K00lJ2j40p8j14j48J26oK59j41
1556b91N01j42j26R8Q4K43k56o8J3R1j88j73K27k99kL34j10J33m17J94k37M29
1578C8J47l11j56L33K11l58j2L20l70L45K69k20q4k34J81p3l76J35Q2j43k6L36
1600C4M64m72K72m60K84j8N9pm5p7K04j67J0j97L35o66n6N26k86j63L15J31j90
1623a70J22L47q5k52K90Q9j92M4J76n73L97l17r8J7%J68k63P6r9L04R8M0j6k02
1647i9K25j45J40K5l4n7j87J41L01k74r3M0p6j65J49k98K51O1j80L65l1k39J42
1670c8J63k27J11K00P2mk71oN1L3M7m7m04M11m84K39K04l44J00L67k77K40j04
1693C2pK69j26J15k80l0L8L13n38L62O4l30kO3%j67L63p2P1K19k24k70M7J20M9
$$ plain form
1718 79 65 90 69 43 50 -131 22 192 30 1 31 -130 -61 -149 79 30 53 191 270 -180 -206 197 -68 -86 -89 239
1744 239 276 114 -82 358 164 -10 -50 -130 -414 -216 -282 -81 -307 -71 133 -168 74 312 6 12 191 -41
1766 -41 -69 58 171 -142 60 -16 6 -228 -21 -175 -91 189 -274 134 -329 -220 -31 57 140 6 112 146 357
1789 357 177 223 176 329 -128 37 -315 -249 -89 59 -211 -237 -350 -36 -99 -205 -125 40 14 77 206 211 139 80
1813 80 370 102 7 -107 122 21 22 -170 412 122 -181 92 -16 -41 84 -18 -39 87 128 155 80 160 -1
1836 -1 -57 -77 -150 -2 -24 -174 -312 71 -267 19 -90 202 -18 -52 112 357 72 127 -34 60 -53 -85 302
1859 302 -30 -30 -295 -132 -156 -15 -168 -77 168 36 -126 257 99 -54 88 45 121 136 348 97 50 -195 71
1882 71 -41 -231 -25 6 -73 -178 -180 -81 -45 149 23 -82 -14 52 37 -42 -269 227 124 -58 -98 -203 34 204
$$ packed form
1718G9j4K5k1k6Pj81J53J70j62k9L0j61O9q8K28m9K3J38P9m50k6M03k65j8lL28
1744B39L7j62j96M40j94j74m0q0k84J98o6K01k26K36K04l01K42K38l06OJ79k32
1766d1k8J27J13l13K02p6K2k34K07j54Q4K80m63M08m63J09J89Q8Q3j34J06L4K11
1789C57j80M6m7J53m57J65l52O6J60J48k70k6j13L14o3j06Q0J65k6O3J29Np2n9
1813H0K90k68r5j14K29j01Jj92N82k90l03K73j08k5J25j02k1J26M1K7p5Q0j61
1836an6k0p3J48k2j50j38L83l38K86j09K92k20l4J64K45k85N5j61R4j13l2L87
1859C02l32%k65J63k4J41j53R1K45j32j62L83j58j53J42m3P6J5K12k51m7k45K66
1882G1j12j90K06L1p9j05kR9L6J94j26j05O8O6j5p9k27M96j03j82m0j05K37J70
$$ plain form
1906 204 -267 -384 -95 22 80 -195 -293 73 59 -119 3 47 127 27 -81 -64 -172 89 303 -56 51 -9
1928 -9 74 -124 342 175 -64 -25 186 97 -151 -156 -57 286 -4 122 43 -23 277 110 -30 -161 22 132 -137
1951 -137 -66 144 54 -109 -170 -290 -60 -62 -146 404 -167 -167 -399 42 291 362 148 56 226 165 106 71 74 44 -91
1976 -91 -154 5 -308 -135 -170 -1 126 -59 197 135 254 219 -103 -91 61 160 -32 -95 27 12 -185 109 10
1999 10 -44 -33 -18 -194 -288 -89 -125 -135 138 152 56 -105 63 -105 266 94 -209 90 -246 -199 118 -208 -125 168
2023 168 -229 83 -131 190 -162 -153 -137 -165 -55 121 87 -67 -240 280 -128 84 -214 -163 42 34 -153 126 34
2046 34 -138 -204 -278 -20 -187 43 -59 114 -101 100 -55 53 13 2 110 -364 -374 -18 -236 -52 109 -179
2068 -179 -79 161 -134 44 -100 169 -22 299 178 -172 33 44 -119 -65 55 162 128 83 166 -6 -263 -44
$$ packed form
1906B04m71j17K89J17N8k75r8L66j4j78J22M4Q0j00j08J7j08K61K14l59J07o0
1928iQ3j98M66j67k39L9K11q9k48nR9L43k90J26p9o6L00j67j40j31J83J10k69
1951a37P1K10r0j63o1j20K30kq4N50n71%k32M41K49P1k14r2J70o1n9l5Ll0j35
1976i1o3J59l13J73l5J69J27j85K56o2J19l5l22J2J52R9j92o3J22j5j97K94r9
1999A0n4J1J5j76r4J99l6j0K73J4r6j61J68j68L71j72l03K99l36M7L17l26Q3K93
2023A68l97L12k14L21l52RJ6k8J10J76l4j54j73N20m08K12k98N1K05qj87K79r2
2046C4j72o6p4K58j67K30j02J73k15K01j55J08m0j1J08m74j0L56k18J84J61k88
2068a79J00K40k95J78j44K69j91L21j21l50K05J1j63N4J20J07l4m5Q3j72k57K19
$$ plain form
2090 -44 -123 -84 194 160 -272 5 -50 101 117 234 484 156 -30 121 89 43 -9 21 114 -55 -85 -191 -36 -80
2114 -80 75 220 182 18 -11 37 125 156 -75 -49 -2 100 -103 -244 -72 61 -160 110 71 -46 -80 -92 -435 -79
2138 -79 58 122 199 86 -87 -173 212 -14 8 145 43 125 15 -124 -146 -155 39 -110 -13 63 -13 -42 -47 -87 -245
2163 -245 -127 -77 112 147 -334 243 -112 183 45 86 -68 -269 -20 54 -339 149 -6 325 301 -216 133 -413
2185 -413 -92 -179 -34 103 140 29 -211 -10 303 -236 128 242 -75 100 147 21 -55 -151 54 -96 -57 55
2207 55 201 -90 327 172 140 51 74 -48 -8 203 126 87 44 -35 -4 193 104 -100 -85 253 -227 -128 86 -96
2231 -96 107 -63 185 230 -67 141 -59 -24 37 -205 -41 -119 -181 -134 172 -170 -380 21 -20 28 81 100 -167 -6
2255 -6 -177 -277 112 -162 3 76 -155 15 115 -304 81 45 -2 199 -361 -157 29 -70 -233 74 43 76 32
$$ packed form
2090d4p9L9K78l4m32K77n5J51J6J17K50l28j86J51l2m6n2L0R3j69l0j06J55m4
2114h0J55J45l8j64k9M8Q8L1k31K6M7J02k03j41J72J33k21K70l9j17l4j2l43L56
2138g9J37O4P7j13j73q6L85k26K2J37j02Q2j10j39k2rJ94j49R7P6p6k9nm0j58
2163b45J18N0J89L5m81N77l55K95j38M1j54k01K49P4l93M88j55L31k4n17L49n46
2185d13L21q7J45J37L7j11k40K01L13n39L64J14l17J75M7j26p6r6K05j50L9J12
2207E5J46k91M17j55l2q9K3j22M0K11p7l9m3p9L1J97q9k04J5L38m80R9K14j82
2231i6K03j70K48M5k97K08k00L5O1k42J64p8o2M7L06l42k10M01m1M8N3J9k67J61
2255fj71j00L89k74J65P3k31J70J00m19L85l6m7K01n60K04J86r9j63L07l1L3m4
$$ plain form
2278 32 -251 185 -112 -208 -146 -202 -164 -77 63 -29 -143 -56 -134 224 -45 154 -43 -253 -82 -177 -313 -256 82 -39
2302 -39 -125 -194 129 174 250 188 -2 55 -98 11 -32 183 227 -115 -105 -91 176 -247 153 -32 66 222 -41 150
2326 150 -207 83 -22 122 -30 -56 -7 24 -186 115 84 -182 179 16 -54 87 -135 -143 69 -190 287 -48
2348 -48 -169 -102 -16 -7 -115 -30 309 94 -49 -184 257 -134 251 -259 -143 -138 -159 63 -186 99 161 -157 40
2371 40 148 395 135 -180 98 -8 215 -158 -94 -140 -203 10 -2 -74 171 -78 -103 -99 -96 194 147 131 152 201 37
2396 37 -56 -73 161 20 -139 90 -80 -47 -189 165 -7 290 -263 -439 22 -15 2 254 2 26 -23 228 207
2419 207 -98 42 -264 -58 -9 37 -24 -71 -96 -62 -256 248 -20 15 311 239 60 200 84 -100 -281 103 -256
2442 -256 160 -102 23 168 120 182 14 -83 -194 -83 -258 -39 -93 -117 -199 88 170 -70 -46 199 -59 -131 -15
$$ packed form
2278C2k83M36k97r6O2n6L8Q7J40r2j14Q7p8L58k69J99j97k10J71r5j36N7L38j21
2302c9q6o9L23M5P6o2j90N7j53J09m3K15M4l42J0J4K67m23M00j85R8J56k63J91
2326A50l57K90j05J44j52k6M9L1k10L01l1k66L61j63p0J41k22qK12k59M77l35
2348d8j21O7Q6Rj08Q5L39k15j43j35M41l91L85n10J16Nk1K22k49K85O2l18J97
2371D0J08K47k60l15K78j06K23l73O4m6o3K13j2p2K45k49k5MLK90m7j6K1M9j64
2396C7r3j7K34j41j59K29j70L3j42L54j72K97n53j76M61l7J7K52k52K4m9K51k1
2419B07l05J40l06K06M9M6o1m7k5L4j94N04k68L5K96p2j79J40j16j84j81L84l59
2442b56M16k62J25J45m8O2j68r7j11J11j75K19n4k4q2K87Q2k40K4K45k58p2J16
$$ plain form
2465 -15 5 -296 222 143 -86 221 -56 -223 -106 -96 40 -72 -78 -3 -139 156 -45 235 166 146 -43 -193 -76
2488 -76 -124 8 -208 -101 21 -140 18 -93 87 322 -92 -61 -289 -154 39 84 -129 105 259 -102 -60 81
2510 81 108 -240 4 34 135 -15 -116 -222 -81 -58 -97 -140 17 127 -235 -197 -310 -19 -325 -181 -173 279 3
2533 3 -193 15 306 -37 -104 -34 23 32 -220 -9 59 -100 253 -30 -147 111 18 47 -184 149 56 -169 8 -98
2557 -98 -248 212 -118 30 217 13 -331 -289 -257 -238 74 -99 -42 -110 226 -88 207 -63 -41 -12 137 106 -125
2580 -125 198 231 -220 0 267 21 -265 -41 76 217 -4 -182 -264 41 172 -34 -127 -92 -158 209 264 -135
2602 -135 22 -224 80 12 -125 -225 70 -72 -109 7 -5 -165 -295 122 165 4 -111 43 -196 65 182
2623 182 -45 191 -15 -47 -12 66 -205 126 -20 -56 -160 191 -329 307 303 194 -86 6 145 103 212 -92 -17
$$ packed form
2465a5K0l01N18p9k29L07k77j67J17J0J36j12oP5j36K95k01K80o9k0j89j50J17
2488g6m8J32k16J07J22j61J58j11J80K35m14L1k28J35J93M5k13K34J54l61M2J41
2510H1K7l48K44L0J01j50j01j06J41K3l9m3J57J10l62L8j13K91l06J44QM52k76
2533Cj96K08K91l43o7P0N7Rk52K11O8j59L53k83j17K58r3K9k31L33r3k25J77j06
2557i8j50M60l30J48J87k04l44M2L2J9L12j73N7o8L36l14K95k70K2K9J49l1k31
2580a25L23L3m51K20K67k46k86K24J17J41k21j78q2L05J31k06r3L5o6L67N5l99
2602a35J57k46L04o8j37j00K95j42l7J16j2j60j30M17M3j61j15J54k39K61J17
2623A82k27K36k06l2L5P8k71L31j46l6j04L51n20O36mj09k80R2J39m2J09l04P5
$$ plain form
2646 -17 -77 48 194 207 128 111 41 -78 -9 -73 -85 -130 -87 56 339 189 -67 39 74 189 -29 -15 -123 146
2670 146 -15 -227 17 -19 495 61 -27 -191 105 273 254 -48 -51 -116 -57 -53 30 -23 -46 -160 -19 134 -188 164
2694 164 -156 216 88 19 -161 -88 -111 -83 -87 31 22 -150 304 -80 -249 37 40 -48 -16 18 -246 14 -29 69 17
2719 17 -63 138 202 -15 67 -27 -20 -275 54 197 -115 209 11 -67 82 -21 -71 146 -68 50 -61 0 -150
2742 -150 -36 3 127 190 162 85 -88 -30 130 31 221 47 170 74 81 -256 -300 -27 -27 -74 74 181 59 -50
2766 -50 -147 -88 -228 -22 -95 -154 3 240 313 116 18 -13 -23 -62 49 -30 49 -61 -184 -234 -193 49 141 73 -90
2791 -90 44 -238 -99 68 -62 -143 219 85 28 47 -138 -2 -15 -84 187 154 235 64 85 -210 -31 -24 71 -333
2815 -333 -19 92 -18 -156 -52 127 -73 -1 177 57 114 -154 332 142 -105 -99 109 158 -338 166 39 151
$$ packed form
2646a7o0J25J46J3p9j7p0j19O9o4j2m5M3J43K83j50k56J06L5J15k18J4j08K69
2670A46j61k12K44l6N14m34q8j64K96J68j9l02lo5N9MQ3n3k3j14J41J53l22L52
2694A64l20L72j28o9j80P3k3K8mJ18rj72M54l84j69K86Lq8L2L4k64K60m3R8n2
2719A7q0K01O4k17Q2r4Pk55L29J43l12L24j98p8J49j03n0K17k14J18j11O1j50
2742a50J14L9J24O3k8p7j73N8J60r9J90j74J23r6Pl37m4K73%m7J48J07j22j09
2766e0r7N9j40K06p3n9J57K37P3j97r8l1j0l9J11p9P9j10j23n0M1K42R2o8j63
2791i0J34k82J39J67j30q1L62j34n7J9j85J36j3o9K71l3Q1j71K1k95J79PR5m04
2815c33L14J11j10j38J04J79k00P2J78j20N7k68M86j90k47OK08M9m96N04j27J12
$$ plain form
2837 151 -160 40 57 -33 -26 133 -17 161 70 -56 -51 106 236 -236 -14 -89 38 -51 42 -34 231 -20 250 -68
2861 -68 -36 -227 23 136 69 316 288 -26 -13 12 204 -61 -181 198 -42 132 -72 108 -142 104 82 -159
2883 -159 -136 46 -186 26 329 83 72 251 186 -14 21 1 50 -209 54 91 157 205 83 -132 -7 153 80
2906 80 30 44 -156 16 172 -14 -13 139 307 121 121 -87 179 -40 196 56 -99 33 -117 -105 -55 -165 -154
2929 -154 18 79 -32 -15 23 -110 46 -171 25 -60 165 54 -38 109 52 20 59 264 27 -180 -169 42 15
2952 15 -4 235 -281 94 -214 20 68 6 268 154 283 144 119 54 95 -52 -19 -196 -10 -99 -133 -32 -32 -27 64
2977 64 26 68 -27 -71 -62 -45 217 105 -3 -168 -37 -172 125 4 -51 74 98 78 47 263 142 -117 -15 100
3001 100 37 51 132 -267 30 91 5 -141 378 -61 -102 115 -201 -243 -118 -12 -24 -90 -91 67 61 -132 -78 -3 286
$$ packed form
2837A51l11K00J7r0PJ59j50J78r1j26NJ57J30m72K22p5J27q9R3p6K65k51K70l18
2861f8L2j91K50J13o7K47k8l14J3K5J92k65j20L79k40J74k04J80k50K46k2k41
2883a59K3J82k32K12L03k46j1J79o5k00L5k0M9k59K63L7O6M8j22k15J25J60p3
2906H0n0J4k00J72J56j86JJ52J68j86%k08K66k19K36j40j55J32j50J2N0j10J1
2929a54J72O1j11J7L8j33J56k17J96q5K25j11r2J47n7l2L9K05k37k07J1K11k7
2952A5j9K39n16L75l08K34M8o2K62j14J29j39k5o5M1j47L3j77J86q9l4J01%NR1
2977F4l8M2r5m4RJ7K62j12j08j65J31j35K97j21n5J25K4k0l1K16j21k59J02J15
3001A00o3J4Q1l99K97O1q6j46N19m39m1K17l16m2J25J06j2o6jJ58oj93N4P5K89
$$ plain form
3026 286 10 -364 150 318 175 -34 -47 -7 14 -256 73 -84 -240 22 140 124 -295 -41 -41 25 159 97 159
3049 159 73 136 48 -149 -159 47 106 118 -9 61 -111 -138 -57 -106 -293 407 -142 -65 36 -2 -189 -213 -45 92
3073 92 37 -13 -98 -16 -225 -73 201 -169 22 28 -1 -37 186 93 -111 -148 152 9 368 194 98 58 -20 276 -82
3098 -82 -139 -42 -261 193 -45 95 63 -141 -294 -117 -42 -32 -18 -257 -114 -3 32 259 78 37 341 41 83
3121 83 93 -230 8 -166 -82 12 63 95 -106 -64 -30 98 90 51 -182 50 87 -35 216 146 143 119 -222 110 -26
3146 -26 226 -63 -111 57 105 219 -87 -99 -263 -63 -98 15 -168 -146 220 -69 96 124 -72 -38 190 -258 -13
3169 -13 -231 28 212 -67 -102 -5 -118 10 -88 28 -280 0 136 297 132 17 -179 170 131 25 -140 -120
3191 -120 17 39 170 -33 -147 -162 143 -25 65 -38 39 -156 -215 -6 23 31 508 -43 115 -209 -42 100 -127
$$ packed form
3026B86k76l74N14J68j43k09j3M0K1k70L29j57j56K62J18j6m19K54%O6J34o2O2
3049A59q6O3q8j97j0K06N9J2j27P0j72k7Q1m9j87P00n49P7J01l8j87k4J68J37
3073I2n5n0q5Q2k09J52K74l70J91Ok9l6K23r3k04l7L00j43L59j74r6m0p8K96l58
3098h2n7R7k19M54k38J40l2k04j53J77P5J0J4k39J43J11L5K27j81m1L04l00M2
3121H3J0l23K38j74Q4R4N1L2k01M2L4J28ql9k33K32L7j22K51p0lk4l41L32j36
3146b6K52k89m8J68M8J14l06j2j64K00l5J13j83K2L66k89J65K8j96L4K28m48K45
3169a3k18K59J84k79l5R7j13J28r8J16l08K80J36J61j65j15j96L49l9j06j65K0
3191a20J37K2J31k03j14j5L05j68R0j03P7j95n9K09K9QM77n51J58l24J67J42k27
$$ plain form
3214 -127 233 -137 156 42 6 -83 382 155 -150 -160 204 207 172 98 -17 146 81 -169 6 -145 217 71 -226
3237 -226 -106 -115 -209 -87 -16 35 -149 -23 59 -69 -83 228 29 104 70 75 53 -15 80 -65 24 22 78 -95 17 -37
3263 -37 -155 -24 -7 -43 75 38 69 -203 60 115 34 114 -62 43 -226 -113 -90 124 159 -192 -55 -229 133
3286 133 -295 -179 -17 92 -34 -8 26 -34 -2 116 85 82 150 -52 45 -127 -165 -91 24 47 -244 46 -90 43
3310 43 -76 61 -47 72 273 -47 219 86 -51 61 255 87 -163 -162 238 139 -25 87 69 2 -23 8 -83
3333 -83 -116 -230 -270 -215 44 189 42 364 82 172 6 -104 15 127 107 -83 -52 -10 128 181 -117 -190 -179 -202
3357 -202 258 -142 -195 288 75 -169 66 54 188 72 -321 13 254 270 -73 19 147 -74 -66 -80 -107 -222 -242
3380 -242 39 -112 -201 221 95 -64 -130 212 135 -26 -62 352 17 -71 -19 -12 86 -126 248 -132 106 193 341
$$ packed form
3214a27L60l70K93j14l6q9M65k27l05j0L64Ll5p4j15J63o5k50J75j51L62j46k97
3237b26J20rr4J22P1N1j84J26Q2j28j4L11j99P5l4Nk2o8R5j45Q9kN6j73J12n4
3263c7j18J31J7l6J18l7L1k72K63N5q1Q0j76J05k69J13K3K14L5l51J37j74L62
3286A33m28J16J62J09j26K6L4o0L2J18l1lO8k02R7j72l8P4J15K3k91K90j36J33
3310D3j19J37j08J19K01l20K66j33j37J12J94j68k50JM00r9j64J12j8o7k5L1r1
3333h3l3j14m0N5K59J45j47L22k82R0j66j10J19J12k0j90L1M2J38N3k98p3J1k3
3357b02M60m00n3M83k13k44K35j2J34j16l93L34K41J6l43R2J28k21Qj4k7j15k0
3380b42K81j51q9M22j26j59o6L42p7j61l6M14l35q8N2PR8k12L74l80K38Q7J48
$$ plain form
3403 341 362 163 209 -293 -107 -146 34 -178 47 173 -60 168 -43 -125 -19 -345 124 257 -185 22 108 -43
3425 -43 -221 -116 181 -97 -12 92 6 22 61 457 -259 77 296 11 265 -238 25 129 -8 -250 -212 28
3447 28 22 -28 -14 36 -49 141 -6 56 132 20 99 -144 -19 -78 -57 87 -183 88 23 -26 -402 -51 67 -68 -75
3472 -75 -112 24 25 57 83 129 198 101 -138 -137 138 100 203 -280 -3 -156 -303 114 -366 -387 -92 110 8 76 -98
3497 -98 -228 290 -9 -150 312 5 85 -71 14 67 137 57 186 76 147 -69 -86 273 91 64 -133 -24 -91
3520 -91 -80 95 -58 -194 47 -201 -6 31 -68 15 -12 -137 -53 -140 174 -108 268 -86 36 7 110 67 252
3543 252 9 -72 361 -128 189 -25 69 79 126 -192 -262 -208 128 196 12 -3 259 -164 -133 69 25 310 -224
3566 -224 169 -69 124 -36 -29 -59 -126 275 25 199 121 24 -36 193 -281 -126 -113 111 94 15 -177 51 109 116
$$ packed form
3403C41K1j99M6n02J86l9J80k12K25J26k33K28k11q2J06l26M69J33m42K07Q6j51
3425d3j78J05K97k78Q5J04q6J6L9L96p16L36K19k85K54n03K63J04j37k42L8K40
3447B8on0J4N0q5J90j47O2P6j12P9k43J25n9K1J44k70K71o5m9l76L51J18j35p
3472g5l7J36JL2K6M6O9r7k39JK75l8J03m83K77j53j47M17m80k1K95K02j02O8j74
3497i8j30N18k99j41M62l07Q0j56Q5N3P0q0J29j10P1k16j7L59j82k7j97J09o7
3520i1J1J75j53j36K41k48J95L7r9Q3k7j25Q4q7L14k82L76l54J22k9J03m3J85
3543B52k43q1M33m89L17k14R4J0M7l18p0N4L36O8j84j5K62m23L1K02m4K85n34
3566b24L93k38J93j60Pl0o7M01k50J74p8r7o0K29m74J55J3K24j7p9j92K28N8P
$$ plain form
3590 116 78 -115 69 289 -54 -132 -206 151 -130 5 76 -261 158 -111 134 -4 145 -82 348 125 -129
3611 -129 -72 139 25 58 170 -113 155 -3 46 -245 -166 -51 -116 34 84 -107 5 123 139 266 21 102 177
3634 177 50 -180 238 139 128 -64 -153 -134 44 -78 98 0 -16 -64 -6 41 -28 -22 -351 176 153 -414 95 7 296
3659 296 -92 152 21 19 120 -178 -52 33 -1 127 166 150 67 173 -53 -147 149 200 -145 -127 -5 91 104 119
3683 119 -44 135 202 -84 -251 7 85 42 23 216 71 6 -187 93 -50 14 79 213 184 127 34 -49 67 4
3707 4 82 148 -54 24 156 -240 -343 153 161 124 5 -182 -220 202 17 27 118 -116 -86 156 -98 -164 179 130 -106
3732 -106 15 -123 18 70 74 -98 10 -30 44 -59 -169 37 34 -10 312 -33 167 5 51 -12 321 -73 -47 -8
3756 -8 -59 -351 69 118 37 257 140 47 -58 -102 -61 3 284 -92 -232 262 -103 52 18 63 -33 -111 -85 181 -119
$$ packed form
3590A16l8j93J84K20l43p8p4L57k81J35P1l37M19k69K45j38J49k27M30k23k54
3611a29N7K11j14L3J12k83K68j58M9k91P9J15o5J50N0j91J12J18J6J27k45Q1P5
3634A77j27k30M18r9j1j92q9J9J78j22J76r8j6m8N8M7o9Ol29N27k3n67N09q8K89
3659B96l88K44j31kJ01k98J26Q5l4J28L9j6q3J06k26r4K96N1l45J8J22R6J3J5
3683A19j63J79O7k86j67K58P8m3j9J93j45o5j93K80j43O4O5J34k9n7r3q3J16o3
3707DP8O6k02P8J32l96j03M96Ql7j19j87l8M22j85J0R1k34L0K42k54o6L43m9k36
3732a06J21j38J41N2Mj72J08m0P4j03j10K06lm4L22l45K00j62M6o3L33l94K6L9
3756hn1k92M20M9q1K20j17r3j05m4M1O4K81l76j40M94l65J55l4M5r6p8K6K66l00
$$ plain form
3781 -119 231 45 86 9 90 166 157 -154 316 84 -56 -184 -108 87 -147 30 -141 181 -3 179 -344 231
3803 231 -20 -54 7 -221 -105 -165 11 14 74 85 -46 -106 -76 187 336 -53 -217 -219 -159 -181 20 -54 -216 54 -163
3828 -163 64 101 -48 -183 7 -13 -61 34 18 -31 -139 -39 -82 0 -28 213 271 -38 32 -38 -55 -158 -117 158 -131
3853 -131 -111 -245 149 -38 -256 -99 129 94 197 -28 -78 -82 -24 69 80 84 58 37 74 110 -1 -37 -216 48 68
$$ packed form
3781a19L50j86M1p7Q1P6rl11M70k32j40j28P6J95k34J77j71L22j84J82n23N75
3803B31k51l4O1k28J16o0J76LO0J1j31o0L0K63J49l89j64kO0k2K01p4j62K70k17
3828a63K27L7j49j35J90k0m8R5j6m9j08J00m3Q2k8K41N8l09P0p0j7j03M1K75k89
3853a31K0j34L94j87k18J57K28l5J03k25n0mN8R3J1Mk6k1L7L6j11l6j79K64K0
$$ [...]
8191a64
##END NTUPLES=NMR FID
##END=
