##TITLE=1H_DE-82K5_TFA
 200.13MHz,CDCl3,
 8 sc
 
 4.8.2025
##JCAMPDX= 6.0         $$ Bruker NMR JCAMP-DX V2.0
##DATA TYPE= NMR FID
##DATA CLASS= NTUPLES
##ORIGIN= UXNMR, Bruker Analytische Messtechnik GmbH
##OWNER= pz
$$ XWIN-NMR		Version 3.5
$$ Mon Aug  4 15:51:09 2025 Russian Standard Time (UT+4h)  she@DPX200
##.OBSERVE FREQUENCY= 200.1313
##.OBSERVE NUCLEUS= ^1H
##.DELAY= (6, 6)
##.ACQUISITION MODE= SIMULTANEOUS
##.ACQUISITION SCHEME= undefined
##.AVERAGES= 8
##.DIGITISER RES= 18
##SPECTROMETER/DATA SYSTEM= spect
##.PULSE SEQUENCE= zg30
##.SOLVENT NAME= CDCl3
##.SHIFT REFERENCE= (INTERNAL, CDCl3, 0, 14.3821)
##AUDIT TRAIL= $$ (NUMBER, WHEN, WHO, WHERE, WHAT)
$$ ##TITLE= Audit trail, XWIN-NMR		Version 3.5
$$ ##JCAMPDX= 5.01
$$ ##ORIGIN= Bruker BioSpin GmbH
$$ ##OWNER= she
$$ F:/spectra/data/she/nmr/H-C/1/audita.txt
$$ ##AUDIT TRAIL=  $$ (NUMBER, WHEN, WHO, WHERE, WHAT)
(   1,<2025-08-04 15:49:41.98 +0400>,<she>,<DPX200>,
      <created by zg, POWCHK disabled, PULCHK disabled
       configuration hash MD5:
       00 E9 B6 7A A2 85 ED C7 34 08 36 98 17 FE 4E 26
       data hash MD5: 16K
       5E 2B 56 18 33 68 E3 F4 E9 6D 7D 1B 46 FF 5F 56>)
$$ ##END=
$$ 
$$ hash MD5
$$ 7B C3 41 E2 1C C8 29 FA C1 68 D9 5D DF 94 B3 BC
##$RELAX= 
##$RELAX= 
##$RELAX= 
##$RELAX= 
##$RELAX= 
##$RELAX= 
$$ Bruker specific parameters
$$ --------------------------
##$DU= <F:/spectra>
##$EXPNO= 1
##$NAME= <H-C>
##$PROCNO= 1
##$TYPE= <nmr>
##$USER= <she>
##$AMP= (0..31)
100 100 100 100 100 100 100 100 100 100 100 100 100 100 100 100 100 100 
100 100 100 100 100 100 100 100 100 100 100 100 100 100 
##$AQSEQ= 0
##$AQ_mod= 1
##$AUNM= <au_zg>
##$AUTOPOS= <>
##$BF1= 200.13
##$BF2= 200.13
##$BF3= 200.13
##$BF4= 200.13
##$BF5= 200.13
##$BF6= 200.13
##$BF7= 200.13
##$BF8= 200.13
##$BYTORDA= 1
##$CFDGTYP= 0
##$CFRGTYP= 5
##$CHEMSTR= <none>
##$CNST= (0..31)
1 1 145 1 1 1 1 1 1 1 1 1 1 1 1 1 1 1 1 1 1 1 1 1 1 1 1 1 1 1 1 1 
##$CPDPRG= <>
##$CPDPRG1= <>
##$CPDPRG2= <>
##$CPDPRG3= <>
##$CPDPRG4= <mlev>
##$CPDPRG5= <mlev>
##$CPDPRG6= <mlev>
##$CPDPRG7= <mlev>
##$CPDPRG8= <mlev>
##$CPDPRGB= <>
##$CPDPRGT= <>
##$D= (0..31)
0 0.7 0 0 0 0 0 0 0 0 0 0.03 0 0 0 0 0 0 0 0 0 0 0 0 0 0 0 0 0 0 0 0 
##$DATE= 1754308181
##$DBL= (0..7)
120 120 120 120 120 120 120 120 
##$DBP= (0..7)
150 150 150 150 150 150 150 150 
##$DBP07= 0
##$DBPNAM0= <>
##$DBPNAM1= <>
##$DBPNAM2= <>
##$DBPNAM3= <>
##$DBPNAM4= <>
##$DBPNAM5= <>
##$DBPNAM6= <>
##$DBPNAM7= <>
##$DBPOAL= (0..7)
0.5 0.5 0.5 0.5 0.5 0.5 0.5 0.5 
##$DBPOFFS= (0..7)
0 0 0 0 0 0 0 0 
##$DE= 6
##$DECBNUC= <off>
##$DECIM= 32
##$DECNUC= <off>
##$DECSTAT= 4
##$DIGMOD= 1
##$DIGTYP= 9
##$DL= (0..7)
0 120 120 120 120 120 120 120 
##$DP= (0..7)
150 150 150 150 150 150 150 150 
##$DP07= 0
##$DPNAME0= <>
##$DPNAME1= <>
##$DPNAME2= <>
##$DPNAME3= <>
##$DPNAME4= <>
##$DPNAME5= <>
##$DPNAME6= <>
##$DPNAME7= <>
##$DPOAL= (0..7)
0.5 0.5 0.5 0.5 0.5 0.5 0.5 0.5 
##$DPOFFS= (0..7)
0 0 0 0 0 0 0 0 
##$DQDMODE= 0
##$DR= 18
##$DS= 0
##$DSLIST= <SSSSSSSSSSSSSSS>
$$ [...]
##$SUBNAM0= <"">
##$SUBNAM1= <"">
##$SUBNAM2= <"">
##$SUBNAM3= <"">
##$SUBNAM4= <"">
##$SUBNAM5= <"">
##$SUBNAM6= <"">
##$SUBNAM7= <"">
##$SUBNAM8= <"">
##$SUBNAM9= <"">
##$SW= 18.0517328524113
##$SWIBOX= (0..15)
0 0 2 0 0 0 0 0 0 0 0 0 0 0 0 0 
##$SW_h= 3612.71676300578
##$TD= 16384
##$TD0= 1
##$TE= 0
##$TE2= 300
##$TE3= 300
##$TEG= 300
##$TL= (0..7)
0 120 120 120 120 120 120 120 
##$TP= (0..7)
150 150 150 150 150 150 150 150 
##$TP07= 0
##$TPNAME0= <>
##$TPNAME1= <>
##$TPNAME2= <>
##$TPNAME3= <>
##$TPNAME4= <>
##$TPNAME5= <>
##$TPNAME6= <>
##$TPNAME7= <>
##$TPOAL= (0..7)
0.5 0.5 0.5 0.5 0.5 0.5 0.5 0.5 
##$TPOFFS= (0..7)
0 0 0 0 0 0 0 0 
##$TUNHIN= 0
##$TUNHOUT= 0
##$TUNXOUT= 0
##$USERA1= <user>
##$USERA2= <user>
##$USERA3= <user>
##$USERA4= <user>
##$USERA5= <user>
##$V9= 5
##$VALIST= <valist>
##$VCLIST= <CCCCCCCCCCCCCCC>
##$VD= 0
##$VDLIST= <DDDDDDDDDDDDDDD>
##$VPLIST= <PPPPPPPPPPPPPPP>
##$VTLIST= <TTTTTTTTTTTTTTT>
##$WBST= 1024
##$WBSW= 4
##$XGAIN= (0..3)
0 0 0 0 
##$XL= 0
##$YL= 0
##$YMAX_a= 116353
##$YMIN_a= -142730
##$ZGOPTNS= <>
##$ZL1= 120
##$ZL2= 120
##$ZL3= 120
##$ZL4= 120
##$ABSF1= 10
##$ABSF2= 0
##$ABSG= 5
##$ABSL= 3
##$ALPHA= 0
##$AQORDER= 0
##$ASSFAC= 0
##$ASSFACI= 0
##$ASSFACX= 0
##$ASSWID= 0
##$AUNMP= <proc_1d>
##$AZFE= 0.1
##$AZFW= 0.1
##$BCFW= 1
##$BC_mod= 2
##$BYTORDP= 1
##$COROFFS= 0
##$CY= -3
##$DATMOD= 1
##$DC= 2
##$DFILT= <>
##$DTYPP= 0
##$F1P= 0
##$F2P= 0
##$FCOR= 0.5
##$FTSIZE= 0
##$FT_mod= 4
##$GAMMA= 1
##$GB= 0.15
##$INTBC= 1
##$INTSCL= 1
##$ISEN= 128
##$LB= 0.25
##$LEV0= 0
##$LPBIN= 0
##$MAXI= 10000
##$MC2= 0
##$MEAN= 0
##$ME_mod= 0
##$MI= 1.114404
##$NCOEF= 0
##$NC_proc= 0
##$NLEV= 6
##$NOISF1= 3.799351
##$NOISF2= 2.8
##$NSP= 1
##$NTH_PI= 0
##$NZP= 0
##$OFFSET= 14.38212
##$PC= 1
##$PHC0= -1199.485
##$PHC1= 11.9923
##$PH_mod= 1
##$PKNL= yes
##$PPARMOD= 0
##$PSCAL= 0
##$PSIGN= 0
##$REVERSE= no
##$SF= 200.129724274929
##$SI= 16384
##$SIGF1= 3
##$SIGF2= 2
##$SINO= 400
##$SIOLD= 16384
##$SREGLST= <1H.CDCl3>
##$SSB= 0
##$STSI= 0
##$STSR= 0
##$SW_p= 3205.1282051282
##$SYMM= 0
##$S_DEV= 0
##$TDeff= 0
##$TDoff= 0
##$TI= <>
##$TILT= no
##$TM1= 0
##$TM2= 0
##$TOPLEV= 0
##$USERP1= <user>
##$USERP2= <user>
##$USERP3= <user>
##$USERP4= <user>
##$USERP5= <user>
##$WDW= 1
##$XDIM= 8192
##$YMAX_p= 0
##$YMIN_p= 0
$$ End of Bruker specific parameters
$$ ---------------------------------
##NTUPLES= NMR FID
##VAR_NAME=  TIME,          FID/REAL,        FID/IMAG
##SYMBOL=    X,             R,               I
##VAR_TYPE=  INDEPENDENT,   DEPENDENT,       DEPENDENT
##VAR_FORM=  AFFN,          ASDF,            ASDF
##VAR_DIM=   8192,          8192,            8192
##UNITS=     SECONDS,       ARBITRARY UNITS, ARBITRARY UNITS
##FACTOR=    0.0002768,     1,               1
##FIRST=     0,             0,               0
##LAST=      2.2672688,     0,               0
##MIN=       0,             -142730,         0
##MAX=       2.2672688,     116353,          0
$$ Real data points
##PAGE= N=1
##DATA TABLE= (X++(R..R)), XYDATA
0@%%%%%%%%%%%%%%%nJ3j6J6j6J6k4L2l2L9m7N3o1P1p9Q8j04J20j36J52j70J91
$$ 0 0 0 0 0 0 0 0 0 0 0 0 0 0 0 0 -5 8 -8 8 -8 8 -16 16 -16 23 -24 29 -32 39 -40 48 -56 64 -72 80 -90 101
37A01k15K39k65K96l29L66m06M50m97N48o05O66p35Q09q90R82j084J198j324J470
$$ 101 -114 125 -140 156 -173 193 -213 237 -260 288 -317 349 -386 423 -467 515 -569 629 -695 775
57G75j640J834k063K338k673L097l649M398n485P205j0327J7742o8274k9791J83825
$$ 775 -865 969 -1094 1244 -1429 1668 -1981 2417 -3068 4137 -6190 11552 -56722 -86513 97312
72I7312n832j22277P076P8915K3096L8063k1526j16167m0177Q5218J7051n2103
$$ 97312 91480 -30797 -23721 55194 78290 116353 94827 -21340 -61517 23701 40752 -11351
84a1351k2134n2249n4243Q8668R0242m5557l7931L4011J7909K8244L8930j0063
$$ -11351 -33485 -85734 -139977 -51309 38933 -6624 -44555 -10544 7365 35609 74539 64476
96F4476k6022j550j8035j1574L9942J0204p6545m5391L7060K3962L843P678m3106
$$ 64476 38454 36904 18869 7295 47237 57441 -19104 -64495 -27435 -3473 370 8048 -35058
109c5058m0912L7368M6323J2411P174k5091l8165L1592P0575O035m8807k1255
$$ -35058 -75970 -38602 7721 20132 27306 2215 -35950 -4358 66217 72252 23445 2190
121B190J441q240J6031J9054l6495m3091M5J9131K7715J9790j2596k1615P03K4847
$$ 2190 3631 -4609 11422 30476 -6019 -49110 -49065 -29934 -2219 17571 4975 -16640 -15937 8910
135H910K6372L695j1582k0223k6778K353L1212P979k6327l0377p080K1000K5720
$$ 8910 35282 38977 27395 7172 -19606 -17253 13959 21938 -4389 -34766 -41846 -20846 4874
148D874Q632j6235k5556M449K8175J6147O468q105k5186J015K6311O082q917p761
$$ 4874 13506 -2729 -28285 -23836 4339 20486 26954 18849 -6337 -5322 20989 27071 18154 10393
162A0393j5036j3267L316J0422k181r856n987o901P223L0575Q812j6883O0O700
$$ 10393 -4643 -17910 -14594 -4172 -6353 -16209 -22196 -29097 -21874 8701 17513 630 690 7390
176G390K853J7037N179k4509j5904O466N324j745m28q683j5982N840J7861m663
$$ 7390 10243 27280 32459 7950 -7954 -1488 3836 2091 1663 -7020 -23002 -17162 699 -3964
190c964n355R228n301m218J7748N735q128L431J085o075M971Q828p583j4651m68
$$ -3964 -9319 -91 -5392 -9610 8138 13873 5745 9176 10261 4186 9157 17985 10402 -4249 -4717
205d717M56n156O315K484j5829m13J5473K489J770N953o727m012J0640N130p663
$$ -4717 -4261 -9417 -3102 -618 -16447 -16860 -1387 1102 2872 8825 2098 -1914 8726 13856 6193
220F193n627r4m415j267Q187j723j0161M332L457m586P038M868p944k122M859
$$ 6193 566 472 -3943 -5210 2977 1254 -8907 -4575 -1118 -5704 1334 6202 -1742 -3864 995
235I95M42J849M282k119p648M87P050r38m353q94p149l677Q865J239n156J063
$$ 995 1437 3286 7568 5449 -2199 -1712 5338 4400 47 -847 -7996 -11673 -2808 -1569 -6725 -5662
251e662J548J547P204M702q89k531J10Q70k666m27n92p909l663K196j143J934
$$ -5662 -4114 -2567 4637 9339 8450 5919 6029 6899 4233 3806 3214 -4695 -8358 -6162 -7305 -5371
267e371K914l403o74M391L485K181j80j401p18J270L620J255l695p02j10k206
$$ -5371 -2457 -5860 -6534 -2143 1342 3523 3343 1942 1224 2494 6114 7369 3674 2972 2862 656
283F56J837j45n052k605j609r93J144J147P17M46J483M747L594J097K048j101
$$ 656 2493 2348 -2704 -5309 -6918 -7911 -6767 -5620 -4903 -4457 -2974 1773 5367 6464 8512 7411
299G411k503J274l68l623k435l220k195P56K79O46L50p02K020J865P51K221r81
$$ 7411 4908 6182 5814 2191 -244 -3464 -5659 -4903 -4624 -3978 -3628 -4330 -2310 -445 306 2527 1546
316A546j390J591N81L90J338j674k79k35m47O15k100k399q50j677l83J996l79
$$ 1546 156 1747 2328 2718 4056 2382 2103 1868 1421 2036 -64 -2463 -3313 -4990 -5373 -3377 -3756
333c756Q1J612J309K732K465K15O21p44r07J98j810k436j265k149j43J138n02
$$ -3756 -3675 -2063 -754 1978 4443 4658 5279 4535 3628 3826 2016 -420 -1685 -3834 -3977 -2839 -3341
350c341Q70M10L0J918P52L41O37n20n96P18J52L41J09j151l7K64n48M57j175j858
$$ -3341 -2471 -2061 -2031 -113 639 980 1617 1097 501 1219 1371 1712 1821 670 633 897 349 806 -369 -2227
370b227L66m53r8J262p39M06J681M95J510J015q22R6l05j589j39j359q86l15j028
$$ -2227 -1861 -2314 -2412 -1150 -1889 -1483 198 693 2203 3218 2396 2492 2187 598 459 -900 -1786 -2101 -3129
389c129O36J097k45J294O24l07J983N18q22N27p19j078P18J1p76r59l23L03p81
$$ -3129 -2493 -1396 -1641 -347 277 -30 1953 2471 1649 2176 1457 379 1097 1108 332 -627 -950 -647 -1428
408a428k16N84j401K13J544q33J36K472KK7J482L99l66K85k59j526j370j77r0
$$ -1428 -1644 -1060 -2461 -2248 -704 -1537 -1401 1071 1073 1100 2582 2981 2615 2900 2641 1115 -255 -432 -522
427e22j915k92Nq34J019K222j199P42J618J81N79Q16l27l99O54L1o67j264L12
$$ -522 -2437 -2729 -2724 -3558 -2539 -317 -1516 -774 844 1025 1604 2420 2093 1694 2348 2379 1712 448 760
446G60n48j719N35q08j473J381j06j547J168J460L20J324Q72Q4P25J240K69k096
$$ 760 212 -1507 -972 -1780 -3253 -1872 -1978 -3525 -2357 -897 -577 747 1619 1703 2428 3668 3937 1841
464A841q79O03j526q68J64j546n24J615o96m54J446N11m35J001M68l83M30J018
$$ 1841 962 1565 39 -829 -665 -2211 -2735 -1120 -1816 -2270 -824 -313 -748 253 721 338 768 1786
482A786P7j671R16O60j654O49j45k094R9Q36j305n43P07P0N02R12R06j3N80J226
$$ 1786 1863 192 1108 1768 114 763 618 -1476 -1377 -541 -1846 -2389 -1682 -1612 -1110 -198 708 695 1275 2501
502B501k76p91N37o13j540P08j439j807J008N67r27P24N35l9J352K00J10q09J255
$$ 2501 2225 1434 1971 1358 -182 526 -913 -2720 -1712 -1145 -2072 -1348 -813 -852 500 700 810 1 1256
521A256M94r63N72n3j256P20R00k388K36P02j212l83K35j358J57J448K59n94O69
$$ 1256 1750 787 1359 1306 50 770 1670 -718 -482 220 -992 -1375 -1140 -2498 -2341 -893 -634 -1228 -559
540e59J641M05k02J527p16j408J601p80j891M56q27q57L39l40m90Q68O47L73m37
$$ -559 1082 1487 1285 2812 2096 688 2289 1509 -382 74 -753 -1610 -1271 -1611 -2101 -1233 -586 -213 -650
559f50PQ93K81M79m47n43Q67L88q63O67k5j210O62P12j865n86Q40n06p47N85K7
$$ -650 -643 250 531 1010 563 20 887 1275 412 1079 1054 -156 506 1218 -647 -1233 -393 -899 -1646 -1061 -1034
580a034k92J007J028r05N0J694l16p39P28p45p83J108n56j036K50L34k99M08K15
$$ -1034 -1326 -319 709 -196 -146 1548 1232 493 1221 476 -307 801 245 -791 -541 -207 -506 -98 117
599A17l68l1P19l61m61N17k81k85L00N06j015P03J383j395j01J175j145j66Q55
$$ 117 -251 -282 437 76 -385 132 -149 -434 -134 372 -643 60 1443 48 -53 1122 -23 -189 666
618F66m49j181O15R72q07k01Q87o51m05R27M8j373J282J84j114J83K37m16M61
$$ 666 217 -964 -349 623 -184 -385 502 -149 -554 373 421 -952 330 514 -600 -417 -180 -596 -135
637a35Q06p36O7N95L36n52k26J89q33K32N45q14n12J089n18P8M65m32K79o7L57
$$ -135 671 -65 2 597 933 381 155 344 -489 -257 288 -526 -1038 51 -467 -389 76 -356 -77 -144 213
658B13n27J60M38o5q9L26K26o27M97M24r72j07J72m25p1J26j81P0M3K84q8L0O08
$$ 213 -314 -154 284 219 130 456 682 55 552 976 4 -103 69 -356 -427 -301 -482 -412 -369 -85 -173 -143 465
681D65l11J4K13q2k58J91k0l41p8J49j44P7m4j46K3J54K37k94r2N69k98K27K66
$$ 465 154 168 381 299 41 232 212 -129 -207 -58 -202 -125 -169 -315 -292 -138 99 -195 -287 282 -16 211 477
704D77rj27L02k25k05q7k10q2j32k2l82K23J56k08L17J44qN36l39K23j9j06NN2
$$ 477 468 341 643 418 213 126 -84 -166 -298 -320 -702 -479 -323 -531 -214 -70 -78 458 119 342 323 217 222 274
728B74k68j23K5J63l7j30J6n0J07j64J52p9k4k95K82L00j23L16K0K30n1l73j01
$$ 274 6 -117 -92 71 34 -96 -80 -130 -23 -187 -35 -114 -138 -433 -151 149 26 342 362 592 541 168 67
751F7m3j29M2j46l96L0J61q6M71m7L12l2j87L76j0j93J96k7n72L02K27k39j22
$$ 67 24 -105 -63 -209 -605 -575 -414 -500 -29 -76 236 204 17 393 383 190 386 359 -213 89 316 77 -45
774d5N6j0j31Q8l3k41L6K08j35QJ49k60L89L97j89j31M07l83j85L16m13j07%j14
$$ -45 11 1 -130 -42 -75 -316 -280 -72 -207 -199 -50 -310 79 476 287 156 563 180 -5 311 -102 -209 -209 -323
798c23K8P3J35P1o8M49j56l13O1P7q3j53J00J30k47L62j5n3m4n5J12l2R3j10J6
$$ -323 -295 -222 -87 -16 -84 365 209 -104 -43 34 -49 -202 -102 28 -219 143 128 75 31 -24 88 56 149 39 55
823E5O9l10J77K9J30j78L88k67n5J71q6p5k8l41N11k98J60nm8l6K83j70K30J16
$$ 55 124 -186 -9 20 150 -28 360 93 38 209 123 48 20 -321 190 -108 52 47 -1 -37 246 76 306 422
847D22n62J40J11Q6k98J06j27K41j94j92K12n2O1J71l21L31J04k84K73j99K7n8
$$ 422 -140 0 111 197 -101 5 -122 119 -75 -267 -55 -107 -46 125 -196 135 239 -45 228 29 56 -2
869bK28j02j06J72j49K62k67k87j00J50K22j35O2OJ9N8Qj91M31j96p6rR2m80M23
$$ -2 226 124 18 190 41 303 36 -251 -351 -201 21 -114 -52 -46 -27 31 39 -152 279 83 7 -2 90 -390 33
894C3k26J63o8N1q9j7J3K47l25J56K20RN9j50J09k86M71j01k85Q2Ll52K69j94
$$ 33 -193 -30 -98 -47 -136 -153 -140 107 -218 -62 158 167 226 76 185 -101 370 269 -16 66 69 -283 -14 -208
918b08j3j07K40j21Q1L24j22k9j51N40j48L7knp8k47j16O3o1k4R6m7l06K93om2
$$ -208 -221 -328 -88 -209 -128 196 74 45 -106 434 286 323 321 316 238 -9 -125 -62 -123 -147 -51 -98 -404 -111 -117 -159
944a59L2j98L03J44k35L11k43Q8J95k70l1M07j78k86Mk62L53j77j14L63k82M4
$$ -159 -127 -325 -22 122 -113 198 -45 43 238 -32 -63 344 166 -120 -116 -378 -25 -202 -316 47 -235 -191
966a91J24k14O9L77j58K23j57k96K20L58l24k72J45K51j11j58K78n02N5L3N2j26
$$ -191 -67 -281 -212 165 7 230 73 -223 -3 355 31 -241 -96 155 44 -114 164 -338 -283 -250 -198 -324
988c24K70j2q5J62K76n01M04j63Pr4R8l05K93j70M0MJ05n1r6N35l11j90L98N0
$$ -324 -54 -66 -151 11 287 -214 190 27 34 -60 38 -267 26 -144 -104 -100 5 -46 -142 393 82 -108 290 340
1012C40m81L03k32oJ51N1j85N4oL10k32k60J4K45l95L92n41N53j21R1k25J92L26
$$ 340 -141 162 -70 -76 75 126 -59 -5 -11 299 67 -193 -179 66 -329 63 -478 75 -46 45 -180 12 338
1035C38l53J15k38R1K3J50k01K96k88J00j55j67J90q4L53k58J93j91j35L13j2
$$ 338 -15 100 -138 -47 -24 126 -75 221 -67 33 -122 -289 -99 -183 170 -88 105 -86 -221 92 80
1056H0J51k17o4J62j99J26J17K6r6Q8l3kl80K99L84l17j53Q7k06LJ49j74K19j26
$$ 80 231 14 -50 112 -87 39 156 182 86 174 141 139 -241 58 442 125 -28 59 -147 -144 5 -169 50 -76
1080g6J01P7j4m6q2j42pJ51N2O1k99j09L13K5P2k70K78k40j32L57j05L3K6Q3j3
$$ -76 25 102 88 42 -40 -182 -189 -38 14 75 -224 -333 -20 5 77 -193 85 -155 -287 70 -35 -2 24 107 94
1105I4J6q8l3j8n7L43k35J01l61J65L00m22j05K96j84K84Rj17J9m2p8L05K8k29
$$ 94 110 22 -11 -29 -86 257 22 123 -238 -73 227 -195 -300 -4 -188 96 105 -12 7 -35 -113 192 220 -9
1129iK0r6L25k55K1l79L15%J91j53m04O91j89m29M63j83J39m7N0k48J91j74L02
$$ -9 11 -85 240 -15 6 -373 -58 -58 133 -20 -424 267 78 -351 112 -71 68 21 71 -177 14 -160 142
1152A42l1j08O7l7o8J53j72r4L23k08n0M7q0N7K48q4j33P3J42j05M4n9J15j20
$$ 142 111 3 70 33 -35 118 -54 -148 175 -33 -83 -36 -116 -59 189 105 -28 45 187 82 126 67 182 62
1176F2p1j18R7k23M71j15jn0k26J25J28r8L8J46l6k67K81l90J31J79n8L3k2Q9
$$ 62 -9 -127 -30 -253 218 103 102 52 -174 -49 79 -19 19 165 129 -138 143 -247 -116 63 5 38 16 105
1200A05K46o62M14k21Q9r4m6J03J12j81J65q9JN1r5r4K03K83l94J02L5j29q6J30
$$ 105 351 -311 103 -118 -29 -123 -169 -66 46 -135 30 -59 -58 -7 -102 -196 7 290 -104 -2 33 -96 -182 -52
1224e2J64n6k98J20J47L1j88M7k08K46J8nj69K80J57l56k01K91J38n9m8J38p5
$$ -52 112 56 -242 -122 25 56 -132 -85 -293 -47 -29 -34 -203 77 234 -122 -323 -32 106 47 -1 137 62
1247F2l04L85q9k53J73K45k84p1M06j23l2k78q9J14K77j47j06J23j0KO7k18K99
$$ 62 -242 143 54 -199 -26 219 -65 -136 270 147 115 -163 -252 -138 139 -8 -114 9 -1 1 68 -150 149
1270A49n0j87J60j36Nr4L11l09M13l07K02j5o6j81P0J70l52M31j87Kk45J78n4
$$ 149 99 -88 72 -64 -59 -153 158 -151 262 -45 157 142 76 -105 -35 135 -217 214 27 29 -216 -38 -92
1293i2Lj5L22m05K24l10J78L21k93K09J66k54P1k46L03j45j30J61P5r5j33K64
$$ -92 -89 -104 218 -187 37 -273 -95 226 -67 142 308 54 125 -121 182 37 -93 68 143 48 -85 179
1315A79l18J47j7o9LJ34k89O56o17K59o1j34L2J03J12k29n9O7O9K2L05j20j98
$$ 179 -139 8 -9 -78 -75 59 -230 426 -191 68 7 -127 -95 8 120 -109 -168 -101 -32 -10 295 175 -23
1338b3r1J89l0o0j09n7J20o0K05j49q8M03r1j76j79J02k3N1j47M09j27L0o6J00
$$ -23 -114 75 45 -15 -124 -181 -61 -121 84 -65 -153 250 159 -17 -196 -94 -117 -66 -213 196 69 99 33 133
1362A33j18k61J81m6l31K95L6J49nJ2j87Q9J36K4j24L05m69K16kJ62l70O8N9j72
$$ 133 15 -246 -65 -111 -442 -147 -111 38 33 45 -142 -53 83 107 -17 288 -181 35 33 195 -175 -107 -48 -220
1386b20R1J12j57n6K10k12M1J95k0%O5j08J0Q1o9J32p8k48K45M5p8j2L2K8l3j04
$$ -220 -129 -17 -174 -230 -20 -232 -191 4 -16 -16 49 -59 -49 32 -37 95 17 -231 14 59 -19 -31 1 29 -4 -108
1412a08J16Kk95K18K15k50K13m28K16J30R7q2Q9Q6q4k6j47r0J66j11n3J35q5P9
$$ -108 8 10 -285 -67 148 -102 111 -317 -101 29 126 44 133 219 135 109 -38 -128 38 -73 -126 9 -76 3
1436Cm1J16j39j68Q9O0M6j08O9J26q8l9P0j0K45l93J15N5J15j2J13k57k70K08
$$ 3 -38 78 -61 -229 -140 -80 -34 -142 -73 53 -35 -74 -4 -14 231 -162 -47 8 123 111 224 -33 -303 -95
1460i5R0o4j71J71j14K23j33j14M32k92L08j9o2r7j81l4m4L99l53p3K63k36O5
$$ -95 -5 -69 -240 -69 -183 40 -93 -207 225 -67 241 222 160 63 -118 -152 -196 203 -150 -223 40 -196 -131
1483a31L79l49J66L0l08P9J16Q3M5J45n0j82q5j02J33n4M8l4J82k24O1J25k00
$$ -131 248 -101 65 95 -213 -134 -18 65 110 255 205 23 -62 -164 -31 -85 -37 -71 111 -113 -52 73 -127
1506a27j9K16j62K23l11J3J9j6J36pJ98j57m12M07l67K86L32l93j05J69q2N1L38
$$ -127 -146 70 -92 131 -180 -167 -148 -164 -28 -35 163 6 -406 1 -366 -80 252 -141 -246 -77 -159 -108 230
1529B30m52K14J18k67QL13m5q9k07J64J13l42K78J08j21J20m3n1O9j45Q1P7Pj2
$$ 230 -222 -8 110 -157 -149 164 119 30 -177 -13 100 -242 36 144 23 143 100 49 118 -27 54 131 138 126
1553A26j12j6j6L18j92m43L52Kp0k1k6k44Q1K27l6J61k8K65l38j49k3R8J92m58
$$ 126 14 -2 -18 300 108 -335 17 19 -51 -72 -98 -342 -261 -34 -70 91 63 328 -10 -159 -182 -84 108 -350
1577c50L73j63J92p1M6k9J04l6J40q9l64J68K06l37J18R3nJ0j60L60l26J36K61
$$ -350 23 -140 52 -19 27 -2 102 66 206 117 -247 -79 127 -210 -92 1 -4 6 -154 206 -120 16 277
1600B77k96q0L57l59K15j28k6J34k07M62n56J57l3K55l26j3m8L96j97k02K71l1
$$ 277 -19 -99 258 -101 114 -14 -40 94 -113 349 -207 -50 -83 172 -154 -167 -215 181 -16 -218 53 22
1622B2r6o3K24J90l55J44qk1R1l04K87k88J43N4m2J49j64K41M7m17Q9L0j1k2L04
$$ 22 -74 -137 87 277 -78 66 58 37 128 -176 111 -177 -34 20 -22 127 -37 204 251 -166 -77 -47 -58 -80 224
1647B24m28M8O5kO5J44j80Q4J62l21K41k68K64j47J08P6j10Lj07J95n05L06r9
$$ 224 -204 -156 -91 -93 -28 116 -64 20 182 -139 102 -166 98 -49 59 135 25 28 -79 116 -389 -83 -182
1670a82L32j18j05m4M13m61K01p7K1MK01k91N6O5k74J85J27l15J46pJ69j8l9k1
$$ -182 150 32 -73 -117 296 -165 36 -41 -20 -16 185 -106 -50 15 -259 -74 53 -262 -116 -123 46 28 -11 -32
1694c2l2n9L21m6k69op3K67J74k01J5K22l20l6K00M6j74J87p8K0r3j9r6L18n2
$$ -32 -64 -123 198 152 -117 -123 -196 71 245 44 59 281 -39 -75 125 171 -3 184 106 126 33 14 -82 236 184
1719A84k13K27K0l15N3J10m9k44K28l6o2K43Q9q5j26K17j27Pj64J23l06K99m10
$$ 184 -29 198 218 -97 -44 66 17 -227 1 -35 -97 146 235 150 24 241 114 121 -43 80 -226 73 -337
1742c37J65L5j11j35J33K83r2J39j11KN0O9l6J60l24L43p3l0j76K55l44J48q7
$$ -337 -172 -137 -248 -383 -250 33 -59 80 -31 -29 21 90 54 214 -110 233 160 130 -46 209 -135 13 -74
1765g4J21Jk89K19k7Q9J45k86J7n1J81j64N8R7J56j42J51k34n2L70l16J21j28
$$ -74 47 48 -241 -22 -49 40 185 -101 -84 -135 46 -118 -60 37 193 51 202 -32 -84 286 -30 91 -37
1788c7p4J48K7m7J29m17L45J7k13O3J07J75N3m57j29J81J30J38k28J25j42R2j2
$$ -37 -111 37 64 17 146 -271 74 91 -122 -59 48 223 276 -181 -310 -129 1 139 -89 36 -106 -14 -26
1811b6J46Oo1k82J97L98o42j5J72L4J66Q9m58L75J84p1l43J75QL1K28o25O1L97
$$ -26 120 126 65 -217 -20 378 -264 -279 -107 -73 93 182 -276 99 283 212 -131 44 52 83 311 -314 -253 144
1835A44j57J10J18q5j41lJ58j66q0L77l24j25N37n96L79m5pk24K9J74o8J04K07
$$ 144 -13 97 215 130 -11 -14 144 -22 -102 275 -49 -174 363 -233 146 101 94 -130 -101 73 5 109 316
1858C16j55j9j95O7J32k14KM2k06M08l94K26p7r4Q3J00qm24M56l8K56k02K00o7
$$ 316 161 142 -53 14 146 -68 -66 -24 -230 178 -216 10 -67 -161 -78 22 14 -410 46 8 264 62 262 195
1882A95l65M2m5M15k98J82q7j52m0L56j0k41J13k03J10m9J12j23P9J6j75K73j92
$$ 195 -170 -128 -173 242 -56 126 39 -113 -153 203 193 -48 65 -138 -28 -77 35 -88 -9 7 -168 105 -87
1905h7K3K30j95R0n1o6o7K93l8P8r2k22P9j43RJ12J03O8l24K19J39q3j36J57K6
$$ -87 -64 166 -29 61 10 -56 -123 170 132 210 118 -104 -25 -168 -159 -47 56 124 -200 19 158 75 -61 96 122
1930A22j96L4K02j66k10K05j97K6J51J72jj14L9J43j95l7LN2m9J54r4O8K17l52
$$ 122 -74 -40 162 -4 -214 -9 -206 -180 -29 143 142 28 67 210 15 -22 -19 33 -16 138 44 112 329 -23
1954b3K57k70M4N7l66K47J62J2j34M08j32j74k28k1J54k17K32j90O36n02j09K16
$$ -23 234 -36 8 65 -301 -54 108 120 -14 394 262 88 -140 -161 -7 -224 8 -182 454 -48 -157 59
1976E9j12M4k9r6n8J61K98o85M43J25Q6k95L9m9K18q7j37K21j28k05l2M7L14P6
$$ 59 -53 -9 -38 -134 -192 -31 267 -418 25 150 236 -59 -20 -69 149 62 -75 146 18 -187 -219 -172 142 218
2000B18k43J26j03M5j05J81R7j94l39K57p1KL73k02k51L33l17K34q6Q1k22J81
$$ 218 -25 101 -2 43 -62 119 216 22 -317 -60 -131 -129 244 42 -209 124 -193 41 -45 36 -186 -5
2022ej30J64O9r5N2k44K11j59J68O4l13L95q0kj22L1Q0k36K63j15J29j99Q4j41
$$ -5 -135 29 98 3 55 -189 22 -137 31 95 -218 177 97 95 -27 4 84 -152 111 -4 125 -74 10 -131
2046a31K92J04m07K79k83J10j0R9j84K59p0j64J32n4J76N5l83J26k5K76k02k01
$$ -131 161 265 -142 137 -146 -36 -46 53 -131 128 58 -106 26 -28 148 203 -180 -54 -79 197 -5 -206
2068b06J79Q8K8m03L09k22L46J00m31j04J25J53J8j9J80k58L3K38j10l65M01J4
$$ -206 -27 61 89 -314 -5 -227 119 219 -212 -316 -191 -38 -20 -39 141 -117 -84 154 44 -321 80 94
2090I4k10l9J82Q1Mk01K1J23j48K05k50P6J49j89K60j37N4j46k5j46L49K4k86
$$ 94 -116 -155 27 108 112 -89 -68 55 -93 112 -138 -62 87 -102 158 21 75 -71 -96 -242 107 131 -155
2113a55J27q7m4j8J73p3L49k32j44M2J43j41j76L88J35l95l2N2M0k2j6L9K30j30
$$ -155 -28 -115 -159 -177 -4 -77 272 40 -104 -62 81 -60 -236 152 287 -108 -140 -88 -48 -70 -86 -47 183 53
2137E3j1r8m2L83k65j47J80m8k1J88k31Nj72K86J32j91oj44J35K09m81J52R4N
$$ 53 42 -56 -98 285 20 -127 53 5 -16 172 -59 -54 -226 60 192 1 -5 -149 -14 195 -286 -134 -40 -35
2161c5J35K94m18K4L05j99p4o4k92M41P0p7j67j43J98K8p9Q0p9K22j34O9j91J15
$$ -35 100 394 -24 0 305 106 32 -32 -324 117 187 110 -57 -200 -2 26 -53 27 -52 170 36 105 -86 29
2185B9JJ65l43K13j44N0K25j14k03k86K38j85K69K89l92L17r5j95L92m14K50J53
$$ 29 30 195 -148 65 -79 -29 196 82 -121 -407 -169 -354 -85 204 -188 129 34 -161 231 -183 67 220
2207B20k21J15l03K64q3j16lj7M7J8J13j1j26j03j99K81q2M03m28L17j06k92N98
$$ 220 -1 114 -189 75 -8 -124 -127 -144 -97 -79 34 23 -103 -206 -405 -124 -206 197 -231 86 -20 -312 286
2230B86l40J70mj67qk4L42k38J65L0k97J67j49k11K04j49L44oP6j04l44L10O2
$$ 286 -54 116 112 -55 -63 -87 255 17 182 212 -85 82 -67 -278 -74 -223 121 115 191 87 -257 53 115
2253A15q0j61R2l3J56k05Q2K9k0k1PJ34o0n7m3J76j33J67k12n5J65k04M60j31
$$ 115 35 -126 -34 -67 89 -116 -34 -5 -25 -46 -39 95 35 -22 -65 111 -22 145 -67 -122 43 -161 299 168
2277A68k69L5K4j47K22J31M5m03Q7K76n9k36J75m2p4L15k63j9r0J72l8q1k9o3
$$ 168 -101 -66 -42 -189 33 164 209 -194 -107 169 110 -126 49 7 -67 248 -15 -34 -124 48 10 -71 -100 -163
2301a63N82n70J76o6k47M08k58J84m7p8m6J10k76K05K01PJo6rk6pk71N40k37K10
$$ -163 419 -151 25 -41 -288 120 -138 46 -1 -79 -125 -15 -291 -86 115 122 123 57 48 22 15 -256 284 47 257
2326B57j42r8p4M8Q1q4J50r3O2r7J94J5m0J7j35k77L15q9%LJ70l3j00r2M4p7J88
$$ 257 115 17 -57 -9 72 -12 138 45 107 10 204 219 179 196 61 -216 99 10 10 13 183 150 50 -42 2 -75 113
2353A13k22J5J69k50K39j55K90l59j35L83Q6k68K65K5j47k60L90j5j29j16J95
$$ 113 -109 -94 75 -175 64 -91 199 -160 -295 88 174 -94 171 196 49 -211 179 164 35 -81 114
2374A14m36N4M39n8j66J06K16l22o4M2O4j85K67M4q6j66o5J43J29m8j6k96L86
$$ 114 -322 -268 171 113 -53 53 269 -53 -117 -75 -11 -196 71 115 29 -137 -202 -59 70 22 6 -290 96
2397I6p4jk90L07K6k06j1K15j87J18J39j55k2J64k52L25k20k8p2J50J03k7M3k8
$$ 96 22 21 -269 38 64 -142 -153 62 -125 -7 132 -23 -45 119 -133 192 -28 -56 -128 22 125 98 141 113
2421A13K3k45q4K90j83Q3j19M29l31j6k01O6K08%Q9m7j17j70M92k84J4O6m0j48
$$ 113 136 -109 -193 97 -86 -3 -122 307 -24 -40 -241 -175 33 33 122 75 -42 -212 280 -4 10 76 36 -112
2445a12K38j11J60j80R2k81N86l50j11n0j52L48j48N8K34l21O1K83j50p4J01q6
$$ -112 126 15 175 -5 87 -194 392 42 -69 -119 -271 77 -71 -13 221 -100 -39 244 94 20 121 35
2467C5j7j34M41k71j09K97j08j1j92K45k73J10m7O9m09L10j58L3K84O4L0m78N52
$$ 35 18 -116 325 54 -55 242 134 123 -69 176 -97 13 -34 35 -374 -64 -222 -189 95 159 189 -289 263
2490B63k89P4J17k53N6j08P2L2Q5k05J00l2J00J1k51L43L49m53R0m3K0j69J64
$$ 263 -26 48 165 -88 -32 -140 -68 -36 49 -156 -56 -88 12 23 -228 115 464 11 101 58 78 -91 73
2513G3j08J45J66k26j40j24K77l6J27l03L41k61J36k2L4o5J43k96K43l1J9Q3j26
$$ 73 -35 110 276 50 -90 -214 63 27 154 -149 192 -69 67 45 79 14 157 -139 104 73 92 175 49
2536D9J0Q0n2j32p7M26j47j20Q8k24o8L12k66J74j88J24K72m26M22l16N2L7J69
$$ 49 59 139 87 -45 -122 304 157 37 125 -99 -167 145 -121 53 -135 -11 261 -165 257 -59 -7 30 199
2559A99k06K02j4j86j36K60J03k19o3J82j0k54J02l1K29l51J35J90q0l4J29j83
$$ 199 -7 195 181 -5 -141 119 222 3 -60 122 112 -142 -40 -71 158 -193 -58 132 52 18 147 -36
2581c6p0o3L1K63j06J33j53oq4N4J93j08j97r0J96R9o7Q8j31L18j31O3l46p3J59
$$ -36 -106 -169 -138 125 19 152 -1 -7 -91 -37 156 48 -149 -239 -43 56 -11 77 -54 264 133 196 -150 -223 -64
2606f4M10o15M3J85L12l15q1J07j14m1K59o8j02J20j95K94k79K4M8J26j15O8N8
$$ -64 346 -269 -226 -41 271 -44 -125 -18 -132 -173 86 18 -84 36 -159 135 -144 -120 -72 54 -61 7 65
2629F5J4l08K53M30l96n0J13J08k23j54M21n3k24m1J0j76O27m81J56QO3j03j08
$$ 65 79 -229 24 454 58 8 121 229 6 -148 273 220 -4 -45 -35 -211 416 -65 91 99 162 59 -49
2652d9l7k95M34rj30K47p8k91L15j97N7l86L63K00j57j42K28k61J48J26j66J53
$$ -49 -86 -381 53 44 -86 161 83 -208 107 -90 -33 -419 -56 144 -13 -155 73 -188 -40 86 -80 73
2674G3j14J30K0L1O5j27m5K3r9K3l18L18j18L29l34M01k97r6K14J42k89j12K5
$$ 73 -41 89 109 140 205 78 33 56 -43 -20 -338 -20 -138 191 -143 258 -39 -135 79 221 -68 -180 -155
2697a55J36O1N6p1j48J38j05K45k57J65l41J33J93n4Pl2o6K79j05J17K46n16K23
$$ -155 -19 42 98 27 -121 17 -88 157 -100 65 -276 -143 50 -4 3 -29 -95 184 79 196 442 -74 149
2720A49k32k8J25m0P1l49K24j3Q6kPj23J33l3K4J04POJ26j48R3j65N7J25n11L52
$$ 149 -83 -111 14 -26 45 -304 -80 -93 -7 -9 -2 -125 8 -25 -1 103 110 116 242 94 187 22 79 204 -307 45
2746D5j76J5J89k0j05PJ05L6j52j2J96j62k10K18Q9J3j18Q1k1j58j59K03P1J1
$$ 45 -131 -116 73 53 -52 -45 60 96 -56 -68 128 -34 -244 -26 63 76 -42 39 18 -140 -299 -96 -25 -14
2770a4j16J36L0j41J44n2l7k7Q1P9J92m52L9L61k09j57j29N21l66J57k26K07M5
$$ -14 -130 6 36 -105 39 -13 -50 -77 4 83 275 -177 -138 223 14 -143 -272 249 -117 40 -186 21 66
2793F6q1p1J38l5j8M8J02J12k16k9m5k44J27K42J1j7j5k37L87k40j93j31M78k53
$$ 66 -15 -86 52 17 -1 47 149 261 45 16 -29 -273 -146 96 107 90 75 -162 225 -15 -208 -339 139 -114
2817a14J64j28n2O5J57j09j3r6j43M58j93M6K77j63n9N1k91R7J52j84J95j7Lj43
$$ -114 50 -78 -130 -65 92 -17 -30 -126 -269 189 -4 42 319 156 97 148 -143 -46 106 -78 117 100 103 -40
2841d0j40rK04J89k38m7J36P8l05J44M4j10J35K84k92k24J93n4o8l5J11j38J71
$$ -40 -180 -189 15 204 -34 -81 55 133 -172 -28 16 -94 41 325 33 -191 2 -52 -120 -155 -44 -182 -11
2864a1M0j93L85m89J52J7L8k8O3N9J08k6j82L32l45j78J77J74l29N98n12j39N47
$$ -11 29 -164 221 -268 -116 -99 -61 -89 -26 33 141 115 -67 265 -80 -258 -81 93 -236 362 -150 -289 258
2887B58m32J32K22l41K08k90K95Qj98k9J17J01j06j80J78n7J7L19l17o2K10L5
$$ 258 -174 -42 180 -161 47 -243 52 60 -138 -167 -50 51 -55 -235 -57 -114 -97 222 -95 -157 53 88
2909H8Jl57L09L12k85k81K83j11N6r4no4Q1m0k3L10j31q7P8n0k93J15K20MK6k20
$$ 88 89 -268 41 353 68 -213 70 -41 15 -79 -84 -148 -67 -107 -130 180 49 -38 40 -10 -303 -188 32 36 62 -158
2935a58L11j01l3r9l1J98j83L1PL23l08J71k8m30J03L18j33M3Jr7M8j33L59k24
$$ -158 153 52 19 -80 -111 87 -96 -65 -58 265 -43 128 100 -330 -227 91 -42 1 2 -95 -47 -180 179 -45
2959d5l49L94l9J40n5r7p3K08k78K49k17L44k80J83m4K99l55j45K67k75L21%j57
$$ -45 -394 0 -39 101 46 -51 -124 84 -194 55 -162 182 -98 85 41 340 -15 -160 107 -168 153 153 -4
2982dl40L62k0K40r5L1j04j03R6P3J89n32K53r9L51k39j61K21k8K45l56j42O7
$$ -4 -344 18 -2 238 143 174 70 -33 63 136 325 -207 46 -53 298 59 -102 119 91 336 -20 -162 -95
3005i5L6Q2q4m2PL98m98K17j77K58j12J43l94K22j06L2J16j34K59j58K39j53P1
$$ -95 -59 23 -61 -103 -96 302 -196 21 -156 102 -10 133 -261 -39 -145 -113 3 -131 128 -30 209 56 127
3028A27k94L70j66n9M2j51n4K58j67K02j47J43j98J92k9r7J16l09O9K87j51pM56
$$ 127 -167 203 37 -22 20 -131 -185 73 -94 108 -39 104 -94 98 69 -28 88 -221 -152 135 -16 -23 433
3051D33m69m9L37m25K50j9J72k62K73j37j43K08p5k34J16L2qP8k5k82J92K79k32
$$ 433 -36 -85 252 -173 77 58 230 -32 241 104 -39 169 94 -140 -24 8 0 78 53 -229 -37 242 10
3074A0k21J80J5p2R0J27o5l41L41Lq0K57l16K52o3l20J19j58j32M64l2k43m4K44
$$ 10 -211 -31 -16 -88 2 129 64 -277 64 67 -13 244 -72 180 117 -203 -84 -242 -374 90 58 -185 -229 15
3098A5p8j42L12j87J32k63J87l9J44n7r7P0l77N05N4k40J10J18r6J26q4l0J94
$$ 15 -63 -205 107 -80 52 -211 -24 -63 81 24 -73 -3 -380 125 179 -61 49 167 71 197 113 83 277
3121B77k89j23M0R0J63l25J42Mm9j93M25k8j05P1l4R4j64J50R8k45k0J73J05j84
$$ 277 -12 -135 -95 -5 158 -167 -25 -21 -70 -263 162 134 29 100 66 160 -4 146 244 -1 -21 152 257 73
3145G3J45l00K06j07k26K88j49m6m1J05Q3j79K28M9l44K11K7j0n0J56K3j01l3
$$ 73 218 -82 124 17 -209 79 -70 -116 -157 -52 31 -148 80 129 -215 -4 23 13 -37 119 142 41 8
3168Hr8o5J49q2O8L59l83nk5j20L73k02j54J55p6K06k4l10N82l49K73l94K6R7
$$ 8 -90 -155 -6 -88 -20 339 -44 -49 -74 -194 179 -23 -177 -22 -98 108 84 -226 356 7 280 -114 -88 9
3192Ij00P3k47K08j49R6rJ40J85o2k14J82j94l4K21j67j36K01j93m8L93j4j57
$$ 9 -91 -18 -265 -57 -206 -110 -119 21 206 144 -70 112 -82 -116 105 -62 -198 3 -190 -238 155 141 -16
3215a6j27Q9J46j12j01J46j07n8K36k43K34k72J72j67L08q5p0O8L8J22k65J39
$$ -16 -143 -54 92 -20 -121 25 -82 -140 96 -147 87 -185 -13 -180 128 43 -27 41 79 201 -64 75
3237G5q6K44l42L4j18K16J11k05K6R1j42k1J43p6K96n87M37J54j07l11K65j53
$$ 75 -11 233 -109 -75 -193 23 134 -71 -45 46 -96 -117 26 -50 246 -341 96 250 143 -168 97 -56
3259e6m2L1R5j80L5J33k1J33J66m35K13l2p2J28k16K78l23J69n4K1j62L60r5l72
$$ -56 -98 -67 28 -152 -117 16 -5 128 294 -141 72 40 -32 96 -120 158 -165 4 -50 -29 -191 169 74 -298
3283b98M93l82J32r8K67o5j87J90K29j40l16KJ12J41k59M08k03j39q0N8n4J94
$$ -298 195 -187 -55 -153 114 49 -138 52 281 141 -175 -173 -61 80 -179 229 26 -113 -193 -135 -189 5
3305EPL32k39k06J53j21J19j69J55j45K59m2l30J43O1k74L73o9N4Nq5j06J19J72
$$ 5 12 344 105 -101 52 -69 50 -119 36 -109 150 108 -222 -79 -18 -292 81 12 66 71 -14 -120 -1 171
3329A71k36Ql7N2P9k48O6L17k24K65l53l1K34j84J15N3J67j92r0J54N9q5R2j13
$$ 171 -65 -57 -94 -42 37 -211 -145 172 -52 213 -140 -171 63 -121 -6 47 214 22 -68 86 145 60 152 39
3353C9j40k34p4L85k33J02R1M0Q9k63k9J59K62k23j07J13K27j97r7L23k81Q0J1
$$ 39 -101 -335 -409 -24 -257 -155 -64 -24 65 -198 -227 -68 194 -29 -136 -23 204 7 -90 233 -48 32 43
3376D3O6l16L86k08J29q6m8J19p7J75N1l18K19q9r9j07J57L2R7N8j39J82l67N4
$$ 43 109 -207 179 -29 100 14 -34 85 8 183 234 -84 135 46 -53 -160 -3 29 126 184 45 227 -140 -86
3400h6j57M40l34K90n5k18J21J33l09K16m1o5q2p2L47J84n24p9K41o5J48j4k3
$$ -86 -243 197 -137 153 98 -120 1 134 -175 41 0 -65 -147 -219 128 312 -212 -291 -50 -115 33 19 -4
3423dr7K05l10J78j89J16O1K10l48k2J93kP8L7M4n7j32Nl4m0J6J02j00n1J98j15
$$ -4 -101 104 -206 -28 -217 -101 -40 170 -178 -200 -7 -9 69 106 150 93 -39 -34 -68 -108 -92 10 -90 -141 57 -58
3449e8M5J83l39L4L16j20N9k11j5J1OJ96j49J05j51K74p2l9j18r0K74k92k1K81
$$ -58 -13 170 -169 -135 181 61 120 -91 -106 -95 -89 107 -42 63 -88 186 114 75 -43 -133 141 -151 -172 109
3473A09j31J89l39J23Nj75K86RP1k02P3k71L17j50j2l4L5K19O8m24J3L04J21l27
$$ 109 -22 167 -172 -49 -44 -219 67 76 147 -55 18 -253 64 -86 -98 -132 -97 122 190 -234 -221 83 204 -123
3497a23j33O1J28L47l73%qK90k6n0j09r4J52o5l51K33K24l5R0k47kJ12K61j59
$$ -123 -256 -195 -67 280 -93 -93 -101 189 163 113 4 -90 62 -3 -354 -121 103 68 158 -89 -91 21 282 123
3521A23N3n4M4k06J63k35Q1N9j70L34n53K80L2j51K42k96K55R5m8J58k53j78L12
$$ 123 176 122 166 -40 123 -112 -31 28 -142 192 -361 -81 -49 -200 42 -254 1 96 48 206 -47 -225 87
3544H7j85J40L6j77J66k15Q3J38LK1p8r5J26l8J1k9k33R4n4L56Q9k27j23L18j88
$$ 87 -98 42 78 -99 67 -148 -65 73 76 97 19 -76 50 12 23 -6 -239 -145 -199 157 246 19 -104 214 26
3569B6J36j11j91J21k29K03j46N18l73O4k36L04r5M5n6m0mr6K96j05R0L4k73N5
$$ 26 162 51 -140 -19 -248 -45 -191 327 -46 18 -218 86 -9 36 -20 -60 -64 -160 136 31 121 155 -118 -63
3593f3Q1j39K59k11J2k25L70q0L12k27Q6k16Q4K22j45j87K30j31j29K12M6j85
$$ -63 18 -121 138 -73 -61 -286 84 4 316 89 175 -41 43 265 120 -67 163 32 -97 115 161 -24
3615b4K34j91J21k95J65j5r2j22K56J46k50J84J08l20k8J90j19l5p9N27o97J01
$$ -24 210 19 140 -155 10 -5 -97 -219 37 183 -67 117 225 -95 -123 67 -52 -87 -166 361 -336 -235
3637b35J37K40n03O30k61N5Rj17r3J32n5L1L8j59j87L37j76O4K80j46j43P5L9
$$ -235 -98 142 -361 269 8 63 72 -45 -138 -6 -61 -30 8 -151 -338 -1 -177 -113 167 21 -122 -47 -8
3660hJ67j66k59J0N07k38Q9O8j20r1j25K51q3j16QK57j77J82j89l8R2m1M7j00
$$ -8 159 -7 -266 -256 251 13 102 170 50 -41 -166 85 2 -114 -106 151 -26 156 -33 -71 21 -20 27 -73
3684g3N8j76J64K65j48o9m3K23Ok50M2J30Pm16N4K39R0j26j07K64L0j47K42l90
$$ -73 -15 -191 -27 238 90 21 -22 201 207 -43 -1 129 136 -280 -226 13 103 -23 -130 134 164 17 259 -131
3708a31R8j78Q2J31j7n9N2K9L5K27l21N0jj75J86RJ51k90J68m0j70J67Oj41L01
$$ -131 -33 -211 -129 2 -15 -74 -22 7 42 269 -52 -2 -3 -178 8 17 168 -122 46 6 -164 3 9 -132 169
3733A69k10j48L86k98K7J56j04P8k18J85Q6m98K25k4J74k18J19Q5J75K48k02m3
$$ 169 -41 -189 197 -101 -74 82 -22 56 -162 23 109 -389 -164 -188 -14 -232 -113 -28 147 395 193 150
3755A50l52K04J03K52j61k50Q1K73j32k2k31pJ90j70Q5j28n7K21J83k77j13J87
$$ 150 -202 2 105 357 196 -54 27 300 168 146 -85 -92 98 -72 13 -115 -172 49 232 -45 -158 29
3777B9o1J91k56J02J0k09K23j0Q8k12J15J53o3j83M0l7K56k35R1k18L09k52L00
$$ 29 -32 159 -97 5 15 -194 29 19 107 -105 10 163 100 -83 -43 -80 176 -59 32 -186 123 -129 171
3800A71l96L27j04k2O2j44K15K0J38m70K70j16k0j26K22J12j37J5J31j0j39J4
$$ 171 -225 102 -2 -24 38 -106 109 129 267 -203 67 -49 -69 -195 27 139 2 17 148 138 -1 13
3822A3MO9o8l34L78j02Jm3K69O5j32K9j57k52N74j27r9p8rL50n58L41l14O7J69
$$ 13 17 86 18 -316 62 -40 -39 -82 187 252 120 149 -8 -260 314 187 88 10 1 351 -207 134 -180 -113 56
3847E6P2r2K22r6j59j80M15k25j06J31K40m01J51l37K99k8l32J13K35K66l62n9
$$ 56 128 36 258 162 3 -177 238 13 -93 38 278 -123 28 -309 -10 -38 -370 -257 -22 244 -118 -177
3869a77L01L0j25J18j71j49K51j32j11L07j35J87j35K7k13J13m7j16J10J9L03
$$ -177 124 154 29 147 -24 -173 78 -54 -165 142 7 194 59 86 -127 -14 -61 -177 -67 -48 255
3890B55m39K26l2J31j04j54J70p8J86l37L09j94R7o7Mj21J99p4N3J82j67L5p6
$$ 255 -184 42 10 141 37 -117 53 -25 161 -176 133 -61 36 -31 -27 -148 51 -23 30 212 45 80 4
3913DJ40q5p4k02J07j9J96k44J05Q0m4l5l6K27l07L32k39J81k08L06Q0n19L15
$$ 4 144 59 -15 -217 -110 -129 67 -177 -72 8 -36 -71 -107 120 -187 145 -94 87 -121 185 265 -254 61
3936F1k11K22n9R7Q6K2j47l2q6j59L60k59J95%k80K51Q0j98j25P8j6K0O3N7n4
$$ 61 -150 72 13 110 196 218 71 39 -47 -206 154 -105 90 90 -190 61 141 -57 -182 -104 -120 -100 -37 20 -34
3961c4j46QL92k17l0j85K57M1j92o0N9R7J9P0m4r6l2K44l06L01j79m4p1kJ91l7
$$ -34 -180 -172 220 3 -27 -212 45 86 -106 -166 -107 -10 9 79 35 -61 -93 151 -155 146 -33 -77 -148 -150 41 4
3987DM9j44J56l6PJ30j75j7J17k58K1j0J75j11J07j07J01Q9L2j54r5L83j58k7
$$ 4 53 -91 65 29 36 166 -9 -26 91 -167 -146 -156 19 -92 15 -92 9 98 130 -24 -119 264 106 79
4011G9o1k11M6N7O2J98j46Q8k95K92k34l28L00J22J21j54J50j9j50P7j00n3M69
$$ 79 18 -193 -147 -90 -28 170 24 112 -183 109 -125 -453 -153 -31 90 -64 86 67 -83 -6 -106 -159 310
4034C10n24K59Q9o5jk83j06K41J80j02j61o9N6J8J03Q1o8K77j33j37K30J31l55
$$ 310 -214 45 134 69 68 -215 -321 -80 100 -2 -163 -232 -176 -158 -55 26 -42 235 102 -35 195 326 -29
4057b9K32j89QK8J4k66J39J41p3k61J82K14M0j63j15K35L9k42j91K10k56K2L10
$$ -29 203 14 22 50 64 -202 -63 78 5 -256 -74 140 180 17 -98 137 176 -66 -257 -47 -303 -281 29
4080B9n3R9j14P3O2o4kJ84l15P1n9L3J68k80L0R1l23J72K49L5k87P7L08k87M01
$$ 29 -24 75 -39 34 96 32 30 214 -101 -30 -89 -56 112 -168 -138 -47 -370 -198 51 86 -201 -124 184 -103 298
4105B98j48j80l9K66o9l46K20R7k08J41J69l4P8l77R9k1l9K64j82L03j71j95K21
$$ 298 150 -30 -69 197 128 -218 2 99 -109 32 201 167 245 -132 -33 -54 -93 171 -11 292 121 -74 147
4128A47j02O6J96p3k20o9L2k3j40L63l89K74j08j89M14j14O2O8j54J72k09L4j32
$$ 147 45 111 307 234 14 -55 -23 -46 -186 177 -212 62 -46 -235 179 65 127 195 41 213 4 38 -94
4151i4n2J08k9P2N7q9k79N94k01k07J31k85K60M9j47L74j63l2J10k06J37j18J7
$$ -94 -146 -38 -67 5 62 -27 -306 288 87 -120 11 -274 -14 35 -112 262 99 67 177 -29 108 -10 7
4174GJ1k13MK38j40L3J96j2P9k38q3J42o7N8j46L37k62r0J78n5L16l93J45j14
$$ 7 18 -195 -191 47 -93 -60 136 124 203 -35 -118 24 -43 15 -131 206 -56 -146 32 -23 293 -100 45 -69
4198f9M6k7K70j97j05K49p3j86o1L48j23j10Qj99L26l21J98P4k52K27K11l39L4
$$ -69 -23 -50 220 23 -82 167 94 -92 -153 195 72 -38 -30 -229 97 -224 -26 48 -204 23 234 -105 -71
4221g1J85J68l26l4O3J19j0j08J74j46k05K51J05k65J79j07K36k07n2J06n8j26
$$ -71 114 282 -44 -78 -15 104 94 -14 160 14 -191 60 165 -100 79 -28 208 1 -51 55 -3 -129
4243a29J92j52Q2j84K98l13M17k62J75Q8l82J23J25j62Q8N2j1P5J10j00pj46L
$$ -129 63 -89 -7 -191 107 -206 211 -51 124 212 -170 -47 78 -84 4 56 45 120 230 130 123 -23 -20
4266b0J29j82K27j65j77K68k1NK49n94J30p3K26J88m22K91j15K14l47K61Jk62
$$ -20 109 -73 154 -11 -188 80 59 64 313 -281 -151 -224 2 190 -232 59 -56 158 -189 72 73 -189
4288a89K06N2n3j89L22j67j46J19j94K64r1R5j33J45J25k75j89K06J55J16n0J48
$$ -189 17 69 16 -173 149 -18 -164 -45 -239 25 -66 29 -104 41 166 -109 -298 -92 63 179 129 277
4310B77o51J37L70j35L96n45kL64k80k08K80j06Q4p1K74k68k56L29J25j27j51
$$ 277 -374 -237 133 -2 394 -151 -153 211 -69 -277 3 -103 -19 -90 184 -84 -340 -11 114 -13 -164
4331a64J94o7P4k14K47j90K86k96L66o6j75J00J97k43j77J52J4j00J9KK9J92j65
$$ -164 30 -37 37 -177 70 -120 166 -130 236 170 -5 95 292 49 -128 24 38 -62 -43 -41 -12 180 15
4354A5j08L2R7j34J74k2j59O2N49l82O4n1j10k1J15j31k09m6K79j07K0L1J10k11
$$ 15 -93 -61 36 -98 76 54 -105 -43 506 124 188 137 27 6 121 -10 -219 -265 14 -93 -73 -42 68 -143
4378a43J34K30j1l12J32K03k09l9J79o5j3P0l93J81J46j67K82j78Lj40R2J80l4
$$ -143 -9 221 210 -102 30 233 24 -15 164 99 86 156 -237 -56 90 -77 205 27 30 -110 -18 162 128
4401A28k4J09m25K5O5L72n3n17M07k42J64j13K83j17J02k58K64k67J45j39k25
$$ 128 104 213 -212 -187 -122 250 197 -320 87 -155 9 -104 179 62 164 -94 170 -97 48 -91 -316
4422c16L74k29K8K75l95K77q7J70l18P8J71j00K50k94L1L1n7p2K28J28m0m6P8
$$ -316 58 -171 -143 132 -263 14 -73 97 -221 -143 28 -72 178 -116 -85 -54 -111 -183 45 173 133 87 165
4445A65k10L3lj71L31j36k59L05k27K69n1P4k2J91l48K55J6j36l4q2K20j46j30
$$ 165 -45 -12 -15 -186 145 9 -250 55 -172 97 46 120 98 289 -59 196 212 76 42 -40 180 34 -96
4468i6K11R9m08K9M38k12l13J66o4j15M14n5j45o1N84n40J79N0j38o3qK54j85
$$ -96 115 214 -194 -165 273 61 -252 -86 -150 -265 149 94 -51 -112 472 -68 111 161 23 -40 -48 206 21
4491B1q3K26M8m01L04n0j70J06rJ70k92j8K32k17J41L1K64m16K03j89qk3K30q5
$$ 21 -62 164 212 -189 115 65 -105 1 -8 162 -130 -148 84 -133 8 39 303 -113 90 -99 -107 -130 100 15
4515A5p2Q3j09%K69j98M4j1j81J24K72r4k62L6K25j1l48L60L3k07L3m1K56p07
$$ 15 -57 26 -83 -83 186 -12 32 21 -160 -36 236 142 -120 -84 141 130 -218 142 175 -32 1 -40 216 -491
4539d91L33K75m5j79J80l14M07o8o0k5j18K87n6m5j87L48j16m9k7j97K30k64R8
$$ -491 -158 117 72 -107 73 -241 166 98 38 13 -105 182 126 81 -106 242 126 77 50 -147 83 -181 -83
4562h3J03k27K83j41M6M9k08P6R8O6R6k69L00k47J76M8k4Jk74OL02k48K72k41
$$ -83 20 -207 76 -65 -19 30 -178 -102 -4 62 158 -111 189 -58 118 166 142 143 -131 -125 177 -71 201 -40
4586d0nJ59o5j83R6j10J45j60K75m0k54K18N2j15j57PK91R9j71Lo6K4j16K02l48
$$ -40 -45 114 49 -134 -38 -148 -3 -163 112 72 -182 36 88 -27 -184 -177 114 213 42 45 -21 3 -113 89 -259
4611b59M58m02K48KK47l11o1n2J69L6J06k6k79K85k02J57j49J75k73p7K71K51
$$ -259 199 -203 45 47 294 -17 -78 -130 39 75 181 155 -124 161 -41 116 -33 142 -131 -208 63 314
4633C14j30j41J32j81q0J57K6j60l9k9K1K33m9Pq8k9k32L69p6j66K23J47l92J13
$$ 314 184 43 175 -6 -86 71 97 -63 -102 -131 -110 123 74 81 -7 -36 -268 101 25 -141 82 229 -163 -50
4657e0M2m4J44m02K42K14j45k27J03J87J69k92m8N01l94m5K18o8l8L9j43J14O3
$$ -50 -8 -52 92 -310 -68 146 1 -226 -123 64 233 -59 -107 394 0 -45 173 105 67 106 -37 77 140
4680A40p3K8m76N22r0o6Q3j01R8nj68J09L18l21Mp7R0Q5n7o6J46Qk47O1J69j3
$$ 140 67 95 -381 141 51 -15 68 -33 65 60 -108 1 319 -2 2 -75 15 100 43 -23 123 131 -116 -55 114 101
4706A01Q9k87R6J03n7J8N9K3k63o1J00K20l46j5K3Q9L75j26l49j1J9L52j80kJ58
$$ 101 190 -97 -1 102 45 63 122 145 -118 -179 -79 141 -205 -220 -197 -108 267 141 -208 -219 -200 152 -28 -30 128
4731A28k25O5K1K15j26N2l15R4K6QO7j83N5P1J82k14J76J86k17j87K24R1j46L05
$$ 128 -97 -32 -11 204 78 130 -185 -91 -65 -57 10 -173 -118 -47 135 -79 97 283 66 -121 103 194 48 353
4755C53l23M3q8K6J24J58Mj70q7k36L20k7j92Q4J33R4m44L23o7k9p7K06J23k28
$$ 353 30 73 -15 11 135 293 297 127 40 -196 124 97 -95 -11 122 216 -228 95 28 -1 -78 128 251 23
4779B3O5k20n6K23m3N6R6m30n8L17k86L71q8j03J54O4j69l12K95L56m22K48N1
$$ 23 88 -132 -188 35 -8 48 144 -286 -344 -27 -313 58 -30 -133 21 85 -84 -396 -101 255 -167 81 132
4802A32l04J17q3J75k54K30j46J11J49j96K40j11%l0j60j56K12K6j12R3J46j84
$$ 132 -172 -55 -138 37 -217 13 -133 -22 127 -69 171 60 60 30 -130 -286 -74 -48 -160 -67 79 -105
4824a05m2J90K34l96k41L79K0J52rl10j27L43j67m1Q1o9JK15j26J5J24R4j07j49
$$ -105 -147 43 277 -119 -360 19 39 191 182 -128 -255 88 -79 -120 -39 -108 -107 108 -18 -3 121 215 108 -41
4848d1O8j23K7Jnj07K32k97K95Q0J59j31l39J97j9K18l44K42k22ll3L73K6j38
$$ -41 27 -96 -69 -68 -73 -180 52 -245 50 130 289 158 -181 16 -3 215 -129 113 -109 -112 -145 228 254 116
4872A16p6j98K46l8k15J59N2O4m7j51K6k4r7LJ58k62O9M7K93l1j01o9K12p5K6
$$ 116 40 -158 88 50 -165 -6 46 110 63 -88 -62 -86 -183 -180 -22 -284 -215 -168 125 94 -7 -76 136 61 87
4897H7K3j73j26p9J48M7M11l24J00j02p8M93n33J18Q6m95N28k48J28r9qm3k08
$$ 87 110 -63 -189 -268 -120 -73 338 14 114 12 -66 427 -106 12 98 -397 131 -117 11 -88 -96 -139 -347
4920c47L12Q0j45J10j46K47j37k22J47R9K13j82j02J74m6p6R7J33m97N72o6k00
$$ -347 -35 45 -100 10 -136 111 -26 -248 -101 -2 211 29 -73 101 55 -21 76 209 -288 284 218 18
4942A8k62N17j96k33K77q3j37J78r0O8k8L09m15M2j77L52j33j79K25m8q6J98j2
$$ 18 -244 273 77 -156 121 38 -99 79 -11 57 29 338 -77 -35 -212 140 7 -172 53 5 -81 117 105
4965A05j67K40k09q1Q5P7k03M52l04J07k04K74l18L85k79l9o2O9K03j17j70J75
$$ 105 -62 178 -31 -112 -27 50 -153 299 -5 102 -102 172 -146 239 -40 -79 -141 -72 131 14 -156 19
4987A9k3n2J81P7j78k7j44K23J1p9R9j58P9p0O4j54J96k51L19l71q0M32%l06J59
$$ 19 -4 -56 125 202 24 -3 -147 76 87 8 107 -51 28 -42 22 -132 64 -187 132 -239 -319 113 113 -193 -34
5012c4K7l5r9J61k36J85o5M0qn6J11L6j62L88l49J3J29k41J65J3L46k58j13K63
$$ -34 -7 -42 -141 20 -216 -31 -96 -56 -64 -120 -9 27 -135 253 -96 -83 46 -195 -30 -17 329 71 -42 221
5036B21p9l13K41r2m3M29m64l8K53l15M60k34k46L56K9j41K60l13n5L10l12K89
$$ 221 142 -171 70 -22 -65 364 -100 -138 115 -200 260 26 -220 136 165 24 284 -29 -84 226 -86 203
5058B03l78Q9P2J72q2k73L48k46L62l52j37N14m57K02j46kQ4J69j97J47j65j28
$$ 203 -175 -86 -14 158 76 -197 151 -95 267 -85 -222 292 -165 37 -109 -111 -27 142 -55 92 -73 -201
5080b01M69l60PJ40K25k17j15Mp6j9J64k2j10L73k03n2K29l67J1J06O6M2q2q6
$$ -201 268 -92 -85 55 280 63 -52 -48 -124 -143 21 -1 -111 262 59 7 236 -131 -120 -14 52 94 12 -74
5104g4Q2J30l05J19P3n8M9J64k58L12m07kK6L55j37o0J2m5pJ00K56k22M6p6m5
$$ -74 8 138 -167 -48 25 -33 16 180 -78 234 -173 -175 -149 206 69 9 21 -24 -31 69 325 103 149 73 28
5129B8J62L2m76L18N3l29M99n97K74r2J55k01J96Q0j9O3j98J26j06J07n0r6K58
$$ 28 190 222 -254 64 117 -212 287 -310 -36 -128 27 -174 22 102 83 146 -52 74 -32 75 25 -71 187
5152A87l94j20J31NM25k49K58m68M01k8j58J05k72J87J35j89K59l33R5M40n74
$$ 187 -207 -327 -196 -191 234 -15 243 -225 176 148 -10 95 -177 10 145 -44 215 -118 -23 417 -157
5173a57J50J87j19j3j9l9J94l16J08k52L46l60L89j96M4L5j02M1k29L69J1K36
$$ -157 -7 180 61 48 29 -10 184 -132 -24 -276 70 -290 99 -97 -53 -18 -120 -79 -308 61 72 308
5195C08l49P5R6j3j87J33o2m9K4j41R6J17l8j12J23l01N50j54J15j39r9P0O2m22
$$ 308 -41 34 130 117 -70 63 1 -48 -24 -165 -69 48 10 -102 21 -280 270 116 231 92 -7 63 125 -297
5219b97J21R1M8J13l9J65K5k03j02K27j96j05J06j65rJ63j48L9K51K31j14k75
$$ -297 -176 -85 -37 76 37 202 227 24 -78 149 -47 -152 -46 -211 -220 -57 -205 -166 85 316 202 -73
5241g3M1o3l5k45M11J09k07J69k02L16k41n9m0p0J50Qp4P1M8k72J52L28L49o75
$$ -73 -32 -95 -130 -375 36 145 -62 107 -95 221 -20 -79 -119 -189 -39 -31 -105 -34 14 -258 -106 222 571 -104
5265a04K20L5J38n42M38j41j15Q6l05j26L16J30J67n07M02J12k40q2K12j45J31
$$ -104 116 151 289 -253 185 44 -71 15 -290 -416 -100 30 197 -310 92 204 -36 -118 94 -51 80
5286H0q0j17L54k51J8o8K51j32J59r4k16K93k4Ok38k20K89l47K02L97k63L53l04
$$ 80 0 -117 237 -14 4 -64 187 55 214 120 -96 197 173 179 -59 -279 10 -337 -135 262 -1 352 48
5309D8j16P7J96j37k60K90p8L3q2j37M27m59L48m1k18J87j09j5l09M61p7j57O2
$$ 48 -68 9 205 68 -192 98 20 53 -29 -166 261 -198 150 109 -109 78 -31 -46 -355 106 29 -128 -66
5332f6N83m99O9l2j71K68l87N3M45j80k10J58j1k20K61p9l9J02n7j3j9J64pj33
$$ -66 517 18 87 55 -116 152 -235 -182 263 83 -127 31 20 -200 61 -18 -57 45 -12 -25 -44 120 113 -20
5356b0j29K20K2RK63o64K43n1J33R8k18L25k27N3k49L35l04K28k89K99l0n1K2
$$ -20 -149 71 93 102 365 -299 -56 -107 26 124 -94 231 4 57 -192 143 -161 67 -222 77 47 -4 18
5379A8q2j20P2K56r9k91K76j79J12j31J43n2K50N6j60m52M27k02j6P3J97M4k41
$$ 18 -64 -184 -112 144 45 -246 30 -149 -37 -168 -25 -77 173 229 69 -383 44 -158 -174 -101 96 140 -101
5402a01j49K56K23j5q9l68L02k39K61Nm5k19J06J1L4K60k91r3K17o9j52K29P7
$$ -101 -250 6 229 214 125 -243 59 -180 81 86 41 -178 -72 -61 -27 233 -58 -151 66 -3 -155 74 151
5425A51n33L31M5o8P8J32j81Ok16K25n2J32r6j90M49k78K0O4j02l1K48L0j88J44
$$ 151 -382 -51 -6 -74 4 136 -45 -39 -255 -30 -82 50 -46 -236 213 -65 -45 19 -83 -114 134 164 -24 120
5449A20j73k05K92j1l41K97J52J63k77Pm0K47l41J08j14J89j07M1J67n7L8k07
$$ 120 -53 -258 34 23 -318 -21 131 294 17 24 -16 231 -110 -2 -116 73 -34 7 174 117 155 -52
5471e2q8M9j5Q3K93k1l67J46j18J96j9k07m7K0j56L81q6K10j89N6p6m1k1m8qO9
$$ -52 -140 -91 -106 -23 270 249 -118 28 -90 106 87 -120 -167 -147 -303 78 -8 202 13 69 -7 -48 -69 -117 -125 -56
5497e6L5PM3j85J42P9KM6k57J89o8J57j78P7P0j30l2L5KmK19k78n3J33j53K96
$$ -56 -21 -14 29 -156 -14 65 67 113 -144 45 -23 134 -44 33 103 -27 -59 -24 -22 -26 193 -85 -138 -5 -158 138
5523A38j85K12nk36J01Q4R1L7k79j41K85ql3j45K29n8l6Lj8l45K09P2K50j55l23
$$ 138 -47 165 160 -76 25 109 200 237 -42 -183 102 94 61 -84 145 87 51 54 36 -309 -100 -28 222 67 -256
5548b56J96J69j38J07k24N3M7M16l22m4pk41K50j07M0P0j94J15Q5M9p1J20l12
$$ -256 -60 109 -29 78 -146 -93 -46 370 48 4 -3 -244 6 -101 -61 9 -185 -70 15 64 -7 113 -199
5571a99J60M5K86m58J22L22l29J03j62N2Q6n3O3K0q7M9j90J48q5N9l2o2k06M67
$$ -199 -39 6 292 -166 -44 278 -51 52 -110 -58 28 -25 38 58 -29 20 -170 -22 -107 -48 -80 -142 -348 119
5595A19K3k81o6J99j53J31O1qj77L33n07J60K2L49l66M5J81j53L8K5J18L6j76
$$ 119 142 -139 -205 -6 -159 -28 33 25 -152 181 -326 -166 -144 205 -161 -116 65 -88 -50 -25 93 129 -47
5618d7J41J01j94l5Q2l3p3J60l54J00J42J09J25l04J63J1k76K91l95K39P6l8m5
$$ -47 94 195 1 -34 48 15 -58 102 -252 -152 -10 99 224 -80 83 94 -182 109 -286 -47 29 -9 -54
5641e4J16Kk04L46j86M3J51l02r7J83k56K43p6M1k4m6K92m37R7K07o6k24L05J8
$$ -54 62 64 -140 206 20 63 214 -88 -185 -2 -258 -15 -91 -50 -74 -120 172 -265 -168 39 -27 -251 54 72
5665G2j31o3l9kJ20P4o7O7j42J45r0k99L58oP4j14K00r4k90K9K79m3K41r2j21
$$ 72 -59 -122 -161 -163 -43 31 -36 31 -111 34 -56 -355 3 -3 71 -43 157 63 -227 -198 81 38 279 187 66
5690F6J37j83j97K33k36L79j54q4p6J54j1K03q3J14j83r9J62l57M18p4k40k56
$$ 66 203 20 -177 56 -180 199 45 -39 -115 39 28 231 148 262 79 -20 142 -215 203 129 -111 -367
5712c67N28m15K10j58O8R7P4o4N0k44L78n6j52K48j82K0j68k08N47j92k12K07
$$ -367 161 -254 -44 -202 -134 -37 37 -27 23 -221 157 101 -51 197 15 35 -133 -341 206 14 -198 9
5734Ij15J84j07j74p2L80k40L96l65N6j2P5j86L24k59J59k54J44n4P5J28p3q2
$$ 9 -106 78 -29 -203 -275 105 -135 261 -104 -48 -60 15 -171 153 -106 53 -201 -57 -111 -36 92 19 -63
5757f3L5L95m39J91p2q5Q2K28j90J9m44J84J78j31J19j20K1L34j29Qk11m7M3k04
$$ -63 -28 367 -72 119 47 -38 44 272 82 101 -343 -159 19 -112 7 -113 -92 242 113 121 -90 -137 -94 -298
5781b98K28j67k36L96M7O0N8J39M7l01J4O4k1k02N31m08j01P6m6p0K05j47L04
$$ -298 -70 -237 -473 -77 -30 30 88 227 274 -27 -13 51 30 -172 359 -49 -150 -74 -120 -190 15 -132 172
5804A72k39N9P8l67L58j51K46j1j49J30J20k11J77l49QJ16j33J38K01r5j53P6
$$ 172 -67 -8 70 -297 61 -90 156 145 -4 126 246 35 212 -137 -129 -13 -146 -8 193 98 -55 21
5826B1J85k67r1L1J48N7j89L15k80K87l84K76p4J8N5j58J98k57j56M20k18O5R7
$$ 21 206 -61 -152 -121 27 84 -105 210 -70 217 -167 109 35 53 108 -50 148 -109 -265 155 -63 2 99
5849I9j48j0R4JOo9o6L17k74q9L23j3k31K62j44j05L52l3l48k5K18O8m58L79J57
$$ 99 -49 -59 35 36 42 -27 -93 224 -50 -139 184 171 -60 202 58 -47 305 272 -76 -101 117 185 -273 106 263
5874B63k92L32p5k63j54K87q5k0R3j33P3k15L0j0J75j09L0JJ47LQ3N8j76p2o5
$$ 263 -29 303 228 -35 -189 98 13 -7 86 -47 26 -189 -159 -169 6 -103 -73 -72 75 78 161 219 43 -29 -94
5899i4N11k90K0j70j4J27Pr6r9j93K58M1m9K09k48L0K12l64J70j11m6J10J21M5
$$ -94 417 127 147 -23 -37 90 97 1 -98 -291 -33 8 -41 168 -80 -50 162 -202 -32 -143 -189 -79 42 87
5923H7j8k75L9L28k00rM0j49Q5J61p7p0J51J07j63M3kj22k08L33K7K32n72L83
$$ 87 69 -206 -167 161 -39 -48 -8 -157 -72 89 12 -58 93 200 37 80 78 -44 -252 81 108 340 -232 151
5947A51m56L22J20o0j04K76k94k73L39l36M36j79N28n83J99k2k0m0m3K40r9j69
$$ 151 -305 17 137 77 -27 249 -45 -318 21 -315 121 -58 470 -113 86 64 44 4 -39 201 102 -67
5969f7QK07L6j61O2j6p8q8J38L7j31RK41k32L6J29l20J58P0j60L3j9N8K46k32
$$ -67 -59 148 184 23 85 69 -9 -97 41 78 -53 -44 197 -35 1 130 -190 -32 38 -122 -89 -108 -50 196 -36
5994c6N7oJ34P2k63J1l5L9j75J02R0k56K46m1k13K52J47q1K33k86Q0j79K06P9
$$ -36 21 15 149 221 -42 -31 -66 -27 -202 -100 -10 -266 -20 -61 -274 -22 125 44 277 -9 71 -108 98 177
6018A77k53K35l34K13O1m3n9K81n32L06l0j0j16r6J77j25J78k5l03J55J67p9K76
$$ 177 -76 159 -175 38 99 56 -3 278 -254 52 22 12 -104 -200 -23 -148 30 5 -298 -143 24 -55 221
6041B21k62l9J62j20Nk30J96L13m35J11M0J08Rj6K01k03J40j56N0J59k76j59N0
$$ 221 -41 -80 82 -38 -33 -263 -67 246 -189 -78 -38 70 79 63 264 61 201 45 95 254 -22 -181 -131
6064a31J68j62J43r5M25m51j78K42K44j99Q4j32L54m34J83J0j1j82K29P1k90K71
$$ -131 37 -125 18 -77 348 -103 -281 -39 205 6 90 -42 312 -122 61 71 60 -122 107 178 -112 159
6086A59j20J33k81J36P8j2m52N21j40L0p3P8m07L98R7k92K89j02K3j33O2K72k19
$$ 159 39 172 -109 27 105 93 -359 162 22 52 -21 57 -350 48 145 -147 142 40 63 -70 -8 264 45
6109D5J47k49%n8J39J00j24N4l11J40J41oj50j7R5K9J60q9k03J74r3k04L29j54
$$ 45 192 -57 -57 -115 24 124 0 54 -257 -117 24 18 -132 -149 -54 -25 135 46 -157 17 -76 -280 49 -105
6133a05J71J60l58J55l2p9R4R4p3K95k62j3k19K84j45K03k29Q3J59o39N19k57
$$ -105 66 226 -132 23 -9 -88 6 100 27 322 60 47 -172 112 -33 170 -59 24 183 -456 63 -194
6155a94L61j55p0m7R9k08K34j43K21p0j31K9O4j2O0Q2K2Q7q6j94L21m15O0P7K36
$$ -194 167 12 -58 -105 -6 -214 20 -123 98 28 -103 -74 -10 -22 38 120 142 229 143 -51 270 -145 -85 -8 228
6180B28Rl15L00l74oL51m5j30N6K22m39r1J59K37j67n8n9Q6O3R5k65k8K57O0j53
$$ 228 237 -78 222 -152 -158 193 148 18 74 296 -143 -234 -75 162 -5 -63 -122 -36 27 122 -143 -171 86 146 -7
6205gM2J02k8m8k3J46k41L2Q2m2J1j09%kn9M6KL11k71j96K50r1K35j65J11j9k42
$$ -7 35 137 109 61 38 184 -57 -25 57 15 26 -83 -83 -85 -144 -98 -96 215 -56 -252 -2 -93 142 -23 88 69 -173
6232a73M6J61j84L78k44o3M8J97p3Nk99K92L0j28k0k59L11P4o2k10J95J52m23
$$ -173 -127 34 -150 228 -16 -79 -31 166 93 98 -201 91 121 -7 -27 -286 25 99 37 -173 22 174 -249
6255b49M77k04j48Q5j14P8j0Q4p7M9J10p4K84o2o9j44j77J68j95nL90k56K2J25
$$ -249 228 24 -124 -39 -153 -75 -85 -1 -78 -29 81 7 291 229 160 16 -161 7 -188 -193 197 -59 -37 88
6279H8lJ02j64Pk06J25r6K54k03j4K29k39K95ol07J76J27j33J32j19j90M6K89
$$ 88 85 187 23 30 -176 -51 -147 107 -96 -110 119 -120 175 169 -138 38 165 32 164 45 -145 -99 190
6302A90k09R5j61K0m2K32j27J31m5k05R6k3J14nl3Rj0nq7K61j54K48l0k50L7J5
$$ 190 -19 76 -85 -65 -107 125 -2 129 84 -121 -25 -48 66 61 28 37 27 22 -65 196 42 290 260 10 47 62
6328F2k3N0l20J96k6j22j29M54n4k06J46L9P7l58K71j2m5%m8R8OL7l2q5K62j81
$$ 62 39 89 -231 -35 -61 -183 -312 142 88 -118 28 67 144 -214 57 45 0 0 -48 50 56 93 61 -24 238 57
6354E7J30m52k53N38o7R2l34J26J01j09J4J25K95j68k41J58k0J30k44K94N5j48
$$ 57 187 -265 -518 20 -47 45 -289 -163 -62 -171 -157 -32 263 95 -146 12 -8 122 -122 172 227 79
6376G9o7M3m2k90R1J60j6Qp6K3k02L38O2Kl4J10l42K55L20n14N0r3K04j3MK12
$$ 79 12 55 13 -277 -186 -26 -42 -34 -110 -87 -289 49 111 113 79 189 -153 102 422 -92 -42 -135 69 56 60 272
6402B72j06n53J68L91r4Nj57j11K31j61L12n3k75K79q7k08L95l70R5M4O1p1o2
$$ 272 166 -387 -219 172 78 83 -74 -185 46 -115 197 144 -131 148 61 -147 248 -122 -27 17 78 7 -55
6425e5N0J6j3J0L9j28J74j56J56j1J99l66o7J18j16L58n2k96K70J33k51j25O3
$$ -55 -5 11 -2 8 47 -81 93 -63 93 82 281 -85 -152 -34 -150 208 156 -140 130 263 12 -113 -50
6448e0oo6n6L13j42j41Q3kJ44np7K99k72j9K05m5o0o0k1k16J15k70L87k2j09J75
$$ -50 -56 -122 -178 135 -7 -148 -65 -67 77 72 -5 294 22 3 208 163 103 43 22 -194 -79 -349 38 16 -93 82
6474H2j13j03P8O5q2n1M5J06P7n24N21m3k50Q8k2r4O21l77Q1o5J85j74k73K85
$$ 82 -31 -134 -56 9 -73 -124 -79 27 104 -420 101 58 -192 -104 -126 -220 401 24 105 40 225 51 -222 63
6498F3l1J44l05J10j02p2J62j05k12K33O3JJ04J18K3j91j43J22K87l36J91m5j15
$$ 63 32 176 -129 -19 -121 -193 -31 -136 -348 -115 -52 -51 53 171 194 3 -140 -18 269 -67 124 79 -36
6521c6P8j78J8O1J19j36n8P7J92j69L70j71k74P8K01j29j8p8j03K28OJ5k12L11
$$ -36 42 -136 -118 -57 62 -74 -132 -55 137 -32 338 167 -107 -29 172 43 25 -53 -156 72 78 93 -119 192
6545A92l44K38k67J26K04k26Q5Q9k09m1P9L22q8k29K16J45k50o3L0n8k72K76j78
$$ 192 -152 86 -181 -55 149 -77 8 97 -112 -153 -74 248 160 -69 147 292 42 -21 9 -49 -321 -45 -223
6568b23N20m91O3K03O5l75K11Q6K20l48K86j83J65j68j92K26QJ73n8Ok52j71J72
$$ -223 297 -194 -131 72 137 -238 -27 59 279 -69 217 34 199 31 -161 65 73 246 188 194 -58 -229 -57
6591e7P4l0o6J70Q8m33J92K30j5p7m8Jj41k38N09l71L50k29n9M7L1l1O4R8J14
$$ -57 17 -13 -79 91 179 -254 -62 168 153 76 28 29 -112 -350 159 -212 138 -91 -150 -103 -72 -103 -39 59 173
6616A73m19N49n27L00R6k88K08q0Nq1J41j13L05m29M9J37K4L11n73L71j93L8j1
$$ 173 -246 303 -224 76 172 -116 92 12 17 -64 77 -36 269 -160 -111 26 50 361 -212 159 -34 4 -7
6639gJ99k64K54k15K81j85j57M6q1Q0q3K61o8K4l48L34j69K21J02k35oQ4N6k66
$$ -7 192 -72 182 -33 248 63 -94 -48 -129 -49 -132 129 61 85 -263 71 -98 123 225 -10 -16 68 124 -142
6663a42J22K30j73J51mj69p7K52k24L3O1Kk55J81m2Q6j16K17k44R3J69l73K0j82
$$ -142 -20 210 37 188 184 15 -62 190 -34 -1 60 62 -193 -12 -54 32 -84 133 -111 -18 151 -222 -202 -384
6687c84N72l64K88k%j62j10Q2N4K32j67P5n7Mk46K66j08j5J46j03J61O0m81M90
$$ -384 188 -176 112 110 110 -52 -162 -80 -26 206 39 114 57 61 -185 81 -27 -42 104 1 162 222 -259 231
6711B31j0k18J11o5k20PK96r5J98l13N5J11L5k12J07l8l1L54l61J31J12j80k06
$$ 231 221 3 114 49 -171 -164 132 37 235 -78 -23 88 123 -89 18 -20 -51 303 -58 73 185 5 -201
6734b01l3L93n7k01J95j8J10k74P3j1k08K19Q6lJ36j72j50J47J6l02M00l16K90
$$ -201 -234 159 102 -99 96 78 188 -86 -13 -24 -232 -13 73 70 206 34 -116 31 47 -255 145 -171 119
6757A19k40L35J72l65k42K53r1N7Qk5n6k14K99J62k17j82o2K35J7r3J38L56k88
$$ 119 -121 214 386 21 -221 32 -59 -2 6 -19 -75 -289 10 172 -45 -227 -289 -54 -37 -130 8 364 76
6780G6m4o6J68l54P9N9K02l29Q6K41j34J21Q9L2k51O7j84M23o03M02j54J57J0
$$ 76 32 -34 134 -220 -141 -82 120 -209 -123 118 -16 105 194 226 -25 42 -142 281 -322 80 -74 83 93
6803I3r6J24m5l61K00j23J32L15l57R3n3L26l20j55K80J6j2J29k02j53N0N1J64
$$ 93 -3 121 76 -285 -85 -208 -76 239 -118 -25 -78 248 -72 -227 53 69 57 186 -16 -169 -119 -68 96
6826I6j55J49j70O2j06J86k09J08J33j82J37k54P7O9L22k18m1m0Q4K72l09L1Q5
$$ 96 -59 90 -80 -18 -124 62 -147 -39 94 -88 49 -205 -128 -59 263 45 4 -36 48 320 11 42 127
6849A27l3M0J11n5j30k92K88J6j90L84k83N0k36L37l72L78j15J42j58l4K8l6L9
$$ 127 94 134 245 190 60 -232 56 72 -118 266 -17 33 -203 134 -238 140 25 167 9 -25 3 -33 6
6872Fj14J23j68K14k75J40OQ0J60k07M9O6o3j44J13k01K4J95k12J18J53r5o7J24
$$ 6 -108 15 -153 61 -214 -74 -68 12 172 -35 14 80 17 -127 -14 -215 -191 4 -208 -90 63 -32 -99 25
6896B5n9m1K38k24jK33J50k97j2l7pJ03r5p4J09j58N1P5J84k6K7O2n38M96j93
$$ 25 -34 -75 163 -61 -62 171 321 24 12 -25 -32 71 -24 -98 11 -147 -96 -21 163 137 164 226 -312 184 -9
6921iQj15k7j20J94L7J65k7K1k71l8J32R0P6n3P5j46k5J34j08K20k76N9J01o3
$$ -9 -1 -116 -143 -263 -69 -32 133 106 127 -144 -182 -50 40 116 63 138 -8 -33 101 -7 213 -63 -4 97 34
6946C4o8Q3nl12J75L52l29r1L34k42K4j1L2j9J32m9j56j16p7N31k44K5L1j37J88
$$ 34 -34 49 44 -268 -93 259 -70 -161 173 -69 -45 -56 -24 -43 89 40 -116 -232 -309 222 -22 3 34 -103 85
6971H5j22K2K8n1j1J63m63L32K47m32J43k42Q2J05K24k21m9J09j07M51m13L61
$$ 85 -37 -15 13 -38 -49 114 -349 -17 230 -202 -59 -301 -219 -114 110 -111 -160 -51 -158 293 -120 241
6993B41m14J50M7O6K9k07l4j35K79M5k64K51k09J18K05l47n5J23J32j0j25L77
$$ 241 -173 -23 24 90 119 -88 -122 -257 22 67 -197 54 -155 -37 168 -179 -234 -111 21 11 -114 263
7015B63r0m11J27l0K21L8j69J63k79L73l10R3j35J48J27l68J76r5J85N7K25l24
$$ 263 173 -238 -111 -141 80 118 -51 112 -167 206 -104 -11 -146 2 129 -239 -63 -158 27 84 309 -15
7037a5j80j50K39K59o1l0o7k22K56N8j37q7J54l06L99k32J07Q2r3K60k14k24J22
$$ -15 -195 -345 -106 153 92 62 -5 -227 29 87 -50 -137 17 -289 110 -122 -15 67 -26 234 20 -204 -82
7060h2N5J88k17P3p8l4K1q5J52k26M82r3j91j95K94j71J23J71l59M37k98J0j70
$$ -82 -27 161 -56 17 -61 -95 -74 -159 -7 -233 249 156 -35 -230 64 -107 16 187 -172 265 -33 -23 -193
7083a93R3J92j8j57J89k37N6j6q3J97J44K14l93K05k86J13l38L62k71K28j78p
$$ -193 -100 92 74 -83 106 -131 -75 -91 -174 23 167 381 -12 193 -93 20 -318 44 -227 1 -177 -184
7105a84K61M2k45J70n2j48J88k77K89j8K92j53k31J3o3J96l16K20P4J16l70N8
$$ -184 77 119 -126 44 -8 -156 32 -245 44 26 318 165 -66 -53 -116 80 -236 -16 58 174 -196 -138
7127a38K85j64k94L54j00L8%N0qp5K94j94n6K02k65n2J33L03l61J88k38K27j91
$$ -138 147 -17 -311 43 -57 -19 -19 31 23 -52 242 48 -8 194 -71 -123 10 313 -48 140 -98 129 -62
7150f2R2j3k07L16l02J56jj4J25k2J10j20j63K90l11K06j12K67l64OJ58m1L7J45
$$ -62 30 17 -190 126 -176 -20 -21 -35 90 68 178 58 -105 185 -126 80 -32 235 -129 -123 35 -6 31 176
7174A76k83J09M1j61K07j86PJ9j53K84o0j08K27K8Q8k97J02k7r1J37l85K26L52
$$ 176 -107 2 43 -118 89 -97 -90 -71 -224 60 0 -108 119 147 235 -62 40 13 -78 59 -326 -100 252
7197B52j50j31J56Q6m9L0m6j97o7J51l08K49J08M0n5j45J23m7J14M4j33m9J90
$$ 252 102 -29 127 213 164 194 148 -49 -116 35 -273 -24 84 124 69 -76 47 0 114 158 25 -24 166
7220A66j96N3M7j85K92m60L6K35j58J47M6R8Lo9j42J84j97J31J37q7m02J20k34
$$ 166 -30 23 70 -115 177 -283 -247 -12 -170 -23 23 121 124 55 -87 97 -100 31 168 81 -321 -201 -435
7243d35K62K21N8j9k45J46j80J75l8J17j7K5J9n0q0N3k2j37L62o7K2k31J36Q1
$$ -435 -173 48 106 87 -158 -12 -192 -17 -55 62 45 70 89 39 -41 12 -10 -147 215 148 170 -61 75 156
7267A56k49J71j28k2J64r4P8j69q8J02NL42j03q5j00JL5r6j88P8K40J67j14j86
$$ 156 -93 78 -50 -72 92 -2 76 -93 -181 -79 -74 268 165 80 -20 -19 16 -80 -268 -190 50 217 103 -83
7291h3K1p3L87k99O2M37l49l2Kk53K82r5j07N5J1l4K40l69J31J76k68n3Q2K16
$$ -83 -62 -135 252 -47 15 452 103 71 73 -180 102 7 -100 -45 -34 -68 172 -197 -66 110 -158 -211 -129 87
7315H7j08L53k20n00N04r6j79L14M9l6J28j43k03o3lJ25K8k76K41K09j83N2j96
$$ 87 -21 332 112 -388 116 20 -159 155 204 168 296 153 -50 -113 -116 9 37 -239 2 211 28 80 -116
7338a16K40q0j51J45j41K85o1m6R8k43L2J5Q5L3M8j66K74k05L6k08J99j34p4K26
$$ -116 124 44 -107 38 -103 182 121 75 173 -70 -38 -23 62 95 143 -23 251 46 82 -126 73 -61 -135 91
7362I1l95M15k04P5P8P0k15p6j44M66k41L37k23M72j98k22r5j9j45m0J98o8r5
$$ 91 -304 111 -93 -18 60 130 -85 -161 -305 161 -80 257 34 506 308 86 -9 -28 -173 -213 -15 -83 -178
7385a78L39j39k21M90m25K4j72J45K08q6r7R8M49m28J11k79K25j02k06L50pm3
$$ -178 161 22 -199 291 -134 -110 -282 -137 71 -15 -112 -14 435 7 118 -161 64 -38 -244 106 99 56
7407E6j78L48k13M7l18K42p7J90M3l82K79q9J86k18PN4M6N2K8k29K18l18K94j08
$$ 56 -122 226 13 60 -258 -16 -93 97 140 -242 37 -52 134 -84 -77 -23 23 75 103 -126 92 -226 68 -40
7431d0J43k19L32l68K30j60K05m3k39N4R1k87L44OJ12k43j87K51m8J04J94j05
$$ -40 103 -116 216 -152 78 -82 123 80 -159 -105 -14 -301 43 49 161 -82 -269 -18 -66 38 232 127
7453A27k50P1l5j23K96l91K65j64K55j1J11j26J93r6r6j73k8M22k47J91m08J36
$$ 127 -123 -52 -87 -210 86 -305 -40 -204 51 40 151 25 218 122 26 -147 -175 247 0 191 -217 -81
7475h1J47j10lJ24j43r7L13Q2m22Q6O6J07K09j83j48K73j44L2k7Q4m05Q2j71J94
$$ -81 66 -44 -47 77 -66 -163 150 232 -190 -104 -38 69 278 95 -53 220 76 108 81 165 -240 -158 -329 -135
7499a35R7K30j98K31m94K71R4qKn3j50J34p6K39l71K99k74K12R8j38k6j50K83
$$ -135 -38 192 -6 225 -269 2 96 88 90 37 -113 21 -55 184 -187 112 -162 50 148 10 -16 -166 117
7522A17l71J40J83%k88J35K23O1j60m00O35m42L46r3K44n47J21O5J50j40K7K8
$$ 117 -254 -114 69 69 -219 -84 139 200 40 -360 275 -167 179 86 330 -217 -96 -31 119 -21 6 34
7544C4J78J28m56J99o5j2l3P7l25K83m6j36J15j95L64pl23K89Nm5L2j27J90o1
$$ 34 212 340 -116 83 18 6 -27 50 -275 8 -38 -174 -59 -254 110 103 -220 69 74 29 61 -66 124 63
7568F3n4J39N0k36N76o42J52o1J7j01j6K73j80K0Q6k18J96j83J34N8r0J66m48
$$ 63 9 148 198 -38 538 -104 48 -13 4 -97 -113 160 -20 0 86 -132 64 -119 15 73 -17 149 -299
7591b99K67j12K68oj6k54L6L84l76p5J63N5M6j01J89Jk80P0m6r7J81n3m2o8RJ20
$$ -299 -32 -144 124 118 102 -152 -116 268 -108 -183 -20 35 81 -20 169 170 -110 -40 -86 -183 -2 -55 -97 -165 -156 -36
7617c6J47k33K0j8K39j30o5L73k29j54J74j91Q8k36O2J77j49P1M0o2J6K88n8l01
$$ -36 111 -122 -102 -120 119 -11 -76 297 68 -86 88 -103 -15 -251 -189 -12 -161 -90 -50 -112 -96 192 134 -167
7641a67L85K36l66l33J10L3J01oL13l47J9j95L82j64J56l95K11K93n06J9K62n0
$$ -167 218 454 88 -245 -135 -102 -1 -7 306 -41 -22 -217 165 1 157 -238 -27 266 -240 -221 41 -9
7663il1N6J45j24R8j79k25M05r8O8r8o0n7j9J30J67l62j3L91l52K37N3pL9j64
$$ -9 -40 16 161 37 135 -44 -269 136 38 106 8 -52 -109 -128 2 169 -193 -206 185 -167 70 123 116 155 -9
7688iK49k76j08K74l00J38jJ99k59J30j59OK71k34K55l34O38o37jL8L90j48j65
$$ -9 240 -36 -144 130 -170 -32 -33 166 -93 37 -122 -116 155 -79 176 -158 480 -157 -158 -120 270 122 -43
7711d3k0L81j48l64K70r6J85n0J3j58K34j78q8k3L35j56J27n1q0R8k92k12L29
$$ -43 -63 318 170 -194 76 -20 165 115 128 -30 204 26 -62 -85 250 94 221 170 90 188 -104 -316 13
7734A3j01J15K41m28J13J2J07l9k53j89P38l9k88R3R0j15Q2l08J71r3j81M24R3
$$ 13 -88 27 268 -160 -47 -35 72 33 -220 -409 329 290 2 95 185 70 152 -156 15 -78 -259 165 258
7757B58l45N2j17k2J77n1J67j67K8K36j18j21Q9N9j41q8L23l92L33K0o2j34j0
$$ 258 -87 -35 -152 -174 3 -48 119 -48 -20 216 98 -23 66 125 -16 -104 219 -173 160 180 118 -16 -26
7780b6L11n58K47L27j61k73K91m16K35J85j81j45K19J06k03j14J79r1Q0M3M5j28
$$ -26 285 -273 -26 301 140 -133 158 -258 -23 162 -19 -164 55 161 -42 -156 23 -68 12 55 100 -28
7802b8m6m1J70j07j69K97j41J72j69J89j84m5R0k64M68l78M91k60l54L50j17K57
$$ -28 -74 -115 55 -52 -221 76 -65 107 -62 127 -57 -102 -12 -276 192 -186 305 45 -309 41 -76 181
7824A81l7k45j23L60R6k05n7o7Q0L6l6M3J4j87K04R4k35K21r5L09l09L1k28l15
$$ 181 144 -101 -224 136 232 27 -30 -97 -17 19 -17 26 40 -147 57 151 -84 137 42 351 42 73 -155 -470
7848d70M83j60K08q4k0J77m9j82j55K54j8J14j37J20l38L52l42L84j26j87L22
$$ -470 13 -147 61 -23 -43 134 85 -97 -252 2 -16 98 -39 81 -257 95 -247 137 11 -176 146
7869A46k80M42j66k05J7r5l8J5L68p9k07L4oq8J71J45j23m5j18P3L48q2j25R9
$$ 146 -134 308 142 -63 -46 -141 -179 -164 204 125 -82 -48 -54 -142 29 174 51 6 -112 -39 309 227 102 201
7893B01j88j44K0J83j1m11J43K16Q4n4q9R0m9J43j15l0Nk72J44P9j19K53l03O9
$$ 201 13 -131 -111 72 61 -350 -207 9 93 39 -50 40 -9 134 19 -11 -6 -278 -134 -55 -174 79 -224 -155
7917a55J78j12j1K79O6j02l5j11J09m7r5P6J02J19l78k7k9P1m7J18J41m02J05
$$ -155 23 -89 -100 179 245 143 108 -3 106 59 -36 40 142 261 -117 -144 -173 -102 -149 -31 110 -292 -187
7940a87K03R4r3j39NL12l48m5j08K63L6O2p8L6k1M7J92m06l4K93R7p2k2kj50K5
$$ -187 16 110 17 -122 -117 195 -153 -198 -306 -43 -7 55 -23 13 -8 39 231 -175 -209 84 181 109 87 85 -65 -40
7966d0P9j43J20L0J64j6n7l10K75k9j87o9Q3K56lJ0q5j17J82q9j9M9j1j27J8R3
$$ -40 39 -104 16 46 210 194 137 -173 102 73 -114 -183 -100 156 153 163 78 -39 143 54 35 84 73 -54 -36 57
7992E7l7J32l7k52P8L1L19j17l68M43n33K81l06M28j38k44K04o6l6L32j19K50
$$ 57 20 152 115 -137 -59 -28 291 174 -194 249 -284 -3 -309 119 -19 -263 -59 -125 -161 171 52 302
8014C02m40J6j3J47mO5k25J97j1M0k08K6j28K92q4r9J99L0j53J21j26L73m50K43
$$ 302 -138 -122 -135 12 8 73 -152 45 34 74 -134 -108 -236 56 -28 -127 72 102 -51 70 -56 317 -133 110
8038A10k38O5j23J03j20K66R3k63qL86j74k11N8k7N7Q7o2l8O5j1j97K80K0k62
$$ 110 -128 -63 -186 -83 -203 63 156 -107 -115 271 97 -114 -56 -83 -26 61 -1 -39 26 15 -182 98 118 -144
8062a44Q0J09J25k32r3R5K13RJ09k40j94kj40L52J0j56J10N7j82K80q2j77J84
$$ -144 -64 45 170 -62 -155 -60 153 162 271 31 -163 -165 -305 47 57 -99 11 68 -114 166 84 -93 91
8085I1j4J80j04k04K60m4Jj29J24j42J05K25l18m5j67K55j61N0R2J11j3q9o5J11
$$ 91 77 257 153 -51 209 165 166 37 161 19 124 349 31 -14 -181 74 -87 -37 55 166 153 64 -1 110
8109A10O8l6n02M71j56j10K76J1O5j81r5J97l4OJj31ml7j74K47j71P2K98j43o2
$$ 110 178 142 -360 111 -45 -155 121 132 197 16 -79 118 84 90 91 -40 -44 -81 -255 -8 -179 -107 191 48 -14
8134a4K44m41N0L12j87J56j72Q1j09J4J96l72L27M6k49j78M18K4l14K27k98K96
$$ -14 230 -211 -161 151 -36 120 -52 29 -80 -66 130 -242 85 131 -118 -296 122 146 -168 59 -239 57
8156E7J03k64o3K87j79R4o0n9m9J78N4m8J79o4k52p3J49J63j48K7N8j58r2J34
$$ 57 160 -104 -167 120 -59 35 -25 -84 -133 45 99 51 230 166 -86 -159 -10 153 5 32 90 -68 -160 -26
8180b6L13m49R5J61k03P3j79K02K2m3k7
$$ -26 287 -162 -67 94 -109 -36 -215 -13 9 -34 -61
8191f1
$$ Imaginary data points
##PAGE= N=2
##DATA TABLE= (X++(I..I)), XYDATA
0@%%%%%%%%%%%%Qj6J6j6K4l2L2m0N2o0P2q8J04j20J38j62J88k14K46k82L20l63
$$ 0 0 0 0 0 0 0 0 0 0 0 0 0 8 -8 8 -8 16 -16 16 -24 28 -32 40 -48 56 -64 74 -88 100 -114 132 -150 170 -193
34a93M11m62N20n84O52p29Q11r01J001j110J229j359J501j654J825k011K215k441
$$ -193 218 -244 276 -308 344 -385 426 -475 526 -584 645 -714 787 -867 958 -1053 1162 -1279
52a279K687k964L275l621M014m464M985n594O317p198Q295r705J1593j4266J8385
$$ -1279 1408 -1556 1719 -1902 2112 -2352 2633 -2961 3356 -3842 4453 -5252 6341 -7925 10460
67A0460k5623M2072j51727j7912J78625o2018J5938j8258n4365K9457J32106J5568
$$ 10460 -15163 26909 -124818 -142730 35895 -26123 -10185 -28443 -82808 -53351 78755 94323
79I4323k9340j4291m3160m2538Q6480N2328p4823n5076j90m3732K6330Q4953k4854
$$ 94323 64983 50692 7532 -35006 51474 103802 28979 -26097 -26287 -70019 -43689 41264 16410
92A6410j03227k9694L5576P3186O2454k7840p7748Q829P2694L1765M635P380n0346
$$ 16410 -86817 -116511 -80935 -7749 54705 26865 -50883 -42054 30640 62405 67040 74420 24074
105B4074n5935K8414L3532j9659j8697l1382l5694K9718M8461l157q602P316j1534
$$ 24074 -31861 -3447 30085 10426 -8271 -39653 -75347 -45629 2832 -325 -8927 -1611 -13145
118a3145k685M8990L7454l7943m4122P354J3415Q825J3924k0628l7503l166J7315
$$ -13145 -15830 33160 70614 32671 -11451 -4097 9318 18143 32067 11439 -26064 -29230 -11915
131a1915J4935K848j8008k0035m46K6561K7814p966k1366M859J5339R612P328
$$ -11915 3020 5868 -12140 -32175 -32621 -6060 21754 13788 -7578 -2719 12620 22232 29560
144B9560l875j5730j4685l179N700j834o573p071j4594L581K4591P389j465M025
$$ 29560 25685 9955 -4730 -7909 -2209 -4043 -10616 -17687 -32281 -28700 -4109 3280 1815 5840
158E840p161R83K5791J1127j8256k0484m738O676R601K937j8114k3525O832J4857
$$ 5840 -1321 -338 25453 36580 18324 -2160 -6898 -222 9379 12316 -5798 -29323 -22491 -7634
172g634k374M167O58j7292L759K1956L858p2O090n273o268J1658J2883q022j1778
$$ -7634 -10008 -5841 -5183 -22475 -18716 3240 7098 7026 13116 7843 1575 13233 26116 18094 6316
187F316m658j2789l190J8714j769k3427k077O422K736J6354R426j3931o479J1484
$$ 6316 1658 -11131 -14321 4393 2624 -20803 -22880 -16458 -13722 2632 12058 -1873 -8352 3132
201C132Q541P10K164n598j4762K019J3514m735o434L065r359n520J2653L651p014
$$ 3132 11673 12383 14547 8949 -5813 -3794 9720 4985 -1449 1616 -7743 -13263 -610 3041 -3973
216c973K58o67m429P134J2452o30r056J044K642k125O919J325j6137n592P198
$$ -3973 -3715 -4382 -8811 -1677 10775 10145 1089 2133 4775 2650 9569 10894 -5243 -10835 -3637
231c637j116J05L440n007l221Q568P797m67j064J765k956k761N306o88p777J47
$$ -3637 -4753 -4648 -1208 -6215 -9436 -868 6929 6462 5398 7163 4207 1446 6752 6064 -1713 -1566
247a566j691n500N120M272m397j894N89J200L392L237m07m325L69O266J403j84
$$ -1566 -3257 -8757 -3637 635 -3762 -5656 -5067 -3867 -475 2762 2355 -1970 -1601 4665 6068 5884
263E884J669m018j895L989j618m369k349l971k698J316J099R66l56J769L469K376
$$ 5884 7553 3535 1640 5629 4011 -358 -2707 -6678 -9376 -8060 -6961 -5995 -6351 -4582 -1113 1263
279A263M752L890l009j427J325j640p83q88n204k666m4N17J168j049n19J53j82
$$ 1263 6015 9905 6896 5469 6794 5154 4371 3483 -1721 -4387 -4431 -3914 -2746 -3795 -4314 -4161 -4343
296d343L068K211j952N26J116j39K903K546j056mq29l18K09j934k049k685m079
$$ -4343 -1275 936 -1016 -490 626 487 3390 5936 4880 4876 4047 3729 3938 2004 -45 -2730 -6809
313f809L62Q22p32J885N28L29L907K883J804J097j319j37k54j191K9k563k998
$$ -6809 -6447 -5625 -6357 -4472 -3944 -3615 292 3175 4979 6076 4757 4620 4366 3175 3204 641 -2357
330b357l78K31k20J049q13o33J260M69J040Q22j043J84R10M8K166L09m67K41q34
$$ -2357 -2735 -2504 -2724 -1675 -2488 -3121 -1861 -1392 -352 470 -573 -389 521 569 2735 3044 2577 2818 1984
349A984k22M14j833j466j212j917M80O00n20J221R09R57K375J335L18L29j338
$$ 1984 1762 2176 343 -1123 -2335 -4252 -3772 -3172 -3692 -2471 -1562 -605 1770 3105 3423 3752 2414
366B414j9o7j912j86j311j577M16m0J84J192p9l13J327K08N16M19j032J12P38
$$ 2414 2395 2328 416 230 -1081 -2658 -2242 -2282 -2098 -906 -985 -1298 29 237 753 1172 140 252 990
385I90j10R33n83j048O59q97k07L68j790P8K94j103O77J227o07J428J160J96J010
$$ 990 880 1813 1230 182 841 -56 -263 105 -1685 -1607 -1313 -2416 -1739 -512 -1119 309 1469 1665 2675
404B675K25K78j328j100n3r51j381O75j449j616J898M93k81J364L02l18J774P79
$$ 2675 2900 3178 1850 750 697 -254 -1635 -960 -2409 -4025 -2127 -1634 -1915 -551 -249 -567 1207 1986
422A986l34j84O59N24q77n30R16j985o71R48j939j279R57m82j388J424j23P12
$$ 1986 1652 1468 2127 2651 1774 1244 2160 175 -496 452 -1487 -2766 -1809 -2291 -3679 -2255 -2378 -1666
440a666J501J333J04L86J424N41r37k6l92k132L76j41k091m98N33n60K76N11j51
$$ -1666 -165 1168 1272 1658 3082 3623 2686 2660 2268 136 512 371 -1720 -2218 -1685 -2245 -1969 -1458 -1609
459a609J54J087O33m64J55J859j59l30J138o69q46J547r72k197K87k24j286l26
$$ -1609 -1455 -368 265 -199 -44 1815 1656 1326 2464 1795 949 2496 1524 -673 -386 -610 -1896 -2222
477b222j37m76K85K023O46q99J095K098n08L07R07j970l65J087j725j564R22n99
$$ -2222 -2359 -2835 -2550 -527 119 -780 315 2413 1905 2212 3119 1149 784 1871 146 -1418 -496 -1095
495a095o13N60N1j14J28J411m30o77J151O30r76J257J68j322J047J234j413n54
$$ -1095 -1708 -1148 -1097 -1211 -1083 328 -102 -779 372 1002 26 1283 1451 129 1176 2410 997 443
513D43j93q01l07k96p03j019J041R59j92K70J550l26R83J208r45m94J614j307
$$ 443 250 -551 -858 -1154 -1857 -2876 -1835 -876 -1068 -798 752 426 1409 2617 1672 1178 2792 1485
531A485j183k26q15r01Q55k85r67J05Q95N35j97N67J08l01J257M21j356M30R11
$$ 1485 302 76 -739 -1640 -785 -1070 -2037 -1932 -1037 -502 -699 -132 -24 -325 932 1353 -3 427 1338
550A338j79J38M56j232K92k4j228o47k60o9j97k10J02n4R04J538k22K39R83n98
$$ 1338 1159 1297 1753 521 813 789 -439 -1086 -1346 -1415 -1612 -1822 -1720 -1774 -870 668 446 685 1668 1070
570A070J60J042j627q55R78o47o82K65j02m22L04P18j015m57J190L69j077K31
$$ 1070 1230 2272 645 -210 768 121 -561 -296 -398 -820 -516 202 -813 -1270 -80 289 -788 -557
588e57N39q10J078N99j096N46Q53l91K59j90p92m26P46p13p44N50M17o53M35Q74
$$ -557 -18 -828 250 849 -247 299 1152 761 1020 830 38 -388 358 -355 -1099 -549 -132 -785 -350 524
608E24j256N92J468j199n24J080j074n38J149k50j074P72J018n00j78P19j0j195
$$ 524 -732 -140 1328 129 -395 685 -389 -927 222 -28 -1102 -330 688 188 10 729 719 -476
626d76J297k65j170N06O95j218ON62l45L12N73n78o5J25L30m96l84O27k74J57
$$ -476 821 556 -614 -108 587 -631 -625 -63 -408 -96 477 -101 -166 -41 289 -207 -591 36 -238 -81
646h1J095n94o70R36J7j020N60m14p07M40J60o15J48O73j86N5J40N29m97M40K70
$$ -81 1014 420 -250 686 703 -317 243 -171 -878 -438 -278 -893 -745 -72 -258 -203 -63 466 -31 409 679
667F79m40k22O10m11j46M15o36m2OL50n25J2Q8K05j72k5j02o4L85L05l65O74L7
$$ 679 239 17 627 216 70 485 -151 -193 -187 163 -362 -350 -262 -57 -229 -254 -356 -420 -35 270 -95 579 616
690F16m43K54j49k84Jm81K21l89ON00k61o8N41j19j39L16M0j95L0J95q4P1j62
$$ 616 173 427 278 -6 -5 -486 -265 -654 -648 -148 -409 -477 64 -55 -194 122 162 -33 -3 192 108 179 17
713A7j4K12j33J53l07j80J95k78k62M41j29J03J25j51L77Q8o9J74Q1j79J06j44
$$ 17 3 215 82 235 -72 -252 -57 -335 -597 -156 -285 -182 -57 -208 169 257 188 362 443 264 370 226
735B26j18j54l58k88M48L0J10j11n5k7M40O9p0j04k7K60l17K67K67k01j61K8J68
$$ 226 108 -46 -404 -692 -244 -214 -104 -215 -270 -297 143 212 142 38 11 271 -46 221 488 287 126 154 322
758C22m47L56l07L1n67R7L06k02K50j39J79L42j09J35M33n09j99L72qm46J55l99
$$ 322 -125 231 -76 -45 -612 -515 -209 -411 -161 -300 -121 221 112 247 680 171 -28 344 336 -110 45 -354
780c54M6K20k14L47J8j50J00j3j41M30m69Q4K03k12L15j63m7j43J46J09J64l9
$$ -354 -308 -88 -302 45 63 -87 13 0 -141 289 -180 -96 107 -105 210 47 0 -143 3 112 276 237
802B37m35L59l30J50k1k02J54NNO3R5O5J5j2j3J14k03k35rj86M49j37j35K44o6
$$ 237 -198 161 -169 -19 -40 -242 -88 -83 -78 -15 80 145 160 148 135 249 46 -189 -198 -384 65 -72 -207 37 -29
827b9J40k11K02J03l1l06R1J97k13Pj60j9K44l2r9K11k42Q3K48m87R2J85Pn9K94
$$ -29 111 -100 102 205 174 -132 -41 156 -57 -50 -210 -229 15 -17 -116 95 -147 -64 184 -303 -211 -26 -19 -78 216
852B16l90O22m01j41J3M6J6k29P5K08o3j94M21m16K13J41j88J4J96o8oj54K06
$$ 216 -174 448 47 -94 -81 -35 -19 -248 -173 35 -28 -222 199 -217 -4 137 -51 -37 159 91 85 -69 137
875A37k67O2j91K11k25J75R1J12j64k0k54K47J38k18L41k2k25M30j83J34j11q6
$$ 137 -130 -68 -259 -48 -273 -98 -7 105 -59 -79 -333 -86 52 -166 175 153 -72 358 175 309 198 112
897A12l53L95m07L56l16l18L58p4J63L1j37q3J61K49n3K34j23j76K27j57o7J50
$$ 112 -241 154 -253 103 -213 -531 -173 -247 -84 -53 -190 -273 -112 137 84 318 195 19 246 89 22 172
919A72j14l04J28l72K52k2j46M27O6m8k68K94j01Q6j00K61l6j09n6L85n03K70
$$ 172 58 -246 -118 -490 -238 -260 -406 21 87 39 -229 65 -36 50 -50 211 175 66 10 395 -108 162
941A62m58J62M2J4J85k05l65N70J06m06N2P7k04L75k0k40J68Q0r4R4l5J35l05
$$ 162 -296 -134 -92 -78 107 -98 -463 107 213 -193 -141 -64 -268 107 87 -153 15 95 1 95 60 195 -110
964a10P5L2k23L3K36k62J68o7m6J68L06Mj81j01PK31lq9m62J45J82k39q8K57L5
$$ -110 -35 -3 -226 -193 43 -219 -51 -118 -164 4 310 314 133 32 39 270 267 178 -284 -139 43 -196 -284 -27 8
989HJ92j05l07L7K01K34k49o9J71l06Q9rL18l31L26n1J18m33L67l70j67L31j77
$$ 8 200 95 -212 -175 26 260 11 -58 113 -193 -104 -113 205 -126 200 149 267 -166 201 -169 -336 -5 -182
1012a82K42L4n3N1MO1J03k76L32k64j56L54j55k78N37n80M5M77j52l53M63k65
$$ -182 60 94 41 92 96 157 260 -16 316 52 -104 250 95 -183 354 -226 -181 296 144 -209 254 -11
1034a1j58n1O39n54k38J53J03NK95rj71j44J19R8n9K97k03k39K3L54l96M93l45
$$ -11 -169 -220 419 -135 -373 -220 -117 -112 183 174 3 -141 -22 76 17 314 111 -128 -105 249 -147 346 1
1057Aq1P3l4j37L18k55j7m6J02k50L37J27J7m76L44L02p12L97K53l30J34j94j85
$$ 1 -80 -7 -41 -178 140 -115 -132 -178 -76 -326 11 138 155 -321 23 325 -387 10 263 -67 67 -127 -312
1080c12O9L35K0L1k70jk85M78KJ55j68j07m3j3J2J93j70J41j81M7q3L69l2l93
$$ -312 -243 92 112 143 -127 -128 -413 65 67 222 54 -53 -96 -109 -97 96 -74 67 -114 -67 -150 219 187 -206
1104b06M5L33k96Q0Q6j65M18K3J6j23k15q6Q5k41L27k6j04K44k40l7N1r4K0K2
$$ -206 -161 172 -124 -44 42 -123 295 318 334 211 -4 -90 -5 -246 81 55 -49 195 -45 -82 -31 -125 -105 -83
1128h3R6J61P6l18j26J58K23j21J35k39J41k08M94k43J9j28j11j4K45j42r6K2
$$ -83 13 174 250 -68 -194 -36 187 66 201 -38 103 -105 389 146 165 37 -74 -88 157 15 -81 -59
1150e9K49j34k04L17K07k60o0L44l37J07l1j67j80M14k61j14L18j42lk28M66k45
$$ -59 190 56 -148 169 376 116 56 400 63 170 139 -28 -208 206 -55 -169 149 7 4 -224 242 -3
1172co6N0o4J13o8J78j92J43J8J20j89J24k06j89L73m14L51L9k33J44J49j71J47
$$ -3 -69 -19 -83 30 -38 140 -52 91 109 229 40 164 -42 -231 142 -272 79 118 -115 29 178 7 154
1195A54m67L27n5k37N20j18j94J73kk1J91j91j42J4K14q0j14p5j68K13J21o3j33
$$ 154 -313 14 -41 -278 242 124 -70 103 101 80 271 80 -62 -48 166 86 -28 -103 -271 -58 63 0 -133
1218a33j44K27l5L7o4R0M0J07j02O3MR1k77R5km8n1K28k31K15j89J40j72J4J25
$$ -133 -277 -50 -85 -48 -112 -22 18 125 23 86 90 181 -96 -1 -3 -51 -102 126 -105 110 -79 61 -111 -97 28
1243B8j17L12j25Q2l05J73m1q0L11j27j76Q9L7j19J07l7p9L5q5P2L44l98J06J07
$$ 28 -89 223 98 180 -125 48 7 -73 238 111 -65 24 61 -58 49 12 -67 -32 -117 -45 299 -99 7 114
1267A14J27J00n29P6J26L7p5m8P8j20K36j59Q1j79j5J57L7K8k12N8o4N1j81M04
$$ 114 241 341 -188 -112 14 51 -24 -72 6 -114 122 -37 44 -135 -150 7 44 72 -140 -82 -146 -95 -276 128
1291A28q5j1K84m04m5mJ71l92R5P4J78j25k09K50K51O3k59R9p7o3MJ06k3P2j05
$$ 128 43 32 316 -88 -133 -137 34 -358 -263 -189 -11 -136 -345 -95 156 219 -40 59 -18 -81 -77 29 6 78 -27
1316b7Rj3J81ok25K52k65L02m74K15j9l9L79j84J7k8j98J13J50K3l4m9O6j67J15
$$ -27 -18 -31 150 144 -81 171 -94 208 -266 -51 -70 -109 270 86 103 75 -123 -10 140 163 129 80 146 -21 94
1341I4q9j78Q9L02j83j74J24j33L3K06j32J24m1n8pN1l56L02o5J49J69k57j98
$$ 94 5 -173 -84 218 35 -139 -15 -148 -115 91 -41 83 42 -16 -23 28 -328 -26 -91 58 227 -30 -228
1364b28M40j22k21rL98k46m7J10L1k51J17j18K72L6m56L83J07r8K81j45l03L40
$$ -228 212 90 -131 -140 258 12 -35 75 106 -145 -28 -146 126 162 -294 89 196 98 379 234 -69 271
1386B71m02M04o04O65m52J9oL13k23q0L54k31K8k23K68Nl01L32j28k2M8P5o5j03
$$ 271 -131 273 -331 334 -118 -99 -105 208 -15 -95 259 28 56 -167 101 106 -195 137 9 -13 35 110 45 -58
1410e8K64m90L04K60l12p8K39l14K50q0l2k44K67O6k38L18k20J00k24K84J20n1
$$ -58 206 -284 20 280 -32 -110 129 -185 65 -15 -47 -291 -24 42 -196 122 -98 2 -222 62 182 131
1432A31j80m7J73k37K75q2j10L6Q5j34Q3j80J82N4Q5k64q2Q4M29k09j69L80j37
$$ 131 -49 -96 77 -160 115 33 -77 -41 44 -90 -7 -187 -5 49 134 -130 -212 -128 301 92 -77 303 166
1455A66j87O1R9k64L88j71r3n0L3m9j17L82k86j02k6K37l30L42j26j69K52N5j43
$$ 166 -21 40 139 -125 263 92 -1 -51 -18 -67 -184 198 -88 -190 -216 21 -309 33 -93 -262 -10 45 -98
1478i8K4K05l3j67QR6j33L4O8j71K36O7j21k29L73m6m5Q8Kj08Lnj54K03j50J3
$$ -98 -74 131 98 -69 -61 35 -98 -64 4 -167 69 136 15 -214 159 113 68 156 158 50 53 48 -106 97 -53 -40
1504d0j56M0L80m2k63p5j11J96K4k0J63Kk20K13j31K25j33Qk69L64k52L73j86
$$ -40 -196 -156 224 182 -81 -156 -267 -71 -47 -67 96 98 -122 91 -40 185 52 60 -209 155 -97 276 90
1527I0J35n87M54j86j81M44k52K52j04J07l33L21J1l25k35M65k23l5J24L99l21
$$ 90 225 -362 92 -94 -275 169 -83 169 65 172 -161 160 171 -154 -389 76 -147 -182 -58 341 20
1548B0k08J99J4J1o3j38j26J49K7O2K39j90l87N45j8r6J25k19n0J32O5N5k1m64
$$ 20 -188 11 25 36 -27 -165 -291 -142 -115 -53 186 -4 -391 154 136 40 165 -54 -104 28 93 148 127 -337
1572c37O36k61k58qK56j2J73J14m14o9j13L58m4J5R7l9k16k3K94l63O2J01l7J39
$$ -337 299 38 -220 -228 28 16 189 303 -111 -180 -293 65 21 36 133 94 -122 -145 149 -214 -152 -51 -88 51
1596E1k07K34J93j86k20K41L2k86q0J43K14k89R5k1J67q8J06l91M22j1N7N7k88
$$ 51 -156 78 271 85 -135 106 138 -148 -228 -85 129 -160 -65 -86 81 -7 99 -292 130 119 176 233 -55
1619e5J31l56J83P8J9n3L8jj16N9%K44k53k31M78j87m6L71j79l32M9l0K13Q4j52
$$ -55 76 -280 -97 -19 0 -53 -15 -16 -132 -73 -73 171 -82 -313 165 -22 -68 303 124 -208 -159 -189 24 108 -44
1644d4p8J30N6j64JJ6R5j23J11J22j60K12k60R0L8Q4j61j9J84k42K51k62J32r6
$$ -44 -122 8 64 -100 -99 -83 12 -111 0 122 -38 174 -86 4 42 126 -35 -54 130 -112 139 -123 9 -87
1668h7K64l18L95j36j16NJ08j16n2M0j90J9Nk4L1P2L50l03K45j79j72K57n3o7
$$ -87 177 -141 254 118 2 7 115 -1 -53 -13 -203 -184 -179 -203 -172 -100 250 -53 192 13 -159 98 45 -22
1692b2%N6j36j39K46J18l26M39m96P6J47j25K53j53J69P8p9l0j38j11J98Kq3L9
$$ -22 -22 34 -102 -241 5 123 -203 236 -260 -184 -37 -162 91 -62 107 185 106 76 -62 -173 25 27 -56 -17
1716a7k62K74m5k08J14L3J37k17K04J56k6j15Jp9R2j52K1K12k29J58j38J65kk92
$$ -17 -279 -5 -50 -258 -144 -111 26 -191 13 169 143 28 29 -50 42 -110 -89 123 -106 52 -86 79 77 -215
1740b15K62O3k68L68k69k1J94k6j49n1M9K26Kl06J5K48j56j68K79M1p9J64j37
$$ -215 47 110 -158 210 -59 -80 114 88 -61 -112 -63 163 165 -141 -126 122 -34 -202 77 118 39 203 66
1763F6j15J77r8J86k14o0M0K9r0L39j88k09J98j80p2L74j47n4J47k2jk08J48P5
$$ 66 -49 128 30 216 2 -58 -18 11 -79 260 72 -137 61 -119 -191 183 36 -18 129 107 106 -102 46 121
1787A21k18q9M6K32oj47lj55L18k04J87j28M4J97m4j57J39j12J49m77N45j69K3
$$ 121 -97 -186 -140 92 86 -61 -64 -219 99 -105 82 -46 -2 195 151 -6 133 21 170 -307 238 69 92
1810I2O2oj35j11K8M9M1Q1j36L23l07M4l9M2MN3N2k26L52j62r3K88n55K22j00
$$ 92 154 148 13 -98 -70 -21 20 101 -35 288 -19 25 -14 28 32 85 137 -89 263 101 8 296 -259 -37 -137
1835a37Q8J81k68LJ89k09J55Q8R7j76P9M0j23Q6j31K6L3p6l6P4J64o9j11j52K01
$$ -137 -49 132 -136 -133 56 -153 2 90 187 11 90 130 7 93 -38 -12 21 -55 -91 -17 147 78 -33 -185 16
1860A6K95k75j25O0P8K18k60J12l44K81l11L75k29q9N03k70j99J02j01k42N04
$$ 16 311 36 -89 -29 49 267 7 119 -225 56 -255 120 -109 -198 305 35 -164 -62 -163 -405 99
1881I9l50K70m9r8M5j03J69J45k51Q%L50k47j39K31q0nQ3J86l89J34k96K2M22
$$ 99 -251 19 -30 -128 -83 -186 -17 128 -123 -115 -115 235 -12 -151 80 0 -5 78 264 -125 9 -287 -265 157
1905A57j43n2K46l7R9j81k53K01J64p3p3j10O4P0J79j35k44P9J29j50jK22r1l7
$$ 157 14 -38 208 171 270 89 -164 37 201 128 55 -55 9 79 258 123 -121 -42 87 -63 -64 158 67 30
1929C0l81J52L78N7l11k2k09K97p3P8J11j5Q1j80k16Q8J3l3L12k60L67k78K31
$$ 30 -351 -199 179 236 -75 -97 -306 -9 -82 -4 107 92 173 -7 -223 -135 -122 -155 157 -103 264 -14 217
1952B17j98K8O3o5J31l55J71J51l7p4j97K89r7P5k05L7j61L76J97k69k04J37M2
$$ 217 19 47 110 45 176 -179 -8 143 106 32 -165 124 27 102 -103 -66 -227 149 346 77 -127 10 52
1975E2n6R1q9J06l74P6J81J58J48l44J32r6Q2j7l02J41k68L26j39K49%k35K64
$$ 52 -4 87 -2 104 -270 -194 -13 145 293 -51 81 -15 67 50 -252 -111 -379 -53 -192 57 57 -178 86
1998H6j10K08l0K9j08j58K74K5k97J44j71KJ75J55k95l3K35k55K14J05l12K11
$$ 86 -24 184 154 183 75 -83 191 216 -81 63 -108 -106 69 224 -71 -104 131 -124 90 195 -117 94
2020I4L3n54M71p6L1N1j3k0l6J52j58j44J10K53K2j54r8m7J05l5J8R8n4m4j90
$$ 94 127 -427 44 -32 -1 50 37 17 -19 133 -25 -169 -59 194 216 62 -36 -83 22 -13 5 103 49 5 -185
2045a85M00q4j13j62J69J17j93L51k68J00k82R6JL77k03J05k5j73j76k04P5K51
$$ -185 215 131 18 -144 25 142 -51 300 32 132 -150 -54 -53 324 121 226 201 28 -148 -352 -277 -26
2067b6k9j22J95n3jl45M55k11K6K54j13k35J23r5o8J33L2Q6p3R9k74L99j59J1
$$ -26 -55 -177 18 -35 -36 -381 74 -137 -111 143 30 -205 -82 -177 -245 -112 -80 6 -67 32 -242 157 -2 9
2091IJ60P0l41J3K59j90J84m21L60M6N7j97nRj39N3K04k80L8K43m03J76J20j77
$$ 9 169 239 -102 -89 170 -20 164 -257 103 149 206 9 4 13 -126 -73 131 -149 -111 132 -271 -95 25 -152
2115a52K34j36j37N50l12J5q5J72k85J29K75o6l11K64n4j43J34j18O2L7%j9j69
$$ -152 82 -54 -191 359 47 62 -23 149 -136 -7 268 202 -109 155 101 -42 92 -26 36 73 73 54 -115
2138a15K25J18k90J25J99k50j6p6j46K84N2k03Q5j82jL7K74j81J70j10J20k58
$$ -115 110 228 -62 63 262 12 -4 -80 -226 58 110 -93 -8 -190 -191 -154 120 -61 109 -1 119 -139
2160a39J75J11j28L03j35k64K32Ro3N7l99O8K06j51Q0Nj00K78k13L84m10J55q
$$ -139 36 147 19 322 187 -77 155 164 101 158 -241 -173 33 -118 -38 -33 -133 145 -68 316 -94 61 53
2183E3N4j48K44q1K9J25j36r1k03J38L7k48K54j4l6mR7p3J33l64J32J85j01L6
$$ 53 107 -41 203 122 151 276 140 49 -154 -16 21 -227 27 13 -23 -27 70 -3 130 -234 -102 83 -18 18
2207A8J43l86J39K61j13l13P0L39J48k96m2K28k99K00j31N3O5J96k08J3k16R5
$$ 18 161 -225 -86 175 62 -251 -181 158 306 10 -32 196 -103 97 -34 19 84 280 72 85 -131 -36
2229c6K5J12j17K37j67j6p0j8k8J80ML3r8j40m7J17J70k57j2N3J75l55J69OL05
$$ -36 -11 101 -16 221 54 38 -32 -50 -78 102 106 139 41 -99 -146 -29 141 -116 -128 -75 100 -255 -86 -80 225
2254B25l31L70j94j22J7K57r0N5l05K43j13J94j12q5J12k97K64Q0O4k84nR2k60
$$ 225 -106 264 70 -52 -35 222 132 187 -118 125 12 206 94 9 121 -176 88 168 232 -52 -57 35 -225
2277b25L05o3J88j49N6O4k79J33j97N6Q4j02J01L0j76K33j12O5l8j05N4M32l76
$$ -225 80 17 205 56 112 176 -103 30 -167 -111 -27 -129 -28 2 -174 59 -53 12 -26 -131 -77 355 -21
2300b1K32l90J08j59J80M1n6N1q5o5N2M3Q4l94L29J84o4m30L26J48j26j87L12
$$ -21 211 -179 -71 -230 -50 -9 -65 -14 -99 -164 -112 -69 15 -379 -50 134 70 -360 -34 114 -12 -199 113
2323A13k11J21o4pJ06q3M1L4q6J02J36l11K58Pj68R1M4k37p4K39J00k12J46o2
$$ 113 -98 23 -41 -48 58 -25 16 50 -36 66 202 -109 149 156 -12 79 123 -114 -188 51 151 -61 85 23
2347B3j59K95l10p9N2K54p3k4j39p1J62j51L03M3k38J06j20L91j26j98K81k74
$$ 23 -136 159 -151 -230 -178 76 3 -21 -160 -231 -69 -220 83 126 -112 -6 -126 265 139 -59 222 -52
2369e2k7j54L27m06L82R1j59k1k58P4J08P9l4J44q6k43J84J32j54K84m57K89k3
$$ -52 -79 -233 94 -312 70 161 2 -19 -277 -203 -95 -16 -50 94 8 -235 -51 81 -73 211 -246 43 20
2392B0j09J57R9j96l08K22J42k95O1J08J64j33J56J89k22m65M62k8k50K21R1k02
$$ 20 -89 68 167 -29 -337 -115 27 -268 -207 -99 65 -68 88 277 55 -410 52 24 -226 -5 86 -116
2414a16J2J2J58o2n2M6KKl9J73j62r9k0L80Q0m32R6K87m22M6J07k13R2K63k75
$$ -116 -104 -92 66 4 -48 -2 0 2 -37 136 -26 -125 -145 235 315 -117 -21 266 -156 -110 -3 -216 -124 139 -136
2439a36P6J67J88j62p1r3K56l21M45l51O7N6q6k0j17J67Q2J54j75o0J08k86L87
$$ -136 -60 107 295 133 62 -31 225 -96 349 -2 65 121 35 15 -102 65 147 301 126 66 174 -112 275
2462B75l55rJ87k33K73l40J99J09j88N4P3k10J86k12K13N0K03l97m0j3J93J95
$$ 275 -80 -89 98 -135 138 -202 -3 106 -82 -28 45 -165 21 -191 22 72 275 -122 -162 -175 18 213
2484B13n52L09j85L77j11k10Q0K96k78M8L90k74j41oN4j81K35K9j07K63j48N0
$$ 213 -339 -30 -215 162 51 -159 -79 217 -61 -13 377 103 -38 -44 10 -171 64 93 -14 249 101 151
2506A51r9j36K55m06M59l40L40l09L9k97L94j5Q4l00J07O6Q1j17K0p7K5K72k54
$$ 151 52 -84 171 -235 224 -116 224 -85 -46 -343 51 36 120 -180 -73 -7 74 -43 -23 -100 -75 197 -57
2529e7K83k54J61n7J82j15j32J12j36o1K51r3j1O2om14J42L11k93O6J37j25j18
$$ -57 226 -28 133 76 258 143 11 123 -13 -74 177 84 73 135 129 -285 -143 168 -125 -59 78 -47 -165
2552a65J17Q9P3j97O8qK4Q4J1j13J24l90J93j38K45J3j66q9M03q6j83j9J76j3
$$ -165 -48 41 114 -83 -15 -23 1 85 96 -17 107 -283 -90 -228 17 30 -136 -225 178 92 -91 -110 66 53
2576E3M1J50j64Kk18Q6J30j70L10l78K69k68J9K69j23j05K07l85L88r2L32k42
$$ 53 94 244 80 82 -136 -50 80 -90 220 -158 111 -157 -138 131 8 -97 110 -275 113 21 353 111
2598A11j17rN6p7N8o6k00Q7J94J48m1j00J34l25K67qj71k7L7L51j95j74j93J77
$$ 111 -6 -15 41 -36 22 -44 -244 -157 37 185 144 44 178 -147 120 112 -59 -86 -49 302 107 -67 -260 -83
2622h3J45J28l60l8M75n26L31L0j79O5j09P2J71k12J26k05P1n7K55n5j07j86L59
$$ -83 62 190 -170 -208 267 -259 72 102 -77 -12 -121 -49 122 -90 36 -169 -98 -155 100 45 -62 -248 111
2645A11j98K88k76qJ24M00m53K47k42rl3j4L00m55J27q3j20J70K08j63R8j82J47
$$ 111 -87 201 -75 -83 41 441 -12 235 -7 -16 -49 -63 237 -218 -91 -174 -294 -124 84 -79 19 -163 -16
2668a6j7j25O5j7J53l2N9j57j5J64j9k61K60J2K2J86j38Q0j19j64j46J6K81j55
$$ -16 -33 -158 -93 -110 43 11 70 -87 -102 62 43 -218 42 54 76 262 124 204 85 -79 -225 -209 72 -83
2692h3q1J01J42K20k89J5p7R0M00m30j27n3NJ71r9R1j46J7J13K37j00n4k98P8
$$ -83 -164 -63 79 299 10 25 -52 38 438 8 -119 -172 -167 4 -95 -4 -150 -133 -20 217 117 63 -235 -157
2716a57J07k4j29J34J77L6m36M58k36Nj29J91k6J94o8j40O1Q8j49N3j71J40K83
$$ -157 -50 -74 -203 -69 108 144 -292 166 -70 -65 -194 -3 -29 165 97 -43 18 106 -43 10 -161 -21 262
2739B62m53J76L8J75k58J47j75J70k96J23q7P0q3K19M7m4L5j88l1L13o2k13q4
$$ 262 -191 -15 23 198 -60 87 -88 82 -214 -91 -178 -108 -191 28 75 31 66 -122 -153 160 98 -115 -199
2762a99K20J51l16Q1N4J51r7j22J12O5M8k96J1K20O1k35L23k36j08K84k25M2P3
$$ -199 21 172 -144 -63 -9 142 45 -77 35 100 148 -148 -137 83 144 -91 232 -4 -112 172 -53 -11 62
2785F2j26m7M6J80j0m27L20J58k31P2J04l20N7K16j06K07k19r2K41q3k39R5J56
$$ 62 -64 -111 -65 115 105 -322 -2 156 -75 -3 101 -219 -162 54 -52 155 -64 -156 85 2 -237 -142 14
2808A4O8m4K5Rj67K8J61j43M8k81K93j57L9NJ04k70L36j19J44j35j4K67n4l8k26
$$ 14 82 38 63 72 -95 -67 94 -49 -1 -282 11 -146 -107 -102 2 -268 68 -51 93 -42 -56 211 157 119 -107
2833a07M17m79p8L75m24M86p9j50q2O5L04l81K7P6R9j60r2Q6J99m3j23l2k65K56
$$ -107 310 -169 -247 128 -296 190 111 -39 -121 -56 248 -133 -106 -30 69 -91 -183 -97 102 59 -64 -96 -361 -105
2857a05O5o1lQ6m3n2J39p7r7J72J20l35J31N5M8j23J4n6L31n7l75J63J1J7k0J07
$$ -105 -40 -101 -104 -18 -61 -113 26 -51 -148 24 144 -191 -60 -5 43 -80 -66 -122 209 152 -223 -60 -49 -32 -52 55
2883E5O4k15L3r6K54R2k31q6K03m19J66P7%q9J64J10Q3j61K6j09J02j86K23lJ26
$$ 55 119 -96 -63 -159 95 187 -44 -130 73 -346 -180 -103 -103 -192 -28 82 165 4 30 -79 23 -163 60 57 183
2908A83l48J04J9L46m45K59j24j80r0L59k57K84k15L13k00J31K7jk41P6K28m68
$$ 183 -165 -61 -42 304 -141 118 -6 -186 -276 83 -174 110 -105 208 8 139 166 165 -76 0 228 -240
2930b40K68j1R9l49L55k94j95O32k94J97k32J78L2pJ26m55J14j54J61J77l13J50
$$ -240 28 17 116 -233 122 -172 -367 265 -29 168 -64 114 146 139 265 -190 -76 -230 -69 108 -205 -55
2952e5J36k63P0J02N8M0q9j48Q5n8M8K53l90J98j57K37k11K78o8L7l00R2l2J08
$$ -55 81 -182 -112 -10 48 88 -1 -149 -64 -122 -74 179 -211 -13 -170 67 -144 134 66 103 -197 -105 -137 -29
2976b9j09L90k69qk04N08j31L6k00k7J71m8j29j89J55J20%p9K10j65K49j22p2
$$ -29 -138 252 -17 -25 -229 279 148 184 -16 -43 128 80 -49 -238 -83 37 37 -42 168 3 252 130 58
2999E8K37m25NM1k2K49j29k12n8O0K32q6L3j9J23p7M2Rm2j40rJ04Ro4R1K7r6n
$$ 58 295 -130 -125 -84 -106 143 14 -198 -256 -196 36 -50 -17 -36 87 10 52 61 19 -121 -130 -26 -17 -81 10 37 -59 -64
3027f4K52l53J95k9j99K54N8K58l50M6j07k40L73M3j81k79K77q1j4L20J00l95
$$ -64 188 -165 30 1 -198 56 114 372 22 68 -39 -279 94 137 -44 -323 -46 -127 -141 179 279 -116
3049a16L7l1n6p0K29k4K21o8j51M2j58J98J6j79r1L72j48K0k9J25L3j35o1m7N5
$$ -116 -79 -110 -166 -236 -7 -31 190 122 -29 13 -145 53 69 -110 -201 171 23 43 14 139 172 37 -24 -71 -16
3074a6kK3k21L67j69o2K26r2J21jnL2k17r3N8o8L79j37Jk59L0J12k2j24K05M8
$$ -16 -18 5 -216 151 -18 -80 146 54 175 174 169 201 -16 -109 -51 -119 260 123 124 -135 -105 7 -15 -139 66 114
3100A14j05J52r5k02J83j86q8L18M7j11j78K90r7O1j43K36Rkk18K59k66m9n0N8
$$ 114 9 161 66 -136 47 -139 -227 91 138 27 -151 139 42 103 -40 196 205 203 -15 244 -22 -71 -121 -63
3124f3PJ76k76L2J98J0J02r3k6j38K17k86L01l03P3K13J77k91j78k28L94J0l4
$$ -63 -56 120 -156 -124 74 84 186 93 67 -71 146 -140 161 -142 -69 144 321 30 -148 -376 18 28 -6
3147fp7N61n08J27k37R2%J52j64J10l2j05R1j0j86l7J10J52J12k49K06j96L84
$$ -6 -83 478 -30 97 -140 -48 -48 104 -60 50 18 -87 4 -6 -192 -229 -119 33 145 -104 102 -94 290
3170B90k32Rr5K29J51l44J57k87J24j30J8O5J58K08k84R0m9j76J20j28M9k25M15
$$ 290 58 67 -28 201 352 8 165 -122 2 -128 -110 -45 113 321 37 127 78 -98 22 -106 -57 -282 133
3193A33j89o7Q1Nk81J07M5K63J60o25N65j09N9l66L50m33N32j75k30K90l33J93
$$ 133 -56 -123 -42 -37 -318 -211 -166 97 257 -368 197 88 147 -219 131 -302 230 55 -175 115 -218 -25
3215b5pL5P6J8k58K26lj3J84l79L13J85l44K13k61K8K59m42L87k37jj39J70m5
$$ -25 -32 3 79 97 -161 65 62 49 233 -146 167 352 8 221 -40 -12 247 -195 192 -45 -46 -185 -15 -60
3239f0j03J24LR9r4K81k81q1R9P7l57L19k20L26K14m00L6j75N38j24l80J35p0
$$ -60 -163 -39 -36 63 -31 250 -31 -112 -13 64 -293 26 -194 132 346 -54 -18 -193 345 221 -159 -24 -94
3262i4J10Q0J2l14J82Q4n1j73J69j05K22l16J33P1j55j7K17l5p0L4J7r0J0K11
$$ -94 16 96 108 -206 -24 60 9 -164 5 -100 122 -194 -61 10 -145 -162 55 20 -50 -16 1 -89 -79 132
3286A32j71L7o6Pj6n4K03m3j2j68R8Q1r1J50j26J33j54K34l30M0J70j61j18J0
$$ 132 -39 -2 -68 -61 -77 -131 72 29 17 -151 -53 28 -63 87 -39 94 -60 174 -156 -116 54 -107 -225 -215
3310b15J54m6K09p1n9R6j13N9N7p4O9j25K15j95j17n8L01M7Op4jp1lj01o7j28
$$ -215 -61 -107 102 31 -28 68 -45 14 71 -3 66 -59 156 -39 -156 -214 87 134 140 66 65 -6 -9 -110 -177 -305
3336c05N3K70j3l9R3k23J52j59J34p9L48l43l9J51j0J80j52J06k46l4m2Oj68M15
$$ -305 -252 18 5 -34 59 -164 -12 -171 -37 -116 232 -111 -150 1 -9 171 19 125 -121 -155 -197 -191 -359 56
3360E6p8l6J37j90K46j58J93j17l97N32p8k04K21k16K55k51mN7J89j60j74J3K89
$$ 56 -22 -58 79 -111 135 -23 170 53 -344 188 110 -94 127 -89 166 -85 -89 -32 157 -3 -177 -164 125
3383A25Rj76J82K7k36k35M33n6m6j74N2K26n15L39l0L0k51O51l38j78K2j03L34
$$ 125 134 -42 140 167 -69 -304 129 73 27 -147 -95 131 -384 -45 -75 -45 -296 355 17 -161 -139 -242 92
3406I2J1k43j66N35k39L9J63j25j87K08j09l0J00l31L34q1m2j41K39k8n5K8R9
$$ 92 103 -140 -306 229 -10 29 192 67 -120 88 -21 -51 49 -282 52 -29 -71 -212 27 -1 -56 -28 71
3429G1j8j6P0k76K15Q4l88P2M15l18MK30j86L10j53j99J70j86K33l02J88j89M0
$$ 71 53 37 107 -169 46 130 -258 -186 229 -89 -85 145 -41 269 116 -83 87 -99 134 -168 20 -169 -129
3452a29j8n4K11j52p9K06J84l1k2k25j02J86RJ79J4J30l43j26J04J9L2J18k51
$$ -129 -147 -201 10 -142 -221 -15 169 138 116 -109 -211 -25 -16 163 177 307 -36 -162 -58 -39 -7 111 -140
3475a40K7J36j62K48j46K39o5j83j34L44kj68J79k94K66p2j55K59k97J92p0k01
$$ -140 -113 23 -139 109 -37 202 137 -46 -180 164 162 -6 173 -121 145 73 -82 177 -120 72 2 -199
3497a99J13RK62k44k7K4K35j37L0k57k07J90j24M67j32J50L0j30j29K53O8l13
$$ -199 -86 -77 185 -59 -86 -62 173 36 66 -191 -398 -208 -332 135 3 153 183 53 -76 177 245 -68
3519f8j48K38J78m18L73j55r3K10m6r8l1Q7j04Jj32L41r5q9R7K6j64K28j53j13
$$ -68 -216 22 200 -218 155 0 -93 117 71 -27 -58 29 -75 -74 -206 135 40 -49 48 74 -90 138 -15 -128
3543a28q0N3L54j04N5J51N8k93M8P1j76J09j68j60K37J7k5j33j0J12m56N56J50
$$ -128 -208 -155 199 95 150 301 359 66 114 185 9 118 -50 -210 27 44 19 -114 -124 -12 -468 88 238
3566B38L8j07k83J97j62K6J55k7k65J78jlL18k23nk76K86j83j30J13J16O1O4j52
$$ 238 276 169 -114 83 -79 -53 102 75 -190 -12 -13 -16 302 79 74 -202 84 -99 -229 -116 0 61 125 -27
3590b7J38j69J8J15r6R4k57L01k43L8J38o5n6K74Ok23J77j65R9j46J01j08o1k
$$ -27 111 -58 -40 75 -21 73 -184 117 -126 -88 50 -15 -71 203 209 -14 163 -2 97 -49 52 -56 -117 -119
3614a19j1K0o2N1P0K72j54l8J97j37K8j18j72r4J57k3L35k19O0Jo9k6q4K38L7
$$ -119 -130 -110 -172 -121 -51 221 67 29 226 89 117 -1 -173 -267 -110 -133 202 -17 43 44 -25 -51 -135 103 140
3639A40o0p2o8q4R2p6N5k16K47K40k21J43R3k67j12L03j55o3k9K49j85J12k14
$$ 140 80 8 -60 -144 -52 -128 -73 -289 -42 198 -23 120 213 -54 -166 137 -18 -81 -110 139 -46 66 -148
3662a48k2L04j58J77j0l32L9J10J69j27k09J66l0K96q8j71n7M9p1J19j0mp1J20
$$ -148 -170 134 -24 153 143 -189 -150 -40 129 2 -207 -41 -71 225 137 -34 -91 -42 -113 6 -4 -8 -79 41
3686D1o8l2j3R4O7m9q4J06J5N7o2K3j55K17n5j74K01q6j22K48m04J83m3J22j20
$$ 41 -27 -59 -72 22 89 40 -44 62 77 134 72 95 -60 157 102 -72 129 43 -79 169 -235 -52 -95 27 -93
3711i3P7K7j48L28k97N0J20k5j47N5Q1j33M8L20k92j52j36O36j95k94J2RL14k72
$$ -93 -16 11 -137 191 -106 -56 64 39 -108 -53 28 -105 -57 263 -29 -181 -317 319 124 -170 -158 -149 165 -107
3735a07j21K12j18J66j19J41J9N6J9k94J55j26J45m9p8L2o8K94l62K31j38J66
$$ -107 -228 -16 -134 32 -87 54 73 129 148 -146 9 -117 28 -21 -99 -67 -135 159 -203 28 -110 56
3757E6o7k58M12k06j19J80M62l28k05l6J74q0R4l58N09j57R3r6J38m54K43k93
$$ 56 -11 -269 143 -63 -182 -2 460 132 -73 -109 65 -15 79 -279 230 73 166 70 208 -246 -3 -296
3779b96K78l3L5l1k1lN8j81J40K29r1J15j00j12K84k86K83l98k31L70n0j5n4J8
$$ -296 -18 -51 -16 -47 -68 -71 -13 -194 -54 175 84 199 99 -13 271 -15 268 -130 -361 9 -41 -56 -110 -92
3803i2j32J80R3M6r6j56J05r8K41l75K93K22j54j9%l12K93M9K6jrrp4j27K01M0
$$ -92 -224 -44 49 95 -1 -157 -52 -150 91 -284 9 231 77 58 58 -254 39 88 114 113 104 95 21 -106 95 135
3829A35k03K08l51L30j55j05L9L37j56J8J36k05J87r7j44k18K84j10L07q6k42
$$ 135 -68 140 -211 119 -36 -141 -102 235 79 97 233 28 215 118 -26 -244 40 -70 237 151 -91
3850i1J25j36J41J3k24J19J13o5Q7RK69j86l33J14K16k19l2J35j48K32j01L2k81
$$ -91 34 -102 39 52 -172 -53 60 -5 82 91 360 174 -159 -45 171 -48 -80 55 -93 139 38 70 -211
3873b11M5K53q7J21K7K3j08k66L77l85J34K22k92J97k41K50M5N9j61j78J88o9
$$ -211 -166 87 0 121 148 171 63 -203 174 -211 -77 145 -147 50 -191 59 104 163 2 -176 12 -57
3895e7J02N9j27k04K64j55m5JK26j14k42j6J14J37j05M8l2K08Q9n11L82j08J00
$$ -57 45 104 -23 -227 37 -118 -163 -162 64 -50 -292 -308 -194 -57 -162 -114 -146 62 151 -360 22 -86 14
3918A4J8K70j52Qk19M4J12l22K63Pj4P7J37m48L12j25J91r1p4K55m04M75n27J71
$$ 14 32 302 150 158 -61 -17 95 -227 36 43 29 106 243 -205 107 -18 173 82 8 263 -141 334 -193 -22
3942b2K9j71R2J66M0k97K34J17k79J27RK7J50j00l71L39k84L13j86K17k73M63
$$ -22 7 -164 -72 94 134 -163 71 188 -91 36 45 72 222 122 -249 90 -194 119 -67 150 -123 340
3964C40l42J9Q8j60J11L2j26O6k6NMj72J80O6j0j37L55k43k46L47Jj51j75J93
$$ 340 -2 17 105 -55 56 88 -38 28 2 7 11 -161 19 85 75 -62 293 50 -196 151 152 1 -174 19
3988A9J69l29j26K44J34k69L88l92n1J67K05j85q4nJ08k25L86O4l43L45j22j35
$$ 19 188 -141 -267 -23 111 -158 230 -162 -213 -46 159 -26 -110 -115 -7 -232 154 218 -125 220 98 -37
4010c7j12J45M6OK9NJ0j72m4P3n1J71j35j94J14K40j27K22l71M44k96o3J66k19
$$ -37 -149 -4 42 48 77 82 92 -80 -124 -51 -102 69 -66 -260 -146 94 -33 189 -182 262 -34 -97 69 -150
4034a50K31k19J38K3k24P0J33j34k4J38Q7m46L04K05j18J55j59J43J02k63k22
$$ -150 81 -138 0 23 -201 -131 2 -132 -156 -18 69 -377 -73 132 14 169 10 153 255 -8 -230
4055b30L85OO2j27J56k43K09O7l43n6K12k35J85k9o1J5k4J67k60lK89l14K87k68
$$ -230 155 161 223 96 252 9 218 285 -58 -114 98 -137 48 19 -42 -27 -51 116 -144 -147 142 -172 115 -153
4079a53JN45j08k20j78n4R2Q2j61M1J14o4M22k67j8j33l1j97L17q6J80k60K09
$$ -153 -152 393 285 65 -113 -167 -75 7 -154 -113 1 -63 359 92 74 -59 -90 -287 30 -56 124 -136 73
4102G3N1k31J36r0k62K96J10o0M2r7J50K4j76K13k00j8J19j00k14J82k34Q7M3
$$ 73 124 -107 29 -61 -323 -27 83 23 65 -32 118 142 -34 179 -21 -39 80 -20 -234 -52 -286 -199 -156
4125a56m1L87k27Q4j72j9K27k1r8M5J81p6j09J16k37n4J91j73L18l20L32J03j14
$$ -156 -197 190 -37 47 -125 -144 83 62 -36 9 190 114 5 121 -116 -170 21 -152 166 -154 178 281 167
4148A67j77M3p7p5L86k69o7R2J17o31M09K0L75m69j1L15j77QO8l7N1l31J42O7
$$ 167 -10 33 -44 -119 267 -2 -69 23 140 -491 -82 -62 313 -156 -167 148 -29 -21 47 10 61 -270 -128 -61
4172f1J50m9J03l71J87M4J28r3k4J00j01J57k39M5j18J98j80K8PL6O3O2j33q0
$$ -61 89 40 143 -228 -41 3 131 38 14 114 13 170 -69 -24 -142 56 -124 -96 -89 -53 10 72 -61 -141
4196a41N8K04j89J69K0k41J65L2l0k62J61k2J20j03K55p7j93K88k67K36r5M3j15
$$ -141 -83 121 -68 101 121 -120 45 77 47 -215 -54 -76 44 -59 196 119 -74 214 -53 183 88 131 16
4219A6J5k23K57j61K8q1K49p2r7J14m48J61J77MK87lj41LKl48K18K3K40j85Q3
$$ 16 31 -192 65 -96 -68 -149 100 28 -69 45 -403 -242 -65 -61 226 223 82 85 87 -261 -43 -20 220 35 118
4244A18k40J81l0K25j24J7l4j00M5J22l40K33j10%J59Lj96L97n60L36K9k21J10
$$ 118 -122 59 29 254 130 147 113 13 58 180 -160 73 -37 -37 122 125 -71 326 -234 102 131 -90 20
4267B0O3jo9K92m13J08J01q6o2K6O6j99K68l53M04k76N8K17j94j56o0L17m1j4
$$ 20 83 82 13 305 -108 0 101 15 -47 -21 45 -154 114 -239 165 -111 -53 164 -30 -186 -246 71 30 16
4291A6j58k28L91N9j30Q3j64J22P5m05K40M7J16K98l13l26J87K45k36J8J16J29
$$ 16 -142 -370 21 80 -50 33 -131 -9 66 -339 -99 -52 64 362 49 -277 -90 155 -81 -63 53 182
4313A82k26k1L5p8qK05K11l60J92J7J09l07M2K35l82O05l80k31J67r2L5J05R8
$$ 182 -44 -65 -30 -108 -116 89 300 -60 132 149 258 -49 -7 228 -154 451 71 -160 7 -85 -50 55 153
4336A53j58rK6j55O9L0K06O8j40J83j32k91M51m07j8k5N8J40R6n7o6j77L1K26
$$ 153 -5 -14 12 -143 -74 -44 162 230 90 273 141 -150 301 -106 -124 -149 -91 49 145 88 22 -155 -124 102
$$ [...]
8191H
##END NTUPLES=NMR FID
##END=
