##TITLE=1H_DE-82K
 200.13MHz, CDCl3,
 8 sc
 
 26.3.2025
##JCAMPDX= 6.0         $$ Bruker NMR JCAMP-DX V2.0
##DATA TYPE= NMR FID
##DATA CLASS= NTUPLES
##ORIGIN= UXNMR, Bruker Analytische Messtechnik GmbH
##OWNER= pz
$$ XWIN-NMR		Version 3.5
$$ Wed Mar 26 13:56:39 2025 Russian Standard Time (UT+4h)  she@DPX200
##.OBSERVE FREQUENCY= 200.1313
##.OBSERVE NUCLEUS= ^1H
##.DELAY= (6, 6)
##.ACQUISITION MODE= SIMULTANEOUS
##.ACQUISITION SCHEME= undefined
##.AVERAGES= 8
##.DIGITISER RES= 18
##SPECTROMETER/DATA SYSTEM= spect
##.PULSE SEQUENCE= zg30
##.SOLVENT NAME= CDCl3
##.SHIFT REFERENCE= (INTERNAL, CDCl3, 0, 14.3821)
##AUDIT TRAIL= $$ (NUMBER, WHEN, WHO, WHERE, WHAT)
$$ ##TITLE= Audit trail, XWIN-NMR		Version 3.5
$$ ##JCAMPDX= 5.01
$$ ##ORIGIN= Bruker BioSpin GmbH
$$ ##OWNER= she
$$ F:/spectra/data/she/nmr/H-C/1/audita.txt
$$ ##AUDIT TRAIL=  $$ (NUMBER, WHEN, WHO, WHERE, WHAT)
(   1,<2025-03-26 13:55:29.40 +0400>,<she>,<DPX200>,
      <created by zg, POWCHK disabled, PULCHK disabled
       configuration hash MD5:
       00 E9 B6 7A A2 85 ED C7 34 08 36 98 17 FE 4E 26
       data hash MD5: 16K
       3F 36 F2 FB 24 26 AA 17 16 40 EA AA 48 BC 26 15>)
$$ ##END=
$$ 
$$ hash MD5
$$ F9 01 32 FD C0 2E 61 16 BF 59 7D 1F 5A 79 F5 57
##$RELAX= 
##$RELAX= 
##$RELAX= 
##$RELAX= 
##$RELAX= 
##$RELAX= 
$$ Bruker specific parameters
$$ --------------------------
##$DU= <F:/spectra>
##$EXPNO= 1
##$NAME= <H-C>
##$PROCNO= 1
##$TYPE= <nmr>
##$USER= <she>
##$AMP= (0..31)
100 100 100 100 100 100 100 100 100 100 100 100 100 100 100 100 100 100 
100 100 100 100 100 100 100 100 100 100 100 100 100 100 
##$AQSEQ= 0
##$AQ_mod= 1
##$AUNM= <au_zg>
##$AUTOPOS= <>
##$BF1= 200.13
##$BF2= 200.13
##$BF3= 200.13
##$BF4= 200.13
##$BF5= 200.13
##$BF6= 200.13
##$BF7= 200.13
##$BF8= 200.13
##$BYTORDA= 1
##$CFDGTYP= 0
##$CFRGTYP= 5
##$CHEMSTR= <none>
##$CNST= (0..31)
1 1 145 1 1 1 1 1 1 1 1 1 1 1 1 1 1 1 1 1 1 1 1 1 1 1 1 1 1 1 1 1 
##$CPDPRG= <>
##$CPDPRG1= <>
##$CPDPRG2= <>
##$CPDPRG3= <>
##$CPDPRG4= <mlev>
##$CPDPRG5= <mlev>
##$CPDPRG6= <mlev>
##$CPDPRG7= <mlev>
##$CPDPRG8= <mlev>
##$CPDPRGB= <>
##$CPDPRGT= <>
##$D= (0..31)
0 0.7 0 0 0 0 0 0 0 0 0 0.03 0 0 0 0 0 0 0 0 0 0 0 0 0 0 0 0 0 0 0 0 
##$DATE= 1742982928
##$DBL= (0..7)
120 120 120 120 120 120 120 120 
##$DBP= (0..7)
150 150 150 150 150 150 150 150 
##$DBP07= 0
##$DBPNAM0= <>
##$DBPNAM1= <>
##$DBPNAM2= <>
##$DBPNAM3= <>
##$DBPNAM4= <>
##$DBPNAM5= <>
##$DBPNAM6= <>
##$DBPNAM7= <>
##$DBPOAL= (0..7)
0.5 0.5 0.5 0.5 0.5 0.5 0.5 0.5 
##$DBPOFFS= (0..7)
0 0 0 0 0 0 0 0 
##$DE= 6
##$DECBNUC= <off>
##$DECIM= 32
##$DECNUC= <off>
##$DECSTAT= 4
##$DIGMOD= 1
##$DIGTYP= 9
##$DL= (0..7)
0 120 120 120 120 120 120 120 
##$DP= (0..7)
150 150 150 150 150 150 150 150 
##$DP07= 0
##$DPNAME0= <>
##$DPNAME1= <>
##$DPNAME2= <>
##$DPNAME3= <>
##$DPNAME4= <>
##$DPNAME5= <>
##$DPNAME6= <>
##$DPNAME7= <>
##$DPOAL= (0..7)
0.5 0.5 0.5 0.5 0.5 0.5 0.5 0.5 
##$DPOFFS= (0..7)
0 0 0 0 0 0 0 0 
##$DQDMODE= 0
##$DR= 18
##$DS= 0
##$DSLIST= <SSSSSSSSSSSSSSS>
$$ [...]
##$SUBNAM0= <"">
##$SUBNAM1= <"">
##$SUBNAM2= <"">
##$SUBNAM3= <"">
##$SUBNAM4= <"">
##$SUBNAM5= <"">
##$SUBNAM6= <"">
##$SUBNAM7= <"">
##$SUBNAM8= <"">
##$SUBNAM9= <"">
##$SW= 18.0517328524113
##$SWIBOX= (0..15)
0 0 2 0 0 0 0 0 0 0 0 0 0 0 0 0 
##$SW_h= 3612.71676300578
##$TD= 16384
##$TD0= 1
##$TE= 0
##$TE2= 300
##$TE3= 300
##$TEG= 300
##$TL= (0..7)
0 120 120 120 120 120 120 120 
##$TP= (0..7)
150 150 150 150 150 150 150 150 
##$TP07= 0
##$TPNAME0= <>
##$TPNAME1= <>
##$TPNAME2= <>
##$TPNAME3= <>
##$TPNAME4= <>
##$TPNAME5= <>
##$TPNAME6= <>
##$TPNAME7= <>
##$TPOAL= (0..7)
0.5 0.5 0.5 0.5 0.5 0.5 0.5 0.5 
##$TPOFFS= (0..7)
0 0 0 0 0 0 0 0 
##$TUNHIN= 0
##$TUNHOUT= 0
##$TUNXOUT= 0
##$USERA1= <user>
##$USERA2= <user>
##$USERA3= <user>
##$USERA4= <user>
##$USERA5= <user>
##$V9= 5
##$VALIST= <valist>
##$VCLIST= <CCCCCCCCCCCCCCC>
##$VD= 0
##$VDLIST= <DDDDDDDDDDDDDDD>
##$VPLIST= <PPPPPPPPPPPPPPP>
##$VTLIST= <TTTTTTTTTTTTTTT>
##$WBST= 1024
##$WBSW= 4
##$XGAIN= (0..3)
0 0 0 0 
##$XL= 0
##$YL= 0
##$YMAX_a= 187273
##$YMIN_a= -217788
##$ZGOPTNS= <>
##$ZL1= 120
##$ZL2= 120
##$ZL3= 120
##$ZL4= 120
##$ABSF1= 10
##$ABSF2= 0
##$ABSG= 5
##$ABSL= 3
##$ALPHA= 0
##$AQORDER= 0
##$ASSFAC= 0
##$ASSFACI= 0
##$ASSFACX= 0
##$ASSWID= 0
##$AUNMP= <proc_1d>
##$AZFE= 0.1
##$AZFW= 0.1
##$BCFW= 1
##$BC_mod= 2
##$BYTORDP= 1
##$COROFFS= 0
##$CY= -3
##$DATMOD= 1
##$DC= 2
##$DFILT= <>
##$DTYPP= 0
##$F1P= 0
##$F2P= 0
##$FCOR= 0.5
##$FTSIZE= 0
##$FT_mod= 4
##$GAMMA= 1
##$GB= 0.15
##$INTBC= 1
##$INTSCL= 1
##$ISEN= 128
##$LB= 0.25
##$LEV0= 0
##$LPBIN= 0
##$MAXI= 10000
##$MC2= 0
##$MEAN= 0
##$ME_mod= 0
##$MI= 1.114404
##$NCOEF= 0
##$NC_proc= 0
##$NLEV= 6
##$NOISF1= 3.799351
##$NOISF2= 2.8
##$NSP= 1
##$NTH_PI= 0
##$NZP= 0
##$OFFSET= 14.38212
##$PC= 1
##$PHC0= -466.2014
##$PHC1= 9.192209
##$PH_mod= 1
##$PKNL= yes
##$PPARMOD= 0
##$PSCAL= 0
##$PSIGN= 0
##$REVERSE= no
##$SF= 200.129724274929
##$SI= 16384
##$SIGF1= 3
##$SIGF2= 2
##$SINO= 400
##$SIOLD= 16384
##$SREGLST= <1H.CDCl3>
##$SSB= 0
##$STSI= 0
##$STSR= 0
##$SW_p= 3205.1282051282
##$SYMM= 0
##$S_DEV= 0
##$TDeff= 0
##$TDoff= 0
##$TI= <>
##$TILT= no
##$TM1= 0
##$TM2= 0
##$TOPLEV= 0
##$USERP1= <user>
##$USERP2= <user>
##$USERP3= <user>
##$USERP4= <user>
##$USERP5= <user>
##$WDW= 1
##$XDIM= 8192
##$YMAX_p= 0
##$YMIN_p= 0
$$ End of Bruker specific parameters
$$ ---------------------------------
##NTUPLES= NMR FID
##VAR_NAME=  TIME,          FID/REAL,        FID/IMAG
##SYMBOL=    X,             R,               I
##VAR_TYPE=  INDEPENDENT,   DEPENDENT,       DEPENDENT
##VAR_FORM=  AFFN,          ASDF,            ASDF
##VAR_DIM=   8192,          8192,            8192
##UNITS=     SECONDS,       ARBITRARY UNITS, ARBITRARY UNITS
##FACTOR=    0.0002768,     1,               1
##FIRST=     0,             0,               0
##LAST=      2.2672688,     0,               0
##MIN=       0,             -217788,         0
##MAX=       2.2672688,     187273,          0
$$ Real data points
##PAGE= N=1
##DATA TABLE= (X++(R..R)), XYDATA
0@%%%%%%%%%%%%%%%%Kj0J6j6J6j6J6k0K8l2L6m4M8n3O1o9Q1q9R7j12J28j43J57
39H2j74J96k18K39k65K93l21L54l91M31m74N22n74O34p03P78q64R62j076J211
59F42j373J570j818K141k574L187m119N684q756J6817p5395j53794K75875J29186
73A87273j66730K0131J04427p2451J4330P3866j12322o9019Q4279o3758j14533
84a14507O0348K646j08829N7216R3411o7586M65J22404K983n5474L7625L3193
96F3895K375K0354m0148n1294M3323R302o5500K2897M0246q5147n1463N8180K566
109c0414l8498K0872j564j8223N8752L2594l4079M5734O7467n8563m4545O9699
121F9232J6107p1817k4404q26k7427J7319L2663l8076l7685L5174L7256q86m090
$$ y = [0, 0, 0, 0, 0, 0, 0, 0, 0, 0, 0, 0, 0, 0, 0, 0, 0, 2, -8, 8, -8, 8, -8, 8, -12, 16, -16, 20, -24, 24, -29, 32, -37, 44, -45, 52, -60, 68, -75, 82, -92, 104, -114, 125, -140, 153, -168, 186, -205, 226, -248, 274, -300, 334, -369, 409, -455, 507, -569, 642, -731, 839, -979, 1162, -1412, 1775, -2344, 3340, -5416, 11401, -63994, -217788, 58087, 187273, 20543, 40674, 145101, 72650, 86980, 160846, 48524, -20495, 63784, 26, -114507, -54159, -51513, -160342, -103126, -9715, -77301, -76836, 45568, 48551, -6923, 30702, 63895, 66270, 86624, 46476, -4818, 38505, 47807, -17693, 5204, 45450, -39697, -91160, -32980, -30414, -68912, -48040, -49604, -67827, -9075, 23519, -10560, 35174, 102641, 44078, -467, 69232, 85339, 13522, -10882, -11708, -39135, -21816, 10847, -27229, -64914, -29740, 7516, 6630, 2540]
134B540p527o525K0119J6905j7044j1903K2805J3661k0007j7029J2737J0449j9429
147b48k2189o680n163K531J9403M57j8875J2608L5898J1586J172O006j1037j2493
161A2976J0618m04k3995j0416p2j0499j110R610m589n00J3303k847r193J4283
175b835J2212o357j990M120O736J6981N573k0143n982J3349n333j5862l319j5455
189a8305j8226J0956P925j4277O137K1049r18K234J9852L08o472J5799p48k5410
203i6L348J7073j3258j3328R155l555q765J1240N74j9734q42J1787n159k124Q848
218d836j827M16J7560O169q186M438P337r434q244n7n747o745m3m548k677R056
234g368O294j855K547M994L95J351J559n097l340K891p56k349K342P36l239R19
$$ y = [2540, -4987, -11512, 8607, 25512, 8468, -3435, 19370, 33031, 13024, -4005, 8732, 19181, -248, -22437, -29117, -34280, -31749, -12346, -11889, -30764, -18156, 17742, 29328, 30500, 36506, 25469, 12976, 23594, 23190, -805, -11221, -11293, -21792, -22902, -13292, -17881, -18381, -5078, -7925, -17118, -2835, 9377, 3020, 1030, 5150, 11886, 28867, 34440, 14297, 8315, 21664, 16331, 469, -2850, -18305, -36531, -25575, -17650, -31927, -25790, -4741, -5659, -3425, 16427, 16735, 10263, 26062, 25314, -96, 3252, 20325, 7067, -6261, 2894, -661, -9426, 1814, 2388, -17346, -18188, -6401, -11560, -13684, -4836, -6663, -6247, 11313, 17482, 9296, 13734, 21071, 11637, 3393, 3336, -2411, -9156, -9199, -13747, -16424, -7368, -1074, -2929, -382, 4612, 5007, 6358, 7917, 2820, -520, 2371, 1615, -734, 1608, 2344, -895, 24]
250B4J378m237k960L42k571j625L353K094J477O642N424j46K360L703k095n916
266G247l909m487n351k480j813k635N37M214L042K608K972K025J244K021J029
281F264j769J76K655p7k183N74K111j743m138k844k743l866m156k013o37K235
297a2154K438K497N414O712M069J463L300J564k550m348k177k915m364k895q66
312d812j626j158r3M62L98O66M45O43J608J598J413L261M374K505P07J438N36
329A2365k297m355l148k685n075m451k576o9J37J413K887M486L633K392J057J939
345E653J676J05n91j99m90j669j236o49q56j631k231j824k308k247q54O12J143
362g596J657K726K835L159L281K458M06L71k61k634k952k819k711k320n41j21
$$ y = [24, 1402, -2835, -5795, -5453, -8024, -9649, -6296, -4202, -2725, 3917, 9341, 9195, 11555, 15258, 13163, 7247, 3338, -1149, -6500, -8980, -10793, -13428, -12891, -8677, -5635, -3027, -55, 1970, 3214, 5235, 6264, 4495, 4671, 7326, 7249, 5066, 5640, 7751, 6008, 1870, -974, -3717, -7583, -11739, -13752, -14389, -12154, -9716, -7219, -1805, 4907, 8976, 10439, 13739, 15303, 12753, 8405, 6228, 3313, -1051, -3946, -4812, -6438, -7596, -7689, -7227, -6829, -6163, -5718, -5075, -3467, -1869, -456, 2805, 7179, 9684, 10391, 11829, 12365, 10068, 5713, 2565, -120, -5195, -9646, -12222, -12291, -12154, -10741, -7854, -3368, 265, 2657, 3714, 5653, 7329, 7434, 6843, 6644, 6154, 4485, 3249, 2600, 1744, 113, -2118, -3942, -6250, -8497, -9351, -8739, -7596, -5939, -3213, -378, 2781, 6062, 8520, 8926, 9297, 9036, 6402, 3450, 631, -2080, -4400, -4941, -5062]
378e062j028O79J085R75R09J182Q38N29P85J049J80J412J173P09N1j063r36j066
396B401k201l269k647K88p18r91J006J916J733L424K863J250L65P60q75j337j47
413C821k624k357R81m71l232l07K039n41j026L14l54L33K463k17q30L484L455
430D931J5O90J340j436j332J066k552n088j146m47l227l01J454k08K355L204j58
447h40j28M191J659k212J134J313k131L11J612k426j993K065r95k992j99k035
463c666k941J560J413k466l9M424J473M42K873J474KJ898j88l616m20M64k565
480A22j580r0j780L90K374j191k459J769K397j481K35N68r81J587K886r06j047
497H13K408J350k347l23l45k025m67J70k330j438K056J374o32O85J588N76J326
$$ y = [-5062, -6090, -5411, -4326, -3351, -2442, -1260, -422, 107, 892, 1941, 2121, 3533, 4706, 5415, 5466, 4403, 3467, 2401, 200, -3069, -5716, -5428, -6146, -7137, -6131, -4215, -2482, 942, 3805, 5055, 5420, 6180, 5305, 3968, 3821, 1197, -1160, -179, -650, -3882, -4189, -2150, -2691, -3717, -3403, -3757, -3424, -961, -1178, -2008, 1476, 4931, 4946, 5636, 6976, 5540, 4208, 5274, 2722, -2366, -3512, -3959, -7186, -7487, -6033, -6241, -3886, -682, -840, -968, 3223, 4882, 2670, 3804, 5117, 2986, 3297, 4909, 2483, 490, 2555, 1560, -1432, -1631, -3666, -6607, -5047, -3634, -6100, -6139, -1715, -242, 200, 3073, 4547, 4549, 6447, 6259, 2643, 2223, 2687, 122, -1458, -1548, -3328, -2938, -564, -1755, -4214, -2445, -48, -1529, -1294, -726, -1707, -120, 2766, 1860, 813, 3221, 4571, 2224, 1901, 1556, -469, -936, -766, -3096, -4534, -2478, -1104, -1736, -1051, 537, 1113, 2439]
514B439L7j184n97K42j75l54j306j036J301J167q12p03P34o98O40M58j402m91
532a740K175J197k155J096J904n54K04P80k247j606J348r51k307m02L09L7J763
549a149N93j145J169L079r11n14R74n13k48R91j223j872J680Q47k098n33Q20k149
567b202O8J985k964j669L626J031k130K000J700j044K120K345l258p90K705j703
583A820l226J503o38k269K105N47k886Q34L198j370j625K486m35j253K149P93
599A733k549J438K613j963n51J262j001j689J184q66k504J312R07j509M72J772
615F1j11O31J838j191r18J701n24j650M64q8j664Q05J318k057m46K246k88j539
633a412J195J74q56R62O46j574R41K362o23j338J228K82j664j66j88j519o16N87
$$ y = [2439, 2476, 1292, 695, 937, 762, 408, -898, -1934, -633, 534, -278, -981, -247, -945, -305, 153, -1249, -1740, 435, 1632, -523, 573, 2477, 1923, 2127, 2907, 660, -946, 402, -549, -2856, -3258, -2949, -2912, -1149, -556, -1701, -532, 2547, 1636, 1122, 2096, 1583, 1335, 2326, 1103, -769, 911, 1758, -340, -873, -53, -2202, -2134, -149, -3113, -4782, -1156, -125, -2255, -255, 1445, 401, 2521, 4866, 1608, 818, 3523, 1820, -1406, 97, -541, -2810, -705, -158, -3044, -2210, 988, -382, -2007, 479, 44, -1209, 940, 1733, -816, 622, 3235, 1272, 721, 1983, 982, -707, 477, -389, -2893, -1581, -674, -2183, -1711, 61, -50, 581, 2419, 1228, 310, 2011, 1487, -163, 301, 213, -1451, -646, 672, -1385, -1831, 415, 127, -1412, -217, -43, -899, 63, 709, -865, 76, 2438, 1815, 477, 1705, 1987, 323, 157, -31, -1550, -2166, -1579]
651a579k74p40R93O32N15O63O04M2P02N68n81o63N19l52n86m31M55r24j69j87
671g93n2n63m85j7K92L96K08J20J129J081K19K63L82J70o89O0r35n95l22m99m82
692a112m38N7k84M47K37n7M88N17N68l28J40R36J06k19L48L87p17k65M40q02q99
713d50k43m26n24K22P3j72N11O95K43J18P44K07K87k3p2m66l25L83n63n52K54
734g9k56n03O2Q2l68L49K13k60R6N55O75n3L3O46J78k38l0n70Q2p62n23n6j3k88
758a028l75N75J05L58P4K74K86K65o0L1P6R3J1j47J26o15j31n8j66k96o9n4m2
781g67k93k16R95j3M03J68J90J55K77J51l81j42m23J9l19j7p5k72M3J42j97K63
803c09j42Q7J5L32N7K32m2L59M7J00j77K00m11J17p98j37J96l32k61j1L66N9J64
$$ y = [-1579, -1853, -2593, -1600, -968, -453, 210, 814, 856, 1558, 2126, 1545, 882, 1401, 1049, 463, 32, 487, -437, -606, -793, -845, -1408, -1893, -1910, -1618, -1222, -1014, -894, 235, 1316, 1535, 1798, 2180, 2350, 1661, 1721, 786, 191, -131, -630, -1112, -1550, -1493, -1777, -1330, -1093, -1150, -662, -145, 423, 95, 235, 1171, 1277, 1058, 1406, 1793, 1076, 811, 1251, 449, -450, -693, -1119, -1643, -1421, -1348, -1520, -1009, -314, -71, 47, 791, 998, 1285, 1262, 1190, 724, 399, 782, 219, -333, -79, -335, -838, -776, -694, -1062, -713, -500, -760, -664, -109, 566, 513, 546, 1192, 1370, 1132, 1102, 532, 614, -148, -671, -727, -740, -1028, -1403, -828, -723, -365, -291, -17, 269, 534, 474, 505, 581, 674, 685, 538, 664, 49, -82, -140, -306, -602, -671, -725, -767, -1060, -1276, -281, -294, 109, 277, 467, 622, 899, 1050, 669, 527, 104, 123, -196, -213, -288, -560, -517, -375, -572, -309, -451, -364, -349, -17, 40, 272, 230, 589, 636, 736, 559, 759, 348, 465, -333, -470, -274, -606, -867, -878, -512, -453, -289]
826b89J13K48j1K90N8o0oJ18rKk09M1l46K36j8l13J2l09o4M5m5J38K4J01K05N01
852D53KJ30P7l9j21j81p6j64l80J78l81K52j15N6J91k3N4j48Q0J62R4j61K98j69
876F9K23J39L8L03n75j36J71l30J38l14Q9J1k23J79K90r8M1k1R1M3p0O4k75J08
900d5J66n7n8K69m5j09j20n5J98k11L10j94m59J61K13j48J54j1k06N20j78L4m46
923c17N24j48l80J39L10o3j44L5L20k13J70j65K21J07m50K97k95k35l6K66J21
944F4o5J55k00k8M65k72j69k01L41l94N50j05K55l59nM6j07j17n0k06L36j91k18
967d75M22J20j24K8K04Pj86J19L32j76j95K68l30M9j38J4o0Ok44P6J14M81l87
990g5j98L17rr8K79k85K64j64L36p1m8k0k50N1j5o2n09N85R7n03K80J97l55K98
$$ y = [-289, -176, 72, 61, 351, 409, 349, 343, 461, 452, 454, 245, 286, -60, 176, 158, -155, -143, -452, -516, -471, -516, -378, -354, -253, -48, 453, 455, 585, 662, 623, 502, 321, 245, 81, -299, -121, -502, -250, -365, -309, -118, -141, -87, -235, -155, 7, 101, -60, 238, 69, 292, 431, 469, 772, 197, 61, 232, -98, 40, -274, -185, -174, -397, -218, 72, -26, 15, -6, 85, 128, 58, 122, -153, -45, 121, 64, 6, 275, 230, 121, 1, -54, 144, -67, 243, 49, -410, -249, -36, -184, -30, -41, -247, 273, 95, 129, -317, 207, 59, -321, -182, 128, 65, -79, -44, 276, 63, 233, 68, 289, 396, -54, 243, -52, -287, -323, -57, 64, -1, 154, -46, -74, 391, 119, -50, -251, 90, -304, 246, 141, 396, 37, 32, 78, -29, -146, -196, -402, -66, -257, -475, -53, 67, -57, -29, 175, 182, -4, 115, 447, 271, 76, 344, 14, 63, -75, -61, -121, -115, -359, -283, -169, 312, -75, -273, 44, 35, -63, 216, -69, 195, 31, 367, 296, 248, 228, -22, 29, 14, -48, -557, 28, 125, -378, -98, 99, -256, 42]
1014D2j43J60K4J60m8l17O59j66p83N61J17k77j24o3J30j15j61j%J33N1P7N17
1037D33rl12j4K90r7j08O8m90J68p6O5j03n2L2k54M79j53j40o8L59n8N9l8J67
1061A48K69N9j32k76L22j75p7k77J1k21M4q7M8n4J8L99K23k45N2j2J99q1J86Q2
1085D23n51N2J62J24j62m6J94k24m20K64N1J21j17L1J1L03Mr1J64r8l3J65j77
1108A50Q8l37P2m4n1lp5n0K21j51M4K05r3N4j09K57m6J21j36J26j3k3Q5n3m01
1133a62J02J53l60R3o9j61J9O21m85L81j06J59k62J08J43K1j29k5J37p4K40k27
1155A17q7j91J44j20J03j48J84M3r6k7rj75J26J62J57L6j23O1P3J40l49J72l07
1178a14N1l4l72K03K98R4k15M1M4j51K68j76J48n6L9J1J06rk2J20j91J47j68q2
$$ y = [42, -101, 59, 83, 243, 195, -122, 537, 371, -412, 149, 266, -11, -135, -198, -68, -183, -344, -345, -345, -212, -161, -84, 433, 424, 112, 98, 388, 291, 183, 251, -239, -71, -147, -82, -185, -237, -205, -459, 20, -133, -273, -341, 18, -40, 19, -19, 148, 417, 476, 344, 68, 390, 215, 138, -139, -128, -349, -305, -392, -344, -398, -380, 19, 242, -3, 49, 37, 236, 155, 341, 423, -128, -76, 86, 210, 48, 2, 196, -28, -448, -184, -133, -12, -129, -98, -87, 216, 220, 129, 293, 195, 162, 327, 150, 238, -99, -27, -71, -122, -125, -200, -250, -29, -180, -136, 69, -24, 30, -79, 178, 132, 253, 117, 243, 230, 207, 292, 239, -162, -60, 93, -267, -174, -243, -404, -385, 236, -249, 132, 26, 185, -77, 31, 174, 195, 66, 41, 178, 104, 344, 117, 30, -161, -17, -137, -34, -182, 2, 45, -51, -78, -87, -262, -136, 26, 183, 219, 96, 157, 230, 370, 21, 193, -114, -63, -97, -469, -266, 32, 126, -89, -48, -4, -155, 113, -63, 85, 29, 68, 79, 185, 176, 154, 274, 83, 230, 62, -20]
1202b0J4Q3k28R9L99k15l78L93r4j72K34n8L03l75l2l5L75k51nm8L17l28k70J70
1226a22j1L99l84K59P6j70J56l32J77j37J0l9L8Q3rPk70L28l75K33K22j84P2p7
1250e0J74j84J5L19l94L13l48L7K81j99K60N9l83l09L94l7R2m8l46J65J17K55
1272A83o3J8l91O0L17j15j5k63K83O1j85L24m3j17j10J16k6J33k20j02m8J96j4
1295b1p9K76l54K39J54r8k29L64m27K68l41J12J06o2K61l99L20J29Q6l29K8K25
1317B29k83L9k6j99J02J26N4J03j49j89J98j75J44j21mK52O8j34m8j31j01M79
1339B34l36o3mM0l0j57K72J29N5m32N23j64Q0k27J36N3K2J45j30k69L08j17l45
1362b77K92n2K06l42L8k0M65l78Q3j9q6K72n7l3L2J09k15M4K3j21j67l9J15J11
$$ y = [-20, -6, 77, -151, -52, 347, 132, -246, 147, 53, -119, 115, 57, 360, -15, -47, -82, 293, 42, 37, -11, 306, -22, -292, -122, -133, 266, -118, 141, 217, 47, 203, -129, 48, -89, -79, -118, -80, 3, -6, 1, -269, 59, -316, -83, 139, -45, 27, -50, 124, -60, -45, 274, -120, 193, -155, -118, 163, -36, 224, 283, -100, -409, -15, -52, 40, -8, -354, -189, -72, 183, 120, 138, -253, -193, 124, 9, -6, -269, 14, 75, -110, 214, 171, 54, -56, 60, 34, 167, -53, -155, -203, -7, -21, -100, 176, -178, 61, 215, 117, -112, 252, -175, 93, -248, -136, -30, -92, 169, -230, 90, 219, 305, -24, 4, 229, -54, -15, -41, -240, -138, -12, 42, 145, -4, -193, 5, -170, -26, -147, -151, 101, 169, 35, -13, -144, -245, 234, -102, -165, -169, -129, -159, -316, -44, 85, 140, -292, 231, 67, 147, -80, 56, 109, 131, 276, 146, -123, 185, 68, -277, 15, -37, 169, -173, -135, -155, 310, -68, 15, -4, -90, 182, 125, 92, 124, 233, 18, 62, 85, -36, -203, -242, -127, -16]
1386a6m34N16R0k17l8J11l5J93m6j65R7J9rO6Q6k27K73l53O8J09j92J92j27l7
1410g6n0n6Jj29L39J4O9j83j20J19K89j05M0j40m9K89k07j62K18k65On6K88k02
1434a28k7L44j56J38l01P8J80n9l84K85R8j48J63j8j15J26j24l4K12l34K44l8
1456BN6j77L19o6j48J3N5J87l20L6K79l49O1K24l02J32kn2j92P8J06K99L3l90
1480a18j49N29N9n79L24l7J19J58l47n6K27k11L40k64j05K18N8kl41lJ56q8r8
1503b10P7N06l89J05j76K35j15p3O0O5K05j05k87J47%m13Q8R1J05kO2l51K42J49
1527A6r2J60j32N0N9Q5m4j66J08j99PK48J29l69L48l77J20k0K88n65L74J4k5q
1551Ij29l26N71j56P5Q4j57J55k70j88R2M92k48k71L06j0j85K42J01k56J33jP
$$ y = [-16, -450, 66, 156, -61, -99, 12, -23, 170, 124, -41, 56, 75, 66, 132, 218, -9, 264, -89, -21, 88, -104, 88, -39, -76, -126, -182, -181, -310, 29, 43, 112, -71, -191, -72, 217, 112, 152, 12, -37, 252, 45, -117, 101, -164, -158, -214, 74, -128, -155, 189, 33, 171, -130, -52, 128, 69, -315, -30, 68, -80, 83, 65, -50, 76, -48, -82, 130, -204, 40, 2, 58, -119, 200, 134, -14, -1, 54, 241, -79, -43, 236, -113, -52, 172, -130, 2, 0, -52, -244, -166, -60, 239, 272, -118, -267, 262, 321, -258, 66, 29, 148, 306, -41, -97, 130, -81, 259, -5, -110, 108, 166, 164, -177, -180, -24, -112, -210, -133, 373, -16, 89, -87, 148, 33, -40, 20, 85, 290, 185, -102, 45, 45, -368, -280, -189, -84, -86, -24, -375, -133, 16, -76, 84, -48, 2, 61, 146, 102, -64, 44, -155, -148, 100, 229, -140, 208, -169, -49, -69, 219, -346, 28, 42, 17, 9, -120, -446, 125, -31, 44, 128, -29, 126, -144, -332, -240, 252, 4, -267, 39, 29, -156, 86, 187, -69, 64, 63, 70]
1574G0k39M8L81k51L0K8R0j21N0q4k40o5K25j12J45J20l05N6J25J36j95J03L7
1597C2N4O7k54J03n8j4J22j02N7R3n8l6K55k59n7J01o8j13L11l08N3J90j35J77
1621A53N2j54j5pj83L23l15l3j7K62j08K3j49K6M05l29n3J31j75J58k4J48k47
1644a28Q9j43K19j52J09k63N5K89J31l02K01P9m6p0k70k8J13L25k72J3J59R1j86
1667A3n5p3L21o65M63K83m67L90k15j64L69j09j78K30k14J42P8k04O7k20N8J98
1689D8r4%K49l20J83R2k59L57j10q9j6k2K29l65R5L5J31K4l23M12m50N81m57J0
1713e9M9J34q5j48J38j36K35j33K76j65j34M37l97j85K33J89k87J36Q8o2R5m57
1735b38J48J01j48L21j40k28K39j77J94k6MK0m32L14p0J07Qr4J73l9j95OL01k64
$$ y = [70, -169, -121, 260, 9, 39, 67, 157, 36, 86, 2, -238, -303, -78, -190, -45, 75, -230, -174, -49, 87, -108, -5, 32, 86, 153, -101, 2, -56, -70, 52, -50, 7, 100, 42, 6, 261, 2, -55, 46, -22, -135, 176, -132, -79, 111, -24, 153, 205, 51, 36, 29, -154, 169, -146, -179, -196, 66, -42, -19, -168, -142, 263, -66, -119, 12, -163, -5, -29, 119, -128, -39, -182, 37, -115, -6, -269, -214, 75, 206, -96, 105, 184, 138, 68, -202, -230, -117, 208, -64, -51, 108, 199, 13, -42, -115, 206, -459, 4, 287, -180, 210, -5, -169, 200, 91, -87, 143, -71, 71, 149, -55, 12, -208, -150, 48, -46, -46, 203, -117, 66, 158, -101, 256, 146, 57, 41, 19, 248, -117, -22, 13, 144, 168, -155, 257, -193, 388, -69, -59, -10, 124, 39, -109, 29, -107, 128, -5, 271, 106, -28, 409, 12, -173, 60, 249, -38, 98, 186, 124, 219, -238, -90, 11, -137, 184, 44, -184, 55, -122, 72, 46, 50, 70, -362, -48, -118, -11, -3, -97, 76, 37, -158, -152, 149, -115]
1759a15o0L06j93K32r0k08M38K0l05l18L75M4m3J80l25M1j77K29j60N8J57j17
1781c1K60l72K69j10q6j53j50L46K12l35J61j99P9J97J31o9j78J64k34r8L59k21
1803e8K62j66j52J04oj71m0L70r7j4O1O4J47l95J89k3n5j63K22n4L7O6r7n8k4
1828e1L00j04j56O7l93K93J71k93J93Q6k24L01Ok01M7J4k2r2K09k96N0J4n5K0
1852a16Q4K11j94j94K25m3J23j97R0J27k33M02l94K2J74j9L9N7j44p4J83j71J39
1875I7j48n1J14Q8K17l54j57J77j8J57k28J19L5n2r8K38l09L11K31m30K18m40
1897b83J67J49L00l82L7R5j34M2L7J62l59J67k64K73j06J4j30K76J5l09K52k61
1919b42N19j23J02r7J45l90j90K98M1j89L5J32Nl28K97jK83k71J95j18k17M90
$$ y = [-115, -175, 131, -62, 170, 80, -128, 310, 330, 25, -293, 82, 126, 83, 263, -62, -21, -198, 31, -129, -71, 86, -31, 229, -143, 126, 16, -70, -223, -373, -27, 185, -150, 11, -188, -109, 88, 219, 150, -28, 136, -98, -196, 163, -58, 204, 38, -114, -10, -16, -187, -227, 143, 46, 32, 93, 157, 304, -91, 98, 75, 20, -143, 79, 25, 62, 128, 31, -27, -51, 249, 145, -11, 56, -337, -44, 127, -166, 27, 113, -111, 190, 196, -5, 42, 56, 34, -58, 151, -145, -95, -81, -136, -116, -32, 179, -15, -209, 16, -27, 96, -101, -11, 116, -117, 285, -109, -87, 87, 68, 107, 164, 20, -54, 129, -42, 97, -51, -102, 12, 100, 317, -37, -194, -17, -35, 122, -106, 13, 48, -4, -102, 136, -173, 138, 369, -61, 157, -283, -116, 33, 333, -49, -12, 83, -51, -9, 28, 190, -169, -2, -266, 7, -99, -85, -215, 61, 76, -233, 19, -242, 277, 154, 256, 159, 304, -86, -276, 22, 63, -126, -91, 41, 46, -282, 15, 14, 297, 26, 221, 103, -114, 376]
1941C76l58K47j91J47k08k35M33k28%J39K86k44m85L26r7L16k82j87K74J46n02
1962c27K56J51j40q1K06mj08K94k25P4J15p3j77J37l87L11J07k68J73K5r7K82
1984B44o1m82J60L41m3k39K41p3j11R3l05M55k55K4K8l28K19M01l64O4l7J14k89
2007b03L24l40J19Q3J32Q5j47j69M0n9K32J86m64K69q7J18j93J27k74M31j75o0
2029b5L6K31j91K13j06r8l84M02O7k27J35j80m4K39J73j20o2k6J4R8k6j72J16
2052F3R1Q4m16J58n3J25L8N1k3l23J82J69J0k07l3j9P9O0J66j91J41J78j93j18
2076A9j42j6n1J27R9j69J8J56j46L25j74lK10m97M63j09Kml62R4N7L11l26J44
2100B6k14p9L02k3k6j47N2n5K85l22N88l47l35K01K17k23j41K35J4K07m34L76
$$ y = [376, 18, 265, 74, 221, 13, -222, 211, -17, -17, 122, 408, 164, -321, 5, -92, 224, -58, -245, 29, 175, -327, -71, 80, -60, -141, 65, 61, -47, 247, 22, 96, 211, 138, -39, 98, -289, 22, 129, -139, 34, 59, -38, 244, 183, -299, -139, 202, 159, -80, 161, 88, -23, 70, -235, 220, -35, -11, 17, -311, -92, 309, -55, 9, -28, 86, -203, 121, -219, -100, -17, 115, 200, 53, -116, -76, -135, 97, 283, -181, 88, 1, 119, -74, 53, -221, 210, 35, -25, 11, 242, 51, 264, 158, 60, -324, 78, 145, -82, 53, -127, -171, 68, 241, 121, 59, 33, 47, 145, 119, -53, 63, 154, 238, -178, -20, -73, 52, 90, 141, 118, -205, -23, 146, 156, -51, -84, -103, -24, 36, 202, 11, 152, 330, 137, 19, -123, -139, -190, -63, 36, -133, -115, 41, -105, 220, 46, 43, 253, -244, 219, 110, 112, 108, -254, -160, -103, 208, -118, 26, -188, -267, 35, 12, -14, -161, -109, -164, 121, -201, 387, 40, -295, -94, 123, -100, -241, -6, 8, 215, -219, 157]
2122A57l14K08p9R1p0l5J59k65P6K90j13j07m9R6m7N1Q1j65j37K39M6k14k2o3
2146a86K61o1N1K6n5o0J09j65K3J04j31o8L40k28L05j95m8j77OK51j65J74p7k2
2170A2kK0p5o6J47j64K79j74k17L45k22q3N23n34K01k82Q5M62j71r6O0j96K54
2193A06k34J41j50K96k53J71M2k07J91q1J41j2p9l51M82j65k17M5P5j32P4K97
2215A80k77K24j68M1k26M0K04j07K54j35J09j39j6k37LR6p9K39K93l79J58j33
2237e5J61k16o1K46k40LK28l12K47K12m72o3L99L47l39k4j0r0L8j1j15J18j54
2260a63O3J73k2j71N3J08m7K05l47K14n5J14j75K7Mm7P3n9J37n8N9L0k81K19k08
2285a54J12M4r6J05O0j41L2q3K19K09k89k06J89j62J86OL9jj47k7J62j68j1N3
$$ y = [157, -157, 51, -28, 63, -7, -42, 117, -148, -72, 218, 105, -2, -51, 45, -2, 49, 130, -35, -172, 67, 113, -101, -123, -186, 75, 14, 65, 91, 36, -24, 85, -80, -57, 47, -84, -152, 188, -40, 265, 70, 22, -155, -149, 102, -63, 111, 34, 12, 10, 30, -45, -111, 36, -128, 151, -23, -240, 105, -117, -200, 323, -211, -10, -292, -207, 255, 84, -12, 48, -148, 106, -128, 13, -137, 159, -94, 77, 119, -88, 103, 22, 163, 151, 72, -279, 203, 38, -179, -134, -59, -191, -117, 180, -97, 127, -41, 0, -226, -186, 18, -89, 165, 30, 139, 0, -16, -253, -250, -154, -233, 6, 299, -80, 78, -55, 106, -110, -171, 75, -165, -162, 66, -246, 1, 213, -259, -322, 77, 424, 85, 61, 51, -39, -1, -12, -127, -9, -163, -100, 73, 51, -120, -67, 41, -6, 199, -148, 66, 11, 125, -50, -23, -19, -66, 7, -52, 85, 27, 86, 116, -165, 54, -154, -42, 2, -94, 11, 71, -70, -38, -121, 98, 307, 18, -188, 1, -161, 25, 31, 70, 69, -78, -105, 57, -111, -122, -69]
2309f9K83J59p16K90N8l6q8K28Q9j55n8pr0J61J40j03Q6j26j4K51k48Nj31j20
2333b11J18j04Q9R5q6L7J86m10K72k50J69o0Q2r2l2K86o7K49m29J93q2K18l0k00
2357e9J55n89L50QJ42q6J03J71l1p2k39J28K8J19j58J5j6J89K8l62j24M27R8k08
2381A7k5j10%K4K37q0k2j38rL67m6l98Q9o0J39k32M22j15L1k66L94j40k32J44
2405iJ87l20L4j5P5j35K8R4k9P3K26o2k52L39m22M52lj25k2k26J09j7j74J53K35
2430A94j81k97K48l5J39l9Q4r4J60o27L30J15m52O65m4l13J3J62K58k86O2n2K15
2453B25k25k7j74J04K33j08k17K4j36K99R4l57J54P6J35j47L4J48m4l93L78j39
2475f3J32j77J51J06j31j3l5j30P2J5P4j03J15k37O0k0L48m0q7R4k24J88k46K44
$$ y = [-69, 214, 373, -343, -53, 5, -31, -119, 109, 198, 43, -15, -22, -112, 49, 189, 86, 172, 46, 32, 283, 35, 40, -91, -211, -93, -197, -108, -13, -99, -62, 124, -286, -14, -264, -95, -155, -73, -165, -197, 89, 22, 271, -158, 35, -47, 171, 141, -59, 96, -493, -143, -135, 7, -79, 24, 195, 164, 92, -147, -19, 9, 128, -30, -15, -31, 158, 186, -176, -300, 127, 225, 17, -8, -118, -118, -94, 143, 63, 41, -97, -106, 261, 215, -183, -94, -154, -15, -247, 175, 60, 91, -175, 219, 79, -153, -9, 178, -142, -108, -123, -48, -183, -155, -61, -90, -17, 209, 147, -105, 234, -188, 264, 261, 136, 114, -112, -3, -20, -194, -41, 194, 13, -284, -36, -71, 68, 29, 113, 19, 179, -448, -118, -3, -455, 210, 166, -147, -134, 28, 286, 0, 62, 10, 225, 0, -27, -201, -97, 136, 28, -189, -165, -301, -2, 92, -265, -111, -35, 100, -47, -13, 135, 91, -302, 76, -63, 69, -108, 43, 149, 18, 5, -30, -160, -88, -73, 1, -102, 13, -224, -164, -184, 164, 124, 37, 131, -93, 95, -151, 93]
2499I3j82pj8J47P6j33J07J9%j14o7o0L38k31P3N1K86m28K53m6j61m4M6Kj00K38
2525A38o2r7j63M1K80O1j9o0j72k44M81J37l52p6J66q5J73r9j44J98L1p8k6J10
2549A39J54l01J24j69Oj20P8J16L4j82j9N9J73qj1l09K74n1L8Q8k26J8J8K20j98
2574e5j28Q2J42R9q0j71K74j37j28L30r3J14k98q4J43J11j75J97m34Q1K44R1j31
2597fj9l0R1J21j92j58L42l21L22n3k44J24J9j51p6K29j20N5j47J76j50L49Rk53
2621h3J20j57J46N1j47r9J84j53J58L09q5k3k49M3J38o2K0j22K99k74j26O6n1
2644i7P8l4R4k38L50j13j72M8j45L85l72Q2L36q8J0q4m7J08j32J56k54J93k69
2667b05rl9L64j25J55r5k29N26l10M3l17J42K0KJ80p8rk63K71K17n13L59j38J51
$$ y = [93, -89, -96, -114, 33, 109, -24, 83, 102, 102, -12, -79, -139, 199, -32, 41, 92, 378, -50, 203, 157, -4, -48, -2, 0, -100, 138, 76, -21, -184, -143, 137, 198, 179, 119, -53, -297, 184, 321, -31, -107, 59, -26, 147, 48, -96, 102, 133, 55, 29, 139, 293, -8, 116, -53, -47, -167, -89, 27, 61, -121, -140, -81, 92, 84, 73, -236, 38, -13, 25, 113, -113, -95, -77, 143, -55, -183, -101, 41, 140, 60, -111, 163, 26, -102, 228, 135, 249, -49, -133, 10, 121, -54, 143, -291, -210, 34, 125, -6, -25, -55, 36, 157, -35, -193, 149, -172, 150, 97, -147, -23, -4, -155, -231, -2, -122, -67, -214, -38, -188, 161, 170, -83, 37, -120, 26, 77, -70, -169, 15, -138, 20, 329, 244, 221, -28, 15, 153, 91, 111, -11, 288, 14, -112, -46, -97, -19, -53, 41, -197, 153, 40, -132, -84, -229, 156, -216, -134, 202, 114, 124, 40, -7, 101, -31, 125, -129, 64, -205, -214, -253, 111, -14, 141, 46, -183, 343, 33, 76, -241, -99, -79, -77, 103, 25, 16, -247, 24, 241, -272, 87, -51, 100]
2691A00Lk2j29n6r3kK69m8k38L17q8K34m46L95l88N28l72O9j34J57j54n2N22l35
2715C7NJ35j29n9j13J24K57P5n07L15J96j6k82m41L99M25o98N05k81rK90l72K0
2738a24R4L47l46Q9k37L68l37K2J14k1R2k17M17l24j00M5J53j90N6J11l1jj72
2761a92K34J63j48k26K78m3k29K76j12p6L97m12N3j15J04l4J29k76L48k27N7j7
2783f8J01n1k4p9N18n59N4J90K0k68K26j46L49n5j55k09J43j07J37Q5k75L33L
2806A63q4n6m6n7kP2l60J89M82n46K50o9q6K31J62q9m23L28j05p1J70k50K75k61
2830a83j32J54J34M2K7O3j40j24J95jk0n7j11J01P7j96J31j50K27k24L74l59M52
2853B80n71L46n1n4J21L54l91k31K58j80J74J49k24J07j12j95K52J44l59J02r0
$$ y = [100, 103, 81, -48, -104, -197, -199, 70, 22, -216, 101, 13, 247, -199, 196, -192, 336, -36, 33, -101, 56, -98, -150, 372, 37, 42, 177, 48, -11, -124, 0, 257, 332, -175, 140, 336, 320, 38, -403, -4, 421, -277, 228, -53, -62, 228, -144, -124, -30, 317, -29, 60, -177, 191, -146, -124, -10, -31, 61, -156, 261, -63, -163, -118, 35, -155, -99, 12, -19, -20, -192, 42, 205, 57, -169, 109, 66, -163, 113, 1, -75, 322, -90, -37, -152, -48, -82, 47, -229, 119, -108, -51, -68, 33, -18, -42, -121, 397, -162, -108, 82, 102, -166, 60, -86, 263, 208, 53, -156, -13, -120, 17, 102, -173, 160, 163, 79, 23, -23, -80, -82, -10, -370, -181, 301, -245, 5, -64, -150, 81, 243, 154, -269, 59, -46, -117, 53, -197, 78, -183, -315, -161, -27, 15, 42, 105, -35, -159, 36, 35, 15, -42, -153, -52, 25, -171, -40, -190, 37, -187, 187, -172, 280, -291, 55, 4, -50, 71, 425, 34, -197, 61, -119, 55, 204, -20, 87, -25, -220, 32, 176, -183, -81, -171]
2874a71J30K1k24K70n7M2J14j89K27l07O1L36n61K43P4Q2L1j04o5Q5k4j53M67
2897C28l03j21K32j25l8Q8J15j00L10m73q2K45l43O6J77q8N7L28m79j46M11J9
2919G8k86K44p6j37L78n4o9J3j23oj84KM55n37L79J7o6jk51K60K38j88p3Q0M5
2944A38k39P3J86j22j93K45jj07K85k89r4N20k57p3j1j22n2Q6Q9r3J4kM4J82M1
2969B48k82j47J4K63r9N3k13m40N59K04j12J42l99JJ64OM8M8J4j00K50n9j33p6
2993d6j54L34k86K6J34l8mO7j56J96n5J0p4m2O9QP7O0j57j91P32m94L5j85k9L51
3019A88j06k53J37j88j14M71p1n3q7K15l1j65L03N5m96K33k93K83N0k32K28p1
3041CN0m2L97l16j44n4K14j63J24Q3k23K3M7J41J65m83Q3K13k31j74J34J85p6
$$ y = [-171, -41, -20, -244, 26, -31, 11, 125, -64, 163, -144, -83, 253, -308, -65, 9, 91, 122, 18, -47, 38, 14, -139, 328, 25, -96, 136, 11, -27, 61, 176, 76, 386, -87, -169, 76, -267, -201, -24, -112, -55, 273, -206, -352, 59, 78, -208, 36, -40, -177, 201, 147, 78, 91, -32, -38, -222, -220, 235, -302, 77, 94, 28, 27, -224, 36, 274, 86, 13, 93, 138, -101, -28, 158, 36, -157, 88, 87, -20, 265, -24, -118, 402, 145, 72, 61, -61, -113, -27, 62, -31, -17, -19, 25, 207, 248, -34, -181, -167, 96, -3, 50, -163, -603, -44, 160, 48, 190, -209, -208, -44, -38, 10, 58, 72, -28, 222, 163, 30, -46, -200, 134, -152, -126, 8, -30, -34, 33, -123, 73, 18, 28, -46, -88, -19, -11, 66, 126, -31, -222, 510, 16, 51, -134, -163, 188, 82, -171, -34, -222, -336, 135, 64, 11, -76, 139, 108, -57, 246, 301, -195, 38, -255, 28, 78, -154, 74, 3, 53, 11, 408, 92, -52, -106, 108, -55, 69, 152, -71, -48, -1, 140, 305, -178, -95, 118, -113, -287, -153, 32, -44]
3064d4K81j81j2k24L21l52K09j6j58J96N7j27J64O5k18j25L03Q8l77l2J52N8R0
3087A18j52J24j26J2PK43o1j81m39M20J03l18K90l41QL12O9l4J71o1k02N5M1j33
3111g5J9J13k17K06j17K78m27M00j45J00J25l30R4m10K83r3K1L71j79l1k7p0L31
3134B20j86r2j92J58K42k39Q6k15K75l67K20j32N9J05n0J03J25j30k05K61Q9k28
3156i3L1J29Kk16M9K00O2J3j52J55j96o2M5k2n3L4N4j26m0Q4O1K03m13L55j57
3181e3K03K9k09P8J70j46q5j22L40l43p5J47o0j9K88j30Q8r8J19j52J12r4Q6K
3205G6m7J50k27nK64k08j19nJ27J50k60L75l60J98j67k41J82L40o1k10l5j38O6
3228a55K0K20j26J50j84J07l2p9N9l9K12l2j76K08k44%o8j52L57o6O9j8J76m10
$$ y = [-44, 237, 56, 44, -180, 141, -211, -2, -18, -176, 20, 77, -50, 114, 179, -39, -164, 139, 227, -150, -182, -30, 28, 118, -34, 90, -36, -24, -17, 226, 165, -16, -455, -35, 68, -250, 40, -301, -293, 19, 88, 54, 225, 164, -38, 17, 58, -75, -56, 57, -160, 46, -71, 207, -220, 180, 35, 135, 260, -70, 24, -386, -103, -196, -175, 196, 17, -14, -41, -111, 220, 34, -58, -250, -92, 150, -89, -3, -218, 57, -310, -90, -222, -163, -58, -108, -5, 120, -10, -215, 46, 135, -93, -62, 67, 69, -147, -98, 102, 164, 177, 25, 180, -16, -78, -33, -55, -108, -74, -20, -146, -186, -102, -41, 162, -251, 104, -53, 150, 179, -30, 48, 218, 72, -13, -135, 205, -138, -213, -66, -126, -145, 143, 13, 101, 3, 122, -30, 82, -12, 74, 76, 29, 179, -48, -53, 211, 3, -116, -121, 6, 156, -104, 271, -89, 109, -58, -299, -117, 223, 162, -48, -83, -221, -155, -135, 85, -41, 109, -75, 32, 0, -79, -20, -59, 153, 121, -55, 153, -91, -91, -159, -311, 46, -20, 49, 31, 207, -203]
3252b03K01m3K61k50J6n4O6J38j67J08N5J16k82j84L88l93R9L61l92J96j97K09
3274D9J8p5R2k91P7L18l04o6J28M6J02l3k0O2P0l9k20J83j94J31N4nj01K26m35
3299b27OJ14L85k21j92J27l24L75K31m85L19k07J53r8l8K54k24N9j55K31k23K77
3321A37k76J96j30j39K70O3k43o5J30j54K61J0J06j6N4o56L10K33j73M6J98l12
3343a50K76l61J03l2j5j8L74k71K1K19l69L65Rj58O2J64l05p0N3j12K57j69K27
3366A00o6l22M88k25P6OJ94m83qM05q6j7n2O3K8q9R3O0l7p7N4j13R1J2N8j77Q6
3393F2j54Q5K64j05k50J01K5R3l53L55j03L3k37L16j81J22m7N7J05k12Pj29j98
3416c44L56l11J53J87j58J68M0n4K09q9p7J51l34k0N1N4r6L03k80J01LJ66j57
$$ y = [-203, -2, -45, 216, -34, -18, -72, -6, 132, -35, 73, 128, 244, -38, -222, 166, -227, -128, 233, -159, 37, -160, 49, 67, -8, 84, -207, -130, 188, -116, -182, -54, -8, 94, 61, 41, 103, 173, 134, -86, 97, -97, 34, 88, 83, -18, 208, -227, -221, -107, 278, 57, -135, -8, -332, 43, 274, -211, 108, -99, 54, -44, -82, 172, -52, 7, -148, 83, -140, 137, -139, 57, -73, -212, 58, 121, -122, -187, -57, -211, 50, 60, 166, 150, 204, -452, -142, 91, -82, -36, 162, -150, 126, -235, -132, -164, -179, -197, 177, -94, -73, 146, -223, 142, 151, -7, 55, 219, -86, -156, -103, -215, 42, -127, 100, 34, -288, 200, -25, 51, 57, 251, -232, -240, 165, 79, 62, 10, 73, 101, 12, 105, 165, 128, 51, 105, -8, 83, 95, 153, -24, 62, -92, -7, 257, 152, -98, 3, 28, 121, -232, 123, 20, 53, -184, 132, -49, 73, 26, 83, 188, -24, -17, -146, -344, 12, -299, -146, 41, -117, 51, 91, 37, 246, 157, 80, 231, -103, -123, -72, -18, -114, 189, -91, 10, 13, 179, 22]
3439B2j6j71K19O2j88k99N01j88J9j26Q5j0M4J11J20r2k00R7O1R1m5j87K45j74
3463a9K40j96o5o0J14j54J18N8j35L7P3r5QL26j38K25l83K01m19K61o1l3m6QK02
3488F7o2j27J70j2j17L10l38N9%Q2q2k32J56J2J28J52k50Q8J12k20K11n6k06K73
3512A18k49k4L16k83j04Q8k5L92r6l6l31n8N44p1k04j25J7k2K86q0J11k09m0K15
3536A30k78L56k08K61j30j99L41m86L04N8l18J53n8L3J71j18K1j91J85J91j84
3557C4N6j9j20K1J22k2L4J69l91PL12k01l51J59L5L18O3l30K71j45j23M5J87k75
3581a44J20k89L17J4J1J03r4j13k46K73P9j53R8J55k81K33j06L60j26k06l5J07
3603G7j96l5R1J26J95L9k97J94k79m5P9k1k3L22o24K15P9j46K36j47J60r7J43
$$ y = [22, 6, -165, 54, 116, -72, -371, 130, -58, -39, -165, -80, -90, -46, 65, 185, 93, -107, -10, 51, 142, 97, -90, 155, -19, 221, 25, -40, -100, 14, -140, -22, 36, -99, -62, 11, -84, -76, 250, 112, 337, -46, 155, -264, -3, -64, -97, -143, -135, 67, 5, -122, 48, 36, -81, 229, -109, -50, -50, 32, -50, -282, -126, -114, 14, 166, -84, 4, 116, -104, 107, 51, -155, 118, -131, -155, 161, -122, -226, -138, -163, 229, 133, 97, -234, -292, 252, 181, -23, -148, -131, -153, 133, 53, 164, -45, -85, 130, -148, 208, 0, 261, 131, -68, 273, -213, 91, 149, -169, -16, -74, -41, 130, 12, 33, -158, 27, 218, 34, 90, 71, -49, -28, 94, 72, 106, 275, -116, -109, 203, 2, -349, -190, -155, 163, 226, -104, 167, 22, -101, -56, 131, -144, -24, -313, 4, 18, 29, 132, 38, -75, -321, -48, 31, -122, -24, 131, -150, 83, -23, 337, 211, 5, -30, 77, -119, -154, -63, 63, 258, 297, 0, 194, -85, -130, -51, -72, -95, 227, -397, -182, -103, -249, -13, -160, 0, -97, 46]
3626D6l17j5J86p5J84J05j78K25l19J93L9j33J59k4J41r3k07q7q0M01j71J04k20
3649a36N12m88J18o5J21j22Q7J90m27O7mL99k61J05k46K29m7q0j82K35O5J94k97
3672c3K4N2j60L82j32qq7JK1L2j55j06J2K78m05L38j43K58l33L47k24k4J44K33
3696C12l52m4K28n4k59O7LL5j93K18J28q1O2j39K97k95M8Q5n6K56l28k98M39j49
3720g0n0L70l29L2J96k22J83j92J39j8j64K34k33l5J75R3j91J52l6j34M6R2J5
3743E3k6J27J82l17j15l60K86J97j37K47k54J03O7N5m8R9l34L42n3J21q0j00l65
3766c10K06L50R7p8m69J25J0J49J9j96q3n6K24l8k08N73m16J30j10J52k02q9J94
3789b6j58K06j98J54L05k18O2k3K00n8p3P8l07L7L23k97K55k12q9J00j27K70Q
$$ y = [46, -271, -286, -100, -175, 9, 114, -64, 161, -158, 35, 74, -59, 100, 76, 217, 124, -83, -170, -250, 151, -20, 84, -136, 376, -112, 6, -59, 62, -60, 27, 217, -210, -143, -147, 252, -9, 96, -150, 79, 32, -48, -230, 5, 70, 264, -33, -9, 43, -117, 265, 133, 125, 38, 39, 60, 92, -63, -169, -157, 121, -284, 54, -89, 169, -164, 183, -41, -65, 79, 312, -40, -84, 144, 90, -169, -102, -99, -64, -257, -39, 89, 8, 70, -69, 228, -67, -19, 66, 10, 266, -62, -360, 79, -70, -120, 250, -79, -47, 149, -73, 110, -82, 57, 39, -125, 109, -124, -159, 16, 109, -82, 70, 34, -100, -54, 38, 53, 27, 154, 336, 19, -96, -456, -170, 27, -110, 137, -117, -14, 53, 108, 60, 159, -175, 167, 114, 235, 155, 55, -310, -104, 246, 343, 265, -204, -79, -69, 80, 99, -97, -180, -236, -12, -50, -258, 315, -101, 29, -81, 71, -131, -220, -26, -184, 22, -176, -22, 283, 65, 127, 104, 304, 246, 173, 251, -56, -19, 304, 7, 262, 50, -39, 61, -66, 204, 212]
3812B12P2r6j09j50N2m8J37k36L37q0j84J54q8r6J97j53n8L9J01Q2j27L07m11
3835a46M7J53j12o0J05P6J52j26N7j77Q2l26J98K00k2L60m89j06OK97p3j97L4
3858f7k99L32p0k14J62P8L16k52J38l48J93K40j96j89L86m3k57K36L0j36j69J60
3880C1j76N7J9l6J98j53J83k25Q8J34l8O4l32M37m8M4j46J26l88P5K26j22O2O5
3904A45j09j99K39R4k48K54j04j96J57j2k3L8K09k51n2r4K68j1p2j20L07j42j38
3927f0O5k70J84J13j5J0J02o4j65J60k20J4J67M9L3q2j32r6n9N35k65q5K80k69
3951g0J60j76r2L39l07NR0n6J62j43J59K19k23n10N97l52R0m7K14M5j28j21K55
3974A10j61j0K32k95J95r3J34O0n6r0j11O2m9P5K26m49J7K09k11j36M04j94L15
$$ y = [212, 284, 188, 79, -71, -19, -67, 70, -166, 171, 91, -93, 61, -27, -123, 74, -79, -137, -98, 3, 85, -42, 265, -146, -99, 54, -58, -118, -13, 63, 215, 89, 146, -31, 51, -275, -77, 123, 101, 461, -28, -134, -128, 169, 96, -101, -67, -366, -34, -104, -318, -156, -78, 238, -14, 124, -224, -31, 209, 13, -176, 210, 167, -90, 146, 176, 40, -129, 31, -145, -88, -69, -105, 93, -60, 123, -102, -14, 120, 82, 146, -186, 251, 203, 247, 101, 227, -161, -86, 140, 18, 80, 145, 36, -163, 76, 170, -78, 176, 72, -124, 33, 21, -2, 36, 245, -6, -58, -152, 116, 105, 33, -87, 220, 78, -60, 5, -265, -81, 32, 17, 27, 129, 65, -100, 60, -160, -146, 21, 70, 103, 21, -111, -207, -266, 269, 4, -81, 199, -70, 90, -86, -178, 161, -146, -141, -51, -107, 55, -88, 71, 290, 67, -443, 154, -198, -108, -155, 59, 104, -24, -145, 110, -51, -61, 171, -124, 71, -22, 112, 172, 116, 26, -85, -23, -72, 3, 229, -220, -203, 6, -205, -341, 63, -131, 184]
3997A84j39l27L04j72K63k32j28K70o3Q3k7j71P0J79j21M5n0K35p5n9l57M09l32
4020b11J77J22j27J05k73J74J91k42J70k33L47k10J41k6k08r6N6n9m8J44K17j71
4042f0j90L46n5J05k67J3K18r3L4q3K87j41n5l75L01j11J34rR1k35m2o7Q5M73
4066C04k00j03N1M4k9j94K11J88j42k19J34J29l83K19N1lj83j3K76J9j64M3M4
4089H0Q5j46k06K52r2RK2K61l72L1k1j6K81l13P7j30M54j73r0K09p8k58K71j02
4113C5q8NJ84m27L47k10J7K51j74K5J78pl80L29J68l22J3N6j80J35J96k21L8l1
4137f3R8j22J81Pj51kK16j30q8J47l42K32K01kJ36m57L29l21J54j08jJ62k92K3
4161a93J60J95j53J51k55K67j71RJ10k51j19K44k80K37J22k19R0j95L43J22k45
$$ y = [184, 45, -282, 22, -150, 113, -119, -247, 23, -40, 43, 16, -155, -85, 94, -27, 18, -32, 203, 128, 69, -288, 121, -211, -34, 88, -39, 66, -207, -33, 158, -84, 86, -147, 200, -10, 131, 105, -103, -199, -143, -202, -250, -106, 111, -60, -250, 96, 41, 146, -121, -108, 110, 17, 51, -32, 255, 114, 59, -316, -15, -126, 8, -1, 90, -145, -187, -254, -169, 304, 104, 1, 52, 96, 67, -127, 84, 272, 130, -89, 45, 174, -209, 10, 61, 58, -125, -138, 138, 157, -7, 36, 80, 165, 19, -187, 65, -27, -18, 4, 265, -107, -76, -97, -113, 168, -145, -68, -198, 256, 83, -7, 202, 124, -134, 137, 35, -53, -48, 136, -291, 56, -154, -137, 114, -60, -35, 143, 136, -244, 85, 253, -69, -56, 0, -180, -45, 151, -70, -32, -63, 35, -87, 94, 101, -50, -52, 164, 34, -54, 93, -249, -17, 184, 182, 318, -139, 190, -131, 23, -85, -86, 76, -216, -193, -33, 162, 9, 160, -95, 172, 1, 10, 120, -131, -250, -6, -286, -49, 73, -146, -56, -251, 92, 214, -31]
4182c1k78K64J09j71K61j07o0l3j83L17j21K11J2n20L01j27L20k92K39j97oL54
4204B62r2j13l14L46j53r6mN3J7K8j97M45j84O9j5j21K07j97M9M6J11l31j31M86
4228A71k12O5j22K47k14J50k72J58j1k6QL22l74P0r0K52j01Q8j66n6j69K03J37
4251E8K08l75K64j56k39Qk7K52L7j04k48K81Jj76J45J90j36Q4j44J34J6j40ol4
4275a07o0J16j35K31k06J41o0J11j35J29J32P5m5k43m4K05k5l41K49J03j41N1
4297An3O1N4k0o2J59q0k3k2L3o8L3P2N6K8l0k88N4K72k14R9j47J70q9j50K9J14
4324a1n4K28k26J48oj80Rp7L54n8r1J35k06k04J92j54J62n4L93m66J58K26J55
4347C73k92Q0j37m6q2j80Q5p7L44M9j95N3J03k51P7J07l9J58p8j03J71j03J04
$$ y = [-31, -309, -45, 64, -107, 154, 47, -13, -46, -229, 88, -33, 178, 190, -330, -29, -156, 164, -128, 111, -86, -92, 262, 170, 57, -257, 89, -64, -160, -164, -111, -94, -66, -263, 182, -2, 67, 52, -69, 138, -59, -10, 36, 147, -184, -315, 171, -41, 24, -98, 149, -65, 85, -187, -29, -40, -66, -58, 264, -110, -40, -130, 122, 21, 109, -57, -113, -282, -79, 58, 266, -109, 155, -1, -240, -232, -259, -7, 30, -74, -322, -41, -40, -216, -71, 119, -17, 67, -77, 57, 73, -67, -73, -107, -167, -51, -186, 45, -161, -20, -80, 31, -104, 25, 157, 232, 187, -56, -100, 105, 80, -261, -12, 91, -50, 1, -52, 9, 63, 43, -19, 140, 60, 37, 15, 48, -20, 13, 85, 141, 169, 139, -149, -95, 177, -37, 62, -85, 85, -4, -154, -125, -11, -65, 163, -63, 85, 79, -101, -92, -169, 185, 127, 36, 171, -35, -239, -47, -201, -39, -93, 300, -166, -8, 218, 373, 81, 161, 24, -22, -104, -284, -199, -276, 68, 117, -78, -25, 78, -173, -96, 11, -28, 130, 52, -51, 120, 17, 121]
4370A21j33K77j81p2oo6j02J17J09n7J07l5j60J87N1j23o9o7K74j83O4O7q0K50
4394B90l82M1K04j07j29O7l9J23k9J9j66J13o5p4L22k09J63k74J48q8r3L31k47
4417h1l3nK72k53J15o9K01j66j09K05k47J9J99j72K45J4l10M48k25q7k79J61R5
4440f2K69n5l3k62K44j05L1m3K15j56R5q1m1m1pJ95q9j88L47k84J86j4k34j39
4464b52L83l18M15q5r3j81k34K80J29rk7j14q7M1J30J25J24l26q1L23k71J60K13
4487B45k18k88M81k54j89K57k35L33j99j72N10j62k48J70N6n0O0j79l6J32p7j9
4509h2o5L33J82k31j07j50J37k10K79n0K04j98K3p1L48k55o1j6p5L27j85%L0k95
4533a88L2J69L1j56l4M9j23P2K15k22J78l38K73J41k44L3J14j03J82j88K8N7j06
$$ y = [121, -12, 265, 84, 12, 6, -60, -162, -45, 64, 7, 114, 79, -81, 106, 157, 34, -35, -102, 172, -11, 53, 120, 40, 290, -92, -51, 153, 46, -83, -16, -55, 68, 39, 58, -108, 5, -60, -134, 188, -21, 142, -132, 16, -72, -165, 166, -81, -114, -119, 153, -100, 15, -54, 147, -19, -128, 77, -170, -151, 48, -124, 121, 135, -175, 273, 48, -39, -318, -157, -62, 207, 152, 119, -143, 101, -4, 27, -16, 199, 43, 138, 57, 16, -25, -32, 163, 74, -114, 233, -51, 135, 121, -113, -252, 131, -187, 228, 143, 50, -131, -365, -85, 44, 35, 8, -106, -193, -152, -22, 103, 227, -99, -180, 143, -128, 32, 245, 27, -261, 220, -34, -223, 34, -201, 132, -67, -239, 271, 109, -139, 31, 87, 37, 97, -82, -118, 14, -63, -82, -147, 186, 368, 137, 30, -120, 17, -193, 86, 36, 240, 42, 65, -6, 342, 87, 26, 10, -65, 262, 77, 77, 107, -188, -156, 13, 44, -112, -146, -97, -220, -148, 67, -155, 23, -315, -42, 99, -145, -112, 2, -101, 81, -107, -79, -22, -128]
4556a28P8K55j64J21k36j25J41lM5q5N7j04J57K21n2j84o3J32M5k57m0Q3L2j6
4580i0m3M05n59J92P2j39J69J7j71L0J53N7k0j26J87p9P5L6N3k41l2J76o3k2j04
4605f7J87p9nk52R5J48N0k98J67J09k23j09K1L0J04M9J29k0j4j58L1J9K95k18
4629iM1m1N5m1k51P3J28R6q5k27M71j20J54k48r2J43R8k8K4L1l6J75k64O7k29
4654a15N6Q0k68K50j93M38m00K1K11J12m56L20o9O9r4J56q1o0K80n11J34J86k97
4677b31K90Q1k08J51j69J08o1K21j94r3J58n5J70k8j76j28m9J04p0K10j09%M1
4700c7J65j78o3J49k29L58l17m0R9K63l23j16M01l82J81j9O4k1k06J89J07j77
4722a32l7n1L5J69ro1L3K12l20K50J6K2k32K14j80K92j80k40K80M0J22l68j10
$$ y = [-128, -50, 205, 41, 162, -74, -199, -58, -61, -16, -101, -44, -148, 9, 230, 178, -6, -69, 63, 108, -149, -189, -106, -74, -90, -133, 272, -287, -95, -23, -162, 7, 24, -147, -117, 36, 93, 73, -53, 134, 55, 130, 166, 219, -22, -54, 122, 59, 37, -67, 120, 41, 36, -216, -121, 27, 77, -221, -54, 55, -168, -277, -256, -226, -122, -73, 56, 36, 22, -136, -105, -86, 209, -9, 32, -9, 46, 5, -246, -173, -45, 51, -34, -261, 210, 90, 244, -4, -96, 47, 145, 117, 141, 172, 136, 311, 47, 114, -115, -59, 21, -247, 3, -190, 248, -152, -131, 80, 192, -264, 56, -13, 56, -38, 118, 37, -23, 257, -254, -120, 66, -231, 59, 140, -68, 83, -86, 22, -39, 182, -12, -105, 53, -2, 168, 140, -36, -164, -213, -109, -179, 31, -78, -78, -37, 128, -50, -113, 36, -193, 165, -152, -192, -93, 170, -153, -269, 132, -250, -69, -88, -24, -45, -251, -62, 45, -132, -169, -220, -185, -16, -25, -86, -53, 159, -161, 89, 105, 127, -105, 109, -71, 221, 41, -199, 81, 121, 243, -125, -235]
4745b35m2J06q6K84J24l0k5l01K16k48J04K40k54J08j14j49K00J13J71k59j6Q6
4767gl7l9lJ26J47r2m7k27p1M5J17Q5PK7M2R2j03l57K67n2J35j14K96m50R5k02
4793c20L58j25J20l01M33k54K44l46J87o3O3q2R4nj5L88p04M00k04J64j93K19
4815E8p8j87Q3J29j2N8k4J99k68O7j41O6n3P7j50L3K55k09n1J30J01j27J56j40
4839b8j9K24k71J15k50kK37k30K75oK71l08m7mL7J00j63R3J69k34J43j85J49m
4863F2K3j44kR0k12j16J66J13J41k04j91J78K57k49j8L58j69k92m1NJ76RN4L30
4887C24k73j75L71k58P0k8J36k06J95o7j41L58l58m4J12k72L12n1P2P9k77J99
4909G8K06n19K31j39P3J48j21j0o7J0K8k19M52l13k8J49M7J44l69j02N00l9m4
$$ y = [-235, -277, -171, -257, 27, 151, 121, 96, -205, 11, -237, -133, 107, -147, -39, -153, -302, -102, 11, 182, -77, -93, -7, -44, -83, -86, 40, 187, 95, 48, -179, -250, -205, -88, -3, 4, 31, 73, 165, 62, -295, -28, -80, 55, -59, 237, -213, -118, -320, 38, -87, 33, -268, 165, -89, 155, -191, -4, -67, -4, -86, 8, 3, -12, 376, -328, 72, -132, 32, -161, 58, -20, -207, -124, 5, -7, 51, 27, 226, -42, 25, -116, -50, -103, -26, -176, -143, 112, -97, -148, -18, 83, -44, 112, -28, -47, 177, -94, 21, -229, -231, 6, -224, 51, 45, 316, 8, -39, -43, -6, 94, -69, 24, 193, -41, 102, -83, 66, 62, 85, -59, -61, 29, -183, -299, -133, -20, 121, -83, -274, -96, 161, -88, -106, 252, 83, -209, -250, -245, -69, -60, -6, 324, 51, -124, 247, -11, 59, 31, 167, -39, 156, 89, -52, 306, -52, -96, 16, -256, 56, 5, 77, 156, -121, 78, 284, -235, -4, -143, -70, 78, -43, -53, -120, -110, -82, -301, 151, -162, -190, -41, 6, 150, -219, -321, 179, 140, 96]
4932I6jO5O2k86J90l64K35R3k9j45J35r8J09q8n8R5J65j34rpm6J23m3j0K61m60
4958a49J15k04L96k3J20j33k22J45Pj27K39J84o24L79k37J43K4r7j23J66J17k65
4980a69L57k87m7K50j87J89P2pk62m8M13r7%J8k93J42J00j27m9J17p4p0J83p0
5004E4j0r3M8O0j38K93j4j39j14j81L95j75J01j25Q7j04J37j37r7K11k43O6N10
5027C92k95j46K74k75J75k12K73l15J55Nn6m5o6J92L2k37p5J74J12k20J81j43
5049a20K20j57J32o2J4k96K30l5N3J15j42P5k40Q0J74p0k6P4r1J74j85m4J93l3
5073C3j46K46k08J13l2R8J13l88M43j61k3k92K76l29M58L0p95P27k40P0m7r5L00
5096A51Jl2J10j20N3k65Q7k02J22L10%k80K27j10j89J36K07k55j46L09l61L66
$$ y = [96, 95, 160, 222, -64, 126, -238, -3, 90, 61, -84, 51, -47, 62, -26, -84, 11, 176, 42, 33, 26, -20, 103, 60, 50, 311, -149, -34, -238, 158, 135, 255, 122, -100, 45, 52, -75, 164, 348, -276, 103, -134, 9, 33, -64, -187, -21, 96, -169, 188, -99, -146, 104, -83, 106, 178, 171, -91, -139, 274, 177, 177, 195, -98, 44, 144, 17, -32, 85, 11, -59, 124, 54, 44, -49, -1, 59, -79, 214, 200, 61, -53, -234, 161, -14, 87, -38, 49, -55, 82, -55, -152, 59, -184, -118, 392, 97, -49, 225, -50, 125, -87, 186, -129, 26, 31, -25, -70, -136, 56, 88, -149, -224, -50, 62, -158, 23, -120, 100, -57, 75, 13, 27, -269, -39, -74, -21, 94, -48, 27, -213, -133, 41, -29, -55, 19, -72, 102, -83, -127, 66, 33, -113, 133, -75, 38, 6, 104, 217, -171, 272, 111, 88, -204, 72, -257, 201, 231, -564, 163, -77, -7, -54, -149, 151, 152, 120, 230, 110, 163, -102, -15, -217, -95, 215, 215, -65, 162, 52, -137, -1, 206, -49, -195, 114, -247, 119]
5118A19n6j80K17j17L6q9k22K75K1l3K24j97l1p6N4o2n3L09o7j4J44r7R7l90L80
5143A92k40Q1m6l70L13J85j37Q9M3L8j55K35k6l96K01m9J05k76L72K65l82K98
5165C40l08p3J14j07j04J02O0Q4j04k14P3Q2k57K56j2J25l1m30O33q2j27J71j93
5188bJ81j58mJ20k61L26l85j42K14K00k35p7J90L34l02P4j76R2o5N5j31l1K07
5211B4j07L05k32J98j17j2k93M75l02j6J36M0j50J12j99J76n17M74pJ82L0k68
5233f8j5J71k21M8K59j76o7M5J76l98J72j04L22m0k38l34M02L3K4J58j9q2O3k90
5257a79K72j37oo3ok9lj41Q6K91M9q9K8P2m45K25K63k11q5m6L16k44NJ52J43n5
5283A63j48r1q3R9k01J79k1qJ87lj90N2k75L07m1q3M27l57j60L16k40K17k79L14
$$ y = [119, 63, -117, 100, -17, 19, -70, -292, -17, 4, -29, 195, -2, -33, -109, -55, -117, -170, 139, 72, 58, 202, 105, 202, -188, 192, -48, 33, -13, -383, -70, 115, -22, 67, 110, 148, -7, 228, 202, -194, 7, -42, 63, -213, 159, 424, 42, 340, 32, -41, 73, -34, -138, -36, 24, 108, 4, -210, -137, -55, -312, -56, -68, 57, 26, -404, 229, 147, 20, 191, -2, 179, 21, 17, 137, -124, 202, -183, -325, -111, 89, -146, -223, -33, 301, -1, 73, -103, -11, -76, -21, -152, -183, 24, -83, 222, -10, 188, 71, 59, -234, 241, -61, -77, 59, 99, -51, 61, -138, 38, -479, -5, -12, 170, 200, -68, -83, 88, -133, -85, 174, -2, -69, -24, 152, -246, -74, -178, 144, 104, -134, -468, -66, -33, -9, 149, 130, 48, 111, -179, 93, -44, -50, -113, -119, -148, -151, -292, -206, 85, 134, 45, 73, 145, -300, -75, 188, -23, -108, -154, 162, -82, -77, 75, 218, 163, 15, -76, -159, -60, -261, -82, -103, -111, 76, 73, -117, -65, -340, -33, -74, -157, 270, -87, -247, 69, -171, 46, -233, 81]
5307H1k27L00k45k32M45j24M3k24J01M4M3K02m6k41j93Q6O3J77j73K52k65K40
5329A07j97M2J13L9k06N3J25N8j80m0L20j53k12J54J19j61J64k09J77j73N2j58
5351a66L28n5P1J85l69j05J26j6r0L40l59Q4L01l31j48K36k09L3q9K95k5j17N
5374g5l6N3J9k1N8J57k15k8J86rk72L9L62l69K65l88L62j9j57j96K23Q5j38P6
5398c8J35K2r4l1J13k7k05L0J57J05m1j06j59K75l02L21k55q6J78K9j04L57k87
5421a3k07L46k68J00M2K14j25p6L0J52n3l37R8K29%j72J01r9J66m9k2k90L18M0
5445A25l21L17O2l5M6m64M60K12k19k29q8K94k79K04J28m48J92L11j79q4Pr2k3
5468a03K52j95K48l54J00O6ML0Q4k12k97K02M76l83o2p2J53K08j14N7l37J66N8
$$ y = [81, -146, 154, -91, -323, 122, -2, 41, -183, -82, -38, 5, 207, 161, -80, -273, -187, -124, 53, -120, 132, -133, 107, -90, -48, 65, 104, -102, -49, 76, 134, -46, -86, 234, 81, -131, 23, 142, -19, 145, -64, 113, -60, -8, -166, 162, 107, 178, 363, -6, -111, 15, -1, -91, 249, -110, -26, 275, -56, -204, 32, -177, -144, -233, 62, 37, -80, -75, -111, -58, -39, -60, -2, 155, -60, -88, 98, 89, -183, -144, 218, -151, 114, -274, 88, 69, -88, -284, -61, 24, -114, -38, 97, 119, 25, -6, 107, 80, -125, -95, 62, 167, 126, 20, -139, 136, -166, 155, -100, -186, -8, 21, -83, 274, -13, -220, 126, -142, -42, 0, 214, 89, 13, 43, 195, 142, -195, -97, 132, 132, -40, 61, -38, 128, 79, 57, -233, 85, 125, -196, 121, 183, 148, 194, -270, 190, 402, 183, -46, -134, 160, -119, 85, 213, -235, -43, 268, 89, 5, 12, -80, -103, 149, -46, 202, -152, -52, 14, 18, 48, 132, -80, -377, -175, 301, -82, -144, -216, -63, 145, 31, 88, -249, -83, -25]
5491b5j22K20J81k87J79j15K5m8j88J1L43J78k29l43Q8J29k22K28K6P0R1l95R2
5514a13L96k49j83J26j91MK69j95k14L83K9L8j16Q2j55j0J96j33K11n8j95Q0k31
5537b29L78k90L74m64K79j22J71k5p2m4J75N2J21k76j7J9K4n6j25K64k45m5P2
5560h1j6J34j69QQ6Q1r2qj3K18j80m5p4KN9K46Oj65L7k63L64q7j03j04L97k87
5586d9n9J17r9J33j80L71l77M7M2l3k89K58J65J00J60m27m3K02J67l81J72j4J8
5609AR0r7K49k10l1k27J98Q4l10J50R6j8J26j02k15K78j49J71k63L84k73J31k95
5632b32M12j64j24J57MRJ43j64PQ2K9k8l39L02p9j12J1l2L2k6K61Q0J6m11J45
5657b1pj22M1J61j47K26m3j03J1r2P6R9j27J65K9o7n6O7k76L08j91N7R5k16J64
$$ y = [-25, -147, 73, 254, -33, 146, 31, 56, 8, -180, -169, 174, 352, 123, -220, -132, -3, -225, 3, 29, 99, 190, -205, -113, 283, 34, -149, -23, -214, -210, 59, -136, -350, 33, 62, 100, -16, 66, -89, -99, 97, -36, 175, 117, -78, 2, -229, 149, -141, 233, -231, 48, -74, 97, 72, 0, -44, 131, 183, 304, 28, 11, 30, 54, -2, -127, 137, -108, -153, -81, -97, 37, -132, -124, -38, 43, -49, -57, -70, 148, -32, -77, -151, -149, -90, 156, 162, -3, 34, -229, 135, 48, -55, -159, 238, -49, -108, 9, -90, 43, -137, 234, -143, -96, -54, -87, -376, -118, 47, 147, 307, -120, -163, 39, 206, -175, -3, -17, 1, 91, -6, 243, 33, 2, -225, -27, 57, -253, -103, -7, -25, 101, -1, -216, 62, -87, 84, -179, 205, -68, 63, -232, 180, 16, -108, 49, 53, 62, 205, 41, 48, 130, 159, 131, -208, 94, 15, -97, -86, -118, -86, -112, 149, 229, 245, -166, -21, -28, -150, -109, 52, -95, 131, 88, -15, -4, -96, -20, 79, -48, 117, 146, 79, 23, 90, -186, 122, -69, -12, 83, -133, 31]
5682C1m02J55l2J08J43kkL09l05j00K74j24J25l68K72M5j73L6J32J66m49O4j39
5705b36L98k70n1K23K0j46J5J21J34k64K11P5k30Q9j08n9J55k83K62J42n67K37
5727a32M84l40p2j0M9J74L7j22l3j65L1j51J19j87K50J90k90K11j25N4J25J8P0
5750A85j40Pk9K1j28K99k17j65J04o5J0J62L5O5J18l35j42J33J5J28l10K72J67
5773A90l33J66p9j34J11l24N00J14o9mk80O9J78k61J18j57L25j21p0L49l58%J13
5796D3j06m9K39j56J09n9J86j43R8j85l69L77K59l02l7n8R3J61J46m24J17n1j67
5819b78K40k73M29l61J20k2Q9J41r9K13j75q9J29l64M68k34K34l95M54l27K39
5840A39k04j9k0K44k8k87m5J42J8n6K51k01k38M30P0J33n00QJ92k03L10k8k54
$$ y = [31, -371, -216, -248, -140, 3, 1, -1, 308, 3, -97, 177, 53, 178, -190, 82, 127, -46, -10, 122, 288, -161, -97, -236, 162, -108, -159, 64, 84, -62, -47, 74, 208, -56, 155, 230, 0, 89, -19, -78, 77, -206, 56, 198, -369, -132, 352, 12, -60, -70, -21, 153, 190, 68, 35, -130, -99, -250, -131, -318, -68, 122, -168, 43, -82, -28, 97, 115, 185, 45, 52, 23, 44, -84, 215, -2, -167, -63, -128, -118, 44, 79, 144, 262, -73, -215, -82, -67, 61, -249, 23, 190, -143, 23, -56, -190, -79, -403, 97, 211, 142, 138, -142, -73, 105, -156, -38, -195, 130, 9, -61, 288, -70, -70, 43, -63, -112, 127, -29, 80, 21, 207, 64, 162, -23, -392, -15, 244, -58, -95, -153, -60, 101, 247, -177, -60, -111, -278, -38, -311, 118, -243, -123, -145, -56, 85, -14, 199, 24, -65, 64, -300, 168, -66, 168, -227, 227, -100, 139, -65, -84, -104, 140, 112, -175, -220, -78, -60, -116, 135, -66, -304, 126, 196, 329, -171, -163, 29, -174, 136, 108, -146]
5863a46K15j53J66l85N50l14r9P2J50L3R5r0O1K67o78K8N3K89k48k4j05J33NJ93
5887F8mr6K1m8K28j67M6k42J05R4J57j79O2q3J13l7J79m1k84K20P2kk69nR3q3
5913h2J18j24J85P9k79j56K73mN9k74K82j86q5R8q0l6R6K07j43k4o5J06q0J87
5937G2J22l92K15OJ4k4j76J69N4j3k18J34j14j6l0K21J46q1M5k83J17K09j94N2
5961C5L08l54k65J51l7L20l34K03O4j91K4o1K12m3j83K04k24O0P0J58j57J33R6
5984A89k22L43o01K79M4m9j55L1K60k62K22n7J13Pk74O8j02L46J76n47oK20O5
6007H8p9r3N06l64K47o8m90K65j36J78j08J32q0J3J24l0kN1p9Rk22J46M1j37p7
6032a65K49J88m89L24J17J5j73j18J44j19k46M33l06K46o1l6k2J81l74J10q9L15
$$ y = [-146, 69, -84, 82, -303, 247, -67, -166, -94, 56, 89, 184, 94, 155, 422, -256, -228, -175, 114, -134, -158, -263, -130, -125, 68, 64, -32, -11, -59, 169, 2, 48, -194, -89, 5, 162, -17, 45, -38, 75, 38, 217, 176, -108, 112, 184, 182, -87, -92, 1, -82, 36, -88, 97, 176, -103, -259, 14, 10, 69, -205, 77, -109, -194, -96, -176, -212, -116, 91, -52, -76, -141, -35, -115, 72, 194, -198, 17, 23, 37, 13, -163, 6, 60, 47, -171, -37, -151, -167, -197, 24, 170, 89, 134, -149, -32, 177, -17, 35, 343, -11, -276, -125, -162, 158, -176, 27, 91, -100, -76, -137, 75, 32, -151, 53, -171, -111, -41, 117, -40, 93, 189, -33, 310, -291, -12, 32, -17, -172, -141, 119, -143, 79, 22, 135, 142, -132, -64, -166, 180, 356, -191, -197, 23, 88, 9, -84, 422, 58, 305, 237, -253, 12, -124, 54, -54, 78, -2, 11, 135, 105, 103, 154, 75, 84, -138, 8, 49, -88, -165, 84, 272, -217, 107, 224, 239, 66, -52, 92, -27, -273, 160, -146, 100, 39, 3, -19, 162, -212, -102, -191, 124]
6054A24k81R0m9L43J6m82M51l43J34L64k44n0j98R2m5J06j4P8j50RM0J6K38k81
6078c6j3K52k13l4J02j68J85j94J73J52l08L7k7J90r7Q3k72J26J68j79j2J41k58
6101b02K59J96j61j32J22k04M8K5P6J27k70K67j31O4n6O5k09J34j69P0k4JJ7K73
6125A86P9n46J30KM4K36k24L9k3NJ90j93J47p2k39K62l4K01J30l71K50r1j89J08
6149B7k48O0L08j67M6J61j01k9j26k04J99L51l94nJ84j1j73K70p1j86K01K3r9
6172A6j00P5K65j76jJ7j71k6K71l8r7m8J45l2mj24L3m1m5L0J10K7k82L70r8N8
6198A34j73p8K71j42j10m1L38l80M16l35J44L0L9k85m7M30l00k19M36l7rm70J98
6221a90M1n4J01k5M0k4O3J69j10N6N9k21K37k21l0j83L01m28K44K76l37K24L6
$$ y = [124, -157, -67, -116, 227, 243, -239, 212, -131, 3, 367, 123, 73, -125, -33, -78, 28, 14, 92, -58, -49, -9, 7, 245, -36, -49, 203, -10, -44, 58, -110, 75, -119, 54, 206, -102, -65, -92, 98, 1, 84, -188, -62, 106, -73, -85, 56, -202, 57, 253, 92, -40, 82, -122, -74, -49, 27, 154, -116, 151, 20, 84, 28, 93, -116, 18, -151, -81, -105, -104, -87, 186, 265, -281, -151, -149, -105, 131, -93, -54, -77, -72, 118, -75, 72, 0, -239, 23, -11, 190, 320, -51, 199, 108, -81, 27, -221, -161, 147, -20, 26, 187, 86, 57, -69, -273, -74, 277, -117, -122, 62, 51, -122, 148, 77, -109, 92, 115, 16, -84, -9, 256, 80, 79, 96, -75, -101, 170, 132, 35, -13, 132, 100, 96, -28, 5, -36, -81, -51, 59, 86, -196, 174, 76, 134, -39, -117, 154, 12, -98, -139, 199, -181, 235, -100, 44, 74, 113, -172, -219, 211, -89, -308, 128, 91, 82, -388, -190, -149, -203, -102, -127, -87, -111, -48, 121, 11, 67, 126, -95, 142, -79, -109, -292, 9, -419, -175, 101, -236, -12, 24]
6244B4j28K53j03k8N8j06p2P3pj3j88M93n2k67K5p4M30k16J79k73n3J42k26M9
6268h0j50K82J9j00J45rJ83l08J4O1L9l91L33J50n6r0m47M58j14R4K31l84M05
6291B85n89M44j32om7Pk35k9L59j07O6N2j34K39L9J46k60k54J8j68M65j15N5k17
6315a18J59L5k42J12K44J44k77k96K51k07j45K89K03j60j99N1L22k28J20l27K76
6336Gk08J12L02m54J7J40j71M86J4k10rO6Oj92L15j91k97L12Q2m16j65K28N00
6359B74M9j18k26l6K37j99J19J37j97k37J55K03j39K52j5k81R3j30k45J99P3m6
6381g8OJ69j75J29k05Q6j51j5nK07O4j88K96j28m5J57K97j63k03j3K5K0k3Q4k74
6406a26K0Q7l20L13K7l1j42J58l7Q5K64k60J89k95J7n3P9K64k26k21O3P7l7p1
$$ y = [24, -104, 149, 46, 18, 76, -30, -102, -29, -36, -49, -237, 256, 204, -63, -38, -112, 318, 102, 281, 8, -45, 97, -129, -80, -230, 52, 71, -29, 116, 107, 290, -18, -4, 57, 96, -295, 38, 188, 132, 42, -405, 53, -61, 33, 264, -120, 285, -304, 140, 8, 2, -45, -38, -273, -302, 57, -50, 16, 68, -66, 173, 212, 358, 98, -156, -138, -306, 159, 44, 99, -118, 41, 76, -166, -54, 190, 334, 57, -239, 12, -195, -340, -51, 152, -8, -207, -156, 166, -62, 58, -269, 7, -201, -89, 213, -241, -224, -84, -255, 231, 245, 35, 26, 92, 98, -94, 221, 30, -267, 45, 127, -289, -454, -226, 274, 323, 205, -21, -57, 180, -19, 100, 237, 40, -197, -42, 161, 22, 274, 259, -22, 71, -59, -304, -105, -32, -78, -72, 97, -78, 51, -154, -68, -219, -234, -239, -32, 32, -156, 140, 12, -33, 124, 421, 258, 55, 42, 67, 87, 64, 148, -126, -106, -19, -339, -26, 1, -30, -172, -14, -51, 34, 298, 38, 227, -68, -51, -104, -25, 239, 13, -208, -145, -68, -105, -176]
6430a76J62k6k92P3J96n2K18j25P8n3K10j16K3j19%J16r4J63M5k06k43J73n7K03
6454A01l15j2L98k26J39k15P9L12k71q0J04J9O5o4j05J93N3k86Q6J16j34l4l5
6477a12M11n25K86n4M5q9j28L06k33M23k62qj61K0l7RJ93m25L27P5j7J72k66K7
6501b3J83k42J20l1j80J39m4J89q2jo3K67J7k94l7O0n3J74K81L6m52K76k09o4
6525c3K93m49K06JJ25k45m6L19o2M9j00J33L4l16q2J49j0O3j55J21K43l72J06
6548b8p1%J99j55l9J45m2Mj09lQ4K9m8j64K66KJL7q8jJ11l8q8J93M3m76L55j5
6576A04j59R6N2k11L48j01k82R6J82l51J98K47l42MJ84O7o1n6k34L60l55K57J04
6599A47k06l9K1J66R7n20M31k47J64j37J3K7J97L3j15l43K34J79n8o9j70J54K1
$$ y = [-176, -14, -40, -332, -259, -63, -115, 103, -22, 56, 3, 213, 97, 120, 1, 1, 117, 23, 186, 231, 25, -218, -45, -102, 101, -214, -226, 172, -54, 85, -130, -51, 261, -10, -90, 14, 33, 98, 34, -71, 122, 175, -111, -25, 91, -43, -77, -112, 299, -226, 60, 6, 51, -38, -166, 140, -93, 330, 68, 60, -101, -81, -118, -109, 84, -341, -14, 61, 44, 216, -50, -23, 160, -82, 38, 7, -173, -34, -78, 111, 29, 28, -35, 232, 249, -45, -82, -22, -75, 99, 380, 416, -36, 240, 31, -33, 260, -189, 17, 18, 143, -102, -148, 171, 109, 158, 58, 191, 225, -91, -173, -24, -34, 29, -126, -5, 238, -134, -28, -99, -99, 100, -55, -94, 51, 9, 13, -96, -99, -15, 14, -34, -198, 68, 70, 71, 108, 20, 19, 130, 92, 4, 197, 240, -236, 119, 104, -55, 41, 93, -118, 230, 129, -153, -57, 125, -226, -28, 219, -123, -119, 65, 132, 71, 15, -219, 141, -214, 43, 147, -59, -98, -77, 89, 186, -334, 97, -150, 14, -123, -110, -83, 114, 147, 32, -311, -77, 102, 44, -25, -195, -41, -20]
6622b0J83j53J50l84j82L66J60q2j58K76l77K42R8O5O4j29k17J8j9K64j9j63j2
6645b9n7j14J45m9K05O9k74K98K2m80K55J72n5r6r7J77j78Q2J2J89m59M06k19
6668g5K11M2l52K85j53L01m95K42O4q1R2J01p5k43q2K79j59L50k7pl10j7K02R
6692A02K45m07J95l51J18r3Q6J60k26M23m45K59j44Q8mN4m30Q7K87P3j85L75k04
6715F3j5M9j83J82j72Q9k80n3L95m42J96K38M5k52J48R7q7n7j95K43J00k24J15
6738@j92k8K58N2j77K21j19O0j51M7L5J7j03J03o9J21j03K1k17L53m92K81Q5J51
6762A54p4l38L99j59n0K79k47J77m8j89L29m25M12j9o9n2Q5k48K26J8Ol27K40
6785H0Q8o7k50J39J74j50O5j43M5J05j99J59k75L67l4k23J0L57k10K18m7K3n11
$$ y = [-20, 163, 10, 160, -224, -406, -40, 120, 38, -120, 156, -221, 21, 119, 184, 248, 119, -98, -80, -99, 165, 146, -17, -29, -86, -200, -55, -104, 101, 170, -104, 194, 216, -264, -9, 163, 108, 12, -85, 92, -86, -4, 8, 197, -262, 144, -75, 136, 178, -174, 111, -42, 259, -236, 6, 70, -11, 81, 182, 107, -136, -218, 61, -98, 252, 225, 218, -92, -109, 93, 102, 347, -60, 135, -216, -98, -191, -105, 55, -171, 252, -193, 66, -78, 10, 6, 60, -370, -283, 4, 77, -108, 267, 63, 48, 97, -86, 96, -76, 13, -267, -320, 75, -367, -171, 67, 112, -140, 8, 105, 18, -39, -234, 9, 109, -115, 0, -192, -220, 38, 90, -87, 134, 15, 75, -76, -29, 6, 23, -80, 23, -46, 75, -28, -7, -224, 129, -363, -82, 3, 154, 80, -258, 141, -18, -68, 211, -36, 141, 93, -96, 233, -192, 220, 201, 132, 80, 165, -83, 143, 161, 167, -160, 80, 168, 101, -149, -10, 164, 14, 79, -64, -19, 86, -113, 46, -229, 138, 104, -119, -109, 248, 38, 256, 209, 232, -279]
6808b79K01Q6k78j48K26M81k41J56l60J30N3n3n2J18o4j05K40j91nQ6J04P4l43
6831a64K21p9%o6l1K39N4m85M81k37P7K9j4j73J60J88r2k98K85J6k28O5L74m21
6855i9J0K29Q7l00P1oj37Q7Q6j83K57oM0j34l21K59q5M8J55l9j91J80J12l15M13
6880B18k30k8P4K3J5j8j98L26j68N5L0j5k71L15j88m5M1L90l53J9n1N4n9j68L10
6905G8j01k09L13j69K13l01J52j47L45k44r5Q9k28L72k61J84j10L08j71k00k0
6926b02J63J33k42o0%L18k24K57j2q1pj57J74L3J52j67j21O0n5J7m4K2j14L6j9
6951a40j27L01k01M9K44n5M4j53L8J10K1J57p2q2l43M16l94J26K26j35J56l33
6973a47K62K50j95l18J99q5j70j4J11J65m1R9k47rL41o7j30m49L89J13l2J42j44
$$ y = [-279, -78, 8, -270, -418, -192, 289, 48, 204, -156, -26, 27, -26, -78, 40, -24, -129, 111, -80, -85, 1, 105, 179, -164, 57, -22, -22, -88, -119, 120, 174, -311, 170, -67, 10, 39, 25, -148, 12, 200, 108, -190, 95, 111, -117, -52, 322, -99, -89, 140, 227, -73, -2, -8, -145, -58, 28, -155, 102, 96, 136, 2, -319, -60, -145, -97, 58, 19, -172, 8, 120, -195, 218, -12, -40, 34, 57, 72, 54, -144, 182, 14, 69, 99, 84, -187, 128, -60, -105, -64, 326, -27, -8, -59, -5, -64, -232, 78, -23, -232, 81, -88, 125, -176, -24, -171, 174, -70, -165, -76, -304, 68, -193, -9, -119, 189, 18, -182, -202, -39, 94, -148, -208, -208, 110, -114, 143, 131, 50, 43, -114, 60, 93, 245, 78, -43, 17, -38, -21, -65, -43, -157, -121, -140, -267, 34, -167, -118, 126, 71, 115, -38, 0, 110, 131, 288, 216, 134, -209, 207, -187, -61, 165, 30, 186, -147, 115, 365, 170, -148, 51, -34, -204, -218, -107, 58, 17, 116, -131, -140, 201, 134, 4, -445, -56, 57, 25, 167, 23]
6996B3J16j93J47n4l68K64l2Q1j9J16q6o8J16J38j49Qk44M80j69j73j73O0n1J04
7020a26J55m3j36M3N1O6R5k65L74mOl96J1J19l76L32J52m6k3K7k48R7k38K71j07
7045b09r9N38n05L01p6j75L60K91l10P0p9J97j86j86o4M42j92N4k35j24Q7J71
7067G1k82J81J77j64J03N0k33KN2O7j89O8o9L01qm85K36J25n0j09l8K30J55q7
7091A04o0k14K97m91K81k0O1J19k03K34k9k9j10L89o18N9M53k32l6r7j5N3R2K19
7115B07l39l6n5L56j29J4j4L3L7k32K01M0J15r2j51j51P02o87K15J9j10J82L4
7138A59j01l36L8J77r6K44J1o5J57j11k1j79J63k41J57r0K19K0Pj47j86n5K00
7161g6Q0J57j83O5l03J50n7K64J64k36j36K8K27j29L5K4jk80R4J07o8k12M72j85
$$ y = [23, 139, -54, 93, 39, -329, -65, -97, -16, -35, 81, -5, -73, 43, 181, 32, 40, -204, 276, 107, -66, -239, -179, -230, -126, 29, -14, -150, -107, -56, 10, 105, -160, 214, 210, 216, -180, -169, -50, -426, -94, 58, 12, -11, 16, -232, -135, -373, -102, -209, -308, 230, -275, 26, -50, -225, 135, 426, 116, 186, 107, 304, 118, -68, -132, 310, 118, 172, -63, -187, -100, 71, -211, -30, 147, -17, 86, 136, -97, -95, -43, 24, -165, -97, -166, 135, 127, -358, -122, 3, -47, -156, -194, 36, 191, 104, 44, -170, 127, -364, -83, -103, -42, 77, -126, 108, 79, 50, -60, 329, -289, -230, 223, -9, -45, -142, -157, -104, -12, 207, -132, -168, -223, 133, 4, 18, 4, 37, 74, -158, 43, 83, 198, 106, -45, -196, 506, -181, 34, 53, -57, 125, 159, 58, -278, -240, -63, -159, 85, 96, 31, 188, 77, 56, -123, 40, -201, -44, -134, 85, 105, 112, -35, -221, -276, -76, 4, 161, -22, 43, -260, -110, -167, 97, 261, 25, -111, -83, 144, 15, 50, 74, 73, -207, -113, -6, -74, -286, 186, 1]
7185Ak91J05J26L16k10J17m46J73K02j35J97k04j37K70k24K37o3on7J69n53J95
7207b18L32M3m8k15K17j24J28n8m0j75J17p3J31j01J72l4k08L77m26J57m1J40
7229E3k78K02n2M43m94q6Q7J04r2K5r5J77r0K06R7l29K04J15J32l34j19K04L1
7252A11j83o0K96r8j71M10l10J23l6J0k08M6R6o9J45j5k01L56m0k36j09J72J84
7275B13j75r8J93j27O5r0K39q9j10j12L1n1K14n3o1J44j64k09L64j1k5L1J9k29
7299i1j7J89o5j24j69N02J4j69k24J42N6n3nj32J93M2Mk76K5J32J79k50J9J90
7323A12r4p0J88k41J53J65Kk18J83k70l86M19j15L99k64J92k28J61j31O3k96M44
7345A68J84l07O1J91k22j32P0P6k75L43l4k18K15q3J73m1M8j13L0j28K00r5J27
$$ y = [1, -290, -185, -59, 257, 47, 164, -282, -109, 93, -42, 155, -49, -186, 84, -140, 97, 34, 28, -29, 140, -413, -218, 114, 157, 109, -106, 111, -13, 115, 57, 17, -158, -41, -114, 17, -84, 88, 54, -154, 223, -203, -46, -87, 53, -225, -23, -75, 368, -126, -212, -125, -21, -113, -88, -183, -6, -96, 110, 207, -122, 82, 197, 329, -5, -124, 80, 111, -72, -132, 164, 66, -105, 305, -5, 118, 82, 92, -116, -70, 26, -43, 102, 87, -114, 242, 202, -34, -143, 29, 213, 38, -60, 133, 6, 71, -19, 220, 131, 21, -91, -60, -111, 103, 50, -11, 133, -31, -240, 124, 113, 88, 119, 138, -91, -108, 81, 16, -108, -277, 225, 239, 70, -154, -12, 44, -9, -14, -146, 47, 89, 93, -183, -158, -26, 153, -97, -78, 112, 18, -52, 136, -105, 48, 213, 215, -3, 180, -90, -476, -57, -172, 227, -37, 155, -73, 88, -43, 20, -276, 168, 352, 45, 106, 297, 75, -57, 13, 89, -186, 157, 123, -95, 120, 37, 210, 169, 217, 104, 134, 6, 206, 111, 238]
7368B38l99L67J2jk62R3j00l9M03k46l01N34l63K9M1q9J69q6K7p1Mk68L81O7j83
7393d3q7M18j92k96K54l41K50q5K88k32q2L03j23K9R9k97J55l4mj15K67k01K64
7416A95l23K2L10k88J09k3J85k97J95k33J71p8O8l98N25j20l16N19r8p4O3J09
7438B23o8k9m31K20J83k74J34K64k31j87R4j84L40l1n6J30j99K94k32N0k7L31
7460C14k34L5l10L29O6k76J72j79M2J61n3n2k6K57L9j71j64K8J62J3k3j91j53
7483b14J70k21J74j25JM29k62J02J42k06Jr0j02M83m1l31L76l90K31O3j39n1p4
7506g4J04P4O4J17k80j72O9P3j44K86l0o7j0J11O2l84L40n4j9K10l91Q1J50r6
7530B0N2N9k0k67R4K36l84K56k07Q0N0J68o1j32JLK26j48k44J36M2q6o0J56J16
$$ y = [238, -161, 206, 218, 217, -45, 48, -52, -91, 312, 66, -235, 299, -64, -35, 6, -83, 86, 0, 27, -44, -40, -308, 73, 140, -43, -130, 288, 96, -200, 54, -287, -37, -122, 166, -66, -148, 155, 32, 61, 160, -137, 18, -16, -20, -135, 132, -69, 195, -128, -106, 204, -84, 25, 2, 187, -110, 85, -148, 23, -55, 13, -385, 140, 20, -296, 223, 125, 51, 114, 223, 155, 126, -305, -85, 98, -176, -42, 222, -9, -196, -102, -286, 54, 23, -33, 97, -102, 192, -40, 10, -17, 314, 80, 115, -195, 134, 200, -76, 96, -83, -41, 120, 67, 15, -11, 246, 285, 114, -50, -22, 140, 153, 130, -61, -214, -44, -265, -91, -216, -215, 214, -48, 54, 196, -10, -9, -99, -201, 282, 241, -90, 286, -104, 127, 190, 51, 0, -74, 30, 104, 168, 285, 5, -167, -98, -25, -169, 117, 87, 20, 10, 121, 183, -201, 139, 85, 66, 276, -115, -34, 116, 20, 72, 131, 111, -156, -62, 174, -210, 46, -161, -81, -31, 137, 76, -56, -55, -52, 174, 26, -218, -82, -40, -126, -186, -30, 86]
7555H6l5j18K34k20j9q1J64j74J63j61O8J7M3j6J09k58K71mj31o8p4J62l9J62
7579H1p1O3l31K70j17n7P8L08k6r6J9l3L38o11M86m13k8J44L7P1j73J7J62K27
7603C45m76L13j58l13K20o3K31l06M18k61r0M29l50j85Q7J08K30j72K67m00K03
7624G7J77m41J54m13L89K55l31K57n2k89m1M27l37l2K58M6j51J6J97n8k31J23
7646@J46k07n6K32k19j4K18L15l03j80J74k66j33J80K18k56nQ5K61R5m12q4K67
7669E6k50K16j10k2j01K66M7l07K03j73K02P5J03p9l41L86Rj24k1j46L51m22K02
7692B0J37j85l5J52N9N3k79L06M4l70M9j2O4k6K40j61k17J23M0j25J97r8O7J18
7716A61l3j4j23j0J79k53rL33l74K70k7J23l71k6J42J07p3J00j51L52l93J61j05
$$ y = [86, 51, -67, 167, -53, -72, -153, 11, -163, 0, -161, -93, -76, -33, -49, 60, -198, 73, 69, -62, -130, -204, -42, -81, 81, 10, 73, -258, 12, -105, -162, -84, 224, 198, 102, 121, 88, 426, -185, 301, -112, -140, 4, 41, 112, -61, -44, 118, 345, -131, 182, 24, -289, -69, -132, 99, -207, 211, -50, -140, 289, -61, -246, -159, -51, 179, 7, 274, -126, 77, 254, -187, -33, -446, -57, 198, -133, 124, 72, -217, -258, 169, -168, -200, 58, 104, -47, -31, 166, 108, -123, 0, 146, -61, -117, 115, -104, -118, 100, 415, 112, -68, 106, -160, -293, -113, 105, -151, -156, -71, 190, 285, -127, -211, 56, -194, 22, -88, -110, -211, 55, 102, -205, -2, -175, 27, 102, 205, 126, -215, 171, 180, 56, 35, -111, 240, -182, 20, 157, -28, -63, 89, 148, 201, -78, 228, 272, -98, -49, -61, 3, -23, 217, 56, -161, -38, 2, -123, 74, -24, 43, 161, 128, 114, -9, -19, 160, -93, -102, 231, -143, 127, 100, 223, -148, -174, -32, 75, 2, 102, -49, 303, -90, 71, -34]
7739c4K1OK7j62J26J05j05K17M0l16R7k83R3Q1J18k41J19J75k57K06J77j18j90
7762i8J40j73M3L4N6J37L2l29J58p1J50m0J32j08k18K3L25k88J89j22j79L68k45
7785h4J79m43K86l1N9j81K09L61j69k61K33k59J33j61K28k23j05L80r5j68k7r
7807a48K16M6j91J90j14Q8j59k1M60n82M2K41l9j13K17j33k7K00m1j74j3Ok01
7830b50lM80j45k7m2k2j86Q5L35l38K38j03K9n4J04Qk08J90j07j9L4J62l8q2J88
7855B29k08k16R5r8K57R0o4j89L2L40k35K12k49j97J49K20k19R2k08J16j81K74
7877D2p5J37p0o2J09mQk93J39L8J59O4j18J92k42P8O6L2m39L33j42r3K38l12M15
7902B00j47q5j49J17j8p4J70m6K71k10k81L14k29L23l44J74J53j6k15O6K92j98
$$ y = [-34, -13, -7, 20, -142, -16, 89, -16, 201, 241, -75, 22, -261, -168, -87, 31, -210, -91, 84, -173, 33, 210, 92, -98, 42, -131, -88, -54, 2, 139, 171, -158, 0, -71, 79, 39, 171, 63, -155, -132, 193, -95, 94, -28, -207, 161, -84, 95, -348, -62, -93, -34, -215, -6, 355, 186, -75, 158, -101, 32, -129, 99, -124, -229, 151, 56, -112, -139, -148, 68, 114, -77, 113, -1, 87, -72, -93, 367, -215, -173, 68, 29, -84, 133, 0, -27, 173, 132, -42, -55, -49, -250, -253, 227, 82, 55, 13, -9, -195, -110, 225, -113, 125, 22, 51, -3, 101, 109, -99, 91, -16, -35, -1, 161, 123, 41, 229, 21, -195, -100, -198, 59, 149, 85, -104, -72, 268, 33, 245, -4, -201, -52, 168, -51, 41, -167, -51, -232, 42, -33, 104, 34, -28, 81, 77, 85, -208, -69, -31, 128, 192, 74, 266, 24, 102, 168, 200, -239, 94, -48, -141, 97, -215, 200, 53, -32, -181, -64, -82, -156, 14, -32, 239, 29, -252, 62, -167, 156, -188, -14, 139, 123, -92, -26, 266, 68]
7924F8J8m4j17q6K2J16ro6J71J45j56M1J55j51k00M3M1l36P6J77K62R1j64j94
7948i7j6K94j32p5K14j18K6P4k96M5J12J09k57o2J23QN8K8J17m68N69j63%l6j09
7973e2L2l4K01n1j05Rk5j78K02K9j12R4q0k66K69J51k28J17Q8k09K5M24l11J09
7997I9m6r6k33M72l55P5N8J08M0j09m6l3J02J34l03j05J88l5q5L8k14M56j23k5
8021c8L55m44J78J32j33Jj68J16J95k48M5mJ47k31J70p8l8J13J88m35Q3K10j94
8044g8k25N85j44r0O7p2m4J37k23o6J19R4J40j61J24m24R1K28l2J27o9K2r6k14
8068b04K9P7j53L38m2m1p6j41J68m0K74k38k00J45J60m18K58K18K27j23k99J65
8090H4l72K4L69k56R7j13R4J11j20J00J51m23L23k00qR4k5j1M82n18k0L17j40
$$ y = [68, 86, 42, -75, -161, -139, -23, -32, -98, 73, 218, 62, 103, 258, 107, -93, -50, -9, -345, -269, -92, 170, 261, 97, -97, -113, 181, 49, -26, 188, 70, 96, 170, -126, -81, 31, 140, -117, -179, -56, -48, 10, 38, 155, -313, 256, 93, 93, 57, -52, -20, -54, 147, 96, -9, 0, -25, -203, -1, 28, -84, 10, -70, -336, -67, 84, -144, -27, 61, -148, -123, 301, -10, 99, 53, -43, -276, 196, -159, -84, -26, 82, 122, 13, -33, -66, 36, 170, -133, -238, -50, -85, -170, -132, -346, 110, -13, -38, 317, -127, 51, 183, 50, 51, -117, -1, 194, -54, -9, -13, 134, -97, 73, -5, -43, 70, 258, -177, -94, 116, -78, -303, 282, 138, 48, 115, 43, -1, 136, -87, -153, -34, 60, 200, 39, 163, -261, -170, 58, 26, 153, 84, 106, 10, -204, -175, -98, -251, 87, 45, 4, -72, -213, -45, -85, 189, -49, -249, -104, 56, -362, -104, 114, 341, 218, -81, 84, -288, -264, 105, -151, -54, -167, -73, 38, -82, 18, 169, -254, 69, -131, -139, -45, -70, -81, 401, -117, -137, 180, 40]
8113D0K37j90j85K57n3k97J41q4k68O45l6j25nk59J12pJ78k32J44Lk39L59q8K9
8137G7j88K26j74j70J54l2K55k66K25j78p0K91k33L31j30J3o8j43O4k03J71P4
8159B6o9k22K29j0m4K11j15K12k3j23m1J4Q7o9j1J84j84j11J17k42jL97m04L09
8183A17j33J23R1j34k09L70j07r0
$$ y = [40, 277, 87, -98, 159, 106, -191, -50, -134, -402, 243, 207, 82, 77, -182, -70, -77, 101, -131, 13, 16, -223, 136, 48, 77, -111, 115, -59, -229, -75, -107, 148, -118, 107, -71, -141, 150, -83, 248, 118, 131, 63, -80, -16, -219, -48, 26, -43, -265, -36, -46, -90, 121, 6, 218, 195, 72, 31, 45, 132, 63, 52, 236, 52, -59, 58, -184, -185, 212, -192, 117, -16, 107, 198, 64, -145, 225, 118, 28]
8191B8
$$ Imaginary data points
##PAGE= N=2
##DATA TABLE= (X++(I..I)), XYDATA
0@%%%%%%%%%%Qj6J6j6K4l2L8m6N6p2Q6j02J20j36J60j92K24k56K96l43L91m46
32b38N08n76O52p35Q26r26J035j156J290j433J589j763J951k155K381k628K896
49A518l190L514l871M266m706N197n748O371p086P912q878J0029j1427J3168j5405
64h336J8399k2640K9157m0569O6332k34112N830K82600k20997J951J29677j3423
76f131j4745J57819k9838n6385P7734p353j19427P0626M7991j09953k1794O1742
88E0286r7865n3797Q7831j3312j09771J7276N2492J2336L4945J1544k0803O6218
100C7380N8445l3221K1047N7705p5425p5245N0659R077p1570j1043l591m0690
112g6472J9737L0977l7724J6408N9386m3873m3288Q4173M7992n7290j0271L9887
$$ y = [0, 0, 0, 0, 0, 0, 0, 0, 0, 0, 0, 8, -8, 8, -8, 16, -16, 22, -24, 32, -40, 46, -56, 64, -72, 88, -104, 120, -136, 160, -183, 208, -238, 270, -306, 346, -389, 437, -489, 546, -610, 680, -753, 836, -927, 1024, -1131, 1250, -1378, 1518, -1672, 1842, -2029, 2237, -2469, 2728, -3020, 3351, -3735, 4177, -4701, 5328, -6099, 7069, -8336, 10063, -12577, 16580, -23989, 42343, -191769, -185939, 96661, -124336, -122385, 7292, -6131, -20876, 136943, 107105, 50720, 128454, 121101, 1674, 72300, 120291, 10338, -11456, 50286, -47579, -101376, -13545, -26857, -136628, -119352, -66860, -54524, -19579, -8035, -28838, 37380, 95825, 62604, 83651, 141356, 65931, -9314, 41345, 50422, -21148, -32191, -35782, -76472, -56735, -25758, -63482, -47074, 12312, -31561, -74849, 9324, 57316, 26, -10245, 29642]
124B9642J395J3621K9723l8245m8497K3300K1499l2662k9499j0997p948J4272
136c4396J8689r941j773L5309K5417j3305r930K0563J4396k0872k3805k202j561
149c411m667O500o664k4929L418K8460J608j5135J790j16l523J8984J5878j1296
163F897O01J7385Q98k167N837q806j5271j675j2341k1243J972O486j0783l754
177c5964J2256J2957J6445J0118j0993J117K3790L266j5749j013k995j2660P997
190H572Q329j9721q137J2644q807j4354Q342k084j3134J1096Q577j4582R871L0335
204A6947q83r851J5443N984j0225M437j404k3562p602J0471p253j0512N566j01
218a2545k898J3363O556r692J837J1247n144n915O765K172l118L090M50k443M451
$$ y = [29642, 31037, 44658, 74381, 36136, -12361, 10939, 32438, -224, -29723, -40720, -48668, -34396, -15707, -25648, -27421, 7888, 33305, 20000, 10070, 30633, 45029, 24157, 352, -1850, -3411, -8078, -1578, -8242, -33171, -29753, -1293, 315, -14820, -13030, -13146, -16669, 2315, 18193, 6897, 7498, 24883, 25781, 23614, 29451, 20645, 5374, 3699, -8642, -29885, -27913, -21427, -32210, -35964, -23708, -10751, 5694, 15812, 4819, 5936, 29726, 32992, 17243, 16230, 13235, 575, 8572, 16901, -2820, -10957, 1687, -7120, -21474, -13132, -15216, -28350, -17254, -8677, -23259, -13388, 16947, 16064, 6213, 21656, 27640, 17415, 21852, 20448, -3114, -10716, -245, -7498, -18010, -12444, -12545, -15443, -2080, 4476, -5216, -3379, 7868, 2724, -3191, 3574, 5746, 2628, 5718, 6168, 3725, 8176]
233H176J941q785n576R04l695l013P57j887j16Q426N897J337N234L760k753l31
249A0276j83o252o012j748l862l588J700J765j87L684L988r13Q67M723J17l210
265A165Q36K223M80J866J665j067j106R76k137m705m850l702l749j601l09K9K668
282a1318O399N226K671M594O249J147k619j257r84l837m526l128j401r87j946
297e717j442j65J244m98j597R36K110J98M23M169M491K357K829L252J351j498
313A2443k245k997m300m561m678m074j827o97l07K781M418L440J868L049L206
328E519Q11k83J053J277j307j765q01N30j305k047j936j841k742l448k379k50
344a0914R69J578J504L611M243L175L113K783K198p45k006k229l066l579l311
$$ y = [8176, 10117, 1332, -4244, -3340, -7035, -10048, -9291, -11178, -11294, -2868, 3029, 4366, 9600, 13360, 10607, 10276, 10093, 3841, -2171, -3919, -7781, -11369, -9669, -7904, -8091, -4407, -419, -1332, -465, 4258, 4375, 1165, 2001, 4224, 4704, 6570, 8235, 7168, 6062, 7038, 4901, 196, -4654, -8356, -12105, -13706, -14015, -13986, -11318, -4919, 307, 2978, 7572, 13821, 14968, 12349, 11092, 10108, 6271, 1745, -1383, -2784, -3771, -5717, -7159, -7324, -6080, -6578, -8175, -7239, -5129, -4931, -4508, -339, 4152, 6509, 9338, 12590, 13941, 12443, 10198, 7201, 2901, -1660, -6338, -10412, -12239, -12936, -13243, -10462, -6044, -2604, -736, 2313, 5519, 6330, 6047, 7100, 8377, 7070, 5305, 4504, 5034, 3729, 1682, -254, -2095, -4837, -8285, -10664, -10914, -9945, -8367, -6863, -3252, 991, 4166, 7279, 10062, 12260, 11515, 9509, 7280, 4214, 635, -2676]
359b676j415j592p22m56M92L59J504R27J72J317J863O12J147J887J958J164J274
376G815M21j538j848j577k717l120k465k055j354k1J047J147K691L411K372J452
392C661J143O08r7l94j600j476M95n56k195r32L4m44p99K52j337j277O80M45P66
411c023J984J394R38L481K080j379m40K000j926m102j912j455k379k60n74j560
427g133K171L634l29M68K210L73M62K361J07k925Q14K415j902r68J112j409j527
444f6L60k886l345J680K78k934Q22L339J91J558M441M39k03L293J41k870q45p30
462B663k654k98N71l818j510K770M71k171J221N42n31J719P93k172J588L339J15
479B638p91K243N7l01J389j963m038J51J026l144j903L00k22J168K920l39r28
$$ y = [-2676, -4091, -5683, -6405, -6861, -6369, -6010, -4506, -3579, -3407, -2090, -227, 385, 1532, 3419, 5377, 6541, 7815, 8236, 6698, 4850, 3273, 556, -2564, -5029, -7084, -8438, -8459, -7412, -6265, -3574, -163, 2209, 3661, 4804, 5412, 5315, 4921, 3321, 1845, 2340, 1784, -411, -1343, -1309, -1753, -2552, -2300, -3637, -4914, -4234, -3789, -3023, -1039, 355, 1293, 4774, 6854, 5475, 5035, 7035, 5109, 1007, -905, -2360, -4739, -4999, -5573, -7133, -4962, -1328, -1657, -1189, 1021, 1394, 1856, 4217, 4324, 1399, 2213, 4628, 2726, 1758, 2870, 1461, -66, 294, -2592, -5937, -4257, -3979, -6913, -6091, -2752, -2561, -1003, 3438, 3877, 3674, 6967, 7108, 4238, 3393, 2663, 9, -289, 282, -3536, -5046, -2276, -1805, -3976, -2755, -2213, -2744, -1025, -232, -2404, -816, 2523, 2638, 1847, 4090, 4147, 3846, 5235, 3272, -766, -615, 411, -2733, -4636, -4336, -4558, -3390, -470, -809, -1737]
496a737L078K184k100l40P49q39k45Q59j492j382K057Q51j600j082P42l47r7k84
514a025j140q9J385N76N32M28j85J753J504j460j678k28m94j034l38j271p45K577
532i32N13j664P95L060k47m21Q88q43r61J966j40k278q2J018j97K13m49j655m38
551a854J852j585j980J488N10l34J929Q37p58K311J910j832o17J409j726j228
567C32J077k366k548J987J364k861N54J934j219N44J900j902j086L759J84k635
583i82K150J890j754N42J692k892o65K293j933l759J633N97k235J541J391j632
599b123R25L399j083j448K585n77j926J548j39k241Q22J788j934l68J228o66j104
616a314J332p82j475J676O70j189P90J530j023R77J754j864q57J390m60k528L05
$$ y = [-1737, 1341, 3525, 1425, 1085, 1834, 995, 750, 1609, 117, -1265, 792, 1643, 43, -1039, -297, -644, -741, -1025, -2165, -2254, -869, -293, 239, 667, 482, 2235, 3739, 2279, 601, 373, -121, -1155, -1493, -2764, -3509, -932, -419, -2083, -1288, 1772, 1525, 1104, 1992, 1149, 188, 2154, 2014, -264, -346, 672, 475, 688, 239, -1416, -1854, -2, -1587, -3567, -2079, -1569, -1903, 26, 863, 105, 2416, 4326, 2494, 1877, 3286, 1560, 332, 1409, -957, -3505, -1518, -154, -3015, -2461, -527, -1746, -1202, 698, -1204, -2290, 1469, 1653, -982, 1168, 3058, 1304, 1846, 3538, 646, -19, 2274, 341, -3418, -1785, -1188, -3423, -1882, -491, -2123, -1198, 2201, 1118, -330, 2255, 1678, -248, 1300, 1161, -1080, -258, 1530, -404, -772, 456, -210, -1314, 18, -764, -2239, -563, 107, -1082, -292, 1238, 215, 1192, 2946, 1082, 225, 1615, 1155, -1373, -1068]
633a068K05j285N31P79j214P74K164R8j247J335P71r27m28J125j171p64J632p32
651E78q50J89J29q44m90J14p41J14Q01j69l65J506Q61J78N48P27L27l48k55p84
671A226n16r80o17l35k51k32R4J57L33j41mQ03O32J06K35Q0L53M41M19pm74M30
693A752p27n30m81m50r41j1j25p00l4Q29O30M6P21R92n3K17L01J21m10Q5m73n88
715A71L1M6n79m27K55m06m68K62K75n58N89N24l7L03Q41J6M0P31l85P1m86l56
737D53m77j62l09n22j04J58L0N0M93O10k06K22k4K17P1K70k55j8J77j69l74J04
759B35p1j94m03j2l92j84J35J25K01L53N22J95K42J55J2P4k22k63k83k14m1k90
781c20k48L01l55L0K24j15p0K58Q0K04n3M12J28M7J86K91n83K21k65n04J70j26
$$ y = [-1068, -863, -2148, -1617, -838, -2052, -1278, 886, 984, -263, 1072, 1843, 916, 488, 1613, 442, -322, 1310, 578, -272, -83, 46, -798, -1288, -1174, -1915, -1801, -1000, -1169, -1534, -28, 833, 1011, 1559, 2286, 2613, 2265, 2010, 1226, 710, -270, -887, -1222, -1473, -1705, -1611, -1454, -1121, -1262, -1266, -463, 169, 275, 510, 590, 943, 1384, 1803, 1796, 1322, 1752, 1025, 495, 14, -436, -1377, -1388, -1513, -2213, -2247, -1418, -788, -742, -21, 971, 918, 1135, 1436, 1557, 1147, 1232, 759, 171, 202, 248, -331, -758, -503, -909, -1377, -1115, -840, -1398, -809, -285, -322, -19, 822, 838, 878, 1609, 1224, 1295, 809, 453, -24, -186, -495, -1017, -1121, -963, -933, -883, -390, 220, 14, 236, 212, 429, 500, 770, 515, 497, 674, 505, 131, 235, 164, -30, -433, -445, -837, -1021, -886, -761, -560, -207, 315, 510, 752, 907, 919, 993, 771, 508, 225, 11, -30, -320, -568, -267, -622, -592, -368, -483, -553, -295, -215, -11, -64, 348, 476, 523, 709, 1000, 417, 638, 373, -131, 39, -87]
803h7n19M6l72Q0J16J6N31J72K96j54M11o1K16l27N0o1k17M88m66J51k27j69k85
826c72j42P8j5j40oJ63k1J65M56K57M3L53k06m2p5k01l40Q6k47o8n5o8j58L7J89
851c29k8J55Q7k36K21J44J24J49O5L7L6p4J31k35N5l15p4j22k3j70j70L77K0J0
875a65J27P7j48J93L68j78k67J80J02p6j87K84l11K14p2J38l85k16K69k83K20
896a16l7k73Q8M10m0l26N12J59l9k00K09j98j06k48J54j80m3K46j1L7j00P8j11
919a35M01l94PO5J14l73K43R7j5k0j02L55Qr4k49P5J66j97k4RK57J2n9J23l61
944i1J60J43l99r9K13n40K94K93M8k19K90N3J79l7J22m34N4J09k5j04k44J98p
967d3j1j00j86L00l6j75J94k45L21O5r0L01k65K96q7k93K02J45l39K4j28K1j76
$$ y = [-87, -606, -560, -932, -852, -736, -720, -189, -17, 279, 125, 536, 475, 691, 364, 414, 353, 136, 624, 158, 309, 82, -87, -372, -514, -436, -451, -591, -597, -434, -455, -290, 166, 423, 466, 819, 613, 571, 496, 295, -45, 41, -206, -274, -329, -397, -555, -518, -329, -357, -202, -115, -351, -130, 14, 138, 287, 352, 389, 425, 351, 482, 247, 302, -13, -87, -209, -232, -402, -572, -195, -175, -165, -38, 39, -109, 84, 452, 274, 7, 187, 289, 213, 26, 310, -1, 213, 141, 279, -106, -322, -53, -336, -116, -153, -426, -338, 72, 32, -294, 218, 377, 338, 138, 347, 149, 43, -205, -51, -231, -274, -28, -39, -2, -102, -24, -135, 266, -128, -121, -56, 58, -315, -72, 25, 10, -10, -112, 243, 251, 157, -92, -17, 149, -48, -72, -63, 194, 206, 147, 270, -91, 69, 212, -187, -286, -73, -613, -319, -26, 22, -197, 93, 146, 325, 288, 410, -24, 30, 139, 114, 10, -234, -36, -43, -54, -154, -340, -40, -76, -251, -57, -302, 19, 84, -6, 295, 30, 326, 239, -54, 148, 293, -46, -22, -150, -129, -305]
990c05M10l47j37M00j62M7p4J60K8r7K67m4K71k79k8J40pl7m47K07P7k18k53P5
1014c53K88l08M21r3l82O63o4J56j68K51J17l27k9j34K70k47j78q5J28j12rP0
1036a25j41N0r1qK84P9k04K94Q8j08J48n1p4k60q1L90m71R9l50J14K10j01J8M9
1060b42j1K06r1L38J8J68k32J08l82K97J58k31J06j09k5j98j4n19K87J10J9r2
1082c31L37j70J70J98o8K48j68P4j39j58J27j39oJ24j40J0k21Pn7k02K32L96q0
1105D4o8k47N02r8J86j19m8j24O6j24R2R5m8j23j95J17k67J07K23n0l82N41r1
1128a1K03k53qL08J04m1l9j17m5l10K53p4q1k36L78l30k80L75j69M08j67mJ29
1151gL48j35J51N5k95K4j52M04l79J2q2j80J48O9o0J65l26J22j5l66K15M95j73
$$ y = [-305, 105, -242, -379, 21, -141, -94, -168, -8, 20, -77, 190, 146, 417, 138, 110, 250, 243, 206, -241, -34, 43, -175, -428, -353, -65, -373, 48, -45, -427, 236, 172, 328, 160, 411, 528, 201, 172, 38, 308, 61, -117, -202, -74, -186, -195, -125, -266, -216, -307, -315, -31, 48, -156, 138, 226, 118, 266, 215, 141, -119, -200, 190, -281, -182, -532, -418, -208, -309, -291, -242, -253, -47, -138, 200, 218, 386, 154, 262, -120, 177, 335, 104, 210, 101, 76, -122, -136, -655, -368, -258, -239, -331, 6, -164, 6, 204, 136, 384, 216, 290, 151, -7, 120, -19, -25, 99, -41, -31, -252, -245, -302, -504, -272, 124, 44, -24, -271, 231, 133, 319, 200, 152, 28, 94, -30, 62, 157, 109, -14, -209, -92, -359, -252, -29, -79, -461, 80, -11, 192, -61, -69, 239, 343, 302, 263, 146, 101, -209, 44, -30, -111, -347, 31, -299, -579, -204, -373, 35, -132, -136, -7, 341, 206, 357, 412, 117, 141, -11, 393, 14, 26, -56, -236, -88, -19, -79, 86, -240, -118, -133, -499, -284, 211, 38]
1174C8j8J17p8R6j84K5o5L53r8q6m00J94N7n3J13l25K72k3o4M18p7l42L23k38
1198d5J37J67l26J48P6j91j36K36K8j92m9l1J46p8R5K56l32J21K24j30k23L12
1220B13m41L68k92K20Pj06J11j9j89K12j17K52j21j85N3L9j84J48p5L3j13J28
1242e8k74K87K74q3J33K7k60P1k61j01J91J19k57J31J17j73L23l35j42P1K33j30
1264i7NJ73R1k90J21K3kKK01k11J04k19j24L9J44l2M9J96j83J6pM9K8l1J05m6
1290A04Q8j70J47l24K21k39L24k57K50j99K43m31L7L05l81M87m01K3K48j22J98
1311A51j4k50J46j34J63pR5k52JK25K5p3O6k3L20l69n8K0k65L50j34J6k26K31
1335DJ34j79M83k87q0K47q7J4l76K7k30K61k64J47J94K35l09J60k51P2J80j03
$$ y = [38, 20, 137, 59, 155, -29, -4, -69, 284, 186, 100, -300, -106, -49, -102, 11, -314, -42, -65, -129, 289, 212, -130, 193, -45, 92, 259, -67, 81, 157, -34, -170, 66, 94, -98, -147, -178, -32, -110, -15, 241, -91, 30, 254, 124, -99, 213, -228, 140, -152, 68, 75, -31, 80, 61, -128, 84, -33, 219, 98, -87, -34, 5, -179, -31, -106, -73, -186, -58, -332, -45, 229, 146, 279, 306, 46, 117, -144, -245, -54, 65, -192, -61, 56, -117, 206, -129, -271, -200, 33, -97, -92, 81, 172, -118, 3, 26, 24, 26, 227, 16, 120, -99, -223, -184, -40, -72, -23, 173, -10, 6, -1, 48, 76, 45, 150, 104, 192, 22, 169, -155, 66, -173, 151, -106, 144, -55, 188, -243, -206, 99, -282, 205, -196, -173, 75, -47, 151, 137, -113, 33, -101, 62, 55, 150, -102, -101, 124, 149, 76, 142, 119, 439, 70, 12, 32, -233, 117, -17, -1, -227, 4, 138, -41, 442, 155, 75, 322, 235, 249, -127, -100, -330, -69, -333, -186, 8, 243, -66, 94, -157, -85, 95, -8]
1357hk5Q5m6k32K25m6P9J77J90l47j1m8K7M5Q1Q1k87J81j74j14K12J83m04L59
1381A83l16M95j53j81O9L5l5j14r9J49k01J97k60K10K8l2P0j16R9k02K11m3K31
1404B25Q5l17q5j41K14K61m77L58k45J36r8L72j38L9k43J71j02J51k26J09k13
1425a64L30J8K03k60k05p4L15j08l51J07P7j08L96k05j05oM71n22J22r7l3L04
1447A05j81J4k16L97j59L68l31K93k33k3J02k95j8K86n5j3j0J25j95J02r9R6R4
1470A54j43o6K6K64l5j42k5M0o9J1k10J93J39k41K15k40L14k00O3j79L29j38j5
1493D5K19l66j6N1K32k46M8K3L34l33K29j96l56O14k97rJ34j65K46L4k16N4j74
1516a11R4Rj27L11j23m7P9j0k64J90O8n3kj60J13K09m03M25j99Q7O2k72Q0J64
$$ y = [-8, -33, 52, 6, -226, -1, -47, 32, 209, 399, 52, 41, -7, 20, 65, 146, 227, -60, 121, -53, -167, 45, 228, -176, 183, -133, 362, 209, 28, 97, 132, 97, -17, -116, 33, -168, 29, -231, -21, 7, -25, 45, -71, 28, -174, 37, -6, 225, 310, -7, -92, -233, -19, 242, -235, 123, -122, 14, -84, 288, 150, 189, -54, 117, 15, 166, -60, 49, -164, 166, 184, 387, 127, -78, -152, 163, 55, -296, -189, -112, -220, 176, -29, -134, -140, 331, -191, -69, -166, -199, 105, -76, -62, -278, 119, -40, 328, -3, 290, 57, 34, 136, -159, -177, 109, 54, 41, 31, 156, -39, 63, -36, 60, 154, 11, -55, -29, 235, 200, 58, 33, 73, 4, 15, -195, -2, 137, -104, 111, -129, 185, -15, 48, -131, 198, 60, 45, 264, -102, -118, -67, 165, -81, -33, -10, 324, -9, 220, 24, -332, 282, -15, -24, 110, -55, 191, 225, 9, 63, -111, -17, -8, -135, 176, 53, 6, 85, 75, -189, 1, 69, 16, 14, -146, -33, 176, -227, 198, -1, 86, 148, -124, -44, 120]
1540A20l2k07l2L41k59j63K56J61k40K67j98M8j63J90J86k90M69l27j51M3J99
1561B18Lj38M1k07K39j71o2j41R2L32l79Q4r7oK48r5L5K2K29m56L15o2j10K67
1585B01M9j46Q2m14J59O9k1j55J73j3J01k40O0K6J50k07p4J25m0m8O5K34j83K21
1609A74N5o45M30j06M7K22j03l06J61J81j45j7q4K72j43J36O3j34j60O7l2P6m6
1632c7j45K62j78J47J22P8k59J7R2j00Q6k37mK27k18J69J46J06l19J82j51o5J75
1655I6j04l5j22L64j16k58j13K34J19M9k18K9Q2j73Q3M27n08K70P6k26l4J54l56
1678b80K20J07q1j52K80P9k11j62J93j23N2m6P0j22n2M24j34N2k08J51J09m09
1700b43J98j34L19J7j99k4L8L16k51j03j2j77L52j92L53k02p2jq7J11j09L4Q4
$$ y = [120, 88, -119, -151, 190, -69, -232, 24, 185, -55, 212, 14, 62, -101, 89, 275, -15, 454, 127, -24, 19, 218, 221, 83, 124, -83, 156, -15, -77, -218, -126, 206, -173, -89, -186, -192, 56, -39, -4, 18, 247, -209, 106, 44, -66, 201, 250, 104, 186, -228, -69, 0, -21, -176, -3, -16, 85, -155, -95, -69, 81, -126, -200, -75, -115, -163, -98, 136, -47, 174, 229, -416, 14, -92, -45, 177, 74, -232, -71, 110, -35, -52, -136, 136, -7, 129, 192, 58, -102, -35, -67, 9, -37, -182, 80, -98, 49, 171, 249, -10, 7, 99, -1, 85, -152, -156, 71, -147, 22, 168, 274, -45, 137, -14, -79, 96, -8, -43, -165, 199, 83, -175, -288, -54, 65, 114, -104, -75, 7, -166, -83, 344, -164, 106, 182, -44, -78, 76, -280, -60, 47, -34, -186, 94, 173, -38, -200, -7, -130, -78, -124, -54, -176, -228, 196, 62, 114, -94, 57, 166, -243, -45, -179, 140, 157, -42, -66, -28, 288, 37, -66, -78, -255, 97, -95, 258, 56, -16, -17, -104, 7, -102, -68, 16]
1723A6n5J72j7j97J90m05K76K13j39K59k83m0n1K49l96K18J50q9k52J97m6p9O1
1746d8J28m5r6M1L6j5l05L25R5j68J21K26k84o0k9j29L35M4k51k9R6O9j30j07
1770a80N8K37q7l9R5j69J00k10K31K6o4k59M75k09r9J68N5k82O9l6K37k25K9K06
1794A27k29m2J57J42j09j55j42L32l60K92k47M93p8k02P4m7L4j44o3K85j38r6
1816a16J64p7N1J44k48K67j67k25Q6K49k31M6J04lj37J91j21J37j56p5OR6Jl75
1840c89M15k85L94J22m03J99m9l9Q1k92KK50j9K16o6J8j89l39M03O4M2j85K47
1863A98j25j62j5J18k2n5K93k26L01l31Q1JJJ7k21L36p3p2l0j22j03M4J18J08
1887E9l64L92k15J23J26J11J83m70o5L30k38M1K26k92r4P3K48l96J10l9J75l7
$$ y = [16, -39, 133, 116, -81, 109, -296, -20, 193, 54, 313, 30, -10, -61, 188, -208, 10, 160, 71, -181, 16, -30, -109, -48, 80, 35, -61, -20, 16, 1, -304, 21, 116, -52, 69, 295, 11, -49, -78, -207, 128, 172, -79, -108, -12, 57, -73, -180, -122, 115, 28, -11, 84, -85, 15, -195, 36, 62, -2, -261, 214, 5, -94, 74, 129, -153, -84, -120, 117, -108, -79, 127, -102, -144, 13, 155, 46, -109, -251, 81, -279, 13, -234, 259, 181, -21, 53, 6, 40, -104, -167, 118, -20, -116, 48, -29, 22, 166, -82, 185, 18, -207, -121, 128, -103, -57, 47, 44, -93, 98, -23, 114, -42, -117, -111, -15, -14, -389, 26, -259, 135, 257, -146, 53, 4, -35, 46, -246, -244, 6, -13, 203, 137, 155, -34, -373, 30, 94, 136, -49, 198, 73, -89, -104, 14, -8, -63, 230, 4, 305, -26, 55, 56, 57, 74, -147, 189, 116, 44, 14, -108, -211, -167, -49, 59, -305, 87, -128, -5, 121, 232, 415, -55, -120, 210, -28, 13, 239, -53, -147, -74, 174, -222, -112, -151, 24, -13]
1909a3r4L10k25j88J85J05l31P1l4j8L96j81P3n6k04K15j16K16J4J75l12M2J10
1932A40J28l25K6j54J78J67P7j89K60m62J7l8J48J48k12J01J3q9J9J37J21k81
1954g0%L09l37P6L1m4o9K88j70N4J3l32K86K39l72K83o2j5k2k05Q7m3k2J89J30
1979B22j66j99K05p3R0M9k23L10m66M65q1k67Lk8K35j64j9L41j83j04J89k44J61
2002E3j11K37j11r7j71M59m09p5K49J1J06k89L4Kj4O0R2l7m0J59j10J49k4k05
2026h2K1j42K80k58K27j15K41p4O0k65M1J89j44Q4N0j51%j52L89j74M2J38m62
2049b57K37J28k64N5J12o1J20k2j7r9m9Q3J71j66J68n2l81J34M84r9l87J07J63
2072A08j40K06j22m4J14k39j58q4M77m9Qm91L70K73k19O7k71K11J52j30p4p5q3
$$ y = [-13, -107, 203, -22, -210, -25, 80, -251, -180, -214, -232, 164, -17, 56, 0, -204, 11, -105, 111, 125, 300, -12, 30, 140, 268, -57, -31, -185, -7, 160, 237, 48, 308, -154, -137, -175, -27, 121, -91, 10, 23, -66, -47, 90, 211, -70, -70, 239, -98, -22, 9, -35, -104, 184, 14, 68, 81, -251, 35, 274, -98, 185, 123, 108, 86, -119, -32, -75, -97, 92, 222, 56, -143, 62, -11, 79, 128, -95, 215, -251, 214, 133, -134, -131, -159, 76, -88, -107, 234, 51, -53, 136, -108, 53, -58, 179, 68, -29, -200, 259, -150, -225, 24, 35, 141, -148, -114, -112, -126, -66, 26, -11, -51, 108, -2, 147, 123, -82, -61, -203, 77, -181, 46, -69, 172, 98, 158, -107, -66, 123, -21, 63, 113, -38, -38, -190, 199, 25, 67, 205, -257, -20, 108, -156, -101, 11, -50, 70, 48, 31, -68, -117, -34, 137, -29, 139, 87, -294, -160, 324, 225, -162, -55, 108, -32, 174, 52, 8, 122, -117, -275, -359, 118, 69, 77, -414, -44, 229, 10, 77, -194, 17, 169, 39, -35, -110, -193]
2095a93L59k19k2L3J0J4lN5j19K27j98j98M2O4M32k52k64N03m15nL45j93J35n80
2119d42K78L14l92J35o3R6J2j80K72M9m2J52m19K12r2J94n1J58l79J34J40k10
2141a24J62Q0M6k86J82k04P7K8K4K03k53p2J90l5P3j06J66M4k54J75k4q5k5J4
2165dR2n76M61l28N46o0K31l98J25J7n47M84j16m9O9L3j04P7O3j1j7M1j35o2J69
2190AO9j30j55J66J41j67K00j10J8n0K50j25j50L3j19J33P6r3J07l51L06J18K36
2213D04m53J54n9j82J12J59j15j69R9K15l12J62M7k92M44l09J45J51k19l53K10
2234a61N1J71k09P8J29r7J70Kj02J50k47J28l38K37l5R5k13J43K47j03joM9K5
2258A63k11Q3j56K22pm8J64l01j95K19J06J13j12k42J5K62q0P9m13K59L34l67
$$ y = [-193, 166, -53, -75, -42, -32, -18, -21, 34, -85, 142, -56, -254, -212, -148, 284, 32, -232, 271, -144, -149, 196, 3, 138, -442, -164, 150, -242, -107, -170, -74, -62, -242, 30, 79, 37, 189, -230, -18, -110, 84, 33, 191, -188, -54, 86, -124, 38, 118, 164, -122, 60, -144, -67, -39, -15, 188, -65, -137, 53, 18, 91, -15, 151, 195, -59, 116, 92, 7, -18, -4, 88, -488, -27, -355, 191, 131, 362, -36, 89, 106, -441, 43, -73, -122, -53, -20, -124, -47, 16, 5, -12, 29, -106, -168, 1, 70, -60, -215, -49, 92, -75, 125, 15, 33, -17, 233, 108, -42, -9, -128, 5, 81, -12, 95, -256, 50, 168, 404, -49, 105, 46, -136, -24, 135, 20, -149, -50, 165, -147, 15, 62, -230, 214, -95, 50, 201, -18, -371, -161, -110, 61, -148, -70, 59, -38, 132, 134, 32, 182, -65, 63, -275, -38, -73, 22, -191, -48, 199, 96, 95, 89, 138, 163, -48, 35, -121, 101, 94, 46, 210, -91, -286, -67, 39, 152, 40, -202, -187, 75, -5, 74, -339, -80, 254, -113]
2280a13n1nR0L73k40j79K48l43J39N3J5R8j04j64K88n0N0J64k97M9J83k59nj8
2304g8O8K83n18K74k2l43L22M4l12N12k01J96r3Q1m66L5K84k56l3L31N0k98R1
2327d9QM2j46J79Q2k61J24J42n1j13J87j65J13p4P3q8K78j99j11j31J57q1j07
2350a91J42K96J92l60j0K5MP0m03L77n3j91J19k6j3lk3j08Q9j26K8J9L50l73J09
2375f0O0K0l4R8k67L22j48j93M09j36j50m2M67o42L46K1j73q9K40n0O8K92m05
2398d6k8R2K5l0j19L15r6m0%j98L12L3l76K01J7j83L03j64j09L5J79j95j51N45
2422C22j92k46J52P2j15r1m4L77j65k22K23l77J96J26P0j71M15l05j49K65j66
2443b5n6O3n0J90M0l72J19k5L33m03J57J14N7j55m3K39K03m39j85J90J04Nj25
$$ y = [-113, -164, -169, -79, 294, 54, -125, 123, -220, -81, -28, -13, 85, -19, -183, 105, 55, 105, 269, -28, 21, 204, -55, -60, -78, -10, 273, -245, 29, 7, -336, -14, 30, -282, 230, 29, 225, 132, 213, -253, -218, 66, -190, -223, 108, 158, -140, -49, -41, 1, -145, 34, 116, -145, -21, 121, 70, -43, 144, -21, 92, 18, 91, 3, 281, 82, -29, -160, -3, -84, -191, -49, 247, 439, 79, 69, 94, 98, 168, -235, 142, 89, -102, 17, -9, -22, -25, -48, -156, -67, -193, -165, -146, 204, -169, -60, 0, 20, -14, 84, -183, 139, -9, -202, 207, 71, -79, -121, 346, -296, 50, 71, -102, -191, 49, -1, 67, 359, -46, -74, 18, 43, 13, -106, 209, 113, 73, 73, -125, 187, 220, -156, 45, 62, -121, 182, 18, -91, -56, 123, -72, -223, 322, 130, -116, 36, 108, -7, -98, -142, 235, 70, -152, 71, -306, -110, 16, 86, -85, 330, 25, -124, 141, -25, -81, -18, -68, 122, 162, -210, -91, -116, 217, -186, -29, 85, 142, -13, -56, 183, 386, -53, -238, -48, 56, 61, -64]
2466f4l1j01M71l11J27k06K48L3J45l6j36j43M2P6l72M10K6j90J42K4j74K1k18
2489b17K73k21J30OqK23j88J7J36k33K40j23p8J51l33K27J75m58M70l88J42R3
2511C6k0J00l97L41P3q2j63K9k03K28J49m4o0M7Jk28L99k86K28j59l5M5K0L22
2535C41o1m32j75N09l5q8j81J43M9k07K25j08J02l4p8k5j10J21k62K60K9k0K7
2558a0j77N09m09K15k24k3K3K54o6L9j08Q7k32m6L07pn3Q5j22k21N7K17j27P8
2582D6k13J55L5n2j14K6J24j33K7N2Q3j%J02k92P5R2j56P1j37Q8%O4J58q1q8Q6
2609A7K9l8j56P0K09k02J9J37p7j68N4K41j65J36m8J4k67R9j29N11j17k30J19
2632E8L51p46K07J66J80p2l64L66k92J09P0j02M9mJ33rn4J43K1l96K18R7J3k3
$$ y = [-64, -95, -196, 275, -36, 91, -115, 133, 166, 311, 275, 139, -4, 38, 114, -258, 152, 178, -12, 130, 154, -20, 1, -217, 56, -165, -35, -29, -37, 186, -2, 15, 151, -82, 158, 35, -43, 108, -225, 2, 177, -281, 189, -199, -57, 36, 16, 116, -281, 60, 133, 51, -112, -83, -286, -58, 91, 47, -13, 34, 35, -193, 206, -80, 148, -11, -46, -1, 19, 341, 280, -152, -327, 182, 147, 59, -122, 21, 70, -137, 88, -20, 82, 48, -30, -55, -165, -44, -306, -46, -17, -37, -10, -187, 322, -87, 128, -96, -119, -96, 158, 92, 131, 23, 110, -122, -168, 139, 132, 79, 164, 42, -179, -122, 95, -32, 46, -167, -12, 23, -29, -143, -117, 7, -126, -99, -47, 36, 35, 35, 137, -155, -80, 12, -144, -73, -210, -122, -122, -58, 100, 19, -69, 17, 46, 8, -148, -78, 131, -71, -52, 85, 8, -160, -106, 135, -30, 106, 58, 72, -195, -96, -225, 286, 169, -61, 58, 409, -337, -130, 36, 216, 144, -220, 146, -146, -37, 33, -69, -20, -24, 109, 100, 46, 189, 210, -186, 32, 129, 142, 119]
2656A19P3j17J2k10J84Q7k71Q5KJ64j27Nj21L73l39n4J87kj19K66k27k33K36j02
2680a29J61l14M82Kk29q5R3q0L7R2j21K54o4P9K3m25J26J14K67p01L74J58k31
2703a17K08j77K04l48J38j38M83m40M09l62L65r2l22M93j74l14K85P2r8o6L5Q
2725E2J90k50O0k17j45J66L31l52M0J57q7K30k94j55K52m3J64j26K49r4r7K20
2747B51j01km06L07j1j74L10k70n9L18j24J65k13M0N1j52K56l13R3j15K14l38
2769b73J69J5o9O4JP4j02m8J14r8JL80l15Q3k15L30m40L81jq4k72L07J56j67q4
2794i3K77j98p2L36J3j01j94q1o6N7j22J56J96l59M15m83K84N0k13K71m2K81j89
2817A23j71K5J32k09K64j71R4j42j1L45k23r4J7M5j87L71q0l09p6J44j3K2J13
$$ y = [119, 192, 75, 87, -123, 61, 148, -123, -38, -36, 128, 1, 6, -115, 258, -81, -135, 52, 50, -69, 197, -30, -263, -27, -129, 32, -282, 200, 202, -27, -112, -19, -99, -62, 30, -91, 163, 99, 178, 201, -224, -98, 16, 283, -418, -44, 114, -117, 91, -86, 118, -230, -92, -230, 253, -187, 222, -140, 225, 133, -189, 304, 130, -184, 101, 173, 75, 9, 44, 52, 242, -8, 52, -165, -310, -144, 187, -165, -125, 32, -55, 175, -119, -274, -22, -65, 99, -27, 222, 128, 31, 251, 150, 148, -258, 49, 38, -136, 174, -96, -155, 163, 39, 204, -9, 31, 82, -70, 186, -127, -34, -149, 65, -273, -104, -89, -158, -94, -93, -19, -121, -169, -55, -153, -152, 228, -87, -4, -219, 111, -329, 52, 51, -33, -305, 2, 158, -9, -93, 184, -14, -86, 250, 263, 162, -32, -113, -179, -122, -244, -88, 108, -251, 164, -319, -35, 15, -198, 73, 31, 312, 123, -48, -23, 109, -100, 164, -7, 87, -55, -66, 279, 56, -38, -21, 24, -163, 208, 128, -181, -257, -113, -126, -104, 9]
2840Ij0jQ7j15k9L0L46j84j41r0P4J20%j17m4K63j72J06j14O0j27M9K42q5L4q5
2866A06mk24m9K04j01k0J36m0j14L69l57K63j23k00P4J04J9jj51J13n5L11l07
2889d7j26Q3LJ80k43J55R7L5K6l24RJ49K00j46r4J74k21k10L17n9KJ53K1l16L6
2914a46N7no5K01j32%j07p8J46K35k10j26L27l3k57L98m1J8k74P8R3J94k99O4
2938C8K59m92K86r7N5Nn5J9J20j93K45j37K25n39N01j54l18R2J23Q9j95K26J85
2961B88l63M6k02Q1J78Q1j69o4L59j07j1p7k15j33M15O8j94J23j49J5K48k44K52
2984B26p8k21J76J5k24K97k41q5n1J05k04L75p9J2K0Q2n2n8J71k35oR1k12K74
3008I8j7l04J01J95j97K03k88J61J35l42L85k23J07kQj88M02j08k88J05pJ14J07
$$ y = [9, -1, -2, 85, -30, -59, -29, 317, 133, -8, -98, -24, 96, 96, -21, -65, 198, 26, 132, 18, 78, -49, 0, 242, 157, 191, 106, 102, -122, -171, 33, -68, -88, 48, 8, -106, 263, -94, 169, 46, -154, -80, 24, 43, 42, -109, 4, -51, 260, -47, -173, -90, -87, 93, -150, 5, 102, 137, 163, -161, -152, -3, 197, 51, -43, 131, -90, -300, 17, -42, -40, 113, 134, -182, -146, -89, -94, -159, 42, -90, -90, -197, -275, -129, 106, -104, -230, 97, 64, -193, 205, 164, 182, -92, -14, 79, 273, -26, 38, 297, -195, 91, -6, 49, 54, -1, 18, 138, -55, 190, 53, 278, -261, 240, 86, -232, -140, -17, 72, -123, 103, 288, -75, -29, -231, -150, 28, 109, -60, -124, 235, 128, 117, 40, -175, -308, 107, 175, -19, 104, -45, -30, 218, -26, 226, 148, -73, 103, 118, -106, 191, -50, -135, -186, -81, -285, 90, 11, 23, 43, 125, 73, 15, 186, -49, -55, 36, -176, 98, 81, -223, -122, 73, -124, 79, -209, -48, 87, -255, 130, -93, 14, 12, 20, -168, 234, 126, -162, -57, -64, 50, 157]
3031A57j65L83k35j90J69l16Q9k7J91MJ30k38l3k73L56L8K86j31l67J73Q7R7k20
3054c5J28j8L0n6J43K35m36O5O9l6p4J58j81K14k48J8L9k20J28PR3O2K09l75J00
3079A9P0k03J49k52L96j01k63J42J1P4N9j87r7J22j82J67K9j08L80j00k32K17
3101A10k66L14l4m5j74K10n5k54K50l65N58l93j01Q4J63j54L83n6n74M13O7k58
3123a77L3M7K70l07R5J03r0L70m71l3L52k85K04l99K17M0r4K21Qj27RN2L7j39
3147f4o2r4R7pJ76p5R7L5j70J38R1j16j60J05ll4K13k68J12j64L86k00j64NQ2
3172d4J68m94K79J72k65K80J9j79J36k14L75j86J6N3J65j07j60q3J5Q4N4j50m1
3195a07J19j75J40m8J47K1l97L23J4N2J88n00L63j74j82K70j50P8m1J30K7N9p2
$$ y = [157, -8, 375, 140, -50, 119, -197, -108, -135, 56, 60, 190, -48, -81, -354, 2, 40, 326, 195, -172, 1, 88, 185, -35, 93, 75, 105, 49, 192, 427, -9, 56, 125, 89, 15, 173, -8, 206, -42, -24, 15, -205, -77, -70, 23, 85, 294, -81, 19, 89, -114, 35, -217, 179, 78, -185, -43, -32, 42, 101, -86, -183, -61, -243, -76, -47, -155, 225, 125, -107, 110, -156, 158, 124, 79, -95, 115, 60, -194, 56, -309, 249, -144, -245, -161, 2, -152, 231, 175, -399, 14, 81, -177, -144, -97, 173, -134, -39, 64, -26, 344, -127, -160, 192, -93, 111, -288, -71, -31, -125, 96, 104, -23, -14, 38, 75, -64, -126, -220, -123, -130, 46, -29, 68, 103, -67, 71, 162, 46, -114, -9, -12, -46, 167, -101, 11, -153, 233, 33, -131, -126, -44, 124, -370, -91, 81, -184, 96, 115, -64, 72, -142, 233, 47, 63, 116, 281, 174, 14, -69, -54, 30, 84, -66, -107, 12, -163, -23, -71, 76, 97, -300, 23, 37, 89, 277, -223, 140, -34, -216, 54, -96, -18, -59, 71, 98, 157, 85]
3218H5RJ57o9l0l92J84K08k15j9K67j40j65J27J35r6J88l33j79L01J7K07k06k3
3241A8K37j45l33L16j60k13K84l3J12k66M54l09J03k49J57j3nJ04p1j73M7R0O5
3264A7J86k90L98l09J42K8l3K19k84K8J13k17m8Q7Q2k1j33P0O9l83K12k9K69j99
3288b6J02p9m3K26j15n4k29M19j20J8k56J72j14L32l91K48j43j53L37j95J5l76
3310d25N49k36J22p7J79j45n9K43j16j9j3m5m8J98l9p0M3R3K15l62m3j6P0N9J12
3335A70l20J05J16kK3q4J95j92r1J25J04k4j81J70l73O5j55J23J70q1P3K21r0
3358F7j12j59K17l7J70j72k19L53j68l6K95k26K26J0k89L5J50k45j31L89j56J19
3380H1j47R6m1k49K94n6J09p3K12l50L24j67L3j23K25k18J10R6k49q4J46j2K22
$$ y = [85, 94, 251, 182, 152, -240, -56, 152, -63, -82, 185, 45, -120, 7, 142, 46, 234, -99, -278, 23, 40, 247, 41, 18, 255, 110, -223, 93, -67, -280, 4, -29, 83, -183, 271, -38, 65, -184, -27, -40, -45, 59, -12, -185, -138, -48, 17, 203, -87, 311, 2, 144, 172, 139, 358, 74, 102, 215, -2, -50, 37, 119, 98, -35, 35, 104, -279, -67, -96, 173, -26, 76, -3, -46, 180, 65, 11, -218, 201, 81, 99, -157, 15, -99, 233, -158, 90, -53, -206, 131, -64, -49, -425, 124, -112, 10, -67, 112, -33, -92, 151, 35, 16, 3, -42, -90, 108, 69, -1, 42, 135, 350, -12, -55, -71, -1, 58, 170, -150, -45, 71, 69, 92, 8, 203, 11, -80, 45, 149, 125, -56, 114, -259, -194, -349, -226, -56, -137, -64, 157, 67, -45, -204, 13, -24, 146, -26, -245, 108, -60, -96, 199, -27, 199, 209, -80, -45, 105, -140, -271, 118, -38, 81, -66, 30, -11, -260, 34, -22, 87, 14, 226, -124, 200, 33, 66, -57, 168, -50, 60, 156, -93, -177, -31, -43, 179]
3403A79r8j16J86k7k06J66K06l62K33m7m8l84M57j61J37L8q4j96K62l68L43j30
3425b0J75k1o5j59J27p9J51k30r5K43L3r1j84J80o2J72j49J34J25m16M10p5o1
3448D3q4J59r1j19J10j37K45K6j51j73N2K69r1P5j56lp4J94pj16L31l24j19q4
3472b25L04n2J07j75L5k01K34J6k07J67J30k20j9J72P6k51k19L80J34k00q8J91
3494H9j43o1K60k57M1J69j75Om6l8n0J42L4J47Q2j06L5k57J51j4J0R3r2J59j41
3519C8P0JJ0N8r5l35M56m78K34J27j03p8L4PJ04N9k85J81J8J5Q8o1N6l6N1j5m4
3546G7M8j5k7J79j74l7k10R0j48R6J98l2n3j01N8R2K8l28K08J82j6Q0K2j75n9
3571a7l9L81k42k73K09o5k04K45K76j25mj20k44M91k53j41J79L6K4n0q4M7Q2J21
$$ y = [179, 81, -35, 151, 124, -82, 84, 290, -72, 161, 114, 66, -318, 139, -22, 115, 153, 69, -127, 135, -233, 110, -20, 155, 134, 69, -90, 37, -42, 109, -121, -216, 27, 60, -31, -215, -35, -97, 75, -74, 60, 185, -231, 179, 104, 43, -41, 118, 27, -92, 18, -119, 126, 152, 1, -172, -120, 149, 58, 133, -23, -26, -100, 94, 87, -29, 302, -22, -141, -225, 79, 27, 134, -41, -6, -207, 27, 43, -164, 3, 133, -87, -106, 66, 142, -109, -328, 52, 186, -14, -102, 89, -54, -115, 145, -112, -71, 98, -77, -71, -117, -155, -205, -63, -29, 118, 200, 94, 129, -128, 23, 9, 19, 112, 20, 179, 38, 108, 109, 119, 177, 82, -253, 203, -275, -41, 86, -17, -95, -61, -54, 50, 109, -176, 5, 23, 38, 126, 65, 121, 85, 136, 121, 77, 125, 110, 83, 262, 88, 51, -159, -69, -217, -121, 77, 45, -8, -109, -51, 41, 69, -259, -51, 131, 115, 195, 217, 42, -17, -56, 325, 83, -190, 19, -46, -250, -5, 271, 146, 142, 22, -222, 269, 16, -125, 54, 90, 114, 64, -20, 27, 109, 230]
3595B30k48j8J68m97N53Pj36n6P7j94K83k5p2j61%P0RJ63l42P6M3J27j14p4J77
3620D6l2R4j47P6q7r3R7q0J27p2R1k03L45q4prM0P1k20K8j37M40l52P8n8L41k98
3647el43M24j51N7K04j42j63L4J2q9L53k0n1j18J24k13jJ18m6N3k3Q1N5l71J88
3672c3J26N6k40J30j16n0J77lq9o5R5Q2k0k75K19J34k8L7j77j87K74p1n9p9J53
3697iK14j25k56L01o2j91M45k11l0k63K19j18K19k7k77K49Q3j53k17J62m6N8O6
3720C1l63L35J37l98M39l67J01m7J81j59R9k5k13L34j2j99L24k37J20ok66M96
3742C05m71L02k5r7K30k15j29J35K22O5m73K35m83M14K80o77L14J06K8k43K24
3763D7l64N22n33M91k38j26n3K03j44k1L21N9k21K5J53j95m4n9L39l47M31l07
$$ y = [230, -18, -36, 132, -365, 188, 195, 59, 3, 80, -114, 169, 144, 72, -89, -89, -19, -10, 153, -189, -113, -70, 57, -57, -131, 46, 14, 108, -39, 37, -50, -143, -46, -126, 1, -71, 20, -183, 162, 78, 71, 62, 102, 173, -47, -19, -156, 284, -68, 10, -48, 293, -5, -348, 76, -75, -18, 186, 44, -119, -85, -73, -162, 191, 171, 120, 2, 126, -87, -88, 30, -16, 37, 14, 95, 150, -221, -33, 93, 149, -91, 39, -77, -127, 50, 47, -42, -107, -12, 70, 50, -225, -6, 128, 100, 137, -40, -227, 47, -24, -83, -162, -9, 205, 80, -176, 125, 63, -128, 317, 106, 76, -187, 32, -86, 133, 106, -171, 78, 161, 8, -209, -47, -93, -35, 31, -332, 3, 140, -258, 181, -186, -85, -132, 49, -110, -11, -36, -249, 85, 73, -126, 198, -39, 81, 75, -191, 305, -166, 136, 111, 14, 244, 29, -100, 35, 257, 322, -151, 84, -399, 15, 295, -382, -68, 38, 66, -177, 47, -317, 205, -328, 163, -75, -201, -254, -51, -195, -216, 105, 164, -57, -32, 121, -74, -118, -177, 162, -185, 246, -61]
3785f1k30O40k91O0k9R5l15K42k29Q3j25J95p5L7J37r2o7k34L24j86K90j64j63
3808a58L0J67j58J61J72j53j45J97J61j90j16K06l2j83j6j22J34%J70N7k82J97
3830I7O6m6j05j77O1J16K78l16j99k2J51l16O03Q9L2m56J32j2P9K6J0M8j72J39
3854A06n6L0m6k52K14J86K1k72j29J92q1J32K26k7k93j53J76q0K33k27J02k93
3876b91K57M7q1m8J69Qj37j29K73Q1m18K19J7q8K28l15J65K52k83Mn0KL56j19
3900A19j73R4j05J81j02L02k19k47N7Q0J40J34l91K9J27N1J18l27L21l58J63J45
3922A39j16j45K38j97j2J09N7O0l07J76M2N4k29J29J5j29K84j34O3m1m13N64k10
3945cPj9J03k83J99j35J10K77l45oJ13j14L66k80K49l00J45r8r1J54m2j45K00
$$ y = [-61, -291, 349, 58, 118, 89, 184, -131, 111, -118, -35, -160, 35, -40, -3, 134, 42, -25, -259, 65, -121, 169, 5, -158, -128, 39, -119, 42, 214, 61, -84, 113, 274, 84, -32, 174, 142, -41, -57, -179, -45, -45, 125, 182, -100, 97, 163, 117, 12, -165, -104, 12, 290, -26, -225, -247, -96, -412, 191, 280, 312, -144, -12, -24, 55, 81, 91, 139, -33, 106, 50, 80, 34, -218, -4, 182, 203, -69, -198, -6, -87, 45, 271, 244, -49, -202, -26, -106, 127, -100, 2, -291, -34, 13, -68, -116, 53, 61, -76, -205, 68, 149, -269, -50, -33, -121, 107, -208, -43, 209, -74, -70, -120, -118, 238, 119, -54, 40, -65, 116, 14, 316, 97, -150, -93, -13, 127, 261, -130, -101, 26, 77, 195, -132, 189, -169, -6, 139, 23, -122, 116, -81, -93, 16, 73, 133, -174, 2, 44, 98, -131, -2, 13, -116, 168, 34, 97, 56, -357, 207, -3, 4, -15, 88, -195, 4, -131, -21, 256, -89, -95, 18, -96, 270, -10, 239, -61, 84, -14, -105, 49, 7, -138, 62]
3968F2rk48rK72k32J46K58m22K7K59J8j39K31j72k16K85j83J16J48r6M5k53j06
3991b18L93j48l4K48k19j01J08Q3j15L8K1k67K49J59m67K25j21K11k8o7k26q4
4013c60K28N9n2Q8k59M61J5k09j35J87J3j50L28l98M19k97Q0K6Q4j85R6M3l23
4036b41L26k21N31m51k2R3J3n1K4K58k23L2K48k62k50L01rk87J28n8Q4Q7k6J55
4060A79j62j52K29o4o9k4K70m50K92M1k15J48K3k42J01J91o9p6J70q5K47q9k4
4083A70k4j43J90J56j63j05j47p5L67j46p9k51K16p2L00p0j86J16j32m6P7q7J0
4106a24J37J67j00q2J68j82lj19Q7J13J69n07K7L46mj09L32l14J9R0j40J2l4M5
4130fo7j54J93P5j40l8J45j79J39P1k35L56l08K19k15q8K17n7j24K59L0m8K77
$$ y = [62, 53, -195, -204, 68, -164, -18, 240, -182, -155, 104, 122, -17, 214, 42, -174, 111, -72, 44, 192, 96, 141, -112, -218, 175, 27, -7, 241, 22, -79, 29, 112, -3, 35, 56, -211, 38, 197, -270, -45, -166, 45, 17, -50, -276, -360, -132, -73, -125, -37, -296, 165, 180, -29, -164, 23, 36, -114, 214, -184, 235, -62, 18, 44, 128, -57, 39, 82, -241, 85, -136, 395, -56, -78, 15, 28, -23, 1, 259, 36, 68, 316, 54, -196, 105, 96, -191, -63, -121, -37, 50, 24, 179, 17, -135, 94, 30, -39, -63, 207, -243, 49, 90, -125, 23, 46, -196, -95, 96, 27, -49, 121, 36, 283, 194, 170, 146, 3, 193, 349, 186, 81, -66, -141, 226, 80, 1, -250, -34, -106, 194, 124, -62, 54, -78, -124, -47, -134, -124, 13, 180, 80, -2, 166, -16, -19, -138, -51, 62, 231, -276, -249, 97, 93, -16, 316, 2, 21, 111, -29, -17, -51, -6, -73, -227, -34, 41, -99, -137, 8, -171, -32, 39, -196, 160, -148, 71, -144, -232, -15, -72, -196, 63, 93, 45, 322]
4153C22k88j85qR3k9j60J99m6R8J52k68K52Jk64P6P5k40J45R3k89J79o4L79k40
4177a7m2k28L93j9k79J53M2J32l75K71J06j31j52k5J72j0r8J7o0K0J54k66m7K93
$$ y = [322, 34, -151, -159, -66, -95, -255, -56, -102, -4, 148, -120, 132, 133, -131, -55, 20, -220, -75, 18, -271, -92, -156, 223, -17, -59, -287, 106, 87, -192, -39, 3, 135, -240, 31, 137, 6, -146, -171, 1, -9, -107, -90, -150, -130, 24, -242, -289, 4]
$$ [...]
8191H0
##END NTUPLES=NMR FID
##END=
