##TITLE=1H_DE-82
 200.13MHz, CDCl3,
 8 sc
 
 4.3.2025
##JCAMPDX= 6.0         $$ Bruker NMR JCAMP-DX V2.0
##DATA TYPE= NMR FID
##DATA CLASS= NTUPLES
##ORIGIN= UXNMR, Bruker Analytische Messtechnik GmbH
##OWNER= pz
$$ XWIN-NMR		Version 3.5
$$ Tue Mar  4 14:34:17 2025 Russian Standard Time (UT+4h)  she@DPX200
##.OBSERVE FREQUENCY= 200.1313
##.OBSERVE NUCLEUS= ^1H
##.DELAY= (6, 6)
##.ACQUISITION MODE= SIMULTANEOUS
##.ACQUISITION SCHEME= undefined
##.AVERAGES= 8
##.DIGITISER RES= 18
##SPECTROMETER/DATA SYSTEM= spect
##.PULSE SEQUENCE= zg30
##.SOLVENT NAME= CDCl3
##.SHIFT REFERENCE= (INTERNAL, CDCl3, 0, 14.3821)
##AUDIT TRAIL= $$ (NUMBER, WHEN, WHO, WHERE, WHAT)
$$ ##TITLE= Audit trail, XWIN-NMR		Version 3.5
$$ ##JCAMPDX= 5.01
$$ ##ORIGIN= Bruker BioSpin GmbH
$$ ##OWNER= she
$$ F:/spectra/data/she/nmr/H-C/1/audita.txt
$$ ##AUDIT TRAIL=  $$ (NUMBER, WHEN, WHO, WHERE, WHAT)
(   1,<2025-03-04 14:33:06.31 +0400>,<she>,<DPX200>,
      <created by zg, POWCHK disabled, PULCHK disabled
       configuration hash MD5:
       00 E9 B6 7A A2 85 ED C7 34 08 36 98 17 FE 4E 26
       data hash MD5: 16K
       B6 CE DC DC 26 24 04 F3 F9 29 85 5A 81 72 D7 E7>)
$$ ##END=
$$ 
$$ hash MD5
$$ 66 0F DD A2 C5 15 42 61 F7 F6 46 0A 05 D0 4B C2
##$RELAX= 
##$RELAX= 
##$RELAX= 
##$RELAX= 
##$RELAX= 
##$RELAX= 
$$ Bruker specific parameters
$$ --------------------------
##$DU= <F:/spectra>
##$EXPNO= 1
##$NAME= <H-C>
##$PROCNO= 1
##$TYPE= <nmr>
##$USER= <she>
##$AMP= (0..31)
100 100 100 100 100 100 100 100 100 100 100 100 100 100 100 100 100 100 
100 100 100 100 100 100 100 100 100 100 100 100 100 100 
##$AQSEQ= 0
##$AQ_mod= 1
##$AUNM= <au_zg>
##$AUTOPOS= <>
##$BF1= 200.13
##$BF2= 200.13
##$BF3= 200.13
##$BF4= 200.13
##$BF5= 200.13
##$BF6= 200.13
##$BF7= 200.13
##$BF8= 200.13
##$BYTORDA= 1
##$CFDGTYP= 0
##$CFRGTYP= 5
##$CHEMSTR= <none>
##$CNST= (0..31)
1 1 145 1 1 1 1 1 1 1 1 1 1 1 1 1 1 1 1 1 1 1 1 1 1 1 1 1 1 1 1 1 
##$CPDPRG= <>
##$CPDPRG1= <>
##$CPDPRG2= <>
##$CPDPRG3= <>
##$CPDPRG4= <mlev>
##$CPDPRG5= <mlev>
##$CPDPRG6= <mlev>
##$CPDPRG7= <mlev>
##$CPDPRG8= <mlev>
##$CPDPRGB= <>
##$CPDPRGT= <>
##$D= (0..31)
0 0.7 0 0 0 0 0 0 0 0 0 0.03 0 0 0 0 0 0 0 0 0 0 0 0 0 0 0 0 0 0 0 0 
##$DATE= 1741084385
##$DBL= (0..7)
120 120 120 120 120 120 120 120 
##$DBP= (0..7)
150 150 150 150 150 150 150 150 
##$DBP07= 0
##$DBPNAM0= <>
##$DBPNAM1= <>
##$DBPNAM2= <>
##$DBPNAM3= <>
##$DBPNAM4= <>
##$DBPNAM5= <>
##$DBPNAM6= <>
##$DBPNAM7= <>
##$DBPOAL= (0..7)
0.5 0.5 0.5 0.5 0.5 0.5 0.5 0.5 
##$DBPOFFS= (0..7)
0 0 0 0 0 0 0 0 
##$DE= 6
##$DECBNUC= <off>
##$DECIM= 32
##$DECNUC= <off>
##$DECSTAT= 4
##$DIGMOD= 1
##$DIGTYP= 9
##$DL= (0..7)
0 120 120 120 120 120 120 120 
##$DP= (0..7)
150 150 150 150 150 150 150 150 
##$DP07= 0
##$DPNAME0= <>
##$DPNAME1= <>
##$DPNAME2= <>
##$DPNAME3= <>
##$DPNAME4= <>
##$DPNAME5= <>
##$DPNAME6= <>
##$DPNAME7= <>
##$DPOAL= (0..7)
0.5 0.5 0.5 0.5 0.5 0.5 0.5 0.5 
##$DPOFFS= (0..7)
0 0 0 0 0 0 0 0 
##$DQDMODE= 0
##$DR= 18
##$DS= 0
##$DSLIST= <SSSSSSSSSSSSSSS>
$$ [...]
##$SUBNAM0= <"">
##$SUBNAM1= <"">
##$SUBNAM2= <"">
##$SUBNAM3= <"">
##$SUBNAM4= <"">
##$SUBNAM5= <"">
##$SUBNAM6= <"">
##$SUBNAM7= <"">
##$SUBNAM8= <"">
##$SUBNAM9= <"">
##$SW= 18.0517328524113
##$SWIBOX= (0..15)
0 0 2 0 0 0 0 0 0 0 0 0 0 0 0 0 
##$SW_h= 3612.71676300578
##$TD= 16384
##$TD0= 1
##$TE= 0
##$TE2= 300
##$TE3= 300
##$TEG= 300
##$TL= (0..7)
0 120 120 120 120 120 120 120 
##$TP= (0..7)
150 150 150 150 150 150 150 150 
##$TP07= 0
##$TPNAME0= <>
##$TPNAME1= <>
##$TPNAME2= <>
##$TPNAME3= <>
##$TPNAME4= <>
##$TPNAME5= <>
##$TPNAME6= <>
##$TPNAME7= <>
##$TPOAL= (0..7)
0.5 0.5 0.5 0.5 0.5 0.5 0.5 0.5 
##$TPOFFS= (0..7)
0 0 0 0 0 0 0 0 
##$TUNHIN= 0
##$TUNHOUT= 0
##$TUNXOUT= 0
##$USERA1= <user>
##$USERA2= <user>
##$USERA3= <user>
##$USERA4= <user>
##$USERA5= <user>
##$V9= 5
##$VALIST= <valist>
##$VCLIST= <CCCCCCCCCCCCCCC>
##$VD= 0
##$VDLIST= <DDDDDDDDDDDDDDD>
##$VPLIST= <PPPPPPPPPPPPPPP>
##$VTLIST= <TTTTTTTTTTTTTTT>
##$WBST= 1024
##$WBSW= 4
##$XGAIN= (0..3)
0 0 0 0 
##$XL= 0
##$YL= 0
##$YMAX_a= 190887
##$YMIN_a= -208267
##$ZGOPTNS= <>
##$ZL1= 120
##$ZL2= 120
##$ZL3= 120
##$ZL4= 120
##$ABSF1= 10
##$ABSF2= 0
##$ABSG= 5
##$ABSL= 3
##$ALPHA= 0
##$AQORDER= 0
##$ASSFAC= 0
##$ASSFACI= 0
##$ASSFACX= 0
##$ASSWID= 0
##$AUNMP= <proc_1d>
##$AZFE= 0.1
##$AZFW= 0.1
##$BCFW= 1
##$BC_mod= 2
##$BYTORDP= 1
##$COROFFS= 0
##$CY= -3
##$DATMOD= 1
##$DC= 2
##$DFILT= <>
##$DTYPP= 0
##$F1P= 0
##$F2P= 0
##$FCOR= 0.5
##$FTSIZE= 0
##$FT_mod= 4
##$GAMMA= 1
##$GB= 0.15
##$INTBC= 1
##$INTSCL= 1
##$ISEN= 128
##$LB= 0.25
##$LEV0= 0
##$LPBIN= 0
##$MAXI= 10000
##$MC2= 0
##$MEAN= 0
##$ME_mod= 0
##$MI= 1.114404
##$NCOEF= 0
##$NC_proc= 0
##$NLEV= 6
##$NOISF1= 3.799351
##$NOISF2= 2.8
##$NSP= 1
##$NTH_PI= 0
##$NZP= 0
##$OFFSET= 14.38212
##$PC= 1
##$PHC0= -464.1406
##$PHC1= 9.39222
##$PH_mod= 1
##$PKNL= yes
##$PPARMOD= 0
##$PSCAL= 0
##$PSIGN= 0
##$REVERSE= no
##$SF= 200.129724274929
##$SI= 16384
##$SIGF1= 3
##$SIGF2= 2
##$SINO= 400
##$SIOLD= 16384
##$SREGLST= <1H.CDCl3>
##$SSB= 0
##$STSI= 0
##$STSR= 0
##$SW_p= 3205.1282051282
##$SYMM= 0
##$S_DEV= 0
##$TDeff= 0
##$TDoff= 0
##$TI= <>
##$TILT= no
##$TM1= 0
##$TM2= 0
##$TOPLEV= 0
##$USERP1= <user>
##$USERP2= <user>
##$USERP3= <user>
##$USERP4= <user>
##$USERP5= <user>
##$WDW= 1
##$XDIM= 8192
##$YMAX_p= 0
##$YMIN_p= 0
$$ End of Bruker specific parameters
$$ ---------------------------------
##NTUPLES= NMR FID
##VAR_NAME=  TIME,          FID/REAL,        FID/IMAG
##SYMBOL=    X,             R,               I
##VAR_TYPE=  INDEPENDENT,   DEPENDENT,       DEPENDENT
##VAR_FORM=  AFFN,          ASDF,            ASDF
##VAR_DIM=   8192,          8192,            8192
##UNITS=     SECONDS,       ARBITRARY UNITS, ARBITRARY UNITS
##FACTOR=    0.0002768,     1,               1
##FIRST=     0,             0,               0
##LAST=      2.2672688,     0,               0
##MIN=       0,             -208267,         0
##MAX=       2.2672688,     190887,          0
$$ Real data points
##PAGE= N=1
##DATA TABLE= (X++(R..R)), XYDATA
0@%%%%%%%%%%%%%%%%%%LrJ4j6J6j6J6j9K6l1L3l6M2n0N6o4P0p7Q9r8J08j21J33
41F9j46J62j78J97k19K41k64K91l20L52l89M28m75N30n87O54p35Q29r45J088j268
62f85J505j828K294l016M256o754J3482o1690j55831K55954J43200j58106n983
75B6798Q7128o6464m102P7488o9937p5139M8784l5362q9578M0983L0797o4991
87i3595J7565O5167l0237r422P7408K5048k9324N155J3956K852L546k2944j9491
100E684J6701j5506l8747K4730K6615m5983k5001L2199L015j3401J6884k75j0899
113b3984K7906J0477k1660K7414L5942l6536k9694L5316J0697l3479q094Q54j8720
126b3561M768K2470j1885j9731J4931J9890j568l735K414O65K470K573n752n396
$$ y = [0, 0, 0, 0, 0, 0, 0, 0, 0, 0, 0, 0, 0, 0, 0, 0, 0, 0, 0, 3, -6, 8, -8, 8, -8, 8, -11, 15, -16, 17, -19, 23, -27, 29, -35, 35, -42, 47, -51, 57, -64, 69, -77, 85, -93, 104, -115, 126, -138, 153, -167, 185, -204, 224, -251, 279, -308, 346, -389, 440, -505, 583, -685, 820, -1008, 1286, -1730, 2526, -4228, 9254, -52436, -208267, 47687, 190887, 32781, 26798, 113926, 47462, 43360, 120848, 50911, -24228, 24556, -10806, -100384, -59401, -28604, -93595, -76030, -10863, -41100, -50522, 26886, 51934, 22610, 27765, 41721, 44573, 48119, 25175, 5684, 22385, 6879, -31868, -7138, 19477, -26506, -51507, -19308, -16293, -29694, -12810, -13085, -23984, 3922, 14399, -7261, 20153, 56095, 19559, -10135, 25181, 35878, 2399, -5695, -4841, -23561, -18793, 3677, -8208, -27939, -13008, 6882, 5314, 1579, 3993, 4658, 7128, 9701, 3949, -1447]
140a447L350M716n345p287L303M259n478k481O198m363q066R460J0880q383n352
155f036J0134M715k353J877j750p566J718M132o559n755J975L30p73J793j97N64
171c751N956J839n578R83O411N74m697j878K809L696k092o490M44N109k619n284
187d568J929P58m067J143L289q36L90K880p37P92L500j363l270K995J170m781
203g76n65L048k094j555L167m27l820K335L268l054k810J801J026K32r1j990J354
220i51L422L85l306P72K404j073k336N53M81q96n71k98M48J034P39p24K4O23j42
239E88o48n54m7m45N06N3l63J102R34j94p18L19O74k76j315q59P87N41j153o32
259a700J792Q26j83n37N23O69n86j015j95K7M7o51J60K42L55P3M83K70j03l09
$$ y = [-1447, 1903, 6619, 1274, -6013, -2710, 1549, -3929, -6410, -212, -4575, -12641, -3181, 7699, -684, -6036, 4098, 8813, 6460, 8337, 6587, -979, 739, 4871, -1688, -7443, -5468, -5138, -5911, -4118, -4315, -3751, 2205, 4044, -1534, -551, 5860, 6434, 1737, -141, 2668, 6364, 4272, -2218, -1774, 3335, 716, -4568, -2639, -1881, -5948, -4805, -1516, -2352, -1962, 918, 181, 973, 4473, 3110, -160, 2835, 4005, -776, -1341, 1707, -387, -1942, 1225, 798, -3022, -687, 2581, -473, -3283, -1482, -456, -224, -315, -2305, -951, 2471, 2856, -450, 322, 2726, 1653, -683, -130, 351, -545, -1116, -1414, -966, 68, 807, 83, 107, 730, 588, -60, -614, -661, -1106, -600, -547, -910, 192, 1126, 932, 214, 533, 1207, 931, -384, -1243, -456, 85, -1068, -1700, 92, 918, 735, 198, 721, 1390, 804, -211, -406, -379, -332, -983, -823, -581, -226, -153, 330, 600, 497, 188]
279A88N03o31p83K24R62m48p54O61J181J6q60p6O97m47r90n39r6Q43l92q37J018
300e60Q18L65n03L12J198n94p24J99q8m85j57l10J72J8J76J28l94J06J46j76k43
321e96K65j4K33N46m68J02J030M15j014j87L60M00j420n21L74j99j11m55L64N31
341c65L55k81N6M57M81p2l04J68L12m03K11j76m46J24k85l64r1O2M0j45j44R6
363g14O07j65j22N29M40K85n18J98L13j75m99k38P5N5j63n55R9M34n87J78J9L18
385a86K89M9K03j11N01n37M17l38J92p0k75j26l57j93k1n2j42P3N46K1J55k70
407b32N99N9K1m48M53p0l66p3L8m4j00O3J3l26J23N4k76P5J42P4J40M37N5j01
431C10J41R6m39J59M8m37l9k19J14k44p3J55K47r7L63l40L98J34Qk19o7L34j53
$$ y = [188, 691, 60, -723, -499, 463, 15, -739, -78, 1103, 1119, 259, 183, 880, 433, -557, -1096, -1192, -349, -741, -1578, -560, 258, 623, 120, 432, 1630, 1036, 312, 511, 423, -62, -219, -529, -357, -339, -163, -35, -429, -323, -177, -353, -596, -331, -345, -112, 434, -34, 68, 1098, 1513, 499, 312, 672, 1072, -348, -869, -495, -694, -805, -1260, -896, -365, -10, -291, -235, 222, 703, 631, 327, 495, 807, 404, 615, 439, -7, 117, -168, -532, -623, -561, -521, -666, -810, -714, -107, -272, -394, 135, 575, 860, 342, 540, 853, 678, 179, -59, 16, 71, -92, -647, -548, -114, -701, -523, -504, -186, 103, 152, 355, 244, 745, 208, 625, 287, 479, 409, 134, 8, -349, -542, -563, -615, -757, -684, -138, -117, 38, -232, 367, 426, 447, -1, 452, 382, 16, -57, -19, -63, -163, -100, -87, -413, -290, -236, -512, -437, -295, -221, -81, 356, 411, 310, 451, 547, 108, 267, 315, -122, -161, -380, -266, -510, -583, -428, -181, -278, 85, -255, 143, 277, 285, 66, -1, 333, 180]
454A80k98K24K69j79j42k60K80k37R2k60L22l14K18j1m7K62Q6L12k50K41j23j3
476C52J00l48N4k30k65K19j74K15L85l23l49J72J60N4k38K99j2j74L80l11l06
497c40L97R3q9j47R3N6RO8j70l51R5K61l6M1J99L8j02J9p1k22Q3k47L23Pn22M00
523a15J49k63K90K4J89j10K4k56N2j36K79l75K68q6M42m45J42k53L37p7k8j26
545g4R6N2j43o9l33L53J60j31K40k15J74k45k1J66N4p4n2Q1L5P9k39o3K69M2n90
570d48L13J90K61l77N4l01K72J08l8r1J25q5J24j3l62M37M4L31m38j41mR9j90
593a30o3j40M66k33Q3R6Q5k22K79l66K59R4k53RK09j72k23L8K26j78J85j37%K41
617A53q9j55O7RK03o6k09M46l58j44M81k76O4K6k48M07m77N6nN3lj64J51O8j3
$$ y = [180, -118, 106, 375, 196, 54, -206, 74, -163, -71, -331, -9, -323, -105, -116, -163, 99, 185, 497, 247, 488, 365, 352, 452, 104, 158, -72, -337, -118, -292, -77, 308, -15, -364, -192, -32, 22, -216, 83, 71, -103, 277, -34, -340, 57, 150, 61, -86, 7, 63, 72, 140, -30, -381, -286, -25, -61, -20, 179, 217, 115, 134, 63, -159, -76, -323, 0, 7, -515, -115, 34, -229, 61, 85, 274, 164, 188, -68, -16, -152, 127, -248, 20, -66, 376, -69, 73, -180, 157, 80, 52, -74, 22, 74, -69, -138, -471, -118, 42, -89, 151, -64, 110, -135, -156, 10, 64, -10, -62, 19, 54, 133, -106, -169, 100, 142, -448, -135, 55, 316, -61, -7, -308, -36, 72, 34, -57, 68, -17, 107, 94, -268, 169, 213, 544, 106, -35, -39, 60, -130, -193, -333, 133, -100, -17, 79, 164, -58, 221, -145, 114, 208, -45, -36, 173, 1, -222, -184, 42, -136, 49, -88, -88, 153, 64, -91, -24, -15, 188, 122, -87, 359, 1, -143, 338, 62, 126, 152, -96, 311, -166, -110, -115, -62, -65, -229, -78, -10, -23]
642b3J01JJ66J0k20j1jk16J66O6r7J94j26Kj03J26l30M94o38O64k85K77k77P3
666A3j67J44K01k57n9L18k77m9J0j09k5K08J01k49J16l3M63m88P0P9k64K20n6
689i0l5M1j40K98j99K08k03l6j26L17j45Q5M6Qq2M7J50j12J56J3m11Q9q4L82L7
714B14l52J08j33K75j16J21J22j48j60J06j81K76j58r9j10L95j55J10N2r5J9j10
736a9L80l36j64K87r5l15L33j4O9l3L4k61J08r3K02J08kp8k82L42O0j32J7K07
760C23k87J87j05o5J16k84K28J32q3j55J34k27J70J94k14m6j82K32l0J25j13l39
782b89L48J0l05J74o9K36m18M90L7n2j89k03M75j92q1J29j10k7N1J96j99J13j12
805A3j25K3J78r7j9J26m2j79O9q7J26j38J65j11K05j41L8p5J82k3Nk04M8K52k17
$$ y = [-23, 78, 79, 245, 255, 35, 24, 23, -193, -27, 39, -58, 136, 10, 12, -91, 35, -295, 199, -439, 225, -60, 217, -60, 13, -154, -10, 191, -66, -125, 193, -84, -133, -123, -232, -257, -49, 52, -197, -81, -114, 349, -139, -69, 10, -254, -34, -90, -125, -84, -224, 74, -125, 83, -120, -156, -282, 35, -110, -25, 21, 29, -53, -6, 144, 32, 188, 201, -210, -121, -205, 177, 214, -138, -30, -163, 112, -4, 117, 239, 91, -69, 37, -144, 132, -26, -125, -235, 160, 5, 115, 167, 72, 91, -19, 361, 25, -139, 148, 53, -262, 71, 57, 126, 93, 127, -134, -26, -119, 83, 191, 189, 111, -171, 171, 231, 99, 116, 323, 36, 223, 118, 53, 169, -115, 113, 245, 162, 7, 141, -86, 84, 278, 64, 18, -164, 68, 38, 163, 50, -289, 59, 69, -236, -62, -131, 105, -313, 177, 214, 162, -27, -230, 245, 53, -28, 101, -9, -36, 15, 211, 12, 125, 13, -112, -89, 89, -8, -27, 99, 57, -122, -53, -140, -14, -152, 13, -98, 107, -34, 4, -71, 111, 88, 93, -111, -63, 189, -28]
830b8O1r6l1O1K15q1K3k76J03J2j6j01M36k90JJ00l06J97J50j02m22M76m0o2k34
855b50J52O8m8J54O3K2k3J17k62oN5J37l74J16K85n2N0n9j09K79q5j26k43L14
879A75j83j34L38K77m18q2j23K58j22J88j05j63K1J73n7q1M3j60J81K17j08j21
901A4J38R4l89J71r9K73l4j98K55j62K10m13R9R3K20k64p6O2j33J82j3k37N4J25
925b8P8K9j3l2k33K71j32J60J50j17j59r0K57k57J0K23j95L03m72L93j12j7m0
948b3o0M4N1j0J04j94J34j10m2J36J32j57m7K43j66K4j90M6j73J10OK58j32N0
972C4q4J44k55r0J09R2K9J52m47M00j14KM24l56k46J46P0K1l57K91L48n01J22
995f6j88L51j67rJ90N1l19L19m44m7K14J71M8j05K3M7QJ8j83J95j00J96j20k4
$$ y = [-28, 33, -63, -94, -33, 182, 101, 124, -152, -49, -37, -53, -154, 282, -8, -7, 93, -213, -16, 134, 32, -390, 86, 46, -16, -250, -98, -30, -78, 76, 139, 161, 138, 255, -7, -13, 42, 179, -195, -79, 206, 154, 204, 145, 36, 315, 230, 104, -139, 175, -8, -142, 196, 473, 55, -27, -150, 108, -14, 174, 69, -94, -73, 100, 43, -38, 5, -155, 26, 243, 135, 14, 152, 246, -143, 28, -71, 202, 168, -30, 225, 63, 273, -140, -41, 52, 272, 8, -68, -6, -139, 43, 30, -207, -153, -28, 50, 79, 66, 34, -199, 72, -60, 100, 250, 133, -26, -116, 141, -116, -106, 117, -78, 225, -247, 146, 34, 17, -23, -83, -39, 12, 2, 106, -88, 46, -64, -106, 30, 162, 5, -42, 201, 35, 59, -131, -85, -258, -148, -142, 116, -16, 34, -50, 94, -161, -251, -142, -50, -21, 131, -316, 84, -30, -28, 396, 40, -206, -60, 10, 31, -326, -35, 313, -188, -66, -254, 97, -70, -79, 111, 162, -157, 162, -282, -329, -115, 56, 104, -1, 22, 69, 77, 95, -88, 107, 7, 203, 83, 59]
1019E9R1n00L20R1j08j3J43j96O0k08n5K73j78J97K6r7J93k58N1K13j64J84j43
1042a9P2l3l5K15k3k06kJ65l44K76J24j36j0L3J65j69k83L34Q6k96p1Q4P6L79
1066C82k10K1l00J05p4J1K27r3p2j17j79pM23p7k93K45J3R3r7K19nm54K23Pn1
1091f0k6J2K13Qp1p5J0j46J30J52o9M9k70P4K07k32Q0R6J77k61J60q5n4j24J37
1116C2R3j69K45k44j01K65l27J82J18Q6k30K5J76r2j67R4j92O3j37L39O8J4J30
1139B71l03N3K88m46J3M87m56L51j03l53O59m01j24O2K4j29o0n1L68j07k9n2K25
1162A87k16NK5O1j22r4J20N9J8l54K66k02J23j2M8J16N1j13j2R4m8j64J15j27
1186a76K46J68j41j65J76j59K4j26K01k13M6K24J2l23L74m0j91n0Q0R0lJ27q2
$$ y = [59, 150, -350, -30, 61, -47, -60, 83, -113, -53, -261, -316, -43, -221, -24, 2, -95, 98, -160, -109, 104, -60, 124, -19, 53, 20, -15, 200, 177, -29, -31, 134, -210, 66, 190, 54, 44, 77, 242, 73, -210, 124, 210, -86, -157, -73, 3, 382, 172, 193, -107, -2, -76, -65, 162, 69, -3, -120, -299, -306, 117, 40, -253, -8, 5, 98, 1, 220, 215, -239, -16, -9, -60, -86, -74, 139, 147, 76, 1, 11, -135, -5, 147, 78, 127, -143, -69, 138, -94, -14, 82, 259, -2, 158, 73, 19, -105, 32, 125, -44, 201, -43, -144, 121, -206, -24, 94, 180, -50, -25, 151, 59, -108, -14, -206, -143, -280, 59, 127, 141, 271, -32, 21, 309, -137, -124, 363, -93, 258, 155, -198, 461, 60, -64, -2, 22, -107, -167, -218, 150, 43, 14, -38, 187, -29, -24, 1, 62, -60, -154, -34, 25, 43, -311, -45, -247, -124, -136, -88, 28, 79, -34, -46, 48, 0, -164, -49, -176, 70, 238, 97, -68, 108, -51, -27, -153, 48, -165, -119, 105, 117, -206, 168, 128, -63, -113, -33, 57, 54, 181, 99]
1209I9P6l9k41Q6L1k5n1N9Q6N3m7n7j32K46p1J00l17j22L98o3k07K10n7j33K83
1234A65J01l20J69k01L52k51L4L40m34k93K30J19J45j02M5k41n7J70m3j14J64
1255b2K3R5k6j5j55J82o6k3q3j9J80j64J72j19J10j42J77J36k88J50m4j75jj0
1279a27Q7J20l13R2M50j22j50m5J69j64j8o7J19k64M49m56K54K19q2k69q4J04
1301i8Q2L9j08J52k8j65N8M56j20l91P1k21K28J03l1j24q8K82j45L5q5j7MM8O9
1326FK45m17K77l9J71K5M9o1l22k08L48j15K5L2R5j42j47K41J60k64m8o6R4j12
1350a73K67r6M6O8o2M5M8k71q6J24n5J91O8k06m8L03J8Q9o8k08k63Q3J27K7j25
1375a57L24k41P3j8j21K88k56P7j73R9J98j3j00K1M28l95k8K31j60O5j5j82J26
$$ y = [99, 175, 136, -105, -19, 12, -13, -64, -5, 81, 134, 87, 30, -102, 144, 73, 173, -144, -266, 132, 69, -138, 72, 15, -118, 165, 266, -54, 115, -86, 266, 15, 49, 389, -45, -338, -108, 11, 156, 54, 99, -142, -199, -29, -72, -186, -22, 1, 96, 70, 55, -100, 82, 16, -7, -90, -109, 71, -93, 79, -40, 70, -72, 105, 241, -47, 103, 59, -116, -117, -127, -40, 80, -233, -141, 309, 187, 37, -8, 161, -3, -21, -88, 31, -233, 216, -240, 14, 233, 151, -118, -202, -98, -16, 23, -85, 67, 39, -126, -68, 388, 268, -123, -52, -273, -45, 58, 27, -97, -185, 97, -48, -13, -98, -115, -111, -63, 6, 251, -166, 111, 72, 243, 268, 317, 256, -66, -274, 74, -41, -16, 16, 111, -31, -178, 63, 223, -41, -89, -155, -61, -173, 94, -2, 44, 112, 50, 95, 143, -128, -214, -90, -145, 46, 114, -92, -140, 163, 181, 270, 202, -6, -269, -186, -59, -32, -157, 167, -74, -1, -19, -140, 148, -108, -31, -204, -105, 93, 80, -20, 1, 429, 34, 6, 237, 77, 142, 127, -55, 71]
1398G1P2l7j2j50k18L07L3j86Q5K12k46L6P0J46k39Q7l0L7j38n2k5N4L70k61L9
1423B5J02k32K57j6M8o0j63J65o6J59m44M46p0j19q2J12j21J8R2k7n6O5k0m31
1447d18M98j32j47J94Q3Q2n8J54k49j54M25j43j62J66j75k55M18j17M4K8k54J68
1469dJ32j95QJ44j79R9K12J53m32j73J07J65nJ39k56N9M1r6K09k15M21k58k65
1492a89K06j3O3l29K11j36K63J62m18J55K29o9j50k0j10J27M9j15J41nj49J89
1514I2m7K1O5k9P4M2k77J28j59j08K32m0M3j08R9qOj14J29J57k51J0Jn8j40K32
1540hJ72m49L88l74M11l40M44m52M05k89r1J14%j40j9K88q8N5j48K01n2p6K1o0
1564h7K3N2p1J76j59K86j89L4K5j78K85M5l70K26O0M1O1l52j12J25P3k12K06M2
$$ y = [71, 143, 106, 94, -56, -274, 33, 66, -120, -35, 177, -69, -33, 37, 183, -56, 31, 1, 38, -100, -152, -177, -123, 247, -14, 25, 127, -105, 152, 136, 184, 124, -39, 126, 60, 219, -225, 221, 151, 32, -50, 62, -59, -41, 51, 24, -32, 33, 13, -418, 80, -52, -199, -5, 78, 160, 102, 256, 7, -147, 278, 135, -27, 139, -36, -291, 127, 10, 54, 82, -172, -4, 128, -67, -59, 85, -94, 5, 217, 370, -62, -235, -128, 37, 32, 171, -85, -26, 15, -81, 128, -87, 334, 76, -189, 17, 4, 67, -262, -51, -187, 76, 238, -180, -25, 204, 135, -15, -35, -145, -18, 31, -84, 57, 52, -97, 92, 45, 66, 131, 102, 176, 218, -59, 69, -90, -198, 34, -6, 37, -71, 28, 20, 26, -88, 41, 198, -53, -43, -42, -100, -240, -8, 164, -285, 103, -271, 140, -200, 244, -208, 197, -92, -183, -69, -69, -209, -228, 60, -28, 27, -121, 80, 28, -48, -27, -87, -64, -12, -83, 93, -66, 220, 31, 65, 90, -88, 197, 242, -128, 98, 158, 199, 260, -92, -204, -79, -6, -218, -12, 30]
1588C0J8m8O3J66m1m05K43J50k3j97n7R8K8K19l56M8k23M75k60j78J59L20m00
1611a71K73r7q1mP0J76m03K41pl4O6j8j55K78j50J53k4m71N43k75J1j31J58J00
1635D8J50j99j24K41l01J70p5J15j09M03k85KJ08j95J81m5J90l27J38Q5j36j17
1657h2J31K5l27K93j11J39k6L0j82J73j41J54q6J8o4K80r0j17o2l4J75r3m9p2
1681a18j00p4J89J18k58O5K86j5l11M54m19J88m8l35M91j27k12J97K15k57J72
1702A01j17m40K86K99k24j34L27j8l89K54P3P3j92K18j46k30K89k61Q5l13N48
1723H9q3O0j31q3LL8M63n39K56P8j92j7M5J67Q0k29k4k47J83L69k05k8j01J15
1747F7N1j97J09Lk9j75J27J33n05N64j53K98m25J79l77K66K63n07R8JL67l02J56
$$ y = [30, 48, 0, 63, 229, 188, -217, 26, 176, 153, -44, -101, -3, 25, 244, -112, -64, -287, 188, -72, -250, -91, 229, -171, 102, 5, -76, -80, -10, 166, -237, 4, -3, -37, 29, 11, -144, 134, -16, 137, 113, -358, 185, -90, -79, -210, -52, 48, 198, -1, -125, 116, -185, -15, -90, 25, -84, 319, 34, 36, 144, -51, 130, 85, 275, -52, 86, 171, 35, -82, 49, 74, -253, 40, -71, 68, 42, 72, -110, 63, -78, 76, -10, 8, -56, 224, 134, 17, -45, -79, 96, 3, -46, -118, -218, -292, -103, 15, -243, -178, 108, 93, -218, 236, -183, 5, -43, -378, 113, -14, -226, -29, 186, -71, 101, -16, -456, -170, 129, -95, -229, 98, 80, -309, -55, 18, 91, -101, 117, -29, -259, 30, -231, -146, -459, 89, 6, 66, -65, -148, -145, -107, 356, -183, 73, 151, -41, -58, -13, 154, 234, 5, -19, -266, -83, 286, 81, 53, -48, 67, 118, -79, 30, 33, 4, -171, -44, 89, -416, 148, -5, 293, -132, 47, -330, -64, 199, -308, -210, -209, 158, -144, 12]
1770A2L9k1p3K03j3l84J87J62k9M9k08J42l17L20o8o4J52k33J73O5j03k86M70
1793A75l91J73M8q9k6P8J5j41J53O6k36L84k71l5K8j32K74j37J08N5j65O4m3L9
1817fK5N9J36l72j07J25L36j54K62j40j89K33k59l5R8p8K81l38J99j67o2J11Q6
1840D4j05j01K77k32o3J76K29j81j95K91k07J42%J33j09o13Q58o14J46J62l5J1
1862A4M6j51K01j64q2J40K44n03K50r7J83j0M3j82p0J61k16K29O6j5P0j17M4l3
1886E1K3k71L95j88k5k29NK46R6l12K13p4j50J65J21j26K43l80P2M06l11r5L45
1909B20q6p8p0j60J58j4o1NJ25k02J04O6J37k78k16L76k9Q0J25K1m03K57k29m9
1933b01J15J43k42K75J13l04j24K76j44J52l8J14q2r9k53K99n9o8j81J55J94M3
$$ y = [12, 51, 30, -43, 160, 147, -237, -50, 112, 83, 132, -76, 66, -251, 69, 1, -63, 89, -144, 29, 94, -9, -295, 175, -216, -43, 5, -84, -110, -32, -17, -158, -5, 61, -175, 209, -62, -97, -69, -201, 73, -64, 44, 99, -66, -2, -45, -6, 19, 78, 214, -158, -265, -140, 196, 42, 304, 164, -25, 208, -51, -86, 12, -66, 215, -123, 76, -91, -153, -42, 44, -61, -162, 115, -117, -180, -4, 225, 44, -151, 140, -67, 75, 75, 208, 99, -514, 344, -270, -124, 38, 3, 14, 60, -91, 110, -54, -136, 4, 248, -255, -5, -102, 81, 71, 114, -68, -138, 23, -193, 36, 102, 87, 157, 40, 84, 51, 74, -197, 198, 10, -15, -244, -239, 7, 103, -209, 4, -70, -220, -55, 66, -60, 183, -197, -125, 281, -30, -125, 220, 134, 56, -14, -174, -16, -30, -91, -86, 39, -163, -59, 7, 144, -134, -350, 26, -3, 77, 202, 223, -180, 77, -152, -201, -86, 57, -185, 90, 203, -101, -225, 51, -93, 59, 21, 135, 53, -46, -299, 0, -59, -127, -308, -153, 41, 84]
1955H4N4j45k2K86J29k16j99P0J35l04j05R0m2J73J34lm0N5k84j2j06L17K31j16
1979A64j73J98L9k45J80J00j11k06J17j60Q3J14k15K44j05J61j04j72K13O1r4
2000H9r3j68J53j15K1k3j7K29k13K36j24O0k34L45J70m47K95K6k43Q5p5K69j73
2023E3K69m13N78o64J23J74J19k76K21l69O4J95Pj53N8K40n30K97Oj22J92P9k30
2046h2J48j94K6J17j31J43q3r8j10N33j97j10m0J43j09j65j9J58K9nn4q2M1O5
2070g6j46K62k0o9J65n1J94j2k11j00L7Q7K77m68k1j04K70j18J64l27K94j02J11
2093C6r9K12j36j61J94l1J10k13j96K60m8K6m8o8%J78j25K55M1l45L56k14M4O6
2117I4K20j79j27q7J62o5J91n12K87p9J84o1L03l25N5r0j2j68P3N2O7q6J82J3
$$ y = [84, 138, -7, -29, 257, 386, 170, -29, 41, 176, -128, -233, -143, -185, -12, 122, 119, 79, 134, -150, -162, -268, 49, 280, 164, -9, 189, 228, -17, 163, 263, 152, -54, 63, -97, -14, 100, -115, 129, 24, 185, 81, -91, 122, 183, 89, -4, -172, -19, -134, -113, -136, -153, 76, -137, 99, -25, 35, -199, 146, 316, -131, 164, 190, -53, 32, -43, 226, 53, 322, -91, 487, -177, -54, 120, 239, -37, 184, -185, -121, 74, 81, -72, -14, 226, -304, -7, -1, -123, 69, 148, -82, 66, -128, -102, 15, -116, 27, -56, -154, -264, 269, 72, -38, -78, 65, -44, -209, -228, -70, -41, -46, -100, -182, -141, -76, -222, 40, 20, -49, 116, 65, 259, 247, 36, -64, -27, 60, 337, -131, -152, -256, 14, -104, 60, -267, 27, -75, 36, -63, 149, 13, -148, 46, 15, 125, -88, -284, -24, -72, -46, -94, -162, -162, 16, -109, 146, 187, -158, 198, -16, 28, 94, 314, 135, 8, -79, 83, 18, 209, -303, -16, -95, 89, 28, 331, 6, 61, -29, -41, -209, -136, -84, -17, -103, 79, 92]
2141I2j21j19K28k0k01Q8J10j64j50P0L00j55J43r4q9O4K66K24m65J91l18o7M3
2164a44KJ79J03m9N8k77N2j9j34K59k2J09k61K02r2L28j38j15j36J31j65K27l16
2187b18L84J05l95L11l84J85M8q8P8J37l31K57P7k71R3J65k79J18J49l10J48O4
2209D3j81K59k48J30j96r2K14K23m6l39L50j43J23k18J97J34j07j10k99R0K71
2230E5L5o9J77n3j08N9r2J86j89q1K11m68K63p9L44l24n8K43n8K3l15m9J82j2
2254a77K29J6k82J54Q6q1l0K54j19Q5J46m38O0Q1K97j41l2J66l75M1J25l7k63
2277b35J36l5l2J94J86j39Lm83M00Nk99M14j17J93k20p2N89m37l76L75O0J08j61
2300E7k4K4k67K6K03J0J72m69M08k43K53o0j48M0j1j8K08k62K73j75o3K70m30
$$ y = [92, -29, -148, 80, 60, -141, -53, 57, -107, -257, -187, 113, -42, 101, 7, -82, -18, 248, 472, 7, 198, -120, -187, -144, -142, 37, 140, 91, 149, -128, -76, -95, -229, 30, 8, 117, -144, 58, -34, 294, 156, 41, -95, 36, -129, 98, -218, 166, 271, -124, 187, -197, -12, 36, -52, 26, 163, -168, 89, 166, -105, -12, 153, -126, -8, 141, -169, -21, 43, -138, 121, -127, 3, -193, -285, -71, 152, 106, -233, 117, -26, 97, -121, 76, 210, 103, -7, -306, -216, 55, 90, 21, 198, 145, 37, 96, 4, 190, 1, -80, 131, -337, -74, -153, 191, -133, -191, 52, -6, 17, -298, -347, -165, -177, 52, 68, -214, -60, 26, -55, -85, 169, 50, 135, 281, -157, -97, -16, 281, 140, 108, 274, -101, -60, 65, 28, -235, -99, -134, -166, 28, 214, 75, 78, -405, -5, 0, -299, 115, -2, 191, -29, -101, 488, 51, -325, 50, 110, 218, 57, 33, 57, -210, -184, 19, 29, 201, -268, 140, -103, 150, 90, -58, -18, -29, -47, 161, -101, 172, -3, -66, 204, -226]
2323b26J12K64k3q1J97l58J79J89j81P5J70l41M0qo5nQ7q5J62l18L17j40K83k07
2347C7p9K03k47J79j65J1K19m7n3j40K63k36l6K38k54R0N7J00k6k3j52l2K46j45
2371HO6J53m81N7J93R4n1l71N03k93J36L3P0j00k1j37K07Pj12J63l27L04k7Oq7
2396gR8Q3l9k54r5L2O5K16j16k8j03KR3J27m5l01K44K51l40J10j27M26l50k23
2420b81M07j94K40k26j25M95k22l8j63K45r9k9J7j01P4J92n61M05J96j76rn6P7
2443F8l07J21o2j31L09J36L7j37P5j18l38M84j91J41j81j84K87n2K19k53K44l03
2465a36l7L6K30j62J23j26J71l44M66l93L00l13J82J80k41L61l24OL9p3K3L09
2487B77j45N9K7k1K34k69j96k1o6n6K97k25P0K29k27J87j27N3l42J49L0l6nJ48
$$ y = [-226, -114, 150, 127, 46, 243, -115, 64, 253, 72, 147, 317, -24, 16, 8, -57, -62, 25, -60, 102, -216, 101, -39, 244, 37, -42, 161, -86, 93, -72, -61, 158, 111, 58, -82, 181, -55, -91, 147, -107, -17, 40, 140, 114, 91, -61, -93, 153, 8, 74, 227, -254, -197, -4, 90, 39, -332, 171, -122, 14, 47, 117, 17, -4, -141, 66, 73, -39, 124, -203, 101, 74, 80, -7, 91, 174, 135, -119, -214, -182, -117, 99, -17, -45, -148, -146, -53, 74, 29, -272, -28, 223, -117, -7, -134, 292, -58, -281, 126, -68, 172, -54, -179, 316, 94, 56, -107, 138, 39, 10, 27, -74, 0, 192, -369, 36, 232, 56, 47, -9, 68, -239, -118, -180, -311, -2, 134, 171, 34, 109, -9, -347, 137, -54, 87, -94, -278, 9, -43, 176, -77, 167, -136, -173, -137, 93, -69, 54, -72, 99, -245, 221, -172, 128, -185, -3, 177, -64, 297, -27, -21, 18, -55, -32, 277, 132, 191, 218, 197, 431, 162, -34, -55, -121, -177, 120, -105, -35, 194, -33, 154, 27, 80, -262, -113, -83, -119, -124, 24]
2511B4k08K17m6k2L16l31J45k32P8j14Q5K48l63L20l59L01j37j4O0j70K83j60
2533g9J28LQ4l05K60o1j14J20k4Qk58J31L4p2K61j92Q9L03k92J7LO4k42Q4K1j99
2559b28J53k2n2L2J82p8P4J07j69J71k29Q2J15L1j15j8j7R6j12M5J01J41k49j39
2583i8KJ0j83L43O2j25L09l36K56o3m24J84P8m0l8j4J81j61K28j88O7k44r2K36
2607e0p3J88M1l2N8rm58M56j89mK20r5j39J02r3J35Q7j67R6o9j30j49L36m62M21
2632B1o1l0K68m5j57J43l8o8O2L3j63PJ99k76R1j23J81j31K0r0K2L23k15l5j78
2657b40J34J60r4m9J50k71J07K24j69J21K22Kj36n44N29k92O6J52L8O4m55J36
2679a45J15K83k07J2l0P8k62L31j88%j26j5J00k03K63K12j96k40L34j69K4j13
$$ y = [24, -184, 33, -13, -35, 281, -50, 95, -137, -59, -173, -88, 160, -203, 117, -242, 59, -78, -92, -32, -202, 81, -79, 49, 52, 136, -169, 91, 30, -84, 36, 12, 20, -238, -107, -73, -145, 116, -76, 13, 316, 24, 41, 44, 108, -134, -50, -29, -228, -75, -97, -149, -117, 65, -13, 61, 168, -1, 170, -59, 23, 138, 169, 54, 36, 19, 115, 3, 48, 149, 290, 41, -98, -96, -86, -269, 74, 136, 11, 320, -16, 240, 177, -247, -63, 15, -25, -63, -77, 104, -57, 171, -17, 50, -194, -286, -50, -123, 65, 106, 74, 132, 123, -335, 121, -68, -72, 148, 53, -86, 16, -77, 58, 145, -22, 74, 5, -125, -274, 62, -400, 21, -40, -70, 198, 153, -4, 139, 101, 33, 95, 128, -35, -28, 171, -105, -14, -137, 44, -87, -67, -157, -135, 188, -27, -62, -240, -106, 54, -40, -89, 61, -210, -103, 121, -48, 73, 295, 297, 161, -383, 146, -146, -80, 72, 110, 174, -281, -145, -30, 253, 46, 58, 28, 106, -156, 175, -13, -13, -139, -154, -54, -257, 6, 218, 22, -218, 116, -53, -29, -142]
2701a42J85k7J43J8j54J32oq4o0K43k70k5j91J11K74k97k74L84K60n80M16p4J19
2724A01k89L92l74m4O0L0K30J11m01J84R5J38k04r4J80J54j52l45L60j27k58N14
2746B61k96Q9m1p4K40j38j89J42M3k43J11O5K52j85l99M17N7j91K50k38o2J7j48
2769b60N0J48j08P9J89l45K2M10j35M0j18Q1j88j3M91l79o2K93k74K03L7o8q1
2792A2k7R4Q1j82L47l53o4K31j85J22l37L82Nj60q1K79r3j1K23k25k28K24k25
2815a71J66P4k13J97l9k52J85R3k1Oj70N4K55k79Q7R3j03J05J23j71p0K39k85
2838i7J50k2q8J96j97r4m2L12J70m10M88m07N2j80J92r6j1J6L30k71k28J64N5
2861a8L2l2j46J74N5J66j52k42L33Q5l11Q6p7RJ23P5p5K04m18p9Q0j81K63p9L98
$$ y = [-142, 43, 16, 159, 177, 23, 155, 149, 65, 5, 248, -22, -47, -238, -127, 147, -150, -424, -40, 220, -360, 56, -18, 101, -188, 204, -170, -214, -154, -124, 106, 217, -184, 0, 95, 233, 29, -65, 115, 269, 117, -228, 132, 5, -253, 261, -35, 54, 13, -61, 179, 41, -148, -6, 37, -206, -95, -30, 222, 37, -362, 55, 112, -79, 171, -67, -129, -112, -260, -210, -62, -170, -91, 98, -247, -225, 185, 50, 90, -28, 53, -135, -148, 343, -36, -98, 195, -79, 124, 161, 93, 12, -15, 79, 160, -22, 325, -28, -92, 139, -46, 76, -261, 121, 126, -34, -115, 164, 71, 60, 283, 58, -170, 54, -171, -5, 69, -144, 53, 14, -238, -53, 40, 19, 25, -145, -91, 164, -115, -28, 65, -38, 67, 190, 19, -51, 188, -97, 53, 31, -57, 139, -58, -152, -194, 118, 288, -122, 366, -41, 11, -169, 23, -73, -84, -68, 262, -9, -237, -73, -18, 14, -18, -164, 10, 65, 231, 79, -163, 170, 255, -56, 30, -47, -38, 85, 160, 85, 289, -129, -208, -128, -309, -46, -125, 273]
2886B73m17L69j17k29M7J08r2l4K31L1j35j55K41J34k93J16k53J09J96j91R6k66
2908b31J97o9L24l3P2k37R2j93L6M00l79J1r8pJ41mJ27m8j22L21m13J06K8J0P6
2933A07k9J56k17k63L98o8j06P3Q9k00M6J33o9J79k08j20M7k23L33J03l91J57
2955g3J70j92J05j27r5K82j16n0L36j77o0j01J7K73k12J47J17j20l02Q8Q2o8Q0
2978DJ17k18Q1%j34L47m65L38j93m6M04j47j02n8K46m01K31j7mk17K95J12m04
3001b31L5J83jj62L26Q0k7l35J46l47K07K60k31j3N1K15q0j30L40k00l5K16j53
3024A14k13N0jR1J10q3J1j92J4J93J2j32J10k05L29j0j60j43J52j83l7O0p6j6
3048b05L43j7R0k44n4J70k57J94K30k13M6K6j44M7j53N7QK73k73K5j00j42K18
$$ y = [273, -144, 225, 108, -121, -74, 34, -58, -92, 139, 170, 35, -120, 121, 255, -38, 78, -175, -66, 130, -61, 35, -231, -34, -103, 221, 188, 260, 23, 115, -78, -42, 358, -21, -10, -108, -115, 26, 22, 149, 101, -21, 300, -113, -7, 21, 31, 107, 78, 234, 17, -246, 152, 84, -22, 51, 140, -60, -14, 119, 50, 229, 21, -99, -52, -275, 58, 161, -230, -73, 97, -95, 10, -117, -212, 70, -46, -96, 240, 63, 3, -98, -81, 192, -20, 127, 244, 124, -178, -90, -8, -76, 4, 121, -97, -16, -16, -150, 197, -268, 70, -123, -169, 235, 88, -14, -72, 174, -227, 4, -13, -17, -234, 61, 173, -231, -196, -13, -14, -176, 150, 230, 203, -132, 14, -333, -126, 134, -97, -110, -59, 156, 76, -54, 286, 86, 51, 267, 114, -99, -49, -50, 41, 151, 68, 79, -113, -99, 94, 106, -26, 84, -121, 208, 198, 38, -105, 47, -136, -173, -113, -189, -205, 138, 121, 211, -33, -87, 83, -174, 20, 250, 37, 83, 109, -35, 12, -141, -84, -76, 197, -76, -51, -151, -293, -75]
3071g5r7K58j73l2o7P4K71l30J49J72l37J82p1J47q6K2J63n0j88K11J12n50M05
3094A10R0l71J50K34n2k17p8J46J3j77k27L59M7J05k4J4l33K05K73j92K88m63
3116a00l4M5J57j84j01L25q6m83Q37k85j29O8k50L57m5O2Q3j46j83J97n9R1j57
3139b0l20M17J14l75K54j99J63k7O2l43j78K79M3n2J91K10l37J59m0J08j80J27
3161E6O9k44K75j70o7J43o1K46l0K9k87j00JJ37j07J83j03j65J87LL9o0K74m46
3185a98J93l53L37Pq6p9L64k57k97M94l0j62n6k24K70J71k70Q0KK01j27K31j36
3208G5j55q5O7K75q4L7k8j62n1K07o3j81j8J82Q5j87J85p4J39j23lj11l42L80
3232c5R5j28N3P7n7J15j57r9J75m9j58K48j39R0o5M0J68j44J16J07k51N1j22J09
$$ y = [-75, -172, 86, -87, -119, -186, -112, 159, -171, -22, 150, -187, -5, -76, 71, -15, 7, 170, 120, -68, 143, 255, -295, 110, 200, -171, -21, 213, 161, -56, -134, 12, 25, -152, -379, -20, 27, 132, 108, 122, -211, -6, 267, 75, 363, -100, -134, -89, 68, -116, -217, 108, 22, -461, 376, 91, -38, 30, -220, 137, 92, 154, 237, 91, -92, 105, 46, 137, -20, -340, 77, 191, -184, 70, -129, 34, 7, 69, -274, -452, -173, -130, -182, 9, 219, -118, 41, 1, 109, -71, 56, 125, -119, 156, -14, -81, 62, 1, 247, 217, 246, -41, -141, -140, -3, -110, 73, -30, -195, -8, -5, 34, -26, 248, -198, -5, -358, -21, -14, -100, -179, 185, -72, -369, 125, 95, -67, -123, -347, -77, 94, -176, -96, -94, 107, -20, 211, 75, -80, -165, -98, 177, 93, 130, 102, -60, -111, 96, 33, -148, -166, 16, 101, -86, 99, 25, 164, 41, 38, -73, -415, -35, 60, -68, -15, 62, 5, 120, -37, -136, 39, -10, -168, 80, -59, 31, -34, 6, 174, 30, 146, 253, 2, 53, -69, 40]
3256D0J63m08L62k88J86j11m6J62Q7K3o4j25J95l69J28P8J01j51j63J60J05K6
3278I1P6r2l51K59q1L14l71J50l2J03k05J98j21m3J18J64j98jLj35R0J87j89J13
3302D7j93L40k37Nj09J44J03j60J86m7j78o8L95m09K42j09K66k53J54j47J22l10
3324b16K79o4j55J42J4q2M8N9J44J35m67L59j97K60l70J87j54J07n3K29l45J98
3346E8j80N0o1J84K44l89J67j04K41N1k27j85L29j77k18J79L00k58P4n0j32K83
3368A79j28Q6l95L21j86P7N4M4j3r9K8L69l98J09l75K83k9J97k83j1M58k80L7
3391D5nJ32l35J22K10j89Pj44O0J27LR6o6j08q3M6J07K7J04j73q7J57j37K25j21
3416B0o1L4J54j80L04m56O9j18K97o7M0k90J43j6J08j35K42p6j07M7J1J27k87
$$ y = [40, 203, -205, 157, -131, 55, -56, -102, 60, 147, 170, 106, -19, 176, -193, -65, 13, 114, -37, -200, -40, 65, 91, 167, 75, -276, -17, -98, 216, -155, -5, -37, 66, -139, 59, -62, -105, 13, 177, -21, -22, -19, -154, -64, 123, -66, 47, -146, 194, -43, -38, -147, -3, 100, -60, 126, 79, -99, -167, 228, -181, 61, -48, 218, -35, 119, -28, 94, -216, 63, -1, -156, -14, 0, -82, -34, 25, 169, 304, -163, 196, -1, 259, -111, 76, -78, 29, -24, 205, -140, 58, -122, -72, -133, 51, 295, -94, 73, -31, 210, 261, 34, -151, 178, 1, -217, -38, 262, 4, 78, 28, -104, 179, 51, 137, -258, 63, -123, -46, 8, 52, 39, -60, -32, 337, -61, 48, -327, -44, -73, 124, -159, -170, 288, 8, 45, 40, 172, -163, -41, 169, -20, -13, -157, -97, 30, 33, 129, 63, -45, -128, -82, 25, 52, 156, -17, -104, 53, -84, 141, 20, -41, -7, 147, -33, 271, -185, -116, -234, 63, -4, 36, -254, -111, -127, -19, -154, 88, 12, -95, -48, -37, 90, -197]
3439a97M40m22k8PK75M2q5j02K65j60j70K22o8N9m25K81j5J46J3k73l5J46M9J75
3463A40p1J10k36k17K91J38r8L3j48J4n6m4K77k5N3j08K23m03K60J74m41K03K2
3486I1l6o0J21q1ko3K04m1q3J40k50n1J89k00K14o3r7J90j08p1K8L4J01k20K8
3511h6J71k86J50J79j99J84r1R0k09J01K48k30j78K05m95K65J6q5L30k40J08n1
3533a03k8J6q8K20LO4j87R4o7K23j65j20K81j68P9m43M49k79L13Rk61r6L09P3
3557A28m5k08L64k62k41M8J87r4J15K01l83J67OM7J82k42J9k26J2L71j87M5j01
3580i7J96j74k10L36N5m8j38J81k8J31N1k98J02j02O6J92l6j18k50K57r9j7K12
3603A64j14j23j6M6J63K43m10J33j60J07k62K05L5J4k76J37q1K43j61K74j21J05
$$ y = [-197, 243, -179, -207, -200, 75, 117, 32, -70, 195, 35, -135, 87, 19, 78, -347, -66, -81, 65, 78, -195, -230, -84, -35, 140, 69, 179, -57, -274, 17, 155, 57, 90, -58, -44, -100, -144, 133, 108, 161, 53, 276, -127, 133, 307, -134, 69, 91, 55, -5, 116, 35, 33, -30, 174, 133, 50, 190, -60, -111, 78, -122, 92, 29, -68, 122, 14, -57, -29, 5, 106, -114, -86, 85, -201, -51, 128, -71, 113, 22, 112, -97, 4, 252, 22, -156, 49, -446, -181, -165, -250, 80, -160, -52, -103, -131, -115, -203, 17, 20, 84, -103, -9, -76, 147, -18, -138, 143, -25, 54, -389, 60, -219, 94, 103, -158, -254, 55, 128, 83, -125, 239, -23, -264, -216, -29, -123, -8, 193, -190, -23, -17, 30, 212, -30, -11, -237, -225, 146, -41, 4, -97, 99, -75, -285, 51, 106, 58, -80, 101, 73, 204, 255, -43, 59, -43, 23, 215, 179, 61, -189, 68, -31, -48, 164, 50, -73, -89, -43, 120, 363, -47, 86, -74, 33, -229, -24, 11, 25, -251, -114, -195, 48, -113, 161, 40, 145]
3625A45J16o45L97j32K59k0l07O4M42k85j64L2M3K20k45N9J38r8k85M15n1k20
3647a22K92l37k2O9P8K35k66J65k75K6J38M4K03m11j2L38k70J22l6P8j60N8J14
3670D9o2j16k34M54j00K46l55J30j65KJ98j09K26k00R2k74M55j62j08k26N03k97
3692e3Kj0J88J44n31K30k31K45n4j21K9J61R3J61k76j9J52k61L93k32J44j45j02
3715i3K24J53l43j40L52k26R7j73L3N83p45J78K13l82R7L19l06L26m06K29L10
3736C00k18j30J25M2j51j3J92J5j8j17L00l42j27K9Nm1M12m21J69J20j91j64K92
3759F8O9J10l79N3J38k96M17k67J32Pj30k21M64o0j64qp0Q1J12m0nq2m2O4K36
3784A87K43l59K78m55R5l8J57l39J80J1j04P0J6k7n6LP3J81n9m5L48k82l55L57
$$ y = [145, 261, -384, 13, -119, 140, 120, -187, -123, 319, 34, -130, -98, -55, 165, -80, -21, 117, 19, -266, 149, 98, -122, 170, -167, -189, -120, -42, 193, -73, 92, -183, -157, -19, 25, 228, -183, -195, 143, -127, -5, -41, 37, -123, -65, 49, -13, -129, -363, 91, -9, 237, -118, 12, -153, -151, 47, -62, 164, -36, 56, -218, 237, 75, -33, -259, 244, -53, -51, -61, 127, 271, -260, -30, -261, -16, -70, -191, -162, -1, 92, 253, -23, -42, 110, -151, 242, 10, 154, 9, -93, 131, 284, -59, -199, 153, -73, 24, -149, -116, 467, -278, -100, 113, -269, -172, 147, -159, 167, -239, -10, 300, 82, -48, 77, 119, -32, -45, 147, 162, 144, 27, 327, -15, -142, -113, -108, -149, 263, -158, 11, 131, -60, -224, 68, 137, 247, -132, -79, 59, -237, 180, -87, 45, 52, -78, -299, 165, 105, -59, -67, -137, -56, 56, 16, 11, -71, -113, -49, 187, 430, 71, 349, -106, -11, -49, 108, -231, -51, -40, -144, -74, -58, -85, -141, -138, -65, 116, 57, 12, 360, 78, -277, 80]
3808H0R4kj06l49L16J21k88L13k38L5l13K98M44m88J66k78J02Q7L25j42J80m62
3830a05J81j18l3j55J08r3K18j61K32n4p9P3J24j8l68L98j33q0k65K25nl3J0J01
3854c0J11q1o2J85j41L9l3Q2K5N3k30K63j19k17K11m7kk35K52k1k03L12k31K04
3878H5N7o0k45O1L90j74Q6k66j03K24P1j57L09J29j98k84K17k40n8K8nJ20Mm2
3902e1J21k84J07K94N5m09J21l6j15L58k71j04M53n01L37J49l02L57j87j69Q2
3923EJ60k13N6kM5r4m6K59k23j60K15R8J1J09l01j03L13l26M12nm1k01l8K30l18
3948a58K30j9j16J94k14O5j50j26L36k81L34j99R3j64M19j9j18j01l2M4k49OJ41
3971h4n0j21O9K61l3Q8j44M9P3K37k89k73Q7K51j22j5P0j58Lo1K02J51j34%j21
$$ y = [80, 174, 172, 66, -283, 33, 154, -134, 179, -59, -24, -337, -39, 405, -83, 83, -195, -93, -6, 319, 177, 357, -105, 76, -42, -75, -230, -122, -215, 3, -158, 74, 20, -59, 14, 138, 120, -248, 150, 17, -63, -328, -103, -108, -141, -131, -30, 81, 0, -62, 123, -18, 21, -12, 70, 95, 148, -82, 181, 62, -155, 56, 9, 7, -228, 24, 3, -200, 112, -119, 85, 142, 82, -163, -102, 288, 114, 200, -66, -169, 55, 126, -31, 278, 407, 209, -75, 142, -98, -156, -128, -133, -13, -9, -51, 70, -214, -107, 187, 242, -167, -46, -82, -197, 161, -110, -214, 239, -262, 75, 224, -78, 279, 92, -77, 5, 165, -48, 8, 6, 51, -43, -89, 170, -53, -213, 2, 100, 111, 220, -81, -184, 129, -197, 215, 210, 169, -32, -70, 160, -158, 72, 53, -63, 131, -83, -18, -168, -294, 42, -239, 95, -104, -11, -175, 244, 225, 107, 6, -26, 18, -231, -225, -84, -134, -255, -186, 75, 42, 130, -14, 35, 108, 345, 56, -217, -130, 121, -1, -16, 54, -104, -101, -162, 40, 191, 57, 57, -64]
3996f4J41k42J94p7J40j40k10L10j56N9J14K5l5J87n9l1k8N5k77L9K19k32J64
4019I6j26j16K0J18K12r1k84K4J26n2J99j22j44K71j16n7k2J76L9j00j66K25j91
4042h1L01k11K6j40P3J70j9j64J04m0%nj88K11Nj4rL1mJ29O8k14m6o1j42L09l8
4069E1o6L2j93J34K29k65k6J26M5l18L80k41K13k30K55j50p3K25k39K83r2K59
4091C39j76j43k39J23j13M30J5p7M4n5n5q0M3j02L2J58n01O12l39j32L5m3N05
4114B81n46L48j42L31l9k01k2r5P8K0r7j25K75J86N6l90q4j5pM30k31K08q0j48
4138iJ48j75M56k75j08l90O28l2l82K21j10Mq4J55Q3j69J12l21J79J74j89nR5
4161FK17k69K20m73K47L5M1J24j73k5R6P9k8l4N1l57L49J06k24K5J41r5j7Q5j0
$$ y = [-64, 77, -165, 29, -48, 92, -48, -258, 52, -104, -45, 69, 94, 59, 246, 187, 156, 128, 183, -94, -55, 164, -68, 96, -30, -146, -126, -8, 204, 113, -171, -147, -21, -73, 126, 4, -140, 131, 15, -42, -64, 112, 151, 51, -115, 110, -81, 220, 9, 35, -105, -32, 138, 119, -45, 59, 19, 19, 14, -174, 37, 42, 28, 19, 50, 46, 175, 243, 29, -17, -78, -220, 89, 51, -15, 17, -176, -42, 187, -78, -104, 22, 67, -251, 129, -112, 101, -129, 126, -24, -97, 128, -111, 172, 80, 339, 163, 20, -219, -96, -209, 221, 236, 159, 203, 148, 93, 13, 56, -46, -14, 144, -357, 255, -84, -216, -181, -224, 281, -265, 83, -59, 272, 233, 32, 10, -85, -7, 13, -84, -209, 66, 252, 308, -82, -166, -181, -188, 242, 11, 219, 139, -9, 139, -36, 420, 145, 37, -353, 275, 243, -139, 82, -28, -24, -108, 47, 130, -39, 73, -248, -69, 105, -84, -89, 6, 223, -46, 174, -299, -52, -17, 24, 148, -25, -50, 46, 125, 97, 63, 114, -243, 106, 212, -12, 13, 154, 59, 42, 127, 117]
4186A17p5j65M03m28P4j2K13k57K00j67jK57o6j03K97k07j92P3K43k83j21R9L55
4209B54l71l4J87n8j0o1J27m1rJ5L21l61lq9M12m44L11k62L12j46K2n0j00K36
4233A58N2l40L82j09m02k5M32J35r6j58P8J76m00M25k34k3O0q6j54J97L7l54L77
4256A28K5l63J46l34J16K35QO7k23K51k3n7j18K66j7O3n5K6j61N5j2j30j93K09
4280i1P5J07K43j45l95J63P6N1J3l1J61k08l8J27q9P8j38m1J42Qk19L30k7l43
4304a91R8J13J63p0K9j23k9K67l99J49n3K09k2j91K20k27K01j80l9J57L06l70
4326A8L4K34k81M5k34M8O4j4L82l09j41L81j53k6o4o7J69k14L31l96J51j8J66
4349A06j96J56l8l6j45OJ55j34J51%NK60j47q7J50l74J46k01L17k2j45N4j5j48
$$ y = [117, 42, -123, 280, -148, -74, -86, 127, -130, 70, -97, -98, 159, 93, -10, 287, 80, -112, -39, 204, -79, -200, -101, 254, -117, -151, 36, -22, -32, -93, 34, -7, -16, -1, 320, -41, -44, -133, 279, -165, 146, -116, 196, 50, 72, 22, -78, 158, 210, -130, 252, 143, -259, -284, 148, 283, 187, 29, 107, 283, -117, 308, 74, 51, 111, 25, -129, 68, 105, -249, 128, 153, -210, -64, -398, -282, -47, -39, 28, -195, 56, 33, -24, -142, 124, 107, 170, 115, 141, -20, 35, 23, -107, -300, -91, -16, 91, 334, 189, -206, -43, 33, 84, 97, 66, 227, 19, -19, 108, 19, 97, -41, -82, 60, 68, -151, 179, 152, -191, -93, 20, 183, 113, 142, 19, -10, 257, -142, 7, -46, 163, 141, -50, 170, -57, 144, -36, -75, 82, 388, 18, 52, 286, 5, 50, -184, -136, -72, -86, 296, -13, -154, 227, 74, 48, -16, -83, 86, -128, 203, -193, -42, -60, 106, -90, 66, 28, -8, -153, -147, 8, -126, 25, 25, 30, 290, 143, 56, 206, -168, -22, -223, 94, 72, -73, -19, -34, -182]
4373a82J98m0k32K08m7O9j53N12q1j1m61k1L15j64K40j21M2p8j78J13M0M1r3K42
4397A58j05N5m3m22N87l73J99Q3j71J05J54r8Q9k03Kj1N21o18m5J37j23K50L8
4420A66j68j58J40j26O2j91J18m4K41j34K92l95O1L03k77J94P6k00J25k18jM7
4442h7q6K20k26J27OK12j64p4K03r1j67jJ08m8J16l75L77J68j86k00J08m7Q7j68
4466a88L76M9j58j07M5l6J05NP0k33q0R4k76N09j27L7N0j43J42j82K04j06J84
4489B34l13R8rj93M08j40l73M44k77K16n0N9J26j50O0jj73n1J35O0k25K12j48
4512e1K37j0l14J57K0j1J2m7J14q8J26k07k31L48m21K62n4K22L9n8O0ll22K81
4536F1k89N50l97k4J42J32r8L1j17qJ02k61J65J84j73k76K11M8k18J86J26j42
$$ y = [-182, 16, -24, -256, -48, -95, -26, -179, 333, 252, 241, -220, -241, 74, -90, 150, 29, 71, -7, -185, -72, -32, 9, -84, 158, 53, 108, 65, -357, 230, -143, 56, 139, -32, 73, 227, 129, 218, 15, 17, 6, 527, -91, -136, 1, -122, 128, 166, -2, -160, -20, -146, -84, -275, -157, -201, 40, -94, 198, -197, -136, 167, -110, 84, 160, -40, 85, -133, -134, -87, -173, 47, -179, -52, -46, 166, 2, -72, 131, 40, -127, -128, -20, -68, 48, -327, 50, 218, 32, -168, -60, -107, -20, -188, 188, 237, 79, -28, 17, -19, 86, 91, 161, -72, -152, -58, -334, 175, 48, 85, 135, -8, 134, -48, 156, 50, 234, -79, 19, 10, -183, 225, 85, -288, 156, -121, 95, 45, 104, 230, 80, 140, 139, -34, -85, 50, 110, -115, 97, -51, 186, 176, -138, 19, 39, 28, 40, -7, 107, 19, 145, -62, -293, 55, -366, -104, -158, 64, 103, 45, 105, 102, -220, 61, -228, 322, -75, -99, 43, 175, 77, 108, -9, -17, 85, -176, -11, 173, 0, -276, -65, -17, -235, -49, 77, -65]
4558f5j67J20L09k25j9N1j37mL7L6j8k03K03J75O5k04o4K58j71j84j30L54M0K
4582E9j66J5L12j10qj26J57o0J3j70l3J47oj59K15k98M62n84L61j74L10J16m55
4605a82K46J7R7q8j05j57L15j18j47L8J09K08J3j13k13RM13l30J29K5k07r9J40
4628@J11m49K41KJ30j28O0K32j07J5l2k36J68L8j17K14q6j26K60k06K40m53K94
4651F5l6P9m7J10m7m5j33m8J5K8k3J10%J88l09R7L7l3J07k76K15j80J65l1J96
4676B04j54K2K09j42k24K78j0m8j7m0l47J99k38K09K51k0k4j74n8K35k26J7K58
4699A60j64mK4k45K99J93l8l61J17N5K24j68J27j56j89l4M0K09j88J54K39l35
4721d1J13J25k12J08m4j38K03j33J14K44j36l99M8J39O5j15L5j17K74Q5n89L86
$$ y = [-65, -232, -112, 197, -28, -47, 4, -133, -137, -100, -64, -82, -285, -82, 93, 158, -46, -110, 148, -23, -207, -337, 17, 57, 59, -107, -92, 220, 110, 102, -24, 133, 73, 86, -84, -117, 30, 24, -135, 80, -218, 244, -340, 21, -153, 157, 273, -182, 64, 81, 178, 90, -15, -172, 143, 25, -122, -84, 25, 233, 246, 133, -80, -71, 342, 12, 141, 166, -41, -140, 0, 111, -338, -97, -95, 35, -93, -33, 199, 92, 107, 75, -161, 7, 45, -72, 142, 56, -70, 190, -16, 224, -229, 65, 29, 108, 61, 171, 124, 79, -54, -102, -87, -59, -82, 28, 28, 216, -93, 4, 41, 8, 115, -161, 54, -126, 39, 8, 204, 50, 72, 281, 139, -85, 193, 183, 135, 118, 78, -269, -70, -308, -99, 152, 132, 108, -66, -124, 111, -115, -98, 160, -4, -8, 16, -229, 70, 263, 225, -136, -19, 36, 260, 92, 219, 63, -126, -160, -120, 89, -99, 55, 294, -41, 72, 197, -15, 93, 49, -89, 114, -19, 95, 339, 203, -196, -148, -9, 56, -59, -24, -141, 133, 218, -371, 15]
4743A5M0K38L5l80p7J38L4n0J73m1n02K65K32j55J79n0k43J48j7q8J90k76NM50
4767B63j71j26Q4j36J67%M1q1m07K10K92rq2j90K11j79o1K62j48R8J17k70K10
4790I5L9j21j24J92l3k26J41j82M01j86k39L53j07j16R1j19R9j44j67L96r7O9
4812A5J11j09k37j8M01o3J51r4Q3k14r8K48k31oo6K34k04L91l61J1L9l51L16M6
4836fq1L20j12k97L14k43k2J18R9k75K08M7Rk3m2J9K80k00L2K0j08o4K22r1N7
4861A81k17J34jl8p1J06p4j26N6J88J4p5n9r3L01l4k35k4K82j78k54L39j36J5
4885AJ57k44J43J09n4j61K61k27J3L71k81k45q8J77K10j39K24j92j1j32o2m5P1
4908a44L43j98k07P8Q2J82k09j23K10Q5j62J6J43k01J69L5J44o6k05l22M40j39
$$ y = [15, 55, 293, 328, -52, -129, 9, 43, -7, 166, 125, -377, -112, 120, -35, 144, 94, -149, -1, -18, -106, 84, -192, -187, 263, 92, -34, 50, -86, 81, 81, 122, 41, -366, -156, 136, 127, 45, -145, 66, -113, -174, 88, -60, 38, 155, -115, 95, 134, 13, -111, 81, 48, -178, -37, -219, 182, -4, -243, 110, 3, -113, -22, -141, -42, -186, -353, 43, -54, 15, 126, 17, -220, -238, 163, 100, 251, 157, 240, 26, -72, 176, -55, -61, -127, 107, -97, 294, -67, -56, -17, -368, -52, -6, -87, 233, 121, -176, 138, -105, -127, -9, 90, -185, 23, 70, 79, 56, 14, 33, 313, 113, 145, 165, 57, -7, 215, 124, 181, -36, 98, 97, 59, -12, 94, 20, -106, -50, 138, 152, 77, 18, -75, 226, 192, -43, -67, 215, 37, -217, 122, -14, 1, 158, -86, 57, 166, 112, -49, 212, -15, -2, 369, 88, -157, -245, -68, 142, 3, 227, 35, 24, -108, -170, -215, -144, 199, 1, -206, -128, -46, 136, -73, -196, 14, 99, -63, -47, 96, -105, 64, 99, 243, 177, -28, -350, 90, -49]
4930d9Q4J8n9N6k70J05O6Kk6k0L28n2n5j77K70p8k06mJ60l05K48j44M26j45m36
4955b63J08q5K80j2J02k94q2K78J37p7j39K10qk2r9m3o2J15k34J44K37k67R5q3
4979f4J71k93J09j03J31L63m00l0R8J30j73J12j05K10j06j85J50r7L30J38k91
5000I5l6N2k41J28j82P4K6J32J64l06nJ47j94J70J90l87J12J67j17L21m52K05
5022F3P8k14M9n8J99K70m56K5J54j04k01L0N2L18k94J53j67J80O9j47p8j92K53
5045a8m%k21L37k01K37k0k57J98Q2k02O8ok09K39l4m9R3l3oJj10J42J40m18L61
5071A10k47J56k32M80l53J73J86l85j14K55J95l18Q7J34ok35M16j55J03N3n09
5092b06M58n05M63j41p7K30k58q6O5K41k34O3J68R5k07j57K28k64J69J9J26l49
$$ y = [-49, 35, 53, -6, 50, -220, -115, -49, -47, -73, -93, 235, 183, 128, -49, 221, 143, -63, -67, 93, -212, 36, -108, 318, 173, -263, -155, -240, 40, 28, 130, -164, -246, 32, 169, 92, -47, 163, 155, 133, 34, -9, -71, 44, -190, -46, 191, -76, 19, -64, 107, -186, -77, -180, -49, 314, -86, -116, -18, 112, -61, 51, -54, 156, 50, -135, 15, -82, 248, 386, 95, 59, 111, -130, -2, -184, -110, -84, 48, 212, -94, -99, 48, -146, 24, 214, -173, -61, 106, -11, 310, -142, 63, 141, -73, -24, -82, 117, 387, -69, -44, 110, 6, -195, -165, -113, 205, -89, 64, -103, 77, 146, -1, -79, -271, -18, -22, -22, -243, 94, -107, 130, 110, -147, 51, 133, -69, -1, -7, -216, 23, -11, -60, 33, 0, -6, -5, -115, 27, 167, -251, 110, -137, 19, -213, 267, -86, 87, 273, -112, -226, 29, 224, -94, -7, 127, 121, -114, 302, 147, 250, 303, -206, 252, -253, 210, 69, -8, 222, -36, -122, -57, 184, -50, 13, 181, 276, 69, -88, 140, -124, 45, 64, 190, -159]
5114a59J17j2j46N50k12n2k7j18J18l75K73J28k98J39L0p3K20k33j5R9L32J83
5136D69o31P1L8K05N6j03j45j09K08k25J14k44K57J42k61K13j67j42K87J17L0
5157A80j12p5J36j01k7j43J83O1k52M74n22N3l9J2J28o3J68o0m8J46O9j71K6k22
5181a99J63J13j54K32r6k80j77N30J01k64Q4j46J93N9j94J80j62nJ5K1J78j91
5203AJ13m5P0l45M53j68N6k86J38l2Q2o0J84j60P7Q4n8r0P3j60o2K56J15j01J52
5228B87m61j27L62j80pJ03K9K99k30j24p9J32k49K13J07j67K58k09M2j42J25l4
5250e2qJ73l61K14J2N2o1O1q9J4J16m7J57p3m74N16N4l62Q2j28L20j8k72L92l0
5275A88l7J6j29N5K8J14m32L59j28n0J27k97L21k01j45K3J33j16K51l3l87M34
$$ y = [-159, -42, -54, -200, 350, 138, 86, 59, -59, 59, -316, -43, 85, -213, -74, -44, -117, 103, -130, -145, -46, 286, 469, -162, -91, -53, 152, 208, 105, -40, -149, 59, -166, -52, -296, -39, 103, -158, 55, -112, -254, 33, 150, 180, 68, -7, 129, 28, 1, -142, 41, 102, -150, 324, -198, -145, -184, -172, -44, -107, 61, 1, -47, 99, 168, -3, 23, -199, -36, 77, -77, 155, 59, -221, -398, 132, 233, -31, 53, -93, 100, 159, -35, 145, -17, -22, -7, 14, 192, 1, 114, 69, 139, -206, 247, 79, 135, -151, -13, -45, 37, -23, 161, 1, 78, 162, 104, 14, 87, -73, -135, 121, 236, 135, 287, -174, -301, 61, -119, -126, -23, 6, 305, 75, -49, -128, 4, -245, -32, 75, -92, 166, -43, -1, -143, -18, -52, -60, 113, -248, -34, -22, 30, -31, 30, -59, -45, 71, 24, 181, 108, -366, 150, 204, -158, -76, -204, 116, 98, -174, 218, 188, 151, 167, 38, 93, 121, 235, -197, 162, 34, -16, 111, -186, 135, -66, -211, -188, -55, -171, 80, 47, -340, 94]
5297I4k20L01k97K84l82K39J79l47J47j04mr8L48r3P1m1nRj70M21l41K61l05K8
5321b5R3J96k94q1J73k15R9R5j15K46Q3l5j62k1j43P7R5m6k71L85K37k06M2k19
5345a2l5j00J03m3K02j22l07M03Q6o6j32J78j85J45l5n2q6K65j50l3k49J57m9
5368a17K6J25n0K5p5k13K51K58m41L02k08J30j16M54m61J55j06j64K41R7j54K24
5390A83k52j36Q2P1Q4J5l21J58M0K8O7o4j29J42L7m9M5rl14M95j50rJ90k05K08
5415B07j76k5j37K43J76l00J02l17K67J24J61m43JJ02p4K32L1j24k81l5J97j52
5437b21l6K07J3k28K03J6Q2l3NK84n1l78L70N2j94j4J4j50N8j89p5N3L08J34N9
5462B89l75J56j79o3J48J10j23k2j51N7K07k65r4K63J42k13L80l58o8J52K31k49
$$ y = [94, -126, 175, -122, 162, -220, 19, 198, -149, -2, -106, -110, -208, 140, 47, 118, 77, 72, 81, -89, 332, -9, 252, -53, -25, 68, 264, -30, -111, 62, -153, -54, 41, -74, 172, 255, 220, 58, 37, -106, -29, 66, 20, -251, 134, 371, 165, 207, -12, -47, -147, -44, -87, 115, -7, -314, 89, 175, 109, -23, 155, -30, 115, 80, 28, -58, 207, 57, 24, -225, -68, -117, -91, 34, -16, 9, -66, -279, -28, 230, -211, 91, -117, 13, -103, 351, -110, 45, -61, -225, 16, 113, -41, 183, -69, -205, -123, -52, 32, 47, -274, -116, -76, -48, 19, -45, -174, -32, 5, -44, 1, -8, -322, 173, 23, 14, 204, -1, 207, 31, 6, -131, 112, 288, -12, 90, -227, 40, 164, 325, -118, -117, -15, -89, 143, 174, 50, -231, -266, -69, -221, -257, -50, -37, -265, -62, -46, 36, 3, 8, 292, 241, -137, 233, 285, 91, 77, 91, -59, -1, -190, -265, -212, 96, 230, 289, -86, 70, -109, -172, -24, 86, -37, -59, -210, -153, 54, -211, -305, -42, 100, -113, 267, -91, -159, -7, 224, -25]
5484b5Rj3k4Mn4L41l80nM63m64P6j28J16J62j30n24N90J54k36J60k39J61O7j32
5508e1j26L42l54J91rJ01k19J88k1j27J47P1j45q8k0N5L4j3N7j71J67K46r0l36
5532a71K92J01j4k78J81J39j39j96K12J11k49J17k8k57M5o6MJ29k44N58l45P7
5554b1R6j16n8K51m4n5Q8Rj50L1K46m08k21J56K51pR8j80m4j63L49n0k74K02L65
5579C51k60j38J21k8J04k90K76P4m96M08k22J15L42o11K25k07P4P4j0k6K49j00
5601B5j38K48J49k84j21RL01k33n5K56j82JPj00N8k22J21k0L13k18j6L6J25j62
5625a02N0oL96k94j24K36J05l09l1M29m11L8K36k40j3j26J14J71m9lk18J88M2
5648G9j41K47j50J75k30J37k21N9L51j18p8k08P1R2j36K3J25K8j7N0k36K35j00
$$ y = [-25, -16, -29, -53, -49, -103, 238, -142, -147, 316, -148, -72, -200, -84, 78, -52, -576, 14, 168, -68, 92, -147, 14, 81, -51, -177, 165, -189, 2, -7, 94, -125, 63, 42, -85, 62, 133, -12, -100, -120, -65, -31, -44, 13, -158, 9, 255, 165, -171, 121, 222, 208, -70, 111, 250, 111, -85, 127, 238, -11, 106, 78, -179, -134, -200, -196, -67, -311, 247, -98, -21, 75, -41, -99, 152, 108, 53, 141, 150, 0, 31, 277, -131, -352, -196, 55, 48, 146, -34, -78, -241, 108, 58, -216, -14, 351, 91, -47, 74, 46, 150, -140, 136, 210, -286, 122, -100, 15, 357, -254, -29, -236, -162, -88, -98, -124, 125, 25, -113, 135, 284, 0, -121, -112, 189, -44, -99, 157, -25, -24, -17, -117, -59, -281, -160, -180, 133, -85, -101, -65, 60, -102, -52, -58, 338, 44, -80, 156, 261, -48, -79, 350, -61, -23, 213, -27, -40, -166, -52, 119, 70, 67, -151, 37, 79, -62, 185, 35, 210, -20, 117, -104, -45, 306, 188, 110, -98, -27, 65, -71, -48, 77, 105, 88, 138, -98, 137, 37]
5671C7l1j78J99j17J95j94j33P3K11r5J39k82K14k06M4l1L00J20j25j71j12K19
5693G6L0n8k08J29q8O6J71P6j10J4r9P5j7J86l7j98J9J2k62L35r5o1l3j25L62
5718A60l1j77J14j19J16q5R4j8J49N8m03M81m76M1J13k53J17k3J97J60j46j21
5740e2J81J22k66O6L2k32J64R2M1k09P5k34K84j16l9K52N4l17R3J10p7j29P7o
5764c4J14J01j72j51K50k33J41J51l51J64j18J66l5j78M45m37l8K72Q7qkk73J89
5787E0JJ56J51k62J30m46O7K57j80l6K38j48K4K43k46k86L66l8k65L71j15k16
5809a84K05R3j00j65p3n3M80o8j21J83l35J21J06m32M15o3n7R5j28J65J12l08
5831a12k2L0K39m14K73j58J13k0j52M38n4j53j87K29j64N5Q1j45Q1K12k88J39
$$ y = [37, 6, -172, 27, -90, 105, -89, -222, -149, 62, -33, 106, -176, 38, -168, -124, -155, 145, 265, 140, -31, -143, 76, 106, 48, -160, -31, -119, -53, 118, 194, 84, 98, -1, 74, 57, 243, 206, 8, 27, 39, -223, 112, 17, -44, -77, -202, 160, 129, -48, 66, -53, 63, -22, 72, 54, 203, 261, -142, 339, -137, -96, 17, -236, -119, -142, 55, 215, 69, -52, 129, 251, -15, 51, 83, -149, 15, 107, 148, -61, 14, -220, 64, -52, -91, 161, 215, -102, -9, 101, 24, -105, -28, -34, 80, 181, 9, -142, 108, -125, 16, 167, -184, -20, -138, 28, -7, -185, 260, -177, -215, 57, 144, 136, 134, -139, 50, 51, 207, 358, 96, 226, -220, -153, 104, -76, -112, 126, -22, 2, 245, -1, -287, 79, 41, -224, 147, 32, -184, 21, 114, 14, -151, -224, -277, 203, 135, 14, 197, -138, -17, 89, -343, 72, 9, -48, 47, -81, 84, 196, -112, -134, -104, 135, -279, -6, -164, -51, -71, -223, 215, 161, 8, -179, 50, -114, -59, 22, -123, -42, 170, -118, 21]
5853B1j04j31j09K54LJ9K67m27J35J31l89N65l01M59l09j07J43l33q3L21J40L3
5875A98j18J14O2j50Q6k75J22l1r1k65M60j11J19k80Q3M5l4j32K39k39J92j28
5897a34L91k1m19Q1L6L23k24J90j13j5Q1l55K65L45n80M19j84j56j07J76k16J45
5919g2K41j25P9m00L73k51J1L14j88q5K69j92J41k92K97l11J90r7R3L9p8j5J27
5942F8J76j68j44q7j09L10j40l1J4o3M29k12M0j80J53k8K6m09K31J34r4K49l62
5965a97K85k52L64k83P3j94J54j83M39j62O5j68k20L38M2l8o0L72l00m30K84n8
5987a29o7M06m63K98j4l73K27M20k91l29RK75n4O0j22J53j11J96j38KK59p6Q4
6010B22j54o6p0J15K21l28J4O0o2m6j13o%J92K6o2M6kl4K28k68k31O15k32j21
$$ y = [21, -83, -214, -323, -69, -66, -47, 220, -207, -72, 59, -330, 235, -66, 393, 84, -23, 120, -213, -296, 25, 165, 198, 80, 194, 256, 106, 192, -83, 39, 8, -83, -348, 112, 1, 120, -160, -77, -32, -66, -198, 41, -198, -6, -134, 257, 236, -183, -102, -66, 257, 33, 223, 110, 95, 176, -179, 86, 431, -149, 270, 86, -70, -177, -1, -217, -72, 169, 44, 123, -277, 96, -155, -144, 170, -18, -103, 166, -26, 115, -177, 120, -191, -1, -98, -5, 34, -44, -59, 68, 244, 76, -68, -155, -264, 46, -94, -125, -111, -174, 255, 43, 83, -97, 56, 28, 54, -355, -124, 10, -84, 165, -197, 88, -164, 200, -83, -10, -204, -50, -233, 206, 44, 109, -59, -279, 59, 101, 63, 3, 375, 75, -355, -71, -129, -196, 210, -253, 45, 31, -342, -115, 305, 14, -315, -306, -31, -85, -25, -147, 6, -105, 91, -47, -45, 214, 138, 222, 68, 2, -68, 47, 268, -60, -46, 14, -48, -94, -207, -213, -213, -21, 5, -57, -11, -13, -47, 181, -87, -318, 297, 65, -56]
6035e6J97R8n06K93j4K12l04J87k08K7L33l08R7j4r6l7L50k83L23l32k36L32j07
6058e2M18j95m77L57J7P1k01K07q4o1j87J86j20J53m7j03R9j91O6K29k45o1K61
6081D0n0l67M98j86L74l91O9p7O4K10k37J03J11k89J61l21M72kj27K6j15J94l04
6104a44K54k31Q6L1P9k68L31j12o9J7j84K29J14k66J24R7o4m2l4K44l33M22k58
6127B3JJ2j30J6pM8KL14l49k3O0M6j46K22R5j69M8j70L15j39j43J19p6l7J56k31
6153a43L16j16k1N4N8k63K19k07K75l06K69k98j3L98l22J41q1q2J7J36l20L29
6175D0m4L9k07K39j04O9j39m8Q1K32k9k79M19j86L5k91K76m6j77J20O3j93L0J52
6199E2o3O9l64J64K57l30K57m4j19O4k6K6P7O0j29m5m2J26j03J77M63m44R8j33
$$ y = [-56, 141, 239, -267, 26, 12, 224, -80, 107, -101, -74, 259, -49, 48, 34, -62, -99, 251, -32, 291, -41, -277, 55, -52, 366, 171, -306, 51, 68, 139, -62, 145, 61, 0, -187, -1, -121, 32, -15, -118, -19, -210, -144, 85, -160, -221, 40, -10, -377, 121, -65, 309, -82, -13, -90, -26, 184, -53, 50, 161, -128, 33, -288, 184, 182, 55, 81, -34, 160, -144, 110, -121, -35, -4, 75, -193, 138, 26, -43, -26, -210, 19, 133, -133, -9, 88, 24, -18, -52, 192, -141, 281, 23, 24, 36, -94, -78, -85, -37, -35, 279, -70, -93, -33, 13, -133, 89, 184, 15, 63, -107, 208, 69, -74, 45, -31, -68, 88, -143, 173, 57, 36, 90, 148, -115, 104, -103, 172, -134, 135, -163, -176, 222, -100, 41, -40, -122, -105, 31, -289, 40, -4, 35, -172, 67, -37, 32, -107, -155, -74, 158, 129, -150, 269, 83, 118, -173, 103, 57, -120, 0, 63, -130, -100, 52, -11, 58, -306, -142, 115, -215, 42, -2, -121, -57, -83, -57, 20, 80, -49, -94, -136, -10, -113, 64, 527, 83, 181, 48]
6223D8P3k5Jon5l0R6Oj54k33K07L38l18j4j05K6J53J7J39j51ml3lj97J56J70L2
6250A34j49mJ98n6k49k00J61J99P1P8j07k45P1N7J00j8K74m96K05O4m5j4q4K44
6274A89j01k16R0o8N4J66j85K25k66K87q5l1ok01J07J05p9J7J25j8Rj39J45o4
6298F0j51l4J05J6L7k46N7J52j93M09r2o7l0QJ57k60J18j26OK92k06K7J80l59
6322a40J59K3m0j24O2K79k73P4K5K54l11k73J08J99k18K97k34%M2J14p4j09j07
6345b67N31j91o0R9o9N1j1l0j60K12P5q9k14q1J80R7j58K46k9P2l34K26k04j07
6369b15J09K6P8J09m25L93j5Ll2l39J80J99k10O6mPLK86k79j62L73j17M3J10j07
6394H0j24M6K82k70k7oj94l4K04J71j19jj19R7J30M4l61K34O5k86P15k51k40k37
$$ y = [48, 121, 96, 97, 91, 36, 6, 102, 108, -46, -279, -72, 266, -52, -66, -171, -145, 8, 25, 164, 13, 9, -24, -27, -224, -68, 102, 134, -15, -19, 179, 123, -126, -326, -165, 34, 105, 183, 76, -169, -98, -41, 59, 41, 315, -181, 24, 88, 43, 29, -55, 189, 88, -128, -38, -106, -52, 114, -71, 154, -112, 175, 90, 59, 53, -148, -41, 64, -15, 2, 127, 109, 118, -21, 124, 60, -91, -125, -20, -4, 33, -213, -156, -4, -197, 212, 120, 53, 23, 31, 188, -72, 46, -80, -74, 218, 12, 39, 219, -140, 19, 42, 2, -122, -60, 219, -54, 20, 45, 299, -12, -285, -177, 22, -196, 101, -133, -133, -91, 23, -51, -160, -267, 264, 73, 13, 112, 43, 94, 83, 53, -107, 105, 180, 91, -123, -204, -24, 73, -85, 161, 132, 204, -130, 96, -108, -215, -106, -80, -2, 107, -318, 75, 60, 63, 31, -308, -128, 71, -139, -73, -77, -70, -67, 219, -60, -222, 151, 34, 77, 187, 80, -44, 2, 284, 14, -13, -19, -213, -247, -43, 128, 9, 8, -111, -14, 116, 160, -201, 33, 98, -188, 527, 276, 36, -201]
6418b01L79j70KJ9N2j06m0Ol3R5j25j24K81J16j73J24J47k62k69L17j36q4M5J73
6442C3m28M97k84K19n7Q6J13l35J06J87j11Q5o5p2K7jQ2k05K19K9k9J77l40K08
6466A41m26L54k8n9j63J29K66l66K94l18J92k63N10j04m86K18O8K07j34k12J71
6487iLK05l08O8r7J0J07K46j96k62L52j02J4l85M04k21J69k4J26P9k17j75j22
6510c35O67m99J05J61K1p5j76J56J57j20m1K18j91j46K1Q5J96l26J89j19J38k45
6532a59J94j40K5J2J25K15k21r7j16J84J56l4m23J63J35r4L2m5p8m0K60j10K6
6555c0j37oO9P1M0J27PP6P4l21J23K1o6k46l7R1Q0K1J32j57L47j63l2j19K08l74
6581b01J00J27l0J82j45J52j14k32L2M01Q4l67n1K25k03J40P7j95J20j68K47k73
$$ y = [-201, 178, 8, 10, 29, 81, -25, -65, -59, -92, 3, -122, -246, 35, 151, -22, 102, 249, -13, -282, 35, -101, -185, -140, 33, -395, 102, -182, 37, -20, 66, 179, -156, -50, 137, 26, 111, 46, -26, 1, 0, 82, -123, 96, 125, 96, 273, -67, 141, -285, 69, 41, -18, -181, -52, 214, -152, 142, -176, 16, -247, 263, 159, -327, -109, -41, 166, 32, -180, -9, -6, 199, -109, -41, -138, -128, -21, 225, 29, -233, 119, 17, 31, -354, 50, -171, -2, -26, 100, 179, -38, -213, -335, 332, -167, -62, 99, 120, 45, -131, 25, 182, 62, 21, 239, 48, -98, -77, 8, 204, -122, 67, -52, 86, -159, 35, -105, -80, -68, 57, 272, 51, -46, -162, 22, 178, 144, -279, -116, 19, -75, -43, -88, -166, -206, 54, -56, -30, -167, -173, -104, -33, 7, 134, 141, 217, 291, -30, 93, 114, 48, -198, -235, -144, -64, -43, 89, -68, 279, 116, 84, -35, 173, -201, -101, 26, -4, 178, 33, 185, 71, -161, -129, 272, 356, -11, -62, 163, -40, 100, 177, -18, 102, -66, 181, -92]
6603i2O7j05L23m3j61j70K0l2J00K04j98J67j48J76j81K22j7j71J92or8p0R7l1
6627D5qJ31l81J96O6J1j00Q6J18o1r7j33L14k62OJ68k50R9K1j36O1j51K61r8N5
6652c9j5j0K7L91n92K61j65P8J94j41N2k72J65p6J4N5J24J24j82J93L0j60kp0
6676a6J48K59j30k72j4q8K75k6k36K16j57J78j60j35q8N05k89J19q0j8P7Q7k04
6699d9j73M03m21K80m5j96L11J65l40J08P3jJ24k97n8P1mj56M55l76L47l46j16
6722b41M05l99N07k05k10J44l73L98P2M17n52o7K18L7j19k0q2QK26j57N5n2Q1
6745I1k29O9J12Lo8J47j71j9J54j49r3K17k5n3L7j12M8J6Q3j18k5M33k73j19J85
6770A41m06L73k13J7N3J1j64J8L33k59J43j05J56m30J24J97N6M3r4k17J64j18
$$ y = [-92, -25, -130, 193, 150, -11, -181, -161, -193, -93, 111, -87, 80, -68, 108, -73, 149, 132, -39, 153, 147, 49, -21, 76, 45, 37, 168, -213, -17, 49, 60, -40, 46, 164, 103, 6, -127, 187, -75, -69, 99, -151, -52, -31, -167, -106, -257, 4, -94, -39, -54, -64, -37, 354, -238, 23, -142, -64, 130, -11, 41, -231, -66, -142, -128, -73, 51, 175, -7, 186, 216, 56, 54, -16, 132, 391, 261, -11, -25, -113, 162, 136, -100, 116, -41, 137, -23, -158, -246, 259, -30, 89, 9, -9, 68, 155, -49, -222, 181, -240, 40, -5, -201, 110, 275, -65, 43, 116, 115, 239, -58, -116, -45, -49, -205, 250, -126, 221, -125, -241, 164, -235, 272, 67, -143, 1, -372, 26, 98, 515, -37, -104, 114, 151, 32, 12, -70, -62, 164, 7, 62, 10, 91, -138, -69, 43, 46, -22, 125, -46, -65, 89, -60, -153, 64, 39, -14, 23, -89, -41, -25, 58, -60, -85, 348, 75, -44, 141, -265, 108, -105, -88, -35, -24, -188, -170, 163, -96, 47, -58, 98, -332, -208, -11, 45, 88, -6, -223, -59, -177]
6792a77M7J15j4l00O2L61K7k44J9k8K73n13M25n1q9P5J48J34j43k86K4K83k93
6815a45K33j08j52J5L09j68J68o4O5k40J23p5K03k53K67j52j93K54J5L7K87l67
6837E9L3j46N3K19l38K58r7mk09j03K52q6j1K40j85j48K57J04l24K86n2l9K4K2
6861F5K9k25M0J00K4p6M44l13J09k37j84J57J54k5kl20R3L2mL59k04R3j97pk90
6886c85P0M80j51J40k24J95l6j34N7M6j66Q2k15L17O3Q1r2n9j52L01m55K7j7j35
6910c62J98J63J4J76j35o0L6o2r5L17k05k33N1O1M9M0J04P2j71K48k46k9P9o0
6934e0K19j69K39m4j43k73J62k42K33O3j9l4n8J61R1l1L4j16M4j54R2r6%J68P2
6959A49l89J16Q8J92p9J93j54m5ROJ56l74K42k1j51j02N7N63k94k21P1j64L1K87
$$ y = [-177, -130, -15, -29, -329, -267, 94, 121, -123, -104, -132, 141, -372, 53, 2, -87, -12, 136, 270, 127, -159, -135, 148, -145, 88, -20, -172, -157, 152, -16, 152, 88, 153, -87, 36, -39, 164, -89, 178, 26, -167, 87, 102, 139, 426, 59, 92, -54, -1, 218, -120, 138, 41, 37, -172, -275, -23, -109, -120, 120, -65, -213, 44, 148, -176, 110, 58, 19, 43, 65, 94, -131, -91, 9, 33, -43, 401, 88, 197, -40, -224, -67, 87, 62, 60, -260, -167, -135, -139, 220, 16, 109, -88, -95, -385, -315, 165, 14, 154, -70, 125, 89, -45, 12, 58, -108, -26, -241, 76, 139, 220, 128, 69, -83, 218, -237, -210, -227, -362, -164, -1, 13, 189, 54, -6, 30, -32, -127, 190, -15, -248, -197, -136, -87, -47, 57, 129, -42, 206, -40, -69, 10, -50, 169, 0, 239, 195, 52, -221, -59, -301, -68, -5, -24, -58, -116, 45, 136, 105, 139, 23, 67, -87, 5, -91, -91, 77, 149, -240, -124, -36, 156, 77, 270, 116, 71, 80, 86, 242, -132, 110, 89, -62, -164, -107, 456, 162, -59, 12, -152, -121, 166]
6983A66R4m22K88q7l6J96l41K71j87J45j13J47j87K44k83j08K47L6j25r5N3j2
7005a09l8K54j49k01J19J85j56j02J50k8K91l1m46Q2L30q0p5PK38M6k30j9%N8
7029I6Q5j37k2p4N4RK03j15j67L6J44qL1P2j70k95N2M50k03j05M36l33J4qp2o6
7055i3k5j22J01N6p5N09l07J09k09r4L33N0M7l44J38j52K07o3j65M10m92J32K34
7078A85J07l78Q8K9O9k91o3L70k03l2L5j52J76J50l4R8J62m97K19k63L54O2m3
7101A48j67k05K62K48l21L19l67L8PO9M6l15L14r0R9j17L1j53K96j92q6J19J91
7124A74m1r8L27m36M1J24J22m38J4J78K60k37O8P4O2l05J34k43K09J34pk50K35
7147A01m1l2J73k36J79m32R2J86L3Q1j37k03J73J16Q0j68N3J07j30J40k52Q3R5
$$ y = [166, 260, -162, 126, 39, 3, 199, -142, 129, -58, 87, -26, 121, -66, 178, -105, -213, 34, 70, -55, -150, -97, -109, -147, 107, -42, -243, -124, 61, -95, -197, -47, -75, 216, 185, -261, -179, 151, 71, -4, 3, 241, 287, 57, 38, 38, 96, 181, 44, 22, -52, 2, 11, 214, 99, -68, -32, 112, 104, 135, 207, 37, -258, -206, 244, 41, -64, 372, 39, 53, 45, -27, -93, -118, -240, -139, -83, -158, 351, 44, 153, -56, -150, 183, 233, 280, -64, 74, -78, 129, 66, -99, 311, -181, -49, 185, 292, -86, 2, 31, 100, -191, -254, 116, -87, -119, -84, -236, -60, 90, 56, 154, 316, -181, 38, -225, 129, 191, 148, -19, -224, 38, 286, -35, 284, -83, -45, -38, 31, 77, -238, 76, -14, 85, -32, -1, -154, 142, -50, -136, -17, 174, 133, 35, 362, -74, -33, 91, 213, -225, -211, -33, 227, -10, 58, 132, 194, -111, 23, -220, -11, 123, 116, -134, 101, 60, 28, 201, -35, 144, -288, -196, -10, 23, 104, -33, -236, -63, 53, 133, -35, 18, 125, -5, 135, -117, -34, 61]
7170F1L7j01J23J5j84J38KJ26k42P7Q3O0l82j55M64r0k47L21k09J47k35L64n91
7193d18L58K26n78M06k95J01K8J63J84j6k8j80J45j53j9R2O1j17J56l32J95L9
7215A8Rq0k20K65K4J94j03l20K01J56o2j89J63M0k21J85p7N7lk42J94Np1K71q5
7240A09k05Q7J26L5j53J52j20L27k08k56N3R3K7L5l5r1k20L47K2l7J05k45J36
7263H4k86J35K71k21k3L06k00M8k49k2K29j62J14P3l93k1L52j75L50j46k70L62
7285A56j12k1Q6j65J56j66k4J64j88L30J58k69k0j41j30L72j15O0j33P9j10m1
7307g4P5k34M37p6l53O1R4O4J34n9j03M4m3q2J50r5Q8J4k48J63Q2k02K87M4L3
7332B01o8j28J15m8j28oJ95p2o6q0p1L14M1k78J13j59j38M76k40j62J28j30L20
$$ y = [61, 98, -3, 120, 135, -49, 89, 91, 217, -25, 52, 135, 195, -187, -342, 122, 32, -215, 106, -103, 44, -191, 173, -418, -60, 166, -412, -6, -301, -200, -172, -9, 175, 159, 131, -49, 96, -57, -76, 16, 77, -40, 116, -216, -21, 18, 27, -53, -273, -8, 16, 210, 107, -213, -12, 144, 82, -107, 56, 96, -125, 60, -17, 40, 37, -205, -11, -6, -77, 194, 109, -96, -9, 117, 152, -1, 151, 31, 358, 150, -106, -53, 40, 67, 102, 67, -24, -244, 103, 125, 88, 193, -52, 84, -202, -67, 204, -17, -40, 266, 66, 114, -135, -157, 72, -90, 24, 97, -296, -317, 35, -140, 210, 64, -206, 156, 44, 23, 109, -56, 100, -66, -90, 74, -114, 216, 374, 105, 85, -56, -186, 186, 71, 131, -2, 77, -33, -74, 1, -233, 204, 128, -225, -164, -70, -6, 128, 69, -34, 10, -33, -115, 35, -60, 28, 42, -206, -43, 39, -163, 124, 168, 201, 133, 5, 120, 72, -56, -62, 133, 61, -5, -85, -156, 158, 199, -79, 34, -125, -263, 213, -27, -189, -61, -191, 129]
7355A29k10J41k01L95k05R7J4q8K25m29J65J9J59k26j99J79j61J70K9r2J43q0
7377b6j25K03j58p1J26L46n6j57j63r7J04J48n2J7J36j23M6j85P2M0N7L2j26J90
7401A78N5j90j10N3J23J06l46P8Q5k4q5J77r5j46J96k34Q3p9p2J62K07j77k08
7424b63K70nl17K56q6J07J93J25m47j6K63K14k22j44M3l8J86j16k9K71l51p8K76
7447I2m1J58l51M8J52j30r6M51k72J68j52l8J10k3l20K53K11j28j25j13J51k72
7469b67L60k95J98n3O1k07L50j70Lk16K32o9L60n17J12J23q2q5K7J84k25M52m94
7492b18K31J3j13j47J11J11j44J99L04n18RK03J8l30R8O8K06j73L1l5J74j4r7
7515a3j95N52k30o8j24j06J48K5k1Q3P0j38J38k15q1L11j98J73k52K57j07l9j45
$$ y = [129, -81, 60, -141, 254, 49, 146, 160, 72, 297, -132, 33, 52, 211, -15, -214, -35, -196, -26, 3, -89, 54, -26, -151, 52, -106, -177, -51, 295, 239, 82, -81, -178, -74, 74, 22, 39, 175, 52, 98, -87, -15, 25, 82, 114, -12, 178, 233, 43, -67, -14, 109, 215, -131, -53, 32, 8, -77, 100, 5, -141, 55, -179, -96, -175, -247, -85, 122, -55, -263, 7, 2, -315, -59, -145, -38, 155, 280, -167, -183, 80, 294, 72, -72, -29, -67, 119, 3, -26, 245, -106, -184, 92, 51, 209, -142, -94, 58, -72, -168, 283, 11, 179, 27, -11, 99, 76, -244, 9, 220, 92, -33, -146, 5, -267, 93, -202, -4, -57, 4, -203, 147, -23, -20, -236, -4, -73, 287, -230, -118, 5, -77, -162, -135, 49, -176, 276, -218, 13, 26, -87, -234, -123, -12, -156, 43, 347, -171, -162, 41, 59, -271, -173, -105, 101, -72, -41, -76, 98, 84, -13, -208, 344, 114, 46, -78, -184, -36, -11, -32, 51, 121, -17, 121, -94, -175, 136, -62, 111, -141, 116, 9, -30, -175]
7538a75K45j78K15q5j60L47j48j62J40J67m78J22K82k50J03j3j49K36j58L60j71
7559I0o5K68n55M6M12k45j08J07L4K06l43J56J93l34K34l66M00k76K16j2l12K96
7581D2l90K37J14J21J1j10K6k1J47j92J65j38l02O5M50l8l66K8K54o0Q5pm37M13
7605I7L8K1j05j61P5j66K0K90n9K65l18J54p5o7J5Lm0J7Kl6J28k12J06Ll14J08
7631b11k7R2J17N8J00N7k27K0k55J79K29l17J3K60k39l0J3O7K10r4P0j35J72J12
7655B34jk68n5r0Q5J73k28J74q6K43j02j99j15J74L0L30r9r0M0j31k4k08L37j02
7679B2p9n0O6L11m21R3n9K00j6j24k11K62j01L96k79j93J62K4m26L50n8K15J4
7702I8k50O2J1J22j45J05nm4J95l13M6O2j0J39j57R2k19J00L37j31J73n64J21
$$ y = [-175, 70, -108, 107, 22, -138, 209, 61, -101, 39, 206, -272, -150, 132, -118, -15, -28, -177, 59, -99, 261, 90, 25, 293, -262, -216, 196, -49, -157, -50, -16, 190, -153, 3, 196, -138, 96, -270, 130, -146, 70, 58, -254, 42, -348, -111, 3, 124, 135, 25, 51, 30, 177, -15, 150, 12, -290, -225, 225, 187, -179, -151, 103, 43, 128, 121, -316, 97, 135, 156, 51, -110, -35, -201, -181, 109, 50, 315, -3, 151, 76, 9, 24, 27, -13, 4, 6, -30, 98, -114, -8, -5, -319, -211, -238, -146, -29, 29, 129, 186, -41, -21, -276, -97, 132, -185, -172, 88, -151, -181, -168, -101, 109, 15, 85, -50, 122, 234, 233, -35, -90, -180, -95, 78, -150, 24, -62, 181, 79, -120, -235, -61, -31, 299, 200, 110, 150, 19, -5, -213, 124, 22, -57, -107, -41, 270, -151, -58, -117, 83, 67, -57, -268, -6, -107, 289, 10, -183, -21, 3, -423, -73, -131, 84, 98, -152, -90, -79, 43, -102, 3, -2, -46, 149, -164, -118, -56, -66, 73, -84, 8, -211, -111, 226, 95, 268, -296, -175]
7725a75J21K1R2J39q1k83J32k24L18J69j59J20j30k89M50k12J61n6RLr2k15l0
7748b11j33K70J03k62L51k3n3j50M24j93p5p7K2j30J68k9K4p4J01l9M0j41P1K94
7772B78k16O0m1o7J41L3l11Q2LK47l18L03k87L56q8j65m3p1j17J25N6P3n4j74
7796a95N84m99J16j70J79l08K21K02M0l45J73J7K38o6n18L39j36J38j64J36N2
7817C4j80Jo3K1K12k81L66k15J41j52j0N4j57M80l21M0R6n8q6K26Rj90J89Qj13
7842E1o1j09j33L22r4j29K53m3j82J81R4o0k7k85L58l68M79l41K88r5j32r3R5
7865c1r9J34J01m6K2j55J75k00J48j9O9O0q4r7o0K32l0j39n2M7J6j2Q8j56J80
7890I2k7j10N9MK20k14j88N8L38j95J48l54K58m6l89L60K34o0J25l63J63J0j20
$$ y = [-175, -54, -33, 59, 198, 117, -166, -34, -258, 60, 229, 70, 190, 60, -229, 221, 9, 170, 114, 123, 126, 34, -181, -211, -344, -74, 29, -233, 118, 95, 42, -108, 316, 123, 48, -29, -7, -137, 31, 2, 26, -48, 53, 14, 54, -87, -16, 278, 62, 122, 81, 14, 155, 188, -123, -41, -38, 209, -109, 194, -93, 263, 175, 10, -33, -104, -221, -96, -40, 33, -21, -195, 389, -110, 6, -164, 15, -293, -72, 130, 170, -175, -2, 15, 253, 187, -331, 8, -128, 10, -154, -18, 34, -146, -145, -208, -187, 25, -256, 110, -105, 36, -116, -126, -72, -229, 251, -70, -30, 66, 8, -78, 148, 157, -33, 156, 164, 51, -10, -119, -252, 70, -24, -153, 100, 57, -125, 56, 150, 90, 63, -222, 136, -232, 247, -94, 194, 99, -33, -126, -31, -130, 4, 105, 59, 81, -74, 101, -99, 49, 30, 99, 159, 75, -22, -82, 150, 120, -19, -71, -24, -8, -20, 68, -88, 92, 65, -45, 14, 18, 238, 24, -164, -106, 232, 37, 185, -169, 89, 43, -346, 14, 248, 188, 313, -50, 113, 123, 3]
7913Ck67J86J59J0o6Q2k7J04o3j90j28J85k50j04k7N94n3Jr1N0J58l86L31k79
7937f8L6j8M6j74j13M85j77n7P7q2j68J31K20J5j46J53m38K83J93j89j27M1p3
7960a50L0K8n3l5N1k5K29L5k21J64p2p1K47k41n1k64L58J45k16J71M0j15P9j64
7984a01L09j63Nq8J97l14l4O8J33O4Nk95K22l03L02R9j52K96k36KR9R2k15j8j10
8009a36K71m24L90J25l06J25l19L73j81o6L07k48j05J29q6r8K67K34n18L73j2
8030I5jk43M31l19K69k41m4J39J1j72L79j90j36J2o8O3J00M9k80l2J10n5J6J44
8054C7l64J89J73j94j04M23k56q0J47L33k10J56j41j88L2K96l42K62j14J25j83
8075cmR9N2j50K52n44L07k36K50O8r2M7k26J13k99L41j32L32k48K70m9j92J18
$$ y = [3, -264, -78, 81, 91, 25, 107, 80, 184, 121, -69, -197, -12, -262, -366, -393, 201, 148, 149, 58, 108, 266, -120, 211, -68, -32, -50, -4, -178, -291, 194, 17, -40, 37, -45, -213, -82, 138, 153, 7, 160, -278, 5, 198, 9, -118, -77, -150, -120, -92, -145, -180, -129, -154, 75, 110, -111, 53, -19, -90, 157, -84, -135, -399, -41, 104, -112, 59, 99, -16, 63, -101, 208, 45, 50, -38, 159, -155, -189, -121, 12, 76, 81, -214, 8, -295, 7, 106, -46, 250, 14, 16, 115, 207, -8, -26, -136, 135, -289, 101, 226, -80, 45, -274, 99, -82, -148, 159, -89, -194, -65, -151, -249, 18, 252, -266, 107, 95, 94, -149, 282, -37, 232, -9, -53, 86, 97, -75, 304, 114, -22, -10, -78, -15, 85, 134, -146, -178, -68, -123, -107, 37, -327, -138, 35, -159, -263, 160, -96, -176, -29, 304, 94, 250, 109, -79, -47, 249, -93, 169, 55, 180, -3, -7, 92, 144, -6, 246, -298, 9, -227, 23, 91, -1, 46, -180, -67, -366, -25, -157, 175, -73, 197, 148, -44, 74]
8098G4NJ56l21K74m08O9K32J80l65o6J74M1j17K06j84o8J22Q6j27Ml19K30J61
8121C9p3J80k86O6K02k18l45K59R9kRJ85M0q8k67J17J4K11Ql20j53L22k0RJ38
8146A26r8J94k59J63k9mj51J06p7N3J18m32R0K04J9j24J53Jo6J62j75l3K12j48
8170EJ28q4n7J40m84J49p4J58K50j08J55j67j09J34j44K97k19j15P8K24j66
$$ y = [74, 79, 235, -86, 188, -220, -151, 81, 261, -104, -170, 4, 45, -72, 134, -50, -118, 4, 90, -37, -33, -352, -122, 39, -34, 146, -140, -74, 128, -90, -435, -176, -77, -79, -70, 115, 155, 67, -200, -83, -69, 142, 150, -170, -323, -1, -21, -12, 126, 28, 222, -37, 126, 97, 93, -58, 48, -29, 24, 142, -290, -200, 4, 23, -101, 52, 53, -13, 149, -26, -59, 153, 5, 133, 49, -8, 132, -352, -203, -277, -119, 131, 23, 178, 11, -98, 36, -108, 189, -30, -145, -67, 157, -9]
8191i
$$ Imaginary data points
##PAGE= N=2
##DATA TABLE= (X++(I..I)), XYDATA
0@%%%%%%%%%%Qj6J6j6K4l2L2m0N6o9P7r0J14j36J59j83K09k48K87l28L76m31M92
33B61n56O30p10P98q95J000j116J245j386J538j705J885k081K297k534K795l079
50a613L391l735M114m537N011n545O150o839P634q567R678j1028J2710j4872J7767
65I719k1869K8173l9222O4183k26695O852K83263k08920m946J34695L078m0026
77a1715J22731j7254n6151N5343J7892j03007J7823L5275o5749k7722N4612m4044
89b1966m8784L9709J3169n3127L222L2381J5856J2360L003n91L8644J5766k0726
102B8916K2577L1373m9733m1892K6623L22l8806k514r10k0986J2874J6661j8431
115c3926J6050L8166k3100k6611M2839K5251l2173r055J5984o568M09J7298j3587
$$ y = [0, 0, 0, 0, 0, 0, 0, 0, 0, 0, 0, 8, -8, 8, -8, 16, -16, 16, -24, 32, -37, 40, -50, 64, -72, 87, -96, 113, -135, 152, -176, 200, -231, 261, -295, 335, -375, 423, -472, 528, -588, 657, -729, 809, -896, 989, -1092, 1205, -1329, 1466, -1613, 1778, -1957, 2157, -2380, 2631, -2914, 3236, -3603, 4031, -4536, 5142, -5886, 6824, -8048, 9719, -12150, 16023, -23199, 40984, -185711, -178859, 104404, -104516, -109462, 25233, 28311, -11715, 111016, 93762, 37611, 92954, 110846, 7839, 25662, 60937, -4812, -32534, 22078, -21966, -70750, -31041, -17872, -70999, -67777, -35396, -19540, -7180, -4177, -4768, 33876, 49642, 28916, 51493, 82866, 33133, -8759, 17864, 18186, -20620, -23134, -24044, -45030, -32156, -15495, -33926, -17876, 20290, -2810, -29421, 13418, 38669, 6496, -2559, 13425, 6857, 7266, 24564, 10977]
128A0977k5403R566J6490j0518j3651L24J571K205L478j474N57Q464P965k196
142H355m412L937M525o228o072K080m439r413N385Q282r277p122J1119P264l730
157B54R12K191l583K957O571m326n449L426J225l381l89j545k556K502r3o606
173g890j30O828Q83m699O86N488M467j185m129J700N848k256n669J487J603m305
189a273m91K992k316k300K188o99j173K464q07k738K967L279l315k82M550Kk288
206G60K568K05m130J062K473l200l397K312J644q51j44j181J001K841Kl382J90
223a227K757j155k666J010J651j29m79N65Q67M65j70j180l75N48n47r35k61LL74
242h84M32M25j66P98R10q44n22m39Q26m45j613k93J465R33r26k14J446Q91j155
$$ y = [10977, -14426, -4860, 11630, 1112, -12539, -12215, -10644, -8439, -4961, -6435, -5878, 2586, 10551, 8355, 3943, 7880, 12405, 6177, 105, 2185, -2254, -11667, -6282, 2000, -7277, -14399, -3280, 3984, 254, 1166, 3357, -226, 2731, 9302, 4976, -473, 2953, 4178, 797, 408, -1137, -3693, -1191, -1284, -7890, -8020, -1192, -309, -5008, -4322, 1166, 5633, 4448, 319, 2019, 7867, 5611, -58, 1429, 3032, -1273, -1764, 1228, -1088, -3388, -1200, -1899, -3072, -608, -1415, -4153, -1186, 2093, -1222, -1504, 3046, 3048, 760, 3328, 3533, -597, 465, 2938, -262, -3659, -1347, 297, -554, -698, -1879, -878, 1963, 1965, -1417, -1227, 1530, 375, -2291, -1281, 370, 241, -238, 327, 1194, 1659, 1489, 309, -66, 482, -65, -1000, -1261, -1258, -884, -452, -27, -193, 605, 1515, 671, 149, -290, 536, 91, -1522, -1815, -350, 583, -343, -557, 889, 1780, 625]
261F25r51N45L51q84q87K84L88O03j45m3P83O83l11l48m46l79n26N2j57p69M84
282a048J045k66k46P38J342l63j034MM40k85p65m10P46M33n45k08J67O04j27r26
302g04K27M88l59q73K66R75j69J46N27L98p1J93J05q68l71N4k90l75k94j02M37
323f60J39k21J04P30M48m41n8M92N19r65j29M45J30l73l39J74M07m95m56L2j31
344f48J47l23k14N66L00J58N52J17k7K73R4n97j46L05J13o24l82k11J17n3n49
365a032M31K75P4o0RL67O2M5K6K78L32l22p6j03R9k38n29J06j39k35j03O8J83
388d82K66J0K04J20k14M37K31m38K25j9K34k51k97m2L0J95p62k50L06J43j81J08
410d27n2Q24k60k8M92o5o5j87J09j89k09Ll47K53l9l85K38J05J50rP0K04j33P6
$$ y = [625, -326, 219, 570, -314, -1201, -917, -529, 74, -71, -114, 669, 1352, 1041, 693, 247, -132, -658, -606, -763, -1532, -1048, -3, -269, -515, 223, 1565, 1202, 168, 172, 612, 327, -438, -848, -102, 331, -214, -422, -255, 349, 222, -704, -477, 11, -348, -1221, -955, 20, -149, -3, 524, 922, 851, 1044, 1149, 281, -90, -36, -326, -701, -995, -1097, -660, -521, -742, -638, 92, 540, 99, 41, 533, 1052, 87, -42, 403, 533, 160, -179, -5, 402, -93, -549, -517, -648, -501, -824, -1038, -472, -172, -14, 538, 655, 628, 901, 995, 398, 252, 557, 670, 46, -336, -547, -430, -483, -1032, -601, -326, -252, -312, -303, 64, 126, 171, 197, 475, 807, 485, 409, 306, 405, 167, -362, -256, -395, -630, -733, -665, -482, -216, -206, -2, 118, -96, 341, 572, 134, 359, 340, 574, 323, 26, -16, 14, 209, -553, -803, -497, -354, -535, -427, -479, 345, 85, 57, 549, 484, 419, 232, 341, 152, -57, -54, -401, -148, -187, -572, -334, -229, -79, -88, -18, 186, 53, 129]
434A29J28K06k73l20P09k57l28J42k02L11m48j26O8o4m6k0R1M08j70K1J66M69
456E94m70R1J89j42j2o54K20Q7j37k53M58J8l03K39K23m58J50L51R8l07M0J41
478A63j82R2n6K70j25p8j77k20K92J71l93j38m1K89K19k25JJ62j79L69n0J58k47
501G5N7j53R6l0j97K58kl30J19J46k53J32j53L15NK5J37j53r7j42J52K58K9r7
525A97k44k7J17j53j92o7N42l12k3J96K3Q3m3nj11oM1J51j80K5k20K90j36k27
549b81J08L18k21L7J0J9J4L1Q2j80J07J13j14p3J68l02l6J59K94j30o4J96j41
572A14j65m4K96m94J44L50k60j16q3K90k65J92Q2K47j46j75j46P4K63k55J48j06
594e5K32j29j94M70k12q0j07J39n5j13l3l0J14J93l13L66k89J10K29R7l15o8J20
$$ y = [129, 257, 463, 190, -130, 579, 322, -6, 136, -66, 245, -203, -329, -261, -325, -371, -391, -300, 108, -62, -41, 125, 594, 124, 215, 404, 262, 250, -404, -184, -97, -234, -487, -29, -11, -314, -75, 148, -310, -160, 191, 289, -18, 22, 163, -19, 73, 17, 287, 162, 84, -93, -313, -21, 150, -243, -381, -422, -133, 86, -139, -138, 24, -155, 214, 164, 322, 75, 132, -21, 75, 45, -152, 106, 104, -226, -107, 39, -214, -82, -235, 80, 85, 110, 247, 94, -3, -145, 7, 265, 294, 197, -47, -74, 43, -110, -302, -369, 173, -139, -162, 34, 57, 140, 97, 92, -19, -25, 16, 167, -13, 12, -208, 82, -54, -281, -173, 145, -76, -39, -29, -10, 4, 35, 117, -63, 44, 157, 43, -30, 138, -164, -200, -41, 253, 123, 59, 255, 114, -51, -95, 201, -293, -149, 201, -59, -175, -258, 32, -233, -41, 41, 288, 142, -33, -179, -105, 158, -97, 51, -55, 177, 48, -146, 324, 112, 32, -75, 64, 9, -104, -137, -167, -53, 140, -173, 193, -96, 14, 243, 340, 25, -43, 77]
617G7j87J05O1k54K98J07o9k02J95L8m5k99M07j56k22K09N6l06J79J58l85J37
639i8P6r8L3j49l2K66J51j01j81J66o0j39M2K10M7o9Q5n0K4l29J66O8p8N4j60
664a56J40K1K04k03J86l45L8L97l29JJ77Q4k00M4p3n5j88J81K8J18j45J14l7J7
688A9J33k23K55l40L09o1J3N2l44L64j05J3M4j7k20rJ93l4N7j48k38K52J59j7
712A07j55j15L59L3k75j48J85j73M2J08n6N9k0L7k0L5j1J7l7l4J05J9N3k56K78
737A37j85l0J66j12N7j67Kl5M5L27m80J74n1K12kj03K76o7oJ29k63j19M51m24
761f8Q8O1k45K49j15K85m8l50J68O5j19r3J46j69K76j85K2j28o6K94k75K80k68
784a95J60m7L35l00j25K50Ok25R9j40K02K63j64l38L39j56oR2K66l23J68O7j97
$$ y = [77, -110, -5, 56, -198, 100, 207, 138, -64, 131, 169, 124, -175, 232, 76, -146, 63, 119, -187, -8, 150, -235, -98, -22, -120, -87, -236, -268, -2, 149, 48, -133, 33, -27, -166, -124, 86, 133, 64, 149, 99, 123, -206, -40, 28, -50, 4, -156, -16, 5, 209, 6, 192, -153, -115, 282, -47, -46, 131, 215, 15, 59, -14, -69, -257, -76, -48, 70, -75, 39, 2, 19, 152, -71, 184, -156, 153, 92, 105, 157, -187, 177, 72, 85, 129, 112, -108, -117, 76, 42, 99, -49, -287, -35, 124, 107, -48, -163, 196, 229, -46, -194, -9, -182, -140, -32, -88, -29, -49, -12, -32, 3, -8, 9, -28, -62, 43, 62, 115, -141, 137, -48, -78, 88, -24, 33, -134, -132, -167, -122, 205, -275, -101, -152, 60, 58, -45, 231, 164, 158, 287, 24, -95, 356, -68, 20, 81, -164, 85, -30, 255, 207, -143, 25, 90, -29, -122, 24, -145, 131, -54, -32, -160, -226, 68, -207, 73, -195, -35, -82, 253, -47, -172, 78, 84, -141, -42, -182, 20, 283, 119, -219, 120, -36, -42, 50, 316, -7, 161, 228, 31]
807C1k21K8L38l43R5J34j9L5J44k95p8Q4K99o42L27m6P0J02J52l61J47K56n16
830b79M72r6r1K2k2Jo8M4j03K45j61J25k96J67K24o8O2j64K1j0J42L4o6k37o6
855a68J72N3k1N0k8j29j54L79k13K7J75l54J78qj21p1J83K73l65rK00L03m51K70
879A71k22jJ37r7P7k66K59j48J66k77K9K08J2N0N4J47j73j80j48K55L1k70M60
902B74j11l9j03M8j21R8j38R4J60j41jl1P1j59J10p4K2J56m4j55k6L8j73J88O
927e1J1P6n7k5K6j3j06J23O8lj21j45K62q6J18l17M51l47M42l76K81l15J90l28
951b42M88l32j34M05m40L60n5j05J29L0J06l05Q4Q1k30M07j24Q2l79K23Q9j09
973B9r9O7l7k24L57O0l71K32J70k77j10M01k55J79l4jL3m69L49o0k6M1l4K97k48
$$ y = [31, -190, -162, 176, -167, -72, 62, 43, 78, 222, -73, -151, -67, 232, -410, -83, -129, -59, 43, 195, -166, -19, 237, -279, 193, 97, 6, 28, 6, 7, -61, -17, -120, 125, -36, 89, -207, -40, 184, 116, 178, 14, 35, 25, 167, 201, 135, -102, -168, 4, 57, 36, 86, 58, -71, -225, 154, -59, -32, 143, -211, -33, -41, -162, -233, -50, 223, -142, -151, 49, 352, -99, 171, -51, -52, 85, -12, 65, -201, 58, -90, 76, -201, -172, 36, 48, 98, 152, 299, 126, -54, -202, 53, 84, -186, 274, 163, 124, 21, 69, -52, 46, -92, 2, 162, 21, 20, -11, 60, -99, 11, -63, -41, 115, 71, -84, -110, -72, -245, -57, -51, -40, 36, -21, -46, -20, -33, -139, -16, 52, 49, -72, -217, 45, -41, 77, -240, 211, -136, 306, -70, 211, -104, 86, -242, 246, -86, -220, 185, -255, 105, 50, -55, 74, 104, 210, -95, -11, 70, -160, 247, 123, 205, -174, 49, 138, 29, -70, -3, -40, -264, 93, 153, -218, 14, 184, -93, -203, 198, -57, 122, 88, 87, 120, -349, 0, -60, -86, -45, -79, 218, -30]
998c0R5l2J74j03k6Oj48L37l31J57p2K57n41L87k70J28K53k00J71k29k43L09k75
1021b26L74j10p8M3N7l30L57j35k6J32J00j60J70j79j3kJ4p7j55P1L68j29k0k24
1045a78k4K65J77k99k8q%L91j70j94L54m01j2m3L38j2L7k35nM6r8M41k80j72J72
1070F2M4o1r9J46k6M6p1k77Q9oK82k26J76pl8K65k67j7NM5k79J46K9j02R0K52
1096B01k17J3q9K69j17k57K23j08j8L39J26k08j37J10l98K71j4O3j3N6j01mp8
1119h8J64mK42k06o7o3J8J30k54j19J85l7N15k60l69L87j24r5J7r2J01K54m44
1142b09l6K72j44N8K7j6J33j88L06j54J5P8k2j21N1l9l3K97k44k55M24n76L82
1165FP8P9k01K17l55J61n7j85Q5qJ62J52j70J22r4j05J86j46qL7n2J70j3j38J15
$$ y = [-30, 65, 33, 207, 104, 78, 84, -64, 273, -58, 99, 27, 284, -257, 130, -140, -12, 241, 41, 212, -17, -260, 49, -226, 148, 38, -40, 3, 60, -270, 87, -48, -74, 58, 158, -2, 168, -11, -24, -26, -12, -89, -244, -173, 195, 66, 46, -178, -202, 63, 240, -59, -87, -95, -95, 296, 126, -68, 286, -115, -127, -170, 168, 156, 193, -42, -47, -1, -99, 342, 62, -110, 62, 106, 45, -54, 92, 66, 112, 41, -236, -147, -153, 129, -97, 79, 72, 34, 299, 32, 15, 20, 65, -214, -68, -39, -141, -51, 201, -16, -3, -92, 177, 60, -197, 26, -82, -100, 239, 365, 157, 20, 130, -268, 3, -11, 52, 39, 95, -6, -10, -88, 76, 72, 314, 108, 41, -22, -4, 126, -128, -247, -62, -99, 416, 156, -213, 174, 50, -45, -28, -120, -19, 235, -209, -245, 27, -117, -59, -32, -48, 85, -103, 203, 49, 64, 142, 120, -1, 50, 11, -22, 275, 31, -224, 200, -376, 6, 84, 163, -38, 179, -176, -15, -72, -257, -172, -180, -18, 134, -36, 86, -8, -113, 73, -73, -81, -44, -96, 74, 61, -77, 38]
1190C8n9l3j7KK08j76L3P3j19R2N5kMK4l83K41q1J74o7o5j95J89J93j48l1K68
1216B18k56J9Q6R6l13K27Qn1j77J10K85m20K37p0k5K93l58L46k79J65K72m24L42
1239C31j98L5l32J68Q8o4k17L42k57j30M31k11l6K02r7j2J01j04j75J25R2j39
1261e7K53k06P9j89L51J2n55L54j13j69J90J69l1n5pJ14J44m24K18j1j69J82j11
1284c1J75m0j16P9l91K31K82j16R4k4j4j53j01R5J1l1J50j86n4J27j23K13J19
1307A96r8j66R7K24k22r3j3p2L10j46j4j31K23l34K37j46Pj27L23j64K64K1r4
1330H2p8l14L35n1J17j91J3j02M3J57K8j4L1j16R8j81J86J41l7k64J31R8Jl05
1354a92J53J38n6j72K58j16M28l80j28K8J52j64N5L4M9j41P6L74k17l19K45n9
$$ y = [38, -21, -54, -71, -69, 139, -37, -4, 69, -50, 42, 97, 95, 99, 123, -260, -19, -100, 74, 7, -58, -253, -64, 129, -19, -50, 218, -38, -19, 67, 163, -150, 77, 85, 34, -143, -33, 252, -168, 69, -1, -26, 267, -91, 255, -24, 141, 413, -11, 331, 133, 168, -164, 4, 92, 28, -189, 153, -104, -234, 197, -14, -50, 152, 55, 43, 144, 40, -135, -10, 82, -57, 196, -10, 69, -120, 231, 243, -312, 42, -71, -240, -50, 119, 88, 33, 26, 140, 284, -140, 78, 67, -102, 80, -31, 144, 104, -12, 67, -324, -93, 189, 73, 167, 143, 129, -24, -125, -30, -19, -50, 100, -86, -140, -13, -136, 77, 196, 98, -68, 29, 253, 31, -62, -75, -147, 163, 17, 3, -128, 95, -239, -2, -148, -141, -268, 55, -109, 155, 176, 82, 4, -310, 25, -26, 91, -100, -87, -189, -146, 11, 39, 25, 56, -60, 38, -143, 43, 184, 147, -117, 14, 112, 113, -192, -39, 99, 43, -129, 129, 13, 441, 61, -67, -39, 113, -51, 4, 38, 87, -54, 22, 396, 179, -140, 105, 46]
1376D6o0L2j03MJ89k84RL52j41K3m4Mj40L39j08k26J24J1L4J55m9m12M44l31m5
1401a77J93p4K25k64mJ68L3k41L23l42K72N4k33J07j76j7J12k8K03m47K46j91
1423b58O4J58J16k15K02N7k96M0R2J27j29n8m6J61J70j3j11j12j39Q3j62M89l33
1446a13K57k66K06K37k14l22K59J22j52j03J04L2Q3m8j74j30J64J18J8j28K15
1467A65j84N7n0Oj7j84J40j08J17J22Kj17P0l8m1K76k27Kj0j44K97r0k34r9L93
1492A04j14J68l03K31Q4j04l2k63K99l8J21l73K83j52R8J98j32j96K88l0m64N47
1514B20l02n3J86J11k80J50K02k10J52j76J32P1k08k1j71J49p0K39k15k55K10
1535a39J0J66j99K40N5j42p7k7K17l98J99q0M2N7k45L52R4k64Q4O9L0j50K3r7
$$ y = [46, -14, 18, -85, -81, 108, -176, -167, 185, 44, 67, 23, 27, -113, 226, 118, -108, 16, 27, 61, 216, 167, -245, 199, -132, -177, 16, -58, 167, -97, -101, 67, 100, -141, 182, -160, 112, 166, -67, 40, -136, -153, -41, -69, 134, -313, -67, -258, -194, -36, 80, -135, 67, 124, -172, -132, -40, 87, -42, -100, -146, 15, 185, 172, 61, -51, -190, -107, -269, 220, -113, 144, -122, 84, 321, 107, -215, 44, 166, 14, -89, 15, 47, 130, 82, -92, -222, -58, 60, 78, -50, 165, -19, 38, -12, -6, -23, -207, -67, -175, -58, 64, 66, -51, 19, -19, -60, 216, -11, -9, -19, -163, 134, 44, -190, -289, 104, -10, 158, -145, 86, 170, 66, 34, -229, 70, 32, 153, -220, 63, -89, 9, 207, 75, -121, 167, 137, -327, 220, -82, -135, 51, 162, -118, 32, 234, 24, 176, 0, 132, 203, -5, -26, -197, -48, -118, 121, -94, -349, -139, -129, 37, -162, 78, 133, -9, -86, -113, 104, -294, -95, -175, -133, -76, -321, 31, 125, -139, -55, 14, 44, -106, -83, -180]
1559a80K47j65J60k25J67j43L1M0j3K02Oj01j68L62J2k66J1L7k25K25LM1M4j95
1583i3j05M79k56j13r5K91k8o7rj64J62M7j58R6K6J20j58j05J78J53l28J27P5
1606G5O5j38J4l30L02K71K5j4l73K84J26l46J76j32j05J27Rj70J99l64O4L05k24
1629a54p4K62J54l66J28j63L88J09k25M2o29M21J68J7k1k35N25l84L00r6J84m98
1651a47J76n6j30M9l7q8J87K55j29k73K66J17j28k71J74K04k68N3L39l74M48l28
1673C9J4k44M68j31m23K73J45j56k00K43rN8%R7j47j89M76n57N16m14K92k37Q8
1696Bj09L03k02J91n61N94k81R3k18n4O8J0K15k32K50k35K56k65J07j30O6n0J10
1719g2P8K7J53j42j59j15kM95L3l93J99q8j95K06n5r4J74j11M0K6k41L76j92R8
$$ y = [-180, 67, -98, 62, -163, 4, -139, -108, -68, -81, 121, 127, 26, -142, 220, 232, -34, -23, 14, -211, 14, 17, 58, 102, -93, -198, 281, 25, -88, -183, 108, 80, 13, 4, -160, 2, 49, -109, -13, 13, 133, -25, -130, 48, 201, -127, 0, 75, 140, 2, 16, -314, -12, 259, 284, 270, -103, 181, 307, -39, 137, 5, -100, 27, 36, -134, 65, -299, -235, 70, -154, -228, 34, 188, -178, -50, -213, 175, 284, 59, 101, -528, -107, 61, 78, 57, -178, 347, -37, 263, 167, 351, -147, 29, -27, -157, -108, -145, -233, -46, 209, 80, -193, 73, 190, 62, -209, -35, 169, -99, -46, 293, -81, 367, 39, 53, -191, 277, 146, -277, -4, 141, -15, -215, 28, 19, 77, 77, 174, 27, -162, 314, -243, 273, -141, 151, -86, 2, -107, 196, -6, 185, -376, 218, -63, 30, -188, -242, -174, -164, 51, -181, 69, -166, 90, -175, -68, -198, -132, -182, -72, 6, 33, 186, 44, -115, -230, -232, 263, 296, -97, 102, 14, -181, 25, -30, -124, 50, -61, -21, 5, -236, 140, -52, 46]
1743D6l20K14M0j38K05q4j7JJ79j78K30r1L9O8j57j60J99j58J92P1j85J57k23
1766g0K96l48p9L9J35NO4j48J03K20k54K27J2k82K2L9M0J65l01L09j27k07J55
1789A5K48j00j29J7P7M6k77K52j96O1k0M00l79j1K0J98j75O0l1O3j97J22O5M1
1813A70L1J46j96k12R0N7j06p4J30R0j8p0K97j61PM5j35l48M22r2J0l8j78J36
1837Cp0J84j89j63K97l04J56L04n79M46k87J88k53K01K11l18J37q8J91j34P1N0
1859E4J63k48J98k7j13k57K02J52j24j32j8K01J47m1k58Nq2J02R4o0K39j28M6
1882A15J25r3l85L06k40J48J37N0r4j0M4l8o2O4Q3k05J28M6j12l0K03o2qp8j33
1907a01J70j15j24J30J28k64K28M9k42K59j06M4Q4j00O8k08j8J63j66LJ88L8l33
$$ y = [46, -274, -60, -20, -158, 47, -37, -54, -53, 126, -52, 178, 87, 126, 194, 37, -123, 76, -82, 110, 181, -4, 153, -70, 226, -122, -201, -162, -27, -22, 42, -106, -3, 217, -37, 190, 202, -80, -58, -19, 21, 186, -115, 194, 67, -140, 15, 263, 163, 34, 51, 128, 174, -103, 149, -47, 14, -6, 394, 15, 4, 24, 222, 47, 107, 76, 139, -58, 64, 129, 170, 201, 347, 151, -61, 29, 86, -20, -94, 36, 126, 108, 38, 335, 174, 181, 226, 91, -257, 165, 73, 83, 45, -133, 3, -67, 117, -72, -235, 62, -242, -86, 218, -361, 85, -202, -14, -267, -66, 145, -173, -36, -124, 67, -67, 4, 54, 217, -31, 167, 140, 27, -230, -28, 124, 0, -132, -150, 51, 198, 157, -101, -96, -178, -76, 18, -42, 197, 69, 115, 240, 147, -238, 68, -172, -24, 113, 163, 69, 59, 103, 65, 3, 67, 150, -55, 73, 119, 7, -23, 180, 118, 110, 32, -101, 69, -46, -170, -40, 88, -176, 52, 101, -141, 118, 12, 56, 140, 40, 108, -100, -118, 45, -121, -118, 70, 108, -225]
1930b25L1K42NJ31j08k30R8Q1j94J18K20k17J9J47rj97j95j3m2L68Q7l55J65L2
1954d1J50M6M6k50K2J06j27J02j64K01Q1k68J43o4Kj62N7J86r0K65p4j34K9m2
1978B0Qo0K71k80J87j52P4l51pM35k44K24l21P2J5J1K56r3j6rk57L10O6j69p0
2003h0QK53O6l43k84N90j93j34K7Q6O8l4p9k24J12J41j05O2O0j04j68M00m80M17
2027F2l2j66L74r2j35j22K81k50K93k27j00K82j49j10k18L37o3n6j95K80K9o2
2049c9J70k5J04l90Qm6J01K86o9k42J01O4J39Q6l03N7j00K6J67K09l14O9l39J58
2073a22q0k0J82J84k16J47n6j96M53m85K74l45q2M84n4J78l16J61J07j05j39Q3
2095C7M3O0p8j37pK25J36l70M4L24k35R5j03p1J89l17M73k08j00J43r1j62R2J21
$$ y = [-225, -194, 48, 53, 184, 76, -154, -56, 25, -169, -51, 169, -48, -29, 118, 109, -88, -283, -296, -338, 30, 117, -238, -73, -41, 109, 155, 201, -49, -27, 79, -48, 54, -110, 91, 172, -96, 47, -17, -15, -177, -120, 66, -24, 241, 167, 33, 62, 20, 28, -32, 239, -41, 146, -6, 68, -283, -290, 145, -99, 125, -196, -124, -109, -98, 158, 65, 49, 40, -217, 93, 159, -10, -80, -72, 181, 247, -96, -380, 210, 17, -117, -90, -4, 64, 30, -49, -273, -161, -20, -125, -63, -3, -107, -275, 125, -355, 62, 30, -136, 238, 146, 11, -111, 170, -80, 213, -14, -114, 168, 19, -91, -309, 28, -35, -91, -286, -6, 23, -39, 131, 106, 210, -180, -172, -218, -117, 169, 100, -142, -41, 23, 162, 248, -55, 2, -98, -72, 95, 304, -10, 59, -280, -122, -202, -222, -40, 144, -72, 75, 19, -177, 276, -209, 65, -280, -362, 122, 68, 246, -70, 91, 198, 93, -46, 37, 80, 140, 62, -75, -82, 143, 279, -91, -47, 277, 42, 137, 34, -37, 152, -165, 308, 100, 0, 143, 52, -110, -18, 103]
2119A03J03j02o3k59K17n2K65m5l15M9J3L84k28j53O3j08N1J24k75k3M37k07J6
2142ej11K14N4l38L70l48L60k97K39j29Jk00M46k43J22l41J43m8j39L87j24J3
2164B6l3J33m8o4o8o4L06k6k47O5K6k20K15k17J13QJ84r2kP9j01K2Q3m8l24J87
2190a07%j2K5r4K39o7l02M21K06p8j60k92J74J78k83K78r0L18j89om9k00Q7J86
2214A83m23L72r0JJ56m70K4K40j83J23M29n10L8k13N17j52J53l39J62p2R4J36
2236A76l20Q3K03j53j1K1k3L6J29k35K56j1l9l34K53Q9k53k49J28M80l90M76l29
2259a7k41M63k53J32k94J07L82m58J57p1M1J86r4j69J17R6O8j57j96J08J07j13
2281i9J0J73j06O1j49KR7p2O4M2K48j10m54K83j62j01L63r9L26l16jJ3j8q8KK50
$$ y = [103, 206, 104, 41, -218, -1, -53, 212, 167, -148, -99, -86, 298, 70, -83, -20, -128, -77, 47, -228, -251, 186, -21, -5, -116, 98, 152, -186, 184, -164, 196, -101, 138, 9, 10, -190, 256, 13, 135, -206, -63, -111, -250, 137, 13, 26, -7, 126, 78, 14, -54, -118, 188, 162, -85, -20, 6, -214, 1, -216, -103, -95, 89, -3, -5, 74, -27, -5, 78, 30, -294, -107, -107, -119, -94, -188, 51, -16, -318, 103, 309, 231, 71, -221, -47, 131, -152, 126, 36, 354, 165, 159, 110, -90, -3, 183, -240, 132, 42, 43, 199, -271, -247, -7, -190, -67, 362, -148, -110, -323, 194, 42, 195, -144, 18, -54, 40, 176, -144, -61, 142, -11, -22, -1, -24, 12, 141, -94, 162, 151, 112, -222, 31, 120, -133, -382, -254, 226, -164, 312, -17, -258, 205, -48, 84, -210, -103, 279, -179, -22, -93, -52, 134, 40, -129, -12, 84, 152, -5, -201, -93, 14, -99, -89, 84, -22, 39, -110, -108, -11, -83, -19, 23, 271, 161, -293, -10, -172, -273, 90, -9, 317, 1, 0, 13, -5, -93, -91, 159]
2307A59k53K24j70l2J27o8l9J71Q4q7j89k05J34J75l1P7m0k05J17j48K11l8L3
2330Gj19J1m0J11k02L77r8r4L69m21K21k58K86m44L63r2J8J26o4J78l66K54k48
2353a25K56j88K9j41j7K37q9J07M3qj37K29k69p5J55r0K87j1k44%K33l9k87K28
2377H4j94J34n5j53J48o2K47k8k27o8j79O55l94J72k21J40j07J57m04O91m79Q0
2399f3J1n4j25J84L31k30R6k58M1J09k24K36m9J4n3l3J96P6j04l26J44K07k21
2422i5L61j4m18J34J23p3j4P2m7j14J69R9j36K07k81N9n3j4K21j27k24J08j5L46
2446B74k0j17j87j11N0L16R6o3j81K7l01J07L23k56J47j54j97L19n4K2k11O9J79
2469G7j05j8K93k38J31n4lk61K45n8k5L3k99K18R1N4n4j05n2L42j06R9J97j36
$$ y = [159, -94, 130, -40, -72, 55, -13, -52, 119, 203, 116, -73, -278, -144, 31, 0, 77, 37, -168, -51, -199, 12, -26, 7, -112, -101, -141, -30, -232, 145, 47, -47, 322, -99, 122, -136, 150, -294, 69, -23, -5, 121, 57, 235, -131, 123, -125, 131, -57, -28, -169, -186, 51, -38, 69, 112, 104, -33, 196, -73, -148, 7, -83, 204, 193, -51, -51, 182, 143, -144, 84, -110, 24, -31, -184, -36, -98, 149, 121, -106, -174, -353, 302, -92, 80, -141, -1, -108, 49, -355, 336, -143, -63, -52, -106, -231, -47, 284, 54, 150, -108, -67, 42, -182, 54, 5, 19, -34, -67, 129, 205, 101, -225, -81, 126, -95, 266, 252, -166, -32, 91, 18, 4, 76, 29, -85, 84, 183, 47, 254, -27, 32, -21, -35, 186, 59, -165, -57, -72, 274, 254, 137, -50, -161, -111, 205, 301, 238, 57, 84, -217, -110, 213, -43, 104, -50, -247, 72, 18, 40, -171, -102, 77, -28, -46, 247, 9, 140, 86, 83, -178, 67, 9, -16, 17, -282, -64, 27, 81, 27, -78, -130, 212, 106, 205, 402, 266]
2493B66m83K23K04l48L74k82j5L8J51L4J71j59k66j24P3M30k07m5Q1j44J10j22
2515d0J82p2K7j03j36K57j10n3M6o9NK42M9j65j71j10J24O3k6nQ7n1Q4j48K60
2540A67k18o0l9L9N4J24j80J54o3qq6K08J93o13K87P9j91K02o6P7K50j99j78P0
2564Ck98L97j14K01n69L34O6r3n3J30p0J4l7K54o7k40j41O2J00K07k59K18J08
2587A53j38k8K10k67N9J65j70k24J51j2o1j59L50L7m4k55L6L90k40k8n3k96K58
2610a66j7L19j40j67J06rM42l29j29K5j47J39J11K1Kl90J96L13j06J25j84Rj64
2633a40r5J74J1o6K37j69Q0r5k3J08j72L05k60NK22m11K65J09k08Q1N4J18k71
2656a41J69OP2n8k07N2R9J36j53M0r2K13o8p8J72j89K56k42J64l77L81j5n42O85
$$ y = [266, -217, 6, 210, -138, 236, -46, -61, -23, 128, 162, 333, 174, -92, -216, -143, 287, 80, 35, 116, -28, 82, -40, 142, 70, 97, -6, -142, 115, 5, -48, -2, -71, -66, 176, 225, 60, -111, -221, -97, -34, -60, -65, 22, -29, 55, -93, 167, -51, -111, -150, -111, -57, 67, -113, 41, -22, -30, -116, 92, 285, -328, -41, 38, -153, 49, -17, 60, 310, 111, -67, 3, -295, 102, -12, 189, -380, -46, 20, -73, -126, 4, -66, -52, -89, 165, 98, -142, -283, -221, -121, 86, -173, 45, 153, 15, -13, 197, -70, -11, 154, -16, -240, -89, -101, -162, -321, 29, 66, 22, -233, -197, 193, -47, -75, -128, -424, -166, -183, 136, -4, -171, -65, -74, 368, 39, -90, -65, -212, -73, 38, 59, 61, -329, -133, 180, 74, 199, 15, 24, -140, -235, -61, -50, -116, 121, -48, 32, -63, -86, 22, -150, 155, -105, -100, 122, -289, -24, 85, -123, -42, 12, 130, -141, 28, 34, 106, 48, -159, -107, -8, 128, -25, 15, -77, 136, 68, -10, 162, -27, 229, -13, 151, -226, 155, 140, -402, 283]
2680B83j87j47K83k74k9R4k8k19K21j13r0Q2L22k32j44P8K8L8o8m4J43o3J89m
2704A19r8Q7R8j62j87J2P4n6Q9L03j13m62K46J42J8j77J57l26K62p6O0J6m4N12
2728D94n33j37K48k32J07N2j31J82k15J02L7k19L55k5o9l85M44q2l8K75rl32L90
2751B79m23K4J79J39k46J45R5l57K59L4j94N7o0Q7q2l1L42m61L03l67L64j10J07
2774H3K35l09l8j4j63j3L41j17j05j9K29o3j4R0j73k5J18j52K72j23p3M4k44M73
2798B40l94L1k7K16J74j86J7J3j9k34K20o8j9R1l01J84J06J23j81l81K25L71l37
2821a36M6R6j13P3o5K08q3N1j33k1K97m12K29pn5L73m98L95m3n3n3q7j04J36Q
2846D9k8ok73K82j1k43L45j7q3j37N4l82M50p1K46j55J86j14j25L6J82J0l8j57
$$ y = [283, 96, -51, 232, -42, -71, 23, -5, -224, -3, -116, -206, -124, 198, -34, -178, -100, -72, -34, -102, -146, -3, -66, 123, 119, 21, 108, 206, 44, -143, -131, -57, -113, -24, 279, 166, -296, -50, 92, 110, -67, 90, -236, 26, -50, 10, 26, -18, 494, -39, -176, 72, -160, -53, -1, -132, 50, -165, -63, -26, -245, 110, 85, 16, -369, 75, -7, -45, 230, 221, -111, 279, -144, -120, 59, 198, -48, 97, 192, -165, 94, 128, -66, -9, -69, 18, -64, -95, 247, -214, 89, -278, 86, -24, 83, 318, 9, -29, -43, -206, -219, 122, 5, -100, -119, 110, 47, 33, 123, -50, -75, 43, -109, 163, 40, -33, 11, -233, 240, -154, -123, -150, 66, 240, 54, 71, 84, 65, -169, 51, -17, -36, 55, -246, -62, 44, 167, -14, -395, -170, 201, -136, -90, 6, -107, -34, -99, 109, 26, 77, -56, -77, 220, -192, 37, 30, -25, 348, -150, 245, 202, 149, 96, 9, -95, 41, 49, 21, 15, -258, 24, 13, -230, 115, 98, 15, -122, -68, -450, 0, -71, 175, 20, 206, 92, -33, 3, 185, 195, 157, 0]
2870@L9O3k68j1LK14l6R4q0O1R9k70O2J30j23M3j1j14rJ32J35k94K55j8n4j06
2896f4K0K26j66M9J5j95J74k09k3J83Q4k18o5M51k27J76j33L2RK1k50J85l50L80
2920A05k00R0j0r8K14o7o5kK8j45K13k20J03P9p3o9J02p1K21r7k02J68j40J16
2944b0k9j61M05k34J25q3P3j7l96L50k93J08L68k62Q2K1r9n3J39J05j25NLj14
2968a02J32l4oo8J92k02J63k6m9N8r4M4J60k91J26K47k13j00N3j55K40k45K87
2991A17j04k84L57%p4J66k36K88n07J39K73j74J25J45r0l5J24j63j72J90j88j
3013a04N9N1j77J08K95m6o4m25K80p1K22Q2k57pj4K12Q0l45Q0R4R2J21l32L6J84
3038A54O0j87K10k78K94j24k37K19k5J20k46J44n9q8K5J64j02j45Q5K03k04J1
$$ y = [0, 39, 102, -166, -177, -174, 40, 4, 98, 18, 79, 178, -92, -30, 100, -23, 20, 9, -105, -114, 18, 153, -141, 114, 96, 42, -64, -44, 182, 16, 65, 80, -115, 59, -150, -173, 10, 94, -124, -189, 262, 35, 211, 78, 110, 119, 140, -110, 75, -275, 105, -95, -5, -15, -113, 101, 34, -31, -33, -5, -150, 63, -157, -54, 25, -48, -117, -15, -86, 135, 38, -164, 4, -136, -20, -49, -210, 195, -39, 86, 3, 76, 59, -337, 13, -280, -172, 196, -66, 16, 37, -62, -115, 24, 129, 4, 9, 12, -102, 30, -4, -10, -78, 114, -88, 75, 49, 0, 58, -36, 8, 168, -123, 3, 250, 37, -63, -10, -165, 75, -170, 117, 13, -271, 86, 86, 12, 178, -58, 230, -277, -138, 135, -39, 86, 231, 141, 106, 230, 67, -105, 85, -103, -104, -45, 6, -171, -63, 232, 186, 122, -303, -23, -94, 128, 210, -47, -54, -68, 144, 224, -121, -41, 53, 145, 266, -66, -30, 154, 214, 27, 237, -41, 253, 129, -108, 111, 86, 206, -40, 104, 45, -43, -18, 146, 44, -101, -16, 187, -17, -6]
3060fl89L79j26L1Q1N9k15J4J51j14L30n6M7k46L72o67L85p2j55J15P3J14k11
3083a06K87O1l23n2L36l08j2K35j13Jj84J39l1J33j59N5L05m94L94j31J7J9j19
3106e0M7p9j32K29j40J25J12q0J76j35j96J78j13jJ57J1j24r8K5K15k40M5o2J37
3130Gp7Q4J32l80K61J87r5K09n02R9K4K4r7J72m2K1j56K50Q8j55j37j10p9P9O5
3155a28l4L40L7j0k42q4N0K24j14J34l38J15k2P5nk2L4J24j26j0k2k17J38K99
3179A96o2j83j19L3K20n6K23l47o2L37m86J44K06j07K1J11L6j19Q3r1O8Qn1M1
3203D4K74j40M1j35j76M57j75J50m38J38p3N3j72L48l18K49K3L8J01n64K18L07
3225B50l18J11j76M16j63m12O22Ll49Ko8N8l4j9j13J24J6J28j4j34j3o1l9J38
$$ y = [-6, -395, -16, -142, -111, -30, 29, -186, -172, -21, -135, 195, 139, 186, -60, 312, -355, 30, -42, -197, -82, -9, 105, -106, 181, 242, -81, -133, 203, -105, -117, 118, 5, 6, -178, -39, -70, 63, -96, -41, 264, -230, 164, 33, 50, 69, -50, -3, -82, -214, 15, -125, 0, 112, 32, 208, 73, -123, 55, -58, -59, 98, 109, -15, -113, -88, 127, -113, -68, -130, 7, -70, 14, 146, -234, 27, 214, 119, 328, -174, -75, -51, -27, -124, 48, 6, 27, -129, 121, 209, 54, -83, -193, -272, -193, -128, -162, 178, 215, 205, -37, -121, -71, 153, 39, 173, -165, -50, -72, 3, -2, -24, 10, 134, 8, -2, -24, -241, -103, 196, 134, -49, -168, -135, 85, 29, 252, -95, -157, 180, -306, -162, 44, -63, -42, 69, 105, -14, 69, -22, 46, 54, 3, 44, 318, 178, 219, 84, -92, 365, 190, 340, -98, 40, -33, 20, -152, 196, -122, 127, 150, 188, 289, -275, -57, 250, -68, 43, -133, 283, 120, -292, 330, 333, -16, -14, -82, -24, -58, -77, -190, -66, -50, 78, 64, -70, -83, -144, -183, -45]
3249d5J94m4k66J36K19k66J81j07q9j78K07K95k23l02L02j79n7K12K1j4J55j8
3271A34n9K04j30l72J36J10P0l74M26J5q4q2Rn7k8R0J21k24P1R0l15K46Q3j92
3295a12J47l7n4O5l3MK02n2k3j87K50l3m87M62j81jK25rj45MM0K4j08j74J89l53
3321c77K94K74K0k87J25m2r6J36j89J87J04j76j38J45k9K01P2j78j37m5j0l6m6
3344b28J33K17r1k6k99O33l12Q1m16M65j94J31p5PK60l46Q1m5J00rk33O6r4k7
3368b21L13j13k8K18p0p8j20R6J87l25L6J28J27J4J5l43J85l3L3q4n0K46K1q5
3392F9p8k14K73N5l01J56j94K60J16n9j32K52l15J49K36k03m07L56M0J9m3M8l21
3415b38L10k7Qo8nM0n9K05l20L19o3o1k09K57k66L07k33K49l82L60Q7k74Q1k3
$$ y = [-45, 149, 105, -161, -25, 194, -72, 109, 2, -87, -265, -58, 237, 14, -288, 14, -165, -222, -10, 11, -3, 152, 134, 75, 279, 149, -223, -87, 23, 93, -281, 145, 160, 76, -6, 3, -54, -82, 8, 129, -95, -24, 66, -249, -3, 80, -112, 35, -2, -56, 9, -24, -20, 182, 130, 107, -80, 170, 137, -350, 112, -69, -70, 155, 146, 1, 5, 45, 69, -39, -213, -24, -377, -83, 191, 211, -76, 49, 7, -89, 47, -142, 45, 149, -27, -165, -20, -49, 152, 224, 46, -91, -136, -146, -182, -228, -95, 122, 31, 5, -294, 339, 27, 108, -308, 157, -37, 94, 19, 26, 286, -60, 21, -24, 76, 67, -166, -100, -194, -221, 92, -21, -49, 169, 99, 21, -99, -3, 184, -141, -105, 23, 150, 164, 179, -164, 21, -12, 21, -63, -113, 133, 154, 69, -9, -223, 50, 105, -196, -40, -234, 26, 142, 83, -49, 203, -112, 37, 273, 70, -337, 19, 59, 78, 35, 83, -238, 72, 45, 53, -15, -20, 20, -39, 166, -154, 165, 102, 41, -168, 89, -177, 130, -103, 146, -236, 124, 211, -63, 18, -5]
3439ekR4n3l8Q6QK3j09J47j99J10N8k81L82j7j20K2n32N57l40K00l5K53l03l5
3464a29L96j54j07o8q8L54O2j22j51K78l93n0K03j32J93p4k5l7j03k2J68k2p9
3487a02J97k97K57j98K51k20r1K1K59j65J80J17p2p2J99j44j47R4r9R8J4Jk3J84
3511B42j97k83jM23j63j70K84R6l90L68j27j02j22J21l1K40j75l6l29J26K28j1
3533ij37J83k56J67n8P4N2q7J41j06J39j92J61m2J1k81K02J21J09m50M71k27k80
3556b94L03Oj18J5k7j06Q7J78J38m69J94Po2J36J6J26L6l3l3k99L15k74J32J66
3580A40k13K0K19l19J55J48j54p2J21N0Q1l53m1P6L03R4j09k03J76K9l93K72j11
3603h4n1P4J17k04J58k01J40J38r7O9L1l9k37K79j15K69p5O1l30J65J31k99MJ83
$$ y = [-5, -7, 87, 34, -4, 82, 90, 113, 4, 151, -48, 62, 120, -161, 221, 204, 84, 106, -426, 131, -209, -9, -44, 209, -94, -129, 267, 113, 6, -62, -150, 204, 266, 144, -7, 271, -122, -172, 31, -101, 92, 18, -7, -44, -147, -169, -1, -23, -102, 95, -202, 55, -143, 108, -112, -203, -182, 77, -88, 92, 209, 137, 65, 264, 120, -27, 67, -32, 66, 80, 81, 58, 242, 45, -238, -239, 184, 21, -149, 135, 231, -159, 209, 82, -20, -142, -21, -52, 188, 13, -23, -352, -226, 2, -9, -146, 37, -219, -52, -110, -36, 16, -71, 70, -36, 103, -89, 72, 30, 41, -240, -38, 83, 192, -258, 213, -14, -294, 9, 15, -103, -88, -115, -221, -134, 44, 182, -287, -93, -86, -148, -12, 4, 130, 166, 133, 100, -199, 116, -158, -26, 140, -73, -53, 166, -153, 2, 150, -4, -76, 45, 95, 176, -177, -218, -142, 161, 255, 146, -57, 119, 148, -245, 27, -84, -135, -61, 56, -148, 10, -191, -51, 87, -10, 59, 90, 51, -186, 93, -22, 247, 172, 233, -97, 68, 199, -100, -96, 87]
3627H7J58q6k72K18j40m7P9m3J54l21J23J32j36K33j30K03k42R8j50J99l71L7
3649b17L32j03J43p9L7j94kj06J04J61l99K21k8J59Nj45P9k09L94l14K87K40r1
3672B75j97k23K23p9j4j10M2j12O9NK03L1j45N6o0j35J17mJ89l93L39j59j23N3
3696a52Q2K71k37Q4k50J12M9J43j70N13k56k41J53k52K86jj99n24P92k03L2j09
3718g7LM39k58J05j05k32Q6j46J27J72J9P0m52J92k86L95O0r0p0N6J65P7k51k6
3742b7j03k0Q1J86k04OL9J04j84J51j3j33K61l13L06n36M42J00J38j27k48j5J30
3765B1L5K18l82j81K90j01K42j74Q6j46K07K14m27K99j92j73K40j83J5k4J53K86
3787C23m77L77p7n10K59R2Q2j33K61k03j76nK69J54n38M38l14r2L86k96K74p4
$$ y = [87, 245, 159, -113, 105, -35, -82, -3, -46, 108, -213, -90, 42, -94, 139, 9, 212, -30, 68, -82, 117, -254, -217, 115, 12, 155, 76, 113, -81, -83, -189, -85, 76, -323, -102, -130, 29, 34, -111, -32, -241, 153, -161, 126, 366, 275, 78, -145, 78, -1, -15, -125, -83, -195, -126, -121, 82, 113, -32, 24, -36, -171, -54, -58, 131, -262, 77, -82, -205, -152, -70, 201, -36, 48, -202, -90, -41, 102, -68, 445, 189, -52, 101, -151, 135, 134, -65, -589, 203, 0, 32, -77, -74, 365, 107, 212, 107, -125, -39, -185, -58, 114, 133, 203, -249, -57, -343, 52, 112, 22, -48, 8, 173, 250, -1, -27, -130, -150, -69, 117, -87, -81, -42, 62, -122, 29, 16, -117, 144, -169, 137, -399, 43, 143, 281, 154, -94, -109, 21, 56, 274, -108, -289, 1, -100, 142, -32, 54, -92, 115, 329, -98, 201, 9, -164, 76, -107, -92, -116, 37, 323, -154, 223, 146, -364, -105, -13, 69, -64, 197, -6, -182, -187, 82, 236, -302, 136, -178, -270, 116, -180, 94, 20]
3809B0J10j58J4k63L00j60p8m8M51m69J29M33l54p4o4K21r8Q0l88J71M54j35k44
3832a50J93l69K53j58K63r6J93j82k32K34M00m01j3j35L13Mk48J2J80J00K9l33
3854a43J44m5J05N0M9m8M7k29J41J14k66J20j2j86r9J03K63k54J5J98j08k97M54
3877A16j15P8m5N6j04O8L6J10J29r6l10j82M77k55m6J11J90k43L8j76J63j18J49
3900C1l8R9j71J82k86J23J38l95N30j07J78l24R3p7p1k9o5K43l16L17l6l8j14
3923a33K36L7l96L16p5Q0J84k63o8J13r9k94M7N20j93k58M41j19j31J99J42l19
3945c3n2N0O9K08k37J16l80L10j54J11J85l43K41q6j62L26M4l40K7M0Q2k25J74
3968b9k62N33r7o4k10K55J6p3k37M6j20J45J67K95k37m4n5l78K98R7K13j31k8
$$ y = [20, 130, -28, -14, -277, 23, -137, -215, -263, 188, -281, -152, 281, -73, -147, -211, 10, -88, -8, -396, -225, 229, 94, -150, 43, -326, -73, -231, 32, -64, 129, -53, -285, -51, 349, -52, -65, -200, 113, 117, -131, -119, 61, 161, 190, -143, 1, -44, 61, 111, 160, 112, 159, -70, 71, 185, -81, 39, 27, -159, -258, -155, 108, -146, -131, 67, -41, -338, 116, 1, 79, 34, 90, -14, 54, 90, 200, 329, 233, -77, -259, 218, -37, -83, 28, 218, -25, 13, -163, 0, -118, 31, -7, 92, -79, 103, -183, -60, 78, -317, 213, 106, 284, -40, 53, -24, -95, -124, -189, 54, -262, 55, 19, -19, -133, 103, 140, -256, 60, -15, 65, 249, -14, -82, 31, -68, -362, -315, 205, 12, -246, 195, 76, -55, 144, 286, -33, -85, -35, 34, 242, 5, 121, -259, 51, -103, 8, 193, -150, 91, 5, -157, 169, 213, -127, -100, -60, 22, -203, -29, -291, 242, 145, 81, -129, 126, 142, 69, -168, -122, -242, -97, 70, 365, 128, 84, 29, -349, -51, 46, 259, 128, 100]
3991A00P7j47l9m6l27L73l94M65P9k86MK14k1j34J40j29J30K08k2l2k06J43k04
4014e4Q9J70l13L37j07j07o9K7L51l75r7o9J30L0J46j90J89nj56R2o0J60j65K7
4038a9l0m1R9pJ39j32j91j73K66J2o2J68R2k86K63l08J98m8O1j55J62n1j35R8
4062h0K37k31j2K66j79P7p1J35j26O1k49K83l20K36l7j95M08O9l50K11p7k33J51
4085b6K8L44l06m6R6q8j39L32k26J44l13K54k03K21R1Kk37P5N6l81l6L26N0Q3
4109A01j70N7J09l2pj49R4j44J71l7K10j85n1j06J30K04j62K08j92J56l12J5L1
4132f1j17K20%j8j6j55K37l63K90p7N9L05n00L36n4j82j81K70l2o7p4J80K5N7
4156H2L3j30j09L84k83Q8Q1j35o0Q7R5p2n5K7O1m1l0J0k3k72l7M97j56j13l0p3
$$ y = [100, 177, 30, -9, -55, -382, -9, -403, 62, 141, -145, -141, 73, 52, -82, 58, -71, 59, 267, 245, 213, 7, 150, -54, 35, 205, -108, 229, 122, 15, -54, -27, 324, -51, -148, -217, -87, -57, 89, -101, 88, 83, -73, 19, -41, 119, -46, -19, -49, -90, 9, 2, 141, 9, -182, -355, -89, -77, -139, 29, 121, -165, 98, -210, -12, -60, 1, -154, 8, -43, -178, -80, 157, -74, -86, 180, 1, 78, 7, 142, 16, 77, -172, 111, -209, 27, -10, -205, 203, 272, -78, 133, 56, -177, -26, 2, 346, 40, -6, 90, 2, -137, 195, -31, 113, -200, 54, -149, 72, 163, 165, -72, 3, 59, -322, -358, -32, 18, 101, -69, -12, 97, 65, 58, -91, 3, -141, 30, -7, 203, 18, -33, -139, -9, 195, 33, 241, 49, 205, -107, -92, -61, -178, 42, 42, 24, 8, -147, 90, -273, 17, -60, -1, 304, -196, 140, 86, -96, -277, -7, -39, -106, -180, 0, 25, 82, 115, -15, -124, 260, -23, 65, 146, 11, -49, 38, 133, 61, 6, 33, 94, 53, 23, 33, 10, -262, -299, 198, 42, -71, -101, -174]
4182a74o6L04J93q6l16K78q2l06K36j08J8K85k96r2L78o7k93M91l79j78L40Mk63
4205a79K52m6o4K83p5L5m58M63j46N5r5J96k03P2oj50N7%r3J1K48l38K58p6k10
4230b09P7K54P6J4k76Q4j02o3n9K31R5k83k7j2J67jq0J87m61M78j76K11N0pk13
4255d5OJ71P4l26r4L63k16L9r0mR5M2L2k05O7K06j18K8q2J90Mj66K59m05O3K90
4281A78k53J56j24J10O5k03J85j94o0J81k9L3J61l40K84p5Lp4J3K50Q1m79J00
4304c1J87k11r8M20l61Q7J50r1O6k9L3k3k41J7L20q6k38J15M4L46k58m1r0RP6
4329G2l21K57K12k95P9K14J0k94Q3j46K83q9j00R4lj04r0m0j06J22JL69k91K28
4353A45j55J51k22O3l1M3rJ8j63K17J68j57J87k03J63l16l0J34K1j23M14l52M09
$$ y = [-174, -240, 64, 257, 171, -145, 133, 51, -255, -19, -127, -109, 176, -120, -212, 166, 99, -194, 297, -82, -260, 80, 84, -179, 73, 27, -37, 246, 171, 206, -252, 211, 65, 120, 25, 221, 18, 90, 84, -66, -9, -9, -102, -91, 157, -181, 77, 1, -209, -132, 122, 198, 212, -64, 20, -82, -145, -204, 27, 122, -161, -188, -200, -33, -34, -114, 73, -388, 90, -86, 125, 175, 168, -45, -39, 132, 206, -120, -214, 149, -67, -28, -118, -122, -27, 15, 47, -158, -91, 115, -3, 25, -57, 133, 137, -29, 230, -175, -112, 178, -75, 81, -43, 67, 132, -71, 114, -80, -140, 41, 12, 45, 206, -134, 150, 75, 78, 4, 17, 267, 348, -131, -31, 156, -55, -153, 267, -94, -7, 143, 52, 118, 89, 122, 99, -142, -125, 195, 109, -129, -14, 30, 376, 118, 77, -13, -4, 72, -249, 8, 220, -75, 4, 218, 228, -66, 17, -129, 154, 65, -35, 59, 56, -48, -138, -178, -284, -162, -161, 208, -83, 145, -10, 141, -81, -18, -49, -6, -15, 3, -160, 57, 225, 68, 255, 52, 215, -101, -131, 3, 24, -99, 315, -37, 372]
4376C72m78J9j03M6J01J01j05J07r1J12p9j08J46J62l32J11J15j53RJ70n2j6Q
4399F2Lj65m9R8L0LM6J85q8k7m56L8L73j05K4l2K42k67J71k5j0J99j90l3m10K28
4425a55j54N11k35l5N4N0J15k07%J99l31J26j78K70R4L6k86J34j98M3O8l3O9M7
4449Dj54j55K48p2O0M2J21k89MK24j47M3n1L9K38j42M1J22l48L30j11J48m75O73
4473C93l85j7j46K32l24N40n0m46O1qK45J0j34Nl85N60J71k12k05J59p0m80N73
4496H7m67M21J27j9q8K6k14o3K49l4j17Q0j41J21M02k93k13L4P2J06k83L11J19
4519B23l06N3J79K7k14K87o0l22nM30l43Q0ll5O1k47M60m75P0K06j9P5j94J38
4543F6n0m8J68l07K23l73N95k80Jj71l4M39l41K47k02J23k31k9L40n1j3j91n0
$$ y = [372, -106, -87, -190, -144, -43, 58, -47, 60, -31, 81, 2, -106, 40, 202, -130, -19, 96, -57, -48, 122, 70, 54, 62, 65, -100, -149, -51, -21, -18, 28, 213, 125, 98, -358, -320, 53, -52, -28, -60, 182, -85, 86, 61, 51, 250, 60, 27, -383, -155, -309, 202, -33, -68, -14, 36, 151, -56, -56, 143, -188, -62, -240, 30, 124, 160, -126, 8, -190, -147, -79, -112, -43, 4, -150, -305, -57, -129, -69, -27, 94, -195, -191, 33, -114, -71, -122, -83, 155, 13, 54, 176, -172, 158, 47, 195, -280, 393, 8, -9, -155, 77, -247, 293, 243, -203, -142, -150, 95, 105, -29, -24, -409, 151, 322, 110, -95, 64, -6, -486, 87, -380, 41, 168, 149, 61, 87, -127, -190, 59, 25, -92, -12, -153, -32, 370, 77, -136, -102, -30, 76, -207, 104, 223, -83, -30, 149, 176, -38, 249, 189, -133, -138, 292, -51, 29, 26, -9, 52, -195, 265, -210, -140, 66, 47, 122, -72, 66, 16, -32, 136, -171, 52, -321, 274, -6, -5, -176, -210, 229, -112, 135, -67, 56, -175, -204, 136, 85, 72, -119, -169]
4566a69K97j4q3j0k2j12j42L18j56P3J24K11l69J87r6l30K55jJ61j00N3j90J14
4589aL3o4Rp3J79j93R6J4K97k91OkK05j79l03L13L30j17q8o4k06Mj57L84J39j27
4615A44q6R5o2O4N7k01j51m1J81L2j35n5K22l25M71l59L08q2k34K40q6k21J14
$$ y = [-169, 128, 114, 31, 21, -1, -113, -255, 63, -93, -20, 104, 315, -54, 133, 37, -293, -38, -39, 122, 22, 75, -115, -1, 32, -32, -23, -96, 83, -110, -14, 0, 297, 6, 12, 10, 215, 36, -267, 46, 376, 259, 171, 107, -99, -95, -252, 132, 271, 144, 58, 153, 91, 155, 212, 11, -140, -181, 0, 32, -103, -158, 64, -261, 210, -149, 159, 77, -157, 83, -3, -224, -110]
$$ [...]
8191F5
##END NTUPLES=NMR FID
##END=
