##TITLE=1H_DE-80_oil
 200.13MHz, D2O,
 8 sc
 
 17.1.2025
##JCAMPDX= 6.0         $$ Bruker NMR JCAMP-DX V2.0
##DATA TYPE= NMR FID
##DATA CLASS= NTUPLES
##ORIGIN= UXNMR, Bruker Analytische Messtechnik GmbH
##OWNER= pz
$$ XWIN-NMR		Version 3.5
$$ Fri Jan 17 15:19:25 2025 Russian Standard Time (UT+4h)  she@DPX200
##.OBSERVE FREQUENCY= 200.1313
##.OBSERVE NUCLEUS= ^1H
##.DELAY= (6, 6)
##.ACQUISITION MODE= SIMULTANEOUS
##.ACQUISITION SCHEME= undefined
##.AVERAGES= 8
##.DIGITISER RES= 18
##SPECTROMETER/DATA SYSTEM= spect
##.PULSE SEQUENCE= zg30
##.SOLVENT NAME= D2O
##.SHIFT REFERENCE= (INTERNAL, D2O, 0, 14.3821)
##AUDIT TRAIL= $$ (NUMBER, WHEN, WHO, WHERE, WHAT)
$$ ##TITLE= Audit trail, XWIN-NMR		Version 3.5
$$ ##JCAMPDX= 5.01
$$ ##ORIGIN= Bruker BioSpin GmbH
$$ ##OWNER= she
$$ F:/spectra/data/she/nmr/H-C/1/audita.txt
$$ ##AUDIT TRAIL=  $$ (NUMBER, WHEN, WHO, WHERE, WHAT)
(   1,<2025-01-17 15:18:36.37 +0400>,<she>,<DPX200>,
      <created by zg, POWCHK disabled, PULCHK disabled
       configuration hash MD5:
       00 E9 B6 7A A2 85 ED C7 34 08 36 98 17 FE 4E 26
       data hash MD5: 16K
       BC 3C AF 69 9A B8 08 D5 B0 59 9C 8A BD 45 FD B0>)
$$ ##END=
$$ 
$$ hash MD5
$$ 6C E7 28 6B 42 DE 6F 6B C9 D2 16 21 8D 53 B3 3C
##$RELAX= 
##$RELAX= 
##$RELAX= 
##$RELAX= 
##$RELAX= 
##$RELAX= 
$$ Bruker specific parameters
$$ --------------------------
##$DU= <F:/spectra>
##$EXPNO= 1
##$NAME= <H-C>
##$PROCNO= 1
##$TYPE= <nmr>
##$USER= <she>
##$AMP= (0..31)
100 100 100 100 100 100 100 100 100 100 100 100 100 100 100 100 100 100 
100 100 100 100 100 100 100 100 100 100 100 100 100 100 
##$AQSEQ= 0
##$AQ_mod= 1
##$AUNM= <au_zg>
##$AUTOPOS= <>
##$BF1= 200.13
##$BF2= 200.13
##$BF3= 200.13
##$BF4= 200.13
##$BF5= 200.13
##$BF6= 200.13
##$BF7= 200.13
##$BF8= 200.13
##$BYTORDA= 1
##$CFDGTYP= 0
##$CFRGTYP= 5
##$CHEMSTR= <none>
##$CNST= (0..31)
1 1 145 1 1 1 1 1 1 1 1 1 1 1 1 1 1 1 1 1 1 1 1 1 1 1 1 1 1 1 1 1 
##$CPDPRG= <>
##$CPDPRG1= <>
##$CPDPRG2= <>
##$CPDPRG3= <>
##$CPDPRG4= <mlev>
##$CPDPRG5= <mlev>
##$CPDPRG6= <mlev>
##$CPDPRG7= <mlev>
##$CPDPRG8= <mlev>
##$CPDPRGB= <>
##$CPDPRGT= <>
##$D= (0..31)
0 0.7 0 0 0 0 0 0 0 0 0 0.03 0 0 0 0 0 0 0 0 0 0 0 0 0 0 0 0 0 0 0 0 
##$DATE= 1737112715
##$DBL= (0..7)
120 120 120 120 120 120 120 120 
##$DBP= (0..7)
150 150 150 150 150 150 150 150 
##$DBP07= 0
##$DBPNAM0= <>
##$DBPNAM1= <>
##$DBPNAM2= <>
##$DBPNAM3= <>
##$DBPNAM4= <>
##$DBPNAM5= <>
##$DBPNAM6= <>
##$DBPNAM7= <>
##$DBPOAL= (0..7)
0.5 0.5 0.5 0.5 0.5 0.5 0.5 0.5 
##$DBPOFFS= (0..7)
0 0 0 0 0 0 0 0 
##$DE= 6
##$DECBNUC= <off>
##$DECIM= 32
##$DECNUC= <off>
##$DECSTAT= 4
##$DIGMOD= 1
##$DIGTYP= 9
##$DL= (0..7)
0 120 120 120 120 120 120 120 
##$DP= (0..7)
150 150 150 150 150 150 150 150 
##$DP07= 0
##$DPNAME0= <>
##$DPNAME1= <>
##$DPNAME2= <>
##$DPNAME3= <>
##$DPNAME4= <>
##$DPNAME5= <>
##$DPNAME6= <>
##$DPNAME7= <>
##$DPOAL= (0..7)
0.5 0.5 0.5 0.5 0.5 0.5 0.5 0.5 
##$DPOFFS= (0..7)
0 0 0 0 0 0 0 0 
##$DQDMODE= 0
##$DR= 18
##$DS= 0
##$DSLIST= <SSSSSSSSSSSSSSS>
##$DSPFIRM= 0
$$ [...]
##$SUBNAM0= <"">
##$SUBNAM1= <"">
##$SUBNAM2= <"">
##$SUBNAM3= <"">
##$SUBNAM4= <"">
##$SUBNAM5= <"">
##$SUBNAM6= <"">
##$SUBNAM7= <"">
##$SUBNAM8= <"">
##$SUBNAM9= <"">
##$SW= 18.0517328524113
##$SWIBOX= (0..15)
0 0 2 0 0 0 0 0 0 0 0 0 0 0 0 0 
##$SW_h= 3612.71676300578
##$TD= 16384
##$TD0= 1
##$TE= 0
##$TE2= 300
##$TE3= 300
##$TEG= 300
##$TL= (0..7)
0 120 120 120 120 120 120 120 
##$TP= (0..7)
150 150 150 150 150 150 150 150 
##$TP07= 0
##$TPNAME0= <>
##$TPNAME1= <>
##$TPNAME2= <>
##$TPNAME3= <>
##$TPNAME4= <>
##$TPNAME5= <>
##$TPNAME6= <>
##$TPNAME7= <>
##$TPOAL= (0..7)
0.5 0.5 0.5 0.5 0.5 0.5 0.5 0.5 
##$TPOFFS= (0..7)
0 0 0 0 0 0 0 0 
##$TUNHIN= 0
##$TUNHOUT= 0
##$TUNXOUT= 0
##$USERA1= <user>
##$USERA2= <user>
##$USERA3= <user>
##$USERA4= <user>
##$USERA5= <user>
##$V9= 5
##$VALIST= <valist>
##$VCLIST= <CCCCCCCCCCCCCCC>
##$VD= 0
##$VDLIST= <DDDDDDDDDDDDDDD>
##$VPLIST= <PPPPPPPPPPPPPPP>
##$VTLIST= <TTTTTTTTTTTTTTT>
##$WBST= 1024
##$WBSW= 4
##$XGAIN= (0..3)
0 0 0 0 
##$XL= 0
##$YL= 0
##$YMAX_a= 28059
##$YMIN_a= -28469
##$ZGOPTNS= <>
##$ZL1= 120
##$ZL2= 120
##$ZL3= 120
##$ZL4= 120
##$ABSF1= 10
##$ABSF2= 0
##$ABSG= 5
##$ABSL= 3
##$ALPHA= 0
##$AQORDER= 0
##$ASSFAC= 0
##$ASSFACI= 0
##$ASSFACX= 0
##$ASSWID= 0
##$AUNMP= <proc_1d>
##$AZFE= 0.1
##$AZFW= 0.1
##$BCFW= 1
##$BC_mod= 2
##$BYTORDP= 1
##$COROFFS= 0
##$CY= -3
##$DATMOD= 1
##$DC= 2
##$DFILT= <>
##$DTYPP= 0
##$F1P= 0
##$F2P= 0
##$FCOR= 0.5
##$FTSIZE= 0
##$FT_mod= 4
##$GAMMA= 1
##$GB= 0.15
##$INTBC= 1
##$INTSCL= 1
##$ISEN= 128
##$LB= 0.25
##$LEV0= 0
##$LPBIN= 0
##$MAXI= 10000
##$MC2= 0
##$MEAN= 0
##$ME_mod= 0
##$MI= 1.114404
##$NCOEF= 0
##$NC_proc= 0
##$NLEV= 6
##$NOISF1= 3.799351
##$NOISF2= 2.8
##$NSP= 1
##$NTH_PI= 0
##$NZP= 0
##$OFFSET= 14.38212
##$PC= 1
##$PHC0= 90.44261
##$PHC1= 9.992201
##$PH_mod= 1
##$PKNL= yes
##$PPARMOD= 0
##$PSCAL= 0
##$PSIGN= 0
##$REVERSE= no
##$SF= 200.129724274929
##$SI= 16384
##$SIGF1= 3
##$SIGF2= 2
##$SINO= 400
##$SIOLD= 16384
##$SREGLST= <1H.CDCl3>
##$SSB= 0
##$STSI= 0
##$STSR= 0
##$SW_p= 3205.1282051282
##$SYMM= 0
##$S_DEV= 0
##$TDeff= 0
##$TDoff= 0
##$TI= <>
##$TILT= no
##$TM1= 0
##$TM2= 0
##$TOPLEV= 0
##$USERP1= <user>
##$USERP2= <user>
##$USERP3= <user>
##$USERP4= <user>
##$USERP5= <user>
##$WDW= 1
##$XDIM= 8192
##$YMAX_p= 0
##$YMIN_p= 0
$$ End of Bruker specific parameters
$$ ---------------------------------
##NTUPLES= NMR FID
##VAR_NAME=  TIME,          FID/REAL,        FID/IMAG
##SYMBOL=    X,             R,               I
##VAR_TYPE=  INDEPENDENT,   DEPENDENT,       DEPENDENT
##VAR_FORM=  AFFN,          ASDF,            ASDF
##VAR_DIM=   8192,          8192,            8192
##UNITS=     SECONDS,       ARBITRARY UNITS, ARBITRARY UNITS
##FACTOR=    0.0002768,     1,               1
##FIRST=     0,             0,               0
##LAST=      2.2672688,     0,               0
##MIN=       0,             -28469,          0
##MAX=       2.2672688,     28059,           0
$$ Real data points
##PAGE= N=1
##DATA TABLE= (X++(R..R)), XYDATA
$$ [...]
$$ plain form
851 668 2140 2791 2116 748 -718 -1965 -2561 -2309 -999 778 1920 2443 2168 1138 -426 -1936 -2426
868 -2426 -2085 -1072 233 1644 2478 2207 1106 -167 -1448 -2399 -2417 -1369 147 1440 2263 2395 1541
885 1541 -19 -1484 -2328 -2439 -1578 -262 1402 2486 2432 1443 225 -1167 -2351 -2556 -1584 -58 1078
902 1078 2049 2398 1737 310 -1159 -2047 -2193 -1695 -634 910 2150 2303 1656 631 -611 -1911 -2483
919 -2483 -1799 -622 589 1830 2355 1975 811 -668 -1855 -2302 -1915 -954 418 1911 2381 1830 972
936 972 -306 -1757 -2387 -1890 -893 323 1584 2200 1972 943 -380 -1492 -2139 -1849 -1137 138 1640
953 1640 2066 1703 1154 144 -1343 -2173 -1855 -1234 -162 1127 2054 2113 1384 164 -1192 -1931 -1926 -1536 -392
972 -392 1283 2083 1870 1376 496 -1047 -2112 -1951 -1375 -398 882 1855 1863 1523 561 -944 -1672 -1756 -1544 -744
$$ packed form
851F68J472O51o75j368j466j247n96K52J310J777J142N23k75j030j564j510m90
868b426L41J013J305J411Q34k71j101j273j281r51j8J048J516J293Q23J32q54
885A541j560j465q44j11Q61J316J664J084n4r89j218j392j184k05R72J526J136
902A078R71L49o61j427j469q88j46M98J061J544J240J53o47j025j242j300n72
919b483O84J177J211J241N25l80j164j479j187m47L87R61J372J493M70n51q58
936I72j278j451o30M97R97J216J261O16k28j029j323j112o47K90P12J275J502
953A640M26l63n49j010j487q30L18O21J072J289R27N9p29j220j356p39NL90J144
972c92J675Q00k13m94q80j543j065J61N76R77J280R73Ql40r62j505p28q4K12Q00
$$ plain form
992 -744 881 1735 1654 1579 935 -626 -1720 -1810 -1636 -888 527 1572 1875 1794 917 -550 -1454 -1760 -1857 -1024
1012 -1024 571 1517 1576 1726 1175 -410 -1583 -1696 -1646 -1103 194 1254 1809 1830 1143 -332 -1204 -1589 -1952
1031 -1952 -1295 393 1329 1409 1683 1424 -65 -1269 -1426 -1642 -1358 -99 982 1517 1882 1417 75 -866
1049 -866 -1405 -1992 -1643 -94 975 1336 1842 1683 129 -977 -1419 -1778 -1571 -305 872 1352 1749 1469
1067 1469 301 -666 -1176 -1837 -1596 -258 652 1055 1769 1746 504 -620 -1088 -1564 -1672 -693 412 1115
1085 1115 1692 1718 674 -280 -964 -1792 -1786 -666 429 816 1639 1834 840 -291 -934 -1636 -1774 -901 115
1104 115 792 1592 1761 879 -83 -730 -1568 -1759 -874 75 721 1438 1714 1009 19 -615 -1392 -1688 -1035 -225
1124 -225 598 1360 1690 1119 351 -492 -1378 -1697 -1159 -308 469 1343 1807 1234 244 -568 -1381 -1655 -1229 -420
$$ packed form
992g44J625Q54q1p5o44j561j094r0J74P48J415J045L03q1q77j467r04l06r7Q33
1012a024J595R46N9J50n51j585j173j13N0N43J297J060N55K1o87j475q72l85l63
1031a952O57J688R36Q0K74k59j489j204j57k16K84J259J081N35L65m65j342r41
1049h66n39n87L49J549J069L61N06j59j554j106m42l59K07J266J177M80L97k80
1067A469j168r67n10o61K41J338R10M03P14k3j242j124m68m76j08R79J105P03
1085A115N77K6j044r54o84q28OJ120J095L87Q23J95r94j131o43p02j38Q73J016
1104A15O77Q00J69q82r62o47q38j91Q85R49O46P17K76p05r90o34p77k96O53Q10
1124b25Q23P62L30n71p68q43q86l19N38Q51P77Q74M64n73r90q12q13k74M26Q09
$$ plain form
1144 -420 512 1310 1601 1033 409 -227 -1177 -1672 -1176 -415 197 1001 1552 1415 558 -251 -1069 -1470 -1366 -751
1164 -751 177 1157 1522 1270 669 -30 -988 -1488 -1264 -680 -35 863 1469 1361 781 -3 -741 -1392 -1421 -929
1184 -929 -40 891 1418 1356 1000 192 -817 -1419 -1290 -854 -190 620 1347 1389 820 127 -477 -1101 -1435 -1112
1204 -1112 -311 615 1102 1282 1097 488 -493 -1307 -1350 -1020 -456 383 1209 1517 1063 356 -356 -1053 -1401 -1163
1224 -1163 -457 382 1017 1276 1169 551 -338 -1093 -1268 -1040 -656 132 1032 1298 1111 597 -42 -881 -1339 -1157
1244 -1157 -603 78 741 1251 1251 806 -110 -793 -1184 -1162 -809 -69 839 1275 1160 766 140 -673 -1276 -1295 -834
1265 -834 -69 606 1148 1276 898 112 -665 -1090 -1100 -851 -224 584 1172 1146 859 280 -414 -1014 -1241 -879 -294
1286 -294 342 961 1239 962 365 -379 -879 -1132 -1046 -402 356 924 1183 1017 446 -258 -881 -1197 -1032 -462
$$ packed form
1144d20R32P98K91n68o24o36r50m95M96P61O12Q04N51j37q57q09q18m01J04O15
1164g51R28R80L65k52o01o99r58n00K24N84O45Q98O06j08n80p84p38o51k9M92
1184i29Q89R31N27o2l56q08j009o02J29M36O64Q10P27M2n69o93o04o24l34L23
1204a112Q01R26M87J80j85o09r81q14m3L30N64Q39Q26L08m54p07p12o97l48K38
1224a163P06Q39O35K59j07o18q89p55j75K28L84P88R00K66j87n14o39q39m58J82
1244a157N54O81O63N10%m45r16o83l91K2L53P40R08M36j15l94o26q13o03j9M61
1265h34P65O75N42J28l78p86p77m25j0K49O27Q08N88k6k87n79o94o00k27L62N85
1286b94O36O19K78k77n97p44n00k53Q6O44P58N68K59j66n71p04o23l16J65N70
$$ plain form
1306 -462 244 814 1221 1092 449 -226 -797 -1130 -1087 -587 156 727 1061 1025 594 -21 -781 -1104 -1057 -592 17
1327 17 618 1068 1149 753 -1 -619 -972 -1029 -779 -151 589 1052 1008 737 166 -501 -1019 -1145 -712 -127 486
1348 486 989 1125 810 197 -518 -924 -1094 -842 -264 426 886 943 799 300 -363 -924 -1057 -824 -328 248
1368 248 794 1082 941 380 -277 -704 -1034 -940 -473 286 747 957 925 543 -159 -789 -1017 -866 -485 88 638
1389 638 1053 933 380 -214 -625 -931 -1003 -594 134 602 880 932 589 -20 -630 -865 -953 -594 -92 511 963
1410 963 911 614 42 -428 -812 -1016 -698 -100 501 777 971 749 146 -460 -790 -954 -806 -226 388 827
1430 827 995 701 219 -322 -820 -1079 -772 -171 287 659 919 789 215 -303 -647 -877 -763 -370 179 706
1450 706 982 753 331 -46 -564 -994 -861 -341 170 569 955 848 427 -145 -635 -927 -868 -483 74 606
$$ packed form
1306d62P06N70M07j29o43o75n71l33M3N00P43N71L34l6m31o15p60l23M7M65O09
1327A7O01M50Q1l96p54o18l53n7K50O28P40M63m4k71n71o67n18j26M33N85O13
1348D86N03J36l15o13p15m06j70K52N78O90M60N7j44m99o63n61j33K33M96N76
1368B48N46K88j41n61o57m27l30R4M67P59M61K10l2l82p02o30k28J51L81N73N50
1389F38M15j20n53n94m11l06p2M09P28M68K78N2l43o09o10k35q8L59N02O03M52
1410I63n2k97n72m70l84k04L18N98O01K76J94k22o03o06l30j64J48N80O14M39
1430H27J68k94m82n41m98k59L07O01M58L72K60j30n74n18l44k30J14L93N49N27
1450G06K76k29m22l77n18m30J33N20N11L99L86j07m21n72m90k92N9L85N57N32
$$ plain form
1470 606 916 873 439 17 -478 -881 -850 -399 -22 385 872 919 523 30 -339 -827 -894 -528 -99 359 831
1491 831 816 486 131 -361 -828 -909 -511 -150 227 741 899 545 161 -262 -691 -905 -606 -267 278 750 898
1512 898 613 367 -185 -809 -938 -525 -192 139 673 814 593 227 -165 -608 -806 -646 -374 85 582 802
1532 802 719 438 42 -625 -898 -705 -423 -50 559 841 670 476 -32 -496 -793 -705 -496 -9 505 791 688
1553 688 446 101 -540 -794 -642 -444 -158 443 836 699 450 126 -409 -705 -697 -514 -148 420 713 714 568
1574 568 262 -382 -708 -668 -555 -283 273 729 741 509 263 -256 -666 -709 -590 -300 259 684 714 630 350 -210
1596 -210 -615 -756 -596 -371 297 644 711 575 328 -142 -543 -691 -577 -313 86 531 575 600 461 -83 -475
1617 -475 -675 -622 -440 -41 499 678 647 403 20 -460 -675 -658 -389 85 435 590 639 486 56 -392 -643
$$ packed form
1470F06L10m3m34m22m95m03L1M51L77M07M87M7l96m93l69m88o7L66M29M58M72
1491H31j5l30l55m92m67q1L98L61L77N14J58l54l84m23m29k14K99L39N45M72J48
1512H98k85k46n52o24j29M13L33L31N34J41k21l66l92m43j98J60K72M59M97K20
1532H02q3k81l96o67k73J93K82L73O09K82j71j94n08m64k97Q8K09M87N14K86j03
1553F88k42l45o41k54J52J98K86O01L93j37k49l24n35k96QJ83L66N68K93Jj46
1574E68l06o44l26M0J13K72N56M56J2k32k46n19m10m3J19K90N59M25L0q4k80n60
1596b10m05j41J60K25O68L47O7j36k47m70m01j48J14K64L99M45M4K5j39n44l92
1617d75k00N3J82L99N40J79l1k44l83m80k15J7K69M74L50J55M9j53m30m48k51
$$ plain form
1638 -643 -622 -468 -138 398 669 645 438 109 -358 -666 -627 -480 -103 307 555 663 526 163 -317 -547 -631
1659 -631 -540 -216 214 560 623 587 278 -194 -554 -750 -546 -235 156 475 708 617 244 -199 -535 -611 -598 -304
1681 -304 196 514 587 460 254 -39 -499 -681 -543 -243 72 301 588 565 275 -113 -381 -533 -657 -403 3
1702 3 375 533 549 475 30 -408 -668 -640 -330 -11 309 568 643 393 9 -267 -534 -596 -427 -32 323 519
1724 519 579 459 91 -305 -548 -537 -427 -185 264 569 590 484 135 -201 -440 -605 -451 -168 234 389 575
1745 575 502 242 -189 -495 -589 -543 -267 91 436 580 554 223 -148 -395 -609 -530 -212 123 424 579 535 207
1767 207 -74 -417 -556 -482 -307 68 362 519 541 311 -67 -329 -538 -472 -342 -5 319 547 541 353 12 -308
1789 -308 -455 -537 -378 -53 290 522 510 338 116 -240 -536 -594 -384 -4 275 470 550 401 106 -211 -465
$$ packed form
1638f43K1J54L30N36K71k4k07l29m67l08L9J47L77M10K48J08j37l63m80k30q4
1659f31R1L24M30L46O3l6l09m72l60j96K04L11L91L19K33r1l73m43l36p6J3K94
1681c04N00L18P3j27k06k93m60j82J38L00L15K29K87k3k90l88k68j52j24K54M06
1702CL72J58J6p4m45m38k60K8L10L19L20K59P5k50l84k76k67o2J69L95L55J96
1724E19O0j20l68l96k43J1J10K42M49L05K1j06l49l36k39j65J54K83M02J55J86
1745E75p3k60m31l06r4M6K76L58L45J44k6l31l71k47k14P9L18L35L01J55m4l28
1767B07k81l43j39P4J75L75K94J57K2k30l78k62k09O6J30L37L24K28oj88l41l20
1789c08j47q2J59L25L43K32j2j72k22l56k96n8K10L80K79J95Q0j49k95l17k54
$$ plain form
1810 -465 -560 -376 -145 135 466 518 361 117 -215 -418 -616 -478 -72 164 411 521 465 209 -164 -401 -485
1831 -485 -481 -207 151 404 569 470 210 -104 -349 -540 -488 -208 110 363 525 485 260 -98 -350 -551 -418 -276
1853 -276 25 337 403 472 279 15 -310 -562 -528 -256 9 240 443 516 371 44 -250 -437 -493 -352 -105 261
1875 261 497 455 325 129 -192 -449 -492 -325 -83 156 449 523 340 60 -240 -366 -478 -373 -77 145 378
1896 378 422 380 203 -70 -450 -480 -361 -229 108 371 501 391 163 -85 -393 -499 -425 -188 92 373 461 391
1918 391 212 -63 -361 -498 -380 -251 4 294 508 462 250 -6 -289 -401 -381 -244 8 307 434 379 263
1939 263 11 -283 -390 -402 -305 -66 206 416 425 292 105 -173 -401 -469 -299 -36 232 387 404 333 73 -220
1961 -220 -387 -460 -313 -108 212 380 360 316 89 -130 -330 -462 -333 -101 135 332 389 358 166 -214 -313 -391
$$ packed form
1810d65r5J84K31K80L31N2j57k44l32k03j98J38M06K36K47J10n6k56l73k37q4
1831d85MK74L58K53J65r9k60l14k45j91N2K80L18K53J62m0k25l58k52k01J33J42
1853b76L01L12O6O9j93k64l25k52L4K72K65K31K03P3j45l27k94j87n6J41K47L66
1875B61K36m2j30j96l21k57m3J67K42K39K93P4j83k80l00j26j12J05K96K22K33
1896C78M4m2j77k73l80l0J19J32L37K63J30j10k28k48l08j06P4K37K80K81Q8p0
1918C91j79k75k98j37J18J29K55K90K14m6k12k56k83j12K0J37K52K99J27n5j16
1939B63k52k94j07j2R7K39K72K10Rj33j87k78k28o8J70K63K68J55J7p1k60k93
1961b20j67p3J47K05L20J68k0m4k27k19k00j32J29K32K36J97N7l1j92l80r9p8
$$ plain form
1983 -391 -408 -162 86 333 441 414 143 -147 -338 -395 -385 -192 96 317 398 374 216 -92 -282 -372 -401 -180 48
2006 48 335 453 417 233 -81 -274 -397 -424 -207 86 193 331 407 274 -15 -211 -386 -486 -259 -31 192
2027 192 332 375 234 0 -165 -400 -442 -313 -14 171 298 424 314 26 -195 -205 -398 -294 -86 170 276
2048 276 421 283 73 -115 -303 -476 -352 -2 101 292 454 347 98 -184 -274 -400 -326 -116 101 293 371
2069 371 348 107 -92 -152 -359 -367 -158 31 184 394 361 140 -59 -283 -375 -395 -211 47 323 382 332 197 -8
2092 -8 -174 -379 -377 -180 13 197 352 361 181 26 -191 -281 -353 -225 -8 171 330 364 235 55 -191 -303 -345
2115 -345 -298 -70 90 287 359 221 -5 -104 -258 -361 -278 -28 76 338 320 324 93 -109 -268 -339 -311 -122 132
2138 132 231 350 163 130 -107 -253 -380 -316 -54 47 275 281 298 141 -100 -225 -328 -356 -233 5 211 322
$$ packed form
1983c91j7K46K48K47J08k7k71k90j91n7J0J93K88K21Q1k4j58l08j90r0k9K21K28
2006D8K87J18l6j84l14j93j23k7K17K93J07J38P6j33k89j96j75j00K27K28K23
2027A92J40M3j41k34j65k35m2J29K99J85J27J26j10k88k21j0j93J04K08K56J06
2048B76J45j38k10j88j88j73J24L50J03J91J62j07k49k82r0j26P4K10K17J92P8
2069C71k3k41j99o0k07qK09J89J53K10l3k21j99k24r2k0J84K58K76N9n0j35k05
2092hj66k05KJ97J93J84J55Rj80j55k17r0p2J28K17J79J59L4j29j80k46j12m2
2115c45M7K28J60J97P2j38k26r9j54j03Q3K50J04K62j8Mk31k02j59p1K8J89K54
2138A32R9J19j87l3k37j46j27O4K62J01K28OJ7j57k41j25j03k8J23K38K06J11
$$ plain form
2160 322 285 175 28 -205 -414 -325 -167 -2 214 326 319 211 -78 -157 -318 -349 -203 -41 214 378 317 199
2182 199 23 -148 -319 -352 -235 -3 110 285 343 226 85 -153 -366 -395 -204 -82 111 330 338 251 137 -93
2204 -93 -286 -416 -218 -103 38 263 361 261 117 -152 -217 -308 -284 -139 121 361 286 275 141 -48 -239 -356
2226 -356 -278 -63 55 263 327 211 126 -63 -226 -351 -290 -136 40 253 254 258 151 -10 -136 -273 -275 -170 6
2249 6 151 297 291 202 7 -190 -237 -202 -185 -55 165 275 294 213 41 -124 -279 -253 -102 -49 97 287 319 173
2273 173 32 -119 -315 -310 -226 -83 145 228 289 264 60 -159 -264 -282 -237 -65 64 302 277 298 82 -122 -232
2296 -232 -287 -314 -119 89 217 297 245 161 -70 -186 -277 -260 -70 45 164 189 204 174 -43 -185 -291 -280 -168 58
2320 58 130 215 200 133 31 -163 -247 -318 -186 15 142 252 246 191 5 -91 -218 -277 -154 -25 160 240 279 212 17
$$ packed form
2160C22l7j10j47k33k09Q9J58J65K16J12pj08k89p9j61l1J46J62K55J64o1j18
2182A99j76j71j71l3J17K32J13J75N8j17j41k38k13k9J91J22J93K19Qq7j14k30
2204i3j93j30J98J15J41K25R8j00j44k69o5r1K4J45K60K40p5j1j34j89j91j17
2226c56P8K15J18K08O4j16q5j89j63j25O1J54J76K13JMj07j61j26j37kJ05J76
2249FJ45J46oq9j95j97m7L5J7J30K20J10J9q1j72j65j55K6J51N3J46J90L2j46
2273A73j41j51j96NQ4J43K28Q3O1k5k04k19j05j8M5J72J29K38k5K1k16k04j10
2296b32n5k7J95K08J28Q0n2q4k31j16r1J7J90J15J19K5J5l0k17j42j06J1J12K26
2320E8P2Q5j5o7j02j94q4p1J32K01J27J10on5j86r6j27n9J23J29J85Q0L9o7j95
$$ plain form
2345 17 -200 -228 -221 -233 -66 100 272 195 183 56 -87 -242 -260 -202 36 95 167 287 248 62 -71 -246 -252 -200 -104
2370 -104 81 208 236 220 79 -110 -225 -309 -233 -90 63 207 257 209 90 -40 -170 -247 -221 -110 82 195 255
2393 255 190 120 -76 -128 -169 -246 -104 31 116 261 221 129 34 -85 -237 -304 -157 12 169 154 260 154 -23 -118
2417 -118 -191 -225 -157 -39 148 232 234 154 69 -121 -233 -212 -155 -69 131 209 196 160 61 -42 -199 -223 -141 -51 49 212
2443 212 234 154 43 -131 -162 -265 -212 -79 28 136 237 181 30 -82 -125 -227 -214 -26 -13 165 220 171 88 -62
2467 -62 -108 -190 -151 -165 61 175 267 170 74 9 -109 -232 -205 -117 -24 179 208 222 141 5 -90 -187 -234 -158 -59 34 157
2494 157 201 113 -49 -122 -181 -194 -142 -43 63 278 224 53 52 -47 -146 -238 -194 7 108 200 144 119 110 -105 -137 -226 -154
2521 -154 -58 -11 140 207 150 35 -36 -125 -220 -144 -81 40 142 210 189 54 -89 -160 -145 -131 -128 2 66 216 167 74
$$ packed form
2345A7k17k8Pj2J67J66J72p7j2j27j43j55j8N8K38N9P2J20l9j86j33j75oN2R6
2370a04J85J27K8j6j41j89j15q4P6J43J53J44N0m8j19j30j30p7K6J11J92J13O0
2393B55o5p0j96n2m1p7J42J35Q5J45m0r2r5j19j52o7J47J69J57j5J06j06j77r5
2417a18p3l4O8J18J87Q4Kq0q5j90j12K1N7Q6K00P8j3l6r9j03j57k4Q2R0J00J63
2443B12K2q0j11j74l1j03N3J33J07J08J01n6j51j12m3j02J3J88J3J78N5m9q3j50
2467f2m6q2L9j4K26J14R2r7r6o5j18j23K7Q8R3K03K9J4q1j36r5r7m7P6R9R3J23
2494A57M4q8j62p3n9j3N2R9J06K15n4j71jr9r9r2M4K01J01R2n6k5rk15l2q9P2
2521a54R6M7J51O7n7j15p1q9r5P6O3J21J02O8k1j35j43p1J5J4LJ30O4J50m9r3
$$ plain form
2547 74 -37 -105 -118 -148 -125 -12 124 159 208 58 11 -95 -204 -137 -128 6 149 145 163 123 -5 -98 -189 -166 -121 -40 66
2574 66 150 156 164 16 -76 -214 -210 -166 -98 55 155 134 82 20 -96 -162 -167 -120 -28 -13 86 169 158 58 -28 -130 -163 -96 -94
2603 -94 96 124 126 91 100 -19 -182 -174 -140 -65 50 166 120 79 29 -3 -67 -163 -133 -62 -45 129 172 128 87 41 -140 -119
2631 -119 -104 -94 64 95 115 136 107 -12 -168 -96 -155 -78 62 63 129 107 129 28 -78 -179 -144 -126 -43 47 93 152 133
2658 133 24 -101 -104 -165 -160 -41 80 141 100 143 27 -99 -120 -155 -84 -41 36 140 150 140 53 -11 -88 -159 -146 -113 23
2685 23 117 202 126 90 13 -71 -157 -121 -53 30 51 124 114 78 -52 -89 -117 -136 -88 11 93 114 114 101 8 -100 -66 -122 -63 -10
2715 -10 55 105 122 89 -82 18 -138 -159 -107 -68 46 130 126 175 16 -93 -111 -136 -98 -68 15 120 72 96 -8 -97 -102
2742 -102 -160 -121 -73 4 127 158 155 -2 -43 -96 -92 -112 -113 76 49 123 127 21 24 -52 -111 -116 -43 35 53 140 133 92 -15 -38 -124
$$ packed form
2547G4j11o8j3l0K3J13J36L5M9j50m7j06j09O7RJ34J43mJ8m0j28r3r1K3M5Q1J06
2574F6Q4OQj48r2j38MM4O8J53J00k1n2o2j16o6nM7R2J5R9Q3j1j00q6j02l3O7K
2603i4J90K8Kl5Rj19j63QL4P5J15J16m6m1n0l2o4r6L0P1J7J74M3m4m1m6j81K1
2631a19J5J0J58L1K0K1k9j19j56P2n9P7J40JO6k2K2j01j06j01L5J8Q3R0M6N9j9
2658A33j09j25lo1NJ19J21O1m1M3j16j26k1l5P1M3P7J04J0j0q7o4p7p1J3L3J36
2685B3R4Q5p6l6p7q4q6L6O8Q3K1P3j0l6j30l7k8j9M8R9Q2K1%j3r3j08L4n6N9N3
2715a0O5N0J7l3j71J00j56k1N2L9J14Q4mM9j59j09j8k5L8L0Q3J05m8K4j04q9n
2742a02n8L9M8P7J23L1lj57m1n3Mk0jJ89k7P4Mj06Lp6n9nP3P8J8Q7pm1j07k3q6
$$ plain form
2773 -124 -72 -86 17 76 79 85 4 2 -98 -104 -135 -96 39 48 118 97 92 61 -80 -102 -77 -118 36 34 138 76 28 -17 -25 -106 -145
2804 -145 -68 -64 82 94 132 78 40 -22 -37 -103 -97 -41 48 92 83 100 42 24 -88 -78 -85 -26 3 55 151 78 4 -25 -40 -115 -2
2835 -2 -30 7 151 122 51 86 12 -25 -119 -103 -84 36 33 115 95 38 9 -28 -146 -104 -111 -3 8 103 172 60 35 -19 -77
2864 -77 -95 -61 -8 87 95 91 121 23 -54 -77 -97 -48 -39 -16 93 45 112 15 -56 -113 -94 -79 10 12 54 46 93 74 22 -69 -124 -99
2896 -99 -42 8 83 94 76 35 11 -84 -97 -120 -53 51 77 93 117 26 -34 -53 -67 -42 -46 55 129 121 65 95 42 -67 -83 -91
2926 -91 -55 11 60 89 77 77 15 -58 -28 -74 -86 -23 17 71 115 58 -10 7 -42 -98 -61 15 54 70 66 63 1 -2 -73 -35 -136 -26
2958 -26 -4 51 65 40 53 -9 -18 -75 -46 3 60 42 47 112 32 -10 -49 -65 -63 -40 -1 51 84 72 85 -28 -38 -72 -103 -65 33
2989 33 -10 10 81 6 15 -11 -123 -81 -61 -47 49 81 38 30 -40 -19 -71 -36 -63 18 28 84 82 48 32 -4 -22 -20 18 -40 -13 88
$$ packed form
2773a24N2j4J03N9LOq1kj00ol1L9J35RP0k1nl1j41k2K5m1J54kJ04o2m8m5qq1l9
2804a45P7MJ46J2L8n4l8o2j5o6ON6Q9M4rJ7n8j8j12J0pN9K9N2R6p3p4k9j5p5J13
2835bk8L7J44k9p1L5p4l7r4J6J9J20lQ2k0n7k9l7j18M2pJ08J1R5O9j12k5n4n8
2864g7j8L4N3R5QmL0r8p7k3k0M9RK3J09m8O7r7p1n7J9J5Q9KM2qM7j9n2r1n5K5
2896i9N7N0P5J1j8m1k4r5j3k3O7J04K6J6K4r1o0j9j4K5mJ01P4qn6L0n3j09j6q
2926i1L6O6M9K9j2%o2p3L0m6j2O3M0N4M4n7o8J7m9n6L7P6L9J6mlo2lp1L8j01J10
2958b6K2N5J4k5J3o2rn7K9M9N7j8NO5q0m2l9j6KK3L9N2L3j2J3j13j0l4l1L8R8
2989C3m3K0P1p5Rk6j12M2K0J4R6L2m3qp0K1n2L5k7Q1J0N6kl4j6l6j8KL8n8K7J01
$$ plain form
3021 88 79 59 32 -13 -57 -100 -57 11 40 -17 30 48 23 9 -21 -91 -66 -38 36 33 71 42 -3 3 -24 -79 -83 -28 -23 -2 7 49 21
3054 21 -26 -23 -45 -90 -57 -1 12 41 54 90 -36 -35 -30 -99 -39 -24 49 73 39 34 -4 11 -48 -104 15 -6 2 47 31 53 0 -6
3086 -6 -52 -62 -60 -8 7 96 87 39 16 43 1 -20 -73 -55 2 48 99 24 44 4 -106 -44 -53 -96 -28 -24 103 40 -2 21 -59 -63
3118 -63 -66 -18 18 -5 63 51 56 30 -9 -36 -49 -40 8 10 64 33 43 -8 -60 -22 -4 11 -34 -20 1 88 62 11 -4 -40 -54 -27
3150 -27 0 43 111 98 27 96 10 -79 -10 -109 -7 -22 69 88 38 37 -34 -15 1 -40 11 13 63 94 78 10 8 -5 -63 -41 -109
3181 -109 4 4 5 68 67 16 14 -89 -26 -44 -61 14 73 85 34 -11 -12 -32 -31 -3 -16 43 20 84 44 19 -32 33 28 1 14 -3
3213 -3 63 40 43 83 -12 -46 -36 7 -65 29 63 94 51 1 10 -56 -57 -74 4 -43 46 75 16 20 -4 -93 -119 -18 -50 -47 29 29 -8
3246 -8 -15 -12 -29 -20 -33 -52 -42 6 29 25 -22 27 25 -9 -53 -46 -54 -2 44 44 91 32 4 41 -103 -97 14 -24 38 61 18 60 28 -43
$$ packed form
3021H8rk0k7m5m4m3M3O8K9n7M7J8k5j4l0p0K5K8P4lL8k9m5Ok7n5mN5NK1RM2k8
3054B1m7Lk2m5L3N6J3K9J3L6j26JNo9O0J5P3K4l4nl8J5n9n6J19k1QM5j6K2n3o
3086fm6j0KN2J5Q9rm8k3K7m2k1n3J8N7M6N1p5K0m0j10O2rm3O8MJ27o3m2K3q0m
3118f3lM8L6k3O8j2Nk6l9k7j3RM8KN4l1J0n1n2L8J8J5m5J4K1Q7k6n1j5l6j4K7
3150b7K7M3O8j3p1O9q6q9O9r9J02j5R1J9n0jp1J9J6m1N1KN0L1j6o8kj3n8K2o8
3181a09J13%JO3jn1kj03O3j8j7P5N9J2n1m5jk0JK8j3N9k3O4m0k5n1O5nk7J3j7
3213cO6k3LM0r5l4J0M3p2R4L4L1m3n0Ro6jj7P8m7Q9K9n9Mk4q9k6J01l2LP6%l7
3246hpLj7Rj3j9J0M8K3mm7M9kl4m4PqN2M6%M7n9k8L7j44OJ11l8O2K3m3M2l2p1
$$ plain form
3280 -43 -41 -86 -67 3 7 89 30 -13 -28 -90 -42 -33 -36 61 15 32 93 56 -6 -5 -9 -36 -7 -11 39 3 35 38 -4 -23 -37 -47 -23 -1
3314 -1 35 102 6 57 20 -21 -49 -126 -73 -11 25 47 22 55 58 -20 -31 -70 -29 15 73 91 37 31 36 3 -43 -57 -28 4 15 -4
3346 -4 72 74 59 -27 -15 11 -91 -5 33 4 43 60 -2 -5 -53 -89 -80 -62 31 -11 6 37 40 31 -15 -94 -39 -33 -66 -12 81 30 43
3379 43 50 34 -24 -102 17 -22 53 72 120 70 6 -57 -18 -39 -34 -10 54 2 -15 110 62 20 -68 -50 -52 -69 11 0 17 28 30
3410 30 -6 -60 -58 -37 3 54 12 57 38 18 -14 -78 -54 -2 8 -19 64 105 73 2 9 -4 -50 -61 -37 5 54 31 35 17 -78 -1
3442 -1 -105 -40 -94 -8 -10 12 79 -2 9 -74 -89 -57 -66 -5 -22 44 97 45 -26 -27 -24 -28 -23 -25 13 94 32 60 4 -6 -61 -43 -100 -14
3476 -14 -46 21 86 22 52 -8 -37 -41 -27 -27 -1 -8 46 75 10 -1 -37 -98 -101 -45 -15 54 74 59 4 0 -43 -43 -125 -42 -34 46 -26 15
3510 15 6 58 -18 -17 -40 -79 7 2 124 80 35 -30 -56 -106 -73 7 -18 7 40 5 44 -18 -10 -60 -82 -140 -75 -10 11 75 28 11
$$ packed form
3280d3Km5J9P0MQ2n9m3j5o2M8RlR7m6J7O1l7o2Jmk7K9mN0l6L2Lm2j9j4j0K4K2
3314aL6O7r6N1l7m1k8p7N3O2L6K2k5L3Lp8j1l9M1M4N8J8n4oNl3m6j4K9L2J1j9
3346dP6Kj5q6J2K6j02Q6L8k9L9J7o2lm8l6RJ8R3m2J7L1Lrm6p9N5Ol3N4R3n1J3
3379D3Pj6n8p8J19l9P5J9M8n0o4o3L9k1NK4O4n2j7J25m8m2q8J8kj7Q0j1J7J1K
3410C0l6n4KK1M0N1m2M5j9k0l2o4K4N2J0k7Q3M1l2p1Pj3m6j1K4M2M9k3Mj8r5P7
3442aj04O5n4Q6kK2O7q1J1q3j5L2rO1j7O6N3n2p1jLmNkL8Q1o2K8n6j0n5J8n7Q6
3476a4l2O7O5o4L0o0k9mJ4%K6pN4K9o5j1l6o1lN6L0O9K0j5n5mm3%q2Q3QQ0p2M1
3510A5rN2p6Jk3l9Q6nJ22m4m5o5k6n0L3Q0k5K5L3l5L9o2Qn0k2n8O5O5K1O4m7j7
$$ plain form
3542 11 -86 -55 -37 -123 -85 75 33 77 33 13 0 -20 -99 -22 -70 68 65 88 73 88 15 -23 12 -46 -15 10 -34 90 85 49
3572 49 16 -27 -44 -103 -67 -36 12 36 45 92 -2 -44 -81 2 -40 -15 51 75 60 -9 19 -22 -51 -71 -43 11 19 18 56 1 -13 -1
3604 -1 -94 -100 -87 -46 16 64 44 73 -10 -16 -40 -81 -91 -62 -7 6 68 37 -33 -45 -40 -91 -85 7 -21 32 93 -24 10 -30 6 -75
3636 -75 -60 -93 18 37 65 35 46 53 3 -79 -17 1 -5 14 36 145 41 2 -61 -71 -75 -24 1 76 82 25 66 25 7 -45 -107
3667 -107 -52 23 -26 71 47 64 -13 20 -53 -52 -42 -80 19 84 27 85 60 -23 33 -33 -54 23 -44 -4 40 22 -6 -2 -41 -82 -27
3698 -27 23 13 1 79 44 54 -17 -50 -74 -113 -42 3 19 88 133 6 64 15 -64 -47 18 25 38 83 51 57 23 -5 -7 -34 -80
3729 -80 -59 21 55 61 53 -10 -41 -42 -79 -54 -8 31 31 70 74 34 -42 -103 -47 -30 -25 37 75 65 46 52 49 -18 -14 -25 16 51 61 47 47
3764 47 52 -24 18 -87 -26 3 9 27 52 16 77 -16 31 -88 -13 -42 25 29 36 23 21 -25 -69 -9 -61 -7 -22 14 44 17 56 0
$$ packed form
3542A1r7L1J8q6L8J60m2M4m4k0j3k0p9P7m8J38lK3j5J5p3l8L5n8L1K5m4J24nl6
3572D9l3m3j7n9L6L1M8K4RM7r4m2l7Q3m2K5O6K4j5o9K8m1k9k0K8N4QjL8n5j4J2
3604ar3oJ3M1O2M8k0K9q3ok4m1j0K9N5J3O2l1p0j2Nn1OR2k8N3O1j17L4m0L6q1
3636g5J5l3J11J9K8l0J1Pn0q2O2J8oJ9K2J09j04l9o3j0mN1K5P5On7M1m1j8n2o2
3667a07N5P5m9R7k4J7p7L3p3JJ0l8R9O5n7N8k5q3N6o6k1P7o7M0M4j8k8Ml9m1N5
3698b7N0j0j2P8l5J0p1l3k4l9P1M5J6O9M5j27N8m9p9J7O5PJ3M5l2Ol4k8kk7m6
3729h0K1Q0L4Oqo3l1jl7K5M6L9%L9Mm0p6o1N6J7NO2L8j0j9Olo7Mj1M1L5J0j4%
3764D7Np6M2j05O1K9OJ8K5l6O1r3M7j19P5k9O7MPj3km6m4O0n2N4j5L6L0k7L9n6
$$ plain form
3796 0 -14 -19 -19 -15 -85 33 34 81 42 14 39 -65 -57 -53 -24 12 70 109 84 19 1 -87 -60 -44 -34 4 37 46 43 19 -19 -16 -134 -32
3830 -32 -80 34 47 37 39 18 -30 -82 -86 -46 -43 -1 -14 33 40 21 -4 -6 -89 -47 -32 10 16 85 96 85 38 -22 -70 -59 -57 -3 7
3863 7 36 15 75 22 -4 -75 -56 -58 -24 25 25 66 51 -17 -27 -63 -86 -17 -60 5 44 64 14 -22 -31 -35 -33 -61 -39 -29 8 71 93
3896 93 37 -15 -39 -35 -47 -18 19 44 47 56 77 -10 -47 -66 -20 -38 44 6 52 51 -13 -4 -45 -61 -59 -7 11 44 67 105 11 -4 -35
3929 -35 -64 -41 -67 9 17 13 51 99 -25 -27 -90 -34 -36 13 3 -7 62 76 61 -59 -74 -50 -87 -38 6 -16 40 -13 13 52 -37
3960 -37 -60 -31 -6 -2 50 93 5 36 -44 -35 -66 -75 -15 -5 14 94 88 35 14 -29 -66 -61 -50 15 30 76 53 16 -11 -60 -74 -32 11
3993 11 1 -36 77 52 89 -31 -37 -78 -31 -23 48 100 38 9 12 3 -12 21 -13 -23 -47 -30 54 32 25 19 -4 -75 -6 -76 -31 -8
4025 -8 58 97 -41 12 2 -7 -77 -33 1 -12 72 59 -27 34 -74 -73 -87 -28 -52 25 49 27 30 -9 1 -64 -87 -6 -20 9 28
$$ packed form
3796@j4n%Mp0J18JM7l9k8K5j04QMK9L6N8L9k5o5j8q8K7J6J0L8L3Rlk4l8Lj18J02
3830c2m8J14J3j0Kk1m8n2mM0LM2j3M7Pj9k5kq3M2J5M2OO9J1j1m7o0m8J1KN4J0
3863GK9k1O0n3k6p1J9kL4M9%M1j5o8j0l6k3O9m3O5L9K0n0l6rmKk8K2J0L7O3K2
3896I3n6n2k4Mj2K9L7K5LRK1q7l7j9M6j8Q2l8M6jo4Rm1j6KN2J8L3K3L8r4j5l1
3929c5k9K3k6P6QmL8M8j24ko3N6kM9j0j0O9J4j5j20j5K4l7M9M4k2N6n3K6L9q9
3960c7k3K9K5MN2M3q8L1q0Rl1rO0J0J9Q0on3k1m3l7NJ1O5J5M6k3l7k7m9j4M2M3
3993A1j0l7J13k5L7j20om1M7QP1N2o2k9Lrj5L3l4j0k4J7Q4k2pok3p1O9p0M5K3
4025hO6L9j38N3j0rp0M4L4j3Q4j3q6O1j08Jj4N9k4P7K4k2Ll9J0o5k3Q1j4K9J9
$$ plain form
4056 28 21 38 80 47 -42 -55 -18 -46 -2 17 48 41 44 -15 -21 -17 -11 -8 3 14 20 51 -23 -26 8 -15 -67 -59 14 31 61 64 52 -19 8 -27
4092 -27 -31 -44 -26 78 -7 76 24 15 -23 12 -103 -71 -36 0 65 59 41 6 -45 -20 -5 -51 -61 18 52 48 32 46 -49 -51 -64 -63
4124 -63 -44 44 62 32 56 13 -34 -27 -33 -85 -54 7 60 48 61 36 38 -74 -4 10 -12 -11 75 -1 66 82 10 -79 -52 -79 -68 60
4156 60 94 52 -22 11 -17 -66 -53 -97 -40 -12 48 136 44 51 13 7 -45 -39 -2 -65 -7 19 10 23 16 -76 -63 -84 0 4 -2 13 82 91
4190 91 11 -3 -36 -45 -131 18 31 53 -1 94 38 -88 -32 -68 -19 -22 36 41 64 19 19 37 -56 -33 -49 -67 3 13 65 18 44
4221 44 -13 -61 -47 -90 12 -7 94 56 85 38 -5 -15 -9 -45 8 36 -2 36 57 -5 32 -68 -72 -33 -20 8 -13 -21 -12 -7 -51
4252 -51 53 -45 -23 -16 -19 29 18 22 46 -18 -61 -42 -36 -88 0 59 77 83 12 28 -47 -10 -56 -6 2 39 1 46 61 -27 -89 -49 -54
4285 -54 -25 17 8 75 14 29 12 8 -61 -90 -56 -54 35 59 37 -44 37 25 -25 -40 -9 16 22 57 13 32 38 41 -51 -21 8 0 23 44
$$ packed form
4056B8pJ7M2l3q9j3L7k8M4J9L1pLn9oMOLJ1J1OL1p4lL4k3n2QP3J7L0Lj2p1K7l5
4092b7mj3J8J04q5Q3n2rl8L5j15L2L5L6O5oj8l5n1K5J5m6j0P9L4mj6J4r5kj3J
4124f3J9Q8J8l0K4m3m7Pon2L1O1N3j2J3k5Kj12P0J4k2JQ6p6O7J6p2q9K7k7J1J28
4156F0L4m2p4L3k8m9J3m4N7K8O0Q8r2Pl8on2OL7o3N8K6rJ3pr2J3k1Q4MoJ5O9R
4190I1q0j4l3rq6J49J3K2n4R5n6j26N6l6M9lN8NK3m5%J8r3K3j6j8P0J0N2m7K6
4221D4n7m8J4m3J02j9J01l8K9m7m3j0Ol6N3K8l8L8K1o2L7j00mL9J3K8k1qRNm4
4252e1J04r8K2PlM8j1MK4o4m3J9On2Q8N9J8Op1J6p5L7m6N0QL7l8M5J5q8o2M0n
4285e4K9M2rO7o1J5j7mo9k9L4KQ9K4k2q1Q1j2n0j5L1K5OL5m4J9OLr2L0K9qK3K1
$$ plain form
4319 44 69 79 11 -22 -72 -37 -38 19 -5 33 -4 62 89 13 -30 -5 -100 -68 -5 -1 71 45 30 11 -25 -66 -48 -80 -32 65 45
4350 45 4 61 16 -13 -50 -74 -23 16 41 44 58 35 72 41 -64 -55 -50 -15 34 -4 12 68 38 -32 -41 -3 10 -11 -6 72 54 47 9
4383 9 -56 38 -67 -69 16 30 68 12 81 67 -7 -53 23 1 3 11 33 51 57 35 10 -52 -20 -20 -23 -37 50 15 16 -2 -3 -70 -49 -52 -90
4418 -90 45 76 72 62 53 16 3 -83 -55 -74 29 13 64 22 -17 37 -17 -37 65 -10 11 44 7 77 32 48 -57 -63 -82 -42
4448 -42 -46 -27 29 95 -14 -35 -13 -16 -46 -37 -7 -10 63 51 10 -31 -6 -55 18 -51 -105 41 9 22 -11 -6 -16 -23 15 -53 30 2
4480 2 64 85 54 31 -22 -46 -52 -8 -25 42 -9 10 19 31 -38 0 -15 -48 -47 -22 25 -11 91 51 -6 -37 -5 -68 -5 9 -5 48
4512 48 76 3 32 7 -91 -48 0 3 23 44 70 48 66 -36 16 -5 39 38 39 54 29 -20 40 12 -55 -49 -39 7 -31 39 6 56
4544 56 6 -31 -71 -25 -60 28 27 15 36 34 -27 14 -21 26 -35 -20 -4 13 -18 5 -10 -18 -21 -65 -56 26 22 -26 42 41 68 18 -10 -77
$$ packed form
4319D4K5J0o8l3n0L5jN7k4L8l7O6K7p6m3K5r5L2O3MP2k6j5j9l6m1J8l2M8R7k0
4350D5m1N7m5k9l7k4N1L9K5LJ4k3L7l1j05RNL5M9l8J6N6l0p0rL8J3k1NP8j8pl8
4383Io5R4j05kQ5J4L8n6O9j4p4m6P6k2KQK2J8Ok2k5o2L2%lj4Q7l5Jj8jo7K1ll8
4418i0J35L1mj0rl7j3q6K8j9J03j6N1m2l9N4n4k0J02p5K1L3l7P0m5J6j05oj9M0
4448d2mJ9N6O6j09k1K2ll0RL0lP3j2m1m1K5m9P3o9n4J46l2J3l3Nj0pL8o8Q3k8
4480BO2K1l1k3n3k4oM4j7O7n1J9RJ2o9L8j5l3JK5M7l6J02m0n7l1L2o3O3J4j4N3
4512D8K8p3K9k5r8M3M8LK0K1K6k2J8j02N2k1M4jJJ5k5m9O0k8o7OJ0M6l8P0l3N0
4544E6n0l7m0M6l5Q8jj2K1ko1M1l5M7o1J5J6J7l1K3j5qlm4RQ2mm8O8jK7n0k8o7
$$ plain form
4578 -77 -23 -31 -45 -12 4 93 87 -7 -78 -25 -45 -19 19 18 -24 13 25 -40 -23 -40 -56 8 12 -21 12 29 29 10 -19 14 18 -16 -9 52
4612 52 51 -15 -23 13 -28 -3 -79 16 -10 -7 -4 1 38 -3 -15 -28 -39 -6 3 -28 4 94 -23 -1 -16 -50 -43 -41 1 -29 -8 68 69 -5
4646 -5 57 -75 -37 -42 73 24 -37 49 -27 -27 -31 -35 -76 -6 -50 -49 -4 52 55 7 -29 -43 -27 13 -68 -2 12 46 -20 37 17 6 -35
4679 -35 -38 -4 -80 38 20 -12 38 28 53 54 -19 -51 -13 35 9 36 55 -22 67 -73 -64 17 -28 15 9 17 23 -37 33 -59 19 -3
4711 -3 30 -13 -34 54 -32 18 -16 50 -25 -55 20 -7 57 32 -4 1 18 -35 -10 5 12 -1 2 -9 46 32 -33 -55 -5 29 -5 -11 -33
4744 -33 -48 45 29 -44 -39 -31 -63 1 26 8 -3 51 9 -71 -35 18 12 -54 46 14 5 26 53 -3 -46 -6 -1 20 -15 54 17 27
4776 27 43 -37 45 -54 15 -33 30 -11 -2 55 -19 -30 -40 -47 -72 -28 -20 1 -5 35 22 -18 -14 -23 -15 -9 -13 26 12 32 -10 1 30 -21 -39
4811 -39 -4 27 25 71 31 26 -38 -14 10 -22 71 0 3 30 22 -7 -61 36 28 -5 -6 26 21 49 -43 62 -9 -16 -39 -11 -14 2 -5 21 -24
$$ packed form
4578g7N4qj4L3J6Q9or4p1N3k0K6L8jm2L7J2o5J7j7j6O4Ml3L3J7%j9k9L3Ml4PO1
4612E2jo6qL6m1K5p6R5k6LLNL7m1j2j3j1L3Rl1L2R0j17K2j5l4PKM2l0K1P6Jp4
4646eO2j32L8nJ15m9o1Q6p6%mmm1P0m4JM5N6Lm8l6j4J6M0q1O6J4L4o6N7k0j1m1
4679c5lL4p6J18j8l2N0j0K5Jp3l2L8M8k6K7J9p7Q9j40RQ1m5M3oQOo0P0r2P8k2
4711cL3m3k1Q8q6N0l4O6p5l0P5k7O4k5l6NJ7n3K5J5Pj3Lj1N5j4o5k2N0L4l4ok2
4744c3j5R3j6p3NQl2O4K5j8j1N4m2q0L6N3oo6J00l2rK1K7n6m3M0NK1l5O9l7J0
4776B7J6q0Q2r9O9m8O3m1RN7p4j1j0pk5M4QK1oM0j3m0MrQOmL9j4K0m2J1K9n1j8
4811c9L5L1kM6m0no4K4K4l2R3p1LK7qk9n4R7ql3jL2nK8r2J05p1pk3K8lJ6pK6m5
$$ plain form
4846 -24 -4 10 21 -25 -3 11 -14 -1 43 17 -5 46 15 5 49 6 45 -8 45 14 17 -36 -7 21 41 -7 16 -66 -3 36 -95
4877 -95 -7 -18 -39 -81 -41 -14 -6 -14 -7 41 32 47 -59 -42 -72 31 6 0 51 52 55 -38 -39 -15 17 -46 -30 2 3 -3 -28 -5 -40 50
4911 50 40 17 -50 -11 31 -8 -8 -4 -17 19 -25 -40 -21 41 -25 16 -3 -36 -40 -23 -47 14 -45 -45 35 31 39 30 32 -15 -26 10 12 15 -4
4946 -4 -6 36 -46 -23 -4 -82 53 38 22 5 39 -26 61 -10 23 21 11 69 -23 79 24 -38 -39 1 -18 -53 -11 -5 9 -29 42 32
4978 32 -25 10 -44 -29 -2 9 21 -2 -14 4 -31 -5 -34 -18 -12 -59 24 11 -30 -24 -3 -18 -71 -55 14 -21 25 -14 -15 -5 23 20
5010 20 -8 -31 22 -15 -77 26 24 18 26 17 -78 -25 -37 -22 -29 79 -8 59 27 -41 -29 6 7 -34 5 -50 47 7 23 10 -21 -21 -69
5043 -69 -46 -16 5 19 16 -57 5 -92 -43 -66 -46 -11 73 -10 25 -53 45 -54 25 -5 5 -15 5 10 57 -16 32 22 -1 -9 39 -19
5075 -19 31 -2 -11 6 -46 -13 -26 -21 -34 -19 8 -6 -30 -7 -55 6 -33 58 -44 -19 7 -20 19 19 43 5 -14 -2 51 -29 -25 8
$$ packed form
4846b4K0J4J1m6K2J4k5J3M4k6k2N1l1j0M4m3L9n3N3l1Ln3K9K8K0m8K3q2O3L9j31
4877i5Q8j1k1m2M0K7QqPM8rJ5j06J7l0J03k5oN1JLr3jK4L2o3J6L2Jok5K3l5R0
4911E0j0k3o7L9M2l9%Mj3L6m4j5J9O2o6M1j9l3mJ7k4O1n9%Q0mQrKm7j1L6KLj9
4946dkM2q2K3J9p8J35j5j6j7L4o5Q7p1L3kj0N8r2J02n5o2jM0j9l5M2OJ4l8P1j0
4978C2n7L5n4J5K7J1J2k3j2J8l5K6k9J6Om7Q3j3m1OK1j5n3J6O9l5M6l9jJ0K8l
5010B0k8k3N3l7o2J03koQrr5N3j2J5pJ08q7O7l2o8J2L5Jm1L9n5R7m0J6j3l1%m8
5043f9K3L0K1J4lp3O2r7M9k3K0L5Q4q3L5p8R8r9P9l0J0k0K0NM7p3M8j0k3qM8n8
5075a9N0l3rJ7n2L3j3Nj3J5K7j4k4K3m8O1l9R1j02K5K6k7L9%K4l8j9J2N3q0ML3
$$ plain form
5107 8 -8 17 -34 53 -30 -66 32 -9 -12 10 -28 33 17 3 -22 -2 -25 -32 -26 22 -20 -17 -2 -44 -32 -95 -13 -1 4 51 -11 -3 10 10
5141 10 10 3 1 -9 -19 7 15 36 -12 4 -15 -42 -31 -8 24 -73 -14 0 14 0 -36 -35 11 20 7 38 -24 -6 9 -21 -35 -25 -8
5174 -8 -44 -29 14 35 -66 -59 4 48 -7 3 1 -30 30 67 94 -35 50 -31 -4 61 -16 -34 15 -8 56 38 -8 -19 -31 -18 1
5205 1 -54 56 9 -22 3 2 -49 -18 2 -34 40 -31 22 18 17 -26 -4 14 13 -31 -11 22 58 -4 -3 -10 6 -13 -1 -1 -13 -26 16 -22
5239 -22 -12 17 -8 9 7 -34 9 -7 -3 47 36 19 -36 -65 -31 -39 -37 -8 -13 45 10 -9 50 -19 -17 19 -15 17 -16 7 65 -38 -17
5272 -17 -30 35 22 -67 23 10 19 59 72 -60 -36 -48 -5 -3 -33 -13 24 -20 -44 16 2 -21 -11 9 30 43 52 7 -48 3 -23
5303 -23 -7 19 26 2 50 -15 76 -33 -28 -7 -2 -33 58 0 41 35 -3 10 -30 -64 -66 5 -15 70 41 -20 39 -1 11 23 -36 25
5335 25 11 -23 -45 -13 -10 11 0 -5 -44 -13 19 -5 14 55 25 4 0 -49 -22 -65 -10 4 -21 -2 -10 63 64 49 24 -8 9 40 -10
$$ packed form
5107Hj6K5n1Q7q3l6R8m1lK2l8O1j6j4k5K0k3pOM8m2LJ5m2J2o3Q2J2NM7o2QJ3%
5141A0%pkj0j0K6QK1m8J6j9k7J1K3L2r7N9J4J4j4l6JM6Rj3L1o2J8J5l0j4J0J7
5174hl6J5M3K1j01PO3M4n5J0kl1O0L7K7j29Q5q1K7O5p7j8M9k3O4j8m6j1j2J3J9
5205An5J10m7l1K5jn1L1K0l6P4p1N3mjm3K2J8jm4K0L3L6o2JpJ6j9J2%j2j3M2l8
5239b2J0K9k5J7km1M3j6MN0j1j7n5k9L4qKK9nN8l5j9N9o9KL6l4L2l3K3N8j03K1
5272a7j3O5j3q9R0j3RM0J3j32K4j2M3Kl0K0L7m4k4O0j4k3J0K0K1J3Rm5n5N1k6
5303b3J6K6Pk4M8o5R1j09NK1Nl1R1n8M1ol8J3m0l4kP1k0Q5k9o1N9m0J2J2n9O1
5335B5j4l4k2L2LK1j1nl9L1L2k4J9M1l0k1mm9K7m3N5J4k5J9qP3Jj5k5l2J7L1n0
$$ plain form
5368 -10 -28 -8 30 -37 23 -21 -39 -25 5 14 1 13 18 -16 -42 1 -8 -9 -68 -17 25 -15 21 45 14 -6 -10 2 -31 -25 69 -13 24
5401 24 10 -19 -3 -39 20 -20 -30 33 86 49 10 49 -32 -30 -33 -31 32 -5 -40 22 25 21 -13 -40 1 -28 -3 36 -49 12 26 -38 -46
5434 -46 -4 -29 -27 0 -7 37 69 25 -25 45 -10 -32 -16 -58 42 -1 52 25 6 12 -61 -47 -16 -18 -30 6 -9 6 -51 -4 -11 -14 7
5467 7 -48 60 49 52 10 31 27 1 -41 -59 3 13 41 15 84 39 46 9 1 -51 8 -28 9 32 51 39 19 -29 -1 -1 -8 18 -34
5500 -34 -13 28 -1 59 15 -21 -48 -27 -21 -27 -6 15 10 7 15 -14 -23 -1 47 64 25 39 57 -59 24 -45 -40 -71 8 39 3 80 55
5533 55 17 -46 24 -30 -43 13 21 7 22 26 10 -15 -17 -32 -39 -54 -36 45 32 23 -13 17 24 -30 -29 -50 -33 35 -11 35 45 -26 -21 14
5567 14 -28 27 -5 1 -9 11 60 -30 -59 -115 -28 -5 25 -2 -32 9 10 -51 -33 -18 -43 -7 -51 12 -13 30 -17 11 -5 -30 -86
5598 -86 2 -20 25 58 -3 23 4 -9 6 7 21 -40 28 58 -2 78 28 -46 35 -22 -31 -9 13 29 -27 31 22 22 -39 -5 7 -29
$$ packed form
5368a0j8K0L8o7O0m4j8J4L0Rj3J2Nl4k6M3rjn9N1M2m0L6K4l1k0mJ2l3OR4q2L7
5401B4j4k9J6l6N9m0j0O3N3l7l9L9q1KlKO3l7l5O2Lml4k7M1k9K5L9q5O1J4o4q
5434d6M2k5KK7pM4L2m4n0P0n5k2J6m2J00m3N3k7j9Op3J4L1kj2L6j5J5n7M7plK1
5467Gn5J08j1Lm2K1mk6m2j8O2J0K8k6O9m5Pl7qn2N9l6L7K3J9j2k0m8K8%pK6n2
5500c4K1M1k9O0m4l6k7K1OoK1K1nlQk9rK2M8J7l9J4J8j16Q3o9Nl1P9L1l6P7k5
5533E5l8o3P0n4j3N6Qj4J5Mj6k5kj5pj5J8Q1j3rl6L0Pn4Jk1J7O8m6M6J0p1NL5
5567A4m2N5l2Oj0K0M9r0k9n6Q7K3L0k7l0M1Jo1J8J5k5L6m4O3k5M3m7K8j6k5n6
5598h6Q8k2M5L3o1K6j9j3J5JJ4o1O8L0o0Q0n0p4Q1n7rK2K2J6n6N8r%o1L4J2l6
$$ plain form
5630 -29 41 32 1 50 31 -4 -10 -10 -41 -18 22 -14 -3 43 -3 -29 -11 4 -57 -22 -7 50 8 56 -2 -2 -2 2 -36 -15 -31 53 1
5663 1 26 22 -14 -20 -47 12 -52 -27 28 -16 -5 -12 3 -22 -21 -71 -54 -45 -35 27 -13 59 15 10 -51 -7 -14 -30 -37 -12 32 -8 -1 13 -9
5698 -9 -9 -43 31 8 26 46 44 32 -5 15 -22 1 -76 -15 3 55 69 20 -31 -31 -40 -23 -32 44 1 3 28 -20 -5 -44 -77 -51 -11 2
5732 2 72 65 33 25 30 -13 -7 -14 1 58 34 -17 86 79 -22 -7 -22 -5 -54 27 -59 -8 17 -37 41 -2 -55 -77 -77 -28 -8 -14 37 -28
5766 -28 5 4 -21 -71 -82 1 -62 40 30 3 6 4 -30 -29 -8 -13 44 -7 30 32 40 -7 18 -15 -13 -12 -34 4 21 -4 -12 57 -22 51 6
5801 6 -16 12 29 28 32 11 -34 -54 -17 -104 -8 -75 -3 63 83 -8 46 22 -65 -36 -26 59 15 26 -4 -1 -6 -31 -4 -19 -32 4 -36
5834 -36 -13 -36 -19 -32 3 -32 -17 -48 -65 -40 0 50 -12 -41 29 -41 -15 13 -51 3 30 46 -9 1 -20 -9 -35 -30 -26 -41 11
5865 11 86 14 -15 -55 -7 -67 -21 -65 -9 21 33 62 22 -13 28 -46 -23 -54 2 30 33 18 -76 16 -15 -9 -41 23 -26 -1 90
$$ packed form
5630b9P0rl1M9j9l5o%l1K3M0l6J1M6m6k6J8J5o1L5J5N7m2M8n8%%Ml8K1j6Q4n2
5663AK5ml6ok7N9o4K5N5m4J1pJ5k5Jn0J7RJ0O2m0P2m4no1M4pj6pK5M4m0PJ4k2
5698i%l4P4k3J8K0kj2l7K0l7K3p7O1J8N2J4m9n1%rJ7rP6m3KK5m8J5l9l3K6M0J3
5732BP0pl2qNm3OpJ5N7k4n1J03pj01J5j5J7m9Q1q6N1K5n4P8m3n3k2%M9K0oN1o5
5766b8L3jk5n0j1Q3o3J02j0k7Lkl4JK1nN7n1L7KQm7K5l3KJk2L8J7k5qO9p9P3m5
5801Fk2K8J7jMk1m5k0L7q7R6o7P2O6K0r1N4k4q7K9J0Q5m4J1l0Lnk5K7j5j3L6m0
5834c6K3k3J7j3L5l5J5l1j7K5M0N0o2k9P0p0K6K8o4N4K7J6n5J0k1J1k6NMj5N2
5865A1P5p2k9m0M8o0M6m4N6L0J2K9m0l5M1p4K3l1N6K8Lj5r4R2l1Ol2O4m9K5R1
$$ plain form
5896 90 19 -17 49 32 -58 9 -11 -42 5 16 -5 32 35 -61 -24 -52 60 -47 -33 1 87 12 31 -58 -85 -1 -5 -31 -25 42 -20
5927 -20 17 -19 7 -2 -54 -29 -98 -43 18 -55 13 -20 -4 -50 22 33 14 25 -40 30 -13 19 -17 31 -29 -27 36 -14 64 52 26
5958 26 -19 13 -51 -47 -41 -14 -59 -45 -35 16 1 -24 -20 -70 -60 -100 -17 -8 39 36 49 14 49 -54 -9 -47 -9 25 22 -8 63 13 -37
5991 -37 -39 -54 10 29 28 69 41 34 16 5 -75 -42 26 57 -5 38 65 5 13 -21 -39 -20 -56 -15 1 12 13 -6 6 7 30 -76 -54
6024 -54 3 13 -17 39 40 -39 7 -4 -49 36 -46 -4 21 65 6 2 -22 36 -9 -16 -109 26 -40 25 -7 31 2 6 -9 -4 14 -27
6056 -27 -26 -6 -51 38 -9 38 -83 -36 49 19 -27 35 59 -31 78 -21 -3 10 -37 7 79 38 36 43 -24 -46 -59 -30 -70 -44 76
6087 76 20 33 70 33 -2 -73 9 -52 -30 -32 75 23 37 -41 21 -21 -25 -81 -18 35 1 22 31 50 -47 37 -43 -40 -31 35 56 20
6119 20 35 24 -9 -20 -40 -43 -24 54 31 -28 34 -8 43 -59 -22 -41 2 -43 28 -23 -11 6 -2 -3 -65 17 -40 -26 -5 39 -34
$$ packed form
5896I0p1l6O6j7r0O7k0l1M7J1k1L7Lr6L7k8J12j07J4L4Q6p5J9q9k7Q4mk6OO7o2
5927b0L7l6K6rn2K5o9N5O1p3O8l3J6m6P2J1j9J1o5P0m3L2l6M8o0KO3n0P8j2k6
5958B6m5L2o4MOK7m5J4J0N1j5k5Mn0J0m0Q3RM7lJ3l5L5j03M5l8L8L4ll0P1n0n0
5991c7kj5O4J9jM1k8pj8j1q0L3O8L1o2M3K7o0Ql4j8J9l6M1J6J1Jj9J2JK3j06K2
6024e4N7J0l0N6Jp9M6j1m5Q5q2M2K5M4n9mk4N8m5pr3J35o6O5l2L8k9Mj5NJ8m1
6056b7JK0m5Q9m7M7j21M7Q5l0m6O2K4r0J09r9J8J3m7M4P2m1kPo7k2j3K9m0K6J20
6087G6n6J3L7l7l5p1Q2o1K2kJ07n2J4p8O2m2mn6O3N3l4K1RJ9r7Q4q0LRO6K1l6
6119B0J5j1l3j1k0lJ9P8k3n9O2m2N1j02L7j9M3m5P1n1J2J7qjo2Q2n7J4K1M4p3
$$ plain form
6150 -34 7 13 -108 -22 -84 -14 -47 21 2 20 55 14 -13 31 -20 -87 13 -13 23 19 33 14 -40 -42 -42 -46 21 15 -20 -28 28 24 -62
6183 -62 -23 -74 -32 22 23 16 9 18 11 -25 -4 -13 -48 -2 20 -43 95 49 34 -5 -32 -25 14 -26 64 16 2 17 -9 8 6 -40 -33 -65
6217 -65 -28 16 -18 -6 10 8 -4 -21 -19 -67 -15 -19 26 11 10 6 3 23 -44 -47 44 67 41 42 8 49 -20 -40 -51 -59 -34 -43 53 63 17
6252 17 -17 39 5 -68 12 -37 -55 42 62 35 36 43 20 -61 -27 5 4 -9 20 47 86 39 -48 2 -25 -49 12 9 32 24 55 82 -55
6285 -55 17 12 -30 -31 -24 17 -54 68 23 -3 -28 -7 -45 -59 -47 -27 33 27 -21 -61 -45 -60 -46 -73 -2 53 32 63 0 8 -22 -26 -56
6318 -56 -8 -13 38 5 80 7 16 -46 -91 34 2 18 51 -3 25 87 -23 -47 -19 -29 -2 17 88 51 6 -22 -18 -32 -78 -31 -22
6349 -22 14 -45 -29 74 23 -85 -29 -8 -31 -25 -6 -5 -2 52 -21 16 -68 -105 -27 -11 20 -35 -22 43 -25 16 -17 -55 -101 -44 -5
6380 -5 -72 -6 54 -28 9 30 22 16 -21 -57 22 -26 11 7 -12 -68 -24 17 -94 -32 -23 48 40 8 -9 25 13 -31 -42 -32 -17 -7 51
$$ packed form
6150c4M1Oj21Q6o2P0l3O8j9J8L5m1k7M4n1o7J00k6L6mJ4j9n4k%mO7ol5qN6mq6
6183f2L9n1M2N4JppRpl6K1rl5M6K2o3J38m6j5l9k7PL9m0R0m8j4J5k6J7km6Pl2
6217f5L7M4l4J2J6kj2j7Km8N2mM5j5jmlK0o7lR1K3k6Jl4M1o9k0j1qK5rR6J0m6
6252A7l4N6l4p3Q0m9j8R7K0k7JPk3q1L4L2jj3K9K7L9m7q7N0k7k4O1lK3qL1K7j37
6285e5P2nm2jPM1p1J22m5k6k5K1l8j4J2K0O0om8m0J6j5J4k7P1N5k1L1o3Ql0ml0
6318e6M8nN1l3P5p3Ro2m5J25l2J6L3n4K8O2j10k4K8j0K7J9P1l7m5k8Mj4m6M7R
6349b2L6n9J6J03n1j08N6K1k3OJ9JLN4p3L7q4l7P8J6L1n5J3O5o8M1l3l8m6N7L9
6380eo7O6O0q2L7K1qol7l6P9m8L7mj9n6M4M1j11O2RP1ql2j7L4j2m4j1J0J5J0N8
$$ plain form
6413 51 76 -7 -16 -25 -73 -53 15 -16 2 -9 72 -36 62 10 -52 -14 5 -12 7 4 48 3 -1 29 -76 -49 -54 39 -22 14 31 14
6445 14 27 -17 -9 -81 37 12 38 3 46 -54 44 -49 -63 -52 -111 25 22 -2 24 -33 -14 -87 -34 -74 -21 -18 -21 11 33 60 13
6476 13 -30 -21 -38 -64 -42 28 38 -18 18 -56 20 -19 -80 -46 -72 55 24 61 14 58 26 -42 -54 -42 -53 19 25 11 -8 -8 -34
6507 -34 -32 -11 -56 -2 40 -24 25 71 39 -1 -3 -112 -46 1 -20 -24 21 4 59 14 24 38 -36 22 -36 9 -3 54 24 38 35 -33
6539 -33 -14 -32 -2 57 4 60 10 -20 -21 -17 -54 -45 -66 -8 -39 24 -22 18 -1 -70 -74 -15 5 -70 -6 78 1 -6 48 -38 -37 -44 -3 60
6573 60 -39 38 37 43 4 -8 -12 1 15 -30 16 10 36 30 -33 -17 -12 19 13 5 41 78 -19 49 -30 -56 -42 -16 -61 -35 -13 -24 57 7
6607 7 -11 17 -71 -88 -41 38 -59 45 15 17 74 -19 7 -10 -1 -19 -54 -6 39 26 -2 3 20 -5 -66 -53 15 6 27 4 -30 7
6639 7 -17 -58 -14 18 -30 64 32 64 15 -6 -29 -23 -35 30 -2 -11 81 8 -20 -11 25 -49 -63 37 -10 59 -3 15 32 -23 -49 -70
$$ packed form
6413E1K5q3rrm8K0O8l1J8j1Q1j08R8n2o2L8J9j7J9lM4m5mL0j05K7nR3o1L6J7j7
6445A4J3m4Qp2J18k5K6l5M3j00R8r3j4J1n9J36lk4K6n7J9p3N3m0N3LlL2K2K7m7
6476A3m3Rj7k6K2P0J0n6L6p4P6l9o1L4k6J27l1L7m7M4l2o8j2J2j1P2Oj4j9%k6
6507c4KK1m5N4M2o4M9M6l2m0kj09O6M7k1mM5j7N5m5J0J4p4N8n8M5j2N7l0J4lo8
6539c3J9j8L0N9n3N6n0l0jMl7Rk1N8l1O3m6M0j9o9mN9K0p5O4Q4p7pN4q6JpM1O3
6573F0r9P7jOl9j2mJ3J4m5M6oK6oo3J6NL1oqL6L7r7O8p9k6J4K6m5K6K2j1Q1n0
6607Gj8K8q8j7M7P9r7J04l0KN7r3K6j7Rj8l5M8M5j3k8NJ7k5o1J3O8rK1k3l4L7
6639Gk4m1M4L2m8R4l2L2m9k1k3Oj2O5l2rR2p3k8RL6p4j4J00m7O9o2J8J7n5k6k1
$$ plain form
6671 -70 -6 -30 -1 -22 -5 24 31 28 -16 -35 -113 -78 -16 43 12 -23 -12 53 -71 -67 -38 -41 -37 63 55 12 22 10 -12 -3 -76 -40 -47
6704 -47 -65 1 51 52 20 31 9 -75 5 -27 8 -14 14 50 -45 0 31 -87 -55 0 52 -48 5 39 -25 -18 3 -16 -62 -75
6734 -75 -13 21 55 14 39 -23 -25 5 31 -32 -24 51 -7 9 38 -6 -11 -26 8 -53 -12 51 47 -28 7 -19 -56 -64 -61 -20 41 65 36
6767 36 74 41 -23 -36 -28 -64 -57 -48 -12 -22 -12 38 38 37 27 14 -40 -21 7 18 16 -4 18 -31 20 -32 -45 70 -8 25 -13 -28 -3
6800 -3 6 -102 -91 -51 30 -35 -1 5 30 55 20 -45 -47 -56 -12 -6 31 32 -29 39 -25 -24 -34 -64 -1 -7 3 -3 62 61 16 -7 -7 -29 -21 -33
6836 -33 28 -28 -3 34 48 -7 25 -52 -67 -20 -22 21 35 3 24 10 2 -96 -11 -22 -24 24 34 112 19 -24 -57 -24 23 -74 39
6867 39 76 59 47 49 -15 -24 -4 -30 7 -36 -33 26 14 -5 -3 -3 32 -58 -50 -42 -18 30 25 6 -66 -56 48 52 -47 4 1 85 6 -18 14
6902 14 -5 -60 -36 25 -17 77 27 42 65 33 -19 17 -65 -81 9 10 39 51 29 4 -5 -35 -33 -38 100 -25 17 1 32 33 -11 -40
$$ packed form
6671g0O4k4K9k1J7K9Plm4j9p8L5O2N9l1l5J1O5j24MK9lMJ00qm3J0j2k2Rp3L6p
6704d7j8O6N0Jl2J1k2q4Q0l2L5k2K8L6r5M5L1j18L2N5N2j00N3L4o4PK1j9m6j3
6734g5O2L4L4m1K5o2kL0K6o3QP5n8J6K9m4nj5L4o1M1O3mp5L5k6l7qLM1O1K4k9
6767C6L8l3o4j3Ql6PRL6j0J0N0%jj0j3n4J9K8J1kk0K2m9N1n2j3J15p8L3l8j5K5
6800cRj08J1M0Q1o5L4OK5K5l5o5krM4OL7Jo1O8o4Jj0l0O3oJ0oO5jm5k3%k2Qj2
6836c3O1n6K5L7J4n5L2p7j5M7kM3J4l2K1j4qr8Q5j1kM8J0P8r3m3l3L3M7r7J13
6867C9L7j7j2Ko4rK0k6L7m3LN9j2j9K%L5r0QQK4M8nj9p2J0J04Mr9N1lQ4p9k4L2
6902A4j9n5K4O1m2R4n0J5K3l2n2L6q2j6R0JK9J2k2k5rl0KnJ38j25M2j6L1Jm4k9
$$ plain form
6934 -40 -29 -4 -41 1 -12 13 76 27 -4 -38 -23 -53 15 0 17 104 73 19 24 8 -20 -11 -31 -74 -19 20 10 0 -16 -2 -73
6965 -73 -14 -102 8 -5 51 -69 -17 65 -25 -48 -47 -65 -23 -84 -18 28 -17 20 -27 -31 9 -52 -28 40 31 24 17 2 9 -32 -16 -64
6997 -64 -69 -25 12 42 -59 -28 3 -20 -18 -62 23 0 24 35 56 32 -21 -34 16 -28 -52 18 15 41 88 29 4 -47 -31 -29 4 10
7029 10 57 49 61 22 -24 -7 -16 -23 -59 -25 57 35 23 64 49 35 -42 -46 -57 -29 -47 40 -10 1 -8 -67 -105 -45 -28 -34 11 31 68
7062 68 25 4 4 32 -73 -26 -28 11 19 47 10 -34 -14 8 -8 31 -29 -23 72 22 63 43 -24 -15 17 -13 0 -19 -23 21 44 51 -17
7095 -17 -25 -48 -35 23 -19 -3 -24 32 48 -43 -3 -1 -16 -70 19 -1 21 27 -20 -11 -27 -7 -95 -12 -21 -20 -11 38 64 27 -5 -42 -44 -15
7129 -15 -6 58 32 37 -23 -3 -48 -28 -45 -28 -69 -32 74 37 55 23 -21 -79 -39 -16 -27 -5 53 -43 28 24 38 -76 -27 -24 -60
7160 -60 17 39 82 47 -5 51 7 -18 -66 -30 40 36 32 43 60 -9 8 -4 23 -67 -12 -9 24 34 -1 -34 -9 -17 -33 2 -35 26
$$ packed form
6934d0J1K5l7M2j3K5O3m9l1l4J5l0O8j5J7Q7l1n4Nj6k8Rk0m3N5L9j0j0j6J4p1
6965g3N9q8J10j3N6j20N2Q2r0k3Jj8M2o1O6M6m5L7m7mM0o1K4O8rppj5Pm1J6m8
6997f4nM4L7L0j01L1L1k3Km4Q5k3K4J1K1k4n3j3N0m4k4P0lK6M7n9k5n1J6KL3O
7029A0M7qJ2l9m6J7rpl6L4Q2k2j2M1j5j4p7mj1K8j8Q7n0J1rn9l8O0J7oM5K0L7
7062F8m3k1%K8j05M7kL9QK8l7m4K0K2j6L9o0OR5n0M1k0o7RL2l0J3j9mM4K3Po8
7095a7qk3J3N8m2J6k1N6J6r1M0Kj5n4Q9k0K2Om7Rj6K0q8Q3rJRM9K6l7l2l7kK9
7129a5RO4k6No0K0m5K0j7J7m1L7J06l7J8l2m4n8M0K3j1K2N8r6P1mJ4j14M9Ll6
7160f0P7K2M3l5n2N6m4k5m8L6P0mmJ1J7o9J7j2K7r0N5LL3J0l5l3K5qj6L5l7O1
$$ plain form
7192 26 76 -5 33 61 4 -36 14 64 21 5 96 61 43 28 1 38 -32 -33 -25 17 -8 75 42 39 -40 -17 -106 -40 16 11 9 28 48
7225 48 79 -15 3 17 -32 -49 -39 37 -34 85 39 -36 8 13 -53 -17 -8 70 13 8 66 -40 -5 -16 -34 -38 32 88 20 -11 40
7256 40 -17 31 18 59 -71 -15 20 -40 85 -30 -15 -30 -40 26 -42 32 48 10 79 25 43 4 -33 -16 -30 -22 -37 63 42
7285 42 31 53 5 31 -53 -34 -22 43 76 43 58 51 47 -20 -41 -3 6 -28 23 5 55 -67 -9 -19 -3 -30 -48 3 45 15 59
7316 59 -8 -28 -44 -65 -58 -32 1 25 -17 59 37 -68 -66 18 -25 -46 23 22 21 13 57 12 2 -38 -35 -48 -18 -2 -2 20 -16 51 -29
7349 -29 6 -35 -15 35 36 17 7 -17 -51 8 -66 -44 -39 2 4 12 18 79 -1 -9 6 -31 61 32 -18 10 51 87 -5 50 29 -43 -39 -18
7383 -18 66 20 27 20 65 21 -58 -11 -47 -2 -37 33 60 -13 33 32 -65 1 -91 -28 48 -27 -3 89 5 -33 -22 -63 -5 -13 -22 36 65
7416 65 23 53 31 53 22 -23 -13 9 -21 -58 -2 50 -1 17 -61 -24 -62 -25 5 20 -5 29 23 -26 -81 -38 -33 -3 22 14 -3 12
$$ packed form
7192B6N0q1L8K8n7m0N0N0m3j6R1l5j8j5k7L7p0jQM2k5Q3l3lp9K3q9O6N6nkJ9K0
7225D8L1r4J8J4m9j7J0P6p1J19m6p5M4No6L6RP8n7nN8j06L5j1j8mP0N6o8l1N1
7256D0n7M8j3M1j30N6L5o0J25j15J5j5j0O6o8P4J6l8O9n4J8l9l7J7j4Qj5J00k1
7285D2j1K2m8K6q4J9J2O5L3l3J5pmo7k1L8Rl4N1j8N0j22N8j0J6k7j8N1M2l0M4
7316E9o7k0j6k1PK6L3K4m2P6k2j05KQ4m3k1O9jjqM4m5j0m0Lj3L0J6%K2l6O7q0
7349b9L5m1K0N0Jj9j0k4l4N9p4K2NM1KQOO1q0qJ5l7R2k9n0K8M1L6r2N5k1p2MK1
7383a8Q4m6PpM5m4p9M7l6M5l5P0K7p3M6jr7O6r2O3P6p5K4R2q4l8J1m1N8qrN8K9
7416F5m2L0k2K2l1m5J0K2l0l7N6N2n1J8p8L7l8L7L0J5k5L4om9n5M3NL0K5qj7J5
$$ plain form
7448 12 31 -25 -50 -78 -62 -45 65 23 16 -24 -4 -30 -42 -19 -7 -7 39 10 80 29 -12 66 4 -29 14 -35 -23 -26 6 35 -92
7479 -92 46 7 20 4 -51 28 32 62 8 28 54 33 -26 -16 -61 28 18 64 128 21 47 -42 -45 29 -49 46 30 -19 78 30
7509 30 -31 24 4 -5 12 -5 55 -1 37 20 6 -10 -26 -58 -77 -2 13 5 18 6 43 43 -3 14 -1 -14 2 24 51 24 34 29
7541 29 -15 50 15 -9 56 -5 3 -7 10 3 -15 -21 -18 -59 10 -20 47 23 18 17 -71 7 17 14 -42 52 -24 -14 7 -21 9 -40 18 -54
7575 -54 10 18 -39 33 15 32 -28 -50 -42 -45 18 -83 23 38 24 2 0 3 17 -40 -55 51 63 69 30 47 18 -94 7 -27 -69
7606 -69 2 -18 54 18 -21 -6 18 -20 -40 -15 10 31 11 22 4 -24 1 -29 -29 -59 22 -12 0 45 14 65 -6 34 -29 -28 -9
7637 -9 17 4 16 19 -26 -38 -16 -59 -58 18 -22 -37 19 42 58 -14 -26 -59 -46 17 29 26 41 -18 -2 40 -22 -42 30 5 -26 -14
7669 -14 -11 9 -32 10 -3 -34 -30 17 34 25 -21 81 -14 -24 -11 -30 -12 -8 23 -2 21 79 -10 6 -26 -16 -57 -68 -21 52 9 -19
$$ packed form
7448A2J9n6k5k8J6J7J10m2pm0K0k6j2K3J2%M6k9P0n1m1P8o2l3M3m9J2lL2K9j27
7479i2J38l9J3j6n5P9ML0n4K0K6k1n9J0m5Q9j0M6O4j07K6q9lP4p8R5j6m9R7m8
7509C0o1N5k0rJ7j7O0n6L8j7j4j6j6l2j9P5J5qJ3j2L7%m6J7j5j3J6K2K7k7J0n
7541B9m4O5l5k4O5o1Qj0J7pj8oLm1O9l0O7k4njq8P8J0ln6R4p6J0K1k8L0m9N8p2
7575e4O4Qn7P2j8J7o0k2QlO3j01J06J5j4k2kLJ4n7j5J06J2Ol9J7k9j12J01l4m2
7606f9P1k0P2l6l9J5K4l8k0K5K5K1k0J1j8k8K5l0%l0Q1l4J2M5l1N1p1M0o3JJ9
7637iK6j3J2Lm5j2K2m3JP6m0j5N6K3J6p2j2l3J3O3J2lJ5n9J6M2o2k0P2k5l1J2
7669a4LK0m1M2j3l1MM7J7rm6J02r5j0J3j9J8ML1k5K3N8q9J6l2J0m1j1M7P3m3k8
$$ plain form
7701 -19 10 35 -29 -57 22 -12 -10 27 15 50 52 -2 35 -27 3 65 -1 -5 11 32 -9 -7 23 -15 -50 -54 -50 -9 -8 -4 -5 -32 -21 -33 -26
7736 -26 -61 -2 21 -2 41 61 5 -36 -30 4 -35 38 -47 44 0 6 -10 19 30 28 0 -46 -23 -14 6 -22 3 -58 -44 11 6 -32 -4
7769 -4 7 6 -10 -50 18 -42 -58 -41 21 -1 -65 -5 -37 1 20 -79 -16 -68 -3 -7 30 31 51 41 26 -40 -14 -20 -1 58 8 -10 6
7802 6 4 25 0 -69 -75 -6 -9 27 15 -46 18 52 -12 -18 5 -49 32 40 53 10 27 2 -7 -54 -18 0 27 -18 40 99 41 53 -24 -12
7836 -12 -18 -37 -44 -20 41 11 12 32 9 -13 -19 1 -32 10 28 26 15 35 -25 14 -75 -1 1 0 43 23 38 39 21 -22 -49 -25 73 -3
7870 -3 -5 67 -12 -26 35 36 -53 -13 -37 -12 -26 5 19 -11 6 -18 -9 -70 -67 33 -22 65 12 -30 -24 -48 -10 14 -32 2 -19 19 6
7903 6 41 -30 -9 -24 -9 8 12 -62 8 40 27 -56 8 5 -42 -43 -30 -45 66 -34 -9 38 -39 23 -15 -47 -5 3 13 0 29 44
7935 44 16 3 -51 -68 22 -21 34 34 28 9 -26 16 -29 -59 -17 43 56 57 15 39 33 -33 5 -19 -77 43 29 48 33 52 -14 -13
$$ packed form
7701a9K9K5o4k8P9l4KL7j2L5Kn4L7o2L0O2o6mJ6K1m1KL0l8l5mMM1JMjk7J1j2P
7736b6l5N9K3k3M3K0n6m1OL4l9P3q5R1m4Oj6K9J1kk8m6K3RK0k8K5o1J4N5nl8K8
7769dJ1jj6m0O8o0j6J7O2k2o4O0l2L8J9r9O3n2O5mL7JK0j0j5o6K6oJ9N9n0j8J6
7802FkK1k5o9oO9lL6j2o1O4L4o4oK3n4Q1QJ3m3J7k5rm7L6J8K7m5N8N9n8J2p7J2
7836a2oj9pK4O1l0JK0k3k2oK0l3M2J8kj1K0o0L9q9P4KjM3k0J5Jj8m3k7K4R8p6
7870ckP2p9j4O1Jq9M0k4K5j4L1J4l0J7k4Ro1LJ00n5Q7n3m2Ok4L8K4m6L4k1L8j3
7903FL5p1K1j5J5J7Mp4P0L2j3q3O4lm7jJ3j5J11j00K5M7p7O2l8l2M2QJ0j3K9J5
7935D4k8j3n4j7R0m3N5%oj9l5M2m5l0M2O0J3Jm2K4oo6L8k4n8J20j4J9j5J9o6J
$$ plain form
7967 -13 11 9 -32 11 -15 16 84 43 2 19 -32 -51 28 -19 -65 22 20 -10 20 -35 -38 -75 -15 -4 31 69 16 27 -11 -7 -17 4
7999 4 -26 -65 -9 12 64 8 8 -32 25 -14 -45 -25 36 47 -38 41 22 -43 -11 -59 -4 -19 -12 -39 25 52 34 -36 -11 8 40 -18
8031 -18 -20 8 15 26 -25 58 19 -30 -84 34 7 -7 41 53 55 21 3 43 -36 -45 -23 -28 1 -37 25 4 67 -59 -26 -77 3 -14
8063 -14 -56 60 -14 33 -52 1 -30 -56 -34 27 -27 12 63 39 -60 -29 -18 -13 -56 2 -10 -7 -25 20 26 -49 -33 4 -33 -29 59 49
8095 49 11 34 -5 3 2 -34 -30 3 41 44 15 5 -28 -66 -42 -12 -119 -45 37 20 -1 43 -7 17 14 -50 -33 -54 16 -5 39 69
8127 69 29 -2 41 12 53 14 29 20 14 7 -37 39 -33 21 -15 -73 -24 55 72 52 -1 -38 -1 22 1 -3 -19 -36 5 14 -1 -4 -8 18
8161 18 -2 -32 0 41 1 24 -41 -7 -14 18 -25 -41 -45 16 -29 41 -25 11 -19 19 -53 -31 -52 19 47 4 54 -28 70 -68
$$ packed form
7967a3K4km1M3k6L1O8m1m1J7n1j9P9m7m6Q7kl0L0n5ll7O0J1L5L8n3J1l8Mj0K1
7999Dl0l9N6K1N2n6%m0N7l9l1K0O1J1q5P9j9o5L2m8N5j5Pk7O4K7j8p0K5J9L2n8
8031a8kK8PJ1n1Q3l9m9n4J18k7j4M8J2Kl4j8M0p9rK2nK9l8O2k1O3j26L3n1Q0j7
8063a4m2J16p4M7q5N3l1k6K2O1n4L9N1k4r9L1J1Nm3N8j2Lj8M5Op5J6L7l7MQ8j0
8095D9l8K3l9Qjl6ML3L8Lk9j0l3l8K4L0j07P4Q2j7k1M4n0K4lo4J7k1P0k1M4L0
8127F9m0l1M3k9M1l9J5ropm4P6p2N4l6n8M9P9J7k0n3l7L7K3k1mj6j7M1Rj5lmK6
8161A8k0l0L2M1m0K3o5L4pL2m3j6mO1m5P0o6L6l0L8p2K2k1P1K8m3N0q2R8j38
8191f8
$$ Imaginary data points
##PAGE= N=2
##DATA TABLE= (X++(I..I)), XYDATA
$$ plain form
0 0 0 0 0 0 0 0 0 0 0 0 0 0 0 0 0 0 0 0 0 0 -8 8 -8 8 -8 8 -9 16 -16 16 -21 24 -24 32 -32 40 -41 48 -55 57 -65
41 -65 73 -81 89 -97 110 -121 134 -145 161 -177 195 -217 239 -264 291 -323 361 -404 454 -515 591
62 591 -685 812 -981 1230 -1632 2382 -4289 21111 28059 -4140 -1239 -13473 -28469 -17430
76 -17430 4491 2896 9544 19483 10212 109 6041 -5104 -20591 -11649 -3115 -10958 2264 24653
90 24653 18343 5101 7175 -5826 -26111 -18790 -2741 -1330 8620 21462 12048 361 2788 -5197
104 -5197 -16655 -8505 -2138 -8368 1019 16826 11256 4838 10418 91 -18813 -15881 -6709 -7096
118 -7096 3599 18847 14222 5038 4492 -5080 -15765 -8824 -3022 -6969 846 13052 8667 4655
132 4655 9435 1840 -12102 -11106 -7766 -10179 -1263 12486 12186 9195 10143 -124 -13315 -12024 -8189
$$ packed form
0@%%%%%%%%%%%%%%%%%%%%qJ6j6J6j6J6j7K5l2L2l7M5m8N6o4P2q1Q9j03J12j22
41f5J38j54J70j86K07k31K55k79L06l38L72m12M56n03N55o14O84p65Q58r69J106
62E91j276J497j793K211k862M014o671K5400O948l2199K901j2234j4996J1039
76a7430K1921j595O648R939r271j0103N932j1145j5487Q942Q534p843J3222K2389
90B4653o310j3242K074j3001k0285P321J6049J411R950J2842r414j1687K427p985
104e197j1458Q150O367o230R387J5807n570o418N580j0327j8904K932R172l87
118g096J0695J5248m625r184n46r572j0685O941N802l947P815J2206m385m012
132D655M780p595j3942R96L340k413Q916J3749l00k991R48j0267j3191J291L835
$$ plain form
147 -8189 -8668 207 11639 10586 7932 9230 1092 -10068 -10458 -9299 -10439 -1494 10326 11153 9789
162 9789 10048 1107 -10138 -10956 -9408 -9357 -1158 9219 10087 8913 8928 1690 -7449 -9281 -9536 -9701 -2116
179 -2116 6719 8884 10409 10707 2219 -7507 -9275 -9583 -10003 -3036 6659 9714 9610 8732 2753 -5060
195 -5060 -8819 -10375 -8913 -1834 4919 7322 9667 9759 2558 -5420 -7684 -8612 -8872 -3359 4519 7859
211 7859 8329 7487 3172 -2489 -6312 -8606 -7957 -3382 1559 5023 8671 9337 4243 -1689 -5033 -8184
227 -8184 -9774 -5512 1472 6067 8270 8855 5730 -310 -5888 -8954 -8271 -4782 -500 4188 8664 9200
243 9200 4821 -37 -3574 -7260 -9427 -6297 -350 4254 6939 8241 6658 1977 -3908 -7777 -8181
258 -8181 -5949 -2508 2543 7572 9062 6341 2066 -2259 -6679 -9187 -7368 -2219 2950 6877 8679
$$ packed form
147h189m79Q875J1432j053k654J298q138j1160l90J159j140Q945J1820Q27j364
162I789K59q941j1245q18J548N1Q199J0377Q68j174J5p238r139j832k55j65P585
179b116Q835K165J525K98q488r726j768l08m20O967R695L055j04q78n979p813
195e060l759j556J462P079O753K403K345R2p201p978k264r28k60N513P878L340
211G859M70q42m315n661l823k294O49M575M941L464L648O66n094n932l344l151
227h184j590M262O984M595K203N85l125o040n578l066O83L489M282M688M476N36
243I200m379m858l537l686k167L130N947M604K685J302j583m681n885l869m04
258h181K232L441N051N029J490k721m275m325m420k508J819N149N169L927J802
$$ plain form
273 8679 7426 2828 -3106 -7408 -8593 -6861 -2961 2510 7285 8635 6438 2506 -2162 -6487 -8473
288 -8473 -6718 -2404 2255 5763 7686 6953 3102 -2123 -5874 -7223 -6525 -3724 1025 5740 7732 6611
304 6611 3512 -534 -4869 -7649 -7288 -3799 817 4739 7012 7169 4511 -491 -4987 -7137 -6654 -4271
320 -4271 -185 4381 7250 6793 4016 146 -3633 -6525 -6890 -4430 -327 3463 5770 6505 4838 1113
336 1113 -3035 -5726 -6405 -5014 -1781 2491 5727 6658 5160 2166 -1862 -5586 -7097 -5663 -2173 1761
352 1761 5115 7192 6325 2372 -2211 -5204 -6601 -6210 -2997 1894 5654 6724 5578 2898 -1099 -5138
368 -5138 -7242 -5853 -2325 1229 4141 6544 6531 3020 -1385 -4288 -5846 -6206 -3858 772 4496 6153
384 6153 5922 3674 -49 -4018 -6717 -6491 -3473 198 3463 6481 7003 3879 -441 -3523 -5907 -6801
$$ packed form
273H679j253m598n934m302j185J732L900N471M775J350k197l932m668m325j986
288h473J755M314M659L508J923p33l851n225l751j349O98K801M749M715J992j121
304F611l099m046m335k780L61L489M616L922K273J57k658n002m496k150M83K383
320d271M086M566K869m57k777l870l779k892l65K460M103L790K307P35j667l725
336A113m148k691o79J391L233M272L236R31j498k994m028l724j511J434L490L934
352A761L354K077q67l953m583k993j397L91L213M891L760J070j146k680l997m039
368e138k104J389L528L554K912K403j3l511m405k903j558l60K348M630L724J657
384F153k31k248l723l969k699K26L018L671L265L018N22l124m320l082k384q94
$$ plain form
400 -6801 -4251 218 3807 5741 6260 4184 255 -3432 -6015 -6131 -3614 -456 2426 5538 6465 3624
416 3624 168 -2038 -4516 -6323 -4421 -701 2137 4290 5759 4590 1654 -1535 -4750 -5991 -4160
431 -4160 -1626 951 4495 6513 4566 1328 -926 -4018 -6260 -4853 -1662 1038 4012 5890 4673
446 4673 1997 -551 -3916 -6003 -4509 -2079 262 3647 5954 4534 2000 13 -3249 -5830 -4657
461 -4657 -2310 -390 3024 5695 4761 2827 813 -2942 -5733 -4949 -3098 -1239 2762 6020 5159 3116
477 3116 1221 -2625 -5937 -5310 -3249 -1014 2819 5599 4862 3285 1519 -2640 -5678 -4533 -3063 -1876
493 -1876 1991 5485 4839 3097 1756 -1742 -4933 -4908 -3669 -1904 2041 4839 4314 3745 2584 -1745
509 -1745 -5023 -4192 -3443 -2864 1057 4857 4647 3538 2670 -877 -4398 -4672 -3985 -2750 1113 4280 4227
$$ packed form
400f801K550M469L589J934N19k076l929l687k583j16K517L158K882L112R27k841
416C624l456k206k478j807J902L720K838K153J469j169k936l189l215j241J831
431d160K534K577L544K018j947l238k254l092k242J407L191K700K974J878j217
446D673k676k548l365k087J494K430K341L385K307j420k534j987l262k581J173
461d657K347J920L414K671r34j934k014l755k791P84J851J859M001L258q61k043
477C116j895l846l312O27K061K235L833K780p37j577j766m159l038J145J470J187
493a876L867L494o46j742j341l498l191K5J239J765L945K798n25n69j161m329
509a745l278Q31P49N79L921L800k10j109q68l547l521k74O87J235L863L167n3
$$ plain form
526 4227 4092 3092 -1288 -4410 -3770 -3636 -3382 673 4351 3893 3278 3137 -18 -3599 -4130 -3838 -2945 263
544 263 3127 3541 4121 3673 -370 -3377 -3121 -3728 -4135 -419 3398 3512 3521 3975 1053 -2741 -3841 -4227
562 -4227 -4005 -713 2553 3623 4638 4302 350 -3042 -3337 -4131 -4289 -608 2965 3121 3502 4027 1239
579 1239 -2200 -3086 -3667 -4018 -1611 1388 2825 4192 4525 1502 -1485 -2638 -4304 -4808 -1615 1982
595 1982 2787 3804 4450 1845 -1563 -2896 -3692 -4074 -1904 881 2402 3903 4369 1876 -792 -2132
611 -2132 -3941 -4719 -2134 1045 2497 3800 4311 2103 -960 -2331 -3600 -3946 -1876 465 1825 3350
627 3350 3959 2213 -47 -1449 -3201 -4232 -2697 -285 1469 3435 4386 2797 294 -1582 -3629 -4325
643 -4325 -2657 -197 1586 3333 4087 2547 387 -1198 -2959 -3952 -2745 -671 975 2808 3793 2959
$$ packed form
526D227j35j000m380l122O40J34K54M055L678m58o15j41l155l581n31K92Q93L208
544B63K864M14N80m48m043l007K56o07m07L716L817J14RM54k922l794j100l86
562d227K22L292L266J070J015l36l952l392k95p94j58L681L573J56L81N25k788
579A239l439q86n81l51K407K999J437J367L33l023k987j153j666n04L193L597
595A982Q05J017O46k605l408j333p96l82K170K785J521J501M66k493k668j340
611b132j809p78K585L179J452J303N11k208l063j371j269l46K070K341J360J525
627C350O09j746k260j402j752j031J535K412J754J966R51j589k503j876k047o96
643d325J668K460J783J747P54j540k160j585j761r93J207K074J646J833R85q34
$$ plain form
659 2959 1105 -934 -3028 -3889 -2833 -1117 609 2918 4001 2867 987 -549 -2434 -3790 -3264 -1324
675 -1324 603 2329 3450 3202 1920 -231 -2590 -3718 -2978 -1829 -137 2461 3975 3227 1709 -99
691 -99 -2139 -3722 -3449 -1767 255 2104 3324 3218 2090 -23 -2137 -3173 -2959 -2098 -491 1915 3304
708 3304 2967 2013 626 -1453 -3228 -3348 -2081 -481 1305 2906 3524 2624 601 -1567 -2871 -3108 -2684
725 -2684 -990 1553 3136 3170 2280 976 -1103 -3001 -3412 -2330 -691 991 2481 3283 2642 904 -1150
742 -1150 -2359 -2949 -2741 -1366 883 2480 2920 2536 1395 -458 -2343 -3074 -2588 -1336 191 1998 3096
759 3096 2912 1466 -320 -1916 -2891 -3033 -1788 317 1984 2812 2803 1922 4 -1978 -2902 -2679 -1702 -159
777 -159 1587 2901 2895 1627 -3 -1425 -2561 -2926 -2014 -160 1511 2452 2677 2070 552 -1352 -2602
$$ packed form
659B959j854k039k094q61J056J716J726K309J083j134j880j536j885j356N26J940
675a324J927J726J121k48j282k151k359j128P40J149J692K598J514p48j518j808
691i9k040j583K73J682K022J849J220j06j128k113k114j036K14Q61J607K406J389
708C304l37r54j387k079j775j20J267J600J786J601O18r00k023k168j304k37M24
725b684J694K543J583L4q90j304k079j898m11J082J639J682J490Q02o41j738k054
742a150j209n90K08J375K249J597M40l84j141j853j885p31M86J252J527J807J098
759C096j84j446j786j596r75j42J245K105J667Q28rq81j918j982r24K23R77J543
777a59J746J314oj268j630j422j136l65R12J854J671R41K25o07j518j904j250
$$ plain form
794 -2602 -2689 -2000 -650 1026 2512 2983 2205 609 -1038 -2394 -3026 -2398 -754 1011 2431 2874 2409
811 2409 1000 -889 -2365 -2862 -2218 -982 730 2205 2834 2286 1004 -664 -2048 -2757 -2410 -1124 580
828 580 1880 2604 2438 1273 -380 -1902 -2562 -2321 -1431 58 1754 2663 2368 1380 -23 -1435 -2551
845 -2551 -2646 -1451 112 1565 2422 2493 1764 8 -1646 -2443 -2353 -1632 -302 1416 2509 2501 1522 184 -1150
864 -1150 -2222 -2576 -1746 -195 1139 2027 2328 1886 497 -1074 -2122 -2368 -1870 -779 838 2114 2382
881 2382 1906 852 -609 -1933 -2537 -2010 -774 666 1880 2546 2220 894 -782 -1912 -2301 -2153 -1128
898 -1128 597 1999 2340 1989 1010 -311 -1781 -2412 -2116 -926 289 1475 2239 2236 1249 -371 -1500 -2072
916 -2072 -2190 -1497 95 1543 2177 2125 1465 88 -1296 -2224 -2268 -1482 -132 1183 2048 2352 1647 99
$$ packed form
794b602q7O89J350J676J486M71p78j596j647j356o32O28J644J765J420M43m65
811B409j409j889j476m97O44J236J712J475O29n48j282j668j384p09L47J286J704
828E80J300P24j66j165j653j522o60K41Q90J489J696R09k95r88j403j412j116
845b551r5J195J563J453Q57P1p29j756j654p97R0P21J330J718J093qr79j338j334
864a150j072l54Q30J551J334Q88L01m42j389j571j048k46M98J091J617J276K68
881B382m76j054j461j324o04N27J236J440J214O66l26j326j676j130l89J48J025
898a128J725J402L41l51r79j321j470o31K96J190J215J186P64lr87j620j129n72
916b072j18O93J592J448O34n2o60j377j384r28m4P86J350J315Q65L04p05j548
$$ plain form
934 99 -1154 -1949 -2247 -1740 -155 1209 1900 2182 1602 298 -1114 -1932 -2129 -1600 -361 850 1730 2194
952 2194 1663 319 -769 -1505 -2128 -1863 -543 792 1577 2011 1814 775 -569 -1647 -2225 -1859 -637
969 -637 375 1421 2281 2045 679 -569 -1328 -2144 -2091 -792 472 1410 2040 1951 872 -249 -1318 -2076
987 -2076 -1928 -896 87 1040 2086 2037 948 -81 -848 -1881 -2119 -1161 -8 928 1854 2112 1225 177
1005 177 -951 -1931 -2000 -1136 -309 768 1947 2153 1051 221 -535 -1786 -2208 -1255 -224 601 1599 2070
1023 2070 1412 482 -653 -1783 -1958 -1230 -539 410 1851 2114 1164 418 -283 -1569 -2096 -1349 -417 222
1041 222 1325 1891 1494 814 -105 -1465 -1934 -1393 -903 -17 1475 2035 1408 854 25 -1377 -2119 -1501 -739
1060 -739 -42 1196 1992 1590 752 11 -1159 -1792 -1433 -1029 -145 1232 1812 1338 1004 405 -1010 -1861 -1451
$$ packed form
934I9j253p95k98N07J585J364O91K82n80j304j412q18j97N29J239J211Q80M64
952B194n31j344j088p36o23K65J320J335P85M34j97j039j344j078n78L66J222
969f37J012J046Q60k36j366j248p59q16N3J299J264R38O30q9j079j121j069p58
987b076J48J032R83R53J046m9j089j029p67j033k38R58J153R36R26K58q87j048
1005A77j128r80o9Q64Q27J077J179K06j102q30p56j251m22R53J031Q25R98M71
1023B070o58r30j135j130j75P28O91R49J441K63r50p46p01j286n27P47R32O39
1041B22J103N66l97o80r19j360m69N41M90Q86J492N60o27n54q29j402p42O18P62
1060g39O97J238P96m02q38p41j170o33L59M04Q84J377N80m74l34n99j415q51M10
$$ plain form
1079 -1451 -923 -402 812 1736 1583 1108 384 -919 -1636 -1512 -1287 -601 831 1645 1461 1178 680 -666
1097 -666 -1672 -1515 -1180 -576 563 1484 1553 1326 735 -558 -1528 -1475 -1347 -714 502 1484 1504 1255 780 -434
1117 -434 -1344 -1467 -1324 -787 267 1238 1451 1318 872 -205 -1194 -1404 -1433 -1050 128 1192 1442 1453 1025
1136 1025 -74 -1157 -1545 -1404 -927 101 1108 1446 1420 909 -145 -955 -1232 -1393 -1090 -22 945 1288
1154 1288 1369 1177 196 -768 -1446 -1518 -1094 -282 641 1294 1577 1168 202 -729 -1141 -1461 -1267 -284 663 1117
1174 1117 1373 1239 510 -531 -1215 -1423 -1212 -584 389 1202 1514 1257 421 -408 -1064 -1429 -1330 -537 523
1193 523 990 1286 1259 655 -334 -1028 -1248 -1194 -719 104 945 1375 1255 676 -47 -732 -1342 -1433 -791 112 780
1214 780 1188 1413 822 -92 -901 -1274 -1320 -875 -74 812 1296 1322 815 122 -580 -1302 -1377 -877 -91 568 1108
$$ packed form
1079a451N28N21J214R24j53m75p24j303p17J24K25O86J432Q14j84k83m98j346
1097f66j006J57L35O04J139R21O9k27n91j293r70N3J28O33J216R82K0k49m75j214
1117d34r10j23J43N37J054R71K13j33m46j077r89k10k9L83J178J064K50J1m28
1136A025j099j083l88J41M77J028J007L38k6n11j054q10k77j61L03J068R67L43
1154A288Q1j92r81r64o78p2M24Q12R23O53K83m09r66r31m12l20J94R83R47M54
1174A117K56j34p29j041o84k08K11O28R73Q13L12k57q36q29o56l65R9P93J060
1193E23M67K96k7o04r89o94k20N4M75Q23Q41M30j20n79p23o85o10r1O42R03O68
1214G80M08K25n91r14q09l73m6M45Q01Q86M84K6n07o93p02p22p5N00P86O59N40
$$ plain form
1235 1108 1393 949 173 -590 -1063 -1262 -1054 -300 566 1139 1200 1039 444 -443 -1108 -1375 -1013 -369 286 977
1255 977 1324 1115 397 -451 -936 -1253 -1194 -523 369 963 1225 1023 584 -254 -998 -1274 -1091 -393 170 829
1275 829 1195 1127 518 -173 -728 -1122 -1102 -581 82 766 1137 1097 673 -4 -721 -1194 -1170 -709 -36 618 1069
1296 1069 1169 786 54 -638 -1080 -1167 -802 -105 583 1096 1147 822 162 -525 -1080 -1087 -840 -270 491 1035 1209
1317 1209 804 207 -456 -915 -1095 -969 -276 443 893 1114 896 422 -310 -920 -1159 -892 -409 236 878 1196
1337 1196 1064 420 -228 -751 -1120 -1021 -526 187 805 1065 1012 502 -112 -801 -1150 -896 -512 73 677 1091
1357 1091 1052 505 -77 -619 -994 -1027 -577 39 686 994 1005 672 49 -589 -982 -985 -666 -137 534 1069 1004 645
1379 645 165 -476 -923 -1117 -712 -118 468 864 1023 828 252 -479 -877 -962 -743 -200 388 899 1007 639
$$ packed form
1235A108K85m44p76p63m73j99K08P54Q66N73O1j61n95q87o65k67L62O44O55O91
1255I77L47k09p18q48m85l17N9O71Q92N94K62k02m39q38p44k76J83O98N63O59
1275H29L66o8o09o91n55l94K0N21O63O84L71m0m24o77p17m73K4M61O73O54M51
1296A069J00l83p32o92m42q7L65O97O88N13N1l25o60o87n55pK47N70P61N44J74
1317A209m05n97o63m59j80J26O93P19M50K21k18m74p32o10k39K67M83O45O42L18
1337A196j32o44o48n23l69R9M95P13O18K60n3n10o14o89l49K54L84N85O04M14
1357A091l9n47n82n42l75l3M50O16O47L08J1l33o23o38l93lL19N29O71N35o5l59
1379F45m80o41m47j94M05N94N86L96J59j95n76p31l98q5K19N43N88N11J08l68
$$ plain form
1399 639 293 -246 -838 -1020 -787 -264 222 759 1009 822 394 -188 -755 -961 -844 -520 216 783 989 793
1419 793 454 -61 -703 -1064 -825 -467 63 637 963 876 534 -138 -640 -945 -853 -614 70 670 895 840 587
1440 587 106 -584 -926 -776 -552 -91 488 826 868 604 104 -488 -754 -819 -743 -268 463 838 803 734 291 -440
1462 -440 -830 -883 -741 -175 400 829 897 766 226 -444 -740 -865 -727 -270 437 751 763 739 332 -257 -696
1483 -696 -864 -756 -371 274 578 850 751 355 -218 -627 -797 -797 -452 194 689 721 764 436 -116 -606 -742 -763
1505 -763 -520 17 480 758 868 553 -105 -467 -768 -854 -510 144 557 683 746 530 -34 -569 -707 -752 -557
1526 -557 -102 398 692 818 602 71 -288 -640 -881 -696 -58 333 572 813 689 131 -354 -611 -757 -761 -199
1547 -199 330 623 802 698 117 -280 -546 -809 -675 -198 235 501 801 728 262 -222 -536 -726 -636 -266 151
$$ packed form
1399F39l46n39n92j82K33N23M86N37K50j87m28n82n67k06J17L24P36N67K06j96
1419G93l39n15o42l61K39L58N30N74L26q7l42o72n02l05R2K39O84O00K25n5k53
1440E87m81o90l42J50K24M61N79L38M2k64n00n92k66o5P6M75P31L75l5o9m43p31
1462d40l90n3J42N66N75M29O8j31n40o70k96j25J38M57P07L14J2k4m07n89m39
1483f96j68J08L85O45L04K72r9l96n73m09j70%L45O46M95L2M3l28n52m90j36k1
1505g63K43N37M63K78J10l15o58l62l01q6L44O54M13J26O3k16n64n35j38m5J95
1526e57M55N00K94J26k16n31l59l52k41J85O38L91K39K41j24n58m85k57j46mN62
1547a99N29K93J79j04n81l97k66k63J34M77M33K66L00p3m66m84l14j90R0L70M17
$$ plain form
1568 151 483 776 753 294 -145 -463 -739 -824 -352 103 383 676 774 355 -45 -383 -693 -736 -409 -13 396
1589 396 755 766 410 -60 -393 -764 -832 -445 56 355 689 799 471 29 -307 -641 -722 -449 5 292 609
1610 609 691 512 139 -242 -564 -724 -545 -187 218 598 763 558 152 -264 -620 -703 -624 -144 212 574 700
1631 700 475 180 -126 -548 -771 -588 -222 134 437 646 664 232 -142 -408 -703 -620 -297 110 504 683 575
1652 575 316 -69 -448 -663 -613 -291 54 368 668 641 334 14 -376 -656 -666 -444 -43 380 612 651 457
1673 457 90 -367 -679 -680 -360 -78 242 686 709 414 25 -261 -501 -684 -400 -69 313 549 550 436 118 -220
1695 -220 -567 -594 -384 -191 151 486 710 473 178 -189 -433 -692 -562 -129 187 473 617 531 232 -135 -472
1716 -472 -581 -502 -306 76 481 684 476 250 -28 -402 -629 -582 -236 23 381 644 571 389 0 -371 -530
$$ packed form
1568A51L32K93k3m59m39l18k76q5M72M55K80K93R8m19m00l38l10m3L27L96M09
1589C96L59J1l56m70l33l71o8L87N01K99L34J10l28m42l36l34q1K73M54K87L17
1610F09Q2j79l73l81l22j60J79L58M05L80J65k05m06m16l56q3P9M80L56L62J26
1631G00k25k95l06m22k23J83L66L56L03K09J8m32l74k66k95Q3L23M07L94J79j08
1652E75k59l85l79k15N0L22L45L14L00k7l07l20l90k80j0K22M01M23K32L9j94
1673D57l67m57l12jL20K82L20M44K3k95l89k86k40j83K84L31L82K36Jj14l18l38
1695b20l47k7K10J93L42L35K24k37k95l67k44k59J30M33L16K86J44q6k99l67l37
1716d72j09P9J96L82M05K03k08k26k78l74k27M7L46K59L58K63p3j82l89l71j59
$$ plain form
1737 -530 -516 -391 0 411 558 529 321 73 -333 -615 -609 -333 -34 272 586 559 428 48 -354 -514 -595 -402
1759 -402 -115 316 565 562 381 121 -235 -517 -602 -372 -136 249 497 598 409 203 -182 -426 -544 -471 -181
1780 -181 222 441 528 471 113 -89 -447 -591 -514 -252 169 444 520 502 224 -142 -465 -495 -537 -300 70 407
1802 407 546 450 277 -84 -407 -551 -494 -293 62 290 487 517 238 -11 -319 -464 -456 -355 -40 376 553 453
1824 453 312 44 -295 -539 -518 -377 -48 247 492 502 321 50 -280 -456 -464 -403 -128 215 460 475 371 170
1846 170 -189 -407 -534 -338 -127 179 446 520 411 135 -123 -377 -440 -420 -173 140 381 441 431 233 -107 -384
1868 -384 -512 -385 -205 49 409 549 460 175 -68 -355 -462 -476 -264 139 346 441 418 223 -79 -343 -476
1889 -476 -390 -228 25 295 515 485 249 -39 -248 -413 -503 -315 18 297 412 474 296 30 -227 -427 -457 -345
$$ packed form
1737e30J4J25L91M11J47k9k08k48m06k82OK76K99L06L14k7j31l80m02j60q1J93
1759d02K87M31K49lj81k60l56k82q5K30K36L85K48J01j89k06l85k44j18P3K90
1780a81M03K19Q7n7l58k02l58j44P7K62M21K75P6j8k78l66l23l0m2K37L70L37
1802D07J39r6j73l61l23j44N7K01L55K28J97L0k79k49l08j45QJ01L15M16J77j00
1824D53j41k68l39k44K1J41L29K95K45J0j81k71l30j76qO1K75L43K45J5j04k01
1846A70l59k18j27J96K11L06K67P4j09k76k58k54o3K0K47L13K41O0j0j98l40k77
1868c84j28J27J80K54L60J40q9k85k43k87j07j4K12M03K07R5k3j95l02k64j33
1889d76Q6J62K53K70K20l0k36k88k09j65r0J88L33K79J15O2j78k66k57k00l0J12
$$ plain form
1911 -345 -100 219 437 449 332 57 -206 -497 -523 -334 -34 246 316 455 372 41 -195 -359 -440 -393 -118 124
1933 124 403 412 262 86 -108 -328 -449 -362 -76 126 322 457 406 201 -79 -298 -466 -413 -157 65 300 467
1955 467 385 201 -40 -270 -472 -449 -228 74 252 469 434 181 -7 -285 -464 -470 -247 -29 226 433 425 223
1977 223 12 -246 -506 -369 -253 23 213 440 455 286 95 -145 -408 -374 -209 -99 230 447 442 295 71
1998 71 -221 -406 -434 -320 -63 151 405 493 291 95 -136 -445 -380 -281 -87 165 353 369 281 156 -91 -366
2020 -366 -363 -299 -115 127 354 436 296 170 -29 -332 -394 -343 -159 41 305 395 327 208 -60 -329 -376 -324 -193
2043 -193 -26 259 396 335 245 4 -283 -392 -341 -249 -9 254 450 288 270 -15 -274 -361 -335 -204 -49 222
2065 222 422 297 306 58 -170 -324 -321 -291 -52 204 358 256 324 105 -231 -406 -340 -311 -77 182 346 363 289
$$ packed form
1911c45K45L19K18J2j17k75k63k91k6J89L00K80P0J39q3l31k36j64q1M7K75K42
1933A24K79Rj50j76j94k20j21Q7K86K02J96J35n1k05k80k19j68N3K56K22K35J67
1955D67q2j84k41k30k02K3K21L02J78K17l5k53j88k78j79oK23K18K55K07qk02
1977B23k11k58k60J37J16K76J90K27J5j69j91k40k63L4J65J10L29K17nj47k24
1998G1k92j85k8J14K57K14K54Q8k02j96k31l09O5R9J94K52J88J6q8j25k47k75
2020c66LO4J84K42K27Q2j40j26j99l03o2N1J84K00K64R0o8j19k68k69m7N2J31
2043a93J67K85J37o1r0k41k87j09N1R2K40K63J96j62j8k85k59q7K6J31J55K71
2065B22K00j25Rk48k28j54LL0K39K56J54j02O8k19l36j75O6K9K34K59J64J7p4
$$ plain form
2088 289 94 -193 -314 -359 -304 -148 151 308 344 256 122 -177 -332 -297 -285 -173 97 343 289 305 135 -86 -279
2111 -279 -311 -289 -130 108 286 295 299 269 -11 -290 -296 -259 -217 27 288 418 344 200 -50 -246 -337 -357 -178 18 219
2136 219 330 324 243 -19 -225 -323 -361 -241 -1 258 332 296 191 34 -151 -296 -333 -204 -48 163 319 297 276
2159 276 36 -145 -227 -324 -370 -103 154 328 353 274 68 -102 -277 -369 -266 -95 98 195 294 244 107 -78 -244
2182 -244 -315 -331 -121 134 228 269 285 157 -101 -254 -345 -289 -173 58 248 339 231 160 -31 -196 -263 -347 -114 30
2206 30 199 259 276 229 -29 -138 -346 -309 -138 -4 221 335 310 151 -11 -224 -285 -315 -222 19 120 306 256
2229 256 255 130 -156 -231 -206 -188 -37 123 268 323 255 55 -127 -222 -256 -209 -95 131 218 280 258 15 -103 -214
2253 -214 -291 -267 -130 98 201 278 298 108 -53 -207 -382 -283 -77 54 216 334 252 140 -81 -237 -361 -246
$$ packed form
2088B89j95k87j21m5N5J56K99J57L6q8j34k99j55L5J2J12K70K46n4J6j70k21j93
2111b79l2K2J59K38J78RMl0k80k79oL7M2K44K61J30p4j44k50j96r1k0J79J96K01
2136B19J11oq1k62k06r8l8J20K40K59P4l6j05j57j85j45l7J29J56K11J56k2k1
2159B76k40j81q2r7m6K67K57J74K5p9k06j70j75r2J03J71J93R7R9n0j37j85j66
2182b44p1j6K10K55R4M1J6j28k58j53r1N6J16K31J90R1j08p1j91j65o7q4K33J44
2206C0J69O0J7m7k58j09k08L7J71J34K25J14k5j59j62k13o1l0R3K41J01J86n0
2229B56jj25k86p5K5J8J51J60J45N5o8k00j82r5l4M7J14K26Q7O2k2k43j18j11
2253b14p7K4J37K28J03P7K0j90j61j54j75R9K06J31J62J18q2j12k21j56j24J15
$$ plain form
2275 -246 -124 24 207 305 283 149 -48 -172 -281 -278 -183 71 197 270 212 201 -15 -186 -266 -254 -115 -19 119 229
2299 229 246 174 5 -182 -308 -300 -227 -40 142 237 281 236 91 -159 -250 -262 -216 -95 89 238 219 120 36 -78 -201
2324 -201 -294 -205 -101 150 222 255 218 79 -104 -188 -282 -163 -187 13 236 280 194 66 -31 -240 -227 -196 -70 15 144
2349 144 310 167 69 -91 -159 -221 -235 -96 52 208 192 265 160 1 -158 -265 -266 -116 37 128 224 288 179 19
2373 19 -174 -260 -214 -174 -68 129 299 222 231 44 -112 -252 -204 -190 -74 147 240 274 197 31 -98 -180 -278 -191 -41
2398 -41 81 205 204 167 87 -105 -201 -213 -180 -63 46 187 235 205 124 -23 -182 -258 -191 -96 56 221 193 196 126 -37
2424 -37 -223 -224 -216 -83 23 158 201 194 107 -29 -151 -214 -245 -152 -8 138 205 231 138 -12 -163 -184 -204 -133 48 206
2450 206 199 208 176 22 -114 -189 -214 -115 -1 112 119 156 123 36 -163 -206 -211 -176 -51 98 225 258 174 51 -92 -186 -187
$$ packed form
2275b46J22J48J83R8k2j34j97j24j09LR5K54J26P3n8j1k16j71q0J2J39R6J38J10
2299B29J7p2j69j87j26QP3J87J82R5M4m5j45k50r1j2M6J21J84J49j9r9q4j14j23
2324b01r3Q9J04K51P2L3l7j39j83q4r4J19k4K00K23M4q6j28r7k09J3L1J26Q5J29
2349A44J66j43r8j60o8o2j4J39J48J56j6P3j05j59j59j07jJ50J53R1R6O4j09j60
2373A9j93q6M6M0J06J97J70p7Rj87j56j40M8J4J16K21R3L4p7j66j29q2r8Q7J50
2398d1J22J24jl7q0j92r6j2L3J17J09J41M8l0q1j47j59p6O7R5J52J65k8Lp0j63
2424c7j86jQJ33J06J35M3pq7j36j22o3l1R3J44J46O7K6r3j50j51k1k0P1J81J58
2450B06pRl2j54j36p5k5R9J14J13PL7l3q7j99m3nL5J25J49J27L3q4j23j43r4j
$$ plain form
2477 -187 -164 -74 103 131 234 195 47 -102 -181 -166 -161 -77 46 156 213 192 10 -72 -183 -221 -185 -76 29 139 165
2502 165 193 90 -14 -148 -169 -225 -118 -13 117 179 244 86 9 -148 -158 -210 -185 -3 85 196 206 73 -42 -111
2526 -111 -142 -156 -119 -10 43 206 212 104 15 -77 -136 -210 -141 -38 132 151 224 136 -18 -75 -153 -192 -182 -52 101 81
2552 81 160 131 24 -110 -201 -200 -111 -32 93 100 177 145 69 -55 -149 -162 -150 -59 22 160 166 204 68 6 -137 -182 -171 -56
2580 -56 -6 41 191 190 36 -54 -111 -208 -159 -88 -9 146 141 167 72 6 -86 -116 -133 -113 23 102 146 138 89 -14 -109 -158 -155 -147
2610 -147 -90 101 126 148 102 4 -70 -146 -153 -128 -13 65 138 168 85 13 -97 -149 -222 -129 -13 17 91 129 158 -35 -111 -108
2638 -108 -175 -103 -94 -4 75 195 157 81 -13 -108 -169 -150 -88 16 112 118 130 23 16 -116 -151 -150 -45 6 32 162 93 119 7
2667 7 -89 -169 -159 -43 17 113 125 175 52 -50 -126 -106 -168 -91 -1 78 123 136 46 25 -53 -160 -115 -89 30 78 130 146
$$ packed form
2477a87K3R0J77K8J03l9j48j49p9J5NQ4J23J10N7k1j82q2j11l8L6J09J05J10K6
2502A65K8j03j04j34k1n6J07J05J30O2O5j58p7j57j0n2K5J82Q8J11J0j33j15o9
2526a11l1j4L7J09N3J63Oj08q9r2n9p4O9J03J70J9P3q8j54n7p8l9J0J30J53k0
2552H1P9k9j07j34r1JQ9P9J25PP7l2p6j24r4j3J2R1Q1J38OL8j36o2j43m5J1J15
2580e6N0M7J50jj54r0n7r7M9P1P9J55nK6r5o6r2l0j7K0J36P9M4qm9j03r5m9LQ
2610a47N7J91K5K2m6r8p4p6pK5J15P8P3L0q3p2j10n2p3R3J16L0P4L8K9j93p6L
2638a08o7P2RR0P9J20l8p6r4r5o1J9O2J04R6OJ2j07pj32l5JJ05N1K6J30o9K6j12
2667Gr6q0J0J16O0R6J2N0j23j02p6K0o2P7R0P9M5J3r0k1p8j07M5K6J19M8N2J6
$$ plain form
2695 146 132 88 -63 -165 -121 -69 -40 0 148 122 73 73 -70 -144 -136 -150 -6 -10 85 149 48 -11 4 -74 -167 -91 -28 44
2723 44 100 107 140 96 -5 -105 -163 -122 -35 16 45 109 116 48 -53 -49 -125 -128 -86 -4 82 104 152 82 -11 -79 -128 -101 -68 -2 53
2754 53 150 135 35 17 -63 -141 -141 -118 -1 14 123 138 76 32 -45 -110 -91 -105 -26 13 75 124 129 38 -69 -62 -107 -42 -2 51
2784 51 98 136 129 -7 -17 -43 -119 -127 -72 10 44 141 82 74 -17 -52 -105 -165 -121 -39 21 29 139 69 4 -92 -123 -61 -120 26 61
2815 61 119 145 36 22 -19 -130 -111 -156 6 52 57 93 55 -30 -79 -96 -39 -32 0 38 73 95 29 7 -31 -73 -105 -105 -35 100
2845 100 134 129 16 25 -38 -50 -86 -67 -25 52 15 95 95 24 47 -45 -104 -83 -66 -9 78 61 99 70 -71 -73 -102 -54 -22 9 63
2876 63 108 81 -100 38 -79 -65 -95 -76 -3 96 113 36 7 9 -36 -85 -67 -86 -25 58 49 89 36 15 -57 -61 -56 -23 -41 72
2906 72 84 103 56 -30 -31 -117 -44 -61 -53 53 63 76 47 -4 -40 -18 -95 -65 -51 7 29 46 43 50 -16 -81 -97 -74 -26 -15 92
$$ packed form
2695A46j4m4j51j02M4N2K9M0J48k6m9%j43p4Qj4J44mR5O4j01n9J5p8r3P6O3P2
2723D4N6PL3m4j01j00n8M1Q7N1K9O4Po8j01Mp6lM2Q2Q6K2M8p0r3o8m9K7L3O6N5
2754E3R7j5j00j8q0p8%K3J17J5J09J5o2m4p7o5J9j4P9L9O2M9Nr1j07Pm5O5M0N3
2784E1M7L8pj36j0k6p6qN5Q2L4R7n9qr1l5n3o0M4Q2O0QJ10p0o5r6l1O2n9J46L5
2815F1N8K6j09j4m1j11J9m5J62M6NL6l8q5m9j7N7PL2L8L5K2o6k2l8m2l2%P0J35
2845A00L4nj13Ro3j2l6J9M2P7l7Q0%p1K3r2n9K1J7N7Q7j7L8k9j41kk9M8L2L1N4
2876F3M5k7j81J38j17J4l0J9P3R9J7p7k9Km5m9J8j9O1Q3rM0n3k1p2mNL3j8J13
2906G2J2J9m7q6jq6P3j7QJ06J0J3k9n1l6K2p7L0J4N8K2J7lPo6o5j6K3M8J1J07
$$ plain form
2937 92 58 100 33 -39 -53 -20 -120 -22 -12 67 130 91 67 27 -44 -54 -38 -62 -13 27 95 42 38 27 4 -15 -49 -41 -5 4 79
2968 79 11 92 -39 -35 -102 -99 1 -5 49 22 10 59 30 -17 -49 -81 -60 -58 69 39 68 51 15 -44 -9 -75 -43 -29 -4 3 32
2999 32 71 9 13 -45 -43 -50 -64 11 83 62 61 33 35 -32 -78 -35 -120 -31 29 43 72 9 -1 -20 -55 -55 -62 -10 84 69 72 28 9 -9
3033 -9 -90 -92 -23 -20 26 23 38 43 65 8 -121 -51 -36 11 67 33 58 81 8 -15 -47 -50 -73 -38 -4 81 4 56 -21 -41 -80 -26 -73
3066 -73 -28 45 9 123 46 51 -27 -34 -22 -54 -75 -52 65 77 38 64 1 -101 -71 -11 -48 -44 50 38 45 9 -38 -15 -130 -142
3096 -142 -107 36 52 40 82 23 8 -5 -91 -52 -106 -74 -22 -2 22 77 24 13 -36 -54 -49 -36 2 47 37 30 40 7 22 -86
3126 -86 -64 6 33 40 69 76 12 -30 -34 -32 -35 -30 -43 11 1 47 70 13 -7 -37 -57 -14 9 -5 36 80 31 34 -18 -14 -59 -10 -77 59
3160 59 89 48 34 56 31 -66 -25 -76 22 15 67 64 47 27 -70 -64 -52 35 39 6 59 28 11 -26 11 -25 -64 -89 -60 3 10 52 51
$$ packed form
2937I2l4M2o7p2j4L3j00R8J0P9O3l9k4m0p1j0J6k4M9M0O8n3mj1k3j9l4QL6RP5
2968G9o8Q1j31Mo7LJ00oN4k7j2M9k9m7l2l2K1KJ27l0K9j7l6n9L5o6L2J4K5PK9
2999C2L9o2Mn8Kpj4P5P2k1jk8Ko7m6M3q5Q9O0J4K9o3j0j9l5%pN2R4j5Lm4j9j8
3033iq1kO9LM6lJ5NK2n7j29P0J5M7N6l4K5K3p3k3l2lk3L5L4Q5p7N2p7k0l9N4m7
3066g3M5P3l6J14p7Np8pJ2l2k1K3J17J2l9K6o3j02L0O0l7MR4j2Pl6m7K3j15j2
3096a42L5J43J6j2M2n9j5j3q6L9n4L2N2K0K4N5n3j1m9j8NJ3L8M5j0pJ0l3J5j08
3126h6K2P0K7PK9Po4m2mKlNj3N4j0M6K3n7k0l0k0M3K3j4M1M4m9Ln2Mm5M9o7J36
3160E9L0m1j4K2k5r7M1n1R8pN2lj7k0r7OJ2Q7Ml3N3l1j7l7L7l6l9k5K9O3PM2j
$$ plain form
3193 51 6 43 -4 -48 19 -12 -17 35 24 47 54 -9 -35 -57 -43 22 50 49 62 61 22 -81 28 -36 -104 -31 17 13 92 24 -12 26
3225 26 -35 -67 -75 -37 -15 -19 -18 89 73 39 -2 -53 -38 -66 12 34 13 87 28 43 64 -20 -80 -33 -33 8 17 70 39 71 9 -27
3257 -27 -59 -13 40 -66 32 57 2 17 67 -26 -64 -72 -48 -24 9 6 41 24 61 -15 -59 -8 -54 -30 71 47 33 41 3 -32 -64
3288 -64 -23 -3 -44 4 74 79 47 -31 -24 -105 -32 -25 -15 30 -1 49 55 3 8 -51 -31 -39 -24 32 63 17 64 -2 14 -22 -20 -88 -20 -20
3322 -20 38 48 57 39 19 -37 -37 -67 -60 8 -7 50 103 19 -9 -45 -42 -69 -41 -50 0 65 41 47 -37 -82 -43 -55 -80 -53 -20 65 27
3355 27 75 -60 -48 -1 -74 -41 -15 31 30 21 45 12 -36 -29 -68 -30 -22 -15 31 52 62 18 -9 17 7 -43 35 67 -51 64 66 54
3387 54 -45 -83 -75 -14 -53 -2 23 20 23 20 10 -68 -52 -83 -90 -63 58 57 40 82 51 -43 -32 -12 -4 -48 43 18 56 36 10 -7 -36
3420 -36 -93 -91 -54 6 81 74 8 -1 43 -54 0 -80 -16 -43 66 20 15 22 2 -44 -50 -49 -8 16 8 33 24 24 9 -49 -66 -97 -22 25 51
$$ packed form
3193E1m5L7m7m4O7l1nN2j1K3Po3k6k2J4O5K8jJ3jl9j03J09o4o8P3M8mP9o8l6L8
3225B6o1l2qL8K2mJJ07j6l4m1n1J5k8P8K2k1P4n9J5K1q4o0M7%M1RN3l1L2o2l6
3257b7l2M6N3j06R8K5n5J5N0r3l8qK4K4L3lL5j7L7p6m4N1m6K4J01k4j4Ql8l5l2
3288f4M1K0m1M8P0Nl2p8Pq1P3PJ0M5l1N0On2Nn9K0qJ5N6L1m6M7o6J6l6Ko8O8%
3322b0N8J0Rj8k0n6%l0PO8j5N7N3q4k8l6Lk7K8rN0O5k4Oq4m5L9j2k5K7L3Q5l8
3355B7M8j35J2M7p3L3K6M6jrK4l3m8Pl9L8QPM6K1J0m4k7K6j0n0P8L2j18J15Kj2
3387E4r9l8QO1l9N1K5lLlj0p8J6l1pK7J21jj7M2l1r4J1K0Qm4R1k5L8k0k6j7k9
3420c6n7KL7O0P5po6rM4r7N4q0O4k7J09m6nPk0m6oJM1K4qK5r%j5n8j7l1P5M7K6
$$ plain form
3455 51 0 14 -11 -56 -16 -53 -39 -75 -40 44 76 49 23 28 -15 -46 -65 -42 -15 37 61 -23 82 -8 -36 -64 -74 -28 -24 46 69
3486 69 68 35 34 -27 -39 -120 -51 3 0 74 84 75 21 10 -47 -81 -6 0 -46 17 45 68 58 -15 -8 -54 -67 -26 15 31 64 37 59
3519 59 -14 -20 -79 -38 -1 -17 41 21 25 -3 33 -30 -30 29 24 -9 -13 62 61 15 29 -55 -75 -96 -86 -35 -10 7 26 26 0 -30 -68 -86
3553 -86 4 -68 24 92 76 22 -27 -53 -71 -65 -3 -7 -1 -4 21 26 -27 -9 17 -43 -36 -37 38 52 2 38 32 31 -1 -57 -24 -58 10 42 15
3588 15 95 56 71 -80 -47 -88 -23 -16 44 98 24 56 -57 15 -6 -60 -85 -14 20 96 80 79 77 4 -46 -56 -17 -55 43 49 50 31
3620 31 57 56 -51 -35 16 -35 10 28 66 62 -27 26 -94 -81 -33 -41 28 39 40 42 48 -8 -50 10 -51 51 -78 41 79 44 69
3651 69 14 -45 -30 -57 -48 -1 20 17 50 31 2 -72 -3 -23 -15 13 14 44 55 13 -20 -3 -38 -64 -60 -21 30 30 12 8 11 -7 -63 -83
3685 -83 -42 23 -36 37 25 97 -20 -14 -16 -73 -22 22 -4 7 63 88 68 29 -15 -17 -13 -7 9 39 101 58 -5 -3 -65 -69 -57 -65 27 -4
$$ packed form
3455E1n1J4k5m5M0l7J4l6L5Q4L2k7k6Nm3l1j9K3K7N2K4q4J05r0k8k8j0M6MP0K3
3486F9jl3jo1j2q1O9N4lP4J0rn4j1n7l4P5Om6O3K8K3j0p3Pm6j3M1M1J6L3k7K2
3519E9p3on9M1L7j6N8k0Mk8L6o3%N9nl3mP5jm6J4q4k0k1J0N1K5J7J9%k6l0l8j8
3553h6R0p2R2O8j6n4m9k6j8OO2mOlK5Nn3J8K6o0PjP5J4n0L6ojl2n6L3l4O8L2k7
3588A5Q0l9J5j51L3m1O5PO0N4p4L2j13P2k1n4k5P1L4P6j6jkp3n0j0L9l8R8OJj9
3620C1K6jj07J6N1n1M5J8L8mq9N3j20J3M8qO9J1JKOn6m2O0o1J02j29J19L8l5K5
3651F9n5n9J5k7RM7K1lL3j9k9p4O9k0QK8JL0J1m2l3J7l5k6ML9N1%j8mLj8n6k0
3685h3M1O5n9P3j2P2j17Okn7N1M4k6J1N6K5k0l9m4kMOJ6L0O2m3o3Ko2mJ2qR2l1
$$ plain form
3719 -4 62 76 42 34 -83 -42 -17 3 -69 9 23 104 47 16 -32 -2 -38 -18 38 -18 57 84 39 21 2 -13 -87 -14 -15 35 103
3750 103 7 48 11 -26 -54 -57 1 43 50 52 35 49 12 -48 -73 -72 -5 -12 31 41 82 47 29 -28 -60 -80 20 -15 77 34 32 161
3782 161 42 -11 -74 28 -45 5 23 19 60 0 74 -35 -30 -28 -92 -16 -25 48 104 53 75 1 -48 -55 -50 -34 -42 -67 85 31 15
3813 15 21 -84 -34 -36 -73 9 81 88 71 121 -8 -11 9 -32 -83 16 27 95 66 40 58 -73 -31 -140 0 -11 -18 -8 95 43
3843 43 39 -50 -61 -118 -45 -48 2 59 19 59 16 20 -48 -118 -66 -3 76 61 58 92 -32 -25 -116 -36 -26 7 12 13 54 36 8 53 -6
3876 -6 -29 -21 -36 3 -5 84 21 98 18 -53 -127 -58 -12 -10 15 35 36 26 27 -41 -51 -61 -68 -8 -5 97 93 106 42 -26 -43 -85 -44 -21
3910 -21 23 90 61 70 12 -31 -44 -62 -58 1 -5 40 89 61 -7 -32 -16 6 -10 -57 2 -37 53 -14 35 -25 -61 -27 16 -103 24
3941 24 45 50 89 6 -9 -101 -100 -27 -36 35 7 35 26 19 43 12 -21 -106 -44 19 53 46 56 3 -28 -68 -34 -73 -56 -22 25 103 92
$$ packed form
3719dO6J4l4qj17M1K5K0p2P8J4Q1n7l1m8L0l6K0N6n6P5K7m5j8j9j5p4P3jN0O8
3750A03r6M1l7l7k8lN8M2PKj7J4l7o0k5JO7pM3J0M1l5j8n7l2k0J00l5R2m3kJ29
3782A61j19n3o3J02p3N0J8mM1o0P4j09NKo4P6rP3N6n1K2p4m9pNJ6qk5J52n4j6
3813A5Oj05N0kl7Q2P2Pj7N0j29lK0m1n1R9J1O8k9k6J8j31M2j09J40j1pJ0J03n2
3843D3mq9j1n7P3lN0N7m0M0m3Mo8p0N2O3P9j5lL4j24Pr1Q0J0L3NJM1j8k8M5n9
3876fk3Qj5L9qQ9o3P7q0p1p4O9M6KK5K0Jj0Jo8j0j0pO0LJ02mJ3o4o8j7m2M1K3
3910b1M4O7k9Rn8m3j3j8MN9oM5M9k8o8k5J6K2j6m7N9l9R0o7M9o0l6L4M3j19J27
3941B4K1NL9q3j5r2JP3rP1k8K8rpK4l1l3q5O2O3L4pJ0n3l1m0L4l9J7L4M7P8j1
$$ plain form
3974 92 -12 9 -57 -48 -71 -11 24 59 26 59 28 34 -39 -59 4 -65 44 35 69 107 62 15 5 -80 -76 -41 -32 79 49 69 17
4005 17 -17 6 -31 -36 -79 -15 67 45 59 23 24 -28 -42 -85 -8 -56 16 -15 52 13 21 -41 -18 -96 -108 -47 1 30 58 21 53 -5
4037 -5 -96 -29 -35 -4 27 47 40 26 16 14 -7 -64 -45 30 -22 3 21 113 81 8 11 -71 -68 -52 -28 -9 46 8 -16 28 -48 -38 -32 -20
4071 -20 60 79 36 82 33 29 -18 9 -79 -46 64 66 113 27 67 87 13 -70 -15 -49 -25 -7 35 17 44 -9 0 -48 -53 2 -24 40
4103 40 19 41 58 21 27 -67 -77 -15 -25 20 30 42 19 86 -91 -13 -42 -12 -71 -55 35 40 48 27 -88 -19 -63 -44 -57 12 30
4134 30 61 78 13 11 -14 -29 -59 14 60 2 53 48 37 -47 -27 -20 -94 -12 -27 33 -28 55 25 17 27 -62 -14 -48 -49 -36 41 59 77
4167 77 -3 -13 -62 -33 -30 11 -5 44 86 38 42 2 -4 -40 -73 -41 -4 17 74 32 54 -12 6 -53 -67 -4 -3 6 67 41 -25 -3 -99
4200 -99 15 -63 -86 19 65 44 32 9 -29 -1 -105 -41 -55 -6 28 24 39 10 -33 -17 -83 -72 -71 15 2 40 42 -28 -7 -97
$$ packed form
3974I2j04K1o6Rk3O0L5L5l3L3l1Op3k0O3o9J09rL4L8m5m7j0q5ML5RJ11l0K0n2
4005A7l4K3l7nm3O4Q2k2J4l6Jn2j4m3P7m8P2l1O7l9Qo2K3p8j2O1M8K9K8l7L2n8
4037er1O7oL1L1K0pj4j0kk1n7J9P5n2K5J8R2l2p3Lq2LJ6K4J9N5l8k4M4p6J0OJ2
4071b0Q0J9m3M6m9mm7K7q8L3J10KM7q6M0K0p4q3N5l4K4J8M2j8K7n3Rm8nN5k6O4
4103D0k1K2J7l7Or4j0O2j0M5J0J2k3O7j77P8k9L0n9J6R0NQk1j15O9m4J9j3O9J8
4134C0L1J7o5kk5j5l0P3M6n8N1nj1q4K0Pp4Q2j5O0o1Q3l0qJ0q9M8l4jJ3P7J8J8
4167G7q0j0m9K9LM1j6M9M2m8Mm0ol6l3L2L7K1N7m2K2o6J8n9j4O3JRO1k6o6K2r6
4200i9J14p8k3J05M6k1j2k3l8K8j04O4j4M9L4mJ5k9m3J6o6J1JQ6j3L8Kp0K1r0
$$ plain form
4230 -97 -44 -55 -23 -26 -11 38 -5 16 40 13 -24 -7 -75 16 34 75 18 54 21 -29 -75 -12 -33 -15 58 43 108 26 -25 -5 0
4261 0 -43 -19 1 63 14 41 -11 19 -88 -43 -119 -59 -21 -36 10 73 109 16 -45 -33 -49 -33 41 -32 48 64 58 14 -31 -43 -5
4292 -5 -24 -22 -36 44 68 137 45 28 -26 -34 50 -55 -11 21 22 23 70 15 -6 9 6 -45 12 45 91 43 4 17 -72 -34 -14 -3 -14
4325 -14 17 52 48 8 44 37 1 -60 0 -9 -15 21 27 15 -24 18 -44 -15 -17 -64 -27 23 23 26 -15 -7 -66 -22 -13 -74 -32 90 38 67 47
4360 47 12 -63 2 -37 -32 43 15 8 30 -35 13 -39 10 -50 -22 -5 -3 12 52 43 -37 -83 -54 3 -54 -31 -4 38 25 18 -21 -72 19
4393 19 -79 -6 -30 42 70 60 0 -55 -36 -7 26 16 52 42 30 41 57 50 -32 -70 0 -37 34 50 10 -4 99 -3 -6 13
4423 13 0 -49 7 66 12 65 57 -1 14 -11 -60 -48 -24 -2 18 59 34 1 46 -7 -57 31 -35 22 -14 41 -50 29 25 -14 -55
4454 -55 -58 -71 -23 39 2 16 24 -43 -52 -85 -75 10 5 21 42 1 9 39 -10 -21 -35 -42 -29 -16 41 0 -27 -13 -13 -53 22 -48 -27 75
$$ packed form
4230i7N3j1L2lJ5M9m3K1K4k7l7J7o8R1J8M1n7L6l3n0m6O3k1J8P3j5O5q2n1K0N
4261@m3K4K0O2m9K7n2L0j07M5p6O0L8j5M6O3L6r3o1J2j6J6P4p3Q0J6om4m5j2L8
4292ej9Kj4Q0K4O9r2j7n4qQ4j05M4L2JJM7n5k1J5ln1N7L3M6m8l9J3q9L8K0J1j1
4325a4L1L5mm0L6pl6o1O0roL6Oj2l9M2o2K9km7L7N0%Lm1Qn9M4Ro1M2J22n2K9k0
4360D7l5p5O5l9NP5k8pK2o5M8n2M9o0K8J7KJ5M0rq0m6K9N7n7K3K7M2j3pl9n1R1
4393A9r8P3k4P2K8j0o0n5J9K9L3j0L6j0j2J1J6pq2l8P0l7P1J6m0j4J03j02lJ9
4423A3j3m9N6N9n4N3qn8J5k5m9J2K4K2K0M1k5l3M5n3n0Q8o6N7l6N5r1P9ml9m1
4454e5lj3M8O2l7J4Qo7rl3J0Q5nJ6K1m1QL0m9j1j4pJ3J3N7m1k7J4%m0P5p0K1J02
$$ plain form
4488 75 -17 112 61 22 -6 -72 38 -18 62 -1 33 27 34 -2 -60 -2 -32 -45 38 55 88 19 41 -6 -2 -33 -36 -26 14 7 47 67
4520 67 40 23 -1 -67 -46 -9 -54 -95 67 42 43 -7 -18 -27 -41 -26 -52 20 23 62 53 0 -15 50 -31 26 -10 -14 18 65 82 12
4552 12 33 -69 -74 -36 -1 -18 -23 9 -21 29 -35 -46 -21 -24 -25 -67 -53 -13 41 49 14 -15 -26 -49 -14 18 3 12 35 45 9 -59 -33
4585 -33 11 -64 -19 5 -8 32 0 -12 -16 -31 -27 16 -41 -38 -4 52 25 14 3 -95 -14 -65 -49 0 -8 10 23 37 28 -36 -27 23 -85
4618 -85 18 6 16 19 63 -41 -47 -51 -34 -23 40 -12 -13 51 34 1 -36 29 -11 -22 115 -23 -26 21 -14 -29 -67 -41 3 -85 -36
4649 -36 28 58 38 -18 35 -29 -6 -4 -62 -62 -1 29 16 51 48 -50 -14 -29 -6 34 27 55 19 35 49 -37 -52 -67 1 6 -29 23 50
4682 50 27 29 -7 -60 -42 -19 44 17 56 66 29 4 -11 -50 -15 -39 8 6 32 53 8 96 47 22 -53 -3 -16 32 5 27 47
4713 47 -11 -34 20 -2 -35 23 43 14 15 4 25 -7 4 -33 1 -30 -59 56 68 15 28 11 -15 5 -39 -49 -7 9 46 -19
$$ packed form
4488G5r2J29n1l9k8o6J10n6Q0o3L4oPl6n8N8l0j3Q3J7L3o9K2m7Ml1lJ0M0pM0K0
4520F7k7j7k4o6K1L7m5m1J62k5Jn0j1rj4J5k6P2LL9rn3j5O5q1N7l6mL2M7J7p0
4552A2K1j02nL8L5j7nL2l0N0o4j1K5ljm2J4M0N4Ql5k9j1k3L5L2j5RK3J0l6o8K6
4585c3M4p5M5K4j3M0l2j2mj5MM3n7LL4N6k7j1j1r8Q1n1J6M9qJ8J3J4ro4RN0j08
4618h5J03j2J0LM4j04omJ7J1O3n2jO4j7l3l7O5m0j1J37j38lM7l5j5l8K6M4q8M9
4649c6O4L0k0n6N3o4K3Kn8%O1L0j3L5lr8L6j5K3M0pK8l6J6J4q6j5j5O8Nl5N2K7
4682E0k3Kl6n3J8K3O3k7L9J0l7k5j5l9L5k4M7kK6K1m5Q8m9k5p5N0j3M8k7K2K0
4713D7n8k3N4k2l3N8K0k9Jj1K1l2J1l7L4l1k9J15J2n3J3j7k6K0m4j0M2J6L7o5
$$ plain form
4743 -19 32 61 -55 -33 -17 8 33 12 -1 23 35 -39 -13 -5 14 -5 18 -7 -24 12 1 -42 -7 -23 -45 -2 -31 3 45 72
4773 72 56 43 7 21 3 -24 24 45 3 27 74 -32 24 -9 -12 44 17 5 -18 71 -6 -47 5 15 -21 -14 13 -10 26 0 8
4804 8 9 -51 -5 -51 -25 -26 -41 15 32 28 -26 -33 28 -38 -1 10 -36 -23 3 50 -36 -22 -40 11 -48 -37 -35 -20 56 13 22 30 -14 10
4838 10 -5 8 -14 19 35 -17 25 14 -17 26 22 -16 -3 -20 20 51 24 -46 44 -35 -11 -58 -30 6 -22 4 -49 8 -10 14 -51
4869 -51 -4 36 10 -14 -3 12 -16 -8 16 32 -21 31 37 44 -6 18 3 23 17 -19 -34 -11 41 1 52 23 70 -44 1 20 14 15 7
4902 7 -7 7 24 -10 14 -11 -2 -64 -54 90 -17 -23 72 22 26 -47 -14 1 -60 -81 20 32 48 50 -36 -44 -39 28 9 12 44 6 -2
4935 -2 18 29 -22 -28 -3 -36 27 -51 -26 64 28 -44 -8 3 32 21 2 34 -4 -30 -18 33 -52 -49 -21 20 33 1 71 13 12 37
4967 37 -33 -49 -71 -33 6 66 -7 66 -26 -6 -8 23 -33 28 14 -7 23 15 6 -34 -69 -30 -56 3 -4 -24 0 23 1 -1 34 -23 -21
$$ packed form
4743a9N1K9j16K2J6K5K5k1j3K4J2p4K6QJ9j9K3k5j7L6j1m3L5j6k2M3k9L4M2K7
4773G2j6j3l6J4j8k7M8K1m2K4M7j06N6l3lN6k7j2k3Q9p7m1N2J0l6PK7k3L6k6Q
4804HJo0M6m6K6jj5N6J7mn4pO1o6L7J1m6J3K6M7q6J4j8N1n9J1KJ5P6m3RQm4K4
4838A0j5J3k2L3J6n2M2j1l1M3ml8J3j7M0L1k7p0R0p9K4m7K8L6k8K6n3N7j8K4o5
4869e1M7M0k6k4J1J5k8QK4J6n3N2OPn0K4j5K0ol6j5K3N2m0N1k9M7j14M5J9oJq
4902Gj4J4J7l4K4k5Ro2J0J44j07oR5n0Mp3L3J5o1k1J01J2J6Kq6qNO7j9LL2l8q
4935bK0J1n1oK5l3O3p8K5R0l6p2L6J1K9j1j9L2l8k6J2N1q5LK8M1J3l2P0n8jK5
4967C7p0j6k2L8L9O0p3P3r2K0kL1n6O1j4k1L0qrm0l5L9k6N9pk0K4K3k2kL5n7K
$$ plain form
5000 -21 -18 -60 30 27 101 -22 -48 16 9 4 -62 22 -4 27 30 8 -23 20 40 16 27 -29 -27 2 -2 -25 -13 -56 -49 -42 -14 30 54 -3
5034 -3 53 4 -27 69 2 -28 -22 -79 67 11 39 7 44 30 13 -9 27 24 -24 39 -24 27 25 28 -54 -73 -14 2 -21 23 5 24
5066 24 -25 -31 11 -2 14 -56 38 -7 -15 85 -47 5 6 -42 -2 -28 12 20 -31 -19 49 52 -8 -5 -24 -2 17 45 -5 -31 54 14
5098 14 2 5 35 -41 18 34 7 49 19 -45 9 72 -26 25 24 -20 1 2 -40 20 38 -13 -5 -71 -1 15 22 -9 -12 35 -19 -27 -50 -24
5132 -24 -8 20 -48 -18 -21 -16 29 21 -79 -22 1 22 -19 14 31 -32 31 -31 4 31 -24 7 11 54 -10 -11 -58 -21 -48 -34 -6 45
5164 45 -17 14 -2 29 -53 -24 -11 9 -4 13 32 28 -17 15 -1 -2 5 37 16 26 7 30 -16 -13 -3 -42 -15 -46 -5 33 -52 66
5196 66 -37 2 25 -28 -29 -21 -10 44 63 -18 -44 -24 24 48 -7 -37 5 -32 80 71 39 -15 26 -5 -17 14 -16 64 25 60 -16
5227 -16 -29 -52 0 -31 -37 -54 0 -9 48 29 6 -16 43 -13 21 11 12 29 57 33 20 -20 -19 -29 6 35 -8 17 22 33 -10 -35 -20
$$ packed form
5000b1Lm2R0lP4j23k6O4pno6Q4k6L1Lk2l1M3K0k4J1n6KK9mk3J2m3PPK8M4K4n7
5034cN6m9l1R6o7l0On7J46n6K8l2L7j4j7k2L6lm8O3o3N1kLq2j9N9J6k3M4j8J9
5066B4m9oM2j3J6p0R4m5qJ00j32N2Jm8M0k6M0Qn1J2O8Lo0Lj9K2J9K8n0k6Q5m0
5098A4j2LL0p6N9J6k7M2l0o4N4O3r8N1jm4K1Jm2O0J8n1Qo6P0J6Pl1lM7n4qk3K6
5132b4J6K8o8L0lNM5qj00N7K3K1m1L3J7o3O3o2L5K7n5L1MM3o4jm7L7k7J4K8N1
5164D5o2L1j6L1q2K9J3K0j3J7J9mm5L2j6jPL2k1J0j9K3m6LJ0l9K7l1M1L8q5J18
5196F6j03L9K3n3jQJ1N4J9q1k6K0M8K4n5l0M2l7J12rl2n4M1l1j2L1l0Q0l9L5p6
5227a6j3k3N2l1oj7N4rN7j9k3k2N9n6L4j0JJ7K8k4j3m0Jj0L5K9m3K5NJ1m3k5J5
$$ plain form
5260 -20 -1 -47 -32 -35 34 58 22 -28 23 2 -15 44 31 6 -1 9 8 -22 -61 -36 1 -9 2 -37 2 -34 49 48 0 3 -77 34
5292 34 -27 -4 34 -44 -9 11 -9 25 -56 -11 44 29 -23 58 10 -12 10 -13 4 -13 -18 75 19 19 -33 28 27 0 -6 -14 0 10 -27
5325 -27 16 40 24 40 -28 -46 -28 -25 -31 -39 11 89 40 50 30 -7 -16 -33 -25 -21 7 75 -11 -4 50 -13 -3 57 -20 -6 -6 19 48 9
5359 9 26 -37 -40 23 -13 -57 10 5 -62 45 50 -23 16 -32 6 20 -3 38 13 -41 -16 -78 -18 37 -10 51 32 47 32 -1 25 8
5391 8 1 12 -36 -12 34 -37 21 4 2 60 -8 -55 0 15 20 38 1 37 11 -1 -32 32 -9 -29 10 103 47 -22 -27 -54 5 41 -18
5424 -18 12 -7 21 20 50 -39 20 -36 -47 -47 0 8 44 -2 7 20 35 -35 11 -11 18 14 45 20 -6 41 16 -17 -1 -7 1 27 -35 40
5458 40 35 12 -15 -9 -22 -49 -39 85 1 27 44 -28 -40 -27 -2 -22 -10 22 15 -16 -5 32 24 -69 44 24 -35 57 10 4 75 -20
5490 -20 0 7 -27 -72 -74 -34 -8 20 -8 -20 -30 -71 -12 -41 -20 54 -14 49 57 32 -6 14 -19 70 -48 11 -16 28 26 -28 -4 12
$$ packed form
5260b0J9m6J5lO9K4l6n0N1k1j7N9j3k5pJ0jl0l9K5L7j0J1l9L9l6Q3jm8Lq0J11
5292C4o1K3L8p8L5K0k0L4q1M5N5j5n2Q1m8k2K2k3J7j7nR3n6%n2O1jk7oqJ4J0l7
5325b7M3K4j6J6o8j8J8LoqN0P8m9J0k0l7rj7QMK8O8q6PN4o3J0O0p7J4%K5K9l9
5359IJ7o3lO3l6m4O7no7J07Np3L9m8L8J4k3M1k5n4K5o2O0N5m7O1j9J5j5l3K6j7
5391HpJ1m8K4M6p1N8j7kN8o8m7N5J5NJ8l7L6k6j2l1O4m1k0L9R3n6o9nk7N9L6n9
5424a8L0j9K8jL0q9N9n6j1%M7QL6m6RJ3J5p0M6k2K9mL1k5k6M7k5l3J6oQK6o2P5
5458D0nk3k7Oj3k7J0J24q4K6J7p2j2J3K5k0J2L2pl1J1L7qr3J13k0n9R2m7oP1r5
5490b0K0Pl4m5kM0K6K8k8j2j0m1N9k9K1P4o8O3Qk5l8K0l3Q9j18N9k7M4kn4K4J6
$$ plain form
5522 12 -2 -12 -62 -8 55 -13 19 0 -39 5 4 35 -12 10 10 14 29 18 32 -6 -36 -65 -19 -40 -6 61 18 32 40 19 0 9 20
5555 20 -38 30 -3 74 33 57 -4 -30 1 -31 16 -40 50 -6 44 31 -45 7 -34 -77 -51 30 -57 -18 29 -24 52 8 2 -2 11
5586 11 -10 -32 11 63 61 47 -28 7 -51 23 -11 -8 -35 0 -8 -15 -33 -9 -39 -15 -23 32 -29 13 47 32 70 -23 -34 -35 21 -5 6
5619 6 23 46 52 23 0 -10 6 -14 22 -32 17 21 -2 17 -83 -20 -13 -13 -41 -8 3 25 -9 -35 9 34 -101 -93 -31 17 52 -15
5651 -15 49 -49 -25 -17 -18 -15 -56 -2 23 2 25 -13 8 -23 -44 -32 14 -10 3 57 60 -17 -13 3 -5 -45 42 -10 24 46 -74 15 4
5684 4 26 1 -12 -46 1 22 54 28 -17 -2 -37 -13 -31 -44 -28 17 9 27 -13 57 12 16 -72 -40 -14 0 59 10 47 -31 32 -42
5716 -42 -20 33 38 -28 56 88 46 2 -24 15 -20 3 56 -22 -10 29 40 55 24 1 -29 -4 7 5 15 25 -5 -19 24 -32 -15
5747 -15 13 -4 -12 24 -11 39 1 16 -8 -98 43 20 50 28 11 68 -32 -20 -24 -37 -17 -14 47 -31 54 72 -14 -75 -8 9 -41
$$ packed form
5522A2j4j0n0N4O3o8L2j9l9M4jL1m7K2%MJ5j1J4l8l0k9M6k1L4O7m3J4Qk1j9RJ1
5555B0n8O8l3P7m1K4o1k6L1l2M7n6R0n6N0j3p6N2m1m3K6Q1q7L9M7n3P6m4omJ3
5586A1k1k2M3N2kj4p5L5n8P4l4Lk7L5qpj8K4l0K4qN5o1M2L4j5L8r3j1jN6k6J1
5619FJ7K3Ok9k3j0J6k0L6n4M9Mk3J9j00O3P%k8L3J1K2l4k6M4K5j35QO2M8L5o7
5651a5O4r8K4QjLm1N4K5k1K3l8K1l1k1J2M6k4J3N4Lp7MJ6qm0Q7n2L4K2j20Q9j1
5684DK2k5j3l4M7K1L2k6m5J5l5K4j8j3J6M5qJ8m0P0m5Mq8L2K6J4N9m9L7p8O3p4
5716d2K2N3No6Q4L2m2m4k6L9l5K3N3p8J2L9J1J5l1k3l0K5J1kJ0J0l0j4M3n6J7
5747a5K8j7qL6l5N0l8J5k4r0J41k3L0k2j7N7j00J2mj3K0LO1p8Q5J8q6o1O7J7n0
$$ plain form
5778 -41 59 17 32 43 13 -3 -40 -16 -60 -49 -14 -56 -22 33 43 27 13 -5 -55 -50 -70 21 45 30 18 30 65 -8 -72 -24
5808 -24 -41 -32 -23 55 29 52 16 -17 19 14 -34 -41 -12 -61 3 14 -51 -28 25 -102 -25 6 22 -35 34 84 16 0 -9 -48 -19 -42
5840 -42 15 -43 12 26 -25 4 -36 -59 -42 -4 21 52 -1 20 34 0 -31 -15 -30 -7 -19 88 56 -33 56 -8 -30 -27 -78 -26
5870 -26 57 23 -7 31 41 59 27 -49 -35 -5 52 20 45 22 -43 -26 -12 28 16 -14 37 24 -10 21 51 -40 -27 -34 -46 -60 39
5901 39 5 9 32 9 2 17 -6 -31 -46 -1 -6 8 37 22 45 -49 -11 -85 -25 -31 3 39 50 72 49 20 1 -92 -13 16 -11 -6 -11
5934 -11 21 53 -16 -43 -34 -25 -62 -7 47 20 -8 37 -26 27 -23 -33 -33 3 -25 23 37 -27 2 13 5 -54 -47 4 41 91 42 33 36 16
5968 16 -16 -70 -4 6 24 35 1 6 -32 -26 -26 -50 -44 -57 25 -18 85 25 10 -26 -38 -26 -40 -29 30 21 30 30 -27 11 1 -40 10
6001 10 -19 -39 28 17 20 9 -64 -20 -39 -36 21 -30 14 -13 62 26 -22 -4 -55 -32 -76 -24 27 38 59 67 19 38 -52 -70 -86 39
$$ packed form
5778d1J00m2J5J1l0j6l7K4m4J1L5m2L4N5J0j6j4j8n0Nk0R1K4j5j2J2L5p3o4M8
5808b4j7RRP8k6K3l6l3L6nm8pK9m9O4J1o5K3N3j27P7L1J6n7O9N0o8j6rl9K9k3
5840d2N7n8N5J4n1K9m0k3J7L8K5L1n3K1J4l4l1J6j5K3j2J07l2q9Q9o4k2Ln1N2
5870b6Q3l4l0L8J0J8l2p6J4L0N7l2K5k3o5J7J4M0j2l0N1j3l4L1L0r1J3pj2j4R9
5901C9l4MK3k3pJ5k3k5j5M5nJ4K9j5K3r4L8p4O0oL4L6J1K2k3k9j9r3P9K9k7Nn
5934a1L2L2o9k7RRl7N5N4k7k8M5o3N3n0j0%L6k8M8J4o4K9J1qn9PN1L7N0m9rLk0
5968A6l2n4O6J0J8J1l4Nl8O%k4Oj3Q2m3J03o0j5l6j2J2j4J1N9rR%n7L8j0m1N0
6001A0k9k0O7j1Lj1p3M4j9LN7n1M4k7P5l6m8J8n1K3m4N2N1J1K1Qm8J9r0j8j6J25
$$ plain form
6033 39 -70 20 19 19 -3 -27 26 -50 44 -46 -18 -19 24 -7 -10 -1 -9 -48 -65 -27 -16 57 22 25 -4 10 -44 -12 -41 -16 -5 1 27 21
6067 21 64 5 -15 -16 -2 -79 18 -3 40 11 2 15 -13 -6 -22 9 21 35 -34 -21 24 3 -73 -53 -30 32 55 30 40 38 81 26
6099 26 -46 -54 -33 -3 -16 6 0 10 9 66 -20 -65 -13 -26 -87 22 40 43 11 28 -24 -3 -57 -81 -4 22 25 57 -7 0 -41 -18 -28
6132 -28 -60 -21 33 36 114 48 23 -11 -46 3 -31 -51 6 62 59 28 7 3 -29 -51 -75 -2 10 -18 23 6 -47 -2 -14 -29 26 -43
6164 -43 -19 43 37 55 22 72 -8 -40 -95 -39 -3 -13 -4 24 71 12 -23 -71 20 -23 17 30 5 6 41 32 -14 -23 -22 -50 -13 26 -15
6197 -15 -14 49 -2 -41 -48 -45 -46 32 41 52 49 37 -29 64 3 -40 -82 38 20 36 31 35 -13 25 -11 -2 -60 -56 39 22 27 10 45 -3 0 -4
6233 -4 -44 -51 49 72 53 65 12 25 -26 -32 -21 -67 3 30 54 -14 20 16 1 -40 41 -31 -24 82 80 65 27 -14 -14 12 -70 -33 17
6266 17 -6 -24 -35 49 2 -45 -15 -15 -52 -7 41 -20 28 5 46 39 -40 -2 -13 -20 20 25 25 53 23 -33 -4 -73 -14 -64 -23 35 23
$$ packed form
6033C9j09R0j%k2k4N3p6R4r0K8jM3l1lRql9j7L8J1P3l5Lk9J4n4L2k9K5J1OK6o
6067B1M3n9k0jJ4p7R7k1M3k9rJ3k8Pj6L1J2J4o9J3M5k1p6K0K3O2K3k5J0kM3n5
6099B6p2qK1L0j3K2oJ0jN7q6m5N2j3o1J09J8Ll2J7n2K1n4k4P7K6LL2o4Pm1K3j0
6132b8l2L9N4LP8o6k5l4l5M9l4k0N7N6ll1k1ml2k2k4P3J2k8M1j7n3M5j2j5N5o9
6164d3K4O2oJ8l3N0q0l2n5N6L6j0RK8M7n9l5m8R1m3M0J3k5JL5rm6rJk8L7L9m1
6197a5JO3n1l9pLjP8RJ1lj2o6R3o1m3m2J20j8J6nMm8L8l6Rn8MR5j7Nj7L5m8Lm
6233dm0pJ00K3j9J2n3J3n1oJ1m6P0K7K4o8L4mj5m1Q1p2PJ06kj5l8m1%K6q2L7N0
6266A7k3j8j1Q4m7m7L0%l7M5M8o1M8k3M1pp9L8j1pM0N%K8l0n6K9o9N9n0M1N8j2
$$ plain form
6299 23 -1 16 11 -124 -5 -17 19 -52 35 -6 25 51 -38 -17 -64 -34 -64 -70 -14 -29 18 23 -19 -23 -2 11 38 23 -57 54 -32
6330 -32 15 55 -10 -36 -58 -44 -29 1 26 26 16 17 7 9 -76 22 -28 -6 11 32 49 7 11 0 -71 -50 14 5 4 4 72 6 -27 -5
6364 -5 -44 -58 -37 -35 49 10 36 -11 11 -35 -40 -57 -58 -20 -21 39 34 54 -20 -11 -11 -8 -19 26 -9 -54 34 29 -52 -65 -60 -86 -32 -34 15 15 20
6401 20 35 -9 -2 -72 -80 12 -32 19 -17 21 24 -7 -50 -67 -65 -41 -14 3 106 39 56 2 -20 -61 16 -54 10 43 11 80 19 24
6433 24 -10 -28 -23 0 19 22 -30 72 -5 6 -7 23 -77 -37 -20 -70 2 65 -15 35 -15 -45 -73 -35 -61 -50 -20 22 22 11 45
6464 45 1 -23 -60 -15 -6 45 6 69 -17 57 -8 18 -50 -27 8 26 27 11 34 26 -3 -42 -57 2 -38 14 3 20 -11 13 -65 -30
6496 -30 -62 -63 -28 8 74 79 42 26 -18 -17 -51 -15 26 -10 -14 56 -11 64 71 -11 -50 18 -2 12 -12 50 20 55 45 23 -56 -2 -13
6529 -13 -4 16 3 54 9 105 -19 -2 -54 -60 -28 46 28 63 17 35 -3 -51 -70 -10 -35 17 35 50 12 -54 -5 -37 -8 -44 -7
$$ packed form
6299B3k4J7nj35J19j2L6p1Q7m1L1K6q9K1m7L0l0oN6j5M7Nm2mK1J3K7j5q0J11q6
6330c2M7M0o5k6k2J4J5L0K5%j0Jj0Kq5R8n0K2J7K1J7m2Mj1p1K1O4rj%O8o6l3K2
6364el9j4K1KQ4l9K6m7K2m6nj7jL8jO0nK0p4R%Lj1M5l5m5Q8nq1j3Nk6N4kM9%N
6401B0J5m4Pp0qR2m4N1l6L8Ll1m3j7KK4K7J7J03o7J7n4k2m1P7p0O4L3l2O9o1N
6433B4l4j8NK3J9Ln2J02p7J1j3L0j00M0J7n0P2O3q0N0n0l0k8L8k6J1L0M2%j1L4
6464D5m4k4l7M5RN1l9O3q6P4o5K6o8K3L5J8Jj6K3qk9l9j5N9m0N2j1J7l1K4p8L5
6496c0l2jL5L6O6Nl7j6m4Jl4L6M1l6mP0o7P5Pq2l9O8k0J4k4O2l0L5j0k2p9N4j1
6529a3RK0j3N1m5R6j24J7n2oL2P4j8L5m6J8l8m8j9O0k5N2J8J5l8o6M9l2K9l6L7
$$ plain form
6560 -7 -33 45 29 30 -2 -30 -29 -45 -62 -30 19 -34 13 -19 12 -62 -8 21 -61 29 0 -23 36 55 23 13 -10 43 -28 14 39 -20
6592 -20 10 -15 14 8 -42 -50 -64 -49 21 48 78 22 21 -17 6 -15 -34 -22 11 -32 42 49 22 -11 -83 -51 -62 -24 -44 10 -13 20
6624 20 -19 -16 -27 -62 -57 30 20 39 73 80 65 -32 3 3 -40 -19 3 -11 15 2 48 -1 -7 -25 -27 -68 -60 20 29 29 20 46 -4 -34 -21
6659 -21 2 -40 -24 -3 18 36 6 48 -51 -64 -61 47 -17 29 57 54 49 -31 -30 0 12 12 18 0 65 37 56 -16 -17 -32 -64 -32 -31 49
6693 49 8 49 47 -27 -14 -47 -23 -4 -18 6 5 37 60 22 -2 -69 -12 12 -21 39 36 41 68 27 -26 3 -66 -11 10 -4 33 -35
6725 -35 55 69 -46 -99 -41 -73 -4 22 9 32 52 5 -24 10 -74 -20 16 -1 12 57 73 23 23 6 -34 23 13 -43 23 42
6755 42 22 -59 23 -18 -27 -15 -20 -1 -56 41 30 12 52 -30 -58 -73 -21 -12 -22 6 83 17 7 -20 -47 -11 -44 15 -42 80 26
6786 26 41 26 -20 -18 -47 -33 -30 45 100 19 32 11 -54 -21 -7 -14 -31 -6 4 34 -11 32 -12 -55 -54 5 -25 29 -11 35 61 65 -23
$$ packed form
6560gk6P8j6Jl2k8Jj6j7L2M9n3M7l2L1p4N4K9q2R0k9k3N9J9l2j0k3N3p1M2K5n9
6592b0L0k5K9on0qj4J5P0K7L0n6jl8K3k1j9J2L3m3P4Pk7l3p2L2j1L8k0N4k3L3
6624B0l9Lj1l5NQ7j0J9L4Pj5r7L5%m3K1K2j4K6j3M6m9oj8km1QQ0R%rK6n0l0J3
6659b1K3m2J6K1K1J8l0M2r9j3LJ08o4M6K8lnq0JL0J2%Oj8O5k8J9p2jj5l2L2JQ0
6693D9m1M1kp4J3l3K4J9j4K4jL2K3l8k4o7N7K4l3O0lNK7m1n3K9o9N5K1j4L7o8
6725c5R0J4j15n3N8l2O9K6j3K3K0m7k9L4q4N4L6j7J3M5J6n0%j7m0N7j0n6O6J9
6755D2k0q1Q2m1rJ2nJ9n5R7j1j8M0q2k8j5N2Rj0K8P7o6j0k7k7L6l3N9n7J22n4
6786B6J5j5m6Kk9J4LP5N5q1J3k1o5L3J4pj7K5J0L0m5M3m4m3JN9l0N4m0M6K6Mq8
$$ plain form
6819 -23 -33 13 -64 -26 -11 57 46 54 26 -14 12 -44 -33 -48 -49 50 74 53 38 44 -22 -10 -40 -15 -37 -21 -32 75 20 23 -25 -66
6851 -66 -11 -61 -8 6 64 123 24 -9 1 -7 -79 53 -62 45 2 50 -3 31 -25 30 -104 27 -10 39 6 -2 57 -3 -10
6880 -10 -63 48 -31 9 39 -1 34 50 -20 21 -60 -34 -7 23 22 54 15 25 22 49 23 -10 -53 -23 7 26 75 66 9 -25 -30 24
6912 24 18 11 36 39 14 90 12 54 -3 -16 -12 -21 50 25 -8 21 2 10 -11 -18 3 -33 4 4 15 15 -49 -18 -47 -31 -46 -37 -54 -5 43
6947 43 78 -34 37 -45 -4 -20 -27 -18 -15 19 28 46 7 -42 -26 1 -54 -13 71 59 34 46 19 3 5 -34 -13 -5 37 43 52 87 -25
$$ packed form
6819b3j0M6p7L8J5O8j1Qk8m0K6n6J1j5jR9K4k1j5Oo6J2l0K5k2J6j1J07n5Lm8m1
6851f6N5n0N3J4N8N9r9l3J0qp2J32j15J07m3M8n3L4n6N5j34J31l7M9l3qN9o0p
6880a0n3J11p9M0L0m0L5J6p0M1q1K6K7L0jL2l9J0lK7k6l3m3L0L0J9M9rn7l4nN4
6912B4opK5Lk5P6p8M2n7j3MrP1k5l3K9j9Qk1pK1l6L7%J1%o4L1k9J6j5Rj7M9M8
6947D3L5j12P1q2M1j6pRLL4RJ8l9m9J6K7n5M1Q4j2k5J2k7j6Kl9K1QM2ORL5j12
$$ [...]
8191E0
##END NTUPLES=NMR FID
##END=
