##TITLE=1H_DE-80_ORG_F
 200.13MHz, CDCl3,
 8 sc
 
 3.2.2025
##JCAMPDX= 6.0         $$ Bruker NMR JCAMP-DX V2.0
##DATA TYPE= NMR FID
##DATA CLASS= NTUPLES
##ORIGIN= UXNMR, Bruker Analytische Messtechnik GmbH
##OWNER= pz
$$ XWIN-NMR		Version 3.5
$$ Mon Feb  3 18:44:48 2025 Russian Standard Time (UT+4h)  she@DPX200
##.OBSERVE FREQUENCY= 200.1313
##.OBSERVE NUCLEUS= ^1H
##.DELAY= (6, 6)
##.ACQUISITION MODE= SIMULTANEOUS
##.ACQUISITION SCHEME= undefined
##.AVERAGES= 8
##.DIGITISER RES= 18
##SPECTROMETER/DATA SYSTEM= spect
##.PULSE SEQUENCE= zg30
##.SOLVENT NAME= CDCl3
##.SHIFT REFERENCE= (INTERNAL, CDCl3, 0, 14.3821)
##AUDIT TRAIL= $$ (NUMBER, WHEN, WHO, WHERE, WHAT)
$$ ##TITLE= Audit trail, XWIN-NMR		Version 3.5
$$ ##JCAMPDX= 5.01
$$ ##ORIGIN= Bruker BioSpin GmbH
$$ ##OWNER= she
$$ F:/spectra/data/she/nmr/H-C/1/audita.txt
$$ ##AUDIT TRAIL=  $$ (NUMBER, WHEN, WHO, WHERE, WHAT)
(   1,<2025-02-03 18:43:43.20 +0400>,<she>,<DPX200>,
      <created by zg, POWCHK disabled, PULCHK disabled
       configuration hash MD5:
       00 E9 B6 7A A2 85 ED C7 34 08 36 98 17 FE 4E 26
       data hash MD5: 16K
       20 57 66 BF A1 89 D4 B1 51 5F 79 5C A3 F3 A9 29>)
$$ ##END=
$$ 
$$ hash MD5
$$ FD 03 45 E0 D2 C0 D1 AC 5D F1 8C 60 A8 FD F2 52
##$RELAX= 
##$RELAX= 
##$RELAX= 
##$RELAX= 
##$RELAX= 
##$RELAX= 
$$ Bruker specific parameters
$$ --------------------------
##$DU= <F:/spectra>
##$EXPNO= 1
##$NAME= <H-C>
##$PROCNO= 1
##$TYPE= <nmr>
##$USER= <she>
##$AMP= (0..31)
100 100 100 100 100 100 100 100 100 100 100 100 100 100 100 100 100 100 
100 100 100 100 100 100 100 100 100 100 100 100 100 100 
##$AQSEQ= 0
##$AQ_mod= 1
##$AUNM= <au_zg>
##$AUTOPOS= <>
##$BF1= 200.13
##$BF2= 200.13
##$BF3= 200.13
##$BF4= 200.13
##$BF5= 200.13
##$BF6= 200.13
##$BF7= 200.13
##$BF8= 200.13
##$BYTORDA= 1
##$CFDGTYP= 0
##$CFRGTYP= 5
##$CHEMSTR= <none>
##$CNST= (0..31)
1 1 145 1 1 1 1 1 1 1 1 1 1 1 1 1 1 1 1 1 1 1 1 1 1 1 1 1 1 1 1 1 
##$CPDPRG= <>
##$CPDPRG1= <>
##$CPDPRG2= <>
##$CPDPRG3= <>
##$CPDPRG4= <mlev>
##$CPDPRG5= <mlev>
##$CPDPRG6= <mlev>
##$CPDPRG7= <mlev>
##$CPDPRG8= <mlev>
##$CPDPRGB= <>
##$CPDPRGT= <>
##$D= (0..31)
0 0.7 0 0 0 0 0 0 0 0 0 0.03 0 0 0 0 0 0 0 0 0 0 0 0 0 0 0 0 0 0 0 0 
##$DATE= 1738593822
##$DBL= (0..7)
120 120 120 120 120 120 120 120 
##$DBP= (0..7)
150 150 150 150 150 150 150 150 
##$DBP07= 0
##$DBPNAM0= <>
##$DBPNAM1= <>
##$DBPNAM2= <>
##$DBPNAM3= <>
##$DBPNAM4= <>
##$DBPNAM5= <>
##$DBPNAM6= <>
##$DBPNAM7= <>
##$DBPOAL= (0..7)
0.5 0.5 0.5 0.5 0.5 0.5 0.5 0.5 
##$DBPOFFS= (0..7)
0 0 0 0 0 0 0 0 
##$DE= 6
##$DECBNUC= <off>
##$DECIM= 32
##$DECNUC= <off>
##$DECSTAT= 4
##$DIGMOD= 1
##$DIGTYP= 9
##$DL= (0..7)
0 120 120 120 120 120 120 120 
##$DP= (0..7)
150 150 150 150 150 150 150 150 
##$DP07= 0
##$DPNAME0= <>
##$DPNAME1= <>
##$DPNAME2= <>
##$DPNAME3= <>
##$DPNAME4= <>
##$DPNAME5= <>
##$DPNAME6= <>
##$DPNAME7= <>
##$DPOAL= (0..7)
0.5 0.5 0.5 0.5 0.5 0.5 0.5 0.5 
##$DPOFFS= (0..7)
0 0 0 0 0 0 0 0 
##$DQDMODE= 0
##$DR= 18
##$DS= 0
##$DSLIST= <SSSSSSSSSSSSSSS>
$$ [...]
##$SUBNAM0= <"">
##$SUBNAM1= <"">
##$SUBNAM2= <"">
##$SUBNAM3= <"">
##$SUBNAM4= <"">
##$SUBNAM5= <"">
##$SUBNAM6= <"">
##$SUBNAM7= <"">
##$SUBNAM8= <"">
##$SUBNAM9= <"">
##$SW= 18.0517328524113
##$SWIBOX= (0..15)
0 0 2 0 0 0 0 0 0 0 0 0 0 0 0 0 
##$SW_h= 3612.71676300578
##$TD= 16384
##$TD0= 1
##$TE= 0
##$TE2= 300
##$TE3= 300
##$TEG= 300
##$TL= (0..7)
0 120 120 120 120 120 120 120 
##$TP= (0..7)
150 150 150 150 150 150 150 150 
##$TP07= 0
##$TPNAME0= <>
##$TPNAME1= <>
##$TPNAME2= <>
##$TPNAME3= <>
##$TPNAME4= <>
##$TPNAME5= <>
##$TPNAME6= <>
##$TPNAME7= <>
##$TPOAL= (0..7)
0.5 0.5 0.5 0.5 0.5 0.5 0.5 0.5 
##$TPOFFS= (0..7)
0 0 0 0 0 0 0 0 
##$TUNHIN= 0
##$TUNHOUT= 0
##$TUNXOUT= 0
##$USERA1= <user>
##$USERA2= <user>
##$USERA3= <user>
##$USERA4= <user>
##$USERA5= <user>
##$V9= 5
##$VALIST= <valist>
##$VCLIST= <CCCCCCCCCCCCCCC>
##$VD= 0
##$VDLIST= <DDDDDDDDDDDDDDD>
##$VPLIST= <PPPPPPPPPPPPPPP>
##$VTLIST= <TTTTTTTTTTTTTTT>
##$WBST= 1024
##$WBSW= 4
##$XGAIN= (0..3)
0 0 0 0 
##$XL= 0
##$YL= 0
##$YMAX_a= 266349
##$YMIN_a= -337526
##$ZGOPTNS= <>
##$ZL1= 120
##$ZL2= 120
##$ZL3= 120
##$ZL4= 120
##$ABSF1= 10
##$ABSF2= 0
##$ABSG= 5
##$ABSL= 3
##$ALPHA= 0
##$AQORDER= 0
##$ASSFAC= 0
##$ASSFACI= 0
##$ASSFACX= 0
##$ASSWID= 0
##$AUNMP= <proc_1d>
##$AZFE= 0.1
##$AZFW= 0.1
##$BCFW= 1
##$BC_mod= 2
##$BYTORDP= 1
##$COROFFS= 0
##$CY= -3
##$DATMOD= 1
##$DC= 2
##$DFILT= <>
##$DTYPP= 0
##$F1P= 0
##$F2P= 0
##$FCOR= 0.5
##$FTSIZE= 0
##$FT_mod= 4
##$GAMMA= 1
##$GB= 0.15
##$INTBC= 1
##$INTSCL= 1
##$ISEN= 128
##$LB= 0.25
##$LEV0= 0
##$LPBIN= 0
##$MAXI= 10000
##$MC2= 0
##$MEAN= 0
##$ME_mod= 0
##$MI= 1.114404
##$NCOEF= 0
##$NC_proc= 0
##$NLEV= 6
##$NOISF1= 3.799351
##$NOISF2= 2.8
##$NSP= 1
##$NTH_PI= 0
##$NZP= 0
##$OFFSET= 14.38212
##$PC= 1
##$PHC0= -123.0383
##$PHC1= 35.99223
##$PH_mod= 1
##$PKNL= yes
##$PPARMOD= 0
##$PSCAL= 0
##$PSIGN= 0
##$REVERSE= no
##$SF= 200.129724274929
##$SI= 16384
##$SIGF1= 3
##$SIGF2= 2
##$SINO= 400
##$SIOLD= 16384
##$SREGLST= <1H.CDCl3>
##$SSB= 0
##$STSI= 0
##$STSR= 0
##$SW_p= 3205.1282051282
##$SYMM= 0
##$S_DEV= 0
##$TDeff= 0
##$TDoff= 0
##$TI= <>
##$TILT= no
##$TM1= 0
##$TM2= 0
##$TOPLEV= 0
##$USERP1= <user>
##$USERP2= <user>
##$USERP3= <user>
##$USERP4= <user>
##$USERP5= <user>
##$WDW= 1
##$XDIM= 8192
##$YMAX_p= 0
##$YMIN_p= 0
$$ End of Bruker specific parameters
$$ ---------------------------------
##NTUPLES= NMR FID
##VAR_NAME=  TIME,          FID/REAL,        FID/IMAG
##SYMBOL=    X,             R,               I
##VAR_TYPE=  INDEPENDENT,   DEPENDENT,       DEPENDENT
##VAR_FORM=  AFFN,          ASDF,            ASDF
##VAR_DIM=   8192,          8192,            8192
##UNITS=     SECONDS,       ARBITRARY UNITS, ARBITRARY UNITS
##FACTOR=    0.0002768,     1,               1
##FIRST=     0,             0,               0
##LAST=      2.2672688,     0,               0
##MIN=       0,             -337526,         0
##MAX=       2.2672688,     266349,          0
$$ Real data points
##PAGE= N=1
##DATA TABLE= (X++(R..R)), XYDATA
$$ [...]
$$ plain form
1846 6 173 -240 101 -16 13 14 33 18 -54 -62 94 179 -109 -92 5 -172 -30 124 -54 65 -80 71 117 114 41 16
1872 16 23 58 117 282 -103 -205 -369 104 -57 -14 -63 205 -177 -118 176 23 114 -30 -305 -42 -28 -14 -82 22
1896 22 -39 150 25 -220 -84 64 231 -25 42 -54 -129 -35 -81 -100 123 177 -74 -19 27 -79 245 -245 80 21
1920 21 235 71 -59 -65 34 -90 -59 -196 -30 83 -8 -102 274 271 303 -113 -294 -26 41 207 -20 55 57 67 50
1945 50 -34 -240 -121 -178 -149 53 27 -154 131 131 -9 -84 -83 -176 114 -2 8 -151 65 113 -152 73 34 83 -123
1970 -123 73 -231 173 -9 -9 53 232 -77 148 119 78 -228 -164 -54 149 16 -14 -194 -219 -63 27 53 6 205
1994 205 -111 -199 -6 154 164 -161 262 -230 182 11 70 29 -63 -259 91 263 46 -224 107 26 -390 100
2016 100 -126 -160 260 171 -26 -58 392 151 -93 -78 -75 -166 14 270 13 77 -109 184 -146 -93 -158 -220 -100 -219
$$ packed form
1846FJ67m13L41j17K9JJ9j5p2qJ56Q5k88J7R7j77J42J54j78J19j45J51M6lp3k5
1872A6PL5N9J65l85j02j64M73j61M3m9K68l82N9K94j53R1j44k75K63J4J4o8J04
1896B2o1J89j25k45J36J48J67k56O7r6p5R4m6j9K23N4k51N5M6j06L24m90L25n9
1920B1K14j64j30oR9j24L1j37J66J13r1r4L76lL2m16j81K68O7J66k27P5KJ0j7
1945E0q4k06J19n7K9K02k6j81K85%j40p5Jr3K90j16J0j59K16M8k65K25l9M9k06
1970a23J96l04M04j82%O2J79l09K25k9m1l06O4J10K03j33l0j80k5J56R0K6m7J99
1994B05l16q8J93J60J0l25M23m92M12j71N9m1r2j96L50J72k17k70L31q1m16M90
2016A00k26l4M20q9j97l2M50k41k44J5Lr1J80K56k57O4j86K93l30N3o5o2J20j19
$$ plain form
2040 -219 15 161 -66 -147 -94 -66 17 39 118 -130 -135 211 86 -80 287 -3 -184 313 151 -71 -82 -156 -126 226
2064 226 -54 -94 -237 60 39 38 26 -194 -61 137 -152 2 -290 90 96 -128 -1 169 -27 -221 -82 257
2086 257 -281 185 -283 67 4 96 -136 35 66 156 -99 169 27 125 -244 -139 435 -43 203 24 123 216
2108 216 111 238 97 -124 0 45 -356 -17 175 -162 331 -58 85 -189 -72 -106 177 264 188 11 150
2129 150 -64 -33 26 -24 -203 34 38 143 82 31 167 -13 -48 218 29 199 86 81 -82 56 190 42 -350
2152 -350 -148 38 -143 -143 189 -72 -128 -3 127 89 149 -290 118 88 -65 -158 -167 -103 -121 49 -94 164 105 -55
2176 -55 -54 60 39 -147 155 -123 -240 63 11 165 126 -280 -107 52 -193 68 54 162 231 -130 -56 5 -127
2199 -127 229 36 -283 -97 -23 10 -154 87 4 -86 -201 96 32 -13 -142 405 -53 -179 -70 -196 -24 -3
$$ packed form
2040b19K34J46k27q1N3K8Q3K2P9k48nL46j25j66L67k90j81M97j62k22j1p4L0L52
2064B26k80m0j43K97k1jj2k20J33J98k89J54k92L80Ok24J27J70j96j94J39L39
2086B57n38M66m68L50o3R2k32J71L1R0k55K68j42R8l69J05N74m78K46j79R9R3
2108B16j05J27j41k21J24M5m01L39J92l37M93l89J43k74J17l4K83Q7p6j77J39
2129A50k14L1N9n0j79K37MJ05o1n1J36j80l5K66j89J70j13nj63J38J34j48l92
2152c50K02J86j81%L32k61n6J25J30l8O0m39M08l0j53r3rO4j8J70j43K58n9j60
2176e5JJ14k1j86L02k78j17L03n2J54l9m06J73J59k45K61j4J08O9l61P4O1j32
2199a27L56j93l19J86P4L3j64K41q3r0j15K97o4m5j29N47m58j26J09j26J72K1
$$ plain form
2221 -3 149 -215 -31 -144 182 -273 37 -106 132 124 -135 -152 -168 15 3 -108 250 131 229 -142 134 21 -81
2244 -81 -81 -231 93 -66 18 -41 66 130 24 22 -26 -14 29 208 126 29 47 1 118 202 -77 43 -93 -29 -21 252
2270 252 29 -193 93 83 -68 -105 197 -143 12 282 50 16 107 -73 5 109 27 -143 58 1 242 111
2292 111 -127 -202 82 74 -251 -152 114 160 172 417 153 64 140 279 104 207 -88 116 154 7 232 154 96 -23
2316 -23 -11 -336 73 -148 -237 -120 -10 -19 116 -24 196 74 -146 140 262 127 -87 -88 -32 -27 -124 -250 -111 -69
2340 -69 -64 35 -105 -125 113 -125 -24 249 273 -82 18 40 -207 -136 115 217 -110 -21 -15 -7 -7 -104 -68 26 -80 -261
2366 -261 82 81 35 -212 -88 -443 -212 254 7 -189 -111 -2 -28 -124 -77 -25 -136 -191 -157 -48 41 190 -51 -2
2390 -2 -182 116 -175 23 -15 85 204 115 133 15 158 -40 -181 142 7 -86 223 94 88 133 -176 -96 52
$$ packed form
2221cJ52l64J84j13L26m55L10j43K38qk59j7j6J83j2j11L58j19R8l71K76j13j02
2244h1%j50L24j59Q4n9J07O4j06km8J2M3J79q2r7J8m6J17Q4k79J20j36O4QK73
2270B52k23k22K86j0j51l7L02l40J55K70k32l4R1j80P8J04q2j70K01n7K41j31
2292A11k38p5K84ql25R9K66M6J2K45k64q9P6J39j75J03k95K04L8j47K25p8n8j19
2316b3J2l25M09k21q9J17J10rJ35j40K20j22k20K86J22j35k14jN6Nr7j26J39M2
2340f9NR9j40k0K38k38J01K73K4l55J00K2k47P1K51J02l27Q9OQ%r7L6R4j06j81
2366b61L43jm6k47J24l55K31M66k47j96P8J09k6r6M7N2j11n5L4J09Q9J49k41M9
2390bj80K98k91J98l8J00J19q9J8j18J43j98j41L23j35r3L09j29oM5l09Q0J48
$$ plain form
2413 52 -198 -81 -297 -39 -90 39 282 -104 124 11 108 230 21 -24 75 -112 -98 -85 -64 -150 12 -165 -2
2436 -2 -114 -298 113 153 154 -132 106 29 19 -108 286 -80 -168 -101 -187 304 -94 -151 25 -105 -159 -96 -218 -86
2460 -86 -71 31 -19 -128 51 -101 136 -98 76 -172 -130 -35 -141 25 234 -39 -170 119 76 -34 204 -174
2482 -174 28 -59 98 -162 -172 37 -170 -105 -19 6 -32 -128 26 -28 -153 -27 -172 -335 121 -251 90 -21 44
2505 44 1 74 136 -35 -125 110 -245 -163 -153 230 115 47 -194 -22 -9 73 -206 94 98 12 -133 300 168 -48
2529 -48 -165 31 198 -145 -58 -11 -63 -178 -15 -60 -139 45 -110 18 -192 -181 -232 -50 11 216 -38 7 172
2552 172 -92 104 -116 -38 17 -15 112 37 -96 211 -109 -39 26 -338 -220 -32 -143 275 138 -264 191 3
2574 3 43 -91 -173 -171 169 48 55 -246 179 -108 130 168 285 -62 180 -41 -38 128 -18 -153 63 8 -209 -104
$$ packed form
2413E2k50J17k16K58n1J29K43l86K28j13R7J22k09m5R9j87J4J3K1q6J62j77J63
2436bj12j84M11M0Jk86K38p7j0j27L94l66q8O7q6M91l98n7J76j30n4O3j22J32
2460h6J5J02n0j09J79j52K37k34J74k48M2R5j06J66K09k73j31K89m3j10K38l78
2482a74K02q7J57k60j0K09k07O5Q6K5l8r6J54n4j25J26j45j63M56l72L41j11O5
2505D4m3P3O2j71r0K35l55Q2J0L83j15o8k41J72J3Q2k79L00Mq6j45M33j32k16
2529d8j17J96J67l43Q7M7n2j15J63m5p9J84j55J28k10J1n1J82O1K05k54M5J65
2552A72k64J96k20P8N5l2J27p5j33L07l20P0O5l64J18J88j11M18j37m02M55j88
2574CM0j34q2KL40j21Pl01M25k87K38L8J17l47K42k21LJ66j46j35K16n5k17J05
$$ plain form
2598 -104 207 -183 -113 97 -183 -322 11 104 30 172 136 251 57 91 74 -225 -109 -187 59 -68 116 -35
2620 -35 135 -165 36 -4 -53 214 -38 88 -87 -22 228 102 -309 14 47 133 195 -132 222 290 41 -51 -5
2643 -5 155 12 83 -53 -122 -110 217 154 19 -98 75 -205 136 25 70 -242 145 88 132 169 59 -151 -262
2666 -262 34 -132 -88 275 -17 -80 -168 71 32 215 -134 -67 127 -197 -138 10 -108 -41 -38 -71 -107 169 24 -33
2690 -33 -86 113 -84 28 134 -141 -82 -24 -21 53 -66 -147 109 -70 40 223 135 -113 -132 -255 -2 -51 30 71
2714 71 -126 235 72 -205 89 -166 41 3 -66 -184 43 24 176 103 -141 232 73 -248 31 -220 69 -153
2736 -153 -314 47 307 267 -343 -53 -224 -104 25 187 -129 -72 19 21 -13 66 -17 -65 -36 -37 -123 -24 221 -171 -146
2761 -146 -207 256 123 133 -95 -147 181 18 -81 26 163 -226 -299 225 78 28 -6 72 80 -336 60 12 134 -19
$$ packed form
2598a04L11l90P0K10k80j39L33R3p4J42l6J15j94L4j7k99J16p8K46j27J84j51
2620c5J70l00K01m0m9K67k52J26j75O5K50j26m11L23L3Q6O2l27L54O8k49r2M6
2643eJ60j43P1j36o9J2L27o3j35j17J73k80L41j11M5l12L87n7M4L7j10k10j11
2666b62K96j66M4L63k92o3q8K39l9J83l49O7J94l24N9J48j18O7Ll3l6K76j45n7
2690c3n3J99j97J12J06k75N9N8LP4j19q1K56j79J10J83q8k48j9j23K53m9Q1M1
2714G1j97L61j63k77K94k55K07l8o9j18K27j9J52p3k44L73j59l21K79k51K89k22
2736a53j61L61K60m0o10K90j71J20J29J62l16N7R1Kl4P9q3m8K9jq6R9K45l92K5
2761a46o1M63j33J0k28n2L28j63r9J07J37l89p3N24j47n0l4P8Qm16L96m8J22j53
$$ plain form
2785 -19 34 -136 42 -22 -171 37 -202 24 90 68 186 -140 125 -101 502 -17 91 215 -360 -39 -34 -5 196
2808 196 -38 -48 -254 206 -106 -171 125 79 205 -131 214 -115 -64 -89 177 -138 -260 -191 -49 -8 -260 135
2830 135 77 -112 45 88 0 -47 -211 102 -9 -184 -85 -37 27 45 -33 42 93 -337 223 -196 0 -29 178 2
2854 2 -328 62 -269 -56 35 244 28 40 -72 -6 -98 -245 98 -187 101 -27 -68 68 39 -65 199 -114 -118
2877 -118 -198 -123 -114 -19 -202 300 72 -230 95 -150 -24 -92 -23 160 264 63 -189 -28 -125 -16 148 92 -2
2900 -2 -123 60 -327 -146 114 130 270 84 259 192 22 -12 -67 168 113 75 -40 -68 -102 68 134 9 -73 -27
2924 -27 61 -170 43 135 -149 119 -246 -237 -88 -65 -110 217 76 -81 -42 -8 201 156 -204 55 -198 24 -164
2947 -164 -4 -276 -107 66 -68 318 -241 47 2 35 -270 109 -75 -114 -168 151 88 -196 -73 2 59 -140
$$ packed form
2785a9N3j70J78o4j49K08k39K26O6k2J18l26K65k26O03n19J08J24n75L21NK9K01
2808A96k34j0k06M60l12o5K96m6J26l36L45l29N1k5K66l15j22O9J42M1k52L95
2830A35n8j89J57M3q8m7j64L13j11j75R9M8O4J8p8P5N1m30N60m19J96k9K07j76
2854Bl30L90l31K13R1K09k16J2j12O6r2j47L43k85K88j28m1J36k9j04K64l13m
2877a18q0P5RR5j83N02k28l02L25k45J26o8O9J83J04k01k52J61r7J09J64n6r4
2900bj21J83l87J81K60J6J40j86J75o7j70l4n5K35n5l8j15k8l4J70O6j25q2M6
2924b7Q8k31K13R2k84K68l65RJ49K3m5L27j41j57L9L4K09m5l60K59k53K22j88
2947a64J60k72J69J73j34L86n59K88m5L3l05L79j84l9n4L19o3k84J23P5N7j99
$$ plain form
2969 -140 -11 -167 76 -4 -23 157 -178 -140 -69 113 29 -151 195 75 -193 -164 4 440 64 87 -188 166
2991 166 -89 178 -184 -2 155 -169 320 -104 -104 81 -2 -112 -45 -33 234 14 -90 -5 229 2 -28 -54 4
3014 4 -6 -24 -70 75 -33 72 -133 247 151 184 -30 244 51 -62 -43 97 193 -189 300 272 165 -62 -214
3037 -214 125 -128 162 -29 15 -6 -174 57 -134 -29 -29 -137 338 -56 -76 168 -98 -116 141 142 -76 105 208
3060 208 -88 34 387 35 199 153 -69 20 -87 -181 -55 -94 -191 198 -128 -111 -46 26 -39 167 -103 -306 74
3083 74 228 -10 -151 201 -139 150 138 58 -320 174 14 -174 160 53 29 35 -161 -297 93 60 27 -95 -32
3106 -32 70 261 -159 75 294 -82 -118 319 152 72 -23 132 -45 -162 -1 247 263 60 140 -185 -210 -241 257
3129 257 17 -108 -174 254 -177 -26 -19 -39 -189 -155 45 0 44 20 8 70 -152 -192 -50 -15 206 -112 113 73
$$ packed form
2969a40J29j56K43q0j9J80l35L8P1J82q4j80L46j20k68K9J68M36l76K3k75L54
2991A66k55K67l62J82J57l24M89m24%J85q3j10O7J2K67k20j04Q5K34k27l0k6N8
3014Dj0j8m6J45j08J05k05L80r6L3k14K74j93j13J9J40R6l82M89k8j07k27j52
3037b14L39k53K90j91M4k1j68K31j91J05%j08M75l94k0K44k66j8K57Jk18J81J03
3060B08k96J22L53l52J64m6k22Q9j07r4J26l9r7L89l26J7O5P2o5K06k70k03L80
3083G4J54k38j41L52l40K89j2q0l78M94j60j88L34j07k4Oj96j36L90l3l3j22O3
3106c2J02J91m20K34K19l76l6M37j67q0r5J55j77j17J61K48J6k03Q0l25k5l1M98
3129B57k40j25o6M28m31J51Pk0j50L4K00m5M4k4j2O2k22m0J42L5K21l18K25m0
$$ plain form
3153 73 21 -21 37 -111 -41 -40 -66 -145 -171 22 184 -49 -245 -140 -150 -57 229 -64 4 -5 -360 83 178 -83 49
3178 49 58 203 -33 -71 42 118 -82 -47 -2 85 -138 -16 -126 -278 36 256 73 -9 -196 38 -44 23 -229 112
3202 112 47 178 -153 -256 -35 -37 193 336 80 110 145 49 38 80 -134 -56 121 176 -132 -36 -98 53 -97 17
3226 17 48 26 39 47 98 35 -9 -128 90 92 129 206 13 -49 -19 112 107 -94 65 -62 -157 1 -140 -41 -120 -190 -30
3253 -30 -55 -61 186 -315 181 -339 105 103 -19 -125 -101 115 294 -41 141 354 152 110 -133 -44 -69 -189 -27
3276 -27 -140 -5 139 220 18 -46 -51 -76 36 -146 -116 -42 -290 -5 -10 184 185 -74 -13 -104 -100 176 -35 88 -229
3301 -229 167 207 47 -27 59 -108 -201 244 64 3 -141 193 -140 8 -69 21 -182 -54 228 -60 -9 113 61
3324 61 -44 -70 -263 50 -95 53 181 178 -172 -47 147 81 -130 17 -307 -61 -5 15 -95 34 -119 54
$$ packed form
3153G3n2m2N8j48P0Jk6p9k6J93J62k33j96J05j0R3K86k93O8rl55M43R5k61J32
3178D9RJ45k36l8J13P6k00L5M5Q7k23J22j10j52L14K20j83q2j87K34q2O7k52L41
3202A12o5J31l31j03K21kK30J43k56L0L5r6j1M2k14P8J77N5l08R6o2J51j50J14
3226A7L1k2J3QN1o3m4j19K18KL7P7j93o2L0J31nk01J59j27r5J58j41R9p9p0J60
3253c0k5oK47n01M96n20M44kj22j06K4K16J79l35J82K13k02m2k43Q9k5j20J62
3276b7j13J35J44Q1k02o4nk5J12j82L0P4k48K85nJ94Jk59O1r1MK76k11J23l17
3301b29L96M0j60p4Q6j67r3M45j80o1j44L34l33J48p7R0k03J28K82k88N1J22n2
3324F1j05k6j93L13j45J48J28ll50J25J94o6k11J47l24K46N6K0j10J29j53J73
$$ plain form
3346 54 -179 204 8 -11 124 170 -133 -201 -266 20 -33 -32 126 -462 -273 -217 -100 -21 65 -88 -179 -49 89 -88
3370 -88 125 -18 64 196 -117 39 -227 242 -275 76 -144 213 444 133 -209 -125 -172 84 23 -102 -96 -45 -209
3393 -209 165 -212 117 -6 138 10 -118 35 -258 57 130 -170 -4 -46 -67 45 -52 6 -31 104 144 45 95
3416 95 188 108 -9 -27 106 -3 -17 -245 17 -56 106 142 -119 -27 227 27 272 32 -94 216 -130 126 -130
3439 -130 167 50 33 -128 -82 -68 145 -296 -154 -91 56 52 -32 -67 229 74 -184 -50 -37 -17 -256 23 181
3462 181 62 -146 -19 210 -198 62 -98 -127 -43 -30 197 148 -19 -72 -91 93 133 93 -107 68 -165 114 -157
3485 -157 2 130 -125 -304 253 26 228 282 -249 196 -3 -16 -65 246 95 162 33 -251 -231 103 38 30 55
3508 55 -76 -85 106 236 103 -43 152 -81 -64 -56 -74 167 -157 -77 210 127 273 -297 17 395 -126 304 -39
$$ packed form
3346E4k33L83j96j9J35M6l03o8o5K86n3JJ58n88J89N6J17P9Q6j53r1J30J38j77
3370h8K13j43Q2J32l13J56k66M69n17L51k20L57K31l11l42Q4m7K56o1j25ON1j64
3393b09L74l77L29j23J44j28j28J53k93L15P3l00J66m2k1J12r7N8l7J35M0r9N0
3416I5R3q0j17j8J33j09j4k28K62p3J62L6k61R2K54k00K45k40j26L10l46K56k56
3439a30K97j17j7j61M6J4K13m41J42O3J47mq4l5K96j55k58J34J3K0k39K79J58
3462A81j19k08J27K29m08K60j60k9Q4J3K27m9j67n3j9J84M0m0k00J75k33K79k71
3485a57J59J28k55j79N57k27K02N4n31M45j99j3m9L11j51O7j29k84K0L34o5qK5
3508E5j31rJ91J30j33j46J95k33J7Qj8K41l24Q0K87q3J46n70L14L78n21M30l43
$$ plain form
3531 -39 -142 -48 79 -107 -215 55 -67 203 -188 -140 -78 -254 22 11 -22 234 -120 -126 85 15 -158 -310 74
3554 74 370 38 -194 10 -194 113 91 40 -143 205 -30 -145 149 90 4 261 -135 26 109 -138 -54 3 -25
3577 -25 40 210 18 58 -116 -17 -38 111 -182 -171 -230 17 203 -41 -90 155 111 133 -20 -181 168 319 -154
3600 -154 164 -148 -270 -241 75 5 64 -28 -56 80 105 261 -285 -75 -64 17 11 13 301 -45 -141 68 -75 20 157
3625 157 -130 -111 54 233 -79 -81 -187 233 152 44 -74 -106 1 160 -3 114 -153 181 -261 -16 -49 44
3647 44 47 -148 156 103 87 128 168 71 204 -21 88 18 26 -204 -49 -5 -50 -110 -166 -137 -40 -95 48 -185 -157 -177 -98
3674 -98 -74 -16 -10 5 -31 71 -30 -22 -178 301 -133 354 192 -177 59 -37 -305 61 -26 240 188 -42 -11 -131
3698 -131 81 -187 -55 -164 -47 191 79 -243 21 87 -150 -5 3 -166 -30 68 -258 -148 33 122 289 139
$$ packed form
3531c9j03R4J27j86j08K70j22K70l91M8O2j76K76j1l3K56l54oK11p0j73j52L84
3554G4K96l32k32K04k04L07k2n1j83L48k35j15K94n9q6K57l96J61Q3k47Q4N7k8
3577b5O5J70j92M0j74R9k1J49k93J1n9K47J86k44m9K45m4K2j53j61L49J51m73
3600a54L18l12j22K9L16p0N9r2k8J36K5J56n46K10J1Q1oKK88l46r6K09j43R5J37
3625A57k87J9J65J79l12kj06M20q1j08j18l2J07J59j63J17k67L34m42K45l3R3
3647D4Lj95L04n3j6M1M0r7J33k25J09p0Qk30J55M4m5o0n6K9R7n5J43k33K8k0P9
3674i8K4N8OJ5l6J02j01Qj56M79m34M87j62l69K36r6k68L66q7K66n2k30L1j20
3698a31K12k68J32j09J17K38j12l22K64O6k37J45Qj69J36R8l26J10J81Q9J67j50
$$ plain form
3720 139 0 308 -97 43 -195 39 -69 89 53 -22 325 113 -61 51 -71 -61 89 -75 -179 -49 -197
3741 -197 -29 184 65 19 -42 56 -199 72 -193 88 62 -206 14 -222 -211 -12 37 68 66 109 -75 -21 -164 -249
3765 -249 290 -52 -173 -278 -81 314 -57 32 -211 164 106 184 -247 -116 234 114 -152 40 133 39 -89 150
3787 150 -422 261 -303 -59 284 57 79 -50 -36 -44 -30 -96 -74 49 205 -120 76 82 19 183 24 -41 52 148
3811 148 203 69 94 -72 248 127 -41 346 191 -70 -143 68 -99 153 -10 21 -72 206 -81 157 -153 -77
3833 -77 65 70 20 -179 -120 158 -183 -47 193 -36 -219 253 255 -333 97 6 -124 41 -75 -240 202 33 -11
3856 -11 80 9 -95 -20 82 -275 203 -199 -200 385 -93 207 -139 -133 -99 -118 62 226 103 217 -204 -6 -165
3879 -165 219 223 81 -86 166 -125 218 135 63 54 -162 -115 218 121 141 152 -27 216 -31 215 -207 -25 0 -48
$$ packed form
3720A39j39L08m05J40k38K34j08J58l6p5L47k12j74J12j22J0J50j64j04J30j48
3741a97J68K13j19m6o1R8k55K71k65K81k6k68K20k36J1J99M9L1kM3j84N4j43q5
3765b49N39l42j21j05J97L95l71Q9k43L75n8P8m31J31L50j20k66J92R3r4j28K39
3787A50n72O83n64K44L43k27K2j29J4qJ4o6K2J23J56l25J96Oo3J64j59o5R3R6
3811A48N5j34K5j66L20j21j68L87j55k61p3K11j67K52j63L1r3K78k87K38l10P6
3833g7J42Nn0j99N9K78l41J36K40k29j83M72Kn88M30r1j30J65j16j65M42j69m4
3856a1R1p1j04P5J02l57M78m02jN85m78L00l46OL4j9J80J64j23J14m21J98j59
3879a65L84Mj42j67K52k91L43q3p2rk16M7L33r7K0J1j79K43k47K46m22J82K5m8
$$ plain form
3903 -48 -163 7 -170 71 16 -4 132 68 115 -276 27 -367 119 -90 186 190 96 -45 74 -140 -24 19 50
3926 50 282 29 43 43 114 -205 -23 119 204 -157 98 41 266 67 -53 -76 -47 92 -150 10 -134 -7 16
3949 16 74 17 98 111 0 143 -146 -171 128 207 -270 -69 135 66 93 -128 150 184 -135 -29 -158 90 203
3972 203 67 -2 183 -89 76 165 12 -104 97 86 -48 149 -225 -81 75 -204 161 -176 -125 -207 69 -36
3994 -36 -185 -91 272 263 128 -401 -174 -75 -138 474 235 32 70 78 -32 9 152 35 54 162 -40 270 125 181
4018 181 -3 101 -193 -268 40 245 30 -147 84 -235 188 170 -140 141 11 -187 -226 -146 217 -114 201
4039 201 -82 -106 -66 -157 168 292 136 -175 217 197 217 138 -29 -24 -162 -120 80 -10 65 77 181 192 268 181 -137
4064 -137 -119 -88 -94 -56 -125 -150 66 -180 145 -184 169 -133 -245 165 110 -318 -186 93 -204 243 -32 -124 19
$$ packed form
3903d8j15J70j77K41n5k0J36o4M7l91L03l94M86k09K76Mr4j41J19k14J16M3L1
3926E0K32k53J4%P1l19J82J42Q5l61K55n7K25j99j20k3K9J39k42J60j44J27K3
3949A6N8n7Q1J3j11J43k89k5K99P9m77K01K04o9K7k21K78L4l19J06j29K48J13
3972B03j36o9J85k72J65Q9j53j16K01j1j34J97l74J44J56k79L65l37N1q2K76j05
3994c6j49R4L63rj35n29K27R9o3O12k39k03L8Qj10M1J43j17J9J08k02L10j45N6
4018A81j84J04k94p5L08K05k15j77K31l19M23j8l10K81j30j98l9Q0L63l31L15
4039B01k83k4M0r1L25J24j56l11L92k0K0p9j67Nj38M2K00r0P5J2J04J1P6q7l18
4064a37J8L1oL8o9k5K16k46L25l29L53l02j12M10n5m28J32K79k97M47k75r2J43
$$ plain form
4087 19 46 -8 59 -114 -273 -270 -161 167 91 -297 22 -131 23 30 -22 -232 -75 -21 -18 53 -40 6 148 -203 11
4112 11 -9 41 158 -30 -239 51 -28 159 240 -106 -81 -5 -123 -81 -37 30 185 9 275 -8 223 -31 -46 -137
4136 -137 45 -20 -73 160 -292 16 -156 34 -70 76 -240 -203 -102 -59 -144 162 -40 -204 -200 30 -132 -111 26
4159 26 143 5 146 22 100 -51 -90 -11 70 -211 -18 -125 42 -126 243 180 -38 253 137 286 -101 51
4181 51 -70 -40 -114 31 92 213 104 93 104 -45 278 105 127 218 -19 89 143 -25 54 59 29 34 -20 -214 -164 -52
4207 -52 198 92 -273 40 -83 -2 -55 -121 124 -282 -214 77 12 -340 66 -36 -46 71 -60 54 115 -225 1
4230 1 -123 -243 67 -141 -161 25 85 166 -103 193 -320 80 2 -114 92 164 -38 -314 386 -125 -95 -347 101
4253 101 126 9 -82 -197 -192 -193 -84 32 86 162 330 65 -152 -51 -260 -9 -37 37 183 -4 -152 -102 126 -294
$$ packed form
4087A9K7n4O7j73j59LJ09L28p6l88L19j53J54Pn2k10J57N4LP1r3M6J42l51K14
4112A1k0N0J17j88k09K90p9J87Q1l46K5P6j18M2M4O7J55j76K66k83K31k54j5r1
4136a37J82o5n3K33m52L08j72J90j04J46l16L7J01M3q5L06k02j64MK30j62K1J37
4159B6J17j38J41j24P8j51l9P9Q1k81J93j07J67j68L69o3k18K91j16J49l87J52
4181E1j21L0p4J45O1J21j09j1J1j49L23j73K2R1k37J08N4j68P9Nl0Nn4j94N0J12
4207e2K50j06l65L13j23Q1n3o6K45m06O8K91o5l52M06j02j0J17j31J14O1l40K26
4230Aj24j20L10k08k0J86O0Q1k69K96n13M00p8j16K06P2k02k76P00n11L0k52M48
4253A01K5j17r1j15NjJ09J16N4P6J68k65k17J01k09K51k8P4J46j87j48N0K28m20
$$ plain form
4277 -294 133 -144 160 -162 -2 199 -2 169 286 -79 -130 165 -196 -63 122 3 -166 212 -20 182
4297 182 -79 -96 34 246 173 130 36 -106 -67 -81 -109 27 126 -276 -99 144 -11 182 -237 189 -76 -46 9
4320 9 180 36 207 -2 -90 176 94 -42 33 42 -204 -7 -21 -62 80 -119 -153 142 -50 157 -65 125 -223
4343 -223 -105 56 -330 -41 78 135 -194 -134 58 213 -163 -8 179 208 -44 -172 -143 -164 354 135 82 -6
4365 -6 -56 92 -119 46 -29 130 -46 -282 138 -327 -22 88 33 137 -223 -44 -149 83 -78 17 -32 -56 383
4388 383 223 99 181 -17 209 57 74 11 224 -21 -500 115 68 74 26 57 79 -113 -112 -102 -94 55 -161 -67 -110
4413 -110 -255 2 148 81 178 -45 142 -100 58 44 -19 267 -68 95 -16 106 170 101 -60 85 149 223 -163
4436 -163 -117 -38 223 -131 151 -19 197 -70 297 75 179 92 -23 210 157 -4 254 -69 21 -288 -353 3
$$ packed form
4277b94M27k77L04l22J60K01k01J71J17l65n1K95l61J33J85j19j69L78k32K02
4297A82k61j7J30K12p3m3r4j42L9j4k8J36R9m02J77K43j55J93m19M26k65L0N5
4320IJ71j44J71k09q8K66q2j36P5Rk46J97j4m1J42j99l4K95j92K07k22J90l48
4343b23J18J61l86K89J19N7l29O0J92J55l76J55J87K9k52j28K9k1N18k19n3q8
4365fn0J48k11J65p5J59j76k36M20m65L05J10n5J04l60J79j05K32j61R5m9k4M39
4388C83j60j24Q2j98K26j52J7o3K13k45m79O15m7Om8L1K2j92JJ0QJ49k16R4m3
4413a10j45K57J46o7R7k23J87k42J58j4o3K86l35J63j11J22O4o9j61J45O4P4l86
4436a63M6P9K61l54K82j70K16k67L67k22J04q7j15K33n3j61K58l23R0l09o5L56
$$ plain form
4458 3 -240 -84 326 -319 43 -72 -170 61 -154 97 384 219 -193 81 -114 -121 -108 -123 53 -125 9 357
4480 357 194 -94 -41 17 258 -41 122 168 57 181 240 169 221 -142 -44 110 -99 -167 -283 15 281 -94 0
4503 0 -32 372 -28 79 -283 -65 -214 -268 73 -64 142 -16 -206 -72 221 246 210 -5 -59 74 -207 -71
4525 -71 73 22 5 -170 -2 23 -133 -25 125 -129 -243 38 -108 -133 75 -76 23 119 195 84 88 -198 -254 333
4549 333 146 -9 -2 200 -107 -109 134 18 163 -72 207 -26 -84 -85 139 119 61 -9 152 -77 46 70 126 -84
4573 -84 231 112 -158 -58 288 54 -133 9 -189 -40 -12 -114 139 -108 171 -127 -351 21 166 76 170
4594 170 -183 42 -25 -54 6 199 -161 -199 -32 102 215 88 163 131 -132 16 -190 81 -52 182 77 147
4616 147 -108 -2 31 241 29 16 -78 -37 68 -88 -277 14 232 -144 113 -124 129 122 111 -20 108 -214
$$ packed form
4458Ck43J56M10o45L62j15r8K31k15K51K87j65m12K74j95pJ3j5J76j78J34L48
4480C57j63k88N3N8K41k99J63M6j11J24N9p1N2l63R8J54k09o8j16K98K66l75R4
4503@l2M04m00J07l62K18j49n4L41j37K06j58j90J34K93K5l6k15n4J33k81J36
4525g1J44n1j7j75J68K5j56J08J50k54j14K81j46k5K08j51R9R6P6j11Mk86n6N87
4549C33j87j55PK02l07kK43j16J45k35K79k33n8jK24k0n8p0J61k29J23K4N6k10
4573h4L15j19k70J00L46k34j87J42j98J49K8j02K53k47K79k98k24L72J45r0R4
4594A70l53K25o7k9O0J93l60l8J67J34J13j27P5l2k63J48k06K71j33K34j05P0
4616A47k55J06L3K10k12j3r4M1J05j56j89K91K18l76K57k37K53pj1j31J28l22
$$ plain form
4638 -214 -83 -141 130 51 63 -231 -152 5 170 -22 -61 -90 269 -192 117 -23 67 62 230 -116 205 155 159 -185
4662 -185 103 -110 -145 -2 -130 305 -138 -24 188 -13 72 71 93 4 -112 -134 -136 123 248 -118 -118 164 105 24
4686 24 -114 21 -101 90 -153 182 -83 143 284 240 -56 -102 -205 -108 59 6 67 -182 184 -50 -5 64 -41
4709 -41 215 -227 -47 33 25 134 -21 330 34 -205 -280 21 -265 254 -152 16 223 -98 106 166 13 -92
4731 -92 -143 6 -113 -147 80 34 -98 -152 -210 -354 1 -379 -129 19 58 18 171 184 -215 -196 249 34 82 -220
4755 -220 -86 171 2 -298 -197 -39 -230 67 320 96 -36 -22 -49 73 -128 -88 -122 275 -82 183 -67
4776 -67 -129 29 -133 20 30 36 139 -145 49 -21 259 165 138 132 -118 -97 -25 109 -45 133 -37 -27 125 57 106
4801 106 -13 103 98 -144 -1 -55 257 169 160 -226 35 78 -97 -59 14 127 -155 -149 221 42 -157 239 -108 -27
$$ packed form
4638b14J31n8K71p9J2k94P9J57J65j92l9k9L59m61L09j40R0nJ68l46L21n0Ml44
4662a85K88k13l5J43j28M35m43J14K12k01Q5jK2q9j16k2kK59J25l66%K82n9q1
4686B4j38J35j22J91k43L35k65K26J41m4k96m6j03R7J67n3O1k49L66k34M5O9j05
4709d1K56m42J80Q0qJ09j55L51k96k39p5L01k86N19m06J68K07l21K04O0j53j05
4731i2n1J49j19l4K27m6j32n4n8j44L55l80K50J48L9m0J53J3l99J9M45k15M8l02
4755b20J34K57j69l00J01J58j91K97K53k24j32J4k7J22k01M0l4L97l57K65k50
4776f7o2J58j62J53J0OJ03k84J94p0K80r4k7ok50K1P2J34j54J78j70J0J52o8M9
4801A06j19J16nk42J43n4L12q8rl86K61M3j75L8P3J13k82OL70j79j99L96l47Q1
$$ plain form
4825 -27 213 -134 204 193 -130 243 352 -240 -139 -268 12 -78 193 17 149 262 -450 -38 -112 -51 50 -123
4847 -123 -49 -168 53 177 0 173 152 -203 100 -44 35 -15 -176 -137 44 41 131 -140 143 108 -217 94 -21
4870 -21 90 15 24 94 -123 -33 -256 -234 -267 48 -70 135 120 66 -184 185 92 191 -68 47 66 -10 100 36 -139
4895 -139 -94 -93 -126 -10 70 -13 -18 -7 -130 -175 84 -111 35 -27 -145 144 8 55 -127 31 -75 63 162 143 -25
4920 -25 116 139 199 -85 -91 85 -46 150 83 -3 227 -153 233 -273 113 -48 -190 -105 36 -80 152 -64 278
4943 278 -97 -75 349 121 84 -11 170 244 9 84 3 17 -66 104 -408 -203 -180 110 -134 79 -44 -297 74
4966 74 192 -20 -557 171 130 -69 -47 26 -42 88 -180 -69 43 296 257 80 151 -44 1 -98 5 164 -211
4989 -211 59 212 312 -190 -57 208 -215 46 104 175 -114 -50 80 78 200 86 -254 30 93 -157 -24 75
$$ packed form
4825b7K40l47L38j1l23L73J09n92J01j29K80r0K71j76J32J13p12M12p4O1J01j73
4847a23P4j19K21J24j77J73k1l55L03j44P9n0j61L9J81lR0k71K83l5l25L11j15
4870b1J11p5RP0k17R0k23K2l3L15j18K05j5n4k50L69r3R9k59J15J9p6J10o4j75
4895a39M5Jl3J16Q0q3nJ1j23m5K59j95J46o2j18K89j36M7j82J58j06J38R9j9j68
4920b5J41K3O0k84oJ76j31J96o7q6K30l80L86n06L86j61j42Q5J41j16K32k16L42
4943B78l75K2M24k28l7r5J81P4k35P5q1J4q3J70n12K05K3K90k44K13j23k53L71
4966G4J18k12n37P28m1j99K2P3o8J30k68J11J12K53l9j77P1j95M5r9J03J59l75
4989b11K70J53J00n02J33K65m23K61N8P1k89O4J30kJ22j14l40K84O3k50J33R9
$$ plain form
5011 75 118 -86 117 -117 172 35 4 43 183 7 -54 205 -315 60 -8 -1 251 65 -141 -263 5 -167 138
5034 138 216 -76 45 154 -24 76 -28 -109 -27 -261 -346 -244 -184 -52 -113 -205 -1 -80 -16 -61 143 123 248 -127
5058 -127 9 -23 56 -194 99 -123 -215 8 -68 -141 -39 99 327 31 12 -175 -53 238 145 172 -55 -98 -71
5081 -71 116 3 -162 -190 43 -66 49 -181 214 -168 236 -212 -62 289 -80 -69 -124 -241 92 87 161 324
5103 324 146 -52 -97 51 81 302 -37 191 -147 42 105 -140 54 82 -202 -437 175 64 71 40 41 107 -1
5126 -1 16 173 -196 -162 183 -34 -149 -149 -62 -126 12 -59 -178 58 -176 24 -312 161 122 -292 -72 -39 -218 159
5150 159 -196 -47 -165 100 -20 -59 -84 134 -386 -6 247 155 195 -186 144 -186 85 -164 172 92 -102 -11
5172 -11 49 90 -77 30 -101 -25 -48 105 -289 71 114 158 -118 43 -24 -13 131 -216 261 -192 -106 -15 100 -103
$$ packed form
5011G5M3k04K03k34K89j37l1L9J40j76o1K59n20L75o8PK52j86k06j22K68j72L05
5034A38P8k92J21J09j78J00j04q1Q2k34q5J02O0J32o1r2K04p9O4m5K04k0J25l75
5058a27J36l2P9k50K93k22r2K23p6p3J02J38K28k96j9j87J22K91r3K7k27m3K7
5081g1J87j13j65k8K33j09J15k30L95l82M04m48J50L51l69J1n5j17L33nP4J63
5103C24j78j98m5J48L0K21l39K28l38J89O3k45J94K8k84k35O12j11Pl1JO6j08
5126aJ7J57l69L4L45k17j15%Q7o4J38p1j19K36k34K00l36M73l9m14K20L3j79L77
5150A59l55J49j18K65j20l9k5K18n20L80K53r2M0l81L30l30K71k49L36q0j94R1
5172a1O0M1j67J07j31P6k3J53l94L60M3M4k76J61o7J1J44l47M77m53Q6R1J15k03
$$ plain form
5196 -103 -29 -12 75 -39 121 -14 -52 67 92 -167 231 -78 -255 -34 42 248 84 83 84 -83 159 0 132
5219 132 -36 -9 7 -8 232 -67 24 -157 351 -87 -71 22 -14 -281 -16 -198 -171 180 -132 -34 347 -355 299
5242 299 1 -320 -27 -90 208 69 -153 168 117 111 278 -57 -99 222 208 43 190 -128 -38 -227 -31 -170
5264 -170 262 -169 -257 -161 -221 59 -192 50 -70 -247 -218 3 -95 -148 -91 154 -130 196 -176 105 43 -58 -6
5287 -6 -24 -5 -165 -54 65 -309 271 27 -144 179 -54 -198 -4 -7 149 -61 -48 -30 45 111 -106 -407 -264
5310 -264 -28 -120 -93 186 -143 -29 246 -441 -90 -327 258 -108 -123 110 -74 56 5 -37 -256 -23 24 13
5332 13 17 -206 -70 76 -152 -45 214 179 -171 -164 286 126 47 -47 -9 236 58 -265 -16 -81 90 -141 -154 -324
5356 -324 -27 -17 -250 115 -155 -106 -50 -101 266 123 -102 132 -36 -128 63 80 -7 119 84 169 -177 -39 135
$$ packed form
5196a03P4J7Q7j14J60j35l8J19K5k59L98l09j77K21P6K06j64jJj67K42j59J32
5219A32j68K7J6j5K40k99R1j81N08m38J6R3l6k67K65j82K7L51l12R8L81p02O54
5242B99k98l21K93o3K98j39k22L21n1oJ67l35m2L21j4j65J47l18R0j89J96j39
5264a70M32m31q8R6o0K80k51K42j20j77K9K21r8n3N7K45k84L26l72K81o2j01N2
5287fj8J9j60J11J19l74N80k44j71L23k33j44J94lJ56k10J3J8P5O6k17l01J43
5310b64K36r2K7K79l29J14K75o87L51k37N85l66j5K33j84J30n1m2k19K33M7j1
5332A3Mk23J36J46k28J07K59l5l50PM50j60p9r4L8K45j78l23K49o5J71k31j3j70
5356c24K97J0k33L65k70M9N6n1L67j43k25K34j68r2J91J7q7J26l5Q5l46J38J74
$$ plain form
5379 135 58 134 69 33 -126 117 79 134 110 110 -117 -293 -63 35 4 -110 -48 -103 -113 163 -156 56 115 -142 -103
5404 -103 -42 107 19 -248 -129 56 34 99 49 67 -66 28 124 -113 -186 139 187 64 33 61 -143 -461 -16 24
5428 24 196 3 -75 179 262 79 139 -150 70 -63 -98 -93 -15 -33 17 44 55 126 155 168 -45 -99 -159 37 -115 263
5454 263 63 -153 58 58 218 -66 66 -219 -40 -21 -68 -64 271 -27 129 -20 -186 56 -95 68 -188 -190 60
5477 60 -31 -49 3 150 24 -315 -15 46 -164 -105 126 -123 -239 1 136 4 -301 69 -139 -66 -201 6
5499 6 122 56 -72 48 -66 -34 -84 -194 -24 -20 -140 -56 -143 72 -7 203 -67 -108 -14 193 -101 98 37 33 92
5524 92 -118 105 -147 -180 -78 145 -114 209 38 88 47 -24 29 268 -227 51 -155 298 100 2 151 180 -86
5547 -86 166 207 -140 261 214 54 61 -167 -51 -119 -99 35 69 23 -112 32 -204 88 91 117 -76 -98 105 89 -94
$$ packed form
5379A35p7P6o5l6j59K43l8N5k4%k27j76K30R8l1j14O2n5j0K76l19K12N9k57L9
5404a03O1J49q8k67J19J85k2O5n0J8j33R4R6k37p3L25M8j23l1K8k04l18M45M0
5428B4J72j93p8K54Q3j83O0k89K20j33l5NP8j8N0K7J1P1K9J3k13n4o0J96j52L78
5454B63k00k16K11%J60k84J32k85J79J9m7ML35k98J56j49j66K42j51J63k56kK50
5477F0r1j8N2J47j26l39L00O1k10N9K31k49j16K40J35j32l05L70k08P3j35K07
5499FJ16o6j28J20j14L2n0j10J70Mj20Q4q7K15p9K10k70m1R4K07k94J99o1mN9
5524I2k10K23k52l3J02K23k59L23j71N0m1p1N3K39m95K78k06M53j98r8J49K9k66
5547h6K52M1l47M01m7j60Pk28J16o8K0J34L4m6j35J44k36K92LK6j93k2K03j6j83
$$ plain form
5572 -94 64 17 -238 -86 161 -206 58 34 -44 -61 -89 -121 136 104 77 151 -166 -157 -63 30 83 192 -211 171 147
5597 147 10 65 88 134 276 -58 -259 -167 -329 -78 -23 -350 -77 49 16 -108 -35 177 -131 6 186 211 -64
5620 -64 -62 46 35 82 125 -124 15 32 -30 300 -61 -40 53 70 119 -21 3 23 -19 -245 -34 67 227 -169 131
5645 131 92 -173 34 -285 -158 1 -258 165 169 -90 156 -174 -41 -10 137 -153 -19 154 99 -4 -46 -241
5667 -241 54 -108 11 -96 147 101 49 154 -252 74 -100 108 13 81 202 -137 190 -79 153 167 38 -80
5689 -80 -174 -131 241 113 105 -119 13 -19 -158 21 28 -104 -302 -111 255 178 -185 -153 74 84 -83 -61 106 100 124
5714 124 -45 76 -56 -62 -52 2 81 -173 128 -80 27 170 -51 -143 79 -17 -6 -150 -96 -24 15 -115 41 59
5738 59 131 -168 -175 103 -128 -139 -31 7 -112 -5 43 -92 -33 300 122 -306 -493 -131 12 245 -85 -115 24
$$ packed form
5572i4J58m7k55J52K47l67K64k4p8j7k8l2K57l2k7P4l17RR4R3N3J09m03L82k4
5597A47j37N5K3M6J42l34k01R2j62K51N5l27K73J26l3j24P3K12l08J37J80K5k75
5620f4KJ08j1M7M3k49J39J7o2L30l61K1R3J7M9j40K4K0m2k26K11J01J60l96L00
5645A31l9k65K07l19J27J59k59M23Mk59K46l30J33L1J47k90J34J73n5j03m2j95
5667b41K95j62J19j07K43m6n2J05m06L26j74K08r5O8J21l39L27k69K32J4j29j18
5689h0r4M3L72j28qk24J32l2j39J79Pj32j98J91L66p7l63L2K27J0j67K2J67oK4
5714A24j69J21j32oJ0N4P9k54L01k08J07J43k21r2K22r6J1j44N4P2L9j30J56J8
5738E9P2k99pK78k31j1J08L8j19J07M8j35N9L33j78m28j87L62J43K33l30l0J39
$$ plain form
5761 24 -256 -17 116 -142 138 -20 -84 -32 175 172 511 -33 4 180 132 94 23 -159 107 -68 -321 15 37
5784 37 -87 16 154 76 114 138 -74 112 95 -59 -76 -91 136 74 -54 236 160 212 -300 223 184 0 113 123
5808 123 57 240 -14 -125 245 165 39 -85 66 -333 99 -49 -142 -41 58 -180 -145 31 -19 -103 54 39 85
5831 85 91 -162 7 -230 92 62 -26 -100 -271 130 48 -113 -256 35 -4 -97 -255 -188 -24 -162 73 -75 -3 -219
5855 -219 -169 -155 -42 -182 -141 -4 -83 -19 40 -97 1 -74 -69 -27 -129 -45 233 283 167 -21 -153 -3 -74 -43 134
5880 134 -274 -87 277 96 95 -189 4 -3 62 -247 -74 61 95 -350 -552 -15 -55 -158 -103 80 -30 -7 -435
5903 -435 34 -56 -165 -235 -65 -153 -39 57 194 46 -233 38 73 270 -246 -166 17 -11 -142 325 64 -96
5925 -96 -75 -165 72 63 87 -52 279 45 56 209 -27 25 -29 -124 -140 53 221 -53 -201 -97 1 -265 -31 241
$$ packed form
5761B4k80K39J33k58K80j58o4N2K07lL39n44L7J76m8l8p1j82K66j75k53L36K2
5784C7j24J03J38p8L8K4k12J86j7j54j7j5K27o2j28K90p6N2n12N23l9j84J13J0
5808A23o6J83k54j11L70q0j26j24J51l99M32j48r3J01R9k38L5J76n0q4J57j5M6
5831H5Ok53J69k37L22l0q8p4j71M01q2j61j43K91l9r3j58O7J64j38K35j48P2k16
5855b19N0J4J13j40M1J37p9O4N9j37R8p5NM2j02Q4K78N0j16j88j32J50p1L1J77
5880A34m08J87L64j81jk84J93pO5l09J73J35L4m45k02N37m0j03N5J83j10K3m28
5903d35M69r0j09p0J70q8J14R6J37j48k79K71L5J97n16Q0J83k8j31M67k61j60
5925i6K1r0K37rK4j39L31k34J1J53k36N2n4r5j6J93J68k74j48J04R8k66K34K72
$$ plain form
5949 241 32 -267 -29 137 42 -133 -46 203 1 242 114 -64 10 337 -41 -163 286 146 -292 -105 133
5970 133 -7 -118 -4 -163 352 55 79 -110 54 151 -118 -141 -68 68 28 1 112 173 50 -217 -132 188 -42
5993 -42 -123 -117 54 -147 104 -200 149 59 21 -113 -252 -270 -30 14 -95 -12 -147 -164 -43 165 -82 -18 57 -63
6017 -63 -67 86 -42 67 -69 118 -3 150 -236 189 -25 40 -124 -61 92 -261 -145 129 131 -127 114 40 -115
6040 -115 -84 -112 101 -44 147 174 -44 11 22 -165 2 -59 63 -61 53 -111 -84 -105 -25 196 43 31 -264
6063 -264 42 -101 -132 -106 -243 -304 48 146 234 -3 -49 354 -73 -60 311 -143 73 29 -9 -63 50 9 35 -6
6087 -6 -59 52 145 28 100 59 129 11 -165 -78 -4 341 -32 -27 -50 54 -69 -193 -31 161 -80 86 35 -294
6111 -294 -188 -70 -167 15 166 55 -140 28 16 -82 80 -33 -114 105 -45 209 150 -83 401 79 162 268
$$ packed form
5949B41k09k99K38J66r5j75Q7K49k02K41j28j78P4L27l78j22M49j40m38J87K38
5970A33j40j11J14j59N15k97K4j89J64R7k69k3P3J36m0k7J11O1j23k67Q5L20k30
5993d2q1OJ71k01K51l04L49r0l8j34j39j8K40M4j09Q3j35j7J21K08k47O4P5j20
6017f3mJ53j28J09j36J87j21J53l86M25k14O5j64O3J53l53J16K74Kk58K41p4j55
6040a15L1k8K13j45J91K7k18N5J1j87J67o1J22j24J14j64K7k1Q0K21j53j2k95
6063b64L06j43l1K6j37o1L52R8Q8k37m6M03m27J3L71m54K16m4l8n4J13m1K6m1
6087fn3J11R3j17P2m1P0j18j76Q7P4L45l73Nk3J04j23j24J62J92k41J66n1l29
6111b94J06J18r7J82J51j11j95J68j2r8J62j13q1K19j50K54n9k33M84l22Q3J06
$$ plain form
6133 268 71 99 -92 127 92 56 -104 -346 100 114 -117 -100 41 -102 -51 -21 29 -128 -78 249 77 -86 -50
6156 -50 42 -18 -51 -252 -34 -75 38 136 -56 91 297 175 -163 126 220 32 50 -22 -99 -47 186 74 -150 14
6180 14 -87 54 -20 -97 107 -303 -128 113 126 259 120 16 0 249 38 -195 67 12 -172 125 0 152
6202 152 -34 271 299 99 346 94 -3 98 -66 68 102 149 38 -71 -55 -7 37 156 63 149 85 95 31 -271
6226 -271 -211 -130 196 33 -40 116 9 189 36 -55 -190 12 130 26 321 234 219 -166 -46 -59 206 -71
6248 -71 149 -115 218 -66 -24 198 -27 -136 127 165 -132 -358 -159 -98 104 -20 -112 118 -217 -295 94 120
6270 120 6 -142 -96 109 -295 48 -145 -30 274 145 159 9 98 -27 -75 -225 79 -58 -110 137 67 -97
6292 -97 -370 -40 -20 -233 -70 -31 -18 -87 78 -121 -145 -163 155 270 -145 30 79 -127 -4 47 -337 154 129
$$ packed form
6133B68j97K8j91K19l5l6j60k42M46J4k31J7J41j43N1L0N0j57N0L27j72j63L6
6156e0R2o0l3k01K18m1J13R8j92J47K06j22l38K89R4j88J8p2p7N2K33j12k24J64
6180A4j01J41p4p7K04m10J75K41J3J33j39j04j6K49k11k33K62n5j84K97j25J52
6202A52j86L05K8k00K47k52r7J01j64J34L4M7j11j09J6M8M4J19r3Q6o4J0o4l02
6226b71O0Q1L26j63p3J56j07J80j53r1j35K02J18j04K95q7j5l85J20j3K65k77
6248g1K20k64L33k84M2K22k25j09K63L8k97k26J99O1K02j24r2K30l35p8L89K6
6270A20j14j48M6K05m04L43j93J15L04j29J4j50Q9j25m8j50L04j37n2K47p0j64
6292i7k73L30K0k13J63L9J3o9J65j99k4j8L18J15m15J75M9k06J23N1l84M91k5
$$ plain form
6315 129 84 48 -267 -15 -121 83 -126 -98 156 206 -69 -4 107 134 -64 189 172 93 61 88 134 53 326 274
6339 274 -130 81 140 -10 364 2 -22 1 -26 250 116 9 153 216 -55 84 88 -80 1 -48 -261 50 2
6362 2 124 -146 139 -55 182 -40 -145 -218 123 -131 42 -20 259 24 97 19 -47 48 27 101 -332 -15 -76 289
6386 289 -176 -32 -77 -306 -7 101 -2 191 -61 153 129 7 -166 -97 -153 -13 144 -176 -415 19 -141
6407 -141 232 57 -11 -14 -191 205 248 260 39 53 103 -180 -265 214 -41 -43 -100 -30 -5 -239 50 27 -12 94 289
6432 289 -62 92 -63 51 63 333 117 51 -153 103 -84 51 183 29 -81 -384 17 238 77 -82 31
6453 31 -202 251 1 -18 -77 -63 73 -47 213 6 45 -50 -39 184 -136 -48 -91 -66 161 290 -57 3 -64 -150
6477 -150 53 -138 236 341 229 -203 -211 -64 -1 -166 -141 -53 80 -148 -88 -189 247 85 327 233 -71 -82 9
$$ packed form
6315A29m5l6l15K52j06K04k09K8K54N0k75O5J11K7j98K53j7p9l2K7M6q1K73n2
6339B74m04K11N9j50L74l62k4K3k7K76j34j07J44O3k71J39Mj68Q1m9k13L11m8
6362BJ22k70K85j94K37k22j05p3L41k54J73o2K79k35P3p8o6R5k1P4m33L17o1L65
6386B89m65J44m5k29K99J08j03J93k52K14k4j22j73O9n6J40J57l20k39M34j60
6407a41L73j75o8lj77L96M3J2k21J4N0k83q5M79k55kn7P0K5k34K89k3l9J06J95
6432B89l51J54j55J14J2K70k16o6k04K56j87J35J32j54j10l03M01K21j61j59J13
6453C1k33M53k50j9n9J4J36j20K60k07L9r5J1K23l20Q8m3K5K27J29l47O0o7q6
6477a50K03j91L74J05j12m32qJ47O3j65K5Q8J33k28O0j01M36j62K42r4l04j1R1
$$ plain form
6500 9 242 95 -118 -78 105 -94 154 88 80 -124 26 -89 -79 47 -71 15 -311 -242 -128 -175 243 3 -72 40
6524 40 115 -255 22 -161 -423 -9 -8 166 115 205 57 274 111 95 125 164 90 -22 92 64 -202 -96 21 -169
6548 -169 82 -68 -68 -2 -16 0 322 73 -96 -80 -27 -13 -142 -121 146 -108 -144 -46 -188 -175 339 167 -131 -318
6572 -318 117 -128 128 203 181 169 -27 94 -18 -136 -14 95 -26 -166 142 -193 -279 22 -172 -117 67 -176
6594 -176 38 -4 -285 -216 3 202 -50 36 79 104 209 -87 -168 106 6 143 -8 222 185 66 -17 -81 -69
6617 -69 189 70 -53 105 62 164 73 117 102 7 22 243 231 -156 -48 -133 -248 112 -65 97 221 -122 -7
6640 -7 -50 -248 -83 -163 -330 -39 252 37 -44 -103 220 164 176 -162 -188 -131 101 -26 5 267 -95 -151 -201 63
6664 63 70 -40 20 -154 -134 1 22 259 -82 -75 -24 -108 113 145 283 -88 4 -44 -54 74 -5 163 -43 -183 -116
$$ packed form
6500IK33j47k13M0J83j99K48o6qk04J50j15J0J26j18Q6l26O9J14m7M18k40p5J12
6524D0P5l70K77j83k62M14JJ74n1R0j48K17j63j6L0L9p4j12J14k8k66J06J17j90
6548a69K51j50%O6j4J6L22k49j69J6N3J4j29K1K67k54l6R8j42J3N14j72k98j87
6572c18M35k45K56P5k2j2j96J21j12j18J22J09j21j40L08l35q6L01j94N5J84k43
6594a76K14m2k81O9K19J99k52Q6M3K5J05k96q1K74j00J37j51K30l7j19q3o4J2
6617f9K58j19j23J58m3J02r1M4j5r5J5K21j2l87J08q5j15L60j77J62J24l43J15
6640gm3j98J65q0j67K91K91k15q1n9L23n6J2l38k6N7K32j27L1K62l62n6n0K64
6664F3Pj10O0j74K0J35K1K37l41PN1q4K21L2J38l71R2m8j0J28p9J68k06j40O7
$$ plain form
6689 -116 -70 -101 131 11 -167 -305 -133 -111 -374 -339 -18 228 -47 180 126 202 69 -12 -36 -113 91 15 -37 -44
6713 -44 -47 -179 236 -141 -215 -116 -75 284 57 237 -84 103 119 -78 6 -54 116 113 -192 292 -296 155 -21 -148
6737 -148 60 42 -183 172 115 -233 168 52 154 -113 255 4 -107 234 103 -319 -27 -196 -39 56 159
6758 159 -54 -121 199 33 -138 -65 109 -73 -210 123 0 63 14 -29 -15 177 72 88 8 -220 11 36 1
6781 1 19 -139 -61 7 44 215 -46 -72 -247 76 120 -91 270 -16 -108 44 65 -15 276 74 -119 11 30 -165
6805 -165 -68 -246 -14 0 -131 -43 310 -4 36 24 -112 -3 -44 24 -72 230 170 29 167 -107 420 -78 13
6828 13 42 67 -95 -44 -44 -360 131 -86 -6 30 74 -86 15 17 161 284 -121 46 168 -77 -193 -5 -3 112
6852 112 -39 97 -111 -80 70 163 -60 128 159 132 2 -168 78 -343 80 -409 191 24 -96 -9 -5 -10 -134
$$ packed form
6689a16M6l1K32j20j78j38J72K2k63L5L21K46k75K27n4P6j33q1k4p7K04p6n2p
6713d4lj32M15l77p4R9M1L59k27J80l21J87J6j97Q4o0J70ll05M84n88M51j76j27
6737a48K08j8k25L55n7l48M01j16J02k67L68k51j11L41j31m22K92j69J57R5J03
6758A59k13o7L20j66j71P3J74j82j37L33j23O3m9m3J4J92j05J6q0k28K31K5l5
6781AJ8j58P8O8L7J71k61k6j75L23M4k11L61k86r2J52K1q0K91k02j93J30J9j95
6805a65R7j78K32J4j31Q8L53l14M0j2j36J09m1O8r6L02o0j41J38k74N27m98R1
6828A3K9K5j62N1%l16M91k17Q0L6M4j60J01KJ44J23m05J67J22k45j16J88KJ15
6852A12j51J36k08L1J50R3k23J88L1k7j30j70K46m21M23m89O00j67j20Q7Mnj24
$$ plain form
6875 -134 145 63 -104 161 166 -4 -27 -38 18 39 -41 10 -145 -167 155 19 129 -1 6 29 297 -340 -36 201
6899 201 -47 -67 -57 105 -214 402 -12 310 -97 -141 215 -474 87 -59 -115 -31 -92 -81 8 -22 80 -21 92
6922 92 -208 -142 -61 -108 89 55 -91 -345 41 -55 -305 -125 -41 -104 296 -21 84 -17 -126 -201 113 -28 41
6945 41 181 158 143 -79 61 -98 -8 -34 -268 -119 166 10 49 275 -137 181 26 -87 -26 13 -134 -51 -107
6968 -107 -329 -128 -31 -228 -110 96 92 150 -198 -242 -191 81 60 72 -71 -50 -132 -7 4 483 -47 119 153 121
6992 121 -86 57 -13 59 -182 -144 9 -48 47 163 -221 -96 -79 -10 28 64 -17 -97 2 -117 154 -38 40 -10 91
7017 91 62 -258 -25 -52 -69 245 -7 -93 206 -169 4 -75 -153 -115 102 25 215 -25 145 149 -174 -301 348 78
7041 78 184 -159 -344 -20 -424 148 281 158 -23 -91 -167 24 146 145 252 -306 -98 -247 139 85 -104 361
$$ packed form
6875a34K79q2j67K65Nj70k3j1N6K1q0N1j55k2L22j36J10j30PK3K68o37L04K37
6899B01k48k0J0J62l19O16m14L22m07m4L56o89N61j46n6Q4o1J1Q9l0J02j01J13
6922I2l00O6Q1m7J97l4j46k54L86r6k50J80Q4o3M00l17J05j01j09p5L14j41O9
6945D1J40k3j5k22J40j59R0k6k34J49K85j56L9K26m12L18j55j13O1L9j47Q3n6
6968a07k22K01R7j97J18K06mN8l48m4N1K72k1J2j43K1q2J25J1M79n30J66L4l2
6992A21k07J43p0P2k41L8J53n7R5J16l84J25J7O9L8L6q1q0R9j19K71j92P8n0J01
7017I1k9l20K33k7j7L14k52q6K99l75J73p9p8L8K17p7J90k40J70Ml23j27O49k70
7041G8J06l43j85L24m04N72J33j23j81o8p6J91J22jJ07n58K08j49L86n4j89M65
$$ plain form
7063 361 -347 15 75 -115 -135 -88 158 119 -87 149 49 267 -164 112 96 313 -87 44 -272 -63 113 103
7085 103 -124 -65 227 -85 -68 350 237 238 55 19 -158 -204 42 -5 6 0 107 -250 -137 -209 101 74 -81 67
7109 67 7 232 -25 -230 -107 179 48 48 -49 -145 -98 -278 12 140 -107 35 265 290 -130 73 -11 -95 61
7132 61 147 358 -54 1 80 -48 190 -135 -196 -157 -19 -99 355 4 163 -32 -140 82 -170 138 -199 -57
7154 -57 62 -207 -151 1 -247 88 141 -25 37 41 206 52 143 -116 -25 219 73 -14 191 212 -49 -116 347 -40
7178 -40 130 248 -187 88 -164 190 -17 -26 329 13 -322 -181 -127 25 -64 -142 168 -199 -17 -412 54 -64
7200 -64 -113 129 -211 153 26 190 -37 -77 -15 85 62 -46 -171 -136 -76 -17 154 95 -55 105 -38 -60 132
7223 132 -84 82 -43 -43 -122 -131 28 147 -46 40 133 -191 42 -107 -115 73 156 66 115 -108 2 -86 129 -36
$$ packed form
7063C61p08L62O0j90k0M7K46l9k06K36j00K18m31K76j6K17m00J31l16K09J76j0
7085A03k27N9K92l12J7M18j13Jj83l6j77m6K46m7J1oJ07l57J13p2L10k7j55J48
7109F7o0K25k57k05J23K86j31%r7r6M7j80K90J28k47J42K30K5m20K03q4q4J56
7132F1Q6K11m12N5P9j28K38l25o1L9J38q0M54l51J59j95j08K22k52L08l37J42
7154e7J19k69N6J52k48L35N3j66O2MJ65j54R1k59R1K44j46q7K05K1k61o7M63l87
7178d0J70J18m35K75k52L54k07rL55l16l35J41N4J52q9p8L10l67J82l95M66j18
7200f4m9K42l40L64j27J64k27m0O2J00k3j08j25L5O0N9J71n9j50J60j43k2J92
7223A32k16J66j25%p9rJ59J19j93Q6R3l24K33j49qJ88Q3r0M9k23J10q8K15j65
$$ plain form
7247 -36 -19 307 -237 255 159 -104 -107 -32 39 -55 208 -81 -48 9 23 -85 -34 16 -31 -57 -122 122 -44 -59 -134 199
7273 199 162 -419 71 152 45 7 348 37 -114 110 61 -111 -55 58 250 -231 -175 256 42 -66 -148 -50 153
7296 153 -129 188 -153 -218 -2 243 -15 22 -292 -358 -44 -71 -100 -180 -4 -2 52 -374 -7 204 -22 -344 204
7319 204 -12 4 -174 172 69 47 -43 -62 -51 98 189 3 -26 -84 208 85 -183 -343 -329 38 -180 -238 -119
7342 -119 -395 77 -251 19 -200 -50 170 -120 -50 -72 80 -159 -178 267 -243 91 18 -39 -62 13 -211 -84
7364 -84 49 -41 -118 137 -267 34 -56 -204 84 279 16 160 -29 4 -153 153 -57 150 221 -59 73 5
7386 5 -63 150 -110 -109 271 -111 -37 -397 30 -2 258 -21 55 288 -245 77 -32 -60 -160 206 89 -165 197
7409 197 -19 1 32 -203 90 -92 5 -41 -58 170 105 66 -329 -21 -101 -45 63 -39 114 36 34 -228 316 -35
$$ packed form
7247c6J7L26n44M92r6k63lP5P1r4K63k89L3N7J4j08N1N0m7k6o5K44j66j5p5L33
7273A99l7n81M90Q1j07l8L41l11j51K24m9j72N6J13J92m81N6M31k14j08q2R8K03
7296A53k82L17l41o5K16K45k58L7l14o6L14k7k9q0J76KN4m26L67K11k26l22N48
7319B04k16J6j78L46j03k2r0j9J1J49R1j86k9n8K92j23k68j60J4L67k18n8J19
7342a19k76M72l28K70k19J50K20k90P0k2J52k39j9M45n10L34p3n7k3P5k24J27
7364h4J33r0p7K55m04L01r0j48K88J95k63J44j89L3j57L06k10K07P1k80J32o8
7386Eo8K13k60JL80l82P4l60M27l2K60k79P6K33n33L22j09k8j00L66j17k54L62
7409A97k16K0L1k35K93j82R7m6j7K28o5l9l95L08q0N6J08j02J53p8kk62N44l51
$$ plain form
7433 -35 98 66 -53 14 10 -21 -131 -180 59 11 -23 -19 175 42 176 76 -55 264 206 -64 -105 -165 287 -58 -15
7458 -15 -63 -13 129 72 -122 -100 25 -65 195 44 -24 23 69 30 -173 176 -128 -105 265 -236 -101 -116 127 -2
7482 -2 270 92 226 -53 32 -9 -211 143 -172 37 -108 265 25 -21 -40 -15 -231 168 191 -37 174 148 -145
7505 -145 8 -33 -194 -207 74 -78 -67 90 32 -167 -38 50 -317 7 -283 -36 -72 -234 -29 50 179 -258
7527 -258 -64 -259 -186 95 43 -184 86 -90 28 -38 371 -144 -109 160 103 -67 -289 -179 -111 183 -153 152
7549 152 184 -80 -155 52 -129 243 128 1 207 -260 -239 -144 41 281 -134 -32 -48 317 222 -247 -265 -198 -72
7572 -72 169 51 -87 -161 33 -68 163 281 -151 -225 34 -46 -159 -75 245 121 189 38 -170 -163 127 -153 57
7595 57 59 -214 17 140 -187 23 27 -47 -1 -211 92 103 -288 -5 132 106 -58 108 -37 257 34 24 -254
$$ packed form
7433c5J33l2j19O7ml1j10m9K39m8l4MJ94j33J34j00j31L19n8k70m1o0M52l45M3
7458a5m8N0J42n7j94K2J25r0K60j51o8M7M6l9k03L49l04K3L70n01J35j5K43j29
7482bK72j78J34k79Q5m1k02L54l15K09j45L73k40m6j9K5k16L99K3k28K11k6k93
7505a45J53m1j61j3K81j52J1J57n8j99J29Q8l67L24k90K47l6j62K05P9J29m37
7527b58J94j95P3K81n2k27K70j76J18o6M09n15L5K69n7j70k22J10O8K94l36L05
7549A52L2k64p5K07j81L72j15j27K06m67K1R5J85K40m15J02j6L65r5m69j8O7J26
7572g2K41j18j38p4J94j01K31J18m32p4K59q0j13Q4L20j24O8j51k08PK90k80K10
7595E7Kk73K31J23l27K10Mp4M6k10L03J1l91K83J37k6j64J66j45K94k23j0k78
$$ plain form
7618 -254 -101 179 16 -36 131 -41 -13 19 -35 -118 9 305 -316 -195 -91 -120 -76 62 60 53 -34 2 103 59 215
7643 215 -23 -139 -94 80 184 -177 -2 -51 131 -3 291 -121 310 -1 61 -71 -117 -97 -112 -161 282 -48
7665 -48 -160 -67 -88 -182 -20 -147 206 338 -208 -43 -19 -63 40 -59 68 336 -109 233 -194 -254 35 45 66
7688 66 38 195 16 -37 -268 -74 -286 149 -89 286 -140 105 62 -30 60 -102 15 -62 9 -261 -88 14 -29
7711 -29 125 122 143 302 -122 1 75 117 -36 55 1 185 446 -148 -17 138 2 14 -88 135 19 -357 -94
7734 -94 187 -73 39 171 131 114 -85 112 133 234 -29 60 -59 -61 -144 287 82 -48 148 141 -1 -152 220
7757 220 15 38 4 -225 49 -127 -413 151 54 54 -108 -278 -93 225 157 -152 -312 -318 151 15 -29 85 -221
7780 -221 -310 -9 -57 390 216 -55 215 399 -97 120 146 -186 49 -327 -351 59 164 -251 100 49 158 -65
$$ packed form
7618b54J53K80j63n2J67j72K8L2n4q3J27K96o21J21J04k9M4J38kpq7L6J01m4J56
7643B15k38j16M5J74J04l61J75m9J82j34K94m12M31l11O2j32m6K0j5m9M43l30
7665d8j12R3k1r4J62j27L53J32n46J65K4m4J03r9J27K68m45L42m27o0K89J0K1
7688F6k8J57j79n3k31J94k12M35k38L75m26K45m3r2R0j62J17p7P1k70J73J02m3
7711b9J54lK1J59m24J23P4M2j53R1n4J84K61n94J31J55j36J2j02K23j16l76K63
7734i4K81k60J12J32m0j7j99J97K1J01k63Q9j19kq3M31k05j30J96pj42j51L72
7757B20k05K3l4k29K74j76k86N64r7%j62j70J85L18o8l09j60oM69j36m4J14l06
7780b21q9L01m8M47j74k71K70J84m96K17K6l32K35l76k4M10J05m15L51n1J09k23
$$ plain form
7802 -65 135 6 -47 176 -188 151 -191 154 128 -27 -166 -252 -177 122 -168 -26 -217 -190 98 96 277 273 -62
7825 -62 -91 91 174 146 75 -33 -109 -15 -237 -77 34 36 -72 144 88 84 90 105 52 -66 -15 55 -109 11 193 96
7851 96 21 -136 42 -27 65 -16 150 -187 15 22 169 -198 -8 -195 126 146 23 109 -292 -129 -105 175 -98
7874 -98 52 -6 -101 -28 -39 46 94 51 11 -73 197 -224 -23 -1 -3 -267 299 25 -8 72 -67 9 -122 -68 -121 90
7900 90 -154 -199 -108 151 56 -121 92 -72 4 -119 -60 137 191 -10 116 -127 -204 -4 -198 59 -14 191 345
7923 345 -88 -176 155 -89 94 -254 20 -171 114 -259 71 -252 25 190 245 309 131 139 18 -190 294 168
7945 168 -47 84 172 116 -188 -36 158 -97 -84 109 -45 203 25 290 -82 39 -135 199 56 -190 -14
7966 -14 16 -189 116 -209 47 123 125 135 -134 239 -91 -54 -352 -319 -90 -264 82 90 -103 213 -23 -60 -124 -103
$$ packed form
7802f5K00j29n3K23l64L39l42L45k6j55j39q6P5K99k90J42j91K7K88kJ81ml35
7825f2k9J82Q3k8p1j08p6R4k22J60J11Kj08K16n6mOJ5n3j18N1P0j64J20J82r7
7851I6p5j57J78o9R2q1J66l37K02PJ47l67J90j87L21K0j23Q6m01J63K4K80k73
7874i8J50n8r5P3j1Q5M8m3m0q4K70m21K01K2kk64N66k74l3Q0j39P6j31N4n3K11
7900I0k44m5R1K59r5j77K13j64P6j23N9J97N4k01J26k43p7K00j94K57p3K05J54
7923C45m33q8L31k44J83l48K74j91K85l73L30l23K77J65N5O4j78Qj21k08M84j26
7945A68k15J31Q8n6l04J52J94k55J3J93j54K48j78K65l72J21j74L34j43k46J76
7966a4L0k05L05l25K56P6KJ0k69L73l30L7k98L3K29j74L46Qj93L16k36l7o4K1
$$ plain form
7990 -103 90 205 -231 115 77 136 -115 83 68 -51 -156 191 -75 -116 71 16 71 -302 -220 -77 -129 132 10
8013 10 138 -56 -101 63 212 93 105 190 -249 215 61 83 -232 -126 -2 52 154 -389 120 337 139 110
8035 110 -72 174 19 143 88 -56 -201 -75 35 32 152 348 48 -122 118 -134 169 66 -118 25 -140
8056 -140 352 277 -62 148 -31 92 -5 153 39 161 -194 -19 -87 -27 41 -58 -69 -264 72 16 -133 304 170
8079 170 -111 -8 -62 105 -148 29 -311 -184 -3 36 -143 144 -83 -81 347 -241 169 187 81 406 96 -192
8101 -192 81 -40 72 -146 -270 -124 16 -11 -48 177 313 -304 -35 -168 17 -211 -86 -44 51 -145 10
8122 10 -159 -51 -51 11 5 5 13 82 -237 -335 175 -19 -28 233 16 137 -202 -50 72 178 -95 26 -22 -120 205
8147 205 -152 222 -91 -129 288 -75 171 74 -384 57 -17 -23 -72 1 75 -23 -5 267 -28 47 72 150 -114 -36 -245
$$ packed form
7990a03J93J15m36L46l8N9k51J98j5j19j05L47k66m1J87n5N5l73Q2J43n2K61j22
8013A0J28j94m5J64J49j19J2Q5m39M64j54K2l15J06J24N4J02n43N09K17j98k9
8035A10j82K46j55J24n5j44j45J26J10lJ20J96l00j70K40k52L03j03j84J43j65
8056a40M92p5l39K10j79J23r7J58j14J22l55J75o8O0O8r9j1j95L36n6j49M37j34
8079A70k81J03n4J67k53J77l40J27J81L9j79K87k27KM28n88M10J8j06L25l10k88
8101a92K73j21J12k18j24J46J40k7l7K25J36o17K69j33J85k28J25M2R5j96J55
8122A0j69J08%O2o%QO9l19r8N10j94rK61k17J21l39J52J22J06k73J21m8r8L25
8147B05l57L74l13l8M17l63K46r7m58M41p4om9P3P4r8J8K72k95P5K5P8k64P8k09
$$ plain form
8172 -245 -57 -38 -64 226 -35 -120 178 105 -113 189 220 -88 -7 6 208 -70 -5 21 116
$$ packed form
8172b45J88J9k6K90k61q5K98p3k18L02L1l08Q1J3K02k78O5K6R5
8191A16
$$ Imaginary data points
##PAGE= N=2
##DATA TABLE= (X++(I..I)), XYDATA
$$ plain form
0 0 0 0 0 0 0 0 0 0 0 0 8 -8 8 -8 16 -16 24 -25 32 -40 48 -56 70 -80 96 -112 128 -148 169 -193 224 -256
32 -256 289 -329 369 -417 469 -525 588 -655 728 -809 898 -996 1100 -1215 1341 -1477 1628
49 1628 -1797 1978 -2179 2402 -2649 2929 -3241 3598 -4007 4484 -5043 5716 -6539 7577 -8928
64 -8928 10772 -13442 17678 -25456 44452 -195387 -125969 178166 -98142 20324 260847
75 260847 54214 -211001 2219 74411 -102472 -11587 227425 57263 -116383 41178
85 41178 75383 -116008 -19976 158756 28155 -107044 5031 560 -141514 -66990 114384
96 114384 40876 -60114 47266 43351 -132554 -73581 94248 27825 -28759 98440 73481
107 73481 -92973 -55455 59326 -16141 -50769 86273 72112 -83973 -42400 48154 -45126
$$ packed form
0@%%%%%%%%%%Qj6J6j6K4l2M0m9N7p2Q8j04J26j50J76k08K40k76L17l62M17m80
32b56N45o18O98p86Q86r94J113j243J383j537J707j894K096k315K556k818L105
49A628l425L775m157M581n051N578o170O839p605Q491r527J0759j2255J4116j6505
64h928J9700k4214L1120m3134O9908k39839O9418L04135k76308J18466K40523
75B60847k06633k65215K13220P2192j76883R0885K39012j70162j73646J57561
85D1178L4205j91391R6032J78732j30601j35199J12075m471j42074P4524J81374
96A14384p3508j00990J07380l915j75905N8973J67829o6423n6584J27199k4959
107G3481j66454L7518J14781p5467l4628J37042j4161j56085M1573R0554r3280
$$ plain form
118 -45126 -56028 82321 56451 -59405 -16477 22388 -63642 -55648 62189 57586 -14701 24669
130 24669 44135 -52553 -64583 21710 11494 -27602 31484 51207 -22091 -31573 21839 1848
142 1848 -37759 9646 36773 -22367 -26298 30077 8266 -24624 22883 32009 -26992 -24121 13370
155 13370 -13977 -29621 20917 32937 -11384 -5956 20367 -15055 -31966 12917 17638 -12524
167 -12524 7642 23760 -10734 -19117 10769 6988 -13083 5062 18255 -8309 -16567 6125 -439
180 -439 -16180 4085 13765 -7956 -7540 9453 290 -10691 5473 14010 -3144 -3884 10728 1360
194 1360 -11200 3728 7522 -9465 -4818 8047 -3064 -8689 6283 6188 -7286 -3081 4423 -5842
208 -5842 -8890 5784 6203 -2416 5639 10280 -3007 -5139 4089 -210 -6209 1743 4900 -3158 -3901
$$ packed form
118d5126j0902J38349k5870j15856M2928L8865q6030P994J17837m603p2287L9370
130B4669J9466r6688j2030Q6293j0216l9096N9086J9723p3298r482N3412j9991
142A848l9607M7405K7127n9140l931N6375k1811l2890M7507R126n9001K871L7491
155A3370k7347j5644N0538J2020m4321N428K6323l5422j6911M4883M721l0162
167a2524K0166J6118l4494q383K9886l781k0071J8145J3193k6564q258K2692o564
180d39j5741K0265R680k1721M16J6993r163j0981J6164Q537j7154p40J4612r368
194A360j2560J4928L794j6987M647J2865j1111n625J4972r5j3474M205P504j0265
208e842l048J4674M19q619Q055M641j3287k132R228m299n999P952L157q058p43
$$ plain form
223 -3901 2280 -1517 -6366 273 3641 -3419 -1737 4304 183 -3335 2414 3672 -1661 -128 4147
238 4147 967 -1746 2885 3348 -3039 -1675 1942 -3358 -4756 965 873 -2797 79 2435 -1374 -1789
254 -1789 2237 1451 -1561 1831 3636 -393 -852 2142 220 -2083 775 1607 -1364 -1044 914 -922
270 -922 -2781 -324 694 -1755 -980 1964 564 -1362 1165 1704 -573 549 1989 416 -691 954
286 954 850 -1687 -708 658 -875 -1888 205 -84 -1437 -258 986 -397 -940 1052 543 -543 586
303 586 1475 20 -431 1321 636 -605 55 664 -568 -778 460 -707 -1522 -293 269 -898 -395 1123
321 1123 565 -32 826 782 -267 -47 1086 223 -674 558 479 -409 -263 540 -428 -1194 211 -134 -974
340 -974 -631 265 -194 -406 917 329 -55 779 1085 309 -233 433 309 -308 -130 270 -964 -405 152 -331
$$ packed form
223c901O181l797m849O639L368p060J682O041m121l518N749J258n333J533M275
238D147l180k713M631M63o387J364L617n300j398N721r2l670K876K356l809m15
254a789M026p86l012L392J805m029m59K994j922k303K858Q32k971L20J958j836
270i22j859K457J018k449P75K944j400j926K527N39k277J122J440j573j107J645
286I54j04k537R79J366j533j013K093k89j353J179J244j383n43J992n09j086J129
303E86Q89j455m51J752o85j241O60O09j232k10J238j167q15J229N62j167N03J518
321A123n58n97Q58m4j049K20J133q63q97J232p9q88J46Q03r68p66J405l45q40
340i74L43Q96m59k12J323n88l84Q34L06p76n42O66j24o17J78M00j234N59N57m83
$$ plain form
360 -331 -796 -35 435 -435 -276 471 -87 -223 206 369 -682 120 843 -222 -22 385 451 -643 -21 342
380 342 -538 -731 145 -307 -983 417 605 -568 -180 651 60 -60 150 954 -270 -57 575 -270 -624
399 -624 362 -37 -676 -326 478 -857 -765 200 153 -653 163 574 -126 -213 580 518 -426 444 742 -139 -86 670
421 670 -5 -783 92 488 -766 -172 160 -358 -626 640 557 -559 -114 533 -326 -570 518 715 -256
440 -256 347 937 -215 -418 210 -44 -195 -77 558 -608 -531 234 -160 -895 427 737 -382 -311 805
459 805 79 -297 689 503 -504 206 398 -612 -609 321 303 -819 51 402 -484 -652 183 156 -374 226 433
480 433 -206 -284 411 169 -267 155 731 -183 -702 523 169 -756 334 610 -527 -150 385 -91 -896 275
500 275 511 -231 -36 666 -265 -662 789 179 -317 188 845 -216 -532 334 263 -512 -185 316 -303 -726
$$ packed form
360c31m65P61M70q70J59P47n58j36M29J63j051Q02P23j065K00M07O6j094O22L63
380C42q80j93Q76m52o76J400J88j173L88Q31n91j20K10Q04j224K13O32q45l54
399f24R86l99o39L50Q04j335R2R65m7q06Q16M11p00q7P93o2r44Q70K98q81N3P56
421F70o75p78Q75L96j254N94L32n18k68J266q3j116M45O47q59k44J088J97r71
440b56O03N90j152k03O28k54j51J18O35j166P7P65l94p35J322L10j119P1J116
459H05p26l76R86j86j007P10J92j010LR30j8j122Q70L51q86j68Q35k7n30O00K07
480D33o39p8O95k42m36M22N76r14n19J225l54r25J090K76j137L77N35m76q05J171
500B75K36p42J95P02r31l97J451o10m96N05O57j061l16Q66p1p75L27N01o19m23
$$ plain form
520 -726 172 281 -326 185 614 -226 -278 722 102 -215 339 269 -278 -336 326 -169 -330 198 363 -558 -179
541 -179 524 -218 -222 94 538 -388 -5 519 -180 63 180 333 -76 -107 363 -220 -433 165 31 -387 -51
562 -51 425 -124 -232 356 36 -378 29 100 -463 -393 263 72 -700 296 -24 -141 -53 341 -76 -431 293 161
584 161 -102 -180 238 -53 -455 390 -111 -64 -32 166 -178 -221 171 205 -185 181 276 28 -148 332 59 -301
606 -301 -49 -75 -113 1 125 -124 -195 -347 162 -111 -153 165 -516 -382 202 332 -149 -26 15 -184 -228 25
628 25 51 -377 251 118 28 267 65 232 -398 -204 63 -139 141 233 236 -30 356 16 81 265 236 89 -249
651 -249 284 -166 -2 -181 107 -499 8 -66 41 -6 -104 167 85 -21 158 59 -317 37 26 103 -24 -93 137
674 137 189 -167 21 -87 -63 84 -161 -102 158 53 -199 22 131 -10 -267 155 172 -116 232 -70 -9 -214
$$ packed form
520g26Q98J09o07N11M29q40n2J000o20l17N54p0n47n8O62m95j61N28J65r21L79
541a79P03p42mL16M44r26L83N24o99K43J17J53m09l1M70n83k13N98j34m18L36
562e1M76n49j08N88l20m14M07P1n63P0O56j91p72R96l20j17Q8L94m17l55P24j32
584A61k63p8M18k91m02Q45n01M7L2J98l44m3L92L4l90L66R5k48j76M80k73l60
606c01K52k6l8J14J24k49p1j52N09k73m2L18o81J34N84J30m81J23M1j99m4K53
628B5K6m28O28j33r0K39k02J67o30J94K67k02K80R2Lk66L86l40O5J84k9j47l38
651b49N33m50J64j79K88o06N07p4J07m7r8K71q2j06J79r9l76L54j1P7j27o9K30
674A37N2l56J88j08K4J47k45N9K60j05k52K21J09j41k57M22J7k88L48l02O1k05
$$ plain form
696 -214 -86 260 -152 8 191 -140 233 96 -126 -109 -235 -66 -150 212 72 89 -254 -172 -99 -112 -90 114 101
719 101 -357 -56 -4 -183 -170 -63 -176 277 -49 39 -7 103 -139 212 -196 71 54 -495 -154 -41 -42 13 -4
742 -4 33 55 -73 18 84 11 262 -4 136 -1 -238 299 22 208 2 -43 58 -103 -39 230 63 -34 -100 -118
766 -118 -183 -168 6 -131 -71 -3 238 178 -160 -75 -20 -51 -79 -24 -3 -252 1 207 9 13 30 -271 118 148 -34
791 -34 -25 94 -179 -18 20 172 65 -85 -16 256 -178 65 17 -34 34 122 137 -241 -190 12 -94 -70 -74 82 250
816 250 83 -39 10 -163 151 -153 -121 -170 64 -139 -301 -117 -62 88 -39 258 -29 -118 -35 -31 -37 84 21 86
840 86 109 98 -98 189 53 183 -200 87 -112 66 31 -15 236 245 175 -203 98 91 -3 143 -216 237 -48 -180
864 -180 341 -88 297 -90 -98 -94 281 430 -137 62 264 -6 -16 124 -161 -26 -79 -98 70 57 -54 146 71
$$ packed form
696b14J28L46m12J60J83l31L73j37k22J7j26J69q4L62j40J7l43Q2P3j3K2K04j3
719A01m58L01N2j79J3J07j13M53l26Q8m6J10k42L51m08K67j7n49L41J13jN5j7
742dL7K2j28R1O6p3K51k66J40j37k37N37k77J86k06m5J01j61O4K69j67r7o6j8
766a18o5J5J74j37O0O8K41o0l38Q5N5l1k8N5K1k49K53K06j98MJ7l01L89L0j82
791c4RJ19k73J61L8J52j07j50O9K72m34K43m8n1O8Q8J5l78N1K02j06K4mJ56J68
816B50j67j22M9j73L14l04L2m9K34k03j62J84N5J50j27K97k87q9Q3MoJ21o3O5
840H6K3j1j96K87j36J30l83K87j99J78l5m6K51Rp0l78L01pr4J46l59M53k85j32
864a80N21m29L85l87qML75J49n67J99K02k70j0J40k85J35n3j9J68j3j11K00p5
$$ plain form
887 71 104 -237 177 300 84 181 -52 -236 -10 83 -63 123 -32 250 4 -146 -166 -15 105 335 102 11
909 11 -39 -322 68 23 74 -92 126 117 220 -22 -68 262 145 37 205 -52 -122 -68 279 38 188 109 72 -41
933 -41 144 228 -193 90 13 -16 -87 62 240 -85 124 62 115 -92 -48 -265 -56 106 -58 -26 44 27 -117 135
957 135 73 212 -30 42 63 119 62 162 245 46 -191 -12 -67 71 96 -52 262 -78 47 38 -98 88 -92 76
981 76 33 26 26 73 33 55 -33 122 -43 157 -190 -60 108 -243 147 -79 -47 142 -91 409 -54 201 -122 -13
1005 -13 -58 2 -16 90 179 207 46 28 192 -71 -255 336 215 -44 41 20 -163 -32 134 -249 -34 0 124
1028 124 152 -11 -201 117 229 84 -32 144 44 202 134 151 -38 101 38 -30 50 331 69 174 -130 -323
1050 -323 120 -84 -106 75 71 149 228 -190 -114 217 114 -2 -22 22 119 88 -171 -57 -257 -182 -71 -182 -119 -102
$$ packed form
887G1L3l41M14J23k16R7k33j84K26R3j46J86j55K82k46j50k0J51J20K30k33r1
909A1n0k83L90m5N1j66K18rJ03k42m6L30j17j08J68k57p0N4L47k41J50p9l7j13
933d1J85Q4m21K83p7k9p1J49J78l25K09o2N3k07M4k17K09J62j64L2P0j7j44K52
957A35o2J39k42P2K1N6n7J00Q3j99k37J79n5J38K5j48L14l40J25rj36J86j80J68
981G6m3p%M7m0K2q8J55j65K00l47J30J68l51L90k26L2J89k33N00m63K55l23J09
1005a3m5O0j8J06Q9K8j61j8J64k63j84N91j21k59Q5k1j83J31J66l83K15L4J24
1028A24K8j63j90L18J12j45j16J76j00J58o8J7j89J39o3o8Q0K81k62J05l04j93
1050c23M43k04k2J81mP8P9m18P6L31j03j16k0M4R7l1k59J14k00P5J11j11O3J7
$$ plain form
1074 -102 133 45 -122 118 -57 11 387 -165 -11 -150 178 245 5 -183 -100 255 -53 25 164 73 -140 126
1096 126 26 -140 51 -6 -169 -89 -114 -8 16 -184 182 -101 33 -109 -77 63 70 55 31 -4 295 -261 171
1119 171 60 151 124 123 16 -80 -229 263 79 -59 80 -161 -95 63 -126 202 -354 335 132 190 -79 88
1141 88 108 -86 111 -109 94 6 44 65 36 -163 -74 92 91 47 -201 -239 -24 2 240 19 161 75 32 103 69
1166 69 -14 31 -32 195 -10 -270 -75 -59 20 -45 -159 -75 46 -188 106 51 -2 108 172 -44 93 60 192 66
1190 66 -95 -274 288 63 180 -146 133 154 128 99 62 139 -142 -106 27 -140 -65 78 -221 148 -178 -19 220
1213 220 -25 84 168 -24 49 136 98 205 -83 7 -299 -39 247 -10 58 111 -121 -113 -87 -241 13 138 -75
1236 -75 71 2 -1 5 -81 5 140 52 -1 146 43 -94 -43 -24 -47 -93 2 2 -162 40 127 109 -1 235 -30 126
$$ packed form
1074a02K35q8j67K40j75O8L76n52J54j39L28O7k40j88Q3L55l08P8J39r1k13K66
1096A26j00j66J91n7j63Q0k5J06K4k00L66k83J34j42L2J40Pj5k4l5K99n56M32
1119A71j11R1k7jj07r6j49M92j84j38J39k41O6J58j89L28n56O89k03N8k69J67
1141H8K0j94J97k20K03q8L8K1k9j99Q9J66jm4k48l8K15K6K38k21J42q6m3P1l4
1166F9q3M5o3K27k05k60J95J6P9o5j14Q4J21k34K94n5n3J10O4k16J37l3J32j26
1190F6j61j79N62k25J17l26K79K1k6k9l7P7k81L6J33j67P5J43k99L69l26J59K39
1213B20k45J09Q4j92P3Q7l8J07k88R0l06K60K86k57O8N3k32QK6j54K54J25k13
1236g5J46o9lOq6Q6J35q8n3J47j03j37N1J9k3m6R5%j64K02Q7j8j10K36k65J56
$$ plain form
1262 126 -228 21 225 -176 -84 83 -178 218 -30 5 212 -159 30 56 -180 -142 -323 163 91 -12 21 -205
1284 -205 -107 -146 -98 -145 201 486 -38 40 -43 -47 124 152 81 -35 58 13 -32 111 129 122 -56 -130 -132 -82 90 142 -31
1311 -31 -4 -176 128 172 -8 120 -107 105 -41 4 225 33 -234 18 -39 -87 99 -135 15 79 -382 82
1333 82 -13 -21 136 253 18 20 -30 -42 156 51 -37 25 -166 -6 -118 -92 -35 -160 -133 113 75 99 136 146 151 -32
1359 -32 1 -211 -40 335 211 -93 -64 -240 153 187 111 -151 -151 282 8 10 -57 42 -102 -187 193 276 -66 42
1383 42 63 149 229 -16 44 -144 -17 266 100 22 -92 87 -6 115 -172 92 -32 -76 189 182 -57 32 -86 -286
1407 -286 -4 -21 356 -254 265 36 -123 326 -4 102 227 139 54 154 -92 -36 -228 161 -57 -98 -159 -71
1429 -71 -65 44 -137 -12 -88 -154 -26 -138 35 116 -79 45 322 75 -306 66 -42 200 -52 86 -11 20 -377
$$ packed form
1262A26l54K49K04m01R2J67k61L96k48L5K07l71J89K6k36L8j81M86p2j03L3k26
1284b05R8l9M8m7L46K85n24P8q3mJ71K8p1j16R3m5m5J43J8pj78p4kN0J72N2j73
1311c1K7j72L04M4j80J28k27K12j46M5K21j92k67K52n7m8J86k34J50O4m61M64
1333H2r5qJ57J17k35Kn0j2J98j05q8O2j91J60j12K6N7j25K7K46l8K4L7J0Nj83
1359c2L3k12J71L75j24l04K9j76L93L4p6k62%M33k74Ko7R9j44q5L80Q3l42J08
1383D2K1Q6Q0k45O0j88J27K83j66p8j14J79r3J21k87K64j24m4K65pk39Q9j18k00
1407b86K82j7L77o10N19k29j59M49l30J06J25q8q5J00k46N6j92L89k18m1o1Q8
1429g1OJ09j81J25p6o6J28j12J73Q1j95J24K77k47l81L72j08K42k52J38r7L1l97
$$ plain form
1452 -377 -65 -159 -25 188 151 -6 193 -132 -280 76 297 -230 8 59 -232 261 277 -54 134 125 94 -14
1474 -14 -230 -151 -62 84 -147 37 14 186 39 53 226 311 -21 10 -131 260 60 -17 204 91 165 80 100 120
1498 120 -21 -162 -75 152 360 -88 -129 -127 55 100 -69 210 134 16 16 -184 -76 193 -165 88 98 -45 -93
1521 -93 180 -45 -57 108 -187 78 -94 -2 -73 2 225 24 67 57 77 -48 119 50 57 62 -118 143 118 -4 136
1546 136 -93 3 -22 -129 -332 -185 -62 153 -42 108 -96 133 207 -178 64 45 171 96 23 -118 -89 -8 73
1569 73 -140 -176 48 -161 220 107 93 -96 18 38 17 108 -228 -159 -338 -215 105 -245 91 98 -113 144 -70
1592 -70 -173 3 -260 154 -167 33 -56 -192 106 -2 33 30 24 30 -32 -449 180 -72 -26 -45 -174 22 -126 -78
1616 -78 2 -44 -146 -90 11 -182 -79 -26 -79 13 -13 -136 290 -14 -172 207 -112 179 -53 34 -106 19 -116
$$ packed form
1452c77L12r4J34K13l7j57J99l25j48L56K21n27K38N1k91M93J6l31J88rl1j08
1474a4k16P9Q9J46k31J84k3J72j47J4J73Q5l32L1j41L91k00p7K21j13P4q5K0K0
1498A20j41j41Q7K27K08m48m1KJ82M5j69K79p6j18%k00J08K69l58K53J0j43m8
1521i3K73k25j2J65k95K65j72R2p1P5K23k01M3j0K0j25J67o9PNj80K61k5j22J40
1546A36k29R6k5j07k03J47J23K15j95J50k04K29P4l85K42j9J26p5p3j41K9Q1Q1
1569G3k13l6K24k09L81j13j4j89J14K0k1R1l36O9j79J23L20l50L36Pk11K57k14
1592g0j03J76k63M14l21K00q9j36K98j08L5loOo2m17O29k52M6j9j29J96j48M8
1616g8Q0m6j02N6J01j93J03N3n3R2k6j23M26l04j58L79l19K91k32Q7j40J25j35
$$ plain form
1639 -116 43 -100 32 -178 -84 -23 124 150 -78 -205 -178 -188 153 -123 81 190 0 105 -11 -246 -57 -1
1661 -1 36 -203 -56 -61 46 -63 34 -257 -75 147 9 -73 -198 93 -1 -144 8 36 -22 -9 -64 -216 9 -103
1685 -103 -166 100 -187 103 90 5 37 19 -32 164 -26 174 65 -104 19 -170 -82 86 82 -247 -14 -436 -221
1708 -221 155 -119 -54 -46 64 -150 -279 129 -56 -12 202 145 -185 56 -22 -94 -58 105 278 249 -36 100 -12
1731 -12 58 -46 -106 283 174 -36 -229 137 -118 -6 74 -88 -23 -68 -65 -339 -11 175 78 -141 178 -149 113
1754 113 63 -45 138 -114 -357 -190 326 -143 -164 -176 46 -13 -58 -69 38 85 327 133 129 -109 263 -112 -192
1777 -192 -3 -97 152 -336 57 -51 -84 32 21 -204 230 48 -120 314 130 120 -84 -138 -184 -51 193 7
1799 7 -197 160 -58 301 -34 2 -29 -114 -286 -235 34 -36 -208 -27 94 243 11 190 97 73 0 -120 -70 -25
$$ packed form
1639a16J59j43J32k10R4O1J47K6k28j27K7j0L41k76K04J09j90J05j16k35J89N6
1661aL7k39J47nJ07j09R7k91J82K22j38q2j25K91r4j43J52K8n8J3n5j52K25j12
1685a03o3K66k87K90j3q5L2j8n1J96j90K00j09j69J23j89Q8J68ml29K33m22K15
1708b21L76k74O5QJ10k14j29M08j85M4K14n7l30K41p8p2L6J63J73k9k85J36j12
1731a2P0j04o0L89j09k10j93L66k55J12Q0j62O5m5Lk74L28J86r7k19L19l27K62
1754A13n0j08J83k52k43J67N16m69k1j2K22n9m5j1J07M7K42j94mk38L72l75q0
1777a92J89r4K49m88L93j08l3J16j1k25M34j82j68M34j84j0k04n4m6J33K44j86
1799Gk04L57k18L59l35L6l1q5j72N1K69p0j72J81J21J49k32J79r3k4p3j20N0M5
$$ plain form
1823 -25 -17 68 -171 65 226 -141 17 -211 -84 35 50 -128 -205 -96 -22 23 71 -109 -12 9 39 300 36 30 43
1848 43 28 -211 13 103 35 -240 35 -33 34 52 153 205 -44 -63 23 144 -195 -61 53 62 -68 121 160 70 11
1873 11 -107 -138 145 109 -430 13 422 88 -73 59 -6 182 -159 84 -34 -10 -132 61 123 -317 143 -159
1895 -159 -20 3 109 34 310 213 139 -48 -136 -31 -213 13 -17 46 -238 -153 -84 83 -76 37 -231 -386 -122
1918 -122 69 114 84 82 -4 161 230 -21 -17 -15 -45 9 -26 132 -12 -222 -11 -103 -244 70 112 -77 -61 -35 -76 -47
1944 -47 -62 11 -101 319 -103 -224 251 -71 -163 15 201 193 2 340 112 -72 93 19 63 -186 -20 105 -100
1967 -100 -7 -249 -137 -90 -97 222 240 52 44 66 -81 -11 -100 8 66 -127 11 74 12 -159 -181 343 83 -78 157
1992 157 301 -242 340 91 51 120 104 -78 -73 241 -15 -27 97 -45 -17 -65 165 204 83 -47 -35 -43 -188 -218
$$ packed form
1823b5QQ5k39K36J61l67J58k28J27J19J5j78p7J09P4M5M8j80R7K1L0K61k64oJ3
1848D3j5k39K24R0o8k75K75o8O7J8J01N2k49j9Q6J21l39J34J14Rj30J89L9r0n9
1873A1j18l1K83l6n39M43M09l34j61J32o5J88l41K43j18K4j22J93O2m40M60l02
1895a59J39K3J06p5K76r7p4j87q8J05j82K26l0O3k84Q5O9J67j59J13k68j55K64
1918a22J91M5l0kq6J65O9k51MKl0N4l5J58j44k10K11r2j41L14M2j89J6K6m1K9
1944d7j5P3j12M20m22j21M75l22r2J78J86qj91L38k28j84J65p4M4k49J66J25k05
1967a00R3k42J12M7pL19J8j88qK2j47P0q9J08N8j93J38O3o2j71k2N24k60j61K35
1992A57J44n43N82k49m0O9j6j82NL14k56j2J24j42K8m8K30L9j21j30J2qj45l0
$$ plain form
2016 -218 4 -294 40 51 -139 -93 -167 32 -163 -196 -162 1 134 -31 64 -233 -102 -295 -57 7 63 188 -425
2039 -425 -131 -110 -102 -71 -176 361 -320 148 -2 -252 -138 36 -102 -318 -236 -76 -187 98 83 -113 149 -45
2061 -45 -12 112 -35 -77 140 -12 472 66 -4 48 111 30 199 -139 -22 96 -25 -4 -273 -75 71 -81 -76
2084 -76 223 -41 283 177 240 102 31 -184 -6 -142 12 109 -91 236 222 -191 -174 -62 201 -65 -46 -21 117
2107 117 -219 44 49 -306 17 -41 -15 -57 54 191 7 28 -277 -48 -85 56 -108 102 12 91 178 41 -94
2130 -94 -38 31 21 -108 15 214 -155 144 -114 -62 22 -95 -114 58 -111 76 -5 93 -136 -42 96 -379 -17
2153 -17 -89 118 80 -150 -22 43 -2 -133 153 -55 -89 49 -23 -14 -392 96 142 -52 55 71 102 -87 304 -198
2177 -198 110 151 -84 -13 -296 131 287 58 12 118 -12 -39 46 18 -287 126 151 -38 78 14 -59 -73 -75 -102
$$ packed form
2016b18K22k98L34J1j90M6p4J99j95l3L4J63J33j65R5k97J31j93K38O4N6J25o13
2039d25K94K1QL1j05N37o81M68j50k50J14J74j38k16Q2J60j11K85j5j96K62j94
2061d5L3J24j47m2K17j52M84m06p0N2O3q1J69l38J17J18j21K1k69J98J46j52N
2084g6K99k64L24j06O3j38p1k15J78j36J54R7k00L27j4m13J7J12K63k66J9K5J38
2107A17l36K63Nl55L23n8K6m2J11J37j84K1l05K29l7J41j64K10r0P9Q7j37j35
2130i4N6O9j0j29J23J99l69K99k58N2Q4j17j9J72j69J87q1R8k29R4J38m75L62
2153a7p2K07l8k30J28O5m5j31K86k08l4J38p2Rl78M88M6j94J07J6L1j89L91n02
2177a98L08M1k35P1k83M27J56k29m6J06j30k7Q5k8l05M13K5j89J16o4p3j4kk7
$$ plain form
2201 -102 118 78 -19 82 -124 78 -191 -276 -276 -14 20 -151 278 -111 -79 -161 150 -168 189 -85 -257 -125 -241
2224 -241 65 124 -167 116 100 3 -30 75 -129 123 152 -231 23 -76 18 -25 104 7 -82 26 2 12 -36 37 10
2249 10 115 120 181 -152 -233 -103 -79 202 21 -153 147 20 54 248 137 -237 50 -114 93 314 147 179 54
2272 54 111 231 87 100 -113 46 107 102 -13 235 31 -154 229 263 57 59 76 -71 53 -52 277 -44 151
2295 151 -94 203 -139 -24 -53 -111 120 166 104 258 -163 59 111 -122 44 28 -72 32 -122 125 242 56
2317 56 -78 -207 -198 -3 -182 167 29 91 24 -234 -77 96 51 95 -331 125 103 3 30 53 187 79 -201
2340 -201 -38 83 11 -53 -151 66 40 -102 69 -71 111 -284 -83 136 120 35 227 4 340 61 -52 -136
2362 -136 -119 72 298 -202 -183 -82 18 -75 2 -10 -129 -251 -226 -47 0 294 311 159 99 -129 -49 -140 77 391
$$ packed form
2201a02K20m0r7J01k06K02k69q5%K62L4j71M29l89L2q2L11l18L57k74j72J32j16
2224b41L06N9k91K83j6r7l3J05k04K52K9l83K54r9R4m3J29r7q9J08k4J0m8P3k7
2249A0J05NO1l33q1J30K4K81j81j74L00j27L4J94j11l74K87j64K07K21j67L2j25
2272E4N7J20j44J3k13J59O1nj15K48k04j85L83L4k06KJ7j47J24j05L29l21J95
2295A51k45K97l42J15k9n8K31M6o2J54m21K22N2k33J66j6j00J04j54K47J17j86
2317E6j34j29RJ95j79L49j38O2o7k58J57J73m5M4m26M56k2j00K7K3J34j08k80
2340b01J63J21p2o4r8K17k6j42J71j40J82l95K01K19j6q5J92k23L36k79j13q4
2362a36J7J91K26n00J9J01J00r3P7j2j19j22K5J79M7K94J7j52o0k28Q0r1K17L14
$$ plain form
2386 391 -168 -95 -42 280 -205 -9 -20 5 59 48 130 -130 -75 -12 129 115 -142 -87 73 6 55 -29 -125 -167 -49
2411 -49 -38 114 115 17 -142 114 74 -16 233 -9 45 312 119 -33 -88 -108 -95 87 232 -36 215 -5 53 -27
2435 -27 250 72 57 29 -32 -101 -78 -76 101 -97 -136 -210 -68 -97 -283 -20 -151 110 11 -41 -150 -13 51 -176 40
2460 40 -53 -86 -69 240 -77 23 7 -143 -64 -45 -2 86 -83 28 -59 63 38 -57 -40 98 9 223 52 92 -80
2485 -80 188 -165 -108 -56 -189 56 -86 168 97 47 -147 56 -38 -75 -113 -207 -9 -278 -200 69 -74 -65 3 -18 -3
2510 -3 154 -106 58 17 -12 -92 -230 -108 101 170 -167 -149 -62 7 -93 -66 3 -114 11 175 -78 57 -26 -305
2534 -305 16 -56 -177 5 -82 39 56 191 -5 77 -31 -334 68 -18 193 12 15 -172 -319 245 -9 141
2556 141 208 149 107 -56 130 66 203 -40 182 -1 82 -9 195 -60 18 50 -240 -7 -3 -15 51 245 0 206
$$ packed form
2386C91n59P3N3L22m85J96j1K5N4j1Q2k60N5O3J41j4k57N5J60o7M9q4r6m2J18
2411d9J1J52Jr8j59K56m0r0K49k42N4K67j93j52n5k0J3J82J45k68K51k20N8q0
2435b7K77j78j5k8o1o9K3KJ77j98l9p4J42k9j86K63j31K61r9n2j09J37O4k27K16
2460D0r3l3J7L09l17J00j6j50P9J9M3Q8j69J11q7J22k5r5J7J38q9K14j71M0j72
2485h0K68l53N7N2j33K45j42K54p1n0j94K03r4l7l8r4J98k69P8K69j43RO8k1J5
2510cJ57k60J64m1k9q0j38J22K09O9l37J8Q7O9j00K7O9j17J25J64k53J35q3k79
2534c05L21p2j21J82q7J21J7J35j96Q2j08l03M02q6K11j81Lj87j47N64k54J50
2556A41O7n9m2j63J86o4J37k43K22j83Q3r1K04k55P8L2k90K33Mj2O6J94k45K06
$$ plain form
2580 206 -4 168 -48 -216 137 -45 -240 -10 154 122 -123 -212 205 -170 -34 -71 -54 257 -39 -109 51 18
2602 18 -1 81 -311 2 13 175 176 -86 157 -187 91 240 86 -104 78 -121 103 -16 -69 12 184 -329 -215
2625 -215 -19 -183 95 -146 -89 37 156 -28 -135 42 -5 -61 74 -308 6 173 -68 129 127 -215 -5 -154
2647 -154 141 -170 54 -13 23 351 -47 -94 38 51 105 -52 38 -35 -207 102 -10 28 -68 73 -29 -22 197 -85
2671 -85 169 169 322 -59 100 212 -137 -72 31 155 -227 -41 82 -16 -34 105 14 141 -75 205 87 84 178
2694 178 -248 -53 -72 63 -2 5 -16 -147 -116 170 158 -20 153 24 -77 -70 197 -90 18 330 -214 189 -129
2717 -129 -100 -258 100 -83 59 -92 171 -146 27 301 -241 -24 3 7 -170 -75 -122 56 -101 -33 -122 -41 61
2740 61 -387 -31 108 171 63 -81 331 -108 -374 153 157 275 100 -159 176 -131 -310 232 -79 218 -119
$$ packed form
2580B06k10J72k16j68L53j82j95K30J64l2k45q9M17l75J36l7J7L11k96p0J60l3
2602A8j9Q2l92L13J1J62Jk62K43l44K78J49j54j90J82j99K24j19n3Q1J72n13J14
2625b15J96j64K78k41N7J26J19j84j07J77m7n6J35l82L14J67k41J97kl42K10j49
2647a54K95l11K24o7L6L28l98m7J32J3N4j57R0p3j72L09j12L8r6J41j02PK19k82
2671h5K54%J53l81J59J12l49O5J03J24l82J86J23r8j8J39r1J27k16K80j18lR4
2694A78m26J95j9J35o5Pk1j31L1K86j2j78J73j29j01PK67k87J08L12n44M03l18
2717a29K9j58L58j83J42j51K63l17J73K74n42K17K7Mj77R5m7J78j57O8q9Q1J02
2740F1m48L56J39O3j08j44M12m39k66N27MJ18j75k59L35l07j79N42l11K97l37
$$ plain form
2761 -119 -29 17 -80 -5 -182 -88 -157 -17 -133 211 -97 -72 -117 -232 144 -80 125 -131 28 -437 93 178 213
2784 213 -12 -23 263 -304 -105 -134 -76 12 85 70 -4 -25 -58 -156 -33 31 244 176 12 -174 15 -103 202 15
2808 15 208 -69 -232 -147 114 15 -17 -33 87 -105 -5 -132 127 -163 38 257 -68 124 176 -28 210 -67
2830 -67 -125 -94 -155 -77 -60 -31 -46 -197 -58 81 52 131 -240 -93 -179 -3 -260 229 213 -32 -106 277 202 -158 -54
2855 -54 -152 333 288 62 232 185 -190 339 48 -189 -75 205 130 126 -24 -252 85 -59 -120 330 -157 173 -73
2878 -73 -2 -93 95 -169 54 170 -21 392 -170 37 -54 84 27 60 -47 355 333 -156 16 -123 29 -155
2900 -155 128 -131 47 -180 121 27 11 87 65 201 55 27 92 58 26 228 211 140 -4 -134 159 -111 264
2923 264 327 -93 144 92 -181 43 -95 91 -432 58 327 23 114 -145 -389 -100 198 205 -15 -437 -280 71
$$ packed form
2761a19R0M6r7P5j77R4o9J40j16L44l08K5m5j15L76k24K05k56J59m65N30Q5L5
2784B13k25j1K86n67J99k9N8Q8P3j5p4k1l3r8J23O4K13o8j64j86J89j18L05j87
2808A5J93k77j63Q5K61r9l2j6J20j92J00j27K59k90K01K19l25J92N2k04K38k77
2830f7n8L1o1P8J7K9j5j51J39J39k9P9l71J47q6J76k57M89j6k45p4L83p5l60J04
2855e4r8M85m5k26J70m7l75N29k91k37J14K80p5mj50k28L37j44o1M50m87L30k46
2878g3P1r1J88k64K23J16j91M13n62K07r1J38n7L3j07M02k2m89J72j39J52j84
2900a55K83k59J78k27L01r4j6P6k2J36j46k8O5l4l2K02j7p1j44j30K93k70L75
2923B64O3m20K37n2k73K24j38J86n23M90K69l04R1k59k44K89K98Pk20m22J57L51
$$ plain form
2945 71 326 -51 -126 -66 89 72 158 -68 151 -205 -65 -101 -217 -29 -184 -21 188 -134 -67 -227 82 242
2967 242 -49 157 289 67 121 -75 155 -32 -20 -57 -89 -411 -27 -95 -111 -62 11 -144 -87 -34 6 -31 22 15 -200
2992 -200 -62 -264 -84 -86 -94 -13 -271 -36 99 140 131 89 -81 287 -4 -123 229 13 -130 53 -86 7 36 -2
3016 -2 68 62 -136 -236 280 -226 -80 -11 260 -158 28 -85 70 -48 2 4 160 39 -108 -134 79 -181 65
3039 65 -20 -202 62 -15 -282 67 70 -8 88 91 66 194 286 -441 -69 24 106 55 198 -174 48 143 57 256 -29
3064 -29 108 33 143 359 -202 -219 -51 -39 -17 44 -29 119 -31 -130 51 -91 35 79 8 211 228 75 94 88 -132
3089 -132 167 103 298 -321 17 174 7 16 -69 41 190 64 -92 94 61 44 29 192 -223 104 63 -62 -79
3112 -79 387 101 125 134 204 34 123 -168 170 -359 -65 252 -85 -73 -118 279 84 251 -235 154 -116 9 -307
$$ packed form
2945G1K55l77p5O0J55j7Q6k26K19l56J40l6j16J88j55J63K09l22O7j60L09J60
2967B42k91K06J32k22N4j96K30j87J2l7l2l22L84o8j6M9P3j55N7N3M0l7N3pk15
2992b00J38k02J80kqQ1k58K35J35M1rm2j70L68k91j19L52k16j43J83j39R3K9l8
3016bP0oj98j00N16n06J46O9K71m18J86j13J55j18N0KJ56j21j47k6K13k60K46
3039F5q5j82K64p7k67L49Lp8R6Lk5J28R2p27L72R3Q2n1J43l72K22R5q6J99k85
3064b9J37p5J10K16n61j7J68J2K2O1p3J48j50r9J81j42J26M4p1K03J7j53J9ok20
3089a32K99o4J95o19L38J57j67Rq5J10J49j26j56J86l3j7j5J63m15L27m1j25j7
3112g9M66k86K4RP0j70Q9k91L38n29K94L17l37J2m5L97j95J67m86L89k70J25l16
$$ plain form
3135 -307 211 283 -10 147 -25 259 83 -246 46 -16 -224 -51 131 302 -176 -16 76 37 0 48 346 31
3157 31 -78 49 73 -58 124 2 -48 125 -202 -267 108 47 -34 -70 9 112 -367 -238 70 -1 -102 300 47
3180 47 48 -27 -222 7 -17 -202 54 17 56 -127 253 -233 -230 -289 -112 17 92 21 -181 -339 -123 -33 -163 6
3204 6 -252 -21 -80 -99 23 -173 72 220 -9 74 82 -100 94 347 -70 -454 51 25 -75 112 -15 -111 -87
3227 -87 113 -89 340 69 -98 -180 -211 89 -31 95 135 6 195 -25 4 0 -68 250 -64 261 -256 -97 165
3250 165 9 -38 8 23 167 210 148 -20 32 60 -12 -189 -110 107 -174 -112 33 -112 37 136 8 149 98 -78
3274 -78 131 32 -109 -414 21 -193 106 -142 154 -141 70 9 -19 70 30 -9 -105 69 133 19 -88 5 -20 -215
3298 -215 72 102 -187 36 273 132 -12 -226 56 165 122 77 -224 -55 -368 -58 -432 -274 -239 -59 -126 -44
$$ packed form
3135c07N18P2k93J57j72K84j76l29K92o2k08J73J82J71m78J60R2l9l7M8K98l15
3157C1j09J27K4j31J82j22n0J73l27o5L75o1q1l6P9J03m79J29L08p1j01M02k53
3180D7Jp5j95K29k4j85K56l7L9j83L80m86Ln9J77J29P5p1k02j58K16R0j30J69
3204Fk58K31n9j9J22j96K45J48k29Q3Qj82J94K53m17l84N05k6j00J87j27r6K4
3227h7K00k02M29k71j67q2l1L00j20J26M0j29J89k20K9mo8L18l14L25n17J59K62
3250A65j56m7M6J5J44M3o2j68N2K8p2j77P9K17k81O2J45j45J49R9j28J41n1j76
3274g8K09r9j41l05M35k14K99k48K96k95K11o1k8Q9m0l9r6J74O4j14j07R3k5j95
3298b15K87L0k89K23K37j41j44k14K82J09m3m5l01J69l13L10l74J58L5J80o7Q2
$$ plain form
3320 -44 -132 -111 71 -8 227 -275 202 -80 12 -279 69 -260 71 -372 81 86 102 25 161 328 186 221 -90
3343 -90 85 -40 -75 178 -20 -79 152 71 -54 38 183 -24 83 255 -107 -37 -46 195 -279 108 -102 5 9
3366 9 -421 59 43 -75 -98 30 -53 111 167 206 -59 -102 -102 35 44 -130 240 -95 -44 -78 -172 70 261 -15 -55
3391 -55 -216 44 -68 -167 62 80 -111 151 -159 80 35 -87 148 58 -45 53 -9 136 253 -192 377 171
3413 171 89 -95 8 -15 -31 106 76 -144 16 -55 -237 -80 135 153 82 -82 36 69 101 -7 95 -270 102
3436 102 152 231 328 -365 94 246 -244 81 -56 5 145 -230 -56 90 218 -60 256 -7 -17 99 -4 -67
3458 -67 58 -60 -4 331 58 -41 -253 12 -218 -203 173 -217 89 41 -35 14 -37 69 -219 86 -84 -193 37
3481 37 -176 3 90 38 350 181 146 78 224 -173 78 148 -108 -46 -203 73 -37 307 61 85 -204 16 -184
$$ packed form
3320d4q8K1J82p9K35n02M77k82R2k91L48l29L31m43M53NJ6p7J36J67j42L5l11
3343i0J75j25l5K53j98n9K31q1j25R2J45k07J07J72l62P0rK41m74L87k10J07M
3366Im30M80j6j18k3J28q3J64N6L9k65m3%J37Rj74L70l35N1l4r4K42J91k76m0
3391e5j61K60j12r9K29J8j91K62l10K39m5j22K35r0j03R8o2J45J17m45N69k06
3413A71q2j84J03k3j6J37l0k20J60p1j82J57K15J8p1j64J18L3L2j08J02l65L72
3436A02N0P9R7o93M59J52m90L25j37O1J40l75J74J46J28k78L16k63j0J16j03o3
3458f7J25j18N6L35k73r9k12K65k30J5L76l90L06m8p6M9n1J06k88L05j70j09K30
3481C7k13J79Q7n2L12j69l5o8J46l97K51P0k56O2j57K76j10L44k46K4k89K20k00
$$ plain form
3504 -184 -187 -105 157 77 163 47 7 52 194 8 -97 109 122 -70 197 -206 104 110 134 -5 117 79 -67 -22
3528 -22 -27 144 115 241 55 162 163 -218 237 -50 191 -285 168 248 -65 17 -45 -237 -199 -116 -138 -6 204 -256
3552 -256 176 21 240 -128 -189 -19 -36 93 299 -8 -30 153 115 -147 229 109 162 151 -30 -151 -52 -59 25
3575 25 66 22 240 -104 -83 -49 12 -72 -59 -129 -23 62 -24 -160 36 139 156 21 -58 239 -136 -103 37 203 98
3600 98 -110 49 179 54 121 -286 -74 -342 259 -172 -50 -38 208 -101 148 -13 -15 210 -22 -67 -70 -62 152
3623 152 -104 92 206 222 -94 132 108 130 107 -141 0 16 -88 -40 31 41 16 64 201 -64 -190 241 363
3646 363 -134 -122 42 208 98 402 134 -4 -126 -121 214 -121 9 44 242 32 155 -167 -213 -77 99 140
3668 140 191 224 40 -54 -40 282 -157 102 -14 8 0 25 276 25 227 -40 -125 -142 240 -4 20 -86 -115 -213
$$ packed form
3504a84lQ2K62q0Q6j16m0M5J42j86j05K06J3j92K67m03L10OK4j39J22l8j46M5
3528b2nJ71k9J26j86J07Jl81M55k87K41m76M53Q0l13Q2o2j92L8Q3k2J32K10m60
3552b56M32j55K19l68o1J70j7J29K06l07k2J83l8k62L76j20N3j1j81j21R9pQ4
3575B5M1m4K18l44K1L4O1q4J3p0J06Q5q6j36J96J03J7j35p9K97l75L3J40J66j05
3600I8k08J59J30j25O7m07K12k68O01m31J22J2K46l09K49j61kK25k32m5lQK14
3623A52k56J96J14J6l16K26k4K2k3k48J41J6j04M8P1J0k5M8J37k65j26M31J22
3646C63m97J2J64J66j10L04k68j38j22NL35l35J30L5J98k10J23l22m6J36J76M1
3668A40N1L3j84r4J4L22m39K59j16K2qK5K51k51K02k67q5j7L82k44K4j06k9r8
$$ plain form
3692 -213 -46 99 -263 235 269 115 48 -72 2 155 -102 -50 257 24 -39 -263 -140 134 -106 117 -70 -100
3714 -100 28 49 -272 144 -65 60 36 7 87 137 -16 34 224 -35 -48 -118 -497 -49 -84 189 103 34 -33 39
3738 39 -98 -163 -1 -277 -12 -60 61 16 -17 50 132 304 32 -131 -47 -73 -111 114 5 246 -103 124 217 43
3762 43 63 -62 -114 9 -35 -238 -175 109 249 196 122 -152 58 -85 94 183 -139 -303 -7 136 -111 -147 -80
3785 -80 150 -249 -131 -221 -92 365 14 33 -18 -82 -107 63 71 -29 23 -162 -92 -77 -222 111 60 -9 -476 -259
3809 -259 -188 -76 -98 1 -195 -112 -106 222 162 -14 76 230 -40 -128 -120 8 87 -55 39 -185 -24 -41 -272 -21 71
3834 71 228 115 -24 -147 4 66 -91 -52 -144 -29 87 208 -105 32 -38 55 11 75 -82 -84 -383 -184 31
3857 31 -193 47 18 118 156 38 22 82 -147 1 -40 82 -41 -40 -96 222 63 20 58 81 37 -55 -172 104 117
$$ packed form
3692b13J67J45l62M98L4j54o7j20P4J53k57N2L07k33o3k24J23K74k40K23j87l0
3714a00J28K1l21M16k09J25k4k9Q0N0j53N0J90k59j3p0l79M48l5K73q6o9o7P2
3738C9j37o5J62k76K65m8J21m5l3O7Q2J72k72j63Q4k6l8K25j09K41l49K27R3j74
3762D3K0j25n2J23m4k03O3K84J40n3p4k74K10j43J79Q9l22j64K96J43k47l6O7
3785h0K30l99J18r0J29M57l51J9n1o4k5J70Qj00N2j85P0J5j45L33n1o9m67K17
3809b59P1J12k2R9j96Q3OL28o0j76R0J54k70q8QJ28P9j42R4k24J61j7k31K51R2
3834G1J57j13j39j23J51O2j57L9r2J15J16J21l13J37p0R3m4O4j57kk99J99K15
3857C1k24K40k9J00L8j18j6O0k29J48m1J22j23Jn6L18j59m3L8K3m4r2j17K76J3
$$ plain form
3882 117 -185 143 103 -208 -130 42 -13 -164 -174 68 95 71 -145 97 -188 -272 276 197 -147 -102 389 117 -84
3905 -84 -65 104 251 122 -226 -23 -13 58 -193 -203 354 -167 -25 -93 -330 -26 142 180 32 -261 -279 40 8
3928 8 -337 -7 41 -280 -23 164 92 37 32 -26 -167 69 31 26 -33 -64 -61 139 95 59 -207 37 -125 -6 189 -27
3954 -27 -68 133 -93 -138 182 132 175 -96 45 254 72 -85 -261 -31 -247 -15 188 43 -43 171 17 -238
3976 -238 -238 -64 172 24 -267 -332 -180 -149 34 -112 -47 -169 -178 75 -77 323 136 207 27 77 -120 -14 113
3999 113 -65 8 106 -21 126 -122 236 78 -95 -89 -82 -92 42 128 -192 106 111 144 -129 -302 120 -1 -299 -175
4023 -175 -191 218 71 -276 -67 162 106 36 91 168 -98 -9 -29 -210 -99 213 -297 34 74 139 -30 87 149
4046 149 -65 177 219 176 6 -162 -36 243 -38 -138 -223 268 -10 58 2 157 108 -126 -17 159 -226 344
$$ packed form
3882A17l02L28m0l11P8J72n5j51j0K42K7k4k16K42k85q4N48p9l44M5M91k72k01
3905h4J9J69J47j29l48K03J0P1k51j0N57n21J42o8k37L04J68L8j48k93j8L19l2
3928Hl45L30M8l21K57J87p2n5nn8j41K36l8nn9l1LK00m4l6k66K44j62J19J95k16
3954b7m1K01k26m5L20n0M3k71J41K09j82j57j76K30k16K32K03j45q6K14j54k55
3976b38%J74K36j48k91o5J52L1J83j46O5j22rK53j52M00j87P1j80N0j97J06J27
3999A13j78P3R8j27J47k48L58j58j73OPj0J34Q6l20K98NL3k73j73M22j21k98J24
4023a75j6M09j47l47K09K29n6p0N5P7k66Q9k0j81J11L12n10L31M0O5j69J17O2
4046A49k14K42M2m3j70j68J26K79k81j00q5M91k78O8n6J55m9k34J09J76l85N70
$$ plain form
4068 344 -47 47 -24 22 -210 231 107 -110 -132 -100 -276 -175 -111 -11 103 143 60 83 -54 -166 99 -153 -114
4091 -114 -107 -166 -2 224 163 48 -161 -172 40 368 86 -160 257 5 -46 107 -211 95 -94 146 -8 -5 -166
4114 -166 36 255 102 57 -40 -115 241 31 29 -251 -203 -9 146 -197 152 191 -117 268 54 49 38 -77 24
4137 24 -59 159 -97 153 68 -120 -35 -205 -56 183 25 -131 95 -39 159 -304 -53 -250 -211 -146 38 -104
4159 -104 -50 -110 253 -81 262 222 69 256 53 13 67 190 41 140 8 71 -14 67 140 168 -7 -256 19 47
4183 47 -95 141 48 -42 14 93 -213 170 58 70 219 -94 -91 -26 -37 -237 -47 0 135 -51 88 284 -147 -139
4207 -139 163 -136 -209 25 99 -6 157 -101 -64 -7 -136 -125 -145 172 -57 -82 126 -195 186 -2 -50 233 -206
4230 -206 158 -125 -190 173 -131 75 218 -117 -80 -68 -74 31 -14 133 -14 -21 136 -138 -76 138 -53 40 -92
$$ packed form
4068C44l91R4p1M6k32M41j24k17k2L2j76J01O4J00J14M0q3K3j37j12K65k52L9
4091a14Pn9J64K26o1j15k09j1K12L28k82k46M17k52n1J53l18L06j89K40j54Lj61
4114a66K02K19j53m5r7p5L56k10kk80M8J94J55l43L49L9l08L85k14nj1j15J01
4137B4q3K18k56K50q5j88Q5j70J49K39j58j56K26j34J98m63K51j97L9O5J84j42
4159a04N4o0L63l34L43m0j53J87k03m0N4J23j49R9j32O3q5Q1P3K8j75k49K75K8
4183D7j42K36r3r0N6P9l06L83j12J2J49l13LO5j1k00J90M7J35j86J39J96m31Q
4207a39L02k99p3K34P4j05J63k58L7N7j29J1k0L17k29k5K08l21L81j88m8K83m39
4230b06L64k83o5L63l04K06J43l35L7J2oJ05m5J47j47pJ57k74O2K14j91R3j32
$$ plain form
4253 -92 -64 -96 178 214 159 -15 -122 -58 -127 180 252 -140 -54 -63 -3 -89 161 42 -110 -15 254 22 72 -8 -59 33
4279 33 66 23 41 -24 273 89 241 -205 68 211 63 211 68 169 33 -190 -82 51 312 -57 -319 368
4301 368 -71 -120 -382 193 134 -72 2 200 161 -18 -190 222 88 179 -61 1 102 -271 -150 -9 49 235
4323 235 -263 24 -45 -202 193 -347 -101 -102 148 121 64 -29 64 -201 275 -298 144 -201 61 144 -22 -32 -167
4346 -167 -86 49 74 28 -62 -55 19 56 185 -15 224 -198 -204 188 12 121 -89 -201 126 4 -51 -144 -80 -124 40
4371 40 -255 155 162 211 -98 -105 36 144 62 88 -50 47 175 285 -58 -35 14 359 182 7 178 -109 -61 -235
4395 -235 -70 -15 20 -41 -165 109 -9 78 155 134 -40 283 -107 301 19 -228 15 -188 234 60 102 -158
4417 -158 -91 78 -2 -83 55 -154 -72 138 167 -75 27 -94 -179 152 -93 70 202 -7 -104 -9 85 2 189
$$ packed form
4253i2K8l2K74L6n5j74j07O4o9L07P2l92Q6rO0q6K50j19j52R5K69k32N0q0n1R2
4279C3L3m3J8o5K97j84J52m46K73J43j48J48j43J01j36k23J08J33K61l69k62O87
4301C68m39m9k62N75n9k06P4J98l9j79j72M12j34R1k40O2J01l73J21J41N8J86
4323B35m98K87o9j57L95n40K46jK50k7n7r3R3k65M76n73M42l45K62Q3j66j0j35
4346a67Q1J35K5m6r0PP4L7J29k00K39m22oL92j76J09k10j12L27j22n5r3O4m4J64
4371D0k95M10PM9l09pJ41J08q2K6j38R7J28J10l43K3M9L45j77j75J71k87M8j74
4395b35J65N5L5o1j24K74j18Q7P7k1j74L23l90M08k82k47K43k03M22j74M2k60
4417a58O7J69q0q1J38k09Q2K10K9k42J02j21q5L31k45J63J32k09r7R5R4q3J87
$$ plain form
4440 189 45 -50 32 -127 84 147 -240 29 -18 104 -263 -58 -47 -134 269 30 39 343 -148 -34 -41 29 29 209
4464 209 72 -103 71 44 -3 -136 29 99 -158 -156 84 -48 -89 -195 -3 186 64 -73 -126 -71 -3 219 -17
4487 -17 -130 14 3 -142 85 -53 -43 -249 -198 23 38 31 -2 193 130 -1 274 -16 100 -62 -97 188 -235
4510 -235 -32 122 -167 221 -8 -4 -184 -42 158 -41 -132 139 268 -109 -44 -124 80 8 28 -125 122 16
4532 16 29 195 30 19 103 67 -304 80 -10 240 -58 75 71 48 100 -166 -229 -168 108 -303 37 -224 -143 33
4556 33 146 45 252 4 -176 -230 -217 182 -164 13 253 163 -357 209 82 77 -106 29 101 33 7 272 -93
4579 -93 15 112 9 26 -118 -250 -165 -96 -45 129 -160 3 -151 -105 152 0 197 -40 153 28 -232 3
4601 3 107 0 -59 -23 -129 -58 -90 -119 -242 51 20 -149 -14 235 51 117 24 201 75 -172 -120 -120 157 186 69
$$ packed form
4440A89j44r5Q2j59K11O3l87K69m7J22l67K05J1q7M03k39RL04m91J14pP0%J80
4464B09j37j75J74k7m7j33J65P0k57KK40j32m1j06J92J89j22j37n3N5O8K22k36
4487a7j13J44j1j45K27j38J0k06N1K21J5pl3J95o3j31K75k90J16j62l5K85m23
4510b35K03J54k89L88k29Mj80J42K00j99r1K71J29l77O5q0K04p2K0j53K47j06
4532A6J3J66j65j1Q4l6l71L84r0K50k98J33mk3N2k66o3O1K76m11L40k61Q1J76
4556C3J13j01K07k48j80n4J3L99l46J77K40r0n20N66j27nj83J35P2o8k6K65l65
4579i3J08R7j03J7j44j32Q5O9N1J74k89J63j54M6K57j52J97k37J93j25k60K35
4601CJ04j07n9L6j06P1l2k9j23K93l1j69J35K49j84O6r3J77j26k47N2%K77K9j17
$$ plain form
4626 69 121 441 208 350 -103 -48 367 6 -187 -241 -11 133 128 25 74 23 -38 210 -2 -75 227 71 111 39
4650 39 -60 -224 -148 13 145 10 121 -208 254 91 -38 370 70 44 89 -5 -33 137 133 74 50 47 252 -72
4674 -72 23 -9 -63 -155 130 -255 -165 14 -127 -4 50 -39 -117 417 265 -2 -110 40 251 262 29 -81 -94 -108
4698 -108 40 13 -128 -274 285 -105 -57 2 132 -21 76 103 186 -46 234 77 15 88 186 -15 16 229 68
4721 68 86 142 -232 -102 -161 128 -24 130 -137 -12 94 28 129 264 2 260 29 192 196 -164 276 188 101
4744 101 17 -81 105 60 -61 -29 -115 49 148 -135 192 -14 -332 136 -222 131 268 139 -342 346 51 7
4766 7 -48 185 -86 84 134 -11 14 -95 -402 -7 -24 164 60 -6 -346 54 153 -10 -13 -260 261 -147 81
4789 81 -5 400 -61 -124 108 -208 -27 95 61 120 18 17 -113 -123 -149 124 46 -40 35 155 -112 -23 36 -130 -7
$$ packed form
4626F9N2L20k33J42m53N5M15l61j93n4K30J44nj03M9n1o1K48k12p3L02j56M0p2
4650C9r9j64P6J61J32j35J11l29M62j63j29M08l00k6M5r4k8J70mn9k4lK05l24
4674g2R5l2n4r2K85l85R0J79j41J23N4q9p8N34j52k67j08J50K11J1k33j10j3j4
4698a08J48k7j41j46N59l90M8N9J30j53R7K7Q3k32K80j57o2P3R8k01L1K13j61
4721F8J8N6l74J30n9K89j52J54k67J25J06o6J01J35k62K58k31J63Ml60M40q8q7
4744A01q4r8J86m5j21L2q6J64R9k83L27k06l18M68l58L53J37j29m81O88k95m4
4766Gn5K33k71J70N0j45K5j09l07L95j7J88j04o6l40M00R9j63lk47N21m08K28
4789H1q6M05m61o3K32l16J81J22l4N9j02jj30j0k6K73p8q6P5J20k67Q9N9j66J23
$$ plain form
4814 -7 154 241 262 259 -116 -114 -84 136 13 86 67 -53 -57 141 -22 -39 49 -61 274 -184 122 -66 174 124 144 -161
4840 -161 105 -44 -17 155 -318 -218 -117 -228 -23 170 -371 270 -120 198 29 279 -117 149 -128 250
4860 250 -2 29 49 -53 -76 -99 224 132 -158 69 84 -158 122 -10 101 -105 116 -38 113 -148 104 -89
4882 -89 58 69 139 266 105 107 -70 -114 -176 -62 0 -171 33 57 -99 284 -255 -63 -211 281 236 -27 -44 62
4906 62 -237 9 -185 -9 -243 -45 -164 226 -125 90 34 -60 86 127 180 70 1 226 -242 -108 -253 111
4928 111 -210 198 -14 -174 -30 -17 25 116 -131 139 -7 40 -78 65 163 293 -10 133 55 -19 -39 -74 210
4951 210 -28 39 91 213 -71 142 -266 -65 -140 12 -24 -327 -38 147 53 183 -38 -103 163 195 90 -80
4973 -80 68 -249 -41 -113 98 -338 -186 -229 77 -52 -58 -37 140 -30 -180 -251 267 39 -246 19 65 -78 -161
$$ packed form
4814gJ61Q7K1ll75KL0K20j23P3j9j20mJ98j63j7Q8j10L35m58L06j88K40n0K0l05
4840a61K66j49K7J72m73J00J01j11K05J93n41O41l90L18j69K50l96K66k77L78
4860B50k52L1K0j02k3k3L23r2k90K27J5k42K80j32J11k06K21j54J51k61K52j93
4882h9J47J1P0J27j61Kj77m4o2J14O2j71K04K4j56L83n39J92j48M92m5k63j7J06
4906F2k99K46j94J76k34J98j19L90l51K15n6r4J46M1N3j10o9K25m68J34j45L64
4928A11l21M08k12j60J44J3M2R1k47K70j46M7j18J43R8J30l03J43p8p4k0l5K84
4951B10k38O7N2J22k84K13m08K01p5J52l6l03K89J85r4J30k21o5K66L2j05j70
4973h0J48l17K08p2K11m36J52m3L06j29oK1J77j70j50p1N18k28k85K65M6j43q3
$$ plain form
4996 -161 -34 -69 256 0 214 181 -155 96 182 57 91 -164 -134 -294 -23 83 273 189 84 -135 -116 185
5018 185 61 21 -298 -285 59 -41 264 -366 -268 158 -117 298 -216 -219 -233 176 127 186 68 142 244 46 -6
5041 -6 -283 59 -70 132 148 -57 -143 -17 -11 -348 -63 -287 152 -76 -26 16 56 13 148 3 245 241 78 45
5065 45 -9 96 -14 -36 -123 -39 130 80 84 32 7 39 -61 -223 -7 52 80 25 -98 70 -44 -10 -113 -72 18 118
5091 118 -275 -8 26 10 -205 -141 26 240 -6 28 124 -68 180 -119 97 -352 206 44 -210 336 -130 23
5113 23 -99 72 284 -103 10 -11 -9 -30 89 185 -81 7 -84 93 -248 265 -247 -40 -244 29 110 -185 241
5136 241 -169 207 -74 37 -259 -127 105 74 -116 80 63 -22 -32 328 74 -181 134 -68 33 90 -100 -23
5158 -23 124 0 -106 -79 413 -36 79 -56 -134 -155 -27 25 43 -14 202 -45 101 95 -12 216 -137 -264 5
$$ packed form
4996a61J27l5L25k56K14l3l36K51Q6j25L4k55L0j60K71J06J90q4j05k19J9L01
5018A85j24m0l19J3L44j00L05o30R8M26k75M15n14lj4M09m9N9j18P4J02j98n2
5041fk77L42j29K02J6k05q6J26Ol37K85k24M39k28N0M2M0m3J35j45K42mj63l3
5065D5n4J05j10k2q7Q4J69n0Mn2k5L2j00j62K16N9K8n5j23J68j14L4j03M1R0J00
5091A18l93K67L4j6k15O4J67K14k46L4R6j92K48k99K16m49N58j62k54N46m66J53
5113B3j22J71K12l87J13k1Kk1J19R6k66Q8r1J77l41N13n12K07k04K73Q1k95M26
5136B41m10L76k81J11k96J32K32l1j90J96j7q5j0L60k54k55L15k02J01N7j90P7
5158b3J47j24j06K7M92m49J15j35p8k1J28N2J8n7K16k47J46oj07K28l53j27K69
$$ plain form
5181 5 158 29 32 23 104 -110 55 -104 -48 -157 -19 -8 95 -164 -149 -61 -83 41 -184 -104 -14 -39 -96 -32 184 126
5207 126 124 101 -273 -109 -97 -140 149 94 127 18 69 79 1 -144 -111 -86 -83 -17 62 247 -79 -270 -23 87 5 -27
5233 -27 125 -40 198 52 199 -149 -318 125 -1 -121 75 233 24 142 -232 208 151 -54 -435 40 -30
5254 -30 50 147 118 132 205 109 3 -13 -86 11 230 49 -74 -71 91 -120 -19 31 -117 -146 62 -187 -235 -91 23
5279 23 58 -46 372 -116 179 -66 42 -9 82 9 24 100 -81 -200 -176 138 76 -128 -136 214 -127 -30 -11 19 158
5304 158 70 43 -157 -414 33 35 132 36 -68 299 236 19 56 27 30 288 98 359 169 -296 133 -85 -210 -6
5328 -6 -71 222 -294 52 115 -320 -12 2 137 -261 -183 151 -17 130 -209 15 -190 -108 112 -143 -181 183 29
5351 29 -338 120 36 114 -66 -124 7 44 -13 142 178 221 -146 157 -220 38 89 70 154 14 -37 126 83 -87
$$ packed form
5181EJ53j29LrQ1k14J65j59N6j09J38J1J03k59J5Q8k2J24k25Q0R0k5n7O4K16n8
5207A26kk3l74J64J2m3K89n5L3j09N1J0p8j45L3K5LO6P9J85l26j91K47J10q2l2
5233b7J52j65K38j46J47l48j69M43j26j20J96J58k09J18l74M40n7k05l81M75p0
5254c0Q0R7k9J4P3r6j06j6p3R7K19j81j23LJ62k11J01N0j48k9K08k49m8J44J14
5279B3L5j04M18m88K95k45J08n1R1p3J5P6j81j19K4L14o2k04qL50l41R7J9L0J39
5304A58q8k7k00k57M47KR7r6j04L67o3k17L7k9LK58j90K61j90m65M29k18j25K04
5328fo5K93n16L46O3m35L08J4J35l98P8L34j68J47l39K24k05Q2K20k55l8L64j54
5351B9l67M58q4P8j80n8J31L7n7J55L6M3l67L03l77K58N1j9Q4j40n1J63m3j70
$$ plain form
5375 -87 226 92 168 -147 -108 111 -129 -178 25 -201 -65 306 -69 -6 320 -282 27 -50 -164 -75 33 182
5397 182 -151 263 44 -12 6 7 74 -150 -49 62 -104 -69 -6 -50 29 155 118 122 -65 -145 -153 106 342 -15 12
5422 12 9 144 1 -9 36 46 -165 -129 90 -96 -94 -124 -5 45 -43 212 37 261 -111 15 34 -267 -47 93
5446 93 283 8 -84 -397 -5 -89 -19 -229 87 -155 117 120 -238 -223 141 -14 118 0 -94 -101 -39 -2 125 129 293
5471 293 -126 -50 -57 422 82 116 48 341 41 -346 -234 -10 169 176 194 17 -62 300 346 -315 44 -123 25
5494 25 -55 79 127 88 -254 7 -261 110 73 -200 -25 -108 156 -248 -119 -75 48 69 283 134 -104 136 -208
5517 -208 110 -8 131 -88 -128 -25 -110 216 -61 62 -145 -26 48 162 219 38 -7 -39 -6 -148 238 45
5539 45 -124 68 79 72 -123 152 29 -167 -120 284 -214 -91 206 -125 78 329 164 39 -66 146 24 -65
$$ packed form
5375h7L13j34P6l15L9K19k40m9K03k26J36L71l75O3L26o02L09p7j14Q9J08J49
5397A82l33M14k19n6J8JO7k24J01J11j66L5O3m4P9J26l7Mj87q0qK59K36l57K7
5422A2lJ35j43j0M5J0k11L6K19j86Kl0J19N0q8K55j75K24l72J26J9l01K20J40
5446I3J90k75r2l13L92q4P0k10L16k42K72Ll58J5L64j55J32j18r4pO2L7J27MJ64
5471B93m19P6pM79l40L4o8K93l00l87J12K24J79PJ8j77p9L62M6o61L59j67J48
5494B5q0J34M8l9l42K61k68L71l7k73J75q3K64m04J29M4J23K1K14j49k38K40l44
5517b08L18j18J39k19m0J03q5L26k77J23k07J19P4J14N7j81m5l2L3j42L86j93
5539D5j69J92J1pj95K75j23j96M7M04m98J23K97l31K03K51j65j25j05K12j22q9
$$ plain form
5561 -65 -158 97 12 -18 -33 -58 -227 89 -181 84 -176 22 202 202 -216 97 74 132 -87 73 55 -37 232 99
5585 99 28 -190 -22 -72 106 -166 -67 224 -70 123 -317 165 251 -73 71 297 118 -41 -78 -64 -253 -6
5607 -6 228 122 -161 52 132 284 -204 250 -13 -51 -4 -55 80 15 162 108 -92 145 85 170 -52 -74 47 -315
5631 -315 28 -142 98 51 39 -29 80 82 87 -264 161 -1 201 9 -60 -68 65 -157 -300 -109 -19 4 210 -114
5655 -114 -45 61 -193 131 207 209 -338 -181 131 226 204 221 -176 -108 -60 -198 -120 -209 214 -111 318 54 -422 206
5679 206 -117 -44 -100 -98 200 -38 -2 -71 314 -59 129 -54 26 -153 108 -10 -98 124 142 143 -151 -126 26 133
5703 133 -120 -25 5 168 -141 -56 -53 -6 -24 -48 -277 -20 -121 184 -197 -136 -35 -224 115 -30 -53 32 -72 0
5727 0 -23 -74 165 52 66 154 -99 -90 65 -84 127 -65 -45 314 38 109 391 -46 40 57 114 -20 54 218 32
$$ packed form
5561f5r3K55q5l0j5k5j69L16k70K65k60J98J80%m18L13k3N8k19J60j8r2K69j33
5585I9p1k18J68n0J78k72R9K91k94J93m40M82Q6l24J44K26j79j59l7J4j89K47
5607fK34j06k83K13Q0J52m88M54k63l8M7n1J35o5J47n4k00K37o0Q5k22k2J21l62
5631c15L43j70K40m7j2o8J09KNl51M25j62K02j92o9qJ33k22j43J91R0K3K06l24
5655a14O9J06k54L24P6Kn47J57L12R5k2J7l97O8M8j38P8q9M23l25M29k64m76O28
5679B06l23P3n6KK98k38L6o9L85l73J88j83Q0j79K61j18q8K22J8Jk94K5J52J07
5703A33k53R5L0J63l09Q5LM7j8k4k29K57j01L05l81O1J01j89L39j45k3Q5j04P2
5727@k3n1K39j13J4Q8k53RJ55j49K11j92K0L59k76P1K82m37Q6J7N7j34P4J64j86
$$ plain form
5752 32 66 230 366 -220 100 -26 136 -22 240 30 219 36 -42 -160 -31 158 -172 -233 -302 -352 -27 112
5774 112 276 -40 307 84 -109 278 -2 150 -213 -2 -137 -80 116 -69 196 -38 9 205 168 -226 -184
5795 -184 139 -7 -16 -171 118 -68 173 58 -281 125 468 163 -170 59 -243 -271 -90 249 -76 -345 72
5816 72 -53 107 -225 274 -15 -47 -168 57 65 51 -277 -244 52 -56 241 -315 -216 129 123 55 -139 271 -58
5839 -58 -135 -97 -84 -132 -25 141 61 40 -10 -54 -18 193 -216 -295 -126 -167 -55 -29 -11 208 92 -5 16 114 -62 -280
5865 -280 -111 -11 -20 112 -235 60 133 -60 75 -65 -55 22 -179 -137 52 -16 177 103 30 104 -88 -21 -37 -232
5889 -232 -22 223 -427 82 -31 -40 133 137 -119 -53 -72 -107 65 16 104 -110 192 290 76 -95 154 251 83 -230
5913 -230 87 -47 75 138 56 320 -14 -396 -121 166 42 33 45 183 -185 311 54 290 72 5 -117 -89
$$ packed form
5752C2L4J64J36n86L20j26J62j58K62k10J89j83p8j18J29J89l30o1o9n0L25J39
5774A12J64l16L47k23j93L87k80J52l63K11j35N7J96j85K65k34M7J96l7l94M2
5795a84L23j46rj55K89j86K41j15l39M06L43l05l33K29l02k8J81L39l25k69M17
5816G2j25J60l32M99k89l2j21K25Qj4l28L3K96j08K97n56R9L45oo8j94M10l29
5839e8p7L8J3m8J07J66q0k1n0m4L6K11m09p9J69m1J12K6J8K19j16r7K1R8j76k18
5865b80J69J00rJ32l47K95P3j93J35j40J0P7k01M2J89o8J93p4p3P4j92O7j6j95
5889b32K10K45o50N09j13rJ73Mk56O6j9l5J72m9Q8k14L02R8k14j71K49R7j68l13
5913b30L17j34J22O3q2K64l34l82K75K87j24rJ2J38l68M96k57K36k18o7j22K8
$$ plain form
5935 -89 106 18 64 -59 -168 -15 -35 -235 179 175 -149 -142 112 -13 29 201 91 -128 -64 -78 67 217 151 128
5959 128 -104 -171 272 88 17 -229 -111 142 -225 98 103 55 -86 211 57 24 228 22 -130 28 155 -77
5981 -77 -139 97 -84 -82 -298 -70 70 -30 -12 86 -81 -78 -21 -89 -155 -78 -77 -37 96 106 21 12 -56 -44 215 86 71
6008 71 -267 -161 142 8 -16 137 234 257 51 289 -76 22 314 254 15 -266 30 153 13 150 -56 -131
6030 -131 -13 127 -234 183 -41 -16 -94 275 -327 48 -62 -214 -25 177 -75 71 -10 -223 8 -166 -23
6051 -23 23 119 145 153 -51 53 -64 135 -141 39 134 70 144 -147 -290 120 -114 247 -115 38 145 -26 -1
6074 -1 14 -96 -105 -39 156 41 -100 119 84 26 87 49 55 63 98 -56 -54 -191 46 -75 13 -74 8 33 -111 68 -171
6101 -171 -112 -74 1 -68 13 65 -27 17 94 -155 -120 -8 240 -26 -55 -183 233 36 61 2 116 158 -140 217 -6
$$ packed form
5935h9J95q8M6j23j09J53k0k00M14ml24PK54j25M2J72j10k19O4j4J45J50o6k3
5959A28k32o7M43j84p1k46J18K53l67L23Nm8j41K97j54l3K04k06j52J58J27k32
5981g7o2K36j81Kk16K28J40j00J8R8j67LN7o8o6P7JM0J33J0q5ro8J2K59j29j5
6008G1l38J06L03j34k4J53R7K3k06K38l65R8K92o0k39k81K96J23j40J37k06p5
6030a31J18J40l61M17k24K5p8L69o02L75j10j52J89K02k52J46q1k13K31j74J43
6051b3M6R6K6Qk04J04j17J99k76J80R5o4P4k91j43M10k34L61l62J53J07j71K5
6074aJ5j10rO6J95j15j41K19l5n8O1l8OQL5j54Kj37K37j21Q8q7Q2K5j44J79k39
6101a71N9L8P5o9Q1N2r2M4P7k49L5J12K48k66k9j28M16j97K5n9J14M2k98L57k23
$$ plain form
6126 -6 182 -102 109 39 -184 -8 -260 -129 26 -15 61 -118 -140 -74 158 40 -20 16 96 -308 -91 -174 82 19
6150 19 -135 215 -107 -25 69 -150 -25 -86 -55 160 -179 -74 -78 90 74 125 -147 47 111 -3 -219 -14 282
6173 282 11 28 52 -43 85 145 -178 -89 291 7 -16 69 -155 -188 128 5 20 -18 -92 -334 -254 -8 28 42 -11
6198 -11 44 -57 -122 141 101 -119 36 -11 11 -41 99 64 -266 -200 -68 287 -298 -190 114 127 110 28 -109 -83
6222 -83 -117 -38 -9 -85 28 -18 239 -231 144 -158 -3 -67 73 13 -170 105 116 228 127 100 -142 127 97 167
6246 167 191 21 185 -10 54 28 -83 83 87 144 81 -222 52 5 139 -105 55 -130 164 57 40 -15 -212
6269 -212 -46 -17 60 -67 -63 -62 -243 -28 104 -38 113 -170 204 86 19 25 -53 -310 77 -180 39 101 49 -147
6293 -147 -173 -198 106 -52 69 16 -271 271 253 118 98 -121 71 30 31 183 -169 -15 84 81 82 -117 3 -108
$$ packed form
6126fJ88k84K11p0k23J76k52J31J55m1P6j79k2O6K32j18o0L6Q0m04K17q3K56o3
6150A9j54L50l22Q2R4k19J25o1L1K15l39J05mJ68j6N1k72J94O4j14k16K05K96
6173B82k71J7K4r5J28O0l23Q9L80k84k3Q5k24l3L16j23J5l8p4k42Q0K46L6J4n3
6198a1N5j01o5K63m0k20J55m7K2n2J40l5l30O6J32L55n85J08L04J3j7q2j37K6
6222h3l4P9K9p6J13m6K57m70L75l02J55o4J40o0j83K75J1J12j01k7k42K69l0P0
6246A67K4j70J64j95O4k6j11J66MN7o3l03K74m7J34k44J60j85K94j07j7n5j97
6269b12J66K9P7j27MJj81K15J32j42J51k83L74j18o7Op8k57L87k57K19O2n2j96
6293a47k6k5L04j58J21n3k87N42j8j35k0k19J92m1JJ52l52J54R9lJj99J20j11
$$ plain form
6317 -108 19 105 36 -66 -38 -34 92 -77 -38 22 74 -102 97 -6 -79 -49 -82 40 -89 90 153 24 -216 -36
6341 -36 -38 -31 231 166 -131 -53 150 -300 92 -212 -18 32 -101 -67 2 192 -13 -203 -69 309 -172 178 27
6364 27 -104 -57 14 -188 -95 -75 282 -44 41 -30 80 244 -18 -103 151 96 196 88 -80 33 -131 -88 -351
6387 -351 176 3 79 265 165 -284 125 -31 267 -185 -163 -17 149 -3 277 40 45 -138 148 -113 69
6408 69 261 -320 123 -79 -10 285 -81 -196 -164 58 191 125 -31 94 139 351 -80 11 203 -97 27 -277
6430 -277 418 108 -230 133 -129 -94 -207 -87 161 -195 -5 175 -59 221 -24 -319 -58 53 -192 258
6450 258 177 22 148 -101 -24 -147 66 -57 -141 -56 302 1 -11 -13 172 195 98 -239 -7 76 95 37 19 67 73
$$ packed form
6317a08J27Q6o9j02K8MJ26j69L9O0N2j76J99j03p3L0l3J22j29J79O3j29k40J80
6341c6kPK62o5k97P8K03m50L92l04J94N0j33L4O9J90k05j90J34L78m81L50j51
6364B7j31M7P1k02R3K0L57l26Q5p1J10J64k62q5K54n5J00j08j68J13j64M3k63
6387c51N27j73P6J86j00m49M09j56K98m52K2J46J66j52K80k37Nj83K86k61J82
6408F9J92n81M43k02O9K95l66j15L2K22J33o6j56J25M5K12m31R1J92l00J24l04
6430b77O95l10l38L63k62L5j13J20K48l56J90J80k34K80k45k95K61J11k45M50
6450B58q1j55J26k49P7j23K13j23q4Q5L58l01j2kJ85K3r7l37K32Q3J9n8j8M8O
$$ [...]
8191A09
##END NTUPLES=NMR FID
##END=
