##TITLE=1H_DE-80_DRG_K
 200.13MHz, D2O,
 8 sc
 
 3.2.2025
##JCAMPDX= 6.0         $$ Bruker NMR JCAMP-DX V2.0
##DATA TYPE= NMR FID
##DATA CLASS= NTUPLES
##ORIGIN= UXNMR, Bruker Analytische Messtechnik GmbH
##OWNER= pz
$$ XWIN-NMR		Version 3.5
$$ Mon Feb  3 19:01:09 2025 Russian Standard Time (UT+4h)  she@DPX200
##.OBSERVE FREQUENCY= 200.1313
##.OBSERVE NUCLEUS= ^1H
##.DELAY= (6, 6)
##.ACQUISITION MODE= SIMULTANEOUS
##.ACQUISITION SCHEME= undefined
##.AVERAGES= 8
##.DIGITISER RES= 18
##SPECTROMETER/DATA SYSTEM= spect
##.PULSE SEQUENCE= zg30
##.SOLVENT NAME= CDCl3
##.SHIFT REFERENCE= (INTERNAL, CDCl3, 0, 14.3821)
##AUDIT TRAIL= $$ (NUMBER, WHEN, WHO, WHERE, WHAT)
$$ ##TITLE= Audit trail, XWIN-NMR		Version 3.5
$$ ##JCAMPDX= 5.01
$$ ##ORIGIN= Bruker BioSpin GmbH
$$ ##OWNER= she
$$ F:/spectra/data/she/nmr/H-C/1/audita.txt
$$ ##AUDIT TRAIL=  $$ (NUMBER, WHEN, WHO, WHERE, WHAT)
(   1,<2025-02-03 19:00:03.82 +0400>,<she>,<DPX200>,
      <created by zg, POWCHK disabled, PULCHK disabled
       configuration hash MD5:
       00 E9 B6 7A A2 85 ED C7 34 08 36 98 17 FE 4E 26
       data hash MD5: 16K
       90 05 DE 66 97 31 F5 5C 21 B8 ED 1B B2 82 5E DB>)
$$ ##END=
$$ 
$$ hash MD5
$$ 71 D0 F1 FA 3B 72 0E F6 E4 56 81 DD 88 8F AA C6
##$RELAX= 
##$RELAX= 
##$RELAX= 
##$RELAX= 
##$RELAX= 
##$RELAX= 
$$ Bruker specific parameters
$$ --------------------------
##$DU= <F:/spectra>
##$EXPNO= 1
##$NAME= <H-C>
##$PROCNO= 1
##$TYPE= <nmr>
##$USER= <she>
##$AMP= (0..31)
100 100 100 100 100 100 100 100 100 100 100 100 100 100 100 100 100 100 
100 100 100 100 100 100 100 100 100 100 100 100 100 100 
##$AQSEQ= 0
##$AQ_mod= 1
##$AUNM= <au_zg>
##$AUTOPOS= <>
##$BF1= 200.13
##$BF2= 200.13
##$BF3= 200.13
##$BF4= 200.13
##$BF5= 200.13
##$BF6= 200.13
##$BF7= 200.13
##$BF8= 200.13
##$BYTORDA= 1
##$CFDGTYP= 0
##$CFRGTYP= 5
##$CHEMSTR= <none>
##$CNST= (0..31)
1 1 145 1 1 1 1 1 1 1 1 1 1 1 1 1 1 1 1 1 1 1 1 1 1 1 1 1 1 1 1 1 
##$CPDPRG= <>
##$CPDPRG1= <>
##$CPDPRG2= <>
##$CPDPRG3= <>
##$CPDPRG4= <mlev>
##$CPDPRG5= <mlev>
##$CPDPRG6= <mlev>
##$CPDPRG7= <mlev>
##$CPDPRG8= <mlev>
##$CPDPRGB= <>
##$CPDPRGT= <>
##$D= (0..31)
0 0.7 0 0 0 0 0 0 0 0 0 0.03 0 0 0 0 0 0 0 0 0 0 0 0 0 0 0 0 0 0 0 0 
##$DATE= 1738594803
##$DBL= (0..7)
120 120 120 120 120 120 120 120 
##$DBP= (0..7)
150 150 150 150 150 150 150 150 
##$DBP07= 0
##$DBPNAM0= <>
##$DBPNAM1= <>
##$DBPNAM2= <>
##$DBPNAM3= <>
##$DBPNAM4= <>
##$DBPNAM5= <>
##$DBPNAM6= <>
##$DBPNAM7= <>
##$DBPOAL= (0..7)
0.5 0.5 0.5 0.5 0.5 0.5 0.5 0.5 
##$DBPOFFS= (0..7)
0 0 0 0 0 0 0 0 
##$DE= 6
##$DECBNUC= <off>
##$DECIM= 32
##$DECNUC= <off>
##$DECSTAT= 4
##$DIGMOD= 1
##$DIGTYP= 9
##$DL= (0..7)
0 120 120 120 120 120 120 120 
##$DP= (0..7)
150 150 150 150 150 150 150 150 
##$DP07= 0
##$DPNAME0= <>
##$DPNAME1= <>
##$DPNAME2= <>
##$DPNAME3= <>
##$DPNAME4= <>
##$DPNAME5= <>
##$DPNAME6= <>
##$DPNAME7= <>
##$DPOAL= (0..7)
0.5 0.5 0.5 0.5 0.5 0.5 0.5 0.5 
##$DPOFFS= (0..7)
0 0 0 0 0 0 0 0 
##$DQDMODE= 0
##$DR= 18
##$DS= 0
##$DSLIST= <SSSSSSSSSSSSSSS>
$$ [...]
##$SUBNAM0= <"">
##$SUBNAM1= <"">
##$SUBNAM2= <"">
##$SUBNAM3= <"">
##$SUBNAM4= <"">
##$SUBNAM5= <"">
##$SUBNAM6= <"">
##$SUBNAM7= <"">
##$SUBNAM8= <"">
##$SUBNAM9= <"">
##$SW= 18.0517328524113
##$SWIBOX= (0..15)
0 0 2 0 0 0 0 0 0 0 0 0 0 0 0 0 
##$SW_h= 3612.71676300578
##$TD= 16384
##$TD0= 1
##$TE= 0
##$TE2= 300
##$TE3= 300
##$TEG= 300
##$TL= (0..7)
0 120 120 120 120 120 120 120 
##$TP= (0..7)
150 150 150 150 150 150 150 150 
##$TP07= 0
##$TPNAME0= <>
##$TPNAME1= <>
##$TPNAME2= <>
##$TPNAME3= <>
##$TPNAME4= <>
##$TPNAME5= <>
##$TPNAME6= <>
##$TPNAME7= <>
##$TPOAL= (0..7)
0.5 0.5 0.5 0.5 0.5 0.5 0.5 0.5 
##$TPOFFS= (0..7)
0 0 0 0 0 0 0 0 
##$TUNHIN= 0
##$TUNHOUT= 0
##$TUNXOUT= 0
##$USERA1= <user>
##$USERA2= <user>
##$USERA3= <user>
##$USERA4= <user>
##$USERA5= <user>
##$V9= 5
##$VALIST= <valist>
##$VCLIST= <CCCCCCCCCCCCCCC>
##$VD= 0
##$VDLIST= <DDDDDDDDDDDDDDD>
##$VPLIST= <PPPPPPPPPPPPPPP>
##$VTLIST= <TTTTTTTTTTTTTTT>
##$WBST= 1024
##$WBSW= 4
##$XGAIN= (0..3)
0 0 0 0 
##$XL= 0
##$YL= 0
##$YMAX_a= 610770
##$YMIN_a= -629272
##$ZGOPTNS= <>
##$ZL1= 120
##$ZL2= 120
##$ZL3= 120
##$ZL4= 120
##$ABSF1= 10
##$ABSF2= 0
##$ABSG= 5
##$ABSL= 3
##$ALPHA= 0
##$AQORDER= 0
##$ASSFAC= 0
##$ASSFACI= 0
##$ASSFACX= 0
##$ASSWID= 0
##$AUNMP= <proc_1d>
##$AZFE= 0.1
##$AZFW= 0.1
##$BCFW= 1
##$BC_mod= 2
##$BYTORDP= 1
##$COROFFS= 0
##$CY= -3
##$DATMOD= 1
##$DC= 2
##$DFILT= <>
##$DTYPP= 0
##$F1P= 0
##$F2P= 0
##$FCOR= 0.5
##$FTSIZE= 0
##$FT_mod= 4
##$GAMMA= 1
##$GB= 0.15
##$INTBC= 1
##$INTSCL= 1
##$ISEN= 128
##$LB= 0.25
##$LEV0= 0
##$LPBIN= 0
##$MAXI= 10000
##$MC2= 0
##$MEAN= 0
##$ME_mod= 0
##$MI= 1.114404
##$NCOEF= 0
##$NC_proc= 0
##$NLEV= 6
##$NOISF1= 3.799351
##$NOISF2= 2.8
##$NSP= 1
##$NTH_PI= 0
##$NZP= 0
##$OFFSET= 14.38212
##$PC= 1
##$PHC0= -125.4876
##$PHC1= 35.99223
##$PH_mod= 1
##$PKNL= yes
##$PPARMOD= 0
##$PSCAL= 0
##$PSIGN= 0
##$REVERSE= no
##$SF= 200.129724274929
##$SI= 16384
##$SIGF1= 3
##$SIGF2= 2
##$SINO= 400
##$SIOLD= 16384
##$SREGLST= <1H.CDCl3>
##$SSB= 0
##$STSI= 0
##$STSR= 0
##$SW_p= 3205.1282051282
##$SYMM= 0
##$S_DEV= 0
##$TDeff= 0
##$TDoff= 0
##$TI= <>
##$TILT= no
##$TM1= 0
##$TM2= 0
##$TOPLEV= 0
##$USERP1= <user>
##$USERP2= <user>
##$USERP3= <user>
##$USERP4= <user>
##$USERP5= <user>
##$WDW= 1
##$XDIM= 8192
##$YMAX_p= 0
##$YMIN_p= 0
$$ End of Bruker specific parameters
$$ ---------------------------------
##NTUPLES= NMR FID
##VAR_NAME=  TIME,          FID/REAL,        FID/IMAG
##SYMBOL=    X,             R,               I
##VAR_TYPE=  INDEPENDENT,   DEPENDENT,       DEPENDENT
##VAR_FORM=  AFFN,          ASDF,            ASDF
##VAR_DIM=   8192,          8192,            8192
##UNITS=     SECONDS,       ARBITRARY UNITS, ARBITRARY UNITS
##FACTOR=    0.0002768,     1,               1
##FIRST=     0,             0,               0
##LAST=      2.2672688,     0,               0
##MIN=       0,             -629272,         0
##MAX=       2.2672688,     610770,          0
$$ Real data points
##PAGE= N=1
##DATA TABLE= (X++(R..R)), XYDATA
$$ [...]
$$ plain form
1867 -260 -501 -481 -62 239 719 351 591 117 -146 -413 -479 -508 133 234 443 545 358 78 -183 -342 -609
1888 -609 -388 -242 366 208 327 180 -81 -334 -227 -660 -526 -255 193 543 311 495 277 -59 -212 -524
1908 -524 -325 -13 66 324 625 487 368 -121 -516 -540 -313 -89 246 275 255 199 287 61 -479 -400 -380 -267 -155
1931 -155 413 566 607 530 32 -136 -391 -776 -570 -70 537 493 473 398 -23 14 -490 -470 -336 91 147 351 561
1954 561 262 134 36 -458 -124 -367 37 129 259 434 339 41 -58 -325 -755 -380 -125 336 103 506 179
1975 179 46 -366 -641 -639 -326 43 30 558 477 547 -30 -126 -256 -447 -299 -391 45 421 439 215 389 -393 -522
1998 -522 -603 -400 -71 109 435 428 301 16 178 -567 -131 -196 -255 71 332 603 371 -10 -93 -513 -248 -210
2020 -210 -239 -24 377 273 366 102 -182 -524 -350 -302 -338 125 274 352 390 115 -121 -387 -601 -276 -102 -91
$$ packed form
1867b60k41K0M19L01M80l68K40m74k63k67o6k9O41J01K09J02j87k80k61j59k67
1888f09K21J46O08j58J19j47k61k53J07m33J34K71M48L50k32J84k18l36j53l12
1908e24J99L12P9K58L01j38j19m89l95k4K27K24L35K9k0n6Q8k26n40P9K0J13J12
1931a55N68J53M1p7m98j68k55l85K06N00O07m4k0p5m21L7n04K0J34M27N6K04K10
1954E61k99j28r8m94L34k43M04R2J30J75r5k98r9k67m30L75K55M61k33M03l27
1975A79j33m12k75KL13L69j3N28q1P0n77r6j30j91J48r2M36L76J8k24J74p82j29
1998e22q1K03L29J80L26pj27k85J62p45M36o5n9L26K61K71k32l81q3m20K65L8
2020b10k9K15M01j04R3k64k84l42J74M8l6M63J49P8L8k75k36k66k14L25J74J1
$$ plain form
2042 -91 104 425 657 324 8 -107 -387 -498 -328 -57 453 574 508 457 118 -132 -539 -596 -434 15 161
2063 161 304 222 296 75 -349 -243 -442 -186 -22 -8 401 480 342 404 -96 -218 -403 -209 -25 -53 554 472
2085 472 236 359 -350 -441 -473 -234 -183 -35 226 565 102 158 -120 -197 -597 -351 -140 181 415 541 226 83
2107 83 53 -305 -853 -443 -390 -65 371 278 684 291 -64 -406 -563 -306 -55 -89 458 487 451 97 -83 -437
2129 -437 -383 -472 -260 230 428 479 363 366 116 -195 -542 -412 -192 -13 360 477 491 136 326 -116 -559 -367
2151 -367 -381 90 174 519 291 366 97 -90 -362 -276 -653 -54 230 583 377 462 349 -382 -403 -805 -235 -100
2173 -100 163 415 338 381 152 17 -374 -96 -658 -58 270 283 618 256 133 -113 -275 -507 -200 -23 295
2194 295 518 494 394 311 17 -340 -542 -427 -164 148 456 498 527 326 -64 -346 -312 -373 -277 -176 178 517
$$ packed form
2042i1J95L21K32l33l16j15k80j11J70K71N10J21o6n1l39k50m07n7J62M49J46
2063A61J43q2P4k21m24J06j99K56J64J4M09P9j38O2n00j22j85J94J84k8O07q2
2085D72k36J23p09r1l2K39N1J48K61L39m63N6k78p7m00K46K11L21K34J26l15j43
2107H3l0l58n48M10N3L25M36r3M06l93l55l42j57K57K51l4N47K9l6l54j80l54
2129d37N4q9K12M90J98N1j16Lk50l11l47J30K20J79L73J17J4l55J90m42m43J92
2151c67j4M71Q4L45k28P5k69j87k72Q6l77N99K84L53k06Q5j13p31k1m02N70J35
2173a00K63K52p7M3k29j35l91K78n62O00L28J3L35l62j23k46j62k32L07J77L18
2194B95K23k4j00q3k94l57k02J15K63L12L08M2K9k01l90k82L4o1R6J01L54L39
$$ plain form
2216 517 452 -24 161 -397 -539 -557 -404 5 229 496 616 311 216 -82 -504 -315 -368 5 418 688 567
2237 567 239 -137 -200 -615 -621 -246 -58 459 347 591 701 11 55 -370 -834 -206 48 221 255 469 313 -7
2259 -7 -19 -161 -809 -138 -357 5 367 415 354 154 -39 -436 -385 -567 -361 202 475 480 265 26 74 -226 -574
2282 -574 -662 -95 66 233 475 558 345 -207 -465 -602 -382 -373 -134 548 370 416 -110 54 -435 -539 -172 -54
2304 -54 -215 263 329 206 154 -166 -478 -331 -549 -333 -168 162 513 345 293 104 -236 -587 -428 -303 -52
2325 -52 669 370 378 450 94 -216 -698 -463 -86 -66 140 226 314 226 83 -131 -493 -592 -207 -260 -6 181 348
2348 348 76 -149 -319 -474 -198 -141 37 49 153 489 -132 -16 -309 -307 -345 -180 -267 180 265 247 -4 54 92
2371 92 -85 -459 -199 -9 20 445 483 276 230 117 -233 -249 -521 -46 -46 42 180 413 64 -28 57 -303 -143
$$ packed form
2216E17o5m76J85n58j42j8J53M09K24K67J20l05r5k98m22J89n3L73M13K70j21
2237E67l28l76o3m15oL75J88N17j12K44J10o90M4m25m64O28K54J73L4K14j56l20
2259gj2j42o48O71k19L62L62M8o1k00j93l97N1j82K06N63K73Nk15k39M8l00l48
2282e74q8N67J61J67K42Q3k13n52k58j37K20RK39O82j78M6n26J64m89j04L67J18
2304e4j61M78O6j23n2l20l12J47k18K16J65L30L51j68n2j89l40l51J59J25K51
2325e2P21k99QP2l56l10m82K35L77K0K06Q6Q8q8j43k14l62r9L85n3K54J87J67
2348C48k72k25j70j55K76N7J78J2J04L36o21J16k93Kl8J65q7M47Q5j8k51N8L8
2371I2j77l74K60J90K9M25L8k07m6j13l50j6k72M75%Q8J38K33l49r2Q5l60J60
$$ plain form
2394 -143 -267 -167 159 317 241 446 62 -267 -156 -277 -353 42 272 290 584 575 270 -250 -309 -402 -229 -36
2416 -36 9 319 556 423 242 -281 -415 -94 -266 -295 167 374 227 207 -177 -147 -291 -137 -346 -202 252 225
2438 225 44 108 57 -83 -598 -219 -177 40 200 461 225 86 91 -321 -58 -315 -241 -206 -73 80 180 348
2460 348 -26 -103 -341 -20 -465 -348 80 151 97 326 383 -265 -240 -190 -380 -166 16 187 182 -155 253 -170 -152
2483 -152 -120 -150 -111 -44 16 91 230 234 94 -247 -91 -202 -122 68 333 376 330 238 -30 -284 -290 -163 -96 310 -55
2508 -55 236 365 462 -386 -170 -93 -149 -170 83 201 326 141 137 200 -249 -188 -408 -160 -129 -54 214 189 278 235 -320
2533 -320 -389 -322 -115 -14 -208 202 332 279 55 141 49 -624 -439 71 308 39 142 137 138 27 -302 -211 6
2556 6 -123 -174 311 280 155 155 -85 -262 -184 -187 -120 169 -32 321 101 -195 -330 -109 -165 -229 136 50 113 189 280
$$ packed form
2394a43j24J00L26J58p6K05l84l29J11j21p6L95K30J8K94rl05n20n9r3J73J93
2416c6M5L10K37j33j81n23j34L21j72k9M62K07j47k0l84L0j44J54k09J44M54k7
2438B25j81O4n1j40n15L79M2K17J60K61k36j39Nm12K63k57P4L5J33J53J00J68
2460C48l74p7k38L21m45J17M28P1n4K29N7o48K5N0j90K14J82J71nl37M08m23J8
2483a52L2l0L9O7O0P5J39Mj40l41J56j11Q0J90K65M3m6r2k68k54oJ27O7M06l65
2508e5K91J29R7q48K16P7n6k1K53J18J25j85mO3m49O1k20K48L1P5K68k5Q9m3n55
2533c20o9O7K07J01j94M10J30n3k24Q6r2o73J85N10K37k69J03nJj11l29R1K17
2556Fj29n1M85l1j25%k40j77P8lO7K89k01L53k20k96j35K21n6o4L65q6O3P6R1
$$ plain form
2581 280 29 -135 36 -152 -234 282 -197 -53 -130 138 129 16 -8 137 -233 -23 248 203 202 409 -229 -66 -9
2604 -9 -245 -477 77 49 64 18 84 78 -52 42 -35 -93 -54 23 59 66 214 -40 138 187 -248 40 68 -133 191 332
2630 332 52 -40 -18 -84 -80 -250 166 -9 73 35 -53 104 -64 79 -200 -59 -55 85 -64 163 66 181 173 108 -209
2655 -209 -212 -284 305 163 326 7 94 -37 -184 -67 -73 -34 -154 2 169 89 -237 -177 -69 30 -90 -27 -114 145
2679 145 90 376 -25 78 160 -190 -81 -60 -162 68 125 159 1 58 -110 -91 -71 -117 -36 -115 8 -24 -166 71
2703 71 -54 -104 -106 -163 -188 -92 177 261 209 174 -164 -206 -74 34 -30 -322 137 233 -193 137 -18 -211 -211 -125 -4
2728 -4 182 226 136 215 130 146 -217 -114 42 -93 -4 242 300 -34 217 -1 -168 46 79 75 80 119 81 441 26
2753 26 187 178 -305 33 -244 44 43 168 84 -4 59 -235 -254 309 -16 -76 -51 -25 -58 217 15 124 -121 -38 -172
$$ packed form
2581B80k51j64J71j88q2N16m79J44p7K68rj13k4J45l70K10K71m5jK07o38J63N7
2604ik36k32N54k8J5m6O6oj30R4p7n8L9P7L6PJ48k54J78M9m35K88K8k01L24J41
2630C32k80r2K2o6Mj70M16j75Q2l8q8J57j68J43k79J41MJ40j49K27r7J15qo5l17
2655b09lp2N89j42J63l19Q7j31j47J17oL9j20J56J67q0l26O0J08R9j20O3q7K59
2679A45n5K86m01J03Q2l50J09K1j02K30N7L4j58N7j68J9K0m6Q1p9J23l2j42K37
2703G1j25n0kn7k5R6K69Q4n2l5l38m2J32J08o4k92M59R6m26L30j55j93%Q6J21
2728dJ86M4r0P9q5J6l63J03J56j35Q9K46N8l34K51k18j67K14L3mNL9l8L60m15
2753B6J61rm83L38k77K88jJ25q4q8O3k94j9N63l25o0K5K6l3K75k02J09k45Q3j34
$$ plain form
2778 -172 -13 159 -26 176 -55 125 22 -242 -98 47 -153 -146 60 -9 221 -44 3 176 16 -1 247 213
2800 213 -125 175 316 -219 124 -107 -366 -290 -165 71 -112 381 211 -46 -224 -122 -245 -19 1 52 208
2821 208 -61 369 338 138 72 -56 -20 42 -347 31 82 104 127 -70 100 12 -288 -103 -49 -143 -26 -52 -170 228
2845 228 9 103 -129 -136 -64 -50 39 277 69 106 -132 38 -280 32 244 485 1 122 103 -213 -142 -87 -182 80
2869 80 -62 -243 377 108 17 -14 -36 -184 -338 -113 -5 9 -5 86 -91 224 -15 -262 -85 -129 -141 205 60
2892 60 97 35 -70 -24 -164 -51 -159 -197 100 63 -17 26 22 -86 10 50 -97 123 17 84 41 74 -12 133 -228
2917 -228 -123 -131 -240 231 -2 215 -136 219 31 34 101 -62 82 9 381 117 169 -266 -51 -122 -19 -39 1
2940 1 244 -201 224 71 -106 318 39 -228 -11 -46 274 263 -213 -37 66 -239 -220 -193 195 -26 -150 -69
$$ packed form
2778a72J59J72j85K02k31J80j03k64J44J45k00PK06o9K30k65M7J73j60j7K48l4
2800B13l38L00J41n35L43k31k59P6J25K36j83M93j70k57j78J02j23K26K0N1J56
2821B08k69M30l1k00o6j28L6O2l89L78N1K2K3j97J70q8l00J85N4r4J17k6j18L98
2845B28k19R4k32pP2J4Q9K38k08L7k38J70l18L12K12K41m84J21j9l16P1N5r5K62
2869H0j42j81O20k69r1l1k2j48j54K25J08J4j4R1j77L15k39k47J77m4j2L46j45
2892F0L7o2j05M6j40J13j08l8K97l7q0M3mj08R6M0j47K20j06O7m3L3q6J45l61
2917b28J05qj09M71k33K17l51L55j88LO7j63J44p3L72k64N2m35K15p1J03k0M0
2940AK43m45M25j53j77M24k79k67K17l5L20j1m76J76J03l05J9K7L88k21j24Q1
$$ plain form
2962 -69 179 -11 -164 31 -163 -35 -76 6 2 209 242 65 -51 -95 -57 96 -75 284 -349 -151 113 -62 95
2985 95 -55 -70 -57 37 17 -36 223 108 -226 -236 -94 246 125 -274 77 -138 -41 24 83 -34 -228 -55 -53 68
3009 68 8 -272 20 -113 49 -127 166 76 -265 -22 -131 -2 203 144 -230 -128 34 315 -56 52 -70
3030 -70 -88 -162 18 71 331 116 66 112 2 -185 6 44 161 142 -14 156 -150 22 -567 -50 -117 7 301
3053 301 -36 71 -83 184 192 -46 -196 -144 -20 -18 87 -218 146 -120 -165 -188 -95 -41 -33 216 85 -81 88 290
3077 290 -282 -56 -149 88 95 -157 209 -124 82 220 -7 -20 -168 -197 48 199 -30 62 -252 8 -41 -225
3099 -225 -112 131 -222 -77 165 299 16 -316 -151 172 18 -32 -139 -22 12 -18 -89 -52 83 -55 -259 158
3121 158 -93 51 41 39 59 -11 200 19 -81 16 4 -79 128 135 215 -128 -16 -99 73 68 -147 -38 84 132 96
$$ packed form
2962f9K48j90j53J95j94J28m1Q2mK07L3j77j16m4L8J53j71L59o33J98K64j75J57
2985I5j50j5J3R4k0n3K59j15l34j0J42L40j21l99L51k15R7O5N9j17j94J73KJ21
3009F8o0k80K92j33J62j76K93r0l41K43j09J29K05n9l74J02J62K81l71J08j22
3030g0j8p4J80N3K60k15n0M6j10j87J91L8J17j9j56J70l06J72n89N17o7J24K94
3053C01l37J07j54K67Qk38j50N2J24KJ05l05L64k66m5k3R3N4QK49j31j66J69K02
3077B90n72K26r3K37Pk52L66l33K06J38k27j3j48k9K45J51k29R2l14K60m9j84
3099b25J13K43l53J45K42J34k83l32J65L23j54n0j07J17L4l0p1L7J35j38k04M17
3121A58k51J44j0kK0p0K11j81j00R7j2q3K07PQ0l43J12q3J72nk15J09J22M8l6
$$ plain form
3146 96 102 -224 -253 -66 -41 44 -109 83 41 24 64 -173 -44 -140 13 -65 422 28 58 137 25 87 22 -49 -228
3171 -228 -52 41 197 29 63 -100 -49 146 80 269 10 -138 138 453 119 143 201 81 53 -177 -87 240 487
3194 487 -159 285 -44 -6 193 -71 -100 -179 293 38 355 -14 58 34 -204 -173 -123 96 -189 28 119 89 142
3217 142 7 227 -47 68 -177 74 71 75 -270 139 85 -19 137 -63 -265 71 244 13 27 254 -60 227
3239 227 -1 -218 113 94 68 -265 155 133 -18 -99 -71 -216 -54 -374 -88 -211 348 -59 -121 -63 -5 -1 -239
3262 -239 -2 83 -92 146 134 116 -71 136 -114 -129 -102 217 -200 28 235 213 63 -254 -147 -200 116 164 -25
3285 -25 263 -167 -56 -25 74 92 -269 -58 -50 -150 209 274 -16 -152 -232 -48 174 13 6 31 -167 -337 -60 121
3309 121 112 -219 -182 -172 65 153 46 -120 -102 65 239 -306 -84 -148 -544 416 64 151 87 -83 -54 -114 172 177
$$ packed form
3146I6Ol26k9J87K5Q5j53J92m2j7M0k37J29r6J53p8M87l94L0P9j12O2o5p1j79
3171b28J76R3J56j68L4j63N1J95o6J89k59j48K76L15l34K4N8j20k8k30R0L27K47
3194D87o46M44l29L8J99k64k9p9M72k55L17l69P2k4k38L1N0K19k85K17R1l0N3
3217A42j35K20k74J15k45K51lMl45M09n4j04J56k00k02L36J73k31J4K27l14K87
3239B27k28k17L31j9k6l33M20k2j51q1K8j45J62l20K86j23N59m07o2N8N8Mk38
3262b39K37Q5j75K38j2j8j87K07k50j5K7L19m17K28K07k2j50l17J07n3L16M8j89
3285b5K88m30J11L1R9J8l61K11Qj00L59O5k90j36q0J84K22j61pK5j98j70K77J81
3309A21rl31L7J0K37Q8j07j66J8J67J74n45K22o4l96R60l52Q7o4j70K9o0K86N
$$ plain form
3333 177 126 -104 203 174 3 -143 167 87 -210 178 15 180 -59 204 -381 132 -76 142 52 -31 29 -217
3355 -217 -199 67 -132 131 155 80 -78 -174 -311 225 97 234 57 123 -20 -208 65 -269 -152 -1 230 1
3377 1 250 33 -159 -117 33 96 -7 30 31 57 119 -63 280 65 -20 -12 21 -36 -135 185 242 53 -73 -99 22 10
3403 10 -124 207 -64 14 65 66 82 -33 -183 16 62 -130 -206 -163 50 -54 125 63 -40 -40 42 -112 -80 -163 48
3428 48 121 -25 37 -294 -17 141 5 115 -221 141 134 -39 21 -167 195 -119 -25 -26 -18 68 8 68 -108 -38 -150
3453 -150 -158 -80 117 212 87 -161 -197 120 188 -46 99 -69 -72 52 -35 10 9 -196 -105 -85 -291 25 -241 -181 184
3478 184 -68 -347 -151 -388 68 201 -139 46 47 -234 -12 398 115 104 82 -195 -116 113 -19 105 -112 -131
3500 -131 120 28 -35 39 -73 -50 -41 -12 -14 -58 -148 -102 -68 -228 -41 -29 220 24 -62 157 -173 -73 71 136 -247
$$ packed form
3333A77n1k30L07k9j71j46L10q0k97L88j63J65k39K63n85N13k08K18r0q3O0k46
3355b17J8K66j99K63K4p5j58r6j37N36j28J37j77O6j43j88K73l34J17J51K31k29
3377AK49k17j92M2J50O3j03L7JK6O2j82L43k15q5QL3n7r9L20N7j89j26k6J21j2
3403A0j34L31k71P8N1JJ6j15j50J99M6j92p6M3K13j04J79o2j03%Q2j54L2q3K11
3428D8P3j46O2l31K77J58j36J10l36L62pj73O0j88L62l14R4jQQ6o0O0j76P0j12
3453a50qP8J97R5j25k48l6L17O8k34J45j68lJ24q7M5jk05R1K0k06L16k66O0L65
3478A84k52k79J96k37M56J33l40J85Jk81K22M10k83j1k2k77P9K29j32J24k17j9
3500a31K51r2o3P4j12K3RK9km4r0M6L4j60J87J2K49j96q6K19l30J00J44O5l83
$$ plain form
3525 -247 -28 -93 39 105 -9 184 -3 -35 -38 -16 -188 0 273 8 -173 -28 -111 380 117 56 -14 -13 161 -12
3549 -12 342 283 155 -109 125 213 -12 -29 52 53 -330 30 65 -20 -13 -25 164 244 133 111 -9 486 -79 11 -68
3574 -68 -152 -199 42 18 79 117 -12 -39 -77 40 73 -203 225 87 84 261 -77 -172 77 -58 175 -152 -252 99
3598 99 -11 -48 -38 26 9 -77 259 47 9 -109 41 -106 87 34 -84 -84 100 148 135 33 62 -87 68 61 -208
3623 -208 -116 -310 -43 -35 87 -13 112 -92 -46 128 -279 -174 98 -149 48 67 118 -207 94 -51 -151 -140
3645 -140 -27 -52 -130 25 55 114 -222 266 -145 214 5 82 1 -23 65 72 132 312 108 -195 73 96 53 142 103
3670 103 -103 -47 -93 80 4 -131 143 65 281 11 121 138 -15 -41 -131 38 106 -43 -14 -200 218 162 -10
3693 -10 83 -34 177 -104 228 -27 -207 -169 -383 -28 -18 -209 135 -152 -134 9 110 43 -119 98 230 -41
$$ packed form
3525b47K19o5J32O6j14J93j87l2lK2j72J88K73k65j81J45q3M91k63o1p0JJ74j73
3549a2L54n9j28k64K34Q8k25j7Q1Jl83L60L5q5Pj2J89Q0j11k2j20M95n65R0p9
3574f8q4m7K41k4O1L8j29k7l8J17L3k76M28j38lJ77l38r5K49j35K33l27j00L51
3598I9j10l7J0O4j7q6L36k12l8j18J50j47J93n3j18%J84M8j3j02K9j49J55pk69
3623b08R2j94K67QJ22j00J25k04M6J74m07J05K72k47J97J9N1l25L01j45j00J1
3645a40J13k5p8J55L0N9l36M88m11L59k09P7q1k4Q8PO0J80k04l03K68K3m3Q9l9
3670A03k06N6m6J73p6j35K74p8K16k70J10J7j53k6r0J69O8j49K9j86M18n6j72
3693a0R3j17K11k81L32k55j80L8k14L55J0j91L44k87J8J43J01o7j62K17J32k71
$$ plain form
3715 -41 165 -12 -159 -143 111 118 36 242 -148 -35 -271 162 144 63 79 -107 61 111 -7 -139 -147 -68 7 89 153
3740 153 157 52 78 -265 -53 -122 63 67 93 94 -51 -96 -281 46 -368 -161 222 58 -12 68 128 8 103 -213 147
3765 147 232 -57 19 -21 65 50 145 122 118 -170 107 83 88 178 8 135 206 19 132 -58 -151 166 -40 217 136
3790 136 -51 25 -97 97 185 195 -97 -110 -172 145 215 103 -7 -87 -276 -222 35 189 -171 -176 -104 332 -61 -12
3814 -12 -250 78 158 -153 -15 332 299 69 -149 -393 63 -280 2 -57 191 252 -83 93 23 107 7 72 -111
3837 -111 -105 -87 -12 -76 -131 5 90 101 -35 -75 -353 355 64 -174 1 226 -111 -130 -84 90 5 -136 263 -102
3861 -102 -35 -16 -119 76 -49 11 -136 104 -178 113 213 -171 -16 16 -65 -131 -171 111 67 133 181 293 11
3884 11 -26 33 100 -170 -151 120 77 -80 23 -125 -20 181 8 -49 -103 255 91 256 32 -76 -54 21 -99
$$ packed form
3715d1K06j77j47J6K54Pq2K06l90J13k36M33j8q1J6j86J68N0j18j32qP9P5Q2O4
3740A53Mj05K6l43K12o9J85MK6Jj45m5j85L27m14K07L83j64p0Q0O0j20R5l16L60
3765A47Q5k89P6m0Q6j5R5k3mk88K77k4NR0j70J27P1j87J13j90r3L17k06K57q1
3790A36j87P6j22J94Q8J0k92j3o2L17P0j12j10q0j89N4K57J54l60nP2M36l93M9
3814a2k38L28Q0l11J38L47l3k30k18k44M56l43K82n9K48O1l35J76p0Q4j00O5j83
3837a11OJ8P5o4n5J36Q5J1j36m0k78P08k91k38J75K25l37j9M6J74q5j41L99l65
3861a02O7J9j03J95j25O0j47K40k82K91J00l84J55L2q1o6m0K82m4O6M8J12k82
3884A1l7N9O7k70J9K71m3j57J03j48J05K01j73n7n4L58j64J65k24j08K2P5j20
$$ plain form
3907 -99 -5 153 0 -58 17 -88 175 268 272 -93 -40 -125 -93 -138 -191 111 26 -103 -122 -149 219 69 -10 -81 52 113
3933 113 75 -31 -69 -124 69 -83 -94 151 -246 -151 -18 -135 -85 -313 193 -154 -170 32 -129 -209 -85 -44 -108
3956 -108 13 -206 -29 14 -40 188 255 -262 7 -76 -96 255 -233 -158 -43 142 -137 13 244 -124 -86 -55 -241
3979 -241 -55 97 60 87 90 5 153 89 -78 162 263 -51 -100 4 19 -46 -119 243 -296 -35 -89 214 -148 -3
4003 -3 -2 -50 24 -193 293 -104 -237 47 -109 -49 -129 166 -266 -146 -57 119 68 -65 -288 -179 51 -85 -171 -280
4027 -280 115 -68 5 -19 112 69 12 -230 -238 -89 -105 -251 21 232 -70 170 -176 6 205 -62 -218 159
4049 159 58 79 151 184 -30 86 -143 276 3 -126 -222 -167 -169 -29 72 92 95 -115 -40 -98 30 53 -259 -66
4073 -66 -50 12 333 -14 -119 62 22 -96 132 -83 -1 -165 17 -83 166 -66 84 45 353 107 -27 -160
$$ packed form
3907i9R4J58j53n8P5j05K63R3Ml65N3q5L2m5n3L02q5j29j9k7L68j50p9p1J33O1
3933A13l8j06l8n5J93j52j1K45l97R5J33j17N0k28N06l47j6K02j61q0J24M1o4
3956a08J21k19J77M3n4K28O7n17K69q3k0L51m88P5J15J85k79J50K31l68L8L1j86
3979b41J86J52l7K7Lq5J48o4j67K40J01l14m9J04J5o5p3L62n39K61n4L03l62J45
4003cJm8P4k17M86l97j33K84j56O0q0K95m32J20Q9J76n1j33k23J09K30j36q6j09
4027b80L95j83P3k4J31m3n7k42qJ49j6j46K72K11l02K40l46J82J99k67j56L77
4049A59j01K1P2L3k14J16k29M19k73j29r6N5kJ40J01K0Lk10P5n8J28K3l12J93
4073f6J6O2L21l47j05J81m0j18K28k15Q2j64J82j00K49k32J50l9L08k46j34j33
$$ plain form
4095 -160 -151 -142 34 -28 -131 -129 -11 -139 55 138 -112 212 -140 1 152 -109 -92 146 -125 -256 -3 -273 62
4118 62 -51 -44 -392 20 179 219 -47 -9 99 -25 58 207 36 -99 54 -84 33 270 69 37 129 276 76
4141 76 -161 -171 117 -93 228 -191 229 -29 -75 -107 -66 25 27 75 -37 -248 -154 -37 26 -8 28 140 -135 134
4165 134 -23 28 74 -34 13 54 -91 -170 343 -215 -76 -326 3 -125 83 -175 -107 137 -7 203 185 -76
4187 -76 -171 135 51 71 30 19 39 -60 -218 -94 149 377 105 169 95 -114 -265 92 -76 303 38 -46 -171 16
4211 16 -3 -48 123 261 35 -132 34 -63 103 134 -301 39 -57 -88 -60 -141 -5 27 -196 345 -62 -41 66 219
4235 219 -12 22 -349 45 181 105 67 -325 -106 -226 -126 -108 -26 118 216 -87 -77 -104 -24 291 110 -271 60
4258 60 49 -127 -56 -167 -57 79 246 -121 -184 64 -33 -219 -43 308 83 -197 -356 331 -142 30 -31 114
$$ packed form
4095a60RRJ76o2j03KJ18j28J94Q3k50L24l52J41J51k61J7K38k71j31K53k70L35
4118F2j13Pl48M12J59M0k66L8J08j24Q3J49j71j35J53j38J17K37k01l2R2J47k00
4141G6k37j0K88k10L21m19M20k58m6l2M1R1KM8j12k11R4J17O3l4L6J12k75K69
4165A34j57N1M6j08M7M1j45p9N13n58J39k50L29j28K08k58O8K44j44K10j8k61
4187g6r5L06q4K0m1j1K0r9j58J24K43K28k72O4p4k09j51L57j68L79k65q4j25J87
4211A6j9m5J71J38k26j67J66r7J66L1m35L40r6l1K8q1J36L2k23N41m07K1J07J53
4235B19k31L4l71L94J36p6l8l92K19j20J00J8Q2J44R8l03J0k7Q0L15j81l81L31
4258F0j1j76P1j11J10J36J67l67o3K48r7j86J76L51k25k80j59O87m73J72o1J45
$$ plain form
4280 114 -55 118 -29 -87 105 -12 55 -88 -364 -182 104 -26 70 -17 98 -87 -49 218 -301 -182 63 34
4302 34 6 -98 67 70 3 118 59 -179 22 58 -58 -212 55 327 -7 -148 -25 148 120 -127 -48 54 -23
4325 -23 -86 -154 -59 55 -275 176 -18 112 118 -220 64 123 -25 107 21 -282 -131 134 258 12 40 -199 -305
4348 -305 347 -36 -105 -146 -45 103 219 -169 89 29 154 309 125 53 221 120 81 51 212 -68 -31 -1 223
4371 223 108 -15 44 -111 -9 -254 76 5 -197 -118 58 -38 22 104 -21 -304 6 -10 -319 133 -134 -142 -104
4394 -104 79 87 54 138 -361 -145 -131 2 158 85 102 142 -111 -130 41 202 -153 -135 -120 184 -82 -61 10 -71 -90
4419 -90 448 16 25 -178 -50 -47 -58 -57 -64 -265 98 3 -164 -286 -141 242 137 33 290 58 -26 223 -20 40
4443 40 96 22 -171 -24 -110 187 -203 209 95 -11 -57 -28 -176 49 -30 -8 -96 -136 -137 -164 137 -9 159 12
$$ packed form
4280A14j69J73j47n8J92j17O7j43k76J82K86j30R6q7J15j85L8K67n19J19K45k9
4302C4k8j04J65Lo7J15n9k38K01L6j16j54K67K72l34j41J23J73k8k47P9J02p7
4325b3o3o8R5J14l30M51j94J30Ol38K84N9j48J32q6l03J51K65J24k46K8k39j06
4348c05O52l83o9m1J01J48J16l88K58o0J25J55j84p2J68j01l9l0J61k80L7L0K24
4371B23j15j23N9j55J02k45L30p1k02P9J76r6O0Q2j25k83L10j6l09M52k67qL8
4394a04J83Ql3Q4m99K16J4J33J56p3J7M0k53j9J71J61l55J8J5L04k66K1P1q1j9
4419i0N38m32Rk03J28Lj1Jpk01L63r5j67j22J45L83j05j04K57k32q4K49k43O0
4443D0N6p4j93J47q6K97l90M12j14j06m6K9j48K25p9K2q8m0jk7L01j46J68j47
$$ plain form
4467 12 188 395 51 -142 22 -177 -264 -46 -32 162 -73 -31 -148 -38 120 169 -345 28 43 -133 -26 -247
4489 -247 5 -179 62 -159 -104 -22 -175 -129 0 -10 184 122 211 -27 318 -306 -17 -138 -56 103 -104 -362
4511 -362 -22 4 -28 -151 -88 -187 39 -110 58 -96 7 -30 182 -257 101 -192 -214 -263 -46 38 -228 -138 157
4534 157 284 -309 117 -331 19 -158 138 -81 249 -151 35 41 -68 95 -211 202 14 248 -175 -72 127
4555 127 -6 155 -51 -24 235 46 28 -40 -54 137 131 -386 -19 205 44 -100 6 176 102 -59 -126 -146 -157
4578 -157 127 -82 -205 -155 63 66 -300 -91 -17 -135 25 63 48 -131 21 -224 -23 42 -29 -42 -102 72 -83
4601 -83 -41 -68 -58 -56 -89 -46 56 39 223 26 -12 -132 144 278 -41 -85 -4 84 194 -88 -30 54 -63 29 172
4626 172 -136 -223 110 -121 -135 -248 -244 74 -119 -129 -46 215 -75 242 34 -42 135 -263 -250 65 -200 -163 146
$$ packed form
4467A2J76K07l44j93J64j99q7K18J4J94k35M2j17J10J58M9n14L73J5j76J07k21
4489b47K52j84K41k21N5Q2j53M6J29j0J94o2Q9k38L45o24K89j21Q2J59k07k58
4511c62L40K6l2j23O3r9K26j49J68j54J03l7K12m39L58k93k2m9K17Q4k66R0K95
4534A57J27n93M26m48L50j77K96k19L30m00J86Oj09J63l06M13j88K34m23J03J99
4555A27j33J61k06K7K59j89j8o8j4J91on17L67K24j61j44J06J70p4j61o7k0j1
4578a57K84k09j23N0K18Ll66K09P4j18J60L8j5j79J52k45K01O5p1j3o0J74j55
4601h3M2k7J0Kl3M3J02j7J84j97l8j20K76J34l19m4Q1Q8J10k82N8Q4j17R2J43
4626A72l08q7L33k31j4j13ML18j93j0Q3K61k90L17k08p6J77l98J3L15k65L7L09
$$ plain form
4649 146 7 18 -253 -241 -180 109 -169 -150 -22 79 -87 -119 13 77 122 35 -90 -49 -14 79 -10 11 -60 120 -125
4674 -125 -102 70 -182 -66 -227 325 113 92 208 49 -76 -73 82 -78 18 -82 180 126 -68 -251 -10 28
4696 28 178 -64 144 30 -298 48 -159 -70 -163 -91 38 33 -37 -118 52 46 -131 -92 -62 -4 50 167 74 -2 -51 20
4722 20 -170 91 21 162 -136 -187 -23 175 -33 242 98 -162 23 5 36 51 41 20 -149 -56 67 -256 -72
4745 -72 -246 102 -162 -205 10 202 -40 -36 -118 -31 -1 263 -293 303 -24 -42 -100 -246 -201 -260 -220 132 208 69
4769 69 -136 98 -5 -76 -78 17 -95 258 30 22 98 178 155 129 20 144 32 17 -233 -24 -115 104 144 -188 -38
4794 -38 -135 -40 -13 50 -40 128 -197 138 16 -164 -11 -19 35 1 60 64 41 94 27 171 17 30 59 97 53 -163 -75
4821 -75 -87 287 62 -74 240 6 -125 179 -247 -96 65 120 171 10 -81 -281 145 110 106 -28 160 59 119
$$ packed form
4649A46j39J1k71J2O1K89k78J9J28J01j66l2J32O4M5q7j25M1L5R3q9K1p1J80k45
4674a25K3J72k52J16j61N52k12k1J16j59j25LJ55j60R6j00K62n4j94j83K41L8
4696B8J50k42K08j14l28L46k07Q9r3P2J29np0q1J70oj77L9L0N8N4J17r3p6m9P1
4722B0j90K61p0J41k98n1J64J98k08K75j44k60J85j8L1J5j0k1j69R3J23l23J84
4745g2j74L48k64m3K15J92k42Mq2Q7L0K64n56N96l27j8n8j46M5n9M0L52P6j39
4769F9k05K34j03p1kR5j12L53k28qP6Q0k3k6j09J24j12j5k50K09r1K19M0l32J50
4794c8r7R5K7O3r0J68l25L35j22j80J53qN4l4N9Mk3N3o7J44j54J3K9L8m4k16Q8
4821g5j2L74k25j36L14k34j31L04m26J51J61N5N1j61r1k00M26l5mj34J88j01O0
$$ plain form
4844 119 -26 158 -200 -175 -137 -75 -194 -6 -87 -67 -374 23 -178 244 395 152 -274 -33 -99 60 -80 -135
4866 -135 -168 -112 -19 -185 33 -199 81 -117 85 2 -70 149 -39 201 -280 131 19 -294 -73 -124 245 39
4888 39 64 203 -181 -48 -112 -112 67 -109 102 -87 192 8 131 254 26 -62 84 -170 -148 18 29 -272 181
4911 181 75 -30 -71 75 163 -29 80 -165 56 24 289 -36 72 12 28 31 -32 135 -151 -255 -91 -132 -63
4934 -63 103 -28 181 293 -117 92 65 -43 101 -56 39 -61 194 107 65 -102 309 189 77 -81 -147 -49
4956 -49 7 93 -1 258 -276 -12 -155 126 -258 -165 77 -111 25 -180 -101 52 -212 -125 -83 -1 108 -213 -176
4979 -176 -322 -59 -81 119 -111 178 144 244 -10 -111 287 110 179 247 -366 370 -50 90 -334 -5 -6 -13 217
5002 217 -249 100 -4 -40 40 32 -230 22 119 61 -63 222 -25 16 5 114 -157 -391 -98 -70 4 -100 -75 94
$$ packed form
4844A19j45J84l58K5L8O2j19J88q1K0l07L97k01M22J51k43m26K41o6J59j40n5
4866a35l3N6R3j66K18k32K80j98K02q3p2K19j88K40m81M11j12l13K21n1L69k06
4888C9K5J39l84J33o4%J79j76K11j89K79j84J23J23k28q8J46k54K2J66J1l01M53
4911A81j06j05m1J46Q8j92J09k45K21l2K65l25J08o0J6Lo3J67k86j04J64m1O9
4934f3J66j31K09J12m10K09k7j08J44j57R5j00K55q7m2j67M11j20j12j58o6R8
4956d9N6Q6r4K59n34K64j43K81l84R3K42j88J36k05P9J53k64Q7M2Q2J09l21L7
4979a76j46K63k2K00k30K89l4J00k54j01L98j77O9O8o13P36m20J40m24L29jpK30
5002B17m66L49j04l6Q0qk62K52R7n8j24K85k47M1j1J09k71k34K93K8P4j04K5J69
$$ plain form
5026 94 -119 63 -52 -177 -206 197 -2 -96 9 -55 124 92 93 354 -14 -30 -98 -36 98 -115 12 -119 -96 -103
5050 -103 -29 -101 58 -162 -102 271 73 83 119 308 -46 205 81 2 -114 45 16 -42 101 55 328 98 -168
5073 -168 98 -167 -299 59 18 42 197 95 392 -268 47 374 -122 42 97 -98 63 137 26 39 -53 -2
5095 -2 -172 175 131 116 -24 329 111 301 -4 4 7 -274 -217 17 127 125 -173 110 15 -163 43 96 -14 -191
5119 -191 -186 13 -44 -171 126 146 246 -147 103 61 -126 144 -17 239 134 -29 -189 -267 -257 -171 -165 -227 41 -279
5143 -279 317 45 241 -31 -45 161 -29 45 -45 8 -227 239 73 56 -140 254 -247 -82 -245 170 113 -170
5165 -170 104 364 -119 -27 44 364 -90 -112 30 209 55 106 111 -189 -152 187 -191 -155 -216 188 -283 -375 -20
5188 -20 -73 -71 151 -331 55 -128 -92 63 129 -133 -165 23 85 8 -179 -46 -115 -143 159 35 -280 62 -104 -235
$$ packed form
5026I4k13J82j15j25k9M03j99r4J05o4J79l2JK61l68j6o8O2J34k13J27j31K3p
5050a03P4p2J59k20O0L73j98J0L6J89l54K51j24p9j16J59k9n8J43m6K73k30k66
5073a68K66k65j32L58m1K4J55j02K97o60L15L27m96J64N5j95J61P4j11J3r2N1
5095bj70L47m4j5j40L53k18J90l05QLk81N7K34J10kk98K83r5j78K06N3j10j77
5119a91NJ99n7j27K97K0J00l93K50m2j87K70j61K56j05j63j60p8J0Q6Oo2K68l20
5143b79N96k72J96k72j4K06j90P4r0N3k35M66j66j7j96L94n01J65j63M15n7k83
5165a70K74K60m83R2P1L20m54k2J42J79j54N1Nl00L7L39l78L6o1M04m71r2L55
5188b0n3KK22m82L86j83L6J55O6k62l2J88O2p7j87J33o9k8L02j24l15L42j66j31
$$ plain form
5212 -235 -233 131 51 -120 4 442 -127 -298 40 -251 -407 286 -72 -384 48 166 92 213 -132 -103 -13 126
5234 126 197 43 -113 43 101 46 -163 152 60 5 146 3 -65 7 100 190 -151 205 -2 357 -83 -165 48
5257 48 -125 -67 -190 -181 -86 98 -19 -50 -184 -16 -114 -96 -93 295 232 132 333 39 156 -20 55 -91 70 66 -239
5282 -239 138 -11 316 -36 -45 206 -58 -6 105 -137 55 -182 105 -40 112 -93 -22 130 -36 17 -196 24
5304 24 18 -241 -98 51 216 253 36 114 9 -13 248 -42 227 -91 17 179 -237 143 64 10 155 -153 91
5327 91 -197 -207 126 34 262 299 57 207 -111 76 50 -86 198 133 -103 3 -223 168 -317 -19 50 22 -107
5350 -107 -71 26 -87 -179 -7 -151 123 26 -58 14 -25 -43 34 259 54 18 113 -229 353 -388 -98 36 -105 48
5374 48 -306 199 -302 4 -162 -187 197 -49 -22 47 217 -118 174 248 -147 -16 -94 63 175 70 65 -268 -37
$$ packed form
5212b35KL64q0j71J24M38n69j71L38k91j56O93l58l12M32J18p4J21l45K9R0J39
5234A26P1j54j56J56N8n5k09L15r2n5J41j43o8P2R3R0l41L56k07L59m40q2K13
5257D8j73N8j23RR5J84j17l1j34J68r8J8LL88o3j00K01k94J17j76P5j46J61ml05
5282b39L77j49L27l52rK51k64N2J11k42J92k37K87j45J52k05P1J52j66N3k13K20
5304B4ok59J43J49J65L7k17P8j05k2K61k90K69l18J08J62m16L80p9n4J45l08K44
5327I1k88j0L33r2K28L7k42J50l18J87k6j36K84o5k36J06k26L91m85K98O9k8j29
5350a07L6R7j13r2J72j44K74r7q4P2l9j8P7K25k05l6R5l42N82p41K90J34j41J53
5374D8l54N05n01L06j66k5L84k46K7O9J70l35K92P4l95J31p8J57J12j05nl33K31
$$ plain form
5397 -37 250 184 196 26 2 -95 57 146 -88 -84 86 138 364 86 112 -44 12 5 43 -50 -3 185 -59 -91 80 -162
5423 -162 103 -64 -162 -105 -61 -164 -248 64 -262 227 168 -166 -83 235 -151 -15 -125 147 -59 -63 -231 128 -59
5446 -59 -129 272 236 9 236 -83 -158 379 -245 -309 -13 275 -55 -81 4 70 -45 11 292 -55 43 183 -122
5469 -122 154 7 -248 -46 27 -161 -47 -280 -86 41 103 -35 -146 99 21 -257 -84 -5 102 124 -286 5
5491 5 221 179 57 106 -29 -128 73 -71 25 150 31 195 -147 145 11 89 202 -144 79 -39 191 -19
5513 -19 -64 2 121 -20 192 -148 139 -50 137 59 110 -53 -66 151 -131 174 191 76 216 54 99 86 194
5536 194 -66 -42 513 256 -242 -1 17 -66 -304 34 -70 -179 -181 91 -22 28 -121 -133 -354 -30 -73 95 67
5559 67 115 -4 -77 110 244 40 -203 36 -51 165 -189 -88 -101 148 24 -5 144 148 127 -33 -38 -349 49 15
$$ packed form
5397c7K87o6J2j70k4r7J52Q9k34MJ70N2K26k78K6j56N6pL8r3M7J88k44l2J71k42
5423a62K65j67r8N7M4j03q4L12l26M89n9l34Q3L18l86J36j10K72k06mj68L59j87
5446e9p0M01l6k27K27l19p5N37o24o4K96K88l30k6Q5O6j15N6K81l47R8J40l05
5469a22K76j47k55K02P3j88J14k33J94J27O2j38j11K45p8k78J73P9J07K2m10K91
5491EK16m2j22M9j35r9K01j44R6J25j19J64l42K92j34P8J13l46K23j18K30k10
5513a9m5O6J19j41K12l40K87j89J87p8N1j63j3K17k82L05J7j15J40j62M5j3J08
5536A94k60K4N55k57m98K41J8q3k38L38j04j09kK72j13N0j49j2k21L24m3J68k8
5559F7M8j19p3J87J34k04k43K39q7K16l54J01j3K49j24k9J49Mk1j60nl11L98l4
$$ plain form
5583 15 35 -42 48 -381 -22 -116 -116 214 -266 0 51 -56 130 -107 143 -237 -111 -150 -195 253 -127 271 95
5606 95 140 152 338 -14 347 145 -33 41 156 37 39 -148 -136 121 378 280 -44 -14 17 109 191 -274 -85 30
5630 30 51 120 127 381 -201 211 -166 265 -65 51 94 108 49 89 300 29 -16 97 38 344 139 181 -82 55
5654 55 105 -204 5 -78 -268 137 27 -39 -81 -49 94 -12 131 -36 110 219 -126 10 409 -115 -267 -135
5676 -135 84 -80 75 -396 -215 -6 158 59 -168 -4 -135 -240 -9 77 -165 117 26 192 -219 -143 -217 15
5698 15 -5 -125 114 144 -182 355 172 -30 -50 28 -33 -208 184 -34 63 94 -136 -172 80 417 17 279 19
5721 19 -198 77 2 -14 -68 41 147 9 -47 130 95 -11 -37 43 -123 36 37 -72 -224 0 47 69 44 -75
5745 -75 100 251 -172 52 233 -103 -239 -1 218 96 39 190 -8 99 55 -115 53 70 -95 -129 -60 153
$$ packed form
5583A5K0p7R0m29L59r4%L30m80K66N1j07J86k37K50l80J26l9m5M48l80L98j76
5606I5M5J2J86l52L61k02j78P4J15j19Kj87J2K57K57r8l24L0L1R2Q2m65J89J15
5630C0K1O9PK54n82M12l77M31l30J16M3J4n9M0K11k71m5J13n9L06k05M2k63J37
5654E5N0l09K09q3j90M05j10o6m2L2J43j06J43j67J46J09l45J36L99n24j52J32
5676a35K19j64J55m71J81K09J64r9k27J64j31j05K31Q6k42K82r1J66m11P6p4K32
5698A5k0j20K39L0l26N37j83k02k0P8o1j75L92k18R7L1k30l6K52L37m00K62k60
5721A9k17K75p5j6n4J09J06j38n6J77l5j06k6Q0j66J59Jj09j52K24M7K2k5j19
5745g5J75J51m23K24J81l36j36K38K19j22n7J51j98J07m4j70J68J7j65l4O9K13
$$ plain form
5767 153 -96 126 190 -182 -36 -75 -49 -13 -273 -118 118 -36 -208 -107 -142 -276 54 38 -71 -21 75 -93 3
5790 3 -41 137 -65 33 -91 241 29 201 43 -8 -258 -148 -42 70 -201 -66 -93 -158 47 26 -194 41 -130
5813 -130 -24 -14 -6 34 -110 101 -8 41 -65 40 84 172 -154 2 -97 41 -58 -142 74 41 -48 185 14 274
5837 274 -78 179 80 191 -52 -4 99 -305 39 25 -18 27 -25 -177 95 -124 -61 -139 233 -68 197 73 -192
5860 -192 157 -17 -140 -184 -90 30 -131 165 -106 83 174 -74 193 131 109 17 169 -115 -111 -10 44 103 145 -178
5884 -178 -56 -113 -17 6 -165 -174 69 79 213 -164 -167 -77 -124 120 -153 324 247 349 229 151 -120 -4 -43 -7 129
5909 129 -30 -137 -1 -192 -43 147 -79 50 -139 -26 182 153 103 -130 46 198 32 179 485 26 161
5930 161 135 -140 -35 -76 60 -160 142 -107 178 138 -21 104 -22 145 -203 208 190 180 -95 204 52 60
$$ packed form
5767A53k49K22O4l72J46l9K6L6k60J55K36j54j72J01l5j34L30j6j09N0R6j68R6
5790Cm4J78k02R8j24L32k12J72j58n1k50J10J06J12k71J35k7o5K05k1k20K35j71
5813a30J06J0QM0j44K11j09M9j06J05M4Q8l26J56r9J38r9q4K16l3q9K33j71K60
5837B74l52K57r9J11k43M8J03m04L44j4m3M5n2j52K72k19O3p8L72l01K65j24k65
5860a92L49j74j23m4R4J20j61K96k71J89R1k48K67o2k2r2J52k84MJ01N4N9M2l23
5884a78J22n7R6K3j71rK43J0J34l77lR0m7K44k73M77p7J02j20p8k71J16l9L6J36
5909A29j59j07J36j91J49J90k26J29j89J13K08k9n0k33J76J52j66J47L06m59J35
5930A61k6k75J05m1J36k20L02k49K85m0j59J25j26J67l48M11j8j0k75K99j52Q
$$ plain form
5952 60 -17 206 40 -236 -105 55 -183 -151 -96 -6 -1 6 191 138 133 -196 -19 -240 -66 -99 -29 -350 -202 -114 80
5977 80 -25 35 10 -105 59 -50 -19 -165 -65 41 -137 -249 190 -109 -70 -273 102 250 -128 156 -61 221
5999 221 83 -36 133 386 -127 118 151 -56 -76 42 362 -343 157 -116 -63 145 -289 -31 -126 -73 -21 94
6021 94 -101 23 -141 -110 -184 -304 -335 133 38 -59 105 -101 233 -56 167 125 -38 147 379 -91 240 -60
6043 -60 -27 60 -324 -16 -126 -109 79 53 -199 -228 -37 108 8 203 26 -220 42 160 34 -135 -29 -165
6065 -165 53 36 -20 -67 -44 125 -156 -17 69 -132 121 -127 -45 -267 97 -103 -108 -193 -46 27 -67 -59 232 -152
6089 -152 93 6 -79 160 114 -21 96 120 -23 116 -18 272 -255 138 232 67 -4 -53 -13 7 64 -50 109
6112 109 186 169 74 -184 -101 85 -56 -129 53 109 -73 260 49 -87 9 -80 23 -69 -160 -116 -123 204 140 -110 39
$$ packed form
5952F0p7K23j66k76J31J60k38L2N5R0NPJ85n3nl29J77k21J74l3P0l21J48Q8J94
5977H0j05O0k5j15J64j09L1j46J00J06j78j12M39k99L9k03L75J48l78K84k17K82
5999B21j38j19J69K53n13K45L3k07k0J18L20p05N00k73N3K08m34K58r5N3N2J15
6021I4j95J24j64L1p4j20l1M68r5r7J64k06L34k89K23m2j63J85K32m70L31l00
6043f0L3Q7l84L08j10J7J88k6k52k9J91J45j00J95j77k46K62J18j26j69J06j36
6065a65K18j7n6m7K3J69k81J39Q6k01K53k48Q2k22L64k00nq5J47P3r4QK91l84
6089a52K45q7q5K39m6j35J17K4j43J39j34K90n27L93R4j65p1m9M0K0N7j14J59
6112A09P7j7r5k58Q3J86j41p3J82N6j82L33k11j36R6q9J03r2r1M4pL27o4k50J49
$$ plain form
6137 39 -231 -157 -93 -50 -211 -129 -212 -305 -63 -141 -155 160 62 113 -161 95 313 -271 201 167 -130 78 203 -87
6161 -87 15 105 5 -31 201 82 277 -143 -251 -276 63 2 -43 -2 -83 111 -259 -24 -285 53 22 -136 43
6184 43 -118 2 216 44 -28 271 -115 -44 28 31 -109 61 -24 315 -107 83 110 -37 -60 -271 -291 -93 -118 -186
6208 -186 -230 226 90 84 32 22 -145 94 5 19 -1 -37 -58 56 -193 -205 100 181 -25 -77 -237 -83 -81 128 235
6233 235 -194 -237 -30 20 119 -63 161 59 10 148 152 78 292 5 -176 -243 309 -59 -10 176 -5 -171 125
6256 125 191 215 -144 6 140 29 -144 125 5 97 -167 -70 76 15 51 -108 -227 -198 58 76 -170 -63 -84
6279 -84 -12 11 -17 -9 -231 -168 -21 -197 -454 -229 -68 -17 -134 -21 -8 185 -31 110 237 -161 212 -30 -12
6302 -12 -25 -45 -32 88 275 -57 -108 -63 -41 9 -223 -217 250 91 119 -288 -24 -57 -185 -59 -56 216 241 1 -145
$$ packed form
6137C9k70P4O4M3j61Q2q3r3K42p8j4L15r8N1k74K56K18n84M72l4k97K08J25k90
6161h7J02R0j00l6K32j19J95m20j08k5L39o1m5M1q1J94l70K35k61L38l1j58J79
6184D3j61J20K14j72p2K99l86P1P2Lj40J70q5L39m22J90K7j47k3k11k0J98k5o8
6208a86m4M56j36on2j0j67K39q9J4k0l6k1J14k49j2L05Q1k06n2j60J54KK09J07
6233B35m29m3K07N0R9j82K24j02m9J38Mp4K14k87j81o7N52l68M9J86j81j66K96
6256A25O6K4l59J50J34j11j73K69j20R2k64R7J46o1L6j59j19K9K56J8k46J07k1
6279h4P2K3k8Qk22O3J47j76k57K25J61N1j17J13J3J93k16J41J27l98L73k42J8
6302a2j3k0J3J20J87l32n1M5K2N0k32OM67j59K8m07K64l3j28J26LK72K5k40j46
$$ plain form
6327 -145 52 287 -147 30 -98 100 101 398 18 -12 129 -63 98 -102 -213 -6 170 178 -74 14 60 254
6349 254 5 161 289 -164 393 85 69 44 -251 13 29 -385 155 4 -13 -216 182 -51 -18 155 -130 41
6371 41 116 10 -24 27 -209 193 -85 -35 -118 -82 -105 -188 -75 -99 46 -37 -158 41 57 -172 130 -143 -158 49
6395 49 -158 387 -148 -15 38 -173 -155 39 -65 235 275 -55 -14 109 -210 -59 85 159 52 -91 -296 230
6417 230 63 -58 -186 6 -105 -102 170 -137 -138 -103 157 -52 -234 42 273 -204 -186 -50 198 170 0 -2 -189
6440 -189 -98 -382 132 175 55 -69 52 49 15 -147 -220 14 -192 177 -29 37 -29 37 -34 -32 178 28 -67 20 -45
6465 -45 -51 122 71 77 71 83 -100 -61 98 127 -14 9 -295 -28 58 -193 -10 -103 -30 222 120 108 -66 3 -93 -108
6491 -108 -150 -48 -28 -108 -58 4 -7 -226 -47 -87 -4 6 92 40 -146 4 244 -193 41 -98 -99 -28 -97 -43 -270
$$ packed form
6327a45J97K35m34J77j28J98JK97l80l0J41j92J61k00j11K07J76Qk52Q8M6J94
6349B54k49J56J28m53N57l08j6k5k95K64J6m14N40j51j7k03L98k33L3J73k85J71
6371D1P5j06l4N1k36M02k78N0q3L6k3q3J13k4J45q3j21J99J6k29L02k73j5K07
6395D9k07N45n35J33N3k11J8J94j04L00M0l30M1J23l19J51J44P4j07j43k05N26
6417B30j67j21j28J92j11LK72l07jL5K60k09j82K76K31m77J8J36K48k8j70kj87
6440a89R1k84N14M3j20j24J21ll4j62p3K34k06L69k06O6o6O6p1KK10j50r5Q7o5
6465d5oJ73n1OoJ2j83L9J59K9j41K3l04K67Q6k51J83r3P3K52j02j2j74O9r6j5
6491a08m2J02K0q0N0O2j1k19J79m0Q3J0Q6n2j86J50K40m37K34j39jP1o9N4k27
$$ plain form
6516 -270 -226 27 -57 -218 -298 114 -179 12 -71 -115 76 -189 24 72 169 -74 180 -162 93 -106 27 -121
6538 -121 -113 -9 -266 0 77 153 3 -138 7 162 -70 353 -87 217 -108 -151 -80 102 12 -149 180 -37
6560 -37 -25 -57 -172 88 -9 90 -81 32 10 91 59 175 -6 -69 -157 -87 -90 67 98 -15 -44 209 256 -99 -96 35
6586 35 -117 15 -60 -121 -73 94 288 299 -231 27 51 102 -114 -63 -221 1 -60 205 -104 -182 69 211 -246
6609 -246 69 40 65 20 -1 191 -356 77 24 -123 -20 86 6 8 0 102 -66 -221 48 165 -118 -66 105 -84
6633 -84 116 -12 -40 -84 -96 -26 -126 151 -155 -7 67 275 284 147 -29 -337 108 -93 76 161 54 241 150
6656 150 96 65 -50 271 -233 31 100 -124 14 -13 -352 23 224 -32 -13 87 319 -72 59 -14 -105 -22 -17
6679 -17 -105 104 -195 5 55 248 -143 33 48 80 -142 -97 -62 79 -171 -11 -107 211 -7 -170 -10 130 186
$$ packed form
6516b70M4K53q4j61q0M12k93J91q3m4J91k65K13M8R7k43K54l42K55j99J33j48
6538a21QJ04k57K66P7P6j50j41J45J55k32M23m40L04l25m3P1J82r0j61L29k17
6560c7J2l2j15K60r7R9j71J13k2Q1l2J16j81o3q8P0lJ57L1j13k9K53M7l55LJ31
6586C5j52J32p5o1M8J67J94J1n30K58K4N1k16N1j58K22o1K65l09p8K51J42m57
6609b46L15k9K5m5k1J92n47M33n3j47J03J06q0KqJ02j68j55K69J17k83N2J71j89
6633h4K00j28k8m4j2P0j00K77l06J48P4K08Rj37j76l08M45k01J69Q5j07J87r1
6656A50n4l1j15L21n04K64O9k24J38k7l39L75K01k56J9J00K32l91J31p3r1Q3N
6679a7q8K09k99K00N0J93l91J76J5L2k22M5L5J41k50J60r6L18k18j63J60J40N6
$$ plain form
6702 186 266 229 -138 -148 36 19 50 11 -351 -29 37 2 140 104 -138 242 -239 55 164 -117 29 163 167 184
6726 184 21 -115 -70 -128 295 7 -304 -103 200 85 2 -31 -170 239 56 -65 -227 223 172 -79 92 125
6748 125 -148 -48 -13 57 -121 200 309 105 94 -132 -109 49 0 50 202 76 -209 -172 94 -50 -101 -68 45
6771 45 -106 145 104 327 269 209 -33 122 132 36 115 -112 -165 375 -135 23 -125 120 -63 -66 -67 -60 180 17 -27
6796 -27 -151 -91 78 -61 -42 -95 -112 -5 -145 -254 324 259 -199 149 268 335 -14 34 -261 22 -21 160 -128
6819 -128 -11 -14 47 -26 157 -230 30 98 307 -108 6 -411 -37 -203 -47 -23 40 143 185 -220 -335 228 -51
6842 -51 80 79 -11 182 118 -87 -254 -320 -132 16 -155 48 -60 -20 -75 85 -55 -129 136 -216 40 125 111 -99
6866 -99 29 -92 -19 -41 -79 -38 -79 -32 -209 -52 183 236 -33 -97 26 70 -135 -144 282 45 -183 171 121 -2
$$ packed form
6702A86Q0l7l67j0J84j7L1l9l62L22O6l5J38l6k42L80m81K94J09k81J46J34MJ7
6726A84j63j36M5n8M23k88l11K01L03j15q3l3j39M09j83j21j62M50n1k51J71L3
6748A25k73J00L5P0j78L21J09k04j1k26K3J58m9N0J52j26k85L7K66j44n1L3J13
6771D5j51K51m1K23n8o0k42J55J0r6P9k27n3N40n10J58j48K45j83ljPK40j63m4
6796b7j24O0J69j39J9n3j7J07j40j09N78o5m58L48J19O7l49M8k95K83m3J81k88
6819a28J17lO1p3J83l87K60O8K09m15J14m17L74j66J56K4O3J03M2m05j15N63k79
6842e1J31jr0J93o4k05j67o6J88J48j71K03j08M0n5J60j40p4K65l52K56Q5j4k10
6866i9J28j21P3k2l8M1m1M7j77J57K35N3k69o4J23M4k05rM26k37k28L54n0j23
$$ plain form
6890 -2 107 -72 -81 -174 -248 127 286 59 -32 116 -48 -210 -11 -78 188 -309 85 15 38 -58 -209 96 -51 -67
6914 -67 108 95 -127 98 54 -96 -191 203 -11 144 141 -165 44 28 -133 -164 -253 45 -189 95 148 -108 53
6937 53 -109 27 -167 137 -33 42 -201 -12 57 83 123 211 -94 -47 224 258 148 -93 -189 88 -345 -94 166
6960 166 235 24 41 -157 -60 -50 293 -15 88 -224 42 -16 156 -58 -275 129 -86 35 20 -86 -110 151
6982 151 218 71 -126 -178 20 -100 -76 -9 97 -168 95 -179 13 33 -14 171 -170 -60 -89 -256 -177 163 139
7005 139 160 252 343 98 166 -8 123 -13 165 74 -40 -13 -15 -245 22 -141 -362 -38 -163 174 -51 -34 -82
7028 -82 78 83 22 234 83 -118 55 -75 -156 -225 -59 -239 104 -99 186 89 122 76 -265 -139 -2 -236 121
7051 121 195 77 -82 166 -313 146 25 -292 146 125 -20 -30 -113 -32 29 101 143 -172 -93 -40 34 67 7 66 256
$$ packed form
6890bJ09j79rr3p4L75J59k27r1J48j64j62J99o7K66m97L94p0K3r6j51L05j47j6
6914f7J75j3k22K25m4j50r5L94k14J55ll06K09j6j61l1q9K98k34K84N3k56J61
6937E3j62J36j94L04j70P5k43J89O9K6M0Q8l05M7K71L4j10k41r6K77m33K51K60
6960A66O9k11J7j98R7J0L43l08J03l12K66n8J72k14k17M04k15J21j5j06k4K61
6982A51O7j47j97n2J98j20K4O7J06k65K63k74J92K0m7J85l41J10k9j67P9L40k4
7005A39K1R2R1k45O8j74J31j36J78r1j14K7kk30K67j63k21L24j25L37k25J7m8
7028h2J60No1K12j51k01J73j30q1o9J66j80L43k03K85r7L3m6l41J26J37k34L57
7051A21P4j18j59K48m79M59j21l17M38k1j45j0q3Q1O1P2M2l15P9N3P4L3o0N9J90
$$ plain form
7076 256 -65 -70 -163 -140 59 96 -118 -20 -95 251 -37 41 112 -198 -185 167 75 -62 78 41 -187 -118 28 -271
7100 -271 123 75 105 18 147 -280 309 180 22 85 -153 98 136 -168 -210 296 72 88 -57 96 -58 312
7122 312 238 2 168 201 50 13 125 -61 -117 261 39 -105 -70 46 132 290 -161 -56 248 -256 76 -35
7144 -35 -268 -30 296 -47 -39 16 57 59 -244 68 90 -256 201 176 -238 -143 -31 115 10 -89 -55 196 -161 -147
7168 -147 41 -111 -8 19 15 -23 183 -11 18 230 57 122 149 -8 -97 -3 -88 40 -55 51 32 166 -161 -16
7192 -16 -10 111 78 40 186 161 140 319 -77 65 -32 -43 248 -65 -9 -81 -1 -197 -214 -373 96 86 4 81 194
7217 194 320 50 24 64 203 45 62 -36 -40 352 -200 -40 -67 -163 -51 4 -35 -22 263 25 93 -35 252 -159
7241 -159 -183 190 94 -180 -113 27 205 236 -176 -163 -138 -24 69 -94 113 -172 -92 -24 164 -140 57 -169 -83
$$ packed form
7076B56l21nr3K3J99L7k14R8p5L46k88P8P1l10J3L52r2j37J40l7k28O9J46k99
7100b71L94m8L0q7J29m27N89j29j58O3k38K51L8l04m2N06k24J6j45J53j54L70
7122C12p4k36J66L3j51l7J12j86n6L78k22j44L5J16Q6J58m51J05L04n04L32j11
7144c5k33K38L26l43QN5M1Kl03L12K2l46M57k5m14R5J12J46j05r9L4K51l57J4
7168a47J88j52J03K7ml8K06j94K9K12j73O5K7j57q9R4q5J28r5J06j9J34l27J45
7192a6OJ21l3l8J46k5k1J79l96J42r7j1K91l13N6p2Q0j96j7j59M69j0q2P7J13
7217A94J26k70k6M0J39j58J7r8mL92n52J60k7r6J12N5l9J3K85k38O8j28K87m11
7241a59k4L73r6k74O7J40J78L1m12J3K5J14R3j63K07k85Q0O8J88l04J97k26Q6
$$ plain form
7264 -83 215 -206 78 107 -11 -15 -214 -360 -62 -80 -157 -14 184 11 86 26 95 107 74 -16 219 190 122 -19 267
7289 267 -137 -123 -170 22 -10 -94 182 -29 40 21 56 1 -192 -2 51 67 116 -182 -82 95 -14 94 96 122 -37
7314 -37 -47 69 161 -47 42 15 126 -318 250 239 -208 101 -141 124 283 23 37 94 318 -33 -85 -36 28 -192
7338 -192 330 404 -119 -10 -134 -12 -235 80 103 199 -26 56 -19 62 82 70 4 -271 -16 -70 -226 97 -72
7361 -72 -20 144 -102 143 115 147 108 257 -4 49 27 68 41 -41 -179 166 -52 40 -118 75 204 -234 -32 -196
7385 -196 -115 -112 166 -43 -204 1 -353 179 -149 -13 76 -101 -60 -217 -101 -203 32 -48 -185 -84 -71 44
7407 44 -179 -122 -9 128 102 -139 154 220 108 -202 27 -127 209 109 155 170 -231 -246 66 289 307 111 20
7430 20 48 -82 -31 132 113 114 33 -289 -161 -153 -236 22 -107 21 108 81 164 97 -268 154 -156 29 22 249 75
$$ packed form
7264h3K98m21K84K9j18mj99j46K98j8p7J43J98j73P5o0O9J2l3r0K35k9o8j41K86
7289B67m04J4m7J92l2q4K76k11O9j9L5n5j93J90N3J6M9k98J00J77j09J08KK6j59
7314c7j0J16R2k08Q9k7J11m44N68j1m47L09k42K65J59k60J4N7K24l51n2M9O4k20
7338a92N22P4n23J09j24J22k23L15K3R6k25Q2p5Q1K0j2o6k75K55n4j56L23j69
7361g2N2J64k46K45k8L2l9J49k61N3k2M1k7q2j38L45k18R2j58J93J29m38K02j64
7385a96Q1LK78k09j61K05l54N32l28J36Q9j77M1j57J16j02K35q0j37J01J3J15
7407D4k23N7J13J37k6k41K93O6j12l10K29j54L36j00M6J5m01j5L12K23J8j96r1
7430B0K8j30N1J63j9Jq1l22J28Qq3K58j29J28Q7k7Q3o7l65M22l10J85pK27j74
$$ plain form
7455 75 -279 -193 -38 -173 25 -98 93 -102 19 -238 25 -341 -185 -154 32 36 -209 45 7 33 -55 -35 70
7478 70 24 279 145 -75 -234 147 115 78 29 -180 -44 24 -73 228 185 99 200 208 -64 95 -68 198 106 -200
7502 -200 38 -246 137 22 -7 -36 167 159 -74 188 -96 126 -29 6 -53 150 -98 -105 128 -144 -19 -98 165
7525 165 -133 -9 40 -126 92 -96 164 -1 -34 164 277 35 -129 156 191 28 -249 -35 -82 71 57 111
7547 111 186 38 -14 3 -106 -91 72 128 225 31 89 -98 72 -109 -15 -10 84 73 -78 122 -37 -101 -67 81 -12
7572 -12 93 -17 -88 -136 177 110 11 255 -121 153 -68 -66 217 -275 4 3 37 -176 -182 45 -41 -49 -61 -153 -18 64
7598 64 -155 102 -61 -52 119 26 -70 311 400 -110 14 -89 -22 13 205 -111 -92 -119 0 9 76 56 17 -10 163
7623 163 -176 109 -167 -19 264 162 71 219 181 -50 85 -30 16 -82 -17 106 -263 28 -211 -184 294 -97
$$ packed form
7455G5l54Q6J55j35J98j23J91j95J21k57K63l66J56L1J86Mk45K54l8K6q8K0J05
7478G0m6K55j34k20j59L81l2l7m9k09J36O8r7L01m3q6J01Qk72J59j63K66r2l06
7502b00K38k84L83j15k9k9K03qk33K62k84K22j55L5n9K03k48pK33k72J25p9K63
7525A65k98J24M9j66K18j88K60j65l3J98J13k42j64K85L5j63k77K14m7J53j4N4
7547A11P5j48n2J7j09J5J63N6R7j94N8j87J70j81R4NR4j1j51K00j59o4L4J48r3
7572a2J05j10p1m8L13o7r9K44l76K74k21KK83m92K79jL4k13oK27q6qj2r2J35Q2
7598F4k19K57j63RJ71r3r6L81Q9n10J24j03O7L5J92l16J9k7J19RO7k0l9k7J73
7623A63l39K85k76J48K83j02r1J48l8k31J35j15M6r8O5J23l69K91k39K7M78l91
$$ plain form
7645 -97 -214 -316 60 5 -11 -115 98 33 -62 -25 -3 -71 73 42 147 182 96 -21 -141 -39 -29 -80 11 131 117
7670 117 -27 -52 -59 156 5 92 -163 -110 -12 135 -44 -7 59 32 -56 174 40 -2 215 -122 119 -153 42 -48
7694 -48 115 113 56 -84 154 15 415 222 91 210 -129 64 -221 -69 -116 31 -53 43 -28 -101 126 -65 -185
7717 -185 -205 100 -120 111 -128 -266 -75 -166 409 -217 -26 -110 -180 -92 66 -19 24 166 -125 48 -87 156
7739 156 -8 -19 90 356 -112 -73 13 -62 -61 -19 136 -159 129 -138 183 1 149 -175 -30 64 -42 243 -44
7762 -44 -69 147 -63 25 -288 -28 298 30 206 57 33 -304 -10 -120 161 24 57 -19 -133 48 122 -76
7784 -76 207 7 -113 229 -91 209 89 -202 -44 -70 -89 -79 55 134 -9 -176 184 -207 -33 188 167 7
7806 7 237 23 139 -155 -107 -126 119 119 -249 -112 268 -72 -43 184 175 -201 -155 -47 -112 338 -91 -123 91 83 -91
$$ packed form
7645i7j17j02L76n5j6j04K13o5r5L7K2o8J44l1J05L5q6j17j20J02J0n1R1J20j4
7670A17j44k5pK15j51Q7k55N3R8J47j79L7O6k7q8K30j34m2K17l37K41k72J95r0
7694d8J63kn7j40K38j39M00j93j31J19l39J93k85J52m7J47q4R6p1p3K27j91j20
7717a85k0L05k20K31k39j38J91r1N75o26J91q4p0Q8J58q5M3J42k91J73j35K43
7739A56j64j1J09K66m68L9Q6p5JM2J55k95K88k67L21j82J48l24J45R4j06K85k87
7762d4k5K16k10Q8l13K60L26k68J76j49k4l37K94j10K81j37L3p6j14J81P4j98
7784g6K83k00j20L42l20L00j20k91J58k6j9J0J34P9j43j67L60l91J74K21k1j60
7806GK30k14J16k94M8j9K45%l68J37L80l40K9K27rl76M6J08o5M50m29l2K14qj74
$$ plain form
7831 -91 -100 23 -38 140 138 -36 -83 50 -98 -305 -296 -202 -40 -60 107 30 -164 -147 -208 -48 -102 -144 -146 -22 -277 -187
7857 -187 -26 49 32 70 -145 -118 93 -189 -385 48 2 -106 -173 -91 -81 62 182 -204 -30 -244 -31 16 -18
7880 -18 333 76 78 -110 28 43 102 48 83 266 -61 109 -237 133 84 -55 103 166 -157 80 226 33 -230
7903 -230 -186 -98 55 -122 26 139 33 -2 105 56 196 114 -177 87 263 -51 -38 -253 -132 -75 -59 66 -45
7926 -45 220 -2 98 282 -263 98 75 117 -44 -131 -342 66 -226 18 269 181 260 27 91 -155 56 -134
7948 -134 62 -136 231 57 309 143 242 -71 -58 -231 73 3 70 33 -37 98 31 -157 -175 -91 28 -81 -169
7971 -169 101 88 28 -82 125 194 -206 29 -34 89 245 31 -226 4 -188 -81 -224 -64 237 112 -101
7992 -101 -266 31 158 48 58 -2 39 -224 243 -106 -223 112 163 -50 -43 33 -40 388 -343 -33 4 -18 -227
$$ packed form
7831i1rJ23o1J78kj74m7J33j48k07RR4J62k0J67p7j94J7o1J60n4m2kJ24k55R0
7857a87J61P5j7L8k15K7K11k82j96M33m6j08o7Q2J0J43J20l86J74k14K13M7l4
7880a8L51k57Kj88J38J5N9n4L5J83l27J70l46L70m9j39J58O3l23K37J46j93k63
7903b30M4Q8J53j77J48J13j06l5J07m9J40q2k91K64J76l14J3k15J21N7J6J25j11
7926d5K65k22J00J84n45L61k3M2j61q7k11M08k92K44K51q8P9k33O4k46K11j90
7948a34J96j98L67j74K52j66R9l13J3j73L04p0O7l7p0J35o7j88j8Q4J19j09q8
7971a69K70j3o0j10K07O9m00K35o3J23J56k14k57K30j92J07j43J60L01j25k13
7992a01j65K97J27j10J0o0M1k63M67l49j17L35N1k13PP6p3M28p31L10L7k2k09
$$ plain form
8015 -227 136 -213 -67 -50 66 -66 -258 36 -160 112 23 -38 5 80 -70 -127 20 384 0 153 1 -116
8037 -116 -211 -307 331 62 266 -45 -283 54 4 -42 102 28 218 -46 43 133 -206 -161 -153 59 54 -125 175 -15
8061 -15 90 334 57 128 -11 172 249 0 -207 -44 -71 182 -38 178 36 -184 -9 27 -65 152 -161 -9
8083 -9 -18 -36 273 232 -70 -371 -100 176 27 -68 78 -94 111 -169 -27 -143 168 101 301 43 -154 -118 -82
8106 -82 -27 59 -4 213 171 118 42 115 -67 105 -48 -139 436 -21 107 -268 19 121 69 107 -184 -90 -125 91
8130 91 -104 199 242 -34 -12 -170 123 244 51 71 -155 -1 -98 -165 101 -113 -52 -33 -141 45 80 219 -1
8153 -1 -280 0 -3 349 -77 160 59 -2 -192 67 44 -133 -337 -106 69 -48 -27 31 -259 228 -136 -22 54
8176 54 -85 -174 214 285 -46 -83 -220 -129 43 70 -33 20 229 -23 124
$$ packed form
8015b27L63l49J46J7J16j32j92K94j96K72q9o1M3P5j50n7J47L64l84J53j52j17
8037a16r5r6O38k69K04l11k38L37n0m6J44p4J90k64Q9R0l39M5QK12nj79L00j90
8061a5J05K44k77P1j39J83P7k49k07J63k7K53k20K16j42k20J75L6r2K17l13J52
8083irj8L09m1l02l01K71K76j49r5J46j72K05k80J42j16L11o7K00k58j97L6L6
8106h2N5Q6o3K17m2n3p6P3j82J72j53r1N75m57J28l75K87J02n2L8k91R4l5K16
8130I1j95L03M3k76K2j58K93J21j93K0k26J54r7o7K66k14O1J9j08J86L5J39k20
8153ak79K80lL52m26K37j01o1j90K59k3j77k04K31J75j17K1N8k90M87l64J14P6
8176E4j39q9L88P1l31l7j37R1J72K7j03N3K09k52J47
8191A24
$$ Imaginary data points
##PAGE= N=2
##DATA TABLE= (X++(I..I)), XYDATA
$$ plain form
0 0 0 0 0 0 0 0 0 0 0 -8 8 -8 8 -16 16 -24 32 -32 40 -56 64 -74 88 -104 121 -142 168 -192 222 -256 288 -332
32 -332 374 -425 481 -540 607 -679 760 -848 944 -1049 1163 -1289 1427 -1573 1739 -1914
48 -1914 2112 -2326 2562 -2825 3112 -3435 3796 -4201 4668 -5199 5817 -6551 7428 -8511
62 -8511 9874 -11660 14108 -17693 23479 -34375 62337 -301367 -513159 -30043 262377 567201
74 567201 610770 451305 85643 -240688 -513318 -576086 -435872 -123804 201730 483587
84 483587 562113 421917 136426 -165617 -442844 -549726 -427294 -148973 149337 416669
94 416669 532716 425197 154740 -142188 -393434 -500611 -407432 -165160 117512 365761
104 365761 477191 397045 178103 -90622 -339794 -461929 -391995 -186692 66853 313533
$$ packed form
0@%%%%%%%%%qJ6j6J6k4L2m0N6o4P2r6J20j38J62j92K25k63L10l60M14m78N44o20
32c32P06p99R06j021J147j286J439j608J792j993K212k452K716l000L312l653
48a914M026m438M888n387N937o547P231p997Q869r867J1016j2368J3979j5939
62h511J8385k1534K5768l1801M1172n7854R6712l63704k11792M83116K92420L04824
74E67201M3569j59465l65662l26331k72630o2768J40214L12068L25534K81857
84D83587P8526j40196k85491l02043k77227j06882J22432K78321K98310K67332
94D16669J16047j07519k70457k96928k51246j07177R3179K42272K82672K48249
104C65761J11430q0146k18942k68725k49172j22135O9934K05303K53545K46680
$$ plain form
114 313533 450235 396058 195950 -56222 -297078 -435865 -391793 -199199 48675 280169
124 280169 411472 378431 208059 -27625 -260103 -395343 -370215 -214019 8950 239245
134 239245 382677 365522 217508 6453 -216184 -366985 -366343 -226097 -16107 202483 352060
145 352060 359594 230338 24489 -189828 -333727 -345644 -232836 -41866 171169 320285
155 320285 338351 234931 55111 -152232 -306677 -334200 -236614 -63452 134876 289890
165 289890 329308 241770 71566 -124225 -275046 -318696 -243225 -80932 112328 261687 306797
176 306797 241315 92744 -96224 -250175 -300695 -239711 -98763 81279 235713 294899 240339
187 240339 103172 -70119 -220503 -286093 -242914 -110416 62040 209157 274759 239671 117550
$$ packed form
114C13533J36702n4177k00108k52172k40856j38787M4072J92594K47874K31494
124B80169J31303l3041j70372k35684k32478j35240K5128J56196K22969K30295
134B39245J43432j7155j48014k11055k22637j50801O42J40246K09990K18590J49577
145C52060P534j29256k05849k14317j43899j1917J12808J90970K13035J49116
155C20285J8066j03420j79820k07343j54445k7523R7586J73162J98328J55014
165B89890L9418q7538j70204j95791j50821m3650P5471J62293J93260J49359M5110
176C06797o5482j48571j88968j53951n0520O0984J40948J80042J54434N9186n4560
187B40339j37167j73291j50384o5590M3179J32498J72456J47117O5602l5088j22121
$$ plain form
198 117550 -50620 -198184 -265324 -235205 -123489 37145 186574 259723 233621 125789 -27702
209 -27702 -173042 -251520 -232543 -129005 20117 160543 240780 231169 134743 -12127 -151708
220 -151708 -230985 -225625 -138925 1771 141801 223312 221160 141185 8805 -129772 -216679
231 -216679 -219350 -142472 -15213 118065 206783 217237 145572 20667 -108767 -196718 -212737
242 -212737 -149278 -28283 101148 188736 206421 150128 36731 -91097 -181486 -202301 -149926
253 -149926 -43015 80387 173380 199571 150571 47075 -71398 -163441 -194926 -152094 -52586
264 -52586 64324 155167 189052 153201 58885 -57101 -148813 -183572 -151904 -64235 48264
275 48264 141904 179686 150460 67484 -40027 -133359 -175810 -150912 -70096 34251 125075 170031
$$ packed form
198A17550j68170j47564o7140L0119J11716J60634J49429P3149k6102j07832j53491
209b7702j45340p8478J8977J03538J49122J40426Q0237r611r6426j46870j39581
220a51708p9277N360Q6700J40696J40030Q1511k152p9975j32380j38577q6907
231b16679k671P6878J27259J33278Q8718J0454p1665j24905j29434q7951j6019
242b12737O3459J20995J29431Q7588J7685n6293j13397j27828r0389k0815N2375
253a49926J06911J23402R2993K6191m9000j03496j18473r2043l1485M2832R9508
264e2586J16910R0843L3885l5851r4316j15986r1712l4759L1668Q7669J12499
275D8264R3640L7782k9226q2976j07511r3332m2451K4898Q0816J04347R0824M4956
$$ plain form
287 170031 151106 74407 -29084 -118581 -163899 -149266 -78796 22050 112776 159068 146587
298 146587 81075 -14843 -105879 -155212 -145192 -82662 9286 97836 150365 145018 84628 -5063
310 -5063 -91567 -143955 -143190 -87661 681 86413 138518 140077 89891 5529 -80691 -134482 -137738
323 -137738 -90474 -10327 73804 130048 136216 91367 14387 -66936 -124246 -134656 -93542 -17794
335 -17794 61982 118418 131465 95162 22769 -57314 -114020 -127781 -95504 -27647 50870 109732
347 109732 125562 95259 30706 -45313 -104275 -123673 -96026 -33386 40189 98819 121040 96976
359 96976 36744 -36399 -94117 -117270 -97178 -40232 31796 90332 114213 96272 43446 -26631
371 -26631 -86273 -111969 -95755 -45046 21613 80652 109519 96118 47001 -18018 -75564 -105916
$$ packed form
287A70031j8925p6699j03491q9497m5318J4633P0470J00846R0726M6292j2481
298A46587o5512r5918r1036m9333J0020O2530R1948Q8550N2529n347o0390q9691
310e063q6504n2388P65N5529Q8342Q5732N2105J559n0186q4362q6220n3791l256
323a37738M7264Q0147Q4131N6244O168m4849p6980q1323n7310j0410M1114P5748
335a7794P9776N6436J3047l6303p2393q0083n6706j3761L2277O7857P8517N8862
347A09732J5830l0303o4553p6019n8962j9398K7647O2640P3575N8630K2221k4064
359I6976o0232p3143n7718k3153K0092N6946P2028N8536K3881j7941n2826p0077
371b6631n9642k5696J6214N0709O6659N9039K8867j3401m9117o5019n7546l0352
$$ plain form
383 -105916 -96275 -49645 14741 72277 102334 94638 52564 -10076 -68469 -99565 -93562 -53604
395 -53604 6102 64163 97330 92967 54344 -2842 -59185 -94095 -92575 -56113 121 55082
407 55082 90483 91789 58324 2925 -52383 -87256 -89752 -59672 -7402 48156 84965 88468 60042
420 60042 10533 -44038 -82131 -87849 -60688 -12674 39925 78235 86764 62202 14968 -36666
432 -36666 -74646 -84864 -63343 -18249 33468 71830 83155 63380 21360 -29707 -69320 -81838
444 -81838 -63518 -23512 25923 65806 80463 63927 25089 -22763 -62199 -78025 -64684 -27402
456 -27402 19811 59071 75910 64684 29954 -16443 -56415 -73595 -64463 -31612 13379 53688
468 53688 72322 63647 32951 -10246 -50316 -70762 -63773 -34232 7986 47020 67914 63638 35973
$$ packed form
383a05916R641M6630O4386N7536L0057p696m2074o2640n8393l1096O003L9958
395e3604N9706N8061L3167m363l8623n7186n6343l4910J520L6462N6234N4961
407E5082L5401J306l3465n5399n5308l4873k496L0080N2270N5558L6809L503k8426
420F0042m9509n4571l8093n718K7161M8014N2599L8310Q529k4562m7234n1634
432c6666l7980j0218K1521M5094N1717L8362J1325j9775m2020n1067l9613j2518
444h1838J8320M0006M9435L9883J4657j6536l8838m7852l9436j5826J3341L7282
456b7402M7213L9260J6839j1226l4730m6397l9972j7180R132L2851M4991M0309
468E3688J8634q675l0696m3197m0070k0446O989K9541M2218L9034K0894m276k7665
$$ plain form
481 35973 -5571 -44689 -65850 -62992 -37363 2656 42189 63980 62392 38659 117 -39069
493 -39069 -62627 -61879 -39039 -2052 35975 60304 61323 40329 4124 -33323 -57396 -60591 -41177
506 -41177 -6455 31308 55713 59412 42144 8865 -28289 -53918 -58358 -42399 -10846 25275
518 25275 51574 57925 42834 12190 -22962 -48927 -56684 -43990 -14145 20807 46636 55294 44398
531 44398 15984 -18416 -44987 -54198 -44462 -17888 15922 43191 53537 44278 19162 -13523 -40634
544 -40634 -52314 -44963 -20101 11707 38281 50762 44774 21593 -9943 -36459 -49337 -44683 -23285
557 -23285 7858 34788 47973 44144 23959 -5660 -32774 -46975 -43926 -24787 3915 30446
569 30446 45736 43875 25369 -2536 -28281 -43813 -43836 -26437 720 26588 42375 42634 27793
$$ packed form
481C5973m1544l9118k1161K858K5629M0019L9533K1791j588k3733l8542l9186
493c9069k3558P48K2840L6987L8027K4329J019k0994l6205l7447k4073l195J9414
506d1177L4722L7763K4405L699j7268l3279l7154k5629m440J5959L1553L6121
518B5275K6299O351j5091l0644l5152k5965p757J2694K9845L4952K5829Q658j0896
531D4398k8414l4400k6571r211R736K6574L3810K7269J0346r259k5116l2685k7111
544d0634j1680P351K4862L1808K6574J2481n988k3181l1536k6516j2878M654K1398
557b3285L1143K6930J3185l829k0185k9619k7114j4201L049J9139K8702K6531
569C0446J5290j861j8506k7905k5745j5532k3J7399K7157K5868J5787K59j4841
$$ plain form
582 27793 1379 -24861 -41632 -42505 -27980 -2931 22937 39794 42058 28396 3944 -20962 -38281
595 -38281 -41361 -28774 -5640 19067 36218 40764 29895 6883 -17402 -34966 -39772 -29944 -8738
608 -8738 15967 33748 39172 30405 9881 -13864 -32231 -38734 -30300 -10922 12381 30382 37785
621 37785 31004 11784 -10779 -28904 -37181 -31186 -13185 9431 27614 36040 30810 14216 -7513
634 -7513 -26622 -35541 -30488 -15059 6210 24995 34980 30879 15094 -5067 -23396 -33476 -31165
647 -31165 -16424 3832 22168 32301 30446 17297 -2244 -20981 -31517 -30339 -17606 1153
659 1153 19731 30695 30240 18166 39 -18104 -29318 -29728 -18476 -776 16915 28338 29781
672 29781 19510 2050 -15696 -27327 -28753 -19733 -3367 14047 26655 28301 19843 4254 -12716
$$ packed form
582B7793k6414k6240j6771q73J4525K5049K5868J6857K264j3662k4452k4906j7319
595c8281l080J2587K3134K4707J7151M546j0869k3012k4285j7564m806R828K1206
608h738K4705J7781N424q767k0524k3745j8367o503Q434J9378K3303J8001P403
621C7785o781j9220k2563j8125q277N995J8001K2616J8183Q426n230j6594k1729
634g513j9109q919N053J5429K1269J8785R985m101j5785k0161j8329j0080K311
647c1165J4741K0256J8336J0133j855j3149j9541j8737j0536J178J2733J8759
659A153J8578J0964m55j2074j8127j8143j1214m10J1252J7700J7691J1423J443
672B9781j0271j7460j7746j1631j426R020J6366J7414J2608J646q458j5589j6970
$$ plain form
685 -12716 -25576 -28377 -20242 -4886 11615 24519 27958 20870 5886 -10628 -23383 -27170 -20813
698 -20813 -6594 9577 22272 26476 21121 7991 -8190 -21164 -26134 -21190 -8182 7123 20235
711 20235 25836 21097 8996 -6185 -19211 -24791 -21383 -9483 5618 18249 24624 21350 10364
724 10364 -4531 -17604 -23635 -21010 -11057 3566 16723 23291 21185 11431 -2409 -15257 -22588
737 -22588 -20954 -11706 1792 14562 21790 21148 12266 -1012 -13715 -20996 -20523 -12645 61 12811
751 12811 20285 20423 12913 972 -11877 -19868 -20168 -13108 -1169 10849 19172 20164 13832 1969
765 1969 -10216 -18262 -19749 -13906 -2669 9278 17633 19496 14034 3632 -8426 -17077 -19284 -14486
779 -14486 -4278 7380 16556 18980 14231 4435 -6773 -15551 -18640 -14430 -5191 5993 14707 17798
$$ packed form
685a2716j2860k801Q135J5356J6501J2904L439p088j4984j6514j2755l787O357
698b0813J4219J6171J2695M204n355j3130j6181j2974m970M944J3008J5305J3112
711B0235N601m739j2101j5181j3026n580L408J1900J5101J2631O375l274j0986
724A0364j4895j3073o031K625R953J4623J3157O568k106r754j3840j2848p331
737b2588J634R248J3498J2770P228o42q882j3278j2703p281M73P878J2706J2750
751A2811P474J38p510j1941j2849p991l00P060J1939J2018Q323R92o332j1863
765A969j2185q046j487N843J1237J1947Q355J863n462j0402j2058q651k207M798
779a4486J0208J1658R176K424m749r796j1208q778l089M210R239J1184Q714L091
$$ plain form
793 17798 14673 5626 -5497 -14335 -17629 -14613 -6345 4511 13616 17349 14733 6458 -4097 -12765
807 -12765 -17217 -14530 -6811 3028 11955 16677 14776 7367 -2574 -11367 -15986 -14655 -7673 2197 10644
822 10644 15578 14134 8202 -1415 -10160 -15072 -14333 -8125 612 9394 14418 14292 8861 -277 -9065
837 -9065 -14071 -14201 -9194 -419 8505 13639 14121 9328 888 -7730 -13186 -13762 -9167 -1324 7136 12536
853 12536 13607 9480 1634 -6269 -12273 -13684 -9374 -2190 5738 11887 13274 9812 2858 -5498 -10961
868 -10961 -12885 -9783 -3048 4428 11014 12886 9798 3505 -3870 -10370 -12754 -9923 -3792 3699 9641
883 9641 12025 10049 4244 -3180 -9039 -11901 -9922 -4240 2356 8890 11442 10119 4672 -2407 -8325
898 -8325 -11367 -10007 -5207 1529 7748 10822 9917 5002 -1382 -7369 -10735 -9983 -5349 970 7173 10009
$$ packed form
793A7798l125r047j1123q838l294L016Q268J0856R105L733k616q275j0555q668
807a2765m452K687P719R839Q927M722j901p409r941q793m619J331O982R870Q447
822A0644M934j444n932r617q745m912P39O208Q737Q782N024j26n431r138q788
837i065n006j30N007Q775Q924N134M82m793q440q618n456n76M595P843Q460N400
853A2536J071m127p846p903o004j411M310P184P928O149J387l462o954q356n463
868a0961j924L102O735P476O586J872l088o293p375o500k384K831O131P491N942
883I641K384j976n805p424n859k862J979N682O596O534K552j323n447p079n918
898h325l042J360M800O736O219L074r05m915o384n987l366P52M634O319O203K836
$$ plain form
914 10009 9920 5894 -487 -6289 -9923 -9748 -6103 -64 6091 9655 9796 5882 202 -5871 -9381 -9412
930 -9412 -5988 -500 5181 8990 9421 6348 868 -4899 -8616 -9128 -6657 -1278 4309 8399 9155 6360
946 6360 1629 -4035 -8038 -8994 -6690 -1612 3553 7612 9000 6866 2053 -3642 -7449 -8255 -6784 -2405
962 -2405 3037 7144 8390 6790 2823 -2544 -7127 -8088 -6597 -2788 2017 6258 7981 6768 2647
977 2647 -2033 -6186 -8070 -6756 -3333 1301 5860 7523 6727 3470 -1322 -5265 -7307 -6558 -3355 897
993 897 4986 7305 6697 3949 -611 -4567 -6862 -6587 -3673 588 4379 6664 6438 3576 -182 -4266
1009 -4266 -6400 -6289 -3976 -127 3991 6324 6253 3683 329 -3556 -6154 -6242 -4286 -364 3383 5832
1025 5832 6306 4294 742 -2926 -5598 -6116 -4488 -1000 2594 5399 5766 4251 1225 -2564 -4967 -5626
$$ packed form
914A0009q9m026o381n802l634J75L645O039O155L564J41l914n680o073l510l1
930i412L424N488N681L809M31l073n480n767l717n12K471N379N587M090P56k795
946F360m731n664m003r56K304N078N165M059J388k134m813n695l807q06J471M379
962b405N442M107J246j600l967n367m583r61J491L809M805M241J723j213m121
977B647m680m153j884J314L423M634M559J663p96l257m792l943k042P49L203M252
993H97M089K319o08k748m560l956k295K75K914M261L791K285k26k862l758m084
1009d266k134J11K313L849M118K333p1k570l354l885k598q8J956L922L747K449
1025E832M74k012l552l668k672n18J628L488L594K805L67j515l026l789k403o59
$$ plain form
1041 -5626 -4264 -1343 2559 4874 5716 4431 1458 -2165 -4605 -5635 -4464 -1862 2110 4722 5583
1056 5583 4444 1669 -1478 -4355 -5132 -4220 -1821 1279 4312 5192 4311 2319 -1285 -3793 -4778 -4845 -2285
1073 -2285 906 3578 4989 4421 2341 -645 -3598 -4725 -4330 -2312 515 3364 4749 4236 2649 -492
1089 -492 -3121 -4756 -4260 -2392 117 2719 4281 4074 2546 -83 -2847 -4083 -4138 -2551 -12 2587
1105 2587 4039 3981 2591 168 -2226 -4047 -4202 -2755 -358 2512 4004 3964 2675 701 -1847 -3594
1121 -3594 -3891 -2945 -606 1669 3607 3992 3138 780 -1737 -3367 -3735 -2703 -766 1644 3117 3866
1137 3866 3143 666 -1457 -3219 -3759 -2768 -1333 1029 3060 3708 2807 843 -989 -2879 -3516 -2959 -1238
1154 -1238 977 2625 3567 2932 1312 -1109 -2558 -3602 -2916 -1016 555 2673 3400 2949 1629 -629
$$ packed form
1041e626J362K921L902K315Q42j285k973l623k440j030J171K602L972K612Q61
1056E583j139k775l147k877p77R12K399L100L033Q80q81j992l604k508r85o7K560
1073b285L191K672J411n68k080k986k953j127L95K018K827K849J385n13j587l141
1089d92k629j635M96J868K509K602J562k07j528k629k764j236n5J587K539K599
1105B587J452n8j390k423k394j821j55J447K397K870J492m0j289j974k548j747
1121c594k97R46K339K275J938L85q54k358k517j630l68J032J937K410J473P49
1137C866p23k477k123j762n40R91J435K362K031O48r01j964j832j890o37N57J721
1154a238K215J648R42o35j620k421j449j044O86J900J571K118P27m51j320k258
$$ plain form
1170 -629 -2514 -3323 -3006 -1741 539 2336 3358 2989 1572 -315 -2431 -3236 -2900 -1698 229 2013
1186 2013 3155 2777 2015 -67 -1989 -2986 -2898 -1862 80 1675 2840 2891 1704 -52 -1827 -2769 -2907
1203 -2907 -1754 -162 1595 2769 2682 1722 207 -1461 -2778 -2876 -1740 -246 1484 2605 2440 1852 551
1220 551 -1300 -2410 -2853 -1980 -392 1252 2264 2409 2100 395 -947 -2368 -2708 -1818 -484 946 2048
1237 2048 2642 1836 656 -951 -2129 -2397 -2153 -974 592 1554 2140 1870 573 -857 -1939 -2404 -1864
1254 -1864 -1039 511 1810 2022 1912 1024 -497 -1785 -2326 -1941 -1145 470 1795 2332 1729 1202 -438
1271 -438 -1479 -2264 -1919 -1054 245 1388 2040 2022 907 201 -1320 -2064 -1758 -1258 18 1349 2064 2085
1289 2085 1116 -230 -1254 -1892 -1853 -1147 -316 1194 1866 1747 1042 217 -1193 -1672 -1739 -1013 -177 948 1889
$$ packed form
1170f29j885q09L17J265K280J797J022l69j417j887k116q05L36J202J927J784
1186B013J142l78p62k082j922r97Q8J036J942J595J165N1j187j756j775r42j38
1203b907J153J592J757J174q7r60j515j668j317r8J136J494J730J121j65n88j301
1220E51j851j110m43Q73J588J644J012J45l09j705j342j421l40Q90J334J430J102
1237B048N94q06j180j607j178k68K44J179J566R62N86k70j297j430j082m65N40
1254a864Q25J550J299K12j10q88j521j288n41L85P96J615J325N37o03n27j640
1271d38j041p85L45Q65J299J143O52j8j115p06j521p44L06N00J276J331P15K1
1289B085r69j346j024o38L9P06Q31J510O72j19p05q25j410m79o7P26Q36J125R41
$$ plain form
1308 1889 1506 1176 -40 -845 -1645 -1579 -1215 -248 888 1348 1384 1116 700 -573 -1571 -1566 -1114 -246 808 1471
1328 1471 1656 1270 299 -547 -1274 -1537 -1380 -289 714 1357 1440 1339 504 -708 -1122 -1649 -1289 -785 282
1347 282 1085 1603 1492 327 -520 -1265 -1354 -1134 -845 327 1109 1458 1438 424 -139 -1348 -1388 -1225 -465 398
1367 398 746 1622 1028 577 -76 -897 -1217 -1106 -501 108 939 1348 1077 637 0 -558 -1199 -894 -403 241
1387 241 645 873 1392 717 -29 -617 -989 -909 -518 89 607 911 898 452 12 -440 -1062 -921 -714 -89 445
1408 445 1074 1106 280 96 -464 -737 -947 -379 -109 619 945 794 594 264 -410 -825 -879 -522 -348 487 660
1429 660 1002 495 -104 -584 -719 -711 -519 -215 609 617 918 526 229 -452 -840 -688 -604 -129 415 606 562 814
1451 814 130 -451 -658 -739 -766 -36 206 572 735 647 186 -190 -404 -668 -457 -106 121 837 730 318 113
$$ packed form
1308A889l83l30j216q05q00O6L64R67J136M60L6k68m16j273r98NM52Q68J054O63
1328A471J85l86r71q46p27k63J57J091J003O43Q3j01q35j212m14n27L60N04J067
1347B82Q03N18j11j165q47p45q9K20K89J172P82L49k0j014n63j209m0J63P60Q63
1367C98L48Q76n94m51o53q21l20J11O05O09Q31M09k71m40o37n58o41L05M91O44
1387B41M04K28N19o75p46n88l72Q0L91O07N18L04j3m46m40m52o22J41K07O25N34
1408D45O29L2q26j84n60k73k10N68K70P28L26j51k00l30o74m15n4L57J74Q35J73
1429F60L42n07n99m80j35QJ92L04Q24QL01l92k97o81l88J52Q4M75N44J91m4K52
1451H14o84n81k07q1k7P30K42L66J63q8m61l76k14k64K11L51K27P16j07m12k05
$$ plain form
1472 113 -124 -766 -492 -757 -174 95 515 555 504 275 96 -394 -717 -411 -155 158 555 638 546 204 77
1493 77 -135 -621 -635 -95 -48 666 622 486 263 -40 -365 -397 -309 -97 143 765 542 495 324 -292 -238 -782 -698
1516 -698 -268 224 297 551 434 262 -184 -177 -157 -224 -285 -116 126 421 375 175 102 -278 -677 -206 56 16 223
1539 223 247 453 151 93 -292 -240 -389 -525 -31 -43 543 226 18 17 -266 -384 -319 -230 116 111 181 99 245 -75
1563 -75 -80 -417 -150 -139 137 413 239 -42 33 97 -109 -193 -230 -215 171 98 151 268 51 -304 -114 -299 -29 78
1587 78 296 342 124 148 13 -49 -39 -222 -72 -70 142 477 327 -124 14 -106 -178 -244 -55 -225 -222 96 79 229
1611 229 150 -118 195 -384 47 -98 165 161 24 -44 243 -28 -212 -49 -97 119 66 149 -6 -95 -305 -437 -56
1634 -56 -305 -88 -60 60 -22 81 82 351 -203 -311 -272 208 232 89 299 10 51 171 -307 -132 27 -40 351
$$ packed form
1472A13k37o42K74k65N83K69M20M0n1k29j79m90l23L06K56L13L97Q3r2l42j27
1493G7k12m86j4N40M7P14m4j36k23l03l25l2Q8K12K40O22k23m7j71o16N4n44Q4
1516f98M30M92P3K54j17j72m46PK0o7o1J69K42K95m6k00p3l80l99M71K62m0K07
1539B23K4K06l02n8l85N2j49j36M94j2N86l17k08jk83j18O5Q9L46nP0q2J46l20
1563g5nl37K67J1K76K76j74k81P5O4k06q4l7J5L86p3N3J17k17l55J90j85K70J07
1587G8K18M6k18K4j35o2J0j83J50KK12L35j50m51J38j20p2o6J89j70LL18j7J50
1611B29p9k68L13n79M31j45K63mj37o8K87k71j84J63m8K16n3Q3j55q9k10j32L81
1634e6k49K17K8J20q2J03JK69n54j08L9M80K4j43K10k89M1J20m78J75J59o7L91
$$ plain form
1657 351 85 269 -24 100 2 -205 -240 -73 230 209 104 288 215 -183 -273 -369 -485 -89 -210 0 319 257
1679 257 -128 75 -107 -622 -456 -286 -25 187 600 227 86 -287 -162 -134 -201 -209 -41 -14 256 187 246 256 123
1702 123 -286 -554 -203 59 185 371 358 299 -23 -42 -518 -336 -219 -63 207 244 251 183 5 -396 -459 -229 -418
1725 -418 198 140 276 356 236 235 -253 -163 -438 36 -130 189 646 278 421 322 -45 -340 -485 -267 -345 252
1747 252 481 469 269 315 -40 -231 -270 -673 -237 43 86 609 532 70 -136 -242 -477 -540 -116 115 199 130 121
1770 121 153 117 -108 -431 -327 -70 -237 312 375 529 284 -258 -374 -160 -268 -329 -87 142 323 626 258
1791 258 -104 -23 -320 -403 -263 154 568 432 377 538 -31 -175 -359 -518 -305 -146 117 475 569 411 22
1812 22 -204 -265 -507 -376 -304 215 292 286 155 14 -242 -510 -382 -302 -144 73 313 313 63 212 -714 -73 -619
$$ packed form
1657C51k66J84k93J24r8k07l5J67L03k1j05J84p3l98r0r6j16L96j21K10L19o2
1679B57l85K03j82n15J66J70K61K12M13l73j41l73J25K8o7qJ68K7K70o9N9J0j33
1702A23m09k68L51K62J26J86j3n9l22j9m76J82J17J56K70L7Po8j78m01o3K30j89
1725d18O16n8J36Q0j20jm88R0k75M74j66L19M57l68J43r9l67k95j45K18p8N97
1747B52K29j2k00M6l55j91l9m03M36K80M3N23p7m62k06j06k35o3M24K31Q4o9r
1770A21L2l6k25l23J04K57j67N49O3J54k45n42j16K14j08o1K42K29J81L03l68
1791B58l62Q1k97q3J40M17M14j36n5J61n69j44j84j59K13J59K63L58R4j58l89
1812B2k26o1k42J31P2N19P7oj31j41k56k68J28Q0J58K17K40%k50J49r26O41n46
$$ plain form
1835 -619 -503 -65 250 405 625 460 -101 -215 -491 -685 -451 -103 -182 437 783 448 121 70 -344 -323 -431
1856 -431 -290 165 102 489 383 267 -78 -382 -468 -370 -170 75 461 490 272 206 -31 -182 -652 -492 -488 53
1878 53 383 676 385 212 173 -97 -471 -454 -533 -39 331 294 353 237 223 19 -514 -428 -261 -43 105 538 573
1901 573 177 12 -165 -374 -212 -131 -186 171 543 451 298 100 -516 -370 -326 -353 -35 105 184 703 400 -48
1923 -48 -171 -735 -411 -385 -208 118 721 530 376 -137 -204 -388 -722 -320 -72 25 345 377 281 -32 -154 -385
1945 -385 -430 -462 -311 31 594 309 338 1 -208 -496 -516 -476 -344 71 654 358 226 350 -211 -457 -485 -475
1967 -475 -244 69 325 16 584 157 -58 -465 -357 -577 -211 -163 269 312 415 272 7 -415 -423 -646 -335
1988 -335 80 178 206 588 468 -55 -117 -588 -368 -164 59 244 576 374 393 177 -150 -351 -575 -369 -51
$$ packed form
1835f19J16M38L15J55K20j65n61j14k76j94K34L48p9O19L46l35l27n1m14K1j08
1856d31J41M55o3L87j06j16l45l04q6R8K00K45L86K9k18o6k37j51m70J60MN41
1878E3L30K93k91j73l9k70l74J7p9M94L70l7N9j16j4k04n33Q6J67K18J48M33L5
1901E73l96j65j77k09J62Q1n5L57L72r2j53j98o16J46M4k7L18J40P9N19l03m48
1923d8j23n64L24K6J77L26O03j91j54n13o7j84l34M02K48R7L20L2r6l13j22k31
1945c85m5l2J51L42N63k85K9l37k09k88k0M0J32M15N83k96j32J24n61k46k8J0
1967d75K31L13K56l09N68m27k15m07J08k20L66M8M32M3J03j43k65m22qk23L11
1988c35M15R8K8L82j20n23o2m71K20K04K23J85L32k02J9k16l27k01k24K06L18
$$ plain form
2009 -51 241 131 410 282 -53 -48 -614 -626 -237 69 307 81 505 449 32 -153 -503 -341 -474 26 133 337
2031 337 406 320 62 -131 -487 -587 -281 -74 225 643 404 758 60 -94 -450 -203 -516 -203 49 535 334
2052 334 289 229 -136 22 -579 -651 29 185 373 417 525 329 -225 -226 -609 -444 47 68 365 613 493 169
2074 169 -122 -343 -340 -685 -64 44 53 538 454 218 -178 -450 -591 -272 -194 158 392 276 562 484 -185 -273 -320
2097 -320 -423 -482 -129 154 498 313 479 -83 -487 -480 -511 -303 -191 165 356 634 177 84 -32 -491 -320 -124
2119 -124 -216 189 516 369 536 173 -35 -636 -549 -157 -255 20 634 511 365 10 14 -184 -731 -397 38 215
2141 215 260 128 606 128 -69 -365 -269 -146 -132 168 485 386 116 218 -93 -342 -141 -372 -357 18 392 506
2163 506 479 295 81 -320 -364 -481 -347 64 224 522 409 -4 -279 -193 -349 -494 -150 -160 208 468 557 161
$$ packed form
2009e1K92j10K79j28l35Nn66j2L89L06K38k26M24n6m17j85l50J62j33N00J07K04
2031C37O9q6k58j93l56j00L06K07K99M18k39L54o98j54l56K47l13L13K52M86k01
2052C34m5o0l65J58o01p2O80J56J88M4J08j96n54jl83J65M91K1K97K48j20l24
2074A69k91k21Ll45O21J08RM85q4k36l96k72j41L19P8L52K34j16K86p8o69q8m7
2097c20j03n9L53K83L44j85J66n62m04Pl1K08J12L56J91K78m57r3j16m59J71J96
2119a24r2M05L27j47J67l63k08o01Q7L92r8K75O14j23j46l55Mj98n47L34M35J77
2141B15M5j32M78m78j97k96R6J23J4L00L17r9k70J02l11k49K01k31J5L75L74J14
2163E06k7j84k14m01m4j17J34M11J60K98j13m13k75Q6j56j45L44j0L68K60Q9l96
$$ plain form
2185 161 -132 -274 -486 -631 -14 236 282 454 501 188 45 -211 -589 -665 -464 -1 278 411 776 200 -270
2206 -270 -222 -454 -273 -249 -26 193 424 511 232 134 -111 -211 -537 -375 -380 6 240 190 150 206 -168 -357 -587
2229 -587 -607 -259 153 325 363 379 66 -70 -336 -247 -312 -325 80 340 342 233 243 97 -331 -443 -405 -183 32
2252 32 445 376 604 336 -220 -124 -697 -171 73 188 288 397 506 310 162 -212 -269 -294 -125 196 139 641
2274 641 254 165 -147 -204 -737 -678 -123 146 511 169 617 303 80 47 -471 -438 -545 -16 354 558 466 273
2296 273 178 -157 -490 -596 -373 210 373 416 523 430 200 -275 -243 -358 -276 -203 539 260 454 302 -13 -339
2318 -339 -251 -161 -334 -298 74 314 235 437 38 163 -114 -586 -283 -268 133 276 549 145 43 -180 -447 -320
2340 -320 -341 -219 -24 302 435 220 59 39 -205 -456 -481 -211 -220 356 703 223 239 -77 -192 -444 -172 -106
$$ packed form
2185A61k93j42k12j45O17K50M6J72M7l13j43k56l78p6K01M63K79J33L65n76m70
2206b70M8k32J81K4K23K19K31Q7k79r8k45j00l26J62nL86K34n0m0N6l74j89k30
2229e87k0L48M12J72L8J6l13j36k66Q9o5j3M05K60Kj09J0j46m28j12L8K22K15
2252C2M13o9K28k68n56R6n73N26K44J15J00J09J09j96j48l74n7k5J69L21n7N02
2274F41l87q9l12n7n33N9N55K69L65l42M48l14k23l3n18L3j07N29L70K04r2j93
2296B73r5l35l33j06K23N83J63M3J07r3k30m75L2j15Q2P3P42k79J94j52l15l26
2318c39Q8R0j73L6L72K40p9K02l99J25k77m72L03J5M01J43K73m04j02k23k67J27
2340c20k1J22J95L26J33k15j61k0k44k51k5K70rN76L47m80J6l16j15k52K72O6
$$ plain form
2362 -106 119 219 373 475 362 -144 -100 -330 -198 -144 -10 293 507 455 50 316 -54 -242 -581 -131 -22
2383 -22 269 324 504 497 269 13 -301 -244 -142 -265 295 219 355 239 118 -108 -544 -278 -276 -12 79 9 416
2406 416 270 452 136 -103 -242 -307 -198 23 330 325 117 187 14 -307 -327 -411 -134 -116 21 376 348 53 -117
2429 -117 -439 -162 -262 -144 375 227 263 561 269 80 -138 -457 -313 -141 220 233 605 293 457 -163 -29
2450 -29 19 -239 -120 121 23 128 384 226 186 -195 -297 -387 -34 205 143 515 436 303 -109 -46 -142 -181 46
2473 46 -163 83 323 332 117 202 -233 -308 -427 -349 -167 -182 457 88 204 165 -118 -295 -166 -214 125 355 174
2496 174 323 275 76 -247 -78 -178 -366 44 173 237 325 141 143 162 99 -268 -614 -60 -73 281 -3 158 131
2519 131 -215 -297 -192 -239 31 114 353 100 72 249 -122 -258 -324 -331 -153 298 214 296 274 -47 -100 -250 -237 -161
$$ packed form
2362a06K25J00J54J02j13n06M4k30J32N4J34L03K14n2m05K66l70j88l39M50J09
2383b2K91N5J80pk28k56l14N7J02j23N60p6J36j16j21k26m36K66KK64R1p0M07
2406D16j46J82l16k39j39o5J09K21L07nk08P0j73l21k0q4K77J8J37L55k8k95j70
2429a17l22K77j00J18N19j48L6K98k92j89k18l19J44J72L61J3L72l12J64o20J34
2450b9M8k58J19K41r8J05K56j58m0l81j02r0L53K39o2L72p9j33m12O3r6l9K27
2473D6k09K46K40Rk15Q5m35p5j19P8J82j5O39l69J16l9k83j77J29m8L39K30j81
2496A74J49m8j99l23J69j00j88M10J29O4Q8j84KJ9o3l67l46N54j3L54k84J61k7
2519A31l46q2J05m7K70Q3K39k53k8J77l71j36o6pJ78M51q4Q2k2l21n3j50J3P6
$$ plain form
2543 -161 -119 9 6 314 211 23 -124 -50 -149 -272 -105 11 4 364 181 390 139 -394 -141 22 -304 -200
2565 -200 -87 221 187 293 -169 -90 -183 -378 -4 32 30 78 24 -14 217 97 -43 -128 -293 96 -212 222 74
2588 74 398 -49 188 -236 -63 -35 -164 364 268 311 170 161 184 -220 -153 -94 -58 -72 250 60 131 -27 -87 -29 -221
2613 -221 -152 14 -211 -52 453 217 37 -89 -259 64 -24 -5 -42 107 269 106 -19 -27 -249 -131 -173 -156 -77
2636 -77 280 424 -15 -19 112 -68 -423 -155 -179 115 17 122 136 48 -99 -270 -263 331 -198 37 -154 209 395
2659 395 38 96 133 -199 -236 131 -261 147 206 172 -264 142 -132 -137 110 -253 -2 136 119 118 98 266 102 -124
2683 -124 -247 -141 -92 280 191 215 -38 151 -257 -27 -253 -129 -269 -10 193 -81 594 -49 -224 -7 -9 -109
2705 -109 73 304 264 235 260 -33 -248 -183 -118 -100 -71 -166 -18 101 242 207 -371 -134 -151 -81 143 9 -61 190
$$ packed form
2543a61M2J28lL08j03j88j47P4r9j23J67J16pL60j83K09k51n33K53J63l26J04
2565b00J13L08l4J06m62P9r3j95L74L6kM8n4l8K31j20j40q5j65L89l08M34j48
2588G4L24m47K37m24J73K8j29N28r6M3j41rK3m04O7N9L6j4L22j90P1j58o0N8j92
2613b21O9J66k25J59N05k36j80j26j70L23q8J9l7J49J62j63j25qk22J18m2J7P9
2636g7L57J44m39mJ31j80l55K68k4K94r8J05J4q8j47j71PN94n29K35j91L63J86
2659C95l57N8L7l32l7L67l92M08N9l4m36M06k74nK47l63K51J38j7jk0J68j64k26
2683a24j23J06M9L72q9K4k53J89m08K30k26J24j40K59K03k74O75o43j75K17kj00
2705a09J82K31m0k9K5k93k15O5O5J8K9r5J48J19J41l5n78K37j7P0K24j34p0K51
$$ plain form
2729 190 280 63 -114 -397 -98 -20 -122 -81 108 135 -121 200 38 134 -150 -199 -175 -192 96 231 -52 46 -316
2752 -316 -276 -64 -159 -182 -93 385 -43 278 159 50 -208 -355 -91 -21 149 -130 172 164 139 99 -352 3 160
2775 160 -192 -63 191 225 -72 143 -62 -151 -178 62 -139 101 48 -59 129 50 -71 34 -108 -76 -135 38
2797 38 142 -120 90 -85 -165 -187 50 -87 -171 -2 -8 88 215 118 -50 -170 -298 -58 258 -90 -112 271 99
2820 99 145 298 -237 -269 -113 161 112 -57 115 107 27 24 -16 -189 -195 71 16 -78 215 96 43 223 -69 101 -120
2845 -120 -361 96 -9 -29 173 28 -31 85 -125 -19 -45 -297 -41 52 292 -69 210 -56 -364 -263 -56
2866 -56 158 -4 -64 163 78 126 47 149 -121 -187 -144 73 189 163 99 -86 -38 48 -165 -240 56 129 169 51 116
2891 116 -45 -249 1 -116 -62 -101 235 -79 366 402 408 -101 53 -83 -138 356 -97 -5 231 108 106 -118 -120 161
$$ packed form
2729A90R0k17j77k83K99P8j02M1J89K7k56L21j62R6k84m9K4j7K88J35k83R8l62
2752c16M0K12r5k3Q9M78m28L21j19j09k58j47K64P0J70k79L02qk5m0m51L55J57
2775A60l52J29K54L4k97K15k05q9k7K40k01K40n3j07J88p9j21J05j42L2n9J73
2797C8J04k62K10j75q0k2K37j37q4J69oR6J27r7j68j20j28K40L16l48k2L83j72
2820I9M6J53n35l2J56K74m9j69J72qq0lm0j73oK66n5r4K93j19n3J80k92J70k21
2845a20k41M57j05k0K02j45n9J16k10J06k6k52K56R3K40l61K79k66l08J01K07
2866e6K14j62o0K27q5M8p9J02k70o6M3K17J16k6o4j85M8Q6k13p5K96P3M0j18O5
2891A16j61k04K50j17N4l9L36l14M45L6On09J54j36n5M94m53R2K36j23kk24kK81
$$ plain form
2915 161 -292 21 158 96 168 132 -72 10 -168 57 81 -193 3 55 142 219 130 -299 -27 -98 -22 -41 -35 -56 75
2940 75 269 -82 292 -39 77 -161 -249 -31 46 -94 272 324 -41 -26 -250 -100 13 20 -78 317 241 70 264
2963 264 44 176 -99 -3 -55 -17 -123 110 54 -75 -131 -322 55 -162 -40 8 222 138 -69 48 -41 -221 -14
2986 -14 -37 -3 -188 -279 82 247 -230 -192 244 -135 -311 -324 27 -32 189 186 105 116 58 136 51 -129 125 71 168
3011 168 105 -82 -150 -60 -219 42 -176 267 164 -2 21 220 -220 41 -246 -190 -114 -75 84 -72 247 49
3033 49 75 81 77 -20 64 85 32 -65 113 18 -130 -27 -400 117 49 -106 -6 147 -2 -67 74 253 -116 -38 75
3058 75 5 201 290 -255 -19 -166 -50 -18 -33 11 202 -37 132 215 -184 192 -32 173 -62 -190 -1 -45 131
3081 131 38 5 -51 -24 -20 145 -139 72 143 209 40 243 11 -96 -114 -115 -90 -69 -68 202 162 268 -88 -294 -163
$$ packed form
2915A61m53L13J37o2P2l6k04Q2j78K25K4k74J96N2Q7P7q9m29K72p1P6j9Ok1J31
2940G5J94l51L74l31J16k38q8K18P7j40L66N2l65J5k24J50J13Pr8L95p6j71J94
2963B64k20J32k75R6n2L8j06K33n6j29n6j91L77k17J22M8K14q4k07J17q9j80K07
2986a4k3L4j85r1L61J65m77L8M36l79j76j3L51n9K21lq1J1n8P8q5j80K54n4R7
3011A68o3j87o8R0j59K61k18M43j03j66K3J99m40K61k87N6P6L9J59j56L19j98
3033D9K6Omr7Q4K1n3r7J78r5j48J03l73N17o8j55J00J53j49o5J41J79l69P8J13
3058G5p0J96Q9n45K36j47J16L2j5M4J91k39J69Q3l99L76k24K05k35j28J89m4J76
3081A31r3l3n6K7MJ65k84K11P1O6j69K03k32j07j8jK5K1JK70m0J06l56k06J31
$$ plain form
3106 -163 9 -87 254 -81 221 25 -181 229 -59 40 -234 408 -272 -17 19 -17 210 -3 189 115 88 81 -133
3129 -133 -42 -12 -131 -49 -100 -152 -144 -268 -356 -114 -193 -15 110 26 -24 -36 112 -50 -174 102 -6 -58 -8 32 55
3154 55 179 98 71 -54 -64 -151 34 165 41 -58 -159 14 139 112 -95 -139 5 -64 -25 83 126 121 -32 73
3178 73 -34 -2 -60 253 8 30 6 -38 -163 -109 -105 186 -67 28 164 -199 10 -221 -55 -79 -10 -235 49 -274
3202 -274 0 180 207 177 130 -94 -30 209 89 125 170 -143 -26 85 57 -246 -14 111 -105 160 281 241 -106
3225 -106 -70 51 -77 -214 29 -208 -395 484 16 -52 114 -84 -67 -121 157 -41 13 -33 -65 94 -81 146
3247 146 -48 64 -133 -67 145 -89 407 132 175 134 288 -65 39 -123 34 74 46 118 0 -95 -203 -240 -146
3270 -146 11 208 -9 -154 -143 -120 -321 -73 -203 271 54 38 54 -6 26 121 129 14 -241 -134 -271 -80 -241
$$ packed form
3106a63J72r6L41l35L02j96k06M10k88R9k74O42o80K55L6l6K27k13J92p4k7pk14
3129a33R1L0j19Q2n1n2Qj24q8K42p9J78J25q4n0j2J48j62j24K76j08n2N0M0K3
3154E5J24q1k7j25j0q7J85J31j24r9j01J73J25k7k07m4J44o9L9J08M3nj53J05
3178G3j07L2n8L13k45K2k4m4j25N4MK91k53R5J36l63K09k31J66k4O9k25K84l23
3202b74K74J80K7l0m7k24O4K39j20L6M5l13J17J11k8l03K32J25k16K65J21m0l47
3225a06L6J21j28j37K43k37j87Q79m68o8J66j98J7n4K78j98N4m6l2J59j75K27
3247A46j94J12j97O6K12k34M96k75M3m1J54l53J04j62J57M0k8P2j18r5j08l7R4
3270a46J57J97k17j45J1K3k01K48j30M74k17j6J6o0L2R5Qj15k55J07j37J91j61
$$ plain form
3293 -241 -107 32 -123 -10 10 -162 -413 36 161 191 103 28 11 -14 161 -65 382 -181 81 303 -327 122
3315 122 21 -32 64 -328 -22 100 -190 163 7 201 28 -219 -107 -273 -155 -52 -76 -34 -397 296 18
3336 18 -31 159 -314 -149 -39 -214 241 48 -236 -53 12 -121 -10 156 -3 -28 188 -7 -95 -50 8 92 16
3359 16 -97 242 5 -103 6 28 225 -54 -83 225 -37 -263 56 -20 -71 396 74 -48 3 -180 -123 165
3381 165 -15 58 -5 25 -23 94 -97 -133 -151 -181 110 -284 12 80 4 -126 42 -9 -98 -60 73 122 69 141 -244
3406 -244 157 -145 34 -269 89 -328 54 15 -260 -26 221 61 -23 -48 70 -57 79 178 66 187 253 127
3428 127 -149 -155 -8 205 229 62 42 297 116 113 -154 -94 120 20 190 -88 33 116 196 -183 -106 -165 1 256
3452 256 194 91 55 -317 148 75 -209 -224 80 -11 124 -33 226 30 27 -128 -136 -159 -228 246 -127 233 145 -40
$$ packed form
3293b41J34J39j55J13K0j72k51M49J25L0q8p5j7k5J75k26M47n63K62K22o30M49
3315A22j01n3R6l92L06J22k90L53j56J94j73k47J12j66J18J03k4M2l63O93k78
3336A8m9J90m73J65J10j75M55j93k84J83O5j33J11J66j59k5K16j95q8M5N8Q4p6
3359A6j13L39k37j08J09K2J97k79k9L08k62k26L19p6n1M67l22j22N1j83N7K88
3381A65j80P3o3L0m8J17j91l6j8l0K91l94K96O8p6j30J68n1q9L8J33M9n3P2l85
3406b44M01l02J79l03L58m17L82l9k75K34K47j60q4k5J18j27J36R9j12J21O6j26
3428A27k76oJ47K13K4j67k0K55j81lk67O0K14j00J70k78J21Q3Q0l79P7n9J66K55
3452B56o2j03l6l72M65p3k84j5L04r1J35j57K59j96lj55qk3o9M74l73L60q8j85
$$ plain form
3476 -40 215 122 -107 -52 -19 363 182 61 159 62 134 83 45 -137 166 221 -150 -154 -53 227 -195 48 44 92 -93
3501 -93 -186 -17 -87 -137 186 63 -104 60 165 164 -112 -249 -72 -82 34 296 -48 -107 -179 29 41 -114 -74 -134
3525 -134 175 8 -90 81 17 439 -177 54 -161 148 35 243 -78 -171 -21 -6 53 102 135 -121 184 -82
3547 -82 122 -102 18 18 172 -29 -127 -270 87 58 50 -250 -11 103 30 27 255 -44 -20 1 200 -296 -45 244
3571 244 94 214 16 -64 -10 124 77 -277 -85 -18 195 257 -123 79 -119 120 -22 189 -227 -43 -20 127
3593 127 345 -73 -69 -166 66 -31 326 12 234 -333 59 -44 -353 -95 -290 35 -93 158 0 -102 198
3614 198 112 -64 180 -72 193 86 -15 120 -18 -57 0 -5 126 -52 98 -70 60 -158 327 -88 -95 79
3636 79 -85 203 -11 -142 -273 24 21 152 -235 111 37 -121 178 152 132 -116 -198 -121 -51 96 -48 176 -49
$$ packed form
3476d0K55r3k29N5L3L82j81j21R8r7P2n1l8j82L03N5l71mJ01K80m22K43mM8j85
3501i3r3J69p0n0L23j23j67J64J05jk76j37J77j0J16K62l44n9p2K08J2j55M0o0
3525a34L09j67r8J71o4M22o16K31k15L09j13K08l21r3J50J5N9M9L3k56L05k66
3547h2K04k24J20%J54k01r8j43L57k9ql00K39J14p3lK28k99K4K1J99m96K51K89
3571B44j50J20j98q0N4J34m7l54J92O7K13O2l80K02j98K39j42K11m16J84K3J47
3593A27K18m18Mr7K32r7L57l14K22n67L92j03l09K58j95L25j28K51j58j02L00
3614A98q6j76K44k52K65j07j01J35j38l9N7nJ31j78J50j68J30k18M85m15pJ74
3636G9j64K88k14j31j31K97lJ31l87L46p4j58K99k6k0k48q2P7P0J47j44K24k25
$$ plain form
3659 -49 209 117 -37 -92 91 139 -19 -183 -188 -56 -157 11 -213 -98 -11 -40 -32 -2 -121 -26 -121 92 100 -401 -178
3684 -178 -27 224 66 -19 145 162 -197 89 -101 240 349 28 -142 188 86 146 66 -78 10 95 -144 -103
3706 -103 169 46 20 1 87 300 422 -263 -134 78 41 -14 89 149 -49 73 346 255 175 -40 -49 -70 14 -38
3730 -38 115 -66 -147 181 175 95 49 74 -24 227 194 107 69 3 110 -89 -32 32 18 -116 264 149 2 89 388
3755 388 -42 -17 202 -62 -121 42 -184 -133 -28 -2 10 81 -207 59 199 -77 62 -269 -103 52 -97 -39
3777 -39 -193 2 -229 252 54 230 100 332 -18 -226 -132 242 -89 -248 -126 189 38 1 -146 -66 164
3798 164 29 50 -343 78 48 -292 -6 2 -69 10 -152 264 -47 -129 -261 -71 -1 131 127 -41 230 -10 -160
3821 -160 -39 31 124 -158 -166 -71 -43 41 -78 -3 90 17 -125 226 -20 1 135 -67 96 61 146 30 -95 -310
$$ packed form
3659d9K58r2j54n5J83M8j58j64nJ32j01J68k24J15Q7k9QL0j19R5r5K13Qn01K23
3684a78J51K51j58q5J64J7l59K86j90L41J09l21j70L30j02O0q0j44Q8Q5k39M1
3706a03K72j23k6j9Q6K13J22o85J29K12l7n5J03O0j98J22K73r1q0k15rk1Q4n2
3730c8J53j81q1L28oq0m6K5r8K51l3q7l8o6J07j99N7O4j4j34L80j15j47Q7K99
3755C88m30K5K19k64n9J63k26N1J05K6J2P1k88K66J40k76J39l31J66J55j49N8
3777c9j54J95k31M81j98J76j30K32l50k08R4L74l31j59J22L15j51l7j47Q0K30
3798A64j35K1l93M21l0l40K86Qp1P9j62M16l11q2j32J90P0J32mj68K71k40j50
3821a60J21P0R3k82qR5K8Q4j19P5R3p3j42L51k46K1J34k02J63l5Q5j16j25k15
$$ plain form
3845 -310 -19 10 -239 -110 -15 173 -108 -44 294 14 111 -69 166 -142 -46 182 160 -159 -35 251 -14 183
3867 183 165 8 45 40 130 -118 -88 -268 153 35 -100 -286 123 -10 297 210 -355 26 -93 7 -297 79
3889 79 -80 3 -250 -18 -45 38 149 -83 -248 -38 28 169 -8 -33 92 -271 5 -30 198 12 -30 115 49
3912 49 215 -94 300 -63 -94 202 -97 -282 -31 237 -53 33 378 37 34 -25 -68 -100 19 196 361 77 213
3935 213 -19 -41 308 -30 88 -4 126 -227 -135 -307 -59 -36 -30 -266 -102 166 -258 -61 64 172 120 131 170
3958 170 107 56 60 212 -49 -14 310 -2 166 340 -62 55 169 -172 4 141 -25 2 -67 -63 -51 138 37
3981 37 79 -65 281 160 -142 -92 -132 80 33 144 -36 -28 25 -166 -105 19 227 28 -127 33 -227 -137 141
4004 141 64 24 10 102 79 -32 -122 248 23 -49 -195 104 -138 -130 75 -296 44 -109 -11 -128 -224 175 41 -86
$$ packed form
3845c10K91K9k49J29R5J88k81O4L38k80R7j80K35l08R6K28k2l19J24K86k65J97
3867A83j8j57L7nR0k48L0j80M21j18j35j86M09j33L07q7n65L81j19J00l04L76
3889G9j59Q3k53K32k7Q3J11k32j65K10O6J41j77k5J25l63K76l5K28j86m2J45o6
3912D9J66l09L94l63l1K96k99j85K51K68k90Q6L45l41ln9m3l2J19J77J65k84J36
3935B13k32k2L49l38J18r2J30l53R2j72K48K3Ok36J64K68m24J97J25J08n2J1L9
3958A70o3n1MJ52k61L5L24l12J68J74m02J17J14l41J76J37j66K7o9MJ2J89j01
3981C7M2j44L46j21l02N0m0K12m7J11j80QN3j91O1J24K08j99j55J60k60R0K78
4004A41p7m0j4R2k3j11r0L70k25p2j46K99k42QK05l71L40j53R8j17r6L99j34j27
$$ plain form
4028 -86 185 197 -295 -204 88 149 -113 238 101 -109 -146 171 298 37 92 28 100 43 -24 -119 73 -50 38 355
4052 355 30 160 -39 -114 -11 40 120 204 -13 124 -219 -238 2 99 -66 -52 -144 -15 -10 26 -72 -110 -16 134 134
4077 134 328 173 67 -305 -44 -308 12 284 -127 -103 42 -107 -198 114 -543 201 207 -124 -106 88 212 -2
4099 -2 -149 154 173 -149 97 43 73 -1 144 226 -57 -18 204 7 77 -41 -97 -4 211 243 -176 -229 22 141
4123 141 -107 14 161 -147 -188 -331 -111 -113 -295 -192 160 -59 -6 -152 7 -99 -31 -247 -159 -45 143 171
4145 171 128 -215 31 -44 298 81 -75 -110 87 -153 -137 85 -58 26 -107 135 -54 134 -69 -125 -95 30
4167 30 49 265 243 81 -55 28 210 15 138 29 154 -11 -132 -115 -24 67 85 77 -80 152 119 198 -48 -86
4191 -86 -97 -110 60 47 -177 326 282 41 65 277 11 -342 26 115 59 63 102 -88 -143 34 -40 213 -161 -155 193
$$ packed form
4028h6K71J2m92R1K92O1k62L51j37k10l7L17J27k61N5o4P2n7o7r5J92j23Q8L17
4052C55l25J30j99p5J03N1Q0Q4k17J37l43j9K40R7j65J4r2J29NL6r8l8R4J50%
4077A34J94j55j06l72K61k64L20K72m11K4J45j49r1L12o57P44Ol31J8J94J24k14
4099bj47L03J9l22K46n4L0p4J45Q2k83L9K22j97P0j18n6R3K15L2m19n3K51J19
4123A41k48J21J47l08m1j43K20kj82J03L52k19N3j46J59j06O8k16Q8J14J88K8
4145A71m3l43K46p5L42k17j56l5J97k40J6K22j43Q4j33K42j89J88k03n6L0J25
4167C0J9K16k2j62j36Q3J82j95J23j09J25j65j21J7R1R1J8qj57K32l3P9k46l8
4191h6j1j3J70j3k24N03m4k41K4K12k66l53L68Q9n6ML9j90n5J77p4K53l74OL48
$$ plain form
4216 193 20 16 22 -106 144 -62 113 -74 -101 36 17 -4 -119 -89 39 -132 48 56 142 84 53 85 -36 196 -74
4241 -74 199 181 38 -79 -143 -65 -101 38 -55 -62 173 144 108 251 -203 1 -150 -156 -259 -126 -84 58 29 -73 -160
4266 -160 -173 -42 85 -180 106 -57 -112 174 78 -38 -157 3 112 21 160 144 -178 68 385 284 255 -18
4288 -18 13 -363 56 238 301 -124 118 -169 89 47 -5 -43 189 -12 114 53 50 -21 69 -75 102 73 -271 -51
4312 -51 -202 -67 -150 76 4 42 77 -15 16 111 22 -13 -199 -16 231 46 132 146 95 -123 -183 -90 -68 138 35
4337 35 -101 -10 25 6 -30 -3 -141 47 -65 117 -75 176 -64 -205 -69 -1 3 17 -235 -201 39 102 15 -19 -12
4362 -12 135 -271 219 -132 70 315 -176 -46 63 194 -95 187 44 -17 -172 -8 1 70 54 -89 52 -61
4384 -61 -78 77 57 -11 -161 -111 -19 -200 52 -75 141 48 -46 54 -79 -60 -32 -51 148 216 212 -4 -1 -28 -116 -213
$$ packed form
4216A93j73mOj28K50k06J75j87k7J37j9k1j15L0J28j71J80QQ6n8l1L2j21K32k70
4241g4K73j8j43j17o4P8l6J39r3pK35k9l6J43m54K04j51oj03J33M2J42k9j02q7
4266a60j3J31J27k65K86j63n5K86r6j16j19J60J09r1J39j6l22K46L17j01k9k73
4288a8L1l76M19J82O3m25K42k87K58m2n2l8K32k01J26o1lp1R0j44J77k9l44K20
4312e1j51J35q3K26p2L8L5r2L1R5q9l5j86J83K47j85Q6J4n1k18o0R3K2K06j03
4337C5j36R1L5j9l6K7j38J88j12J82j92K51k40j41J36O8MJ4k52L4K40O3q7l4P
4362a2J47m06M90l51K02K45m91J30J09J31k89K82j43o1j55J64RO9j6j43J41j13
4384f1j7J55k0o8j50N0R2j81K52j27K16r3r4J00j33J9K8j9J99O8mk16Lk7q8r7
$$ plain form
4410 -213 -173 61 -47 -148 -93 -47 -142 50 214 -250 432 -138 -23 -22 -51 103 -165 -203 -94 64 -134 13 50
4433 50 107 -186 197 -28 156 88 153 23 -237 43 152 -147 75 262 41 87 41 75 -142 324 289 26 -156
4456 -156 -146 99 -37 223 45 24 75 76 -75 124 141 125 75 -102 125 -16 -25 89 -18 -9 -39 -88 130 84 208
4481 208 -52 22 -206 -8 32 -85 -186 -188 140 310 3 9 225 146 185 322 73 -265 13 -355 253 32 33
4504 33 -12 -13 -250 -34 -5 -148 194 -1 0 -21 -134 80 120 -82 -87 -1 -126 -223 -81 -146 65 370 -187 -314 -70
4529 -70 -24 173 105 -335 -80 18 -168 -105 -304 60 118 -213 -48 -59 -7 -278 149 -3 17 7 -130 174 -113
4552 -113 -200 5 -215 52 103 109 33 7 -115 96 135 -241 80 49 -264 -114 203 33 -231 393 183 253 -74
4575 -74 -51 121 -30 -155 -308 128 -75 143 258 -24 -76 -418 -51 -47 130 -34 -117 -160 312 -78 -7 78 119
$$ packed form
4410b13M0K34j08j01N5M6r5J92J64m64O82n70J15Jk9J54k68l8J09J58j98J47L7
4433E0N7k93L83k25J84o8O5j30k60K80J09k99K22J87k21M6m6L4k17M66l5k63j82
4456a56J0K45j36K60j78k1N1Jj51J99J7j6n0j77K27j41rJ14j07Rl0m9K18m6J24
4481B08k60P4k28J98M0j17j01kL28J70l07OK16p9L9J37k49l38K78l68O08k21J
4504C3m5jk37K16K9j43L42j95Jk1j13K14M0k02nQ6j25r7J42o5K11L05n57j27K44
4529g0M6J97o8m40K55R8j86O3j99L64N8l31J65j1N2k71M27j52K0j0j37L04k87
4552a13q7K05k20K67N1Op6k6j22K11L9l76L21l1l13J50L17j70k64O24k10P0l27
4575g4K3J72j51j25j53M36k03K18J15k82n2l42L67MJ77j64q3m3M72l90P1Q5M1
$$ plain form
4598 119 -57 -372 141 103 -149 144 71 71 71 -232 61 -83 230 -124 193 -90 -37 102 33 -220 2 304 135
4621 135 -22 37 -18 98 -33 -198 109 -41 217 143 68 -104 -29 365 -64 -110 -210 -137 -115 165 12 -30 -73
4644 -73 64 49 -100 198 5 30 195 -210 -87 78 -290 210 -273 101 -182 -9 70 -102 -30 -120 -89 17
4666 17 -243 -87 143 -1 -218 150 -226 -56 -103 -83 327 -90 -75 72 20 -99 -314 -150 116 -97 72 123
4688 123 -250 8 66 140 212 98 -99 83 -153 -186 257 -93 -177 -104 114 42 91 40 59 28 -39 218 -171 70
4712 70 -72 37 -55 -227 88 -91 -35 178 -114 3 -28 -266 -97 88 -19 -129 150 50 65 -90 15 -164
4734 -164 45 -271 106 204 -18 155 -7 -19 -113 26 44 -43 -115 74 -175 164 106 -59 -146 4 -36 3 -255
4757 -255 177 35 -148 46 16 229 8 192 -82 60 130 70 55 -37 383 21 194 6 26 -129 81 51
$$ packed form
4598A19j76l15N13l8k52K93p3%%l03K93j44L13l54L17k83N3J39o9k53K22L02j69
4621A35j57N9n5J16j31j65L07j50K58p4p5j72P5L94m29m6j00P3K2K80j53m2m3
4644g3J37j5j49K98j93K5J65m05J23J65l68N00m83L74k83J73P9j72P2r0L1J06
4666A7k60J56K30j44k17L68l76J70m7K0M10m17J5J47n2j19k15J64K66k13J69N1
4688A23l73K58N8P4P2j14j97J82k36l3M43l50q4P3K18p2M9n1J9l1o7K57l89K41
4712G0j42J09r2j72L15j79N6K13k92J17l1k38J69J85j07j10K79j00J5j55J05j79
4734a64K09l16L77R8k22J73j62j2r4J39J8q7p2J89k49L39n8j65q7J50m0L9k58
4757b55M32j42j83J94l0K13k21J84k74J42P0o0j5r2M20l62J73j88K0j55K10l0
$$ plain form
4779 51 -55 -151 36 219 34 34 19 100 52 -20 -37 -47 -122 -70 -339 246 -115 66 -32 216 190 22 -191 -235 2
4804 2 -49 103 190 -11 -98 200 37 68 9 -187 157 156 80 -156 -74 42 2 -192 -150 28 120 324 -16 181 -3
4829 -3 -230 301 -23 116 292 -200 -214 -277 -57 138 -6 -90 -61 -62 156 -206 -108 -9 282 -68 -45 211 -36 76
4853 76 -134 195 -28 -192 237 44 214 293 -221 -16 -237 -106 -130 79 -13 169 19 11 -52 202 148 -156 108
4876 108 -171 -15 -1 100 39 -47 -104 -48 125 -108 -12 -19 83 161 -196 104 81 -231 192 10 82 27 34 -63 -157
4901 -157 -19 175 -100 34 -26 169 245 -70 100 -128 -146 -110 171 -242 -162 219 35 38 -34 -164 141 222 -137
4924 -137 117 -259 -115 76 254 61 -160 204 136 -75 -107 -209 -6 149 -53 159 55 188 93 2 82 -230
4946 -230 -221 -44 23 -51 -339 -198 -113 -139 275 13 -162 18 -20 -51 432 -124 -36 -109 139 -182 -16 -106 -175 -182 -169
$$ packed form
4779E1j06r6J87J83j85%j5Q1m8p2j7j0p5N2k69N85l61J81r8K48k6j68k13m4K37
4804Bn1J52Q7k01q7K98j63L1n9j96L44jp6k36Q2J16m0j94M2J78R2K04l40J97j84
4829ck27N31l24J39J76m92j4o3K20J95j44q4K9jK18l62R8R9K91l50K3K56k47J12
4853G6k10L29k23j64M29j93J70P9n14K05k21J31k4K09r2J82j50qo3K54n4l04K64
4876A08k79J56J4J01o1q6n7N6J73k33R6pJ02P8l57L00k3l12M23j82P2n5Pr7r4
4901a57J38J94k75J34o0J95P6l15J70k28j8L6K81m13Q0L81j84Lp2j30L05Q1l59
4924a37K54l76J44J91J78j93k21L64o8k11l2j02K03J55k02K12j04J33r5r1Q0l12
4946b30RJ77O7p4k88J41Q5k6M14k62j75J80l8l1M83n56Q8p3K48l21J66r0o9pJ3
$$ plain form
4971 -169 43 -179 -210 214 319 120 -106 140 1 -77 -45 -236 13 -8 -54 109 -6 -12 -200 312 -178 -25
4993 -25 76 -150 122 -182 177 -82 -3 -136 -185 17 -40 -216 156 -95 28 64 138 96 -208 157 312 134
5015 134 54 -15 -111 49 -132 147 -305 28 203 162 -110 -95 186 -370 -248 73 -5 154 194 90 81 54 -100
5038 -100 20 -26 186 3 94 -145 194 -55 -22 3 -83 31 -104 -131 62 128 53 13 -28 -60 73 -122 197 213
5062 213 158 160 194 119 -52 389 -174 176 -15 -108 -118 269 406 -9 -5 -94 27 -21 -342 -229 52 157 53 158
5086 158 -186 61 -239 -88 -173 154 184 -198 197 -220 155 -180 -9 -77 375 -60 -286 20 -169 -2 -214
5107 -214 -166 -17 -41 -65 12 131 -168 124 -50 -11 439 197 2 371 -145 141 -60 82 48 -77 95 229
5129 229 130 -75 148 -51 188 156 34 106 -87 10 175 -6 18 98 133 46 -59 -95 427 212 -180 77 59
$$ packed form
4971a69K12k22l1M24J05j99k26K46j39p8L2j91K49k1m6J63j15oj88N12m90J53
4993b5J01k26K72l04L59k59P9j33m9K02n7j76L72k51J23L6P4m2l04L65J55j78
5015A34q0o9r6J60j81K79m52L33J75m1k72J5K81n56J22L21p8J59M0j04rk7j54
5038a00J20m6K12j83R1k39L39k49L3K5q6J14j35k7J93O6p5m0m1l2J33j95L19J6
5062B13n5KL4p5j71M41n63L50j91r3j0L87J37m15Mq9J21m8l21J13K81J05j04J05
5086A58l44K47l00J51q5L27L0l82L95m17L75l35J71o8M52m35k26L06j89J67k12
5107b14M8J49k4k4P7J19k99K92j74L9M50k42j95L69n16K86k01J42l4j25J72J34
5129B29r9k05K23j99K39l2j22P2j93R7J65j81K4Q0L5q7j05l6N22k15l92K57j8
$$ plain form
5152 59 -50 96 -38 56 53 -71 -215 151 -285 -131 -127 255 115 18 41 -118 -224 -188 120 -86 44 89 -51
5175 -51 -19 122 4 -176 -46 173 -129 -161 -185 -23 0 42 84 234 -170 -74 32 -59 -128 -127 -143 -64 -141 -98 -342
5200 -342 18 50 -70 208 7 -59 85 -237 -107 -33 279 -59 -227 66 291 -130 -107 266 200 -159 12 -213
5222 -213 -239 -82 -124 45 -11 44 -29 153 136 -150 -182 75 152 57 102 65 -116 62 -283 -108 16 121 -60 -98
5246 -98 83 20 95 106 179 -86 -277 -311 -48 8 -293 -143 -106 5 102 -61 244 -278 83 -4 50 -181 47 146
5270 146 86 -81 273 15 -86 3 -174 -281 -353 -189 303 -68 7 -155 -85 42 -403 196 -13 -71 -30 -11 -92
5293 -92 -87 141 16 18 -69 -222 -148 50 -244 -91 -155 7 -239 132 -212 116 60 -172 246 96 107 46 -22 292
5317 292 153 128 -151 289 14 100 -21 -277 306 227 -31 70 -13 57 256 -192 2 -18 19 31 28 111 31 27 -95
$$ packed form
5152E9j09J46j34R4lj24j44L66m36J54ML82j40r7K3j59j06L6L08k06J30M5j40
5175e1L2J41j18j80J30K19l02l2k4J62K3M2M2J50m04R6J06r1o9Jj6P9p7M3k44
5200c42L60L2j20K78k01o6J44l22J30P4L12l38j68K93K25m21K3L73o6l59J71k25
5222b13k6J57m2J69n6N5p3J82j7k86l2K57P7r5M5l7j81J78l45J75J24J05j81l8
5246i8J81o3P5J1P3k65j91l4K63N6l01J50L7J11R7j63L05n22L61q7N4k31K28R9
5270A46o0j67L54k58j01Q9j77j07p2J64M92l71P5j62P0J27m45N99k09n8M1J9q1
5293i2NK28j25Kq7j53P4J98k94J53o4J62k46L71l44L28n6k32M18j50J1o1o8L14
5317B92j39k5k79M40k75Q6j21k56N83p9k58J01q3P0J99m48J94k0L7J2lQ3q0mj22
$$ plain form
5342 -95 -93 94 131 -193 27 -138 10 223 146 8 -238 12 38 -89 139 168 5 -161 81 227 213 -99 14
5365 14 -71 -17 86 -65 -198 -43 -98 -145 -17 -19 -99 179 156 -173 10 -115 -73 -283 55 -76 128 -230 -51
5388 -51 71 20 -61 -199 69 -217 133 11 -191 0 56 -83 254 165 -60 -131 175 70 27 -96 60 163
5410 163 72 80 21 30 -71 -167 -88 136 -235 27 -3 -322 -167 102 167 -289 150 231 269 111 86 -36 35 -180 152
5435 152 -169 183 163 -105 4 95 2 83 -79 -110 60 -149 -183 -104 5 -109 -8 -393 -238 -9 49 -11 -271
5458 -271 -46 184 -103 -76 -113 105 -90 -15 -52 -52 -307 99 -99 169 173 256 5 -40 299 -26 -194 33 -72
5481 -72 48 77 -106 -130 60 -66 86 68 -265 156 108 -39 123 139 -379 191 -128 168 71 1 -139 -43 87
5504 87 -110 271 116 192 40 -22 -229 -268 -30 123 -258 -144 15 -307 -347 -62 -118 -132 99 -4 80 -15 -182
$$ packed form
5342i5KJ87L7l24K20j65J48K13p7j38k46K50K6j27K28K9j63j66K42J46j4l12J13
5365A4q5N4J03j51j33J55n5m7J28kq0K78k3l29J83j25M2k10L38j31K04l58J79
5388e1J22n1q1j38K68k86L50j22k02J91N6j39L37q9k25p1L06j05m3j23J56J03
5410A63r1Qn9Rj01r6P9K24l71K62l0l19J55K69O5m56M39Q1L8j58k5j22P1k15L32
5435A52l21L52k0k68J09R1r3Q1j62l1J70k09l4P9J09j14J01l85J55K29N8o0k60
5458b71K25K30k87K7l7K18j95P5l7%k55M06j98K68MQ3k51m5L39l25j68K27j05
5481g2J20K9j83k4J90j26J52j8l33M21m8j47J62J6n18N70l19K96r7p0j40R6J30
5504H7j97L81j55P6j52o2k07l9K38J53l81J14J59l22m0K85n6j4K31j03Q4r5j67
$$ plain form
5527 -182 44 -4 79 -34 243 -183 -264 59 178 -115 -189 179 -127 13 116 -146 12 104 -103 209 -172 -91
5549 -91 -98 -16 -14 -31 -119 -100 -73 1 -139 -40 210 98 -149 319 165 -56 56 46 -340 97 253 -118 13 92 -39
5574 -39 23 -121 175 -28 131 -55 167 -28 -199 -135 137 -97 -120 -162 66 -1 -28 -79 -125 -81 14 -71 42 168
5598 168 168 -86 6 -54 4 118 -253 -145 -11 -98 -47 -250 -87 -149 -261 -24 -359 -336 -132 67 67 -145 -50 -268
5622 -268 155 -85 -157 146 83 -143 -1 59 90 -61 -30 -21 103 203 56 -201 -30 26 173 107 229 35 -37
5645 -37 -24 -15 81 -342 143 46 364 -187 10 -35 104 228 -237 426 -54 302 117 -16 -151 126 -8 -247
$$ packed form
5527a82K26m8Q3j13K77m26q1L23J19k93p4L68l06J40J03k62J58R2k07L12l81Q1
5549i1pQ2Kj7q8J9K7P4j40R9K50j12k47M68j54k21J12j0l86M37J56l71J31P9j31
5574c9O2j44K96k03J59j86K22j95j71O4K72k34k3m2K28o7k7n1m6M4R5q5J13J26
5598A68%k54R2o0N8J14l71J08J34q7N1k03J63o2j12K37l35K3K04J99%k12R5k18
5622b68M23k40p2L03o3k26J42O0L1j51L1RJ24J00j47k57J71N6J47o6J22j94p2
5645c7J3RR6m23M85r7L18n51J97m5J39J24m65O63m80L56j85j33j35K77j34k39
$$ [...]
8191B13
##END NTUPLES=NMR FID
##END=
