##TITLE=1H_DE-80Wnk
 200.13MHz, D2O,
 8 sc
 
 30.1.2025
##JCAMPDX= 6.0         $$ Bruker NMR JCAMP-DX V2.0
##DATA TYPE= NMR FID
##DATA CLASS= NTUPLES
##ORIGIN= UXNMR, Bruker Analytische Messtechnik GmbH
##OWNER= pz
$$ XWIN-NMR		Version 3.5
$$ Thu Jan 30 15:11:20 2025 Russian Standard Time (UT+4h)  she@DPX200
##.OBSERVE FREQUENCY= 200.1313
##.OBSERVE NUCLEUS= ^1H
##.DELAY= (6, 6)
##.ACQUISITION MODE= SIMULTANEOUS
##.ACQUISITION SCHEME= undefined
##.AVERAGES= 8
##.DIGITISER RES= 18
##SPECTROMETER/DATA SYSTEM= spect
##.PULSE SEQUENCE= zg30
##.SOLVENT NAME= D2O
##.SHIFT REFERENCE= (INTERNAL, D2O, 0, 14.3821)
##AUDIT TRAIL= $$ (NUMBER, WHEN, WHO, WHERE, WHAT)
$$ ##TITLE= Audit trail, XWIN-NMR		Version 3.5
$$ ##JCAMPDX= 5.01
$$ ##ORIGIN= Bruker BioSpin GmbH
$$ ##OWNER= she
$$ F:/spectra/data/she/nmr/H-C/1/audita.txt
$$ ##AUDIT TRAIL=  $$ (NUMBER, WHEN, WHO, WHERE, WHAT)
(   1,<2025-01-30 15:10:13.51 +0400>,<she>,<DPX200>,
      <created by zg, POWCHK disabled, PULCHK disabled
       configuration hash MD5:
       00 E9 B6 7A A2 85 ED C7 34 08 36 98 17 FE 4E 26
       data hash MD5: 16K
       69 9B B8 1D C2 ED 62 C6 AC 04 C5 8F 14 8D F0 76>)
$$ ##END=
$$ 
$$ hash MD5
$$ B3 E0 B5 55 07 3C 03 5F 95 5E CD 2D BD 21 0E 2C
##$RELAX= 
##$RELAX= 
##$RELAX= 
##$RELAX= 
##$RELAX= 
##$RELAX= 
$$ Bruker specific parameters
$$ --------------------------
##$DU= <F:/spectra>
##$EXPNO= 1
##$NAME= <H-C>
##$PROCNO= 1
##$TYPE= <nmr>
##$USER= <she>
##$AMP= (0..31)
100 100 100 100 100 100 100 100 100 100 100 100 100 100 100 100 100 100 
100 100 100 100 100 100 100 100 100 100 100 100 100 100 
##$AQSEQ= 0
##$AQ_mod= 1
##$AUNM= <au_zg>
##$AUTOPOS= <>
##$BF1= 200.13
##$BF2= 200.13
##$BF3= 200.13
##$BF4= 200.13
##$BF5= 200.13
##$BF6= 200.13
##$BF7= 200.13
##$BF8= 200.13
##$BYTORDA= 1
##$CFDGTYP= 0
##$CFRGTYP= 5
##$CHEMSTR= <none>
##$CNST= (0..31)
1 1 145 1 1 1 1 1 1 1 1 1 1 1 1 1 1 1 1 1 1 1 1 1 1 1 1 1 1 1 1 1 
##$CPDPRG= <>
##$CPDPRG1= <>
##$CPDPRG2= <>
##$CPDPRG3= <>
##$CPDPRG4= <mlev>
##$CPDPRG5= <mlev>
##$CPDPRG6= <mlev>
##$CPDPRG7= <mlev>
##$CPDPRG8= <mlev>
##$CPDPRGB= <>
##$CPDPRGT= <>
##$D= (0..31)
0 0.7 0 0 0 0 0 0 0 0 0 0.03 0 0 0 0 0 0 0 0 0 0 0 0 0 0 0 0 0 0 0 0 
##$DATE= 1738235412
##$DBL= (0..7)
120 120 120 120 120 120 120 120 
##$DBP= (0..7)
150 150 150 150 150 150 150 150 
##$DBP07= 0
##$DBPNAM0= <>
##$DBPNAM1= <>
##$DBPNAM2= <>
##$DBPNAM3= <>
##$DBPNAM4= <>
##$DBPNAM5= <>
##$DBPNAM6= <>
##$DBPNAM7= <>
##$DBPOAL= (0..7)
0.5 0.5 0.5 0.5 0.5 0.5 0.5 0.5 
##$DBPOFFS= (0..7)
0 0 0 0 0 0 0 0 
##$DE= 6
##$DECBNUC= <off>
##$DECIM= 32
##$DECNUC= <off>
##$DECSTAT= 4
##$DIGMOD= 1
##$DIGTYP= 9
##$DL= (0..7)
0 120 120 120 120 120 120 120 
##$DP= (0..7)
150 150 150 150 150 150 150 150 
##$DP07= 0
##$DPNAME0= <>
##$DPNAME1= <>
##$DPNAME2= <>
##$DPNAME3= <>
##$DPNAME4= <>
##$DPNAME5= <>
##$DPNAME6= <>
##$DPNAME7= <>
##$DPOAL= (0..7)
0.5 0.5 0.5 0.5 0.5 0.5 0.5 0.5 
##$DPOFFS= (0..7)
0 0 0 0 0 0 0 0 
##$DQDMODE= 0
##$DR= 18
##$DS= 0
##$DSLIST= <SSSSSSSSSSSSSSS>
##$DSPFIRM= 0
$$ [...]
##$SUBNAM0= <"">
##$SUBNAM1= <"">
##$SUBNAM2= <"">
##$SUBNAM3= <"">
##$SUBNAM4= <"">
##$SUBNAM5= <"">
##$SUBNAM6= <"">
##$SUBNAM7= <"">
##$SUBNAM8= <"">
##$SUBNAM9= <"">
##$SW= 18.0517328524113
##$SWIBOX= (0..15)
0 0 2 0 0 0 0 0 0 0 0 0 0 0 0 0 
##$SW_h= 3612.71676300578
##$TD= 16384
##$TD0= 1
##$TE= 0
##$TE2= 300
##$TE3= 300
##$TEG= 300
##$TL= (0..7)
0 120 120 120 120 120 120 120 
##$TP= (0..7)
150 150 150 150 150 150 150 150 
##$TP07= 0
##$TPNAME0= <>
##$TPNAME1= <>
##$TPNAME2= <>
##$TPNAME3= <>
##$TPNAME4= <>
##$TPNAME5= <>
##$TPNAME6= <>
##$TPNAME7= <>
##$TPOAL= (0..7)
0.5 0.5 0.5 0.5 0.5 0.5 0.5 0.5 
##$TPOFFS= (0..7)
0 0 0 0 0 0 0 0 
##$TUNHIN= 0
##$TUNHOUT= 0
##$TUNXOUT= 0
##$USERA1= <user>
##$USERA2= <user>
##$USERA3= <user>
##$USERA4= <user>
##$USERA5= <user>
##$V9= 5
##$VALIST= <valist>
##$VCLIST= <CCCCCCCCCCCCCCC>
##$VD= 0
##$VDLIST= <DDDDDDDDDDDDDDD>
##$VPLIST= <PPPPPPPPPPPPPPP>
##$VTLIST= <TTTTTTTTTTTTTTT>
##$WBST= 1024
##$WBSW= 4
##$XGAIN= (0..3)
0 0 0 0 
##$XL= 0
##$YL= 0
##$YMAX_a= 659248
##$YMIN_a= -663057
##$ZGOPTNS= <>
##$ZL1= 120
##$ZL2= 120
##$ZL3= 120
##$ZL4= 120
##$ABSF1= 10
##$ABSF2= 0
##$ABSG= 5
##$ABSL= 3
##$ALPHA= 0
##$AQORDER= 0
##$ASSFAC= 0
##$ASSFACI= 0
##$ASSFACX= 0
##$ASSWID= 0
##$AUNMP= <proc_1d>
##$AZFE= 0.1
##$AZFW= 0.1
##$BCFW= 1
##$BC_mod= 2
##$BYTORDP= 1
##$COROFFS= 0
##$CY= -3
##$DATMOD= 1
##$DC= 2
##$DFILT= <>
##$DTYPP= 0
##$F1P= 0
##$F2P= 0
##$FCOR= 0.5
##$FTSIZE= 0
##$FT_mod= 4
##$GAMMA= 1
##$GB= 0.15
##$INTBC= 1
##$INTSCL= 1
##$ISEN= 128
##$LB= 0.25
##$LEV0= 0
##$LPBIN= 0
##$MAXI= 10000
##$MC2= 0
##$MEAN= 0
##$ME_mod= 0
##$MI= 1.114404
##$NCOEF= 0
##$NC_proc= 0
##$NLEV= 6
##$NOISF1= 3.799351
##$NOISF2= 2.8
##$NSP= 1
##$NTH_PI= 0
##$NZP= 0
##$OFFSET= 14.38212
##$PC= 1
##$PHC0= 258.7095
##$PHC1= -5.407778
##$PH_mod= 1
##$PKNL= yes
##$PPARMOD= 0
##$PSCAL= 0
##$PSIGN= 0
##$REVERSE= no
##$SF= 200.129724274929
##$SI= 16384
##$SIGF1= 3
##$SIGF2= 2
##$SINO= 400
##$SIOLD= 16384
##$SREGLST= <1H.CDCl3>
##$SSB= 0
##$STSI= 0
##$STSR= 0
##$SW_p= 3205.1282051282
##$SYMM= 0
##$S_DEV= 0
##$TDeff= 0
##$TDoff= 0
##$TI= <>
##$TILT= no
##$TM1= 0
##$TM2= 0
##$TOPLEV= 0
##$USERP1= <user>
##$USERP2= <user>
##$USERP3= <user>
##$USERP4= <user>
##$USERP5= <user>
##$WDW= 1
##$XDIM= 8192
##$YMAX_p= 0
##$YMIN_p= 0
$$ End of Bruker specific parameters
$$ ---------------------------------
##NTUPLES= NMR FID
##VAR_NAME=  TIME,          FID/REAL,        FID/IMAG
##SYMBOL=    X,             R,               I
##VAR_TYPE=  INDEPENDENT,   DEPENDENT,       DEPENDENT
##VAR_FORM=  AFFN,          ASDF,            ASDF
##VAR_DIM=   8192,          8192,            8192
##UNITS=     SECONDS,       ARBITRARY UNITS, ARBITRARY UNITS
##FACTOR=    0.0002768,     1,               1
##FIRST=     0,             0,               0
##LAST=      2.2672688,     0,               0
##MIN=       0,             -663057,         0
##MAX=       2.2672688,     659248,          0
$$ Real data points
##PAGE= N=1
##DATA TABLE= (X++(R..R)), XYDATA
0@%%%%%%%%%%%qQqJ6j6J6j6K4l2L7m5M9n7P0q3R8j12J29j47J68j92K17k49K81
35A48l14L52l94M40m90N45o06O71p42Q18r04J001j102J214j338J473j623J790
53I39j977K184k418K688k998L362l791M310m953N766o842Q332j0539J4149k1059
68a2847L8965j76481m99446j3248J30364K27448M15680L96711Q5332r1830k13920
79B86728l52122l19713j30085n796J88141L84484L08102J00236K7707j27347l63600
90c265l34524j18643j6890J24657L42544L29973J21608p413j37527k98668k73040
101b71188j13419j6341J08245K59025K45048J32888N7236r2674k59902k35988
111a87070j27670p5653O7525K56881K46372J25675O6076n8505k40569k47857j26275
$$ plain form
0 0 0 0 0 0 0 0 0 0 0 0 0 -8 0 -8 8 -8 8 -8 16 -16 21 -24 25 -32 38 -45 53 -59 70 -77 91 -101 116 -133 148
35 148 -166 186 -208 232 -258 287 -319 352 -390 428 -476 525 -577 637 -701 772 -851 939
53 939 -1038 1146 -1272 1416 -1582 1780 -2011 2299 -2654 3112 -3730 4602 -5937 8212 -12847
68 -12847 26118 -150363 -649809 -663057 -532693 -305245 110435 507146 592478 500648 286728
79 286728 -65394 -385107 -515192 -520988 -332847 51637 359739 459975 487682 360335 -3265
90 -3265 -337789 -456432 -473322 -348665 -6121 323852 445460 438047 300520 1852 -271188
101 -271188 -384607 -400948 -292703 -33678 211370 344258 401494 308820 48918 -187070
111 -187070 -314740 -390393 -322868 -65987 180385 306060 372136 313631 73062 -174795 -301070
122c01070m1038O8942J98714K04065J30896O5220n5200j79980j83531j39840r6115
133c28937M2799J91637J87278J25557R0326k6674j77326j90393j25267p8609K1897
144b67712J53782J84844J35629P1242l3800j35626j55508j32295q5646K5808J27620
155a11662J40603J27044J01018j0197j30798j47342j18063q9086K010J15323J46297
166B5147J18000P8977k388r4817j33815j24918q0682Q175Q6570J14068J20086
177A14403R0990l64q5887j07952j10793r4587j0860Q2947J12636J05194Q1555
188A77282J5077o6431j08053j07903p6553j3163N3609R6387J10957Q1260R471
199A71940n2873q4202j01830q5285j6998N2080Q1056R3126Q2413K6314m5297q4447
$$ plain form
122 -301070 -342108 -273166 -74452 129613 260509 325729 270529 90549 -92982 -232822 -328937
133 -328937 -286138 -94501 92777 218334 308660 281986 104660 -85733 -211000 -289609 -267712
144 -267712 -113930 70914 206543 277785 243985 108359 -47149 -179444 -265090 -239282 -111662
155 -111662 28941 155985 257003 246806 116008 -31334 -149397 -238483 -236473 -121150 25147
166 25147 143147 222124 219736 124919 -8896 -133814 -214496 -206321 -119751 -5683 114403
177 114403 205393 205029 119142 11190 -99603 -194190 -205050 -122103 -9467 95727 177282
188 177282 192359 125928 17875 -90028 -166581 -179744 -126135 -29748 81209 162469 171940
199 171940 119067 34865 -66965 -152250 -169248 -117168 -36112 57014 139427 165741 120444 35997
211C5997r0716p3045k6339L2879P8169R2770P0925K3232k5441o6710r2649p6910
223a17838k2834K8252O0380Q4192P7334K9006k7278o1687p6634p0877l4440J9291
235a13133O1756P6997O4823L2043j1188n4025p8317o5553k8876Q877M6183P3642
247A3229O8955L1104j1057m3450o5758o6663l6478Q830M4072O1875O0694L8405
259A03758k295m2365o2920n6864l4976k415L5977O1901N8686L2542J224l0062
271F2191n6793n9216l5006J8K9719N0159N5970L8363L072l1052m8161n0189l7713
284g8638q161K7609M8857M8506L4119R859k1233m6620n0811l2759p883J7844M0802
297a8509M9878L6143P465j8369l7140m5230l7537j1954J8832L7322M1909L5015
$$ plain form
211 35997 -54719 -127764 -154103 -121224 -43055 49715 120640 143872 118431 51721 -40928 -117838
223 -117838 -140672 -112420 -52040 32152 109486 138492 111214 49527 -27107 -97984 -132424 -113133
235 -113133 -51377 25620 90443 122486 111298 57273 -21044 -86597 -115473 -106596 -60413 13229
247 13229 82184 113288 102231 58781 -6977 -73640 -110118 -101288 -57216 4659 65353 103758
259 103758 101463 59098 -3822 -60686 -95662 -98077 -62100 -199 58487 91029 92253 62191
271 62191 5398 -53818 -88824 -88806 -59087 -8928 47042 85405 88477 57425 9264 -40925 -78638
284 -78638 -86799 -59190 -10333 38173 72292 82151 60918 14298 -36513 -69272 -77155 -59311 -18509
297 -18509 31369 67512 74977 56608 19468 -25762 -63299 -75253 -56421 -19099 22810 57825
309E7825J4607j5071l7010m1580l2362j4191J0315L4226M2333L2567J2716r531
321E4844k9498m0595l4025j3554R904K6931L6749L4564J6344q623k7853l4251
333i063l1575j7679N066K7015L4825K9197J6879k263k3411l5874l0167j5132K896
346d9286J9898L2541L1602J6432l559j9525k8320l0434j9045J820K0159K7982
358B65K7099J8820J045j8165k8381k6433j6813k399J4734K7167K8138J6011J551
371D2639j2963k3807k7735j8053j322J2299K1915K5456J9378L700j2875k1566
383G066k3396j8328n130J0394K1765K2879J6987N508q418j9674k3796j6898m443
396c5484O917J7654K2296J8015N206p105j5962k0462j8663o751O782J6162J9323
$$ plain form
309 57825 72432 57361 20351 -21229 -53591 -67782 -57467 -23241 19092 51659 64375 54844
321 54844 25346 -15249 -49274 -62828 -52924 -25993 10756 45320 61664 53041 25188 -9063
333 -9063 -40638 -58317 -53251 -26236 8589 37786 54665 52402 28991 -6883 -37050 -52182 -49286
346 -49286 -29388 3153 34755 51187 47628 28103 -217 -30651 -49696 -47876 -27717 265
358 265 27364 46184 47229 29064 683 -25750 -42563 -44962 -30228 -3061 25077 41088 42639
371 42639 29676 5869 -21866 -39919 -41241 -28942 -7027 18429 37807 41507 28632 7066
383 7066 -16330 -34658 -39788 -29394 -7629 15250 32237 37745 29327 9653 -14143 -31041 -35484
396 -35484 -28567 -10913 11383 29398 34604 27499 11537 -8925 -27588 -34339 -27557 -11395 7928
409G928J6878Q023n223j5392j9579j5328p499K665J3776J9899J5896P023l098
422B5969j1279j8392j7396p084K877J0680J6816J6090R086j831j1468j5860j4573
435a6365q928J94J0287J5805J4421P832Q66q507j5331j4995p727l19P309J3828
449a630J4734Q348J149p283j2863j3705r358j472P105J2416J2666Q722K476n798
463A5507j2588j2174p847l159M430J1760J2421Q197K828m261j0259j1735r312
476a6192k633M334R224J0729Q978L786l485r710r739q231m167K341R225R915P585
491A1960M156j427q112j0075q164l754J451P258R241Q204M029j347o623q264p667
506i134n352J015O456Q087P084N431j30o066q115p094m722q1M768P928P319M666
$$ plain form
409 7928 24806 32829 27606 12214 -7365 -22693 -30192 -27527 -13751 6148 22044 29067 25969
422 25969 14690 -3702 -21098 -28182 -25305 -14625 2191 18281 27367 25536 14068 -1792 -16365
435 -16365 -25293 -25099 -14812 993 15414 23246 24112 15605 274 -14721 -22448 -22767 -15458 -1630
449 -1630 13104 21452 22601 15318 2455 -11250 -20608 -22080 -14975 -2559 10107 18829 21305 15507
463 15507 2919 -9255 -17102 -20261 -15831 -4071 8350 16547 19375 15114 4855 -6880 -16192
476 -16192 -18825 -14491 -5267 5462 14440 18226 14741 5031 -4708 -12939 -17106 -14765 -5540 4375 11960
491 11960 16116 14689 6577 -3498 -11662 -15416 -13965 -6707 2534 10738 14767 13420 6797 -1467 -9134
506 -9134 -14486 -13471 -7015 1072 8156 13587 13457 7391 -724 -7818 -12540 -12621 -7853 75 7394 12060
522A2060m6m585o934p159m886o9M417N991O536N668O55m047o104o512n281j206
538a1502M039N680O457M870J228k890n827o484m474j167K495N067N857N380J000
553I729k543m204n577n407j824K727M118N461M609K255j442m760n428m779j544
568h609J147L978N437M474J862j373k770n428m732j716R65K822M517M825K333
583G732p08l060m449m540k370K04L346M274M260K285p7k605m215m226k264P3J778
600d562L909M497K459j33j930l427m172k539k29J953L360L732K301J085k001l429
616H74l466k523p15J118L494L635K122Q15j151k571l726k544k41O66K640L013
632A440K536J210j042k529l135k323j103O69K438K970K322J213n79j984l300k314
$$ plain form
522 12060 12014 7429 495 -6664 -11550 -11619 -7202 -1211 5325 10993 11648 7601 1497 -5015 -10296 -11502
538 -11502 -7463 -1783 4674 9544 10772 7882 2055 -4429 -8903 -10070 -7575 -2508 3349 8729 9729
553 9729 7186 2982 -2595 -8002 -9826 -7099 -2981 2480 7089 9344 7902 3142 -2286 -7065 -8609
568 -8609 -7462 -3484 1953 6427 8289 6916 4146 -1282 -6014 -7730 -6765 -3943 574 5399 7732
583 7732 7024 3964 -485 -5025 -7395 -7191 -3845 429 4689 6974 6897 4292 77 -4149 -6413 -6340 -4562
600 -4562 -653 3844 6303 6170 4240 813 -3359 -5898 -6127 -4174 -814 2918 5219 6304 4303 874
616 874 -2592 -5115 -5830 -4712 -1218 2417 4539 5354 4203 1632 -2094 -4638 -4879 -4213 -1573 1440
632 1440 3976 5186 4144 1615 -1520 -3843 -4946 -4277 -1839 1131 3453 4666 4087 2103 -1197 -3511
648c511r39M86J856L030K131J003j80j735k736k206j187J9K192K119K175J217
664C734J86j699k428k053j328j15J281K479J468K043k68r80k060k143j473l49
680c705J370J738K277J476K60j109j646j817j798k43P65J981J651J339M42m82
696B499j722j694j450p18O52J629J671J459M49m73j287j881j205o68N90P70J945
713E66J546N37l88j114j573j418p52K06J223J214J564P04k88q23r82j568q44j7
731b207Q45J096J910M68J17o53j265j363r39l77Q21J368J108J191O8m83j122j391
749h08p46l47N16J029J042R65N22o17q37j369p88n57L67J080J016R21L33j34p80
768H08j158p44p33M27P22Q09R18N50R9r81j025m13r23M40L91O27R77O63J58q27
$$ plain form
648 -3511 -4450 -3964 -2108 922 3053 4056 3876 2141 -595 -2801 -3988 -3969 -1777 342 2517 3734
664 3734 3920 2221 -207 -2260 -3588 -3703 -2422 57 1525 3568 3300 2320 260 -1883 -3356 -3705
680 -3705 -2335 -597 1680 3156 3416 2307 661 -1156 -2954 -3197 -2432 -451 1200 2539 2981 2499
696 2499 777 -917 -2367 -3085 -2433 -804 867 2326 2775 2302 1015 -866 -2071 -2739 -2149 -1379 566
713 566 2112 2649 2261 1147 -426 -1844 -2596 -2390 -1167 47 1611 2315 2027 1204 222 -1346 -2190 -2207
731 -2207 -1362 -266 1644 2112 2229 1576 311 -1052 -1991 -2368 -1547 -179 929 2120 2188 1705 583 -808
749 -808 -1554 -1901 -1385 -356 686 1651 2173 1556 719 -650 -1438 -1995 -1628 -548 468 1389 1722 1588 808
768 808 -350 -1094 -1827 -1400 -678 131 1049 1599 1698 717 -308 -721 -1644 -1204 -813 -186 791 1454 1612 785
788G85n69j264k55m0L24J075O62Q44Q9q25n94p70p11l67P16O08Q98O85j11k97
808H83l82r67n72l86M20O48N15P22K29ko20o87p56Q3l28P76Q74N76l9L06n65r40
830b12n92k74K2N81L77R30L01j39m95p69l76l97l1L49M83P28M76j06k92n01p23
851f60m07L39L57K97K91P32J36k43n08n85p36j83O02K25N73J075m74j96n04m41
871c10l05j44P9N39J79P68k0p9m57m30n42m86Q56k83O34O75J79k34l54n17m69
892g21j8L01O9P53L4L09n5j41m43n02m89M44n0L66M49J74M25m62k62o57Q3j37
914e30o4N34K87J66J67K24m79r40J35j62K74L03M16J82K09l68l54k45j33k41P8
935e41N09L82L53k30k2j66m92m24j8J77Q8L78K96L71j38m67ql02k22m7L80K05
$$ plain form
788 785 216 -1048 -1303 -1343 -1019 56 718 1562 1651 826 232 -538 -1249 -1616 -900 -292 606 1291 1180 883
808 883 501 -466 -1038 -1424 -1004 -356 159 881 1110 1108 488 -199 -955 -872 -1200 -424 450 1026 987 1293 728 -212
830 -212 -804 -1078 -1056 -475 -98 832 1133 994 499 -270 -646 -1043 -1074 -725 -242 486 962 856 564 63 -660
851 -660 -1067 -728 -371 -74 217 949 1085 842 334 -251 -987 -1170 -568 -343 230 1305 831 635 131 -310
871 -310 -615 -759 -680 -141 38 806 786 707 250 -180 -722 -1208 -352 -635 -1 674 853 619 265 -252 -721
892 -721 -739 -438 -369 384 418 727 672 531 88 -414 -903 -459 -509 -143 306 480 905 443 181 -476 -393 -530
914 -530 -594 -60 227 393 560 784 305 -635 -500 -662 -388 -85 331 513 722 354 0 -245 -378 -619 -541
935 -541 -32 350 703 473 451 285 -207 -631 -649 -472 -384 -6 290 661 523 56 48 -254 -476 -523 -143 62
957F2N55M0o8m64k40m45j5J10J23L04N60L64j16n14l06l74k01j4K19O74j26M25
979E53N8l69j09m54k40J42J96J82qO29j49l0m20k12oj17P2L12K37jK36k47l98
1002a43J74m68k22K35Q4O23L17q3r7j85l16m81k23J97K40M67J78P8J00l90l21
1023b36j65M7j62J93O41K28j88n1k47k33j83j31nm6M74L54K97j66k94Q4n26j03
1045d18j85K93K97M25J91j73j87n28O9j85o3K31R2O62K8j07j39l61n6k77k15L82
1067b24Q1K77N14j77l87J06l57l10J50k56M85K99K71n4j84k10j76l38L51r7K11
1088b5j4L25J44J07l68k81j56m01K88o9K77N62j99K61l57l24J64m35L55r0J24
1109a12M32R6l49k0O1k52l29K13L95k80M77N9J70l61k51N7m49p1Q9M35K47L0J97
$$ plain form
957 62 617 657 589 125 -115 -560 -575 -465 -342 -38 522 886 770 256 -50 -424 -625 -639 -420 254 128 553
979 553 611 242 133 -321 -561 -419 -223 -41 -49 580 431 401 -19 -231 -237 -354 -282 30 267 266 502 255 -143
1002 -143 31 -437 -659 -424 -340 283 600 517 420 235 -81 -562 -785 -588 -348 119 297 375 475 85 -236
1023 -236 -401 -354 -516 -323 318 546 358 307 60 -173 -356 -487 -492 -538 -64 290 587 421 127 211 -315 -418
1045 -418 -603 -310 -13 412 603 430 243 -285 -216 -401 -464 -233 -141 521 549 442 303 -58 -114 -391 -606 -224
1067 -224 -143 134 648 471 84 190 -167 -477 -327 -583 -98 201 472 418 234 24 -152 -490 -139 -236 -25
1088 -25 -39 286 430 537 169 -112 -268 -669 -381 -450 -173 389 190 451 94 -230 -66 -501 -146 -236 -112
1109 -112 320 416 67 47 108 -144 -473 -260 135 -145 332 391 561 200 -51 6 -443 -514 -425 10 257 287 484
1132D84j58k07j00n16k8J34L15K07M36l69N0o2m45k08m7J45K15L97J5O3j96j77
1154e2j54k02j5J29K67N1L06p5m1J41n84k75K23k58O16N9K12J6J00j82o22j3J65
1177a88m47M12L54J76L9m3p4k81Q1m82J59qM35JJ75L6l36r3j45j54Q8k64M91K95
1201B27O5j20J5k65l33J97n8k5L61L60l36J93O0n39k80P8MN02m6P4J07J0L8l63
1225g4J21j78p4J3J76K5O85o92M55m68j18l02j7J58Q1L40R1R7K5k73m54K2k43
1248f04L24J38M18l40K33N21m85k30N5n03J28J05K30L85q3P2n19j68L40l86K50
1269a19m5k91Q87j68J43k42j05l49O5j73K6M16J52J61r2k79L2j32n69N14J31M9
1291A2L65j30n9q8k4l03j82J38J4M17j8J0J89j67q7j90l50K61J71j44K69k43L60
$$ plain form
1132 484 326 119 19 -497 -525 -391 -76 131 567 198 248 186 -259 -467 -514 -369 -154 243 258 321 125 -52
1154 -52 -206 -408 -423 -294 -27 24 330 255 214 355 -229 -504 -281 -539 77 136 348 364 464 282 -340 -353 -188
1177 -188 -635 -223 131 307 346 303 229 -52 29 -453 -294 -302 133 134 309 345 9 -84 -229 -383 -295 -559 -68 227
1201 227 292 172 187 -78 -411 -214 -272 -297 64 424 88 281 341 -198 -478 -400 -396 106 60 134 241 251 289 -74
1225 -74 47 -131 -205 -192 -16 9 694 2 457 -11 -129 -431 -448 -290 -209 131 222 319 344 71 -383 -361 -604
1248 -604 -280 -142 276 -64 169 690 205 -25 30 -473 -345 -240 -10 375 292 364 -155 -323 17 -369 -119
1269 -119 -164 -455 432 264 407 165 60 -289 -224 -397 -371 45 197 358 266 -13 19 -113 -682 -168 -37 12
1291 12 377 247 188 100 76 -227 -409 -271 -257 160 142 152 341 174 87 -103 -453 -192 -21 -165 104 -139 221
1314B21j52j64j14J9k8o6L95p2K79j07j0j87p5j73q3o3N29pJ97N1l4j86l82oJ58
1339f0p3O8n4N55k02m4m17L06m6k22J66p8RK50L30n91J77m5k32N4p4M7P8P2L29
1364C03m53n6k7k2K8J32K9J3K23k81J27N3k09J45k86O68k38l1J70o7m0l11L27
1387A97k90Rp6K46K16j02j12o9k1L1J4n1n8J87l06J82L36l03j24L09j99j70j69
1410c23K08K95j26m1r1L27k06J63j92r9Qj21L91j86j47R5m6K7J26k16K71j25L60
1433C52m12K05k31Q5j22O3J25m8J62Q4p6j26q3J28k26k9k3j78L85J58j73M5j58
1456i3r2J61J40l13J99%Rj35JJ18J47n6j16n8j90N37k43N0J65m15J61J7n0K50
1480A94k02j41J27J20k11L30j67l94K26J32o0n6R8P8K8m7J77j75J99k03Nj82L06
$$ plain form
1314 221 69 -95 -209 -190 -218 -284 111 39 318 211 201 14 -61 -234 -317 -380 149 142 339 390 356 170 -212 -218 -60
1339 -60 -133 -65 -119 436 234 190 -227 79 33 -189 -23 -101 -92 158 488 -103 74 29 -203 -149 -223 -176 -98 -26 303
1364 303 -150 -206 -233 -255 -227 -95 -66 -53 170 -111 16 69 -140 5 -281 387 149 118 288 221 181 -130 197
1387 197 -93 -84 -160 86 302 200 88 19 -2 29 43 -8 -66 121 -185 -3 333 30 -94 215 16 -154 -323
1410 -323 -115 180 54 13 -78 249 43 206 14 -85 -77 -198 193 7 -140 -45 -91 -64 62 -154 117 -8 352
1433 352 -60 145 -86 -1 -123 -60 65 17 179 263 187 61 -22 106 -120 -149 -172 -350 35 193 20 65 -93
1456 -93 -185 -24 116 -197 2 2 11 -124 -123 -5 142 86 -30 -88 -278 259 16 66 231 -184 -23 -6 -56 194
1480 194 -8 -149 -22 98 -113 217 50 -344 -118 14 -46 -102 -4 74 102 55 232 57 256 53 58 -124 182
1503A82j81j31J78j13j98J13J88n5j00J8J30k21M31n26J25K37jm5l84N47k79J56
1525G1r4j98M94k87p3J27n9L8j78r9J61L8J04J05N2k28J11O6l47o4J98K33n7n9
1549E5K1k88L21k57O3j6J65J13O1m31J87M0P5j09M7j1k26J85L36k43j00j6P8j19
1573f9J87L4m24N23k32K68l33J03K03j42R3j08k63oJ5J51M0K37j95J77k02K7l72
1596b88K18Q2J07p8o6K2J28j45k7K70n34K55K43k07J71q0l3k53J03k91K81L3J35
1619D6p0Q1j11L9j5N3Q3k50J96p5K65j29j21l6j0JJ98k41J81k88K07J44j74L5
1643IP5J0j60O5n5k4J5J51J39j59J01j88j0j3Q7k2j32R5k10M50l15J15l6J98j36
1668E0j35N3k1L41j48j41j06J89k97L66m52K49J18L8j26J44j71J32j01N3k21K45
$$ plain form
1503 182 1 -130 48 -65 -263 -150 38 -17 -117 -99 31 -190 241 -285 -160 77 76 31 -353 194 -85 71
1525 71 -23 -221 273 -14 -87 40 -19 19 -159 -258 -97 -59 45 150 202 -26 85 151 -196 -260 -62 171 114 55
1549 55 76 -212 109 -148 -85 -101 64 177 238 -193 -6 34 109 0 47 36 -190 -5 331 88 -12 -28 50 -69
1573 -69 118 152 -272 251 19 287 -46 57 260 118 211 103 -160 -166 -151 0 40 277 82 259 57 84 -288
1596 -288 -70 12 119 41 -25 -3 125 -20 -47 223 -311 -56 187 -20 151 71 38 -215 -112 -403 -122 -89 46
1619 46 -24 57 -54 -15 -30 23 106 -144 52 -23 242 113 -8 -44 -54 -53 145 -96 85 -203 4 148 -26 9
1643 9 84 94 -66 -1 -56 -80 -65 86 225 66 167 -21 -31 -44 43 21 -111 -16 -226 224 -91 24 -12 186 50
1668 50 -85 -32 -53 288 140 -1 -107 82 -215 151 -301 -52 66 104 -22 122 -49 83 -18 35 -186 59
1690E9k7q6P6K2M8k5m2J15j8j07j3p0J13R1j08O1j76J41K00l42K61m41K06L2J96
1715A66l57L34k39k11L50O8R1m80M8L60j11J35k37R7K44k98L7J26o4p7j8K3j81
1738a94K46j31Q1J71l63L2L83m93M52m64L80j63K39j26J34J21k89j64K06l1Rm8
1760a2r5L99j21j99N5r4o7K39L7o6N0p5r3J40L3l69JM21O2o2j89q8J89P7L6q7
1786A22k08L38k19J60n7q8l41K66l3Q7KK03l30K32m5k96J02J35l8m0M5L9J70m02
1810a96j39J71M12m79N41p8j93n3P5k76L41j40m4R0M5l7r0J4R0J62k92K08l8j26
1834c2N9P1k15L89J6n68K40q0L84m70M13l70J82j55J21o3n8RJ25r0O1j31l8K21
1858B1l22K09J84j63jK24K26j62j07K1j72K08K01m94j16J02Q6J71k2j50k14L36
$$ plain form
1690 59 32 -54 22 44 92 67 25 140 122 15 2 -68 45 136 28 89 -87 54 254 -88 173 -268 -62 -30 166
1715 166 -191 143 -96 -307 43 111 202 -278 -230 130 19 154 -83 14 258 -40 -3 123 59 -18 -36 -13 -194
1738 -194 52 -79 2 173 -190 -158 225 -268 184 -280 100 -63 176 50 184 305 16 -148 58 27 36 -12
1760 -12 -107 292 171 -28 27 -67 -134 105 142 76 126 51 -42 98 131 -238 -237 184 246 184 -5 -93 96 173 209 122
1786 122 -86 252 33 193 136 48 -293 -27 -60 27 29 232 -98 134 89 -207 -105 30 -8 -48 -3 36 206 -196
1810 -196 -335 -164 248 -231 310 232 39 -14 61 -215 126 -14 -58 32 77 40 -50 -36 54 216 -76 132 94 -32
1834 -32 27 98 -117 272 288 -280 -40 -120 264 -206 207 -163 19 -136 -15 -78 -136 -127 -2 -92 -31 -162 -200 21
1858 21 -301 -92 92 -71 -72 152 378 216 109 130 -42 166 367 -127 -243 -141 -55 116 94 -56 -270 66
1880F6J95l17j3J64J22J82n40J92O5k26q5Q6K52l7k84J88J6l36K24J72j81K0k9
1903a04J12J28j03J68j09R1k27O3J1l56J88J46K33m62L28j13O0j01K40k68J94
1924A19J33j39j11J90o7j10K44j74j39M7R1j14o1L3K68k13r2J49p4r5L96l21j94
1947b34J18M14k26j17M7k2J98j91NJ08n4J11k27n6q6M73k14j58L3j09K77k00j2
1970a22J77j10J30m89J65J44K88j18o4K71l73R1j54J02K00m60J75K99M4m9N0l33
1992a36k1O2K3K81l19P2l5K51o5l26J15K53L15l65j38m3J06M0j61L63k61j08L84
2015B87p0k58P4K19N7m44J99j70L8k4J11J66q2K46m15P2J63k65j13L19k08J04
2037Fk71j4N50m81L30p0J61k44J48k1lK80Rl39o3L1mp5l6J89j79K52j17j21nQ3
$$ plain form
1880 66 261 -56 -69 95 217 399 -141 51 116 -110 -195 -109 143 106 -178 10 26 -310 -86 86 -95 -75 -104
1903 -104 8 136 33 201 92 183 -44 19 30 -326 -138 8 241 -221 107 -6 54 -47 193 -75 119
1924 119 252 113 2 192 125 15 259 85 -54 -7 84 -30 -91 -58 210 -3 -95 54 -20 -115 281 -40 -234
1947 -234 -116 298 72 -45 2 -20 178 -13 -8 100 46 157 -70 -126 -212 261 47 -111 -78 -187 90 -110 -122
1970 -122 55 -55 75 -414 -249 -105 183 65 1 272 -101 -10 -164 -62 138 -322 -147 152 196 147 197 -136
1992 -136 -157 -95 -72 209 -110 -38 -73 178 113 -213 -98 155 470 105 -33 -76 30 70 -91 272 11 -97 287
2015 287 217 -41 33 252 309 -135 64 -106 -68 -92 19 185 103 349 -66 6 169 -96 -209 110 -98 6
2037 6 -265 -279 271 -210 120 50 211 -33 115 94 91 371 380 41 -22 9 5 -70 -106 83 -96 156 39 -82 -87 -4
2063dj24P8J74J61j23k96J60k9k7k19K60l56K55K54m18L65j59j17L34m57K65k4
2085d7j82K33K5O4j46k0J89k73J47l15J75L32P7NLk47l1M9k02J2J91J39m59L17
2109C6LJ00j59K93n52K05JRN4k0K09O5l52K27k30m7J14L5p6j00J65R2j51K42k95
2134a32k4K40N0l0jq0j59L19k71j36M0M1K90k57K28j82J35J31l20L05k6j09j30
2157g8L40L01n87K23J02o57L24O3Lj63N0Jj24O6K08J30j17o1l4Q1k63K00J07m7
2181F8K9l06N48m26K59l81J58j06K52j47M20n28J14J24j81J32J24j00j46K99k93
2202h7N6r6k3K57j50O7m20J83J46K39l09J82j88J68j24LL0p2K56q4Q2l05L46k63
2226a06P8j51L93q6J71l96J81j48J8Q9l5r6J91N1r5L09m32l9N6p4j3L49j43m3
$$ plain form
2063 -4 -128 -50 124 285 162 -134 26 -3 -30 -249 11 -345 -90 164 -254 111 -48 -165 169 -288 -23 -47
2085 -47 -229 4 29 93 -53 -73 116 -157 -10 -325 -150 182 259 264 267 20 -11 38 -164 -152 39 178 -281 36
2109 36 39 139 -20 273 -279 -74 -73 -64 -10 -30 179 244 -108 119 -111 -158 -44 -9 -85 -185 -20 72 -79 163 -132
2134 -132 -156 84 134 104 103 23 -136 183 -88 -224 -184 -143 147 -110 118 -64 71 202 -118 187 161 52 -78
2157 -78 262 563 -24 199 301 -356 -32 31 34 -129 -79 -78 -202 -136 72 202 85 24 -10 71 -192 8 115 68
2181 68 97 -209 339 -87 172 -209 -51 -157 95 -52 368 -160 -46 78 -103 29 153 53 -93 206 -87
2202 -87 -31 -127 -150 107 -43 24 -396 -213 -67 172 -137 45 -143 25 -99 -96 -66 -138 118 34 116 -189 157 -106
2226 -106 -28 -179 214 128 299 -97 84 -64 -46 43 8 -88 103 154 59 368 -64 -103 -47 -121 -134 215 72 29
2250B9k68L16j71pk46K01K59j13k50L62l37J14R9M6J54j98r5O1J16j31L58l61
2272f2J14k16K97l51M07J17l51l6J65lJ00j56l1J4J9K00k29Q8o1K28k20j31J29
2295C1O1k47K16n6j08%m8J38P4j90J07n0K49r1m8j85M9J11k9k90K89l3Q8k9j59
2320a50L51k80J3k31L67k02j05K64L5l6k06L51k68J83n7j04L05j75k19J86r5L29
2342B56J9k18mj32R1K3j29Q0K40j58J32k76j40K36J1lj58J1J83k15L77j47k09
2365a30J30J59j1j51J16k0m2n7K67k55j80K07j38J35k48Q5J56J14r1K08k74K37
2387B17l86O0p0K01o2K7P0qK1Q0j39mk07K58mj29J83J85n15L01k67M04k70j18
2411a72J84O6Q0Q2k60O2K99l88Pn3L89l10j70J83J32J34k81J00k41O8m4J05J20
$$ plain form
2250 29 -239 77 -94 -101 -347 -146 113 0 -250 112 -225 -111 -12 34 188 -10 -105 -44 72 -59 299 -62
2272 -62 52 -164 133 -218 189 306 -45 -81 84 81 181 25 -6 8 27 227 -2 86 25 253 33 -98 31
2295 31 92 -155 61 5 -103 -103 -151 -13 61 -129 -22 -72 177 86 38 -147 -98 13 -16 -306 -17 -50 38 9 -150
2320 -150 201 -79 -66 -297 70 -132 -237 27 62 26 -180 171 -97 86 29 -75 230 55 -164 22 -73 256
2342 256 275 57 53 -79 12 35 -94 -14 226 68 200 -76 -216 20 31 28 -130 -119 64 -151 226 79 -130
2365 -130 0 159 148 -3 113 93 51 -6 261 6 -174 33 -105 30 -218 -133 23 137 46 254 -20 217
2387 217 -169 -109 -179 22 -40 -13 57 49 70 150 11 7 -200 58 54 -75 108 293 -222 79 -188 216 -54 -172
2411 -172 12 78 158 240 -20 42 341 -47 -40 -93 296 -14 -184 -1 131 265 -16 84 -157 -89 -133 -28 92
2434I2j70K50l19J55lq5j03Q9L45l26J04o0j25L37j58l9L4k2m17O22K48k72o6
2457A11m40J80M2M8NR0j12R3j65j91N71k11j65J75L54m99J29l7j74K54r5k82L01
2480a8K04l1n9L4j29q8J67M0m3N4k6P1p3K96m30J4K20l71q0J96j21n9L36k34K50
2505A20k31o1J81J83q0j99m0m9J89J05L1R6N4m07J84m35M26J00m20K21M8L6J3
2528F5o8J0K1K19k80q9J95K9j37J34r2l3r4K5Q7q2J06j1P6j3Mj10J55j37k9R1
2554D2j28L88l91P2j33J61J79l85K32K4j35K03o6M4m29N8M75p6k72J18J52j15
2576A8K18l25l2P9j14P1K67k61o5K60k21L52k05k49J38k34M13j93K11j33q1k8
2598a14j8L0L36l22J76k00N8j25L52j02M5k03LM9j35J91j58K38R5k57M1r7o8O6
$$ plain form
2434 92 -78 172 -147 8 5 -80 -183 -94 251 -75 29 -31 -156 181 23 -16 18 -4 -421 201 449 177 111
2457 111 -329 -149 -107 -59 -54 36 -76 17 -148 -339 232 21 -144 31 385 -114 15 -22 -196 58 -37 -319 -18
2480 -18 186 155 96 130 1 -87 80 120 77 131 105 176 103 399 -31 -17 203 -168 -248 -52 -173 -232 104 -130 120
2505 120 -111 -172 9 192 112 -87 -127 -176 13 118 149 245 299 -108 76 -359 67 167 -253 -32 16 52 65
2528 65 -3 7 28 247 -33 -122 73 102 -35 99 7 -26 -120 -95 -8 -90 16 5 81 68 72 -38 117 -20 -49 42
2554 42 -86 302 -89 -17 -150 11 190 -195 37 61 -74 129 63 107 -322 -264 211 135 -137 -19 133 18
2576 18 236 -89 -121 -42 -156 -85 182 -79 -144 116 -105 247 42 -207 -69 -303 110 -83 128 -5 -86 -114
2598 -114 -132 -102 234 -88 88 -112 -54 -179 173 71 116 -87 -84 -35 -170 21 -137 101 196 -61 -20 -117 -185 -119
2622a19J37n6j8K41o3J09l68m4N8R2K58j98R0l25j11O77k85j45PJ73o7L1k66J78
2646a4J2K18j13j78J18p9r4K61j64m2Q3K39o2k08k59K87q5j25n8J1J13R6K44m72
2670b71K87j80K15q4Q1k12K18J5kq6Q5j37l6K88m06J33M8j01K46o6Jk2J7k63P8
2695a54J25n5J17J31q6L14m96J77q7j8J3J12j94J23J03J7m04M30R9m54O8J60J34
2718A75J8k52j28K17l8j3n0L2L17o5q0j11R7Q2Jm2j06J83k44Kj42KL82k52L3J6
2744C4P7k91J44P6n0K70j33m02J22j32Q5L86o7k74J36j97K18j40L95m11K15J2
2766G3k28K25Ok92K43M7M1J2j0r6mk3J42oJ35j19J49j37n20M34j65l8j15M11l92
2791b27K29j37l8J75K39j30mn9L4j34J12k96R2J95J12P9L8k22k21L93m43N04m48
$$ plain form
2622 -119 18 -38 -56 185 122 231 -137 -181 -123 -31 227 29 119 -206 -317 360 75 -70 -63 110 43 74 -192 -14
2646 -14 -2 216 103 -75 43 -36 -130 131 -33 -75 8 247 185 -23 -282 5 -80 -205 -263 -252 -139 -43 201 -271
2670 -271 16 -164 51 -33 48 -164 54 69 67 -19 66 -71 -107 181 -225 -92 -44 -145 101 35 36 14 31 -232 -154
2695 -154 -29 -84 33 164 78 392 -104 73 -14 -32 -19 93 -101 22 125 142 -262 168 267 -187 -119 41 175
2718 175 193 -59 -187 30 -8 -21 -71 -39 278 213 133 22 119 201 202 160 54 237 -7 -5 -147 -145 237 -15 18 34
2744 34 111 -180 -36 40 -10 260 127 -275 -153 -285 -200 186 119 -155 -19 -216 2 -138 257 -154 61 73
2766 73 -155 70 76 -216 27 74 115 127 117 21 17 -6 136 130 265 146 295 158 -362 72 -93 -131 -246 165 -227
2791 -227 2 -135 -173 2 241 111 107 48 82 -52 60 -236 -144 51 163 242 280 58 -163 230 -213 291 -157
2814a57N8k50N35k14J14l2j33M0M0jo0J73j4l49M41k00J70k43n7P2N9j81j0J59
2838d0J25P4k57K07NJ75k45N2l47L2K30K48l90PK40j35o9J12Q9J38j02p6J91j7
2862B47m05J9R2R6m6J34j53k37J69r3L89m8m9j03J23j98J32j64j0K53j43o1K90
2885B34n90M01J89m56K61k8k33K46j47K24R2r2Qk04q4K88j14j70J00J45j97L20
2907A93j97q5O6J73k69n0K1l14L35J7J16rL7J5q7K22j3k27j83J21R2m44N57p3
2931A4J08m4j02L7k9j61o7M59j91k47J42J34j52K01k18K42j87q0K72P3Q6k40k93
2954b43K25k19J37n7K56Q7J13j76j50o3J89l30K09J08j50N3m1o0o4Q1L79j70j73
2977e9j04J98p0j02oJ92m5N5NN4l95M90k31j6J62N4OM5k00K37l94J39o3j2j3J56
$$ plain form
2814 -157 -99 -349 186 -28 86 54 -79 -39 1 0 -60 113 99 -250 191 -9 161 -82 -139 -67 -8 -189 -199 -40
2838 -40 85 159 -98 109 114 289 44 96 -251 -219 11 259 -131 -124 116 -19 -88 24 113 251 149 73 264 247
2862 247 -158 -139 -47 49 3 137 -16 -253 -84 -177 212 164 115 12 135 -63 69 -95 -105 148 5 -56 234
2885 234 -356 45 234 -222 39 11 -222 24 -123 101 193 101 109 -95 -179 109 -5 -175 -75 70 -127 193
2907 193 -4 -89 -23 150 -119 -169 -148 -462 -127 -110 6 -3 34 49 -38 184 171 -56 -239 -118 -26 -470 87 14
2931 14 122 78 -24 13 -16 -177 -244 215 24 -223 -81 53 -99 102 -116 126 -61 -141 131 204 290 50 -243
2954 -243 -18 -237 -100 -157 99 186 299 123 -27 -90 99 -231 -22 86 -64 -11 -52 -112 -176 -95 284 114 -59
2977 -59 -163 35 -35 -137 -143 49 4 59 64 118 -277 213 -18 -34 128 182 188 233 33 270 -124 15 -48 -60 -73 83
3003H3j90qL6%K2L1j15k76M01O3j47M39n37K67J51k23J82l19L65j53r7N0l2j58
3027a65J35j40L69l04j8k95M35J3l44M25n5j98J57J85k43J30o0J5j83M3r0K00
3049A2K50j40m9j83L29l58P3J41l1j65k6M8O4j5O3m9J00j83K51l02K29L6J00j27
3073F8mk9j9o7j93L04J29r5j02J25l6N7j28m6K10j15l02K20k4K14j58J86o7k53
3097a25N6M3J53r0j28K57k96P6L16j94qK16m81L25j96k55L33K18l40K58J12m9
3119B01Q5k54K08p2n36O15l24k6j65N20j66j1o1K81l00q8O8L09l73n1P5N3J98
3142A86k13N2l49M02K7l0j32p1M37k50n1M2j30k7L65k27NJ52K9k04l65pL73J25
3166A39k79nM16k24N1O7l9k43K07J41j34k22r3N12j61l5J07j92K24k53k33N09
$$ plain form
3003 83 -107 -115 -79 -79 -57 -26 -141 -417 -16 47 -100 339 -198 69 220 -3 179 -140 225 72 -25 25 -7 -165
3027 -165 -30 -170 199 -105 -123 -418 17 30 -314 111 56 -142 15 200 -43 87 27 42 -141 -98 -188 12
3049 12 262 122 73 -110 219 -139 -66 75 44 -121 -147 -99 -35 -50 13 -36 64 -119 132 -170 59 95 195 68
3073 68 64 35 16 -51 -244 60 189 94 -8 117 81 138 10 -36 174 59 -243 -23 -47 167 9 195 128 -125
3097 -125 -69 -26 127 37 -91 166 -130 -54 262 68 60 276 -205 120 -76 -331 2 220 -120 138 250 201
3119 201 286 32 240 168 -368 247 -77 -103 -268 252 86 75 14 295 -5 -93 -25 284 -89 -140 -65 -12 186
3142 186 -27 25 -324 78 105 75 -57 -128 309 59 8 50 -80 -107 258 31 36 188 217 13 -352 -359 14 139
3166 139 -140 -145 271 47 98 165 126 -117 90 231 97 -125 -218 294 133 98 205 13 237 -16 -249 260
3188B60j96j3j44J05J09J82k35j96L2k2J69p9K44P9k70K32J2j88k61L52J32k55
3210D9r5J2j35K85j67k47N00l77J94j30J90k55j1K96j90K49k95J13j33K83j00
3231C6l05K0J89k76L02L8j73N62m04j75J22R7q6K07j56K2K3k1j16m3J52J3J17
3254A45j54K27j13k36J80r6L25j67qL9m04Q5K56m3Q0j68K5J49j85j21L41j56N3
3277E4L4r4j72K05q8M3j35j30J73K56K4o3k15j55K05J75j30J64p7j31J34Q3j36
3300B4O5j15J79l55L05k53J32K21j44j84J24L2j28J05N2Kj7j77J01K60k75J7N7
3323B8k94K94p9J03j84N7n4M6L35j96O7k84K25l00J79J42J79l00J88p1o1j6k41
3346b37L70o1j49j43r9M59j83K93j06n83O63j90k95L08k80J46o6mM34n8j86j50
$$ plain form
3188 260 64 51 -93 12 121 303 68 -128 -96 -118 51 -28 216 295 25 257 269 81 -180 172 304 49
3210 49 -46 -34 -169 116 -51 -298 202 -175 19 -111 79 -176 -187 109 -81 168 -127 -14 -147 136 36
3231 36 -269 -249 -60 -336 -34 4 -169 393 -11 -186 -64 33 -53 154 -2 20 43 22 -94 -137 15 28 145
3254 145 -9 218 105 -131 49 -47 278 111 103 142 -262 -177 79 36 116 -52 -27 122 -63 -184 157 1 54
3277 54 88 -6 -178 27 -61 -18 -153 -283 -110 146 170 107 -108 -263 -58 117 -13 151 74 -57 77 160 24
3300 24 89 -26 153 -202 103 -150 -18 203 59 -125 -1 31 -97 8 60 62 45 -132 -31 229 -46 -29 28
3323 28 -266 28 -51 52 -132 -75 -129 -83 252 56 123 -161 64 -236 -57 85 264 -36 152 81 20 4 -237
3346 -237 133 72 -77 -220 -319 140 -43 250 144 -439 224 34 -261 47 -233 -87 -153 -157 277 219 33 -117
3368a17J09o3k6L50j71k27J75K25m57J39Q4Q0n9k75J6L68q6J60l05o8K13L3k40
3391a42J50m6j01L28J25j37R9l04o5Jl0J03j3k8J9L44j93R2k8k52L77l33J76k12
3415g0M0P4L1J31k43k88K32J20K96m23M3q0J57J05j20l6L78l77O2m8j87K13O3
3438G3L6j79R8Lj69L8L5M9Q1j32J19J4J16l45P2K12r4N6r6M57l63q4r9j63M41
3463A76l67J18R4q4k46j30N73j00J2n8J32J03n30j34L58j76K83j4l6L4J84k66
3485g4J24p1j59O3n8J16J60j94J46j47j40K54J08m5j33J00J63J51m89N23k56k10
3507f8J42j02j22r5J77k41K80j32J81o9M0q1O1J6k0LN7n9j89R8K56m1j95p7l3
3532b13K21j27K78kj51k0L6k06L37k19J93P3l19L6K13On6K11m83J04L39l35J03
$$ plain form
3368 -117 -8 -71 -97 253 82 -145 30 255 -202 -63 21 101 42 -233 -217 151 65 225 -80 -148 65 98 -142
3391 -142 8 -38 -139 189 314 177 276 -28 -93 -92 -122 -19 -32 -60 -41 303 110 202 174 -78 299 -34 142 -70
3415 -70 -30 44 75 206 -37 -325 -93 27 323 -100 -57 -137 20 125 5 -31 347 -30 32 -16 -203 10 73
3438 73 109 -70 28 31 -138 -100 -65 -16 65 -67 52 66 182 -163 -91 121 27 83 -13 444 81 -3 -102 -265 176
3463 176 -191 -73 21 -63 -309 -439 134 34 46 -12 120 223 -307 -441 -83 -259 24 10 -26 8 192 -74
3485 -74 50 -21 -180 -117 -175 -59 101 -93 53 -94 -234 20 128 83 -50 50 213 364 -125 398 142 -68
3507 -68 74 -28 -150 -245 -68 -309 -29 -161 20 -49 -9 -90 -29 -13 -33 -30 27 -32 -221 -123 133 92 -103 -180 -213
3532 -213 8 -119 159 157 6 -14 22 -184 153 -66 127 200 -119 -83 130 136 80 291 -192 -88 251 -84 19
3555A9O2j54R6j64n6R6L96j28j58j81J18jJ17o3k84L31J0K06l64K67l77L98Mk15
3579b5j40J46O8np8q0R7r9l6L21l30M3K84k32R3R8l2O4j78r7K46m08K05l7j19
3604b31L74k28PO8J26m08J0N18j11k3l56K64J32k3N7k17M4j89K43k19O6Q4P9k90
3628b23J81j97L06p0l48L70j1P2Q7j97j74K39K51l53R0J04l60L4J28J91L3k28
3650g5J49k16LL8O5J59%j23r2N5j05R0j79L41j87J24m14L51L25r9j03r1j38R4
3674b8K29k02m3J51rKMk21K75j09J41k95P8Q1l8j17J97k95K28l4R2L6q0P3j88
3699g2P4J93j31o1lJ62k6M6O4k98J97r7l6K2J41k04J13l14N4K34k78N6K38j06
3723c2q0J16j49J11N1L7N4k64J96K2k18K72kr9j99K30n0J89m26K32M8j21J02J89
$$ plain form
3555 19 81 -73 23 -141 -197 -101 295 167 9 -172 -54 -55 62 -1 -285 46 56 262 -102 165 -212 186 190 -25
3579 -25 -165 -19 49 44 -34 -114 -17 -116 -152 169 -161 -118 166 -66 27 125 93 157 -21 -118 128 -280 -75 -112 -231
3604 -231 143 -85 -78 -10 116 -292 -282 236 125 102 -254 10 142 119 176 -41 3 -186 57 -162 -96 -12 67 -223
3628 -223 -42 -239 67 -3 -351 19 8 80 167 -30 -204 35 286 -67 23 127 -233 -199 -71 120 153 -75
3650 -75 74 -142 -139 -101 -36 123 123 0 -92 -37 -142 -52 -231 110 -77 47 -367 -16 309 210 107 16 -122 -28
3674 -28 201 -1 -44 107 98 100 104 -117 158 49 190 -105 -27 54 16 -101 96 -199 29 -5 87 123 43 116 -72
3699 -72 2 195 64 3 0 162 136 182 246 -52 145 48 12 34 175 -29 84 -230 -176 58 -220 -164 74 -32
3723 -32 -112 4 -145 -34 17 54 108 -156 40 62 -156 116 114 15 -184 46 -4 185 -241 -9 39 -82 20 209
3747B09k74r1M8P5q9k2LJ35k89K01j18L23j29j45Q5J13L9o0J54l73J78P1j75o4
3771a95J76kK3j6J62L43o77KL17r4k3j29pM61k27j31m3j64K25j72K44k0k37J19
3795f5N2J61j80J25o5J48j00QO6j53K10o7r3J53j16J74m03M5j85oJ34J83l0j44
3819a48J0K47j70J98k86K89k92J66j19Kl1J62J42k29L6J09o0M3j4L9j12J28K43
3842C53k76k60K80k86M8K18n5k44J27k5J51r9J38k1M4o7p3N2N5J04j60j10R5m8
3866e9P8j21J84j83P9oj65P7N3M1O4J1l44J50O9j50L45k95J65m9o5K87j16k6K32
3891B56j66j83K60j42l21L17K99k75j41P7Qk16K76k98K24O4j47R4j90M0J04o2
3913a22M85k52j2l47O1L21J5j19k73K84j28O7j44K95K05o42M42j73k10K51m4j7
$$ plain form
3747 209 -65 -156 -108 -33 -122 -144 -141 -6 -295 -94 -212 111 -18 -163 -78 35 74 14 168 -205 -27 44 -131 -195
3771 -195 -19 -21 2 -14 148 491 -186 -184 133 39 16 -113 -120 341 114 -17 -60 -224 1 -171 73 53 -184 -65
3795 -65 -13 148 -32 93 28 176 76 84 150 -3 207 140 47 200 84 258 -145 -100 -285 -291 -157 26 -4 -148
3819 -148 -138 109 -61 137 -149 140 -152 14 -105 -103 -134 28 170 -59 -23 86 26 69 55 94 -18 110 353
3842 353 77 -183 97 -189 -141 77 22 -222 -95 -120 31 -68 70 49 93 26 -47 5 60 164 4 -106 -11 -59
3866 -59 19 -102 82 -101 -22 -28 -193 -116 -63 -22 42 53 -291 -141 -72 -222 123 -172 -7 -56 -121 166 50 24 256
3891 256 90 -93 167 25 -296 21 320 45 -96 -19 -11 -227 49 -249 -25 39 -108 -14 -204 -164 -60 -122
3913 -122 363 111 99 -248 -187 134 149 30 -243 41 -87 -20 -164 131 336 -306 136 -37 -247 4 -40 -57
3935e7l56J69L81k33j89K81lL0Q6j48Kl7k67K63R3j95M04j52j09P2n8P5k0J03
3959A35M5O2l20M60k98j07Oj06L92k38J66n82M88k08n2K94k40R8j13J79P0K7K5
3982A83k6k42J49J15k20j13L23k03K26j66j0j23R3k2J11l05J09j7J89k2j08k07
4004b86J67O1J47l82L53j69lN6J45l41L06k1J09L3l17P2n0N1J6O1j06M3K64J05
4028C14m50O0Q0j14J08l75K02n5O1N85m17O6J94p5l3j27J86m20J17J30k7L9jm7
4052Ak76K79n0K5L21l28Jp6J03J28q2l5J27J2l56K30j78K6K53K9j26j42l50L44
4076a20P6j9J9j50L84j57m2J20K89n34J13l3K45m39L05j60j42R6J09j45M14q4
4098A45k83J19j40N22k93Oq5k39Q6P2J14L0k25L09M1j18j20J86k10Q3M9j85K46
$$ plain form
3935 -57 -413 -244 137 -96 -285 -4 -7 23 109 -39 -37 -74 -341 -78 15 -180 224 72 -37 35 -23 52 32 135
3959 135 180 242 -78 382 84 -23 -17 -123 269 31 197 -385 103 -105 -157 137 -103 -5 -118 61 131 158 183
3982 183 157 -85 64 179 -41 -154 169 -34 192 26 16 -107 -14 -36 75 -230 -121 -138 51 29 -79 -286
4004 -286 -119 -58 89 -293 60 -109 -112 -56 89 -252 54 33 142 175 -142 -70 -120 -69 -53 8 -98 -55 209 314
4028 314 -136 -76 4 -110 -2 -377 -175 -230 -169 416 -1 65 259 184 151 24 210 -210 -93 37 10 49 48 1
4052 1 -275 4 -46 -21 300 -28 -27 -103 0 128 46 11 138 150 -206 24 -154 -128 125 154 28 -114 -464 -120
4076 -120 -44 -63 -44 -194 190 33 -9 111 400 -134 -21 -54 191 -248 57 -103 -245 -149 -40 -185 229 145
4098 145 -138 -19 -159 363 70 76 -9 -248 -162 -90 24 54 -171 138 179 61 -59 127 -83 0 49 -136 110
4121A10k06J90n7L24m13j41L89j27j42R3j31N3J58j46Pk10L22o1j11K48k35R5
4143IJ34j69J51j98l9R4J28r9P5j55J17k49M30r1o7k7o8k21M29j14k55L42k10
4166e3j08k38K76J61N4j6PQ4j35J50k04N7p1M0n9o2K6j31J7L06j21P6J57k07j2
4191fq7K52j76jn3J5J59p0J84k66K03l7j65K45l68J76o8M9j14L30j71L7O6l2k85
4216a83L43r9k03J33m3o0k6J80M8mK13k84J2j00n6K03J20k57P2k23L52k18J77
4239I7M2j3J66j57j43J27l15N3J38K6K35k62K19m5k09j04K30q9L1RR1l08L76n2
4263A43r6p7k47L87R4j56j09k1J90j80q5M27k16j53k7K33j52l6K55l05r3L33l1
4286G8J46j44j67pJ13j2J37p8j50K91k92J05K59l51j0K67j03n5R1j33j90K41N0
$$ plain form
4121 110 -96 94 37 361 -52 -193 196 69 -73 20 -111 -58 100 -46 -39 -249 73 12 -99 149 -86 9
4143 9 143 -26 125 -73 -112 -18 110 11 86 -69 48 -201 229 138 71 44 -24 -245 184 70 -185 157 -53
4166 -53 -161 -399 -123 38 92 76 83 167 32 182 -22 35 -36 4 -55 -117 -91 -222 -205 101 -20 56 213 6 -6
4191 -6 -93 159 -17 -18 -71 -56 103 33 217 -49 154 117 -48 197 -171 5 -63 -14 -128 202 31 68 134 102 -183
4216 -183 160 61 -142 -9 -52 -112 -138 42 90 86 299 15 27 -73 -129 74 194 -63 9 -214 138 -80 97
4239 97 139 126 292 135 -8 119 -196 -143 -5 21 256 -6 213 168 -41 -145 85 -4 27 36 127 -181 195 143
4263 143 47 -30 -277 110 204 48 -61 -82 108 -72 -157 270 54 -99 -126 107 -45 -81 174 -131 -224 109 78
4286 78 224 80 -87 -94 19 7 144 66 -84 207 -85 20 279 -72 -82 185 82 27 118 -15 -205 36 86
4309H6k56K10l3J51l3P6k36M4J1N0N7k91L05j1R6j89Q6j69k9K2J84P9k72k02K30
4334c4L2j46J85Nj27L13l47P7o2Q0mJ81j42j67J54J80k22p7L05l54J37K77Q8l51
4358a9P6j24O8j79L90k17J34Q4l19k3K00k61P7L45k49M3K01k29J32l31K66O9n3
4381H1kj63m1K27K6j07m8L0K16l20J96P2j57j17K20J72k00J23l15L7J1j38K64
4404F7j13KJ32J48k43J26J38j70K7J38j92p0J86J33m41pK04J7j96N6R6q7q9R8
4428d0J56k53N9n8K36n26N29J8q5l0K6N3j60O5J75m06M08r4l1m8J27k85L3J02
4452b9J2K84l46J17j50J35j39l2K10j01j24M57k04o7k51J8K69j18NJ60j66L59
4474B99l89l3O4K6p5L6J34J00j28K2m27L86J46rj09KJ81l13J9K22l32J7L8R1J9
$$ plain form
4309 86 -170 40 7 158 125 201 -35 9 20 70 127 -164 141 130 226 37 123 -46 -75 -53 131 210 -62 -264 -34
4334 -34 -2 -148 37 42 -85 228 -119 -42 -104 -24 -28 153 11 -156 -2 178 -44 -121 184 -170 -33 244 332 -19
4358 -19 57 -67 1 -178 212 -5 129 213 -106 -129 71 -190 -113 232 -17 26 227 -2 130 -201 65 134 81
4381 81 79 -84 -125 102 128 21 -27 3 219 -101 95 167 10 -107 113 285 85 208 -107 -70 -59 -197 67
4404 67 -46 -44 88 236 -7 119 257 87 114 252 60 -10 176 309 -132 -139 65 82 -114 -58 38 -49 -138 -40
4428 -40 116 -137 -78 -136 100 -426 103 121 36 6 32 85 -75 -10 165 -241 167 73 42 -6 121 -164 -131 -29
4452 -29 -17 267 -79 38 -112 23 -116 -148 62 -39 -163 294 90 23 -228 -210 59 -59 -54 106 -60 299
4474 299 -90 -123 -59 -33 -108 -72 62 162 34 56 -371 15 161 152 43 45 226 -87 -68 154 -178 -161 -123 -32 -13
4499a3k4K21l23N9J84n3j22r8J49J00p3J99j18L7j54J40k37K07j40K38j18m7Q1
4522I5j34J72j51M7j01J25Q4j37p6O8J19o7Q6j75k6J77k10ML28k83J73j46K6O9
4546F7p8p2J45j60o9K19Jl34L01K28k18j37M56m87J61n0M59m97M2K33r8L1%j27
4570A6j45L7N8L43l63J4L45l30q7L07l20J28K8O1k7o0j19q0J22k33L25k2k26K88
4594F0j40N5n3L48k70p2k2j2K21j40O1k0k06j43K70O2M4Q6k32Q8o1r9L71m39L68
4619A25k7Qq3L1j53o1J45P0k39L18k47J75j10j82P1P0K18j4j4J6l3N5J49k50k4
4644A4r4j30J35J79j6m20K99O3P2Q1n04L06J5j7m1n0J28k6r5K28n5p5k13K42J7
4669D3J89k39J12l9L3M6k53L92j5k30j75n4K53j59L31j18k37J06M2j09j1J13J
$$ plain form
4499 -13 -37 184 -139 -80 104 51 -71 -169 -20 80 7 206 88 125 -29 111 -126 81 -59 179 61 14 95
4522 95 -39 133 -18 29 -72 53 137 0 -76 -8 111 44 130 -45 -71 106 -104 -100 228 -55 118 -28 -2 67
4546 67 -11 -83 62 -98 -167 52 53 -281 20 248 30 -107 349 -138 23 -27 432 -65 -23 210 112 143 143 16
4570 16 -129 -92 -34 309 -54 -40 305 -25 -112 195 -125 3 31 92 65 5 -114 -194 -72 -305 20 -2 -228 60
4594 60 -80 -25 -78 270 0 -72 -94 -106 115 -25 36 16 -190 -333 -63 -1 43 129 -103 -15 -76 -175 196 -243 125
4619 125 98 106 23 54 -99 -160 -15 55 -184 134 -113 62 -48 -230 -159 -89 129 115 101 117 84 139 288 38 14
4644 14 -80 -210 -75 104 88 -332 -33 30 102 183 -321 -15 0 -17 -58 -108 20 -6 -101 127 72 -3 -216 26 43
4669 43 232 -7 105 66 99 145 -108 284 269 39 -136 -190 63 -96 235 117 -120 -14 28 -81 -92 21 22
4692B2j37Q1J83k73J17M2o6pj87P3j4L02j56J09n3R7j33m9O5J58j07k14K29k99
4716b17L11o1j63J06k2j42K26n3j1j81kL49j13j55J32k25K19J08j60R9J08j82
4738b9L3j48J78j14K46p2p4J56n3K9l3j7n8k9r3P3j90L89j02Nj29n7J96o3Q6j95
4764f5J54J87k26J60m6l05K53q0M9K28k34L0m4l5J08j59q8K11j46N0L5r1Q3L3
4788F2K0j13J3n6J89l09J53lj53L10k03k03NM18j66n7j49j69K53L31j20p5k35
4811b57J12K33n5j81K30k5p4Qj83K19J53j85k6L8m3O1M8q5P7P0j37O4j08j12k4
4836a82K8P5K48m21J75K27q7LJ04l11J98l53J73K83l68L17k21K17j44l0L76k66
4858D1j73K87j68n7Lp7P4N0K65l91L02L9j45J25l81M44k40Oj24j45M38k91J7j54
$$ plain form
4692 22 -115 -34 149 -124 -7 35 -31 -38 -225 -152 -166 136 -20 89 36 133 0 -49 16 174 67 -147 82 -217
4716 -217 94 33 -130 -24 -46 -188 38 -15 -26 -207 -209 140 27 -128 4 -221 -2 106 -54 45 153 -29
4738 -29 4 -144 34 -80 166 94 20 176 123 152 119 102 44 15 -78 -5 -195 194 92 97 -32 -89 107 44 130 -65
4764 -65 89 276 50 210 164 -141 112 32 81 309 75 105 61 26 134 -25 -113 98 -48 2 37 -54 29 62
4788 62 82 -31 -18 -74 115 -194 -41 -44 -197 113 -90 -293 -288 130 -36 -93 -242 -411 -158 173 53 -22 -257
4811 -257 -145 88 33 -148 82 57 -17 -9 -192 27 180 -5 -31 7 -36 25 73 -12 65 135 -2 62 -46 -158 -182
4836 -182 -154 -79 169 -252 -77 150 63 66 170 -141 57 -296 -123 160 -208 109 -112 105 -39 -69 307 41
4858 41 -132 155 -13 -70 -67 -144 -70 -20 245 -146 156 195 50 175 -206 238 -2 4 -120 -265 173 -118 -101 -255
4882b55j42N75j06q3J7r3r9J42J16j11j73K11J12j78P2o2p2k1J93j39J43M6JK7
4906A21q2J0J74l36J78K9k5k95M36k34j4P3l4n6K88J16k63j9j97j43J74K36k57
4929a20N4O2K92l01O6l04L43O4j49O5J8l16J25J59J4N5q8Q1L59m92M8R8q7N5j07
4954fJ38k28j34J74j73J4L27k77L99l03k2K42k7k99J17K8J20k15J68M3P9k27%
4977f2L8j81K53J9j1o9o7p2N1j2P2m8q5J06L82m66K62J68r4j99L0k11K98lL3j37
5003eML1J80k4j86j33K65k48M16m19n3M02l57J63k39M76l1k57l45O34k68k15L56
5026A47L0j03q7n5J53j3K12k64j12J61k5m3N5o5K60k87K11k95J38J18j70q0K32
5049A18k66K22K3j93L6K12O0k9k20MJ47M0k43J71J05j74m4M4k7K69n9l87K01j87
$$ plain form
4882 -255 -397 178 72 -11 6 -87 -186 -44 72 -39 -212 -1 111 -67 5 -57 -129 -150 43 -96 47 93 94 121
4906 121 39 49 223 -113 65 94 69 -226 210 -24 -38 35 1 -55 233 349 86 67 -130 -273 -99 137 -120
4929 -120 -66 -4 288 -13 53 -251 92 156 7 72 90 -226 -101 58 72 127 39 120 479 -13 35 133 46 101 -6
4954 -6 132 -96 -230 -56 -229 -215 112 -165 234 -69 -91 151 124 -175 -58 -30 90 -125 43 86 165 -62 -62
4977 -62 -24 -205 48 67 56 -13 -80 -152 -101 -113 -41 -89 -174 -68 314 -152 110 278 184 -15 15 -196 102 99 132 -5
5003 -5 -1 30 210 186 0 -133 132 -116 300 -119 -172 230 -127 36 -203 273 242 -15 -360 274 6 -209 147
5026 147 177 74 -13 -68 85 72 284 20 -92 69 44 1 56 -9 251 -36 175 -120 18 136 -34 -114 118
5049 118 -148 74 97 -96 -60 152 212 183 -37 -33 114 154 -89 82 187 13 -31 13 -14 255 196 -191 10 -177
5073a77L62j16k46L88k34J7J09o9j01J30P3M0k67P4K80n14K01J13Rl1j37k7P9
5096d4j8J13J32j60l2k43K53l76M99O8p8l58L50q0k91K59K9K1k5j92K59O0l55
5119b09J84k2j17jL47k86M1J54j71P1N7n9k17K22j95j19L75j60L11k81J20j4k98
5142b67J46J78J79l42K84l52K28j73R8J82j51j1J83l92J47l4M8%j4j69M09l16
5164a39K15N0j33J10k84L03l7k6j25k26K15K25j13k04NJ13J00j36K73k71l6J28
5186GP9j58O7R0O1m6j86j11J82r9PK28L9R1k85K70j38l32J11J94K24l06Q4K8k14
5211a13J09K59l10K01k39J10q5M0o3j07K85m9j60J95j83J99j24k02K23j18L88
5232B56k90N6p1J60J51k05p6L30l36J65j76P8j75K04k88K33k66J41L27K14l03
$$ plain form
5073 -177 185 69 -177 211 -23 -6 103 34 -67 63 136 176 -91 -17 263 -251 -50 63 72 41 -96 -123 -44
5096 -44 -62 51 183 23 -9 -252 1 -375 124 192 114 -244 106 26 -265 -6 23 44 19 -173 86 146 -209
5119 -209 -25 -47 -164 -165 182 -104 -63 91 -80 -9 48 -11 -228 -6 -201 -320 55 -105 206 -75 45 31 -267
5142 -267 -121 57 236 -106 178 -174 54 -119 -21 161 10 -1 182 -210 -63 -97 -49 -49 -63 -232 177 -139
5164 -139 76 126 -7 103 -181 122 85 59 -66 -292 -77 148 35 -169 -164 -51 49 -87 186 -85 -121 7
5186 7 86 -72 -5 85 146 100 -86 -197 -15 -114 -107 121 160 251 -34 236 98 -234 -123 71 295 -11 73 101 -113
5211 -113 -4 255 -55 146 -93 17 -68 -28 -91 -198 87 38 -122 73 -110 89 -35 -237 -14 -132 256
5232 256 -34 22 -49 111 262 57 -19 311 -25 140 -36 42 -133 71 -217 16 -250 -109 218 432 129
5253A29k48L00j34J0Q9j60N1j59J10L07m64M09l02r9J95k19L43Jj19j7J25j77
5275b9j49L88R0k97N5L5k4p2K22k07Q7j56j03K15k3l7j03K71k13M21n95J32j84
5298b76K00K96k45J75oq7r5R2J61k29N4L6M5j67j35K35K57j94k48j2r3J98K09
5321A71p6l02L22k40J18K04k27r8J34J55m3j45L49l89k8K70q5l22J45M00k27k4
5343F2n5N7l03K44K83k84K42n02J45j71J69J02j50L40l5k17J17j45K13J45l59
5364a02rR5j85L65k22k34L39l32N17l48n4K50j28L67m55r2K7K80J3l5n0L1j77
5387a39K62q6k0j80L18l54KK23O2q9M4rQ3O3p2j41k17J54M8J82l01K04o6K47m21
5412b03K17J1k08J10P8O7j11q1q7L16K87k78j80J02k6j76K80k88K49mn7m3J38
$$ plain form
5253 129 -119 181 47 57 146 -14 37 -122 -12 295 -169 240 -62 -161 34 -185 158 159 40 23 148 -29
5275 -29 -178 210 300 3 58 93 69 -3 219 12 99 -57 -160 55 32 -5 -108 163 -50 371 -224 -92 -276
5298 -276 -76 220 -25 150 144 57 -38 54 215 -14 40 76 121 -46 -181 54 311 117 -131 -143 -236 -38 171
5321 171 95 -207 115 -125 -7 197 -30 -128 6 161 118 -27 322 -67 -95 175 90 -232 -87 313 86 62
5343 62 7 64 -239 5 288 4 246 -256 -111 -282 -113 -11 -161 179 144 -73 44 -101 112 257 -102
5364 -102 -111 -16 -201 164 -58 -292 47 -285 232 -116 -170 80 -48 319 -136 -228 -201 79 92 57 7 38 -139
5387 -139 123 37 17 -163 155 -199 -197 26 88 -1 43 34 117 180 108 -33 -250 -96 -48 134 -167 37 -29 218 -203
5412 -203 14 25 -183 -73 5 72 -39 -120 -207 109 396 118 -62 40 14 -162 118 -170 79 75 18 -25 113
5435A13L7l74J14R4O1J09Mk57n0J28J98m14P6J56j96Q0K98M0m44L47l16J53P9
5458C6j32K48l31J01J06Rj87K22O5k3l83M00J0k71J8L46m17M68J99m88j99m2M15
5481A70k67qJ28l11M03l42R1K40k60P2o7N0J82l18J14L23l20J73j13j04J33j47
5503a78k7L36j88M63n08M7J64j20j06j93M27J29l35J0J20r5J19k81P6K19r4J91
5525A76m3k50L6J63j53J48M7j2Mj54J35K73l71M7l9R8J73l84K43m9Q5l0k06k2
5549h5Q7l20K64K8j53R5j08L34J23k06l30J92L3J20mr4l8k6N2n7K19k6k30lJ84
5574E1n2mk94K27j87K40K12l34K75k81j09L47m15J27K71m9r0J42J8K6q1J27k57
5597i0K6K27N0nk22k7j74J24Q6j3N5q3J48k21J56l2J98j90o1K00j52L2l02N24
$$ plain form
5435 113 150 -224 -110 -16 45 154 158 -99 -149 -21 177 -237 -161 -5 -201 -121 177 217 -227 120 -196 -43 36
5458 36 -96 152 -179 -78 28 37 -150 72 137 114 -269 131 141 -130 -112 234 -183 285 484 -4 -203 -245 170
5481 170 -97 -105 23 -288 115 -227 -136 104 -156 -84 -151 -101 81 -237 -123 200 -120 53 -60 -164 -31 -178
5503 -178 -205 131 -57 406 -102 -55 109 -11 -117 -310 117 246 -89 -79 41 -54 65 -216 -140 79 -15 176
5525 176 133 -117 -81 82 -71 77 124 112 116 -38 97 370 -1 46 7 105 278 -106 137 88 173 143 -63 -85
5549 -85 2 -318 -54 -26 -179 -84 -192 142 265 59 -271 -79 -46 74 70 -24 -62 -88 -36 -93 126 100 -130 -133 51
5574 51 -1 -5 -299 -72 -259 -19 193 -141 134 -147 -256 91 -324 -197 74 25 -65 77 95 121 40 167 -90
5597 -90 -64 163 213 208 -14 -41 -215 -91 -5 -18 37 -46 102 -119 37 5 203 13 -48 152 0 32 -270 254
5621B54l88K14j12k02L72j09k44P6j01J77Oj11j38P2K46q4J38k3L11l15K17k10
5643D6j69J60j14j8L9K90k38mk09j54N3L46P3p9nJ00j37M7K11k51K20k27K0j97
5667a97J35K46j52q9k7J89l78K96R7R9k58jp4q2K26J22k36k33J38J69J67N9j83
5690C3k05J52L33k91L2P0L7j8K45l57K8O5J04r0k47J01j27r2N21n85Q14m84J87
5713B26k87r2O8J07J13j00l83L42J82k41N2J25O8j43k98M22k68K48j58J01J92
5734B76l58J56k0k38K73l4k62L61q3r8p2nJ77J63k89L1J96j0m27K49J17J82k60
5757B5J36K4M6k26Q3k15K8J44nj64K47JJ59j72n8j24l6n7J68r0J80j80j8o1J96
5782C1M6P0O1k53ml6o0m1L91m8k67L28l16K12j20J24k00P4q4J34J69k67j6K46
$$ plain form
5621 254 -134 80 -32 -234 138 29 -215 -139 -240 -63 -57 -168 -306 -234 12 -72 66 43 354 39 256 46
5643 46 -123 37 -77 -95 -56 234 -4 -8 -217 -371 -318 28 101 22 17 117 -20 27 238 -13 207 -20 0 -197
5667 -197 -62 184 32 -57 -84 105 -273 23 120 219 -39 -40 -114 -196 30 152 -84 -317 -179 -10 157 216 33
5690 33 -172 -20 313 22 54 124 161 143 388 31 59 124 228 138 -109 -8 -135 -227 294 -291 523 39 226
5713 226 -61 -153 -85 22 135 35 -348 -6 176 -65 -13 112 180 37 -261 161 -107 141 -17 84 276
5734 276 -82 74 54 -184 89 55 -207 154 71 -27 -99 -104 73 236 -53 -22 174 164 -263 -14 103 285 25
5757 25 161 185 231 5 88 -127 -99 45 40 -124 123 124 283 111 53 -71 -107 -164 4 -86 94 -86 -104 -165 31
5782 31 77 147 208 -45 -49 -85 -145 -186 205 157 -110 218 -98 114 -6 118 -82 -8 -92 42 211 -56 -72 174
5806A74j94k98L34M7L42m97K33P4o4Qj48j73M09k85J97j69P1Q9r6N8j07J81k08
5829b2J48n9J97l20J7K33j46l2m8L0j97M82j79j27k2j63K80P1j77J9k72L07j8
5852BJ00Q3l35K39J4j90K18q2L0j4o5j8k39N13m15M9l9K95l27K73j62O9j24j00
5876b25M30j89K60k60J25o3p5M8j92K24J23j34N3k39J83N8j27J13o4J22j34L1
5898F8m5m9l61M31k26K50k51J63L38k41l14K25J97n3rk50K90l20L7j89K90K77
5920B58k18mj77J49K13n4m06L70k23K81p4k02K17j61M25o14J89k7J1N5r9J7j6
5943i0R9J96l88J03qM9k47K29J68q4N6k30K22K7l1k72R7M7j36N26l22k16J40J25
5967F0k43L64k07j92L64m47M63j11l25K67J43p6j32k31L51K14k12n9J03Jk82J84
$$ plain form
5806 174 -20 -318 16 63 405 -92 141 215 151 159 11 -162 247 -38 159 -10 61 150 54 112 5 186 -22
5829 -22 126 67 264 -56 -39 194 48 16 -32 -2 -199 283 104 -23 -45 -208 72 143 -34 -15 -287 20 2
5852 2 102 185 -150 89 103 -87 131 49 79 65 0 -18 -257 256 -159 -110 -149 146 -181 92 -70 -1 -125 -225
5876 -225 205 16 276 16 141 78 3 51 -141 83 206 72 125 -114 69 127 0 113 49 171 37 68
5898 68 23 -26 -387 44 -182 68 -183 -20 318 77 -237 -12 185 132 123 -127 163 -157 -120 -309 -19 258
5920 258 40 36 -141 8 221 167 -239 131 -92 189 115 -87 130 -31 394 -220 -31 -58 -47 8 -91 -74 -90
5943 -90 9 205 -183 -80 -88 -39 -286 -57 111 27 83 -147 75 102 71 -201 -104 -57 -193 333 11 -205 -65 60
5967 60 -183 181 -26 -218 146 -301 162 51 -274 -7 136 60 -72 -303 48 262 50 -9 94 95 -187 -3
5989cJ86k97R3nN3l4L9j95J41l91K15K49J18j51j01R0J41k30L9R6J31r4j25K5
6013a0l05J37K92j79K65j95m3J7J59J1K19j81l61J7p9K70L53m30J56K1l51K25
6035HR0l05M37j45K9L9O7k85q9RJ48K16k38K12j64j1k68O0L69k18o5j48K80k27
6059a99J90j12K50J1j10R8l40L42j87p6J57M0N3j8k08K37J84k67lj11Q1J45k55
6082i8M49j94k90K16k74J45l4o6l6K00j79J51j8j66L14m15L60k05J18J50l4o3
6104C1P8k51J66j11j0q7L98k75R6q2j70K10J2P6j14n1K59j38j39M5M3Q1q0K11
6128A98j40j96K74l00K27j23j09L49j15j68M1J9p3J91j27K28r8J04k06J84k8k00
6150f8J27j7M9k23J68q6N4j6M17l10k12M00l54L22k45R2k28Q8J79l38J85J90k45
$$ plain form
5989 -3 183 -114 -21 -26 27 -7 32 -163 -22 -413 -198 51 169 18 -83 7 148 -82 -43 53 184 90 -35 -10
6013 -10 -315 -178 114 -65 200 5 -38 -21 138 149 368 187 -174 -157 -236 34 387 -43 113 134 -217 8
6035 8 98 -207 230 85 114 153 220 -65 -154 -145 3 219 -19 193 29 18 -250 -190 179 -39 -104 -252 28 -199
6059 -199 -9 -121 129 140 30 128 -212 130 -57 -133 24 64 117 99 -109 128 312 45 42 -69 12 157 -98
6082 -98 351 157 -133 83 -191 -46 -80 -146 -182 18 -161 -10 -28 -194 120 -295 65 -140 -22 128 94 31
6104 31 109 -142 24 -87 -97 -184 214 -61 35 -47 -217 -7 5 81 -33 -84 175 37 -102 -57 -14 67 -13 198
6128 198 58 -138 136 -164 63 -60 -169 180 65 -103 -62 -43 -116 75 -52 176 78 182 -24 160 132 -68
6150 -68 59 42 91 -132 36 -50 4 -12 405 95 -117 283 -71 251 6 98 -130 -42 137 -201 -16 174 -71
6173g1J11j04q3P6PQ3j26J32j56L0M5Q6m06J83M22l00R4N6l69O5K27m6j82K89
6197F3p1K40j91j44J85om8qL3p6rrj09J9J89R3j87q4P7J56k29J90P5j27j79k32
6223c89L70Qj55k0q3K86q7N4O8Q9j12K74k62k33K68n1J00k60K01J43k07J2R8k96
6247a84K40l54L93R5K2j55J7j52J36j56L23j29R6l81L12j76L5J01J6j88J86l02
6269b05K09P2k31j2K19j8r2M6o5k6n2M04n3k72rK20K62l64k25K67j16m5L49l41
6293g8K32l56J62j99K20K87j99j80N6J31J66j14l39J60J79J47m6j24l40J3J76
6314d6j35j09L34j45k3j37q5L60J26k60J33J71k54J30j32j2o1J61l9p8J4K80k25
6337c2j04J88j53J10j98J61j65L34q8N1k42P9J16k75J36J84k94J68j32J70J98
$$ plain form
6173 -71 40 -64 -147 -71 -64 19 -107 25 -131 -101 -56 30 -376 -193 229 -71 23 79 -290 -225 2 -44 -226 63
6197 63 -8 232 41 -103 82 76 28 20 53 -23 -32 -41 -150 -131 58 151 -36 -120 -43 113 -116 74 149 22 -157 -389
6223 -389 -19 -11 -166 -186 -269 17 -70 -16 52 141 29 303 41 -192 76 25 125 -135 66 209 2 14 112 -184
6247 -184 56 -298 95 190 212 57 74 -78 58 -98 225 96 192 -189 123 -53 -18 83 99 -89 97 -205
6269 -205 4 76 -155 -167 52 34 -58 -12 -77 -103 -155 249 196 -76 -85 135 397 33 -192 75 -41 -86 263 -78
6293 -78 154 -202 -40 -239 -19 268 69 -111 -55 76 242 128 -211 -51 128 275 229 105 -235 -222 -46
6314 -46 -181 -290 44 -101 -124 -261 -346 14 140 -120 13 184 -70 60 -72 -84 -145 16 -23 -101 -87 193 -32
6337 -32 -136 52 -101 9 -189 -28 -193 141 53 104 -138 -59 57 -218 -82 102 -192 -24 -156 14 212
6358B12k00k04O1J50J21k6j63l5k25M22m49L41j28J5L41k53Q5P6J03l47k13J24
6380a92jM8p4K89j14J08r0K27l95j37M65nn3j71J91p5R3j9J00j55l7k58J60L49
6404B54n16L82l46J90l8K48j12j40K06l53m5M08o5L3j20j14k98K14J74q4J33n2
6426d1k5l0J8j87l2K88n0m4K84j68q1p5J39j3R1j40J72j63J21J84l48J41J16L2
6450A89k14R8Q3j80m0j11k1L73j33J32j73l4K67l73K4J94l06K40Q4R3Nm07L33
6473A23l84L07J39p9L4j32J71q6k60J99L9K05k80l7J20k35l5M9K02K54k45L02
6495C71k71M0m7r7m5K62m05J97J68l90K91l96M17j4j28J41K2j08j41P0J09lJ19
6518A62l33J79K57n61K00J00R3O5k27j3J85n2J16q8j21K02l54J59P3k48P7J42
$$ plain form
6358 212 12 -192 -131 19 140 114 -49 -84 -309 113 -336 5 -123 -108 233 -20 65 141 244 -103 -316 -192
6380 -192 -193 -145 -219 70 -44 64 -26 201 -194 -331 134 129 76 -95 96 21 114 95 195 40 3 -255 -95 254
6404 254 -262 120 -226 -36 -74 174 62 -78 128 -225 -270 138 73 106 -14 -128 -426 -212 -38 -122 11 -41
6426 -41 -66 -96 -78 -265 -297 -9 -59 -103 181 13 -68 -143 -4 -17 74 -66 106 -57 64 248 -100 41 157 189
6450 189 -25 73 156 -24 -64 -175 -196 177 44 176 3 -31 236 -137 -113 81 -225 15 99 192 197 -210 123
6473 123 -261 46 185 106 140 8 179 93 -167 32 71 276 -4 -41 79 -156 -191 -142 60 314 69 371
6495 371 100 140 93 -4 -49 213 -192 5 173 -217 74 -322 95 81 -47 94 116 8 -133 -63 46 43 162
6518 162 -171 8 265 -296 -96 4 97 162 -65 -78 107 55 171 83 -38 164 -190 -31 42 -206 -129 13
6540A3O9j29j43P8q0j7M75l00R8j29K8oK31m4m8J8k09j69M88k95k9N4k2N8M5j94
6566a59K11jl8J10k28Q0n1j05p8J81L32l57p0K33J25m82K14j6J43o9R2J25J23
6589C15j09j53r1L57m47j5K40jj35j1K75j38n6J39n15L14M5J21j8j05Qj5K34m66
6613b27l9J86q2J03K85j38J88o40K98k0o9J32P9o7J69O4k90Q6O5k06Q5O6q3K46
6637A91k62J84j81K01l60O6K31r2j79K42j80L22j40J23Ol1j12J41j39p1J02N1
6659A13J43j82J46l1j47J19k42J38k53K63J17j76K97o8p5k39K54l93L61m5j90
6680i0k49J16K56k49K51R1l23J30J91j16j31J44j08Q2k4L18m5k70J92J0k10J26
6702I2k11l4J03j58K35K41Pm80J38P2l39N98l18O8j74J14M9K46j99n3j00J18n7
$$ plain form
6540 13 82 -47 -190 -112 -192 -209 266 -34 64 -65 -37 -43 188 144 96 114 -95 -264 224 -71 -100 -46 -68 -10 35 -159
6566 -159 52 51 13 123 -105 -25 -76 -181 -259 -78 254 -103 -173 60 185 -297 -83 -99 44 -25 67 192 315
6589 315 206 53 -38 319 -128 -143 97 96 -39 -50 225 87 31 170 -345 -31 14 135 117 12 20 5 239 -227
6613 -227 -266 -80 -162 -59 226 88 276 -364 -66 -86 -155 -23 56 -11 158 222 -68 18 83 -123 -38 28 -55 191
6637 191 -71 113 -68 133 -227 -161 70 -22 -201 41 -139 183 43 166 172 141 29 170 31 -40 62 113
6659 113 256 74 220 189 42 161 -81 57 -196 67 184 8 305 237 162 -77 177 -216 145 100 -90
6680 -90 -339 -223 33 -216 35 126 -197 -67 124 8 -123 21 -87 -5 -29 289 244 -26 166 176 -34 92
6702 92 -119 -153 -50 -208 27 268 275 -205 -67 5 -334 264 -54 14 -160 -46 3 249 50 -3 -103 15 -42
6725d2K11k65M5L83l53ML85j61Q4j23M7j70j9K04j61j68K09j45O8k67J27L46j14
6748A25k34q3Q9R3j1k70J71J23n5R9O1j38n0J79J77l77J42k3m07N53m11K34L1
6771A8N4j63J97k46K72k27L6J15k50K67Q1k0m9J35k70N8J11k78J86j47j02J75
6793d7K64k38J27l38J78l03L6K49N4j30J57p4J39J38m49J73L57l21mP6l16L35
6815F3j47l4m1J27l9K27m26M68j06j39n9m1L68l67J97N6k42L0m6J61m7O8j15K55
6839A71r5k82K38J06k34J60j94J03J69j98J16O8k99N6j95N93m61K24k6j38R0k56
6861b84L18L9n8o3L39l36J19j9J22k66J82j03k58L50j29q4P1K21L3n9m01P3L05
6884A12L1k88J67j7J25j23n7k4K47m4l0j86P7J55n6j68J09O7j91K47k51J9J30
$$ plain form
6725 -42 169 -96 -51 332 -21 -17 368 207 291 168 215 45 26 230 69 -99 110 -35 33 -234 -107 239 125
6748 125 -109 -192 -103 -10 -21 -291 -120 3 -52 47 108 -30 -80 99 276 -101 41 18 -389 164 -247 -13 18
6771 18 72 -91 106 -140 132 -95 -59 56 -194 73 154 134 85 220 -50 8 119 -159 27 -120 -222 -47
6793 -47 217 -21 106 -232 -54 -357 -321 -72 -18 -148 9 -65 74 212 -237 -64 293 -28 -32 44 -272 63
6815 63 -84 -118 -159 -32 -71 156 -270 198 92 -47 -106 -147 221 -146 51 107 -135 -105 -151 10 -37 31 -84 171
6839 171 76 -206 32 138 -96 64 -130 -27 142 -56 60 128 -171 -115 -310 283 -178 46 20 -118 -28 -284
6861 -284 34 73 15 -48 291 -45 74 55 177 -89 93 -10 -268 82 -47 -131 -60 161 194 135 -266 -193 112
6884 112 143 -145 22 5 130 7 -50 -74 173 129 99 -87 -10 145 89 -79 30 97 -94 153 -98 -79 51
6907E1r8j10J97N8Q2n4ol70K76o2J20n7k81J42K55Nl66L5K34J03k43L52m87M23
6931A99k55r7K64p7j35L02l09J18J8P7j94K50j42j80J18Rr1J35J78l51L39l19
6953a43N0j2J9K00j83M8j7l90O72k62M69m00o5q6K05j67J56L74m53J21r3q6j28
6976a71k2J61l0m2o4k30L29Q2j76J67P9j13J05k74M26l12q3M31k37J31k61L2j27
6999a99J71M0J4j34j95J54K47j89Nj0p2K24l4K3j35J66N4m20J66m7K99m01J09
7022a64Q3q9L68j99J01J9n0j24J63j33j92K53j31q9R1K7J64l34M54O4k48p6n9
7045a01N7Q5n6M02j38k57k29M56k32R3J96m09J24Q4q3k5J19J15k40O9M3J74j25
7068A22O3k04j16L49m91N22j50k89M09j98N5m6o7L1J43q4j04n7Q7p0l46L95o3
$$ plain form
6907 51 -47 -157 40 98 180 126 120 -250 26 -36 84 27 -254 -112 143 148 -218 -183 51 154 -89 263 -224 199
6931 199 -56 -153 111 34 -101 201 -108 10 28 105 -89 161 19 -161 -43 -34 -125 10 188 -163 176 -143
6953 -143 -93 -105 -86 114 -69 -21 -38 -428 244 -18 451 51 -14 -100 105 -62 94 468 15 136 43 -43 -171
6976 -171 -193 -32 -62 -104 -168 -398 -69 13 -163 4 83 -30 75 -199 227 -85 -168 263 26 157 -104 -72 -199
6999 -199 -28 12 26 -108 -303 -149 98 -91 -86 -96 -168 56 22 45 -90 76 130 -290 -124 -171 128 -273 -164
7022 -164 -81 -170 198 -1 100 119 69 -55 108 -25 -217 36 -95 -184 -93 -66 98 -236 218 282 34 -42 -101
7045 -101 -44 41 -15 387 249 -8 -237 219 -13 80 276 -133 -9 75 -8 -33 86 201 -39 30 73 247 122
7068 122 185 -19 -135 214 -277 245 95 -194 215 17 72 26 -41 -10 133 49 -55 -112 -25 -95 -441 -46 -109
7091a09o0K24p5k3J75k3j39j57N1n0K07j39J67Oj78Q0k9J67M4l24L47j00m12L27
7115b3j32O1Lm9L79n01K02J77n7k23J33J30j59kN7p6J21m41M04q7J79k35L8j0
7139a11M30l34j6J17J8m7j80J03k98L91R4K03j71k10K19j42K3m9L9m1j09l3M64
7162C60k56k59M06j26j39J42k8j49J4k52N40k44j04J5J62j94Q8j30J14k17L85
7183A28k13L00k59k18J68J32R9n65O91k45k08O7j4L23j70j54J31M6j91J20J33
7204A01n9o9j14M03j30j60J7J6j32P6J87r7N3l49M17k94K95r2j19j36K66N0l62
7227b32M67j69j0q6k87O17k45n9O7j7n9j69J79k44J57j8J4p8J23J40L06m70R4
7250B1l6J99l86K84m5j29K4j34J69k28K46k8R4j38j00J24Q0k86M4kM40o12O90
$$ plain form
7091 -109 -169 55 -20 -43 132 109 -30 -187 -136 -186 21 -118 49 55 -123 -43 -72 95 139 -185 162 62 -350 -23
7115 -23 -155 -94 -91 -140 239 -262 -60 117 60 -163 -30 100 -59 -61 -4 -80 41 -400 4 -83 96 -139 -101 -111
7139 -111 319 -15 -31 86 104 57 -123 -20 -318 73 167 370 199 -11 208 66 89 40 79 38 -71 -104 360
7162 360 104 -155 251 125 -14 128 100 -49 -35 -287 253 9 -95 -80 82 -112 -24 -154 -40 -257 128
7183 128 -85 215 -44 -262 -94 38 137 -428 263 18 -190 -123 -137 186 16 -138 -7 39 -152 -32 101
7204 101 42 -27 -141 262 132 -28 -11 5 -127 -51 136 39 92 -257 160 -134 161 69 -50 -186 80 130 -232
7227 -232 235 66 56 -30 -317 300 55 -4 63 46 -13 -182 -3 -247 -90 -108 -94 -172 -49 91 397 -73 21
7250 21 -15 184 -202 82 37 -92 -68 -202 -33 -261 -15 -43 51 -87 -187 -63 17 -269 -225 -227 213 -399 291
7273B91m07Q9J74j44K74l43Nj71K50m7Q2M8n4j8J58j07k5j00j28K34pJ59k76P8
7297A5m7J85r8J02m37L08r5J45l57J97J22j1j30j03J69J51j9k5m7k6L23m00O6
7320a2kJ18L2J58n01M13l09K5J37o7N6K50k78l0J25j80R6K26m08K48j98l5J6l9
7344a59J95j75J78o1J26N4k49L42n3o8q8l18L1N3M0R1k76L85M8J37j59j92J10
7367hr3j36j5K47j51L47j54k1M0O7M9j95j53l1J34p2l4L14m91K87n5q4Q0J21P5
7392F8M7m0j22P8N7R9j46k65Q0K22m16L18J00j55J30O9k91J28L8r0n2q0K61j47
7416a09o1M48k47k5K63j22j88jQ7n9m2K0q3M09l73L30r6r0j11J62j46N4q2l11
7440c73K47J1M36n91J32j5OQ9j22K49l6P9j38J38k42J58K69l38q6n2J93j14J53
$$ plain form
7273 291 -116 -27 147 3 277 -66 -61 -232 18 -29 53 101 47 29 187 80 55 -45 -173 61 54 213 -63 15
7297 15 -32 153 55 157 -280 28 -67 78 -279 -82 40 29 -101 -204 -35 116 97 72 25 -1 322 -78 -12
7320 -12 -14 104 136 294 -207 206 -103 -78 59 -8 48 298 20 -10 115 -65 31 257 -151 97 -101 -136 -120 -159
7344 -159 36 -139 39 -22 104 158 -91 251 198 130 42 -276 -245 -192 -152 -61 -337 48 96 233 74 -118 -8
7367 -8 -101 -237 -252 -5 -156 191 37 16 56 123 172 -23 -176 -207 -73 -145 -179 135 -356 -69 -124 -208 -128 -7 68
7392 68 115 75 -47 31 88 187 41 -224 -144 78 -338 -20 80 -75 55 124 -167 -39 -1 -91 -143 -223 38 -109
7416 -109 -170 278 31 6 269 147 -41 -42 45 -14 -56 -36 -119 290 -83 247 151 61 -50 112 -34 20 -62 -373
7440 -373 -126 -115 321 -270 -138 -153 -147 -58 -180 69 33 112 -26 112 -130 28 297 -41 -127 -179 14 -100 53
7463E3k26m5P4j65K46J48j07J43k10K19l30K35j5K75j99J26k62L5L6n1l6K08j62
7486a0k15rO3L18j43n1J1j98K66k49J66M3L4J55m5K2j3l1Q4j1m0J38k40q5O0J4
7512C4R6j74M23l08m27K18J02r9M5L68l63k17L64l59M69k14%L4j24P4J48j48m
7535f2pR9j49p9K25M7Q6o2j73j91M08j90j3J33m9k57M02r6K39k88k1k41K15j57
7559a81P6L0R6L1k28J88P8k79J94K38K1m05M00j08j57j00L8K1J66O0r2j02j21
7582a36k8K32J92m95K69J56k24l10L40o9K06m7j03p4J1RK34l88K21Q0J14j68j39
7605a17J11J88k5j03J73Q9j62j59j07m3l3J86J65m62M62m94O46k96o1p2j29K67
7627B4k6L7r0r3K80j93KL63k82k09q9M53k07L54l74Q1j05L3noL36m55Q7lJ42k30
$$ plain form
7463 53 -173 -218 -144 -309 -63 85 -22 121 -89 130 -200 35 20 295 96 222 -40 -5 31 -20 -56 152 -10
7486 -10 -225 -234 -171 147 4 -47 -36 -234 32 -217 -51 -8 26 181 136 158 145 114 198 187 147 285 45 -40 20 34
7512 34 130 -44 379 71 -356 -138 -36 -135 -90 278 -85 -302 62 -297 172 -42 -42 -8 -132 -58 90 -58 -62
7535 -62 -69 30 -119 -198 27 74 160 98 -75 -266 142 -48 -61 72 23 -234 168 72 311 23 2 -239 -24 -181
7559 -181 -105 -75 21 52 -176 12 90 -189 5 243 264 -141 259 151 -6 -106 -68 -47 119 179 87 -15 -136
7582 -136 -164 68 260 -235 34 190 -34 -344 -4 -73 133 86 -17 -91 -80 -71 163 -225 -4 76 190 22 -117
7605 -117 -6 182 157 54 227 316 154 -5 -112 -155 -188 -2 163 -299 163 -331 315 19 -42 -114 -243 24
7627 24 -2 35 -55 -148 132 -61 -59 304 22 -187 -276 177 -30 324 -50 31 -74 -41 -46 -52 284 -171 -84 -87 55 -175
7653a75l0K96r9K0j27r3J01k42O23l80J93n2j20N8n1j02K72K5k15J09Q7Rp4K06
7677B39l54K61m16K80j28J83k23J86L6p0j50K47O9N2l25M8J01j50K75k02m7J11
7699B3j3j6l2P3K50m23J08l07L84r5n3K07l91j30M18j21K16j33K03j78r5J01j17
7722a21Rj55M19j33O9k25J28J21j24l23M14o0r5J84k19J71P3l31K81j47p9J61
7744A8q7q7R8K23j63l2J23Q2j12j69kK25ll2j7M4j60K37j96K31l52Pj7m2K85k32
7770a30L38k21k93K83j14K43R4l24R7j41J03n4J17Kj33K66q7mj77R9Q8K86l05
7793C3J7L7o1J1q4l3n1J65R3j6j67L25n08J54P2j85M6K18L28l91R9J48l35J65
7817H0j9J27k30J74l80N36j85j55j2j75Q7K77O2j48j20J98m1j63m4n2N33o91K34
$$ plain form
7653 -175 -205 91 -8 12 -115 -208 -107 -349 274 -106 87 35 -85 -27 -78 -180 92 117 -98 11 98 107 33 239
7677 239 -115 146 -270 10 -118 65 -158 28 64 -6 -156 91 160 212 -113 -65 36 -114 161 -41 -88 23
7699 23 10 -6 -38 35 285 -138 -30 -337 47 -48 -101 106 -285 -415 3 -118 98 -35 168 -10 -105 -4 -121
7722 -121 -112 -267 152 19 88 -137 -9 112 -12 -335 79 19 -76 108 -111 60 133 -198 83 -64 -143 18
7744 18 -69 -156 -58 165 2 -30 93 175 63 -106 -108 117 114 82 65 109 -51 186 -10 221 -131 -124 -141 -183 102 -130
7770 -130 208 -13 -306 -23 -137 106 200 -124 -27 -168 -65 -119 -2 0 -133 133 46 42 -135 -36 52 338 33
7793 33 50 87 26 37 -47 -80 -131 34 127 111 -56 269 -239 -85 -13 -198 -152 66 394 3 102 250 -85 80
7817 80 61 188 -42 132 -248 288 103 -52 -64 -239 -152 125 187 39 -81 117 76 -87 -131 -183 350 -341 -107
7840a07J02j86L71j86O1k41l3K46j14M53j35k88r8K01k52L85m61K70n4P0k36K86
7862E4o2qR3p6j08lL09l80K40j61K9Rk5pM14m24J68P6k50J76N4k72J48K61l39
7887h4M5M5o2J22J44k59R9j62P8j93R6J4N5OJ01J3o4n5M11k34k45K78j24n6j0
7912d1J8J40r0J36j75Q8N3j6m7Q0P4j45j74l27K90O3K57k05J19l24K75M22n40
7935f9j58J12L95l35Q4k93N26l51j66J82J10K2k20j11K36R8j23L00j90j52j44
7956b47J86%j28K33k07Q6L8J5k36j91P95l10L12k88O6k6j03o8M9J22k80L54q0
7979I2m6K7l39K29J10K50l66R3R7l35K23k23K67J24l15K19o3J07j40j79K82N3
8001A67k1m9k62J42J3Jj41j16L03J49j20l63L20Q2k20M5J56o7J00L2k82j89N01
$$ plain form
7840 -107 -5 -191 180 -6 55 -186 -219 27 -87 366 231 -57 -155 46 -206 179 -282 -12 -66 4 -232 54
7862 54 -8 -16 77 1 -107 -110 199 -181 59 -102 -73 -64 -89 -96 318 -106 62 138 -112 64 118 -154 -6 255 -84
7887 -84 -39 6 -56 66 210 -49 50 -112 -34 -227 -131 -117 -62 -56 45 58 -6 -61 350 116 -129 149 25 -31 -41
7912 -41 -23 117 27 163 -12 76 129 113 66 146 220 75 -99 -426 -136 -73 184 -21 98 -226 49 471 -69
7935 -69 -227 -115 280 -55 29 -264 262 -89 -255 -73 37 59 -161 -272 -36 62 -61 239 49 -103 -247
7956 -247 -61 -61 -189 44 -163 -77 -39 -24 -260 -451 344 34 346 58 124 98 -5 -73 -24 98 -182 172 92
7979 92 46 73 -266 -37 73 323 -43 50 147 -188 35 -188 79 203 -112 107 44 151 11 -168 114 167
8001 167 146 97 -165 -23 -10 -9 -150 -266 37 186 66 -297 23 105 -115 -70 86 19 119 151 -131 -320 181
8024A81j51n3j11Q7Q9Q2Q6l93K59j05r9M09j38m81O16j86j80M21l02j76L54l04
8046i5OJ63K04k49J5j22k9O7j04L9P8k64J92K53k08J71j81K08j09k5j73K02Q4
8069A23k50L87k07k73K54Nn0J87k65L47m68J43J81L7j89K40q4k09J38j10k08L21
8091E0k0J26j10k90j24L28O5O%l22M43l04K12m0l5L00o02O10m9k56L90n99Q1L36
8115A96j53j1K57m4n90M42J03m59J20J80k9Q9l8l08J48mR8J81j44k4N2P0l04K26
8139E4J77j07l08L06M5j76K2J05j69q3l0Q3Q9n8P0o5N3J02Lk34P7r4J55J32M5
8164A94j65K4Q7j83k41K53k26Q4K54R9j3l83J49O8M0j15L7l37l9J38J15L64j50
8187E4K00j12j72K06
$$ plain form
8024 181 30 -23 -134 -47 42 124 210 -183 76 -29 -128 281 143 -338 278 92 -88 333 31 -145 209 -95
8046 -95 -89 74 278 29 44 -78 -107 -40 -144 -105 -27 -291 -99 154 -54 117 -64 144 35 10 -163 39 123
8069 123 -127 260 53 -220 34 39 -11 176 -89 258 -210 -67 114 151 -38 202 118 -91 47 -63 -271 50
8091 50 30 156 46 -244 -368 -40 25 31 31 -291 152 -152 60 20 -15 285 -317 293 244 -12 378 -221 -140 196
8115 196 43 32 289 245 -345 97 200 -259 -139 41 12 101 63 -245 -97 -101 -3 178 34 10 62 132 -172 54
8139 54 231 124 -184 122 167 -9 13 118 -51 -134 -164 -81 8 -50 20 -45 8 110 113 -121 -44 -138 17 149 194
8164 194 29 53 140 -43 -284 -31 -257 -173 81 180 167 -216 -67 1 41 -74 -37 -374 -413 -275 -160 204 54
8187 54 254 142 -30 176
8191A76
$$ Imaginary data points
##PAGE= N=2
##DATA TABLE= (X++(I..I)), XYDATA
0@%%%%%%%%%qJ6k2L0l2M0m8O4q0R6j20J36j68K06k38K80l28L83m44N09n85O71
31C58p66Q71r89J120j261J417j591J781j989K215k463K735l031L355l708M095
47B149m518M980n487O043o659P339q093Q939r888J0964j2194J3615j5282J7266
61I174j9679K2688k6560L1762l9159N0605p0883J17679m32135j79672N94136K21583
73B79539L11371O8338k16491m13111k75894k60037o6627J59078K93983K85802
83A65951L17623Q9079j83906k60923k39459l13393j41650J59267K69562K45714
93A07865K92988J43186j47193k71311k46843k48226j06486J24709K17545K16811
103H3045K33166J10808q5359j70634k12988k53062j19212Q1653J49960J94947
$$ plain form
0 0 0 0 0 0 0 0 0 0 0 -8 8 -14 16 -16 24 -24 40 -40 56 -64 72 -96 110 -128 152 -176 207 -237 272 -313 358
31 358 -408 463 -526 594 -667 750 -841 940 -1049 1166 -1297 1438 -1593 1762 -1946 2149
47 2149 -2369 2611 -2876 3167 -3492 3847 -4246 4693 -5195 5769 -6425 7190 -8092 9174
61 9174 -10505 12183 -14377 17385 -21774 28831 -42052 75627 -356508 -536180 57956 279539
73 279539 590910 659248 442757 29646 -246248 -506285 -572912 -413834 -119851 165951
83 165951 483574 572653 388747 127824 -111635 -425028 -566678 -407411 -137849 107865
93 107865 400853 544039 396846 125535 -121308 -369534 -476020 -351311 -133766 83045
103 83045 316211 427019 341660 171026 -41962 -295024 -414236 -332583 -182623 12324
113A2324K59476J39633p7401j55689j86211k43551j44147O8085J64476J84678
123B1673K03867J15133m0993j22330j72230k02730j13945K0523Q9843J67214K24120
134A90145J23633l0605r1332j49084k11503j32162K0588R5201J42888J90475J31339
145B79583k829r2577j49468j73971j08413o791O5858J38621J73792J05535J1629
156B40969m6326j25336j81273j17118p411N3599J13343J65584J18964J6028n5538
167A75485j10586j46203j11153l0609M5249J12925J40038R7656L3481k6927j03010
178G6346j42679r8054l1091J9815R0234J40579J05986K9863k6789q2010j23809
189d1609j03756m0302K4629Q1775J12031R5775M9605j4851q3070j11795q6988
$$ plain form
113 12324 271800 411433 334032 178343 -7868 -251419 -395566 -327481 -163005 21673
123 21673 225540 340673 299680 177350 5120 -197610 -311555 -291032 -201189 -33975 190145
134 190145 313778 283173 191841 42757 -168746 -300908 -280320 -185119 -42231 148244 279583
145 279583 276754 184177 34709 -139262 -247675 -254466 -188608 -49987 123805 229340 240969
156 240969 194643 69307 -111966 -229084 -236495 -182896 -69553 96031 214995 231023 175485
167 175485 64899 -81304 -192457 -223066 -177817 -64892 75146 172802 206283 179356 76346
178 76346 -66333 -164387 -195478 -175663 -85429 55150 161136 190999 164210 82200 -41609
189 -41609 -145365 -185667 -161038 -79263 32768 128543 178148 163297 80227 -31568 -118556
200a18556m5230M958P2036J10622Q7950M2411k687o0556j04173r3171m4474P585
212a43285N7174R0890Q8717N1898m109n7454q4183q0635n5775o017N5609Q6632
224e38P6833N0070J0666m6137q5121p9427m6815p739L8169P6233Q0458N1287N466
237A23405l8109o6998p4110n6194j0289L8161O4943O7753N4431J7261l3633o6014
249B0607o6485m8992j8416K5571O1959O8468M8406J5475k1764n3636o7715n1857
261h8379j5074K2374M8927O1367N3269J9570k2069m8338n6936m9524k3449J7256
273h1006M8325N6857M5045K2329j1242m4310n7505m5069j9070R714L7192N4202
285A5462M8272K0169j1275l4475m8373m7378k4276R158L5281M5774M3135K5942
$$ plain form
200 -118556 -163786 -158828 -86792 23830 111780 154191 151504 90948 -13225 -106396 -150870 -143285
212 -143285 -86111 4779 93496 145394 141285 83831 -352 -80987 -136762 -142779 -87170 -538
224 -538 76295 126365 137031 90894 5773 -73654 -120469 -128208 -90039 -13806 66652 117939 123405
237 123405 85296 18298 -55812 -112006 -122295 -84134 -19191 48562 102993 120254 86621 20607
249 20607 -45878 -94870 -113286 -87715 -25756 42712 91118 106593 84829 31193 -36522 -88379
261 -88379 -103453 -81079 -32152 29215 82484 102054 79985 31647 -25289 -74813 -98262 -81006
273 -81006 -32681 24176 69221 91550 80308 35998 -21507 -66576 -85646 -75932 -38740 15462
285 15462 63734 83903 72628 38153 -10220 -57598 -81874 -72716 -37435 8339 51474 77416
297G7416l937l4673m6290m0245k3871Q07K9004M6131M2390K1999j606k5145m2052
310g2m3069k4090K585K3686L7844M1263K6497O4k4358l6647l7168k6655l236K1762
324d1594L6910L5766K4306N665j8103l5851l7132k3296m369J5458L1532L7316
336B6608K5485L687j5196k8267l4674k6984o761J5721K9001L0917K5192R516j2736
349D1509k9173l0867k3160r441R495K6674L2234K3349P592q649k2937l0511k5110
362c8995q128R017K1589K7108K4928J1085q113k1694k6140k2629j1884N073K0851
375a7932K6602K1120J1370l053j8242k6630k2516r976L298J6108K4005K2908J1274
388C8336l577j5149k1992k1196j3138K116J4996K1275J9524J2954J92j4194k0852
$$ plain form
297 77416 73479 38806 -7484 -47729 -71600 -70793 -41789 4342 46732 68731 67125 41980 -72
310 -72 -43141 -67231 -64646 -40960 -3116 38147 64644 64708 40350 3703 -33465 -60120 -63356 -41594
324 -41594 -4684 31082 55388 61053 42950 7099 -30033 -53329 -57698 -42240 -10708 26608
336 26608 52093 55780 40584 12317 -22357 -49341 -56102 -40381 -11380 19537 44729 54245 41509
349 41509 12336 -18531 -41691 -51132 -41637 -14963 17271 40620 48212 39563 16626 -13885 -38995
362 -38995 -47123 -38106 -16517 10591 35519 46604 38491 16797 -9343 -31972 -43856 -38783 -17932
375 -17932 8670 29790 41160 38107 19865 -6765 -29281 -39257 -35959 -19851 4154 27062 38336
388 38336 34759 19610 -2382 -23578 -36716 -34600 -19604 1671 21195 34149 34341 20147 -705
401g05j8838j2047j827J1992K0512J9660J1734R90j0286j8254j9976j2810l43
414c0198R661J6213J8110J4490K445j0153j6700j6420j3060m418Q631J6683J6214
427A1498J2283M358o532j5105j7352j2348l422O344J2927J6248J3003L922o108
440A9716j1949j4221j3711n597N610J2446J3331J2732N920l842j2148j3706j1739
453a7158n363K742J0442J3549J1997N583l154q564j2764j2772n546L115P870J1498
467A475J2059O886k314q256j1146j1023o670J243P628J0856J0602O182m11o371
481A0740j0377j0864o080L11N394R355J0925O638k50n259q295j0403o933o63N051
496a0710Q233R919O486J429m529q343r112o368j198K832P893R835O219Q03k172
$$ plain form
401 -705 -19543 -31590 -33417 -21425 -913 18747 30481 31471 21185 2931 -17045 -29855 -30198
414 -30198 -20537 -4324 13786 28276 30721 20568 3868 -12552 -25612 -30030 -21399 -4716 11498
427 11498 23781 28139 21607 6502 -10850 -23198 -26620 -20276 -7349 8899 21902 25824 19716
440 19716 7767 -6454 -20165 -25762 -20152 -7706 5625 18357 24277 20435 8287 -5419 -17158
453 -17158 -22521 -19779 -9337 4212 16209 21792 18638 10074 -2690 -15462 -21008 -17893 -10023 1475
467 1475 13534 20420 18106 9850 -1296 -12319 -18989 -17746 -10118 738 11340 17522 17111 10740
481 10740 363 -10501 -16581 -16270 -10876 -1521 9404 16042 15792 10533 2238 -8165 -15098 -15761 -10710
496 -10710 -2477 7442 13928 15357 10828 2485 -6627 -12995 -14193 -11361 -3468 6367 12586 13389 11217
511A1217p445r048o362j368K519O196Q478O736K064k588o262q028n824k412J667
526a0460O165P627N534K111q79m761q005n957k032N67M861P237N826K642n01m619
542E356o473o006l490O15M892O046N228K989L05l802o383n245k860o63L361O484
558C54N355K811M86l072n418n510l159l08K976M719M956L717P56l354m577m331
574c599l476r74K357M557M685K932J471k105m242m659l559r69J495M379M207L765
590F265Q93j561l467m335l765j182J616L595L675L279K052j236l386l861l283
605d701j891Q34L111L782L550J546r14k553l194l974j713P80K495L371L359J856
621E744n72k444k835l068k210M6K461L164K649K215j90j887k921k964j955j71
$$ plain form
511 11217 3772 -5276 -11638 -13006 -10487 -4291 4187 10923 12987 10399 4137 -3891 -9715 -12127 -10460
526 -10460 -4295 3332 8866 10977 10098 5337 -2668 -8625 -10657 -10090 -5229 2008 7834 10476 9975 5356
542 5356 -1117 -7123 -10613 -9998 -5106 940 6168 9157 9462 5660 -723 -5968 -8828 -9491 -6130 354
558 354 5709 8520 9006 5934 516 -4994 -8153 -8461 -5485 -766 4190 7907 8663 5309 732 -3599
574 -3599 -7075 -8049 -5692 -1135 3550 6482 7953 5848 1606 -3053 -6612 -7581 -6086 -1707 2500 6265
590 6265 7158 5597 2130 -2205 -5970 -7152 -5536 -1941 1734 5013 7065 5829 2443 -1418 -4701
605 -4701 -6592 -5758 -2647 1135 4685 6231 5317 2764 -430 -4404 -6117 -5337 -2842 529 3888 5744
621 5744 5172 2728 -107 -3175 -5385 -5339 -2878 286 2935 5150 4960 3073 152 -2812 -4767 -4938
637d938J868K660L118J980k70j346k522l060j533m73J522K270K448K671k17r86
653C192k461k301j969n73J340J608K547K126N03j078j755k607k075n95J021J950
669a127K114K078R33q54j671k355j969o86L7K090K351J448J132o53j408j886j933
686b359q46K88J233K095J748N42Jr64j837j965r04K31J234J657J623J055J10j013
704A929k270j259q94j59Q70J550J491J005J38m27j649j499j175k24P62J212J579
721I80Q12P08o39j321j013j468m06N83J133J189J225N44m66j041j630r39k18O2
739a905J109J202J108M88r0q88j345r10q69K95J021Q67R32Q02Ko69q69j920M2
758a597k28Q62R18J001N98J08m36r98q15j073j87K83J270J130N18Q2l74q34p20
$$ plain form
637 -4938 -3070 -410 2708 4688 4418 3072 550 -2510 -4043 -4516 -2994 -724 1724 4395 4178 3192
653 3192 731 -1570 -3539 -4112 -2772 -1164 1383 3509 4012 2934 1179 -1428 -3503 -4098 -3077 -1127
669 -1127 987 3065 3998 3144 1473 -882 -2851 -3537 -3500 -1410 941 2389 3521 2868 1460 -426 -2359
686 -2359 -3205 -2917 -1684 411 2159 2701 2702 1738 -99 -2064 -2968 -2737 -1503 154 1777 2832 2942 1929
704 1929 -341 -1600 -2494 -2653 -1783 -233 1258 2263 2401 1974 325 -1174 -2349 -2573 -1811 -599 980
721 980 1792 2500 1861 540 -473 -1941 -2347 -1764 -631 558 1783 2327 1861 820 -810 -1749 -1967 -1905
739 -1905 -796 406 1514 2002 1912 1024 -321 -1231 -2100 -1805 -784 83 1015 1817 1819 1150 281 -1639 -1597
758 -1597 -1825 -963 -45 956 1554 1662 1226 228 -587 -1660 -1847 -1564 -294 836 1354 1436 1062 228 -492
777d92o88n92N53R36O74O42N04l63q78q54m79l90J78Q06R42M71L08k81n92k71
797A34j204j41J58O04N39N41Q43j70o35j204l48m81O8M82R12N63L23K54l18r84
817f4n08l28m38O22O49N30L28M03k42r98l81m22k71M78N41N52N52J12n46l05l31
838f7o91m11L42Q41J98O57O7R1p23n01m73l98K29L31Q42L50L72l41k29n44n16
859e74m15L61P7L36N82M78j4k20p61m32k09l8O10J95P15K55m15Kk57o51k98m98
881a171P52M38J71L25J27l40m65J65n98l15M34L19L98K84J49j20k08p34l07Pj73
902h62P72K86O59n7k92k9n29m41k65j1J60O11O31j59K05m69j73l89l38J18L79
923a93M24J37L32k62O6n37k71j24j28N90n3M00J84k48j77k84p2n57K60J67P5N48
$$ plain form
777 -492 -1180 -1772 -1219 -283 391 1033 1537 1174 296 -558 -1037 -1427 -1249 -443 499 970 1278 997 405 134
797 134 -1070 -1211 -1053 -449 90 631 1474 1304 669 -535 -883 -1364 -1296 -814 98 661 984 1238 920 -64
817 -64 -572 -900 -1338 -716 -67 463 791 1194 952 -46 -427 -849 -1120 -642 -101 451 1003 1115 569 264 -67
838 -67 -758 -1169 -827 14 212 869 936 1027 304 -197 -670 -1068 -839 -508 334 684 1056 715 486 -58 -574
859 -574 -989 -628 -551 -215 367 845 831 611 -150 -582 -791 -829 -219 -24 691 946 531 533 276 -375 -673 -1171
881 -1171 -419 19 190 515 642 302 -163 2 -596 -911 -477 -158 240 524 673 553 345 -389 -696 -689 -862
902 -862 -90 196 855 798 506 477 -52 -493 -758 -769 -609 2 633 474 679 210 37 -352 -690 -572 -193
923 -193 231 368 700 438 504 -33 -304 -428 -556 34 -19 381 565 317 140 -144 -216 -773 -513 -346 -271 277
945B77M3K01k76l22l9l51j90L51J39M39J56N4l2l74l39l72K34p8M92K08L61l96
967A86J30j46o74P8j86K2K29P47j17j33M16k46o49k29j0K23L38L74J29J69n0n90
989A1l31o7qj20K50K97M54k35m8L39n42m30o9N9K93j14Q50M00j40p74L1o77L49
1012b22m72N78k06N61L26k8j99k70l49l57J29j36N40L78N5K28Q5m45n16j59k36
1033g15M59j08P90k59M32n37Jk71l64K97qK13K11J58J97j48k3k32l46k95K22j0
1055c36N50M99j20k82j67m2n29l5J95J67L17O6K60J00l45r9m18j41J09k7J75M80
1077C77J96k38l25Qj74l09J70P5K67L13N1M4o9j99o90l6k4M24kK78K69r1j59j7
1101A39l96n0P3o5J45J79L78k43K71k50k31l57qJ92j26L54N80n18L47l90o0l56
$$ plain form
945 277 320 521 245 -77 -116 -467 -657 -306 -167 272 428 482 450 76 -263 -635 -401 -479 13 221 582 186
967 186 316 170 -504 -426 -612 -590 -361 386 269 136 552 306 -343 -572 -582 -359 -21 353 482 651 601 11
989 11 -320 -387 -395 -515 -265 32 486 251 203 542 0 -430 -499 -440 -147 -261 589 989 849 75 106 -571 -222
1012 -222 -694 -116 -322 239 565 537 338 68 -281 -638 -509 -645 -105 273 328 556 641 196 -320 -479 -715
1033 -715 -256 -364 426 167 599 62 63 -208 -572 -275 -283 -70 141 299 496 348 325 93 -253 -548 -326 -336
1055 -336 214 713 593 311 144 102 -427 -462 -267 -100 217 283 543 643 298 199 -219 -360 -251 -278 -103 377
1077 377 573 335 10 18 -156 -465 -295 -220 47 360 411 455 386 187 -503 -539 -563 -139 -141 137 406 315 156 139
1101 139 -257 -307 -234 -299 -154 25 403 160 431 181 -50 -407 -415 -223 -349 5 585 67 414 24 -36 -392
1123c92Q5K52j3K24P5J44j49j16k46Nm78J16L18K83J89R2Rn23J15j73k80J16j38
1146d85M48J08M99k34j14l45l49L01k5O2kO15l43N09m38j55j76n45K41K02L40
1167A14L2L34k46n1j02k59j59n4L01P9M80j23R8r2l31j57k62J54j95M66N5J42
1189B24J16j74k58J55j58k22J07J18L33J85J16l9l54k70k53M8l9K68J74K02K15
1210D94l02k17L3k11n09L64K77K53M7K86m48J97l88k31J64j17J60P9M71O0j70
1231B92q3j97n13J32Q4N5k5M73K70k66K1n22L30l87J1j1K98L10L7j14J32j52l88
1254b13q4O8P6N9K13J73J6j12k65r4k29O3p9L09K49J23k2Q4k68k66l14K21K7K50
1278a5n9M20k70J58Q1l57N0j61j54K08K44L3LJ24k54k16o5o6J0K13R9J27L14m27
$$ plain form
1123 -392 -307 -55 -68 156 231 375 226 110 -136 -131 -609 -493 -175 108 297 389 398 -125 -10 -183 -463 -347 -485
1146 -485 -37 71 570 336 222 -123 -472 -171 -196 -134 -136 479 136 645 207 52 -124 -669 -428 -226 114
1167 114 146 480 234 183 81 -178 -337 -391 -90 -11 469 346 444 352 21 -136 -398 -244 -439 27 82 224
1189 224 340 166 -92 63 -95 -317 -210 -92 241 426 542 503 149 -121 -374 -326 -365 -97 77 279 494
1210 494 192 -25 8 -203 -712 -348 -71 182 229 515 67 264 -124 -355 -191 -308 -148 -69 402 462 292
1231 292 209 12 -501 -369 -285 -230 -255 218 488 222 243 -279 51 -336 -325 -336 -38 272 309 195 327 175 -213
1254 -213 -297 -229 -153 -94 119 292 308 196 -69 -163 -392 -329 -408 -99 150 273 251 335 67 -199 -513 -292 -265 -15
1278 -15 -74 346 76 234 315 -42 8 -153 -307 -99 145 178 181 305 51 -165 -230 -296 -286 -73 26 153 467 40
1302D0K13k46l81K38k26K25J50J93J05Rl6l76j66O7j77M18j70K93L22j01r0k26
1324G8j82J63l58J80Q0j47M15j04j51K08k40q5nK52R7j69J89L9j42J64l39l46
1346d03K17M9J03J92l08J26j55j0J36j01j55J2J20J03K59J13k66J9j39l85J51
1367c22N20j02O3l5LO7k48q4J61l14J94N5J76K30j32k64q5L24o3l13P2J78m0K20
1391B61j15l14P9J34m00K89j6J09k05L07j15N3m0r4J27q0p2j29J27K44m5K42n4
1414B93j31j29k99l1L25O1M8J54m27K92m79K26J69j90Qj2K40k25J21O9k57J37
1436c7J29j20K4K0N8K39k04j33l5m0J26n5K3J12k71J83J76l77J73k44K93j10J8
1459e2K5j76L95j28j93K18k22J30r5J76J38n24O6M17n1k4r6j77L07l64L73Q5j63
$$ plain form
1302 40 253 7 -374 -136 -362 -137 13 206 311 320 284 -92 -258 -191 -368 50 -120 173 495 394 304 78
1324 78 -104 59 -299 -119 -39 -186 229 125 -26 182 -58 -143 -148 104 201 32 221 260 118 282 -57 -403
1346 -403 -186 -137 -34 158 -150 -24 -179 -189 -53 -154 -309 -297 -177 -74 185 298 32 51 -88 -473 -322
1367 -322 198 96 159 124 127 194 -54 -138 23 -291 -97 -42 134 364 232 -32 -117 207 144 -169 -97 81 41 261
1391 261 146 -168 -89 45 -355 -66 -82 27 -178 129 14 67 27 -67 60 -20 -92 -221 -94 150 105 347 293
1414 293 162 33 -266 -297 28 89 137 291 -136 156 -323 -97 72 -118 -110 -122 118 -107 14 83 -174 -37
1436 -37 92 -28 -4 16 74 313 109 -24 -59 -99 27 -28 -5 107 -164 19 195 -182 -9 -253 40 -70 -52
1459 -52 -27 -203 192 64 -129 89 -133 -3 -98 78 216 -308 -242 175 124 100 4 -173 134 -230 143 228 65
1482F5j39Q6J93k45K34j56J4J09k64J50J21m41K04R9k0O6j2J44j15j80K46p8j00
1505a9K15l25J29J46o3O1J63l82j01K43o2l9K73j27J69l79O5k71l3J29J66J92
1527A50l50J51K97k10P0L5j89J02J8n3j0K64l22M8M2p1Q3k37J25R5o4j00J23R7
1551I4l24K18J95l16J71O3j37L03l32J22J61j16j60J23PJ4m9j42Q8J2n3J27l19
1574b50K12L84l23l18J84J14Q4K16m98J6J8K18k0J10j08j10J61k86K52k50R4K44
1596A44J72l36K06j86j14J18K08k00Q0R7Q3j92j73J55J40k03r9mJ53k7nlM45n48
1620h9k29M06M2l59J84j31K86m2o6j7K71N7r8m66N1K54Q3p3k93L09l5r9Q1o1m7
1645h1J23K06M6k99p1P5j34O0j95L82j07K29k14o3k81K46K86j62k68M05j53M6
$$ plain form
1482 65 -74 12 205 -40 194 38 52 161 -103 47 168 -273 -69 30 10 76 64 208 93 -87 159 81 -19
1505 -19 196 -129 0 146 83 144 307 -75 -176 67 5 -34 239 112 281 -98 -33 -304 -337 -208 -42 150
1527 150 -200 -49 248 38 108 143 -46 56 74 21 11 275 -47 1 43 -28 55 -182 -57 38 -26 -126 -3 94
1551 94 -230 -12 183 -133 38 101 -36 267 -65 57 218 102 -58 65 72 86 37 -105 -17 -5 -58 69 -250
1574 -250 -38 346 23 -295 -111 3 87 303 -195 -179 -161 57 37 147 39 -71 90 -196 56 -194 -100 144
1596 144 316 -20 186 0 -114 4 212 12 92 189 272 80 -93 62 202 -1 -100 -104 49 22 17 14 459 -89
1620 -89 -318 88 130 -229 -45 -176 110 68 2 -15 256 313 215 -251 -200 54 137 64 -229 80 45 -54 27 -34 -81
1645 -81 42 248 294 -5 -76 -1 -135 -75 -270 112 5 234 20 -43 -324 -78 208 46 -222 183 30 76
1667G6Nj55J29p7P6j21L0K02l5kJ6k18K26R3m38K62j32k5J51l45P6K38k15K27
1691D4j08J10k12J79m1O8K25j04k62J52k33L47j38k31J86J20j04o7L78l07k61
1712b59L23K9j87%N1J41j1m4K65l31l94M13l1K6l91L04K31N2k36nN8J82m63J35
1736a42K02N3j80L1L04l27oq2K65k88O6K10r9J65Q0l09J86o72K41L85n5O2J82
1759B72l50R1r7j73J46l8J63O9j51r9J73j62N6j39R0J22J93j19M8K4k22L23N3
1782B73o5l18n2O5J49j30K05Ok31R7j33K59j70j31K04j04j13L93o8pj2j97L44
1805B64m49k8j3L37j51p5L4o8J56K35n03O7J38J43j5q0P1k8j47j1j0m9J33m9M66
1830C68k99M8Q2j81j53L85k40qj64K4K18j59J90L3j10J1j81J86j5k90L15J01n3
$$ plain form
1667 76 81 -74 55 -22 54 -67 -37 165 130 128 144 -74 152 245 -193 69 -63 -88 63 -282 -206 32 -183 44
1691 44 -64 46 -166 13 -28 40 265 161 -101 51 -182 165 27 -204 -18 102 -2 -69 309 2 -259
1712 -259 64 93 -94 -94 -43 98 87 43 308 -23 -417 -4 -35 -9 -400 -96 135 187 -49 -54 4 186 -277 -142
1736 -142 60 113 -67 -36 268 -59 -65 -147 118 -170 -104 106 7 172 252 -57 129 -543 -302 83 28 90 272
1759 272 -78 13 -84 -257 -111 -149 14 83 -68 -167 6 -156 -100 -239 -149 -27 166 47 95 119 -103 220 273
1782 273 208 -110 -162 -97 52 -78 127 133 -98 -1 -134 125 -45 -176 28 -76 -189 204 136 129 117 -80 264
1805 264 -185 -213 -226 111 -40 -115 -81 -149 7 242 -261 -194 -56 87 72 -8 63 35 -112 -123 -133 -182 -49 -98 368
1830 368 69 117 199 18 -135 250 10 2 -162 -138 80 -79 111 144 34 45 -136 50 35 -255 60 161 108
1853A08j50OL6R7j03K08q0j9n4j02K57j96p5j10R2j91K61K28M7l66J5L23l58M6
1877h0J25j89j17J42J85j8J51J18l56q1J39%j2O9j3K4L0j71J03j66o3J47k09J38
1901a04n1K82j16l09L14n5J3K15k62L15k30m3j8JJ54k51K85j89N5j27K18l7J35
1924A95l18J18J82n88L55K40j76K67l31L5j85L94l4j89Qj6r5K53o0N4k01Q6j77
1947a83K83o8Mn9L9K31m50L17L8N6j7m26J76j78J91o3J39K1J10n03M89j63p0j3
1971i9J25l7p7L74j75k2j88J54L9j65j53L72j14J44n9j73J08M1j30j08K36k52
1993a59J11J68k77K36J70q2k08J18j89K81l52K42J14Rj68m7J09k35J57L1j95L99
2015B33J06k73l10J76J06k07j49K71L60j70o9p7N5p0j19J85R3k20q5J16j23M66
$$ plain form
1853 108 -42 -36 0 97 -6 202 122 103 49 -53 204 8 -67 -177 -85 -276 -15 213 260 -106 -91 232 -126 -80
1877 -80 45 -144 -261 -119 66 48 199 317 -39 -120 19 19 7 76 63 87 117 -54 49 -117 -180 -33 -242 -104
1901 -104 -155 127 11 -298 16 -39 -26 189 -73 242 12 -31 -49 -48 106 -145 140 -49 6 -121 97 60 195
1924 195 -123 -5 177 -411 -56 184 8 275 -56 -21 -206 188 154 -35 -27 -43 -138 115 55 109 -92 -6 -183
1947 -183 100 32 36 -23 16 247 -203 114 152 208 191 -235 -59 -237 -46 -109 30 51 161 -342 147 -16 -86 -99
1971 -99 26 -11 -88 286 111 89 -99 55 94 -71 -224 148 34 178 119 -54 54 95 -35 -143 93 -159
1993 -159 -48 120 -157 79 249 167 -41 77 -112 169 -183 59 173 182 14 -33 76 -159 -2 29 -166 233
2015 233 339 66 -244 -68 38 -169 -318 -47 313 143 74 -3 52 -18 -137 48 141 -79 -164 -48 -171 295
2037B95j35q1k3J00qk21M6o9K41q2o5R0k05J40j77K66j58oK2K8k2N2j42j69J40
2062a43P5O3Rp0oK43k14kL20n15qN00l86N9J15R2l61L58j3o8p5J44n0k12J24q0
2088a01l6J93r7j36L47k69L81k35j72J10q9j19Q3q6L09l10R7K23j65K0J99k99
2110a52M4J27j2J98r0q9Jk6j47J51k09J11J23K40l02J10Q8j34j47K21k73J48K37
2133B18k55j48J72J86k51r8N19k76r5j5K7j7k24M42l35K13r6O1k75L92k0j33j11
2156a19J87R1l4M4k47k03L4M72j61n7j48R7J30L7j00k57K7O1j25K95j80Q4J49
2179G7J48l72M10k95mjk82M41j35O4m2p7L93m73k01M66q1m8j44K91j32j77P6k2
2203a20L38j65n8RQ1l59K92J48m44K05J22m2k57J37K17k97K51m2N3o0N5j85R8
$$ plain form
2037 295 160 79 56 156 148 -73 -27 -96 145 63 -2 88 -117 23 -154 112 -46 -52 -30 -2 -24 28 -114 -283 -143
2062 -143 -68 -5 4 -66 -72 171 -43 -45 275 -240 -248 252 -134 -75 40 132 -229 129 116 48 -27 117 67 -145 -21 -101
2088 -101 -137 56 -41 -177 170 -99 282 47 -125 -15 -104 -223 -140 -226 83 -227 -130 93 -72 -52 147 -152
2110 -152 -108 19 7 205 115 26 27 1 -146 5 -204 -93 30 270 -32 78 166 32 -115 106 -167 -19 218
2133 218 -37 -185 -13 173 -78 -176 343 67 -28 -43 -16 -33 -257 185 -150 63 -33 28 -247 145 125 -8 -119
2156 -119 68 159 125 169 -78 -281 -247 225 64 7 -141 -44 86 123 23 -234 -207 -146 -271 24 -156 -72 77
2179 77 225 -147 263 -32 -36 -37 -319 122 -13 51 9 -68 325 -148 -349 117 36 -12 -156 135 3 -174 -98 -120
2203 -120 218 53 -5 4 85 -274 18 166 -278 -73 49 7 -250 -113 104 -193 58 16 69 9 64 -121 -23
2226b3Q4l4n9K30l50k3K25R3m5j00K9k7J83j90q3j04K65j22K93m28K64o7m0M3
2250A4J25Q4l24J31K9n7q0Q5R2m08K31K44n3k81J39j06k3K07j41L19P8r9l57J64
2274A3n48M79r2MJ92J64J95k70n7r2P2j29j5j37p4L47p1k4M39n27K30l6m0oL03
2299C20j64K2k00KL6j04J47j98P4J46k35M71l83J16m8Q9j62n7K8K44p1J02m8k91
2323a64K20k49J91j35M34j71Nl5o9n6j2L0k13j07J93K41J7j39K7J2JJ51l17J54
2347Ij80K46o4R1k4k10P7R4j59K80p1k56K31k44R5M6j34L65l56K27l2n5J48m9
2371G5J2N4J9k22k87J61J64J78j5n8k28O8J03kP2k40PK57j13p6M71l20k01J40
2395A9J76k31m3QK06j09k13J76k64O5j21m4K68J63n8N5K77l78J1j7O7k41J52J00
$$ plain form
2226 -23 61 27 -32 198 -152 -175 50 143 98 -2 27 0 183 -7 -90 -194 71 -51 242 -186 78 11 -29 14
2250 14 139 223 -101 30 59 2 -78 7 99 -309 -78 166 113 -168 -29 -135 -158 49 -92 227 305 206 -151 13
2274 13 -535 -56 -148 -144 48 212 407 137 80 -12 60 -69 -84 -221 -295 52 -19 -43 396 -131 99 63 23 17 320
2299 320 156 178 -22 -20 16 -88 59 -139 -65 81 -154 317 -66 50 2 91 -71 -128 -100 144 73 175 127 -164
2323 -164 56 -193 -2 -137 297 126 131 96 27 -29 -41 -11 -224 -331 -138 103 120 -19 8 20 21 172 -145 9
2347 9 -171 75 11 102 78 -132 -55 39 -120 160 89 -167 64 -180 -85 -39 -173 192 -164 63 31 -24 124 75
2371 75 87 141 160 -62 -349 -188 -24 154 139 81 -147 -79 24 22 94 -146 -139 118 5 -71 400 80 -121 19
2395 19 195 -36 -79 -71 135 26 -187 -11 -275 -210 -331 -375 -107 56 -2 53 330 -48 -37 -54 13 -228 -76 24
2419B4j61K37K2q4Q6o0J46m48K10J33k93J95j55M7R3k8L80l80j60P4K48K7j69
2442a6m1K6J68j74R9o9j39l2J35K06k27N6J70k09K32k07k75M61l17J98J27p5Q
2465A05j99J78r8j03j36M40k68J42j75J6L80k4l21j00j10Q0K79q5Q4O3k27K91
2487B12K10l18r3j9m0P9j83N4n9L77l17J33n6k16J70R6j11J7L63j89k96K58j06
2510c4M4j00M2Q8m39M71l41L17q5r7Q3k68M11m0J4N2k6p0l7J58k83J36j44q1M11
2535A82k19j29J2K59m09J22K5J19K4O6m9K40n9j73j53M6j88N09j45R6k90K2J58
2558F6R3o1j35j11j7P9r8L63o6R1k73k70L38N0m61O40l25L07k84j36O2o7L67j50
2582BOn5J96k04K3o4R2J69j93J44o5J74n02L43O2k56K56k11Q9J39k60K43J00l49
$$ plain form
2419 24 -137 100 122 38 124 64 210 -238 -28 105 -188 7 -148 -101 -8 -36 344 -36 -196 -122 126 153 -16
2442 -16 -57 -31 137 -37 62 -7 -146 -178 -43 163 -64 -8 162 -47 185 -22 -297 164 -153 45 172 97 105
2465 105 -94 84 -14 -117 -253 187 -81 61 -114 -98 282 258 -63 -163 -273 -193 86 1 85 148 -79 212
2487 212 422 104 11 -8 -48 31 -152 -98 -157 220 -97 36 -20 -236 -66 30 -81 -64 299 110 -186 72 -34
2510 -34 10 -90 -48 40 -399 72 -269 48 -37 -134 -51 -319 92 52 66 118 92 22 -15 143 -140 -4 -148 -229 182
2535 182 -37 -166 -154 105 -304 -182 -157 -38 -14 52 3 243 184 11 -142 -96 -284 225 80 176 -114 -92 66
2558 66 159 98 -37 -148 -165 -86 -184 179 113 204 -69 -339 -1 49 -412 228 -97 210 -74 -210 -148 -215 152 2
2582 2 8 -47 149 -55 -32 -96 -4 165 -28 116 51 225 -277 66 128 -128 128 -83 6 145 -115 128 228 -121
2606a21J42o6j1l16O03l07M5K33j6l6k65J82r5q0J12O2q8L06j95n8j42n7K10n0
2630hl2j26J67j3q1j0J6o1p9P5J44LL4Q6J98l67j35L29l98M62k42J02J52j29n8
2655B9j30R4n5Q%K62L2k85qQ9k6P1P6j46r5n4J20R9j12K25m7r6q3J38l12L87l2
2682A49k50K4j50K7J64qR2J38m8l39J78K11k01q2K80k09k45M77l64J08j07L07
2704A52J37k75l1L24l17m2R3Rj02Ok4n5K4K63l44R4J1J15K83l98J01k02R6K1K2
2729c9j3J30n11K20K32j39M2L2J89r7k50J8K47k84L20j11k4J9k4n3J06j77K6J19
2753b2K55j84k42K82N5j94n4M00m80K75k2k27J95N5k64J13r7K94j70J19p9K31
2775B39l44k4q1R2K75k14J06lNqk03p8L08J26j37j65J06L3lj54J31m21M53Q1P2
$$ plain form
2606 -121 21 -45 -56 -372 231 -76 -31 202 186 150 -115 67 -28 -108 4 66 -22 284 89 31 -111 -168 42 -8
2630 -8 -40 -166 1 -12 -93 -103 -87 -148 -227 -152 -8 -5 29 115 313 -54 -189 140 -258 204 -38 64 216 87 29
2655 29 -101 -7 -62 -54 -54 208 240 -45 -53 36 10 81 157 11 -84 -138 -18 81 -31 194 147 51 -32 106 -206 181 149
2682 149 -101 -77 -227 -200 -36 -44 48 186 138 -201 -23 188 -13 -95 185 -24 -269 208 -156 -48 -155 152
2704 152 289 14 -17 307 -10 -52 41 50 -52 -46 -70 -125 -101 162 -182 -88 -77 38 321 -77 24 -178 -82 -61 -39
2729 -39 -52 78 -433 -213 19 -120 -78 -46 143 46 -204 -186 61 -223 97 -14 -38 -19 -43 -96 10 -167 -141 -22
2753 -22 233 49 -193 89 144 -50 -104 296 -184 91 69 -158 37 92 -172 -59 -156 138 -32 87 8 239
2775 239 -105 -129 -210 -118 157 -57 49 46 51 43 -160 -238 70 196 59 -106 0 33 30 -124 7 -414 39 120 192
2800A92k94K02j36K03k5j06o0K02R8n56K89K30m25J39M27l67J92k51l0p9k2J26
2822e1q8P9M9P0N1j82q2K21j68K07ON4l31K19J50p3j03k2J31l38N7J28P1j87J72
2847D0m7O4jk43L16n2K6j30L43m01K55j88j27JK44j66J38j71M7K00j27QP7j90
2871h4j96L97j17O4%j64l0J82j62l0J10K05L3j02j25M24n5m67MJ51k58l9L27j15
2895d7M3J10l1J2l74N00j35j69K40j44J68p0j60J13k23L50J91n05N9J75Nj36M5
2918A7J61m4q7M9l31J02k19M38j62k0K84j09k7j25r3L28j26K09k16J79m0j20j97
2941a49O0l5k2K94j5j24K33m11L11j60L6q2K19k40K4K99j41k21j2K04k14J38N6
2964D8Q9n00M72q2j7K32j95j57j02k5K61j34p3K24J28j86j11N9p8J73R7k31K56
$$ plain form
2800 192 -102 100 -36 167 142 36 -24 178 276 -280 9 239 -186 -47 380 13 205 -46 -76 -155 -177 -51
2822 -51 -139 -60 -11 59 110 -72 -154 67 -101 106 112 166 -165 54 204 131 28 6 137 -201 -144 -16 55 -132 40
2847 40 -7 57 56 -187 129 77 103 -27 316 -85 170 -18 -145 -144 100 -66 72 -99 -52 148 21 29 106 -84
2871 -84 -280 117 0 64 64 -100 -130 52 -110 -140 -30 175 208 106 -19 405 350 -117 -113 38 -220 -259 68 -47
2895 -47 -4 106 75 87 -287 213 78 -91 149 5 173 103 -57 56 -167 183 374 -131 -72 103 108 -28 17
2918 17 178 134 47 96 -235 -133 -352 86 -76 -96 188 79 52 -73 -166 162 36 245 29 208 168 48 -149
2941 -149 -89 -124 -146 148 133 9 242 -169 142 -18 18 -64 155 -85 -61 238 97 -124 -136 68 -146 -8 48
2964 48 137 -363 109 27 10 242 47 -110 -212 -237 24 -110 -183 41 169 -17 -128 -69 -147 26 123 -108 148
2987A48k89J79j01M7J50k1J6j78K43j99m3RO2Q2l0R7j60K09l55N7k97J02M39j76
3011ij75K88j62k20N43k79J58n5n7N8r5m2J17N3k07m0J1K38k24K3o7J85j91o8
3035b17L25j63J23o8J32k4k18l6K30k13O3J24k33j9L04l8r3K64j99j49k00K15
3057i0JO3P2q0o7o1K11P8j08M8n8o5m8Q7k35J70Q6Pk90M56k86J77rJ40j32j44
3083g7J2j89N19k88M79k51o8l55K69P6j37o4K21j8j09J08p4j8k8m9J30j14Q6l01
3107b40L27j07o8L79k97J6q6l5J09K02p7l34n0K81N1Q8n0p2k10J33L11m25L84
3130B30l95K86k19L13r7l4r6K20j36q1k44M1N0K30l1l5J69Q1Nj91r6j95l6K53
3154ho1K7N6k21K26l35M92j51n1r5O0J19k6K07j08j86PK34l26L11k62n7L46j72
$$ plain form
2987 148 -141 38 -63 -16 134 113 129 -49 194 -5 -48 -39 23 105 75 172 12 221 -134 -77 -374 -272 167 -9
3011 -9 -184 104 -58 -278 265 -14 144 89 32 90 -5 -47 70 123 -84 -124 -113 125 -99 -76 -143 42 -149 -217
3035 -217 108 -55 68 0 132 108 -110 -146 84 -129 -66 58 -175 -194 110 72 -21 243 44 -105 -305 -90
3057 -90 -89 -26 46 -34 -101 -162 49 127 19 67 9 -56 -104 -17 -252 -82 4 11 -279 177 -109 68 59 199 67 -77
3083 -77 -65 -254 265 -23 456 205 137 -218 51 127 -10 -74 147 129 20 128 54 36 8 -41 89 -25 61 -240
3107 -240 87 -20 -88 291 -6 10 -76 -111 -2 200 123 -211 -261 20 71 159 109 37 -173 -40 271 -154 230
3130 230 -165 121 -98 215 118 84 -12 208 72 -9 -253 -212 -162 68 37 2 171 252 257 66 -30 -225 -261 -8
3154 -8 -69 -42 14 -207 19 -316 176 25 -26 -121 -61 58 32 239 131 -55 -48 186 -140 171 -91 -148 198 26
3178B6K8O6n7j20K96l33M1q2J49J21j42o7K55j97J48j23l00M20J13l52J56k71
3200b25J29o5N1K25j77J38j45R4k66K34j06K42m6k42L05l44J62M98m86o3J74m0
3222D7j28J98j66k26K85n0N8J03j03L8J69k35J63j19L9j25K82j31Q8k79m9K66
3244A25k02j26J03N0k05R8L2j05K07P7j39l2J07J30l21N8K42j76R9J04k14R2m2
3267c8O2m1j87J68J2J09J15k2l16j19J13p7l1J16K22m7j41J37K4p3k19L45J91
3290C03n70Q2L49o16O22j72m5L29j1k94O6p6j83Q0R3o7J81NJ46j62M0j6j5j4N6
3315A11N4l59J39j31K43n9K22k33K5J14j45P8j01n2k7J7N2J52j71n6K31J57n16
3338b55L96j93P4L27l37j75K55q7J86j76L8P0k35M02n45J02Q3jj10n3M91m46J41
$$ plain form
3178 26 54 120 63 -57 239 -94 -53 -135 14 135 -7 -74 181 -16 132 9 -291 129 242 -110 46 -225
3200 -225 -96 -161 -110 115 -62 76 -69 25 -241 -7 -113 129 83 -159 146 -198 -36 462 -24 -87 87 47
3222 47 -81 117 -49 -275 10 -40 18 121 18 56 225 -10 153 34 73 -52 230 99 187 -92 -141 125
3244 125 -77 -203 -100 -50 -255 -157 -125 -230 -23 54 -85 -117 -10 120 -201 -143 99 -77 22 126 -88 4 -38
3267 -38 24 -17 -204 -36 -24 85 200 178 -138 -257 -144 -221 -252 -136 86 39 -102 35 59 -14 -233 112 303
3290 303 -267 -185 164 -452 170 -2 -47 282 271 -23 43 -33 -216 -136 -43 -110 71 76 222 60 100 84 69 55 111
3315 111 165 -194 -55 -186 57 -2 220 -13 12 126 -19 59 -42 -94 -121 -104 -52 100 -71 -127 104 261 -255
3338 -255 141 -52 22 349 12 -163 92 5 191 15 53 123 -112 290 -255 -153 -70 -71 -181 -234 257 -189 -48
3361d8j88K03l6n6J55j75M45k29K1KM2l31K75l6m16K01J28L23k28l1N7j69M0p5
3385a26J08K99l72R9j69J00Q5J03O4k47L40l83L67j45j94J22k9l65L59Q6R5j04
3407I3r6J16j65J77q9K0j01P4Q6j03j67K53N5L8l30Q8j25L08l13RL66j99Jl7J06
3432F5q4J38j3K10m99J96O9j02K12k51J15k3j60J59Q2J1j00mJ29j88k4j42L43
3455A39J74k79j74j00M36k90K63kk16J10j68J1K07p5p4J50O6q0k50J78Q1N9k46
3478h0J78j01J62k22J51j42M3j16J60r5J18K1m1O4k73j72M72L9k94J17kM2r4J40
3502G5j39M4M14n90M3N7K72pm3n4j69L08q1j34L02l80q8K65m3J36l78K74j62j2
3526i0l0k05M28J77k32o0k79L00J7j38J00l01M36J0j52r4N2J07mj97J60j51K74
$$ plain form
3361 -48 -236 -33 -69 -125 30 -145 300 71 92 94 136 -195 80 44 -372 -171 -43 280 52 21 78 -91 -51 -126
3385 -126 -18 281 -91 8 -161 -61 24 127 191 -56 284 -99 268 123 -71 51 22 -343 16 102 197 93
3407 93 -3 113 -52 125 36 56 -45 29 115 12 -155 98 153 191 -139 -51 -176 132 -181 -172 194 -5 -4 -41 65
3432 65 -19 119 106 316 -183 13 82 -20 192 -59 56 33 -127 32 114 125 25 21 150 -38 -62 -204 139
3455 139 313 34 -140 -240 196 -94 169 167 -49 61 -107 -96 111 36 -38 112 178 98 -152 26 107 166 -80
3478 -80 98 -3 159 -63 88 -54 -11 -127 33 -62 56 77 36 100 -173 -345 127 166 -128 -11 -13 29 -65 75
3502 75 -64 -20 394 -196 -153 -96 176 169 126 72 -97 211 130 -4 298 -82 -170 95 52 188 -190 84 -78 -90
3526 -90 -120 -325 103 280 48 -12 -291 9 26 -112 -12 -313 123 133 -19 -113 -61 46 42 -155 5 -146 128
3549A28L8j62k9L9R0n6j5Q0k21J37j61J62J80l83R8J84j37j17J5J76r6m7j33P3
3573a57L47k17m7N8P1j17J96k34OJ14o8K33l19M47k89k08L02j7k1j69K32j11J86
3596B18K7j39J5p0k49K91j37q3R1L27l89p9J48Q9L5j75J8MM40j09k19k39L04p1
3620D8n7j13J33RK7J74k55j1L7k45J35J51R2L4k91J82J09k81l7K40n3j43J58j61
3644a18J7K18l37J18p3J75K33l49J5K79j67kQR9m48J81K11l7j63O1q1K66l6%O2
3669A32j65J45k35M90k14j52k27M33l9j37O3j71K12J21r5j47l02N05k24l55K27
3690a35k3n4K78j7Qq6NJ54k79J25K1K9jj42k27K40R6j8J40l54o9P38k97j07o5
3715d0M22j21l38%k2M04l06J65k47J43k04L63j6m5m15K08K09l53K99l77K28J01
$$ plain form
3549 128 166 4 -25 14 104 48 33 113 -108 29 -132 30 210 -173 -75 109 -28 -145 -130 46 -50 -97 -230 -157
3573 -157 190 -27 -74 -16 55 -62 134 -100 -94 20 -48 185 -134 313 24 -184 118 101 80 -89 143 32 218
3596 218 245 106 121 51 -198 93 -44 -127 -36 291 -98 -177 -29 60 95 -80 -62 -58 382 273 54 -185 119 48
3620 48 -9 -122 11 20 47 221 -34 -45 -8 -253 -118 33 125 159 -132 50 159 -122 -159 81 28 -115 43 -118
3644 -118 -101 117 -220 -102 -175 0 233 -116 -101 178 11 9 17 116 -332 -151 60 23 -140 -79 -160 106 70 70 132
3669 132 -33 112 -123 367 153 1 -226 207 168 31 94 -77 135 256 161 14 -288 217 -7 -362 -135
3690 -135 -158 -212 66 49 57 -29 -24 130 -149 -24 -3 26 25 -117 -344 -104 -8 -26 114 -240 -309 429 132 25 -40
3715 -40 382 261 -77 -77 -99 305 -1 164 -83 60 -144 219 203 158 -257 -49 160 -193 106 -271 -43 58
3737E8j33J21J01k18L8K47l8p8m9j55J68m0J88k6j10P8j62l1J30J04l57O2n1K88
$$ plain form
3737 58 -75 46 147 -71 -33 214 176 98 49 -106 62 22 210 184 74 152 -10 -41 89 193 -164 -102 -153 135
$$ [...]
8191A51
##END NTUPLES=NMR FID
##END=
