##TITLE=1H_DE-80Wk
 200.13MHz, D2O,
 8 sc
 
 27.1.2025
##JCAMPDX= 6.0         $$ Bruker NMR JCAMP-DX V2.0
##DATA TYPE= NMR FID
##DATA CLASS= NTUPLES
##ORIGIN= UXNMR, Bruker Analytische Messtechnik GmbH
##OWNER= pz
$$ XWIN-NMR		Version 3.5
$$ Mon Jan 27 16:20:15 2025 Russian Standard Time (UT+4h)  she@DPX200
##.OBSERVE FREQUENCY= 200.1313
##.OBSERVE NUCLEUS= ^1H
##.DELAY= (6, 6)
##.ACQUISITION MODE= SIMULTANEOUS
##.ACQUISITION SCHEME= undefined
##.AVERAGES= 8
##.DIGITISER RES= 18
##SPECTROMETER/DATA SYSTEM= spect
##.PULSE SEQUENCE= zg30
##.SOLVENT NAME= D2O
##.SHIFT REFERENCE= (INTERNAL, D2O, 0, 14.3821)
##AUDIT TRAIL= $$ (NUMBER, WHEN, WHO, WHERE, WHAT)
$$ ##TITLE= Audit trail, XWIN-NMR		Version 3.5
$$ ##JCAMPDX= 5.01
$$ ##ORIGIN= Bruker BioSpin GmbH
$$ ##OWNER= she
$$ F:/spectra/data/she/nmr/H-C/1/audita.txt
$$ ##AUDIT TRAIL=  $$ (NUMBER, WHEN, WHO, WHERE, WHAT)
(   1,<2025-01-27 16:19:08.85 +0400>,<she>,<DPX200>,
      <created by zg, POWCHK disabled, PULCHK disabled
       configuration hash MD5:
       00 E9 B6 7A A2 85 ED C7 34 08 36 98 17 FE 4E 26
       data hash MD5: 16K
       ED F7 2C E6 30 37 78 CE D3 AD 48 64 82 58 46 1E>)
$$ ##END=
$$ 
$$ hash MD5
$$ 88 81 BA A1 AA FA AE E3 A8 D7 B1 1E C1 97 B9 99
##$RELAX= 
##$RELAX= 
##$RELAX= 
##$RELAX= 
##$RELAX= 
##$RELAX= 
$$ Bruker specific parameters
$$ --------------------------
##$DU= <F:/spectra>
##$EXPNO= 1
##$NAME= <H-C>
##$PROCNO= 1
##$TYPE= <nmr>
##$USER= <she>
##$AMP= (0..31)
100 100 100 100 100 100 100 100 100 100 100 100 100 100 100 100 100 100 
100 100 100 100 100 100 100 100 100 100 100 100 100 100 
##$AQSEQ= 0
##$AQ_mod= 1
##$AUNM= <au_zg>
##$AUTOPOS= <>
##$BF1= 200.13
##$BF2= 200.13
##$BF3= 200.13
##$BF4= 200.13
##$BF5= 200.13
##$BF6= 200.13
##$BF7= 200.13
##$BF8= 200.13
##$BYTORDA= 1
##$CFDGTYP= 0
##$CFRGTYP= 5
##$CHEMSTR= <none>
##$CNST= (0..31)
1 1 145 1 1 1 1 1 1 1 1 1 1 1 1 1 1 1 1 1 1 1 1 1 1 1 1 1 1 1 1 1 
##$CPDPRG= <>
##$CPDPRG1= <>
##$CPDPRG2= <>
##$CPDPRG3= <>
##$CPDPRG4= <mlev>
##$CPDPRG5= <mlev>
##$CPDPRG6= <mlev>
##$CPDPRG7= <mlev>
##$CPDPRG8= <mlev>
##$CPDPRGB= <>
##$CPDPRGT= <>
##$D= (0..31)
0 0.7 0 0 0 0 0 0 0 0 0 0.03 0 0 0 0 0 0 0 0 0 0 0 0 0 0 0 0 0 0 0 0 
##$DATE= 1737980348
##$DBL= (0..7)
120 120 120 120 120 120 120 120 
##$DBP= (0..7)
150 150 150 150 150 150 150 150 
##$DBP07= 0
##$DBPNAM0= <>
##$DBPNAM1= <>
##$DBPNAM2= <>
##$DBPNAM3= <>
##$DBPNAM4= <>
##$DBPNAM5= <>
##$DBPNAM6= <>
##$DBPNAM7= <>
##$DBPOAL= (0..7)
0.5 0.5 0.5 0.5 0.5 0.5 0.5 0.5 
##$DBPOFFS= (0..7)
0 0 0 0 0 0 0 0 
##$DE= 6
##$DECBNUC= <off>
##$DECIM= 32
##$DECNUC= <off>
##$DECSTAT= 4
##$DIGMOD= 1
##$DIGTYP= 9
##$DL= (0..7)
0 120 120 120 120 120 120 120 
##$DP= (0..7)
150 150 150 150 150 150 150 150 
##$DP07= 0
##$DPNAME0= <>
##$DPNAME1= <>
##$DPNAME2= <>
##$DPNAME3= <>
##$DPNAME4= <>
##$DPNAME5= <>
##$DPNAME6= <>
##$DPNAME7= <>
##$DPOAL= (0..7)
0.5 0.5 0.5 0.5 0.5 0.5 0.5 0.5 
##$DPOFFS= (0..7)
0 0 0 0 0 0 0 0 
##$DQDMODE= 0
##$DR= 18
##$DS= 0
##$DSLIST= <SSSSSSSSSSSSSSS>
##$DSPFIRM= 0
$$ [...]
##$SUBNAM0= <"">
##$SUBNAM1= <"">
##$SUBNAM2= <"">
##$SUBNAM3= <"">
##$SUBNAM4= <"">
##$SUBNAM5= <"">
##$SUBNAM6= <"">
##$SUBNAM7= <"">
##$SUBNAM8= <"">
##$SUBNAM9= <"">
##$SW= 18.0517328524113
##$SWIBOX= (0..15)
0 0 2 0 0 0 0 0 0 0 0 0 0 0 0 0 
##$SW_h= 3612.71676300578
##$TD= 16384
##$TD0= 1
##$TE= 0
##$TE2= 300
##$TE3= 300
##$TEG= 300
##$TL= (0..7)
0 120 120 120 120 120 120 120 
##$TP= (0..7)
150 150 150 150 150 150 150 150 
##$TP07= 0
##$TPNAME0= <>
##$TPNAME1= <>
##$TPNAME2= <>
##$TPNAME3= <>
##$TPNAME4= <>
##$TPNAME5= <>
##$TPNAME6= <>
##$TPNAME7= <>
##$TPOAL= (0..7)
0.5 0.5 0.5 0.5 0.5 0.5 0.5 0.5 
##$TPOFFS= (0..7)
0 0 0 0 0 0 0 0 
##$TUNHIN= 0
##$TUNHOUT= 0
##$TUNXOUT= 0
##$USERA1= <user>
##$USERA2= <user>
##$USERA3= <user>
##$USERA4= <user>
##$USERA5= <user>
##$V9= 5
##$VALIST= <valist>
##$VCLIST= <CCCCCCCCCCCCCCC>
##$VD= 0
##$VDLIST= <DDDDDDDDDDDDDDD>
##$VPLIST= <PPPPPPPPPPPPPPP>
##$VTLIST= <TTTTTTTTTTTTTTT>
##$WBST= 1024
##$WBSW= 4
##$XGAIN= (0..3)
0 0 0 0 
##$XL= 0
##$YL= 0
##$YMAX_a= 159867
##$YMIN_a= -221488
##$ZGOPTNS= <>
##$ZL1= 120
##$ZL2= 120
##$ZL3= 120
##$ZL4= 120
##$ABSF1= 10
##$ABSF2= 0
##$ABSG= 5
##$ABSL= 3
##$ALPHA= 0
##$AQORDER= 0
##$ASSFAC= 0
##$ASSFACI= 0
##$ASSFACX= 0
##$ASSWID= 0
##$AUNMP= <proc_1d>
##$AZFE= 0.1
##$AZFW= 0.1
##$BCFW= 1
##$BC_mod= 2
##$BYTORDP= 1
##$COROFFS= 0
##$CY= -3
##$DATMOD= 1
##$DC= 2
##$DFILT= <>
##$DTYPP= 0
##$F1P= 0
##$F2P= 0
##$FCOR= 0.5
##$FTSIZE= 0
##$FT_mod= 4
##$GAMMA= 1
##$GB= 0.15
##$INTBC= 1
##$INTSCL= 1
##$ISEN= 128
##$LB= 0.25
##$LEV0= 0
##$LPBIN= 0
##$MAXI= 10000
##$MC2= 0
##$MEAN= 0
##$ME_mod= 0
##$MI= 1.114404
##$NCOEF= 0
##$NC_proc= 0
##$NLEV= 6
##$NOISF1= 3.799351
##$NOISF2= 2.8
##$NSP= 1
##$NTH_PI= 0
##$NZP= 0
##$OFFSET= 14.38212
##$PC= 1
##$PHC0= 247.9967
##$PHC1= 10.59223
##$PH_mod= 1
##$PKNL= yes
##$PPARMOD= 0
##$PSCAL= 0
##$PSIGN= 0
##$REVERSE= no
##$SF= 200.129724274929
##$SI= 16384
##$SIGF1= 3
##$SIGF2= 2
##$SINO= 400
##$SIOLD= 16384
##$SREGLST= <1H.CDCl3>
##$SSB= 0
##$STSI= 0
##$STSR= 0
##$SW_p= 3205.1282051282
##$SYMM= 0
##$S_DEV= 0
##$TDeff= 0
##$TDoff= 0
##$TI= <>
##$TILT= no
##$TM1= 0
##$TM2= 0
##$TOPLEV= 0
##$USERP1= <user>
##$USERP2= <user>
##$USERP3= <user>
##$USERP4= <user>
##$USERP5= <user>
##$WDW= 1
##$XDIM= 8192
##$YMAX_p= 0
##$YMIN_p= 0
$$ End of Bruker specific parameters
$$ ---------------------------------
##NTUPLES= NMR FID
##VAR_NAME=  TIME,          FID/REAL,        FID/IMAG
##SYMBOL=    X,             R,               I
##VAR_TYPE=  INDEPENDENT,   DEPENDENT,       DEPENDENT
##VAR_FORM=  AFFN,          ASDF,            ASDF
##VAR_DIM=   8192,          8192,            8192
##UNITS=     SECONDS,       ARBITRARY UNITS, ARBITRARY UNITS
##FACTOR=    0.0002768,     1,               1
##FIRST=     0,             0,               0
##LAST=      2.2672688,     0,               0
##MIN=       0,             -221488,         0
##MAX=       2.2672688,     159867,          0
$$ Real data points
##PAGE= N=1
##DATA TABLE= (X++(R..R)), XYDATA
$$ [...]
1936b73J37l8M7J26J04L04k09k40J54k34J36k31Q1j94K20J21J20J67j62K0k56
1957a00l04O1J87l19N61K74j17m2r3l65l02R4K85K32j93O38n01K22j19k79K2J50
1979hj78K83j98L20l4q0j9J3k08K07k76MR6N51l38J19j00j49j11j76J78r4M82
2002B84k3o8j28J48k14m1j10l6j3J31J71k24L81j11k70J03l02K96j01R9N8K36
2024B66m99K28J14m05J36n4J86K65k60K7K85k38j9j69p1l1J76Q4J64J25j00r1
2046A19J4k60J09j19j12L68k24N59j56j3k9j00k54l9k24N43%k99L24r5j36o1j38
2069b23K50k20J21J83j46K41k96J64o0j59K9J36n3K16j28J8k4J39k96j46pL12
2091E1j54K00J58j0l4P2l05m2Nk9J68k71K70j36J16L2j44j2NK7J92j10k48N60
$$ y = [-273, -136, -174, -127, -1, 103, 407, 198, -42, 112, -122, 14, -217, -136, -330, -110, 11, 131, 298, 136, 156, -100, -404, -343, -156, -475, 86, 360, 243, 201, 108, -257, -559, -465, -180, 52, -141, 497, -4, 218, 99, -180, -158, -8, -186, 97, -101, 219, 185, 105, 86, 99, -109, 98, -178, -174, -78, 473, 135, 254, 154, 5, -106, -282, -104, -198, 284, 261, 193, 65, 213, -1, -42, -152, -188, -201, -70, 101, -123, 258, 147, -123, -20, -322, -26, -127, -28, 30, 266, -233, -5, 109, -296, -160, -214, -28, 237, -23, 4, 289, 51, 32, -137, -208, -239, -63, 21, 185, 310, 210, 119, 133, -127, -18, -137, -249, 119, -105, 454, 298, 285, 256, 156, -98, -137, -361, 182, 182, -117, 207, 112, -24, -85, -223, 27, -193, -72, 111, -35, 206, -90, 74, 14, -145, -116, 20, -33, 183, 55, 73, 49, 188, -108, -254, -261, 51, -103, 97, 255, 245, 211, 283, -22, -64, -59, -88, 80, -191, 79, -57, 59, 91, -53, -65, -60, -33, 159, 49, -199, 361]
2115C61j03j28j64j7j00O6j60J9K31j58L57k09k32J70N6M8k28R2k18N24L2j60
2137G9P5k28l26M40k42J50P8p8K83J16m43K15k10lq7J47J32P0m29M11Q0m1Q5m48
2161a74N6K45k43K61j46J67Lj44k30J90L2n1J07k38K29O4p5R4k57Q8k40K67L8
2184D3R1M1j86J46m29N05k40j46L65l18J96j72K98j16j49m5K48j00k69J2r9K53
2206g1M93l02m7r5j48k6J85J08K7p1M6j78Q9R8j82k4J4K24R1k32N9M1l3J14n3
2231A27j89nK9N6N1J48R5j90p3K19o11L20Np9J1J17J60l86K50j50K54j65p8q8
2255a72L19m0P2j72J23j18j54J0J3q0K03Q4Q6j78k4k22J09k55M73j75J84p9J22
2278A29j34R8j79K22k16j03l6M3L35l1J55k09L6j62K5J0j62K72k69K54M8j28K22
$$ y = [361, 258, 130, -34, -51, -151, -85, -245, -226, 5, -153, 204, -5, -237, -67, -11, 37, -191, -99, -317, 207, 239, 79, 154, -74, -400, 40, -202, -52, 26, -52, 231, 347, -96, 119, -91, -94, -181, -34, 98, 168, -261, 150, 230, 189, 274, -174, -118, 127, -116, 145, -1, 166, 169, 25, -205, -15, 17, -34, 73, -165, 64, 128, 53, 147, -110, -22, -262, 5, 43, 134, 175, -11, 135, -294, 211, -29, -175, 190, -128, 68, -104, 194, 78, -71, -116, 132, 32, -237, -225, -324, -71, 422, 120, 73, -22, -170, -196, -11, 97, 124, 53, 99, -79, 10, 108, -74, -98, -84, 140, 231, -1, 58, 99, 66, 180, 127, -62, -67, -38, 18, 69, 217, 312, 122, 49, 268, -343, -23, -18, -97, -86, 31, 191, -195, 55, -95, 159, -6, -84, -172, 147, 107, 179, 7, 130, 12, -142, -132, -119, -199, 4, 88, 174, -4, -28, -250, -141, -396, 77, -98, 86, 7, 129, -5, 93, -86, 136, -80, -183, -219, -176, 159, 128, 283, 74, 110, -52, -27, -17, -179, 93, -176, 78, 126, -2, 220]
2301B20k16J1j62N10m56K48L8k81J73P5K8k01k84K09j60J02K09j11J16N9k83P1
2323h5J3j52R4Q8J36JL9l61N9J52j7J48m8r4J08Q0k46J51N2K4k40R4k38J97q8
2348a33J3J82j07J70k40Q0j57K7J42%K06k1k26K11l49Q2j63j13M11J36q4k64M96
2371B99j22j44J22l95L28j48Q7P7k57K76j84J9J64m14K11k67M89j57L20k4m7m22
2393a89k3k6J6j59L45M27m71J75J07j37q5r1j33K38J40N2j86L37k86J69k46N3
2415B7p9M0K6J9n4K08j70P7k94O3n1L81k12j48K79j10J70k58K46k30Qj36O4P7
2439e7N1O5l9J06l28kJ11j08L40j92L03l85L55l34j19J84j81J55k37N5K14K01
2461A58k09o1J60j83J76j25K3L71k40Q7K01k18R7j15k06j49L21N5j84K64k25n3
$$ y = [220, 4, 15, -147, 363, -93, 155, 193, -88, 85, 160, 188, -13, -297, -88, -248, -146, 63, -48, 68, 127, -156, -85, -72, -224, -130, -42, 94, 95, 134, -227, -168, -16, -33, 115, 67, -27, 81, 161, -85, 66, 118, 142, -98, -4, -242, -45, -133, -120, 62, -45, 125, -115, -35, -192, -165, -23, -23, 183, 162, -64, 147, -202, -120, -283, -396, 15, 151, 67, -197, 299, 177, 33, 155, -240, 88, -60, 27, 104, -153, 123, -61, -42, 122, -292, -81, -348, 141, -16, 304, 280, 233, -189, -212, -238, -222, -381, -36, 391, -80, 95, 202, 65, -20, -111, -244, -6, 134, 186, 0, 337, 51, 220, -26, 27, -52, -12, 14, 33, -21, 187, 17, 94, -200, -137, -188, 193, -19, -167, 112, 2, 172, -86, 160, -70, -62, -198, -134, -57, -6, 59, 20, 126, -202, -204, -93, -201, 139, -53, 250, -135, 220, -114, -233, -49, -230, -75, -312, -257, -43, 158, -51, -112, 48, -135, 41, -84, -61, 310, 70, 157, 358, 140, 237, 122, -84, -233, 88, 143, -41, 223, -2, -55]
2483e5jJ65nk26J92poK33l42L72k72P9l69J04K80k49J60K4J39J4m62M20j91L3
2507C0J15q2n6K9K22j68k20J41k18O5J38m7r8K27p0J8J82j68N9l92M52k38p4J48
2531eOJ26j34l1j30L09j48j42J4K37j7J49l99j4K74m0k38L6L5J20R2j82L86j67
2555A37m36M28j89J5R3P8j91P2pK92m40M5K80m15K46N3l1J32l8Jj94J48j87N1
2579e7kL00l82J52K03k20P0o9O9l12L02q3M8J69l99M39m34K4J31p6L1Q9O2J7J88
2604B60k25kk4L0j50J99K5k79q1J85J64o3q5P1j53J00K03j91QK14k19j68Q6K47
2628A52k72Pk2J08o6j66L55k24o0J6L7M1J57K82k36j39J7k60O9K24l7O3O2J06
2652B14l77L99j62J95m92j5L01Q6l04j14J68o9L54j63L0q6J18j70l58M39L06j64
$$ y = [-55, -56, 109, 104, -122, 70, 63, 57, 290, -52, 320, 48, 127, -242, -138, 142, -107, 53, 77, 216, 230, -232, 188, -3, 30, 145, 63, 7, 36, 258, 90, -130, 11, -207, -142, -4, -51, -149, 78, 8, 26, 208, 40, 99, -293, 159, -79, -153, -5, 1, 127, -7, -38, -168, 141, -7, -149, -135, 102, 85, 234, -165, -179, 95, 55, -183, -147, -112, 8, 100, -82, 304, 137, -299, 129, -60, -45, 48, 126, -65, 7, 0, 292, -148, -103, 177, -238, 8, 61, 30, 162, 124, 125, -69, 79, -108, -57, -59, 241, -141, 11, 214, -6, 64, -5, 64, -248, 54, -29, 19, 188, -211, 228, -206, -182, -51, -127, -96, -7, 55, 72, 260, 35, 33, 9, 39, -111, 88, 113, -166, -247, -62, 102, 39, -46, 25, -128, -28, 175, -16, -8, 206, -13, -181, -95, 152, -120, -113, -135, -27, -93, -259, 96, -128, -188, -172, -135, -94, 63, 345, 109, -30, -13, -273, -204, 20, -17, 46, 108, 214, -163, 236, 74, 269, -223, -238, 63, 149, -155, -269, -101, -170, 184, 21, 51, -35, 83, -87, -445, -6, 300, 136]
2674A36R1k7n58K88N4o3n6K71M5p3j15J11j02J68o8j03p5J88r6J36j70K37j14
2697A05j81J03j23L3k59K35K06J39l39J8k29L96J1k13N7L8P4K22j83j40M7Q3J24
2720B24n05L13J98k91N5L6j36J6J59j74L70m37K15J29M3J7o2j60K8lJ43k26J80
2743A32j61j32O9J78j95o7rJ73o0j42K83k58Q1L23j84k38K57k41N9J31L9r7M8
2766a1K5j38J75k62M37j37j4N0j07N7J56j82k79K26j71R7N9O5K44l91K64l46K46
2789F3l16J46m0K41j66J68j43O2o8m6Q6Q3J18j24m1Q8l59P4J18L6O5k57L69j61
2813dNj18J10J38j78k46M08j37J44l65J40O6J60m76J97L32j50K35l21j81K54O2
2835G5o0O1O1K6j61K5J4J38k5j21k10K21q6L4R8j18j16J56J35j15j11n2J73j92
$$ y = [136, 227, 200, -358, -70, -16, -79, -135, 136, 181, 108, -7, 104, 2, 170, 102, -1, -76, 112, 16, 152, -18, 219, 105, -76, 27, -96, -63, -322, -87, 119, 258, -81, -63, -292, 104, 115, -98, -41, -3, 71, 293, 110, -30, 17, 100, 224, -281, 32, 230, -61, -6, 30, -106, -90, 69, -105, 265, -172, 43, 172, 215, 232, 170, 10, 38, 35, 178, -48, 132, -29, -161, -92, 86, -109, -176, -185, -12, -72, -214, 69, -189, -108, 215, 31, -207, 50, -191, -132, -1, 38, -59, -11, 14, -124, 51, -211, 226, 89, 75, 125, 18, 75, 231, 49, -230, -4, -175, -78, -19, 46, 290, -101, 163, -183, 63, -253, -107, -147, 94, -72, 96, -47, 15, -53, -99, -13, 70, 188, 64, 23, 111, -248, -174, -56, -20, 45, -212, 157, -4, 1, -117, -7, 131, -47, -293, 115, -22, 122, -243, -103, -37, 123, -353, -156, 176, 26, 261, -60, -241, 13, 75, 15, 76, 137, 163, 2, 27, 41, 179, 154, 33, -177, 44, -42, -8, 90, -28, -144, 12, 147, 32, -79, -131, 42, -150]
2859a50M0J3N17l45j46K43n4K6k27L20l38K67k96J1J4Q8J85l01J14Q6o1Q7J1k72
2883a68K07O2j79q7J54L6J51k28L2N1J44m0j76J97j29k8n9J11k55L42j35j70M78
2906C11k39J06j85j61K4m2Q8k7K29j9n2M0j48L15j81J16m15L27l1P8j95n0P9J33
2930A01k81J87j49O2P7j38J73j19K41j99K01k48J27j15L4L2M8j56L7K33Ok2k24
2953i2L18k29J09o6N7k82K27J49j88j39J37n8L20k96k59J52J26k19K27n7K11J65
2975C13l36L4J13J8n95L29J29q8J33L4l26M74j74j3Qj39q9M1J56J66k61k4J82
2998H5k5q4j55P5j03M35l46P7j91L27j90J54l24J50J19L6J43k93K10k00L3K0J00
3021E3k17L64j71m7J9K23m43J48mJ98j68K3m5P4K45k41k17R6K03k82J43K5N9l00
$$ y = [-150, -110, -97, 420, 75, -71, 172, 118, 144, -83, 237, -101, 166, -130, -119, -105, -17, 168, -133, -19, 67, 6, 93, 104, -168, 39, 101, -78, -165, -11, 25, 176, -52, -20, 31, 175, 135, -41, 156, 27, -1, -60, 51, -204, 138, 3, -167, 311, 72, 178, -7, -168, -144, -186, -98, -125, 104, 85, 33, 73, -75, 240, 59, 175, -240, 87, 56, 134, -61, -111, -32, 101, -180, 7, -142, -80, -3, -141, 32, -87, 154, -45, 156, -92, 35, -80, -46, -14, 34, -122, -85, 148, 154, 132, -92, 226, -3, 106, 40, 97, -185, 42, 191, 3, -136, 1, -57, 263, -33, -292, -140, -14, -233, -6, -63, 148, 313, -23, 11, 124, 142, -453, -124, 5, -83, 50, 84, -242, 232, 58, 45, 53, -86, -175, -134, 22, 188, -73, -97, 85, 60, -24, -179, -104, -207, 228, -118, -41, -232, 95, -95, 59, -265, -115, 4, 40, 183, -110, 100, -100, -67, -47, 53, -164, 200, 29, -18, 1, 224, -219, -71, -75, 123, -45, -22, -67, 7, 252, 11, -206, -110, 93, -189, -46, -21, 38, -262]
3045b62M04o7k80J68K2N6J53q8j66L53m66J09P8oj02J11l7J10M5l10J58j02L76
3068B57k40k26J98J14M2l88J58J6J69m2q6k3j22K7m6K36J74k48J37k5J26k77J14
3091D5j25j0J26k92M47l15J04j61L45k94K93j88r0K46Oj30L4j5p2L0J43k83J21
3114c5o4J22Pk4mJ16n2N0J50m32K56q9M1O3k31J15r7J13J86p5l3l57L55j54N7
3139a6q1j07M17k6n45L27J8J05j61K25l48K82j37J63j96L3J96Pl51L0M37l03K97
3162B66m20P3J14j93lJ44K75j80M9k82J35J7K7lM9j12m2J63j78K47j80j72m6K20
3186c2M2n3k61L34k8k91J90J84k15K10k53Q5J49m36K82J91L5j66j12J83q3K86
3208B41j08j56j91L41kk07O9M83n76k0K05m7K68p2j54k6j36l6L06o1P0j8j69L4
$$ y = [-262, 142, 75, -205, -37, -15, 41, 194, 106, -60, 293, -173, -64, 14, 8, -94, 17, -20, 90, 135, -175, -17, -119, 257, 17, -209, -11, 103, 145, -243, -85, -69, 100, 58, -28, -51, -173, -146, -192, 44, 218, -30, 107, 82, 208, -69, 45, -80, -90, 36, -256, 191, -124, -20, -181, 164, -130, 163, -25, -115, 131, 137, 7, 41, 26, -46, -16, 127, -156, -35, -99, 23, 30, 6, 2, 118, 66, 116, 266, -166, 90, 1, 42, 105, -126, -11, -108, 5, 191, 116, 83, -274, 81, -73, -16, -97, -204, 213, 187, -358, -31, -13, 92, -69, 156, -192, 90, -47, 116, -80, -47, 149, 156, -195, -165, 272, -31, 266, -154, -81, 33, -160, -163, -19, 256, 76, 125, -157, -22, -5, 22, 19, 68, -44, -86, 77, -101, 146, -34, -206, -252, -32, 10, -43, -304, 30, 2, -289, -99, 85, -130, 80, -173, -88, 61, -375, -93, 98, 133, -33, -145, 38, -45, 241, 133, -23, -214, 127, 125, -82, -13, 470, -106, -126, 79, 32, 300, 228, 74, 48, -88, -124, 182, 121, 191, 173, 4, 38]
3232C8j28L36k44M9J5k39O0k8p3K08q7k24L49P1j8k41M52m89L07l29J54O3k50
3255b48L07P7o2q1n6Q8J10j47l1K4L18k75p4L9J4j75J35p1j5R4K25j72j52O3k95
3280c60N47r4l47J96K46j66j09J3K81l30K99k37N7k7K06l72k5K06J76l00Q5J03
3302D8j2k27L22J9R8k62K2J27j91L57k63M5j06j97K06J55j38Rm6q8J39j60J22
3325b1k3l2J43L6j67J49k1j11l4J69k09L56j85k37J91L0o8j26K36J3j71J40n0
3348Hq9m7K22k58J93J78j42q6K1l5M5k06r6K98j34L52K1l62K45j12PJ11k85K71
3372A20k27J56r7K68k59j50N9L2j24N3K18j90J58q4K5m4L90J4o16J3M60k50k02
3395b77K51J03J17j77J57Q8k08j47J6L4q8j24L13k60J23J05m1j24j44J05J95K6
$$ y = [38, -90, 246, 2, 51, 66, -173, -113, -141, -214, -6, -93, -317, 32, 103, 85, -156, 296, -193, 114, -215, -61, 2, -248, 59, 136, 74, -7, -63, 25, 135, -12, -43, -19, 299, 24, -50, -11, 3, -172, -37, -108, -123, -29, 196, 24, -128, -65, -360, 187, 93, -254, -58, 188, 22, -87, -74, 207, -123, 176, -61, -4, -31, 175, -197, -222, -16, 160, -140, -55, 48, 36, -191, 131, 150, 248, -14, 8, 135, -56, 301, 38, 83, -23, -220, -14, 141, 3, 12, -34, -122, 17, -143, -21, -44, -76, 67, 103, -64, 85, 64, -47, -81, 88, -121, 235, 50, -187, 4, 34, -34, -160, 76, 89, -82, 58, 8, -81, -128, 94, -164, 29, 207, 65, -21, 0, -35, 10, -196, -292, 6, -128, 224, 245, -117, 128, 16, 23, 134, -151, 120, -107, 49, -48, 220, -39, -189, -130, -98, -222, -169, 49, -141, 17, -67, -42, -86, 304, 318, -298, -285, 175, -75, -277, -26, 77, 194, 17, 174, 262, 54, -93, -77, -43, -131, -255, 58, -202, -79, 26, -15, -139, -283, -178, 17, 43]
3417D3O6k79j8J15M63o60M91j49J89j04k30R7j78K40q0N4k06K12j95R1O7n5k4
3440e0k68K38j25L28l36J42R8k26P3L49l43J24K6M3K28j01j19m3K72m38L7J02
3462A1j62J46J00L0l9j74R3j81J84lO8r1n1R4j23L48j75k4k18qK41j55m4J4L46
3487B27l48J74j3L87k27k47J36J12km43N42m58j13m0L78J76k8o2j5k1J04j2k9
3510A78k62j09K23l1Pj20o2N5N05k59k36K19j57J91k45Q1j26L0J85l2J83l21l8
3533a41J6K8J54P9m4K10l05p9J33P4j82J14k4l65K02M02m60QJ34j27J98K23m65
3556b17N9L3J7K02L3j38j78J69R2o9J6L4M6m2q3j38K83J71j7l79J33p8N0J90r3
3581I6J3r5r0M4j81K40J48l33J46j53K46L4n2j98K27j37J71k29Q0k3k03Q3j02
$$ y = [43, 109, -170, -188, -73, 390, -270, 221, 72, 261, 157, -73, 24, -154, 86, 6, 60, -146, 66, -129, -38, 29, -26, -50, -318, -80, -205, 123, -213, -71, 27, -199, -126, 223, -120, 4, 30, 73, 301, 200, 81, 38, 310, -128, -91, 11, -151, -5, 95, 125, 86, -88, 5, -176, 8, 5, 73, -18, -69, 25, -98, 250, 75, 51, -167, -175, 66, -89, -133, -119, 227, -121, 53, 40, 427, 200, -47, 89, 201, 199, -244, 298, -160, -273, -313, 65, 241, 213, 151, 136, 115, 219, 207, 178, -84, -193, 30, -1, 6, -114, -176, -121, 384, 125, -111, 108, -49, 142, -103, -22, -148, -118, 67, 35, 218, -103, -141, -125, -97, 57, 136, 92, 302, -3, -82, 51, 125, -57, 57, 33, -332, -130, 272, -188, -180, -46, -173, 25, 248, -217, -158, -125, -108, 94, 127, -11, -189, -20, 72, 3, 19, 53, 99, 57, -26, -164, 119, 290, 273, -106, 27, -51, -1, 189, 96, 109, 14, -76, -32, -213, 27, 175, -158, -12, -165, 81, 115, 63, -135, 92, -45, 126, -103, -23, -46, -249, -166, -268]
3604b68J32K30n51N70k59J45J27n0J67l81J14j49k23P58m62J7Q8P4m03N48k55
3625c1j91M54l37J30K4J48j65k2n4j21k8K64l7l62O91p3j60k06j17K16j89L15
3647A49p5oJ76l84M1L12k33j08N3K47k03j0K5q7K2J16K04k64j22K04Nj34J49j0
3671F7j4j29J75k63J44J62m61K6M49k39j77K76NK36j82k44O5L28k49J46k24K3
3693h0o9M05l02l88L22N5P6j0j20N8J05j10N3kL78l35R8l33P2M3j27N05k63n1
3717b0L15m33j10L28k23Q8K32k26j1J64m6L3%l54o4K06J32j44K01Q7l33Q7L18
3740B27j29Q9k41J73J76l69L1K06k17J24jl8k14J65m8j03M9J04R1J13l57L58k46
3763e7j04K66j42l4J6O6QJ30k04j29L09j65J50q2k15K10q2J03K20l51M9K3j62
$$ y = [-268, -136, 94, -457, 113, -146, -1, 126, 76, 243, -138, -24, -173, -396, 362, -100, -83, 5, 79, -324, 224, -31, -222, 232, -105, 25, 49, 197, 32, 10, -44, -165, -193, 71, 34, -328, 363, 290, 130, -76, -193, 23, -166, 149, 74, 68, 244, -140, -99, 213, -20, -128, -75, 172, -31, -41, -16, -103, -81, 35, 239, -25, -147, 57, 62, -72, 77, 67, 53, -76, 99, -164, -20, 142, -319, -293, 156, -83, -260, 16, 21, 257, 75, -169, -104, 224, -25, 121, -103, -80, -149, 256, -46, -434, -112, -57, 19, 9, -111, -53, 52, -58, -5, -7, 371, 36, 134, -199, -127, -84, -211, 294, 31, -20, 295, -138, -248, 80, -143, -55, 177, -49, -60, 104, 58, 91, 91, -263, -327, -121, 11, -133, 68, 155, -178, -91, 227, 98, 187, -54, 119, 295, -74, -43, 163, -54, 70, 69, 31, -183, -18, -66, -169, -120, -16, 75, 188, -169, 189, -57, -161, 105, -37, -71, -55, 11, 19, 149, -55, -184, 125, -40, 110, 28, -187, 23, -59, 44, 264, -87, -38, -15, -177]
3786a77R8M14j35m68L27M4k5k28j31j3J15J40J43j72k06L55k09N4J79j44J30k13
3808a22K05j95J80q8K5m1J25mM1l99M83m83K43r2L13J6p2j69QN8J74j79q6M6M
3833ik18M21k12Lq6R1M4L6n3K45k55k08P1L99l29J91n3k16O7j9K14k12K13j01
3857B4Q2Oj06J1n7NJ27L7m71J67N33n10N9rK57m9Q5k43K25k41L6L66k42R7M8k65
3883b8P4k63J07r6J1L74m1p1l60K88r0n2L77l78J25K19m84N10r1j97K62j85J61
3906A72k02l3K27m70M02p2O0J01k07r3N9l7k7J3N7R4j18L4o3K66J01j67r1j02
3930i6O1L44k08j19j23j2K53O5L1l00R5n9K33j92J38J4m72K39L81l94Q6M6k93
3953b82J29J04q7L12k69K17m16P54k86J03l28Q0j11m3j1J07M2l9P5j09M1j60J17
$$ y = [-177, -79, 335, 200, -268, 59, 103, 78, -150, -281, -294, -179, -39, 104, -68, -274, 81, -128, -74, 105, -39, 91, -122, 83, -112, 68, -20, 5, -36, 89, 85, 126, -273, 210, -273, -30, -122, 191, 207, 135, -34, -26, 32, 206, 27, -59, -13, -9, -227, 194, -18, -15, -101, -10, 34, 70, 17, 262, 7, -201, -130, 269, -60, 131, 78, -138, -71, -90, 124, -88, 125, 24, 106, 112, 6, 17, -40, -35, 92, 129, -342, -175, 358, -152, -93, -102, 155, 106, 191, -52, 173, -68, -32, 334, 92, 189, 237, -28, 46, -217, -110, -206, -195, 179, 138, 67, -293, -5, -95, -147, 230, -148, -23, 196, -288, 222, 131, -66, 196, 11, 172, -30, -63, 164, -306, 96, 24, 84, 185, -22, -115, -56, -93, -120, -107, -50, 44, -74, -40, -103, 163, 264, 97, 6, -96, -35, 309, 101, -18, -141, -153, 100, 165, 196, -104, -9, -68, 165, -27, 111, 125, -347, -108, 273, -121, -35, 11, -282, -153, -49, -136, 176, -93, 124, -292, 462, 176, 279, -49, 31, -80, -123, -134, -27, 15, -24, 51, -58, -17, -177, -60]
3976f0R7L1j05j55L07j82J15j05K60j82K5Lk4p9KO7R6R1n0k47J64k03K69o4O7
4001A38l51J41K77l32K61j10K25m34pJ87j52L92J48m14j53L88q1q2Om9Q1m06K25
4024a02p5J60P3r6K14k00J22k73J54n6L29O5o19J84J27M6j64L0j47K81j95L31
4046A89o3m07L54j89N61n06J22J85n19K87j81L90mk32K4j25L16q9l06L73k46K69
4068B03l38j4M01r5N5k63J84j47m9P9o6K23j87L9J51k70o8J90j45N3K9%M2qr7
4093i8J63Ol37K36k8M8K2K3K1k49L72k2J84k11q6J48m7k24K57l41j56M04j02j6
4117c3L26l46m8J14l4K7Q5j05J31j31j1J60k75K02K53n27J69N9l60L13o7N8j28
4140a68J96Q4j12J03k0j82q0M72k90J86l34J23J03k2K91k95j57N8J13n4J10j45
$$ y = [-60, 37, 68, -37, -192, 115, -67, 48, -57, 203, 21, 46, 49, 25, -54, -52, 15, 111, 202, 152, -95, 69, -134, 135, 71, 138, -213, -72, 205, -127, 134, 24, 249, -185, -192, -5, -157, 235, 383, -31, -184, 204, 123, 41, 47, -2, 79, -327, -102, -177, -17, 56, -40, 174, -26, 96, -177, -23, -79, 250, 315, -304, -120, 7, 53, -111, -81, -228, 53, -142, 189, 126, -281, 73, -116, 445, -61, 61, 246, -273, 14, -167, 223, 219, -13, 11, -114, 202, 113, -193, 180, -66, 203, -135, -149, 252, 157, 212, -51, 133, -14, -63, 16, -50, 173, -14, 25, 176, -94, -162, 28, -117, -64, -35, -35, 7, -1, -98, 65, 71, -266, -30, -58, -10, 12, 35, 56, -193, 179, 157, 341, 130, 44, 192, 145, -79, 178, -163, -319, 85, -17, -33, 293, -53, -101, 13, -21, 6, 91, -14, 117, -14, -25, 135, -140, 62, 315, -212, -43, 16, -344, -31, -98, -40, -168, 28, 112, 0, 103, 83, -99, -179, 293, 3, 189, -145, -22, 81, 59, 350, 55, -102, -44, 69, 15, 125, -20]
4162b0J11j9j0Q9k86k1J36kj0L0j94K70N7k62K08j31oN0M8N8L1k45NoJ95l47%
4189b71K07J21L9q7j27J9J34J35q7k0j5J53j45k74J49Q9k9J23n9J87k35N4M9j76
4213f6m2nP0P7j20kL3J4l53L75p7J42k15O1L6p7J3J5K83k55kk0O2N0M80k13l23
4240e9K99o18M44r1L1K6j18M38l64J99l76J06K13l22J74J17o2K94j56k31J92l10
4262a74L7Q0J34l06K43m00O20j62K60k23L5J31o19L85L10j95j53r5K17k07o3K7
4284a18K6K34j68K94n11J66N2o5K0K6R2J43l02R0p3K04K0j77J61l65K76k50K12
4307a3K57j43l35L69p5K1o6J85r2k86j0L28k64J29j26J38J86l48j14K58k85L03
4329A7q7J84j40L4K37l62J42Q5l63L86k84j45O92j51j36r3m9J03J07m83L83k8
$$ y = [-20, 91, 72, 62, 151, -135, -156, -20, -22, -32, -2, -196, 74, 131, -131, 77, -54, -60, -10, 38, 96, 127, -118, -113, -119, 76, -271, -271, -64, 57, 96, 9, -118, -99, 35, 170, 83, 63, 48, 201, 56, -218, -69, 20, -9, 114, 55, 242, 7, 61, 110, -66, -108, -113, -43, 34, -86, -88, -55, -41, -394, -19, -96, 46, -169, -108, -72, -149, -136, -121, 162, -93, -95, -115, -53, -3, 477, 264, -59, 240, -378, 66, -25, 6, 32, -86, 352, -12, 187, -189, -83, 130, -192, -18, 99, 37, 331, 175, -56, 136, -174, -137, -57, 77, -229, 14, -386, 234, 72, 332, 109, 144, 275, -344, 41, 351, 156, 3, -92, 125, -82, -145, -118, -92, 142, -26, 268, -243, -77, -25, -90, -70, -44, 48, 191, -111, -21, -94, 110, 130, -47, 114, -251, 25, -225, -13, 244, 101, -234, 135, 60, 81, 15, 200, 108, -178, -188, 140, -124, 5, -121, 17, 203, -145, -259, -1, -286, 17, -70, 114, -26, 8, 245, -117, 25, 110, -253, 133, -151, -296, 396, 245, 109, 16, -33, 70, 177, -306, 77, 49]
4351D9J20j64K0q1M3j4P9m6r3J89P1O0l8k68R7k15J20O8J11J4k97K58K32l91K32
4376A56p4k5j36K10k88J51k6N5l18L54m3Q3N7m5j74K27m9P3J7l72J76L8Q2l14
4400a85K29r5j39M4L4n3K94m80M33L0n16K87O5k04K11j21K22J72j71q2J2m0J36
4423H3j24lJ94j40o7j6mN6JK37j79j06J53J37l25J61k49J45L8P5m7j93J49o5J08
4448A9M4J93n00J30K05k45M25j62l3k85J40J50J03m7N7k58J07J45l02K49j21R9
4470A13j63j14L3J22j37J64k02K15j22L18l16j3j3J4L8J68n0j58L24j34L4j67
4492d6K34m71J00K27o2k02p9L23L65l87Rk05J29M3J94k47j83K05L08l65J5N71
4514D76m39J30j20K35j77j67qJ79k23O3j55K46j78M8J55l4Pm1J1J98j78k18K16
$$ y = [49, 169, 5, 25, -56, -13, -27, 52, 6, -87, 102, 173, 233, 195, -73, 24, -191, -71, -3, 108, 122, -175, 83, 315, -76, 156, 82, 57, -79, 131, -157, -6, -32, 23, -295, 59, 16, 99, 156, 111, -63, 164, 115, 188, 205, -167, 9, 47, 129, -185, 44, -51, -190, -146, -112, -165, 129, -351, 82, 112, -404, -117, -52, -256, -45, -166, 56, 228, 57, -25, -13, -53, 83, -41, -44, 150, 10, -57, -73, -77, -21, -20, 217, 38, -68, 85, 222, -103, 58, -191, -46, -8, 67, 20, -173, -24, -89, 19, 63, 256, -244, -114, 91, -154, 271, 109, 76, -209, -69, 81, 184, 137, 194, -64, 43, 188, -114, 135, 14, 113, -50, -164, -131, -9, -146, 18, -184, 31, -91, 227, -89, -102, -115, -101, -63, 105, 55, -103, 221, 87, 121, -46, 188, -283, -183, 44, -18, -220, -299, 24, 389, 2, 11, -194, -65, -22, 172, -75, -258, -53, 255, -110, -95, 476, 37, 167, 47, 282, 105, -62, -70, 109, -114, -51, -206, 40, -138, -90, 65, 31, 38, -3, 8, 206, 28, -190, 26]
4537B6o0k3N0o0j21K00pJ86j53R0k55J16j69L44j12L2l12J48L59l26R9j12k4J50
4561F6o7o0J52j57M2K20k25K7k15L01kr2K25j39m7j36K66j86M3j17L08l5j68r2
4585h8M3j5k45J49K17q7o4O0M9m9k8J10nk82J27PN9J4K62l54K90j1k30J5q6j16
4611b58L19j92K75L6j5k59K29j79P6P9k45J39J49qj42J17k25k3P8l4K64p9l05
4634b03L48l40K32J21j17k04R3O2k3J56j59j11m6M83m42m4L33l69M12M3q9o3k26
4657a53K82m31K95Nj09J35j24J12L7K48l58K94j09n9m09K49O3Q1j87L57j84j2
4679B3n5j29KK80l6k19J56j23R3J9J83k01Q6k01J11J35l21N72l83m5J40j15N2
4702B4k6l7J66j21j45K15K3p3j56K55j51J39k98K82l23M73o25M41J09k24n8P6
$$ y = [26, -34, -57, -7, -67, -188, 12, 5, 191, 38, 128, -127, -11, -180, 164, 52, 84, -228, -80, 279, -47, 52, -60, -84, 66, -1, -61, 91, -66, -24, 196, -29, -2, -217, 84, 82, -10, 215, 76, 29, -107, 159, -27, 16, -101, 207, 172, 4, -88, -45, -60, -305, -156, 61, -26, -90, -30, 19, -30, -58, 52, 47, -235, -108, -101, -42, -28, 234, -120, 170, 159, -71, -56, -142, -258, 61, -131, 144, 180, 165, -94, 135, -44, 32, 111, -134, 5, 154, 146, 4, 121, -104, -127, -49, -83, 181, 102, -203, 145, -195, 37, 158, 41, -163, -70, -8, -31, 125, -34, -145, -191, 292, -150, -194, 139, -230, 182, 225, 136, 73, -153, 129, -302, -7, -2, -111, 24, -100, 12, 49, 297, -61, 233, 124, 65, -344, -95, -32, 49, -138, 219, 35, 23, -32, -161, -159, 121, 85, -134, 22, -101, -8, 11, 194, -7, 79, -122, -11, 124, -197, 375, -8, -53, 87, -28, 24, -2, -39, 127, 6, -139, 76, 99, 26, -130, 125, -26, 113, -185, 97, -226, 247, -378, 63, 172, -52, -110, -34]
4724c4k9K62j15j19nk68L63K5j15n5K15j42k30M18k16J1q9K2J58P1J6j35J85j18
4748G6j91J40O1N5k53J48n4K81l89L53l24L7J06j03q6L66o9R5j67j59O8M1R5p2
4772E5l6j90K39l44J64K96k73k49L31p3o2K47k20J34Q9q0J39j14J10l86J10K37
4794A24j02n3K1O8o5L2k66L29N1l01L45r8k69K95j87L0L13j97J95j19k7k01KJ39
4818E9q0P7k33K82R8j75L51l41j6M9k52M94n27m1L86p2k62O5O9M5P5O2j84Jj76
4843b46K00K68j18j23%R1Mn30N40m1m8R2j82K0jL04jk61Q0q8K45k30M1k15K30
4868C1J12j99qn1N3l5K96m83J37Q6M3k04L70k01L95k73o9J71j63k22K37L9P9k68
4892a27L6jl0L63l95L00j01j06j81L59k1k71KM90k01l54K10j92J85P5jj39K53
$$ y = [-34, -63, 199, 84, -35, -40, -308, 55, 80, -35, -90, 125, -17, -247, 171, -45, -34, -123, -101, 57, 128, 144, 9, 194, 76, -115, 25, 86, 141, -112, 36, -18, 263, -126, 227, -97, -60, 46, -57, -143, 223, 154, 249, 82, -77, -9, 32, 127, 55, 19, -171, 68, -276, -112, 184, -89, -338, -7, -80, -142, 105, -115, 19, 108, 28, 167, 53, 163, -223, -113, 124, 22, -31, -10, 58, -7, 25, -241, 88, 139, -162, 183, 85, -184, 111, -76, -46, 267, 70, 265, 146, 119, -82, -80, 59, -21, 56, -177, 105, 203, 28, 379, 38, 22, 71, -181, 313, -214, -255, 131, 59, -203, -138, -69, -24, 51, 113, -71, -70, -246, -46, 222, 104, -19, -19, 72, 76, -454, 86, 45, -3, 89, -93, -73, -74, 230, 229, -32, 48, -40, 205, -25, 16, -199, 31, 143, -56, -64, -115, -62, -97, 199, -284, -147, -61, -18, -222, 148, -53, 342, 69, 0, 171, 8, -214, 23, 62, 141, -127, -91, -92, -122, 241, -154, 146, 45, -61, -242, 117, 96, -175, -173, 317, 116, -238, -28, -220, -35, 40, 39, -100, 153]
4915A53j49k63m9M01r0J39l05lp5M75l55K37m07K33M68n20L68k63L93m91J50N2
4937I9j56M2K00J91k11p7j99K02l54J81o7K06p0N9m9n7n2M7J50N3l24J64o4J82
4961I6M5k9k72jJ9L52R3l30K03j02N1j35j97J87j55K93l35J91j34L70j22j15K08
4984A81k28J1k02J29J46j8K2o0J47J19n2m11L99P3k10j73J10j1p4J7R6Q6j59J
5008f1k3n1K62R1k80K8R8k47K73j21J67l18P6l01L75j4J0J45k36K08j05m0l2L04
5032B08K14n21k20J5K54Q6r6k74M94k43M9q2J25R2j86J81j01J33j59J28j48P3
5054B2j26M2j95K22L9j7M3L07l62j3L7m6K29k65J02J35k83o4L65k06k25L43k08
5077a24K55m15J87l7K0J64n0j97N0J74k98K72k3l19L09RQ5k98M04j88l3R3Q9q4
$$ y = [153, 4, -259, -308, 93, 3, 142, -163, -166, -241, 234, -121, 116, -291, -58, 410, -110, 258, -5, 388, -103, 47, 99, -57, -15, 185, 376, 165, 88, -111, 91, -263, -82, -149, 57, -13, 46, -3, -60, -112, -65, 85, 138, -186, -22, -86, 96, 141, 112, -160, -161, -142, 210, 303, -27, 176, 74, 125, -10, -207, -20, -175, 118, -217, -26, -160, 210, 88, -27, 181, -47, -36, -238, -109, 37, 19, 41, -19, 128, 247, 195, -216, 183, 256, 46, -127, -17, -28, -102, -85, 11, 97, -62, -61, -84, -135, 127, 218, -62, -34, 64, -183, 90, -31, 136, -182, -106, -407, -32, -46, -36, 109, -127, 81, -24, -64, -96, 208, 422, -99, -319, -304, -50, 36, -60, -334, 160, -83, -34, -116, 9, 101, -85, 96, -5, 128, -31, 97, -51, 22, -104, -62, -257, -35, 4, -13, 30, 337, -25, -38, -1, -47, 182, -83, 19, 154, -129, -193, 172, -34, -259, 84, -124, 131, -284, -97, -134, -114, 50, 0, -197, -147, 27, -271, 1, -22, -341, -32, -23, 62, -236, 168, -20, -53, 40, 129, 45]
5101D5M3K2j85r7J94K1l5j20L55j01k72J95J73k92q0K29j34J09N3m5L4J91k15
5124H8k59O8K78J32k59k42M71k39j53J16L9n1J30l20K38l76L25Q4o0J27o3k16
5146a42P1r7J65j80P0L18k01R3L8k50J72l16J80q9P9J47J45k12m1O5J03Kl52M70
5170B38l26Q0M2m9M1J2K91o49M48J30j49j29QK17k57m6P1Q7j02J40j76N9K22j98
5194EQJ81r0q9j44K12q9L4r7J13Q5k33R9Q5k07L4J47J0j92J56o8K09k41j2J8R0
5220B4N6J51m97J09J68m7K70l21J51o6K4J01k82J59j40K16j97j1O7J22k03N3p1
5243a64J7J24J74n0M9k87N13l54j9J3K05k00p6J85j41R8j15o5KRK18j40q8J92
5267A00n2L5k02rK58j40P8j05k0N1O8M9l32M49k8k07J79j89K03k74P0J31r3j53
$$ y = [45, 88, 110, -75, -172, 22, 43, 8, -112, 243, 142, -130, 65, 238, -54, -134, 95, -39, 70, 123, 78, 112, 303, 88, -171, -103, 175, 307, 48, -194, 277, 38, -115, 1, 40, -11, 119, -201, 37, -339, -14, 70, 10, 137, 74, -142, -71, -168, -3, -183, -113, 205, 4, 97, 135, -115, 57, -259, -79, -168, -89, 58, 203, -9, -50, 15, 118, 120, -232, 238, -88, -8, 34, -15, 26, 38, 329, -320, 128, 258, 109, -20, -12, 205, -52, -98, -27, 60, -42, 98, -78, -19, 203, 5, 13, 194, 104, 15, -129, 83, -6, 28, -69, 44, 129, -104, -5, 80, -127, -93, 54, 64, -128, 28, -40, 169, -72, -84, -66, 24, 80, 231, -266, -157, 11, -36, 234, -87, 64, -2, 22, 123, -159, 0, -140, 76, -121, -132, -65, 57, -146, -93, -164, -147, -23, 151, 101, 150, -137, 376, 22, 3, 16, 221, 21, -55, 130, -11, 87, -28, -93, -91, -82, 136, -4, -92, 100, 48, 83, -119, -128, 130, -10, 68, -37, -57, -6, 62, 111, -221, 228, 200, -7, 172, -17, 186, -88, -18, 113, 20, -133]
5291a33J20j81N6K28Q3L8k83KL68k04m9J1J12l20J17j82K49mk01J70k6Q5k3O7
5315A00l8m03K54K0LJ38j31K66k05J70j6k25L9Q5M0o9M4j39N7j40K21K25k84J22
5339A34k01P1l4N4R6k93Q7L00o2k71K16k15K41o8k5j03J09j6J61Jk01O9k15L39
5363A74j3j10K18k87k87L14j4q8Q8J04j38n8j97L31j05J64l48K35K6l7m7p6L67
5386B16oj45l1J73j96K19k62r4J06J7rj05J25k01K98j26K62j67K48l47j9N7j25
5409a12K30l23L62l7m8j09n4LN5j52K77R6j38Mk6L9J53k17q6ln6K87l13J68Q8
5434H8N5q1j58J00J85L3k48q4o7L43r2K19k94k44qL46l9k04J68J16m8K74l89k72
5458c01M69j14k29K72J22k78p0J76j8j26J8K0j1j32J86k72J77l0j5J31j86M54
$$ y = [-133, -13, -194, -138, 90, 173, 211, -72, -70, 298, 94, 45, 56, 168, -152, -35, -217, 32, 28, -173, -3, -29, 56, 33, 100, 62, -341, -87, -67, -64, 74, -57, 209, 4, 174, 158, -67, -28, 57, 97, 28, 72, -67, -10, -150, 71, 296, 12, 134, -67, 4, -30, 24, 120, -173, -86, 214, 152, -119, 97, -118, 123, 55, 30, -73, 36, 20, 181, 182, -19, 50, -165, 174, 161, 51, 269, -18, -305, 9, -5, -93, -5, 99, -39, -97, -294, 37, -68, 96, -252, -17, 9, -28, -75, -151, 216, 210, 65, 34, 207, 11, 230, -32, -126, -20, -3, -12, -117, 8, -193, 105, -21, 241, 74, 322, -25, -44, 13, -112, 118, -205, 157, 120, 72, -37, -91, -88, -33, -185, 92, 188, 50, 54, 28, 67, 220, 3, -83, -86, -142, 145, -168, 0, 88, 143, 62, -96, 4, 189, 222, -26, -110, -177, 166, 74, 293, -1, -245, -253, 93, 54, -150, 18, 134, 86, 360, -29, -301, 168, 54, -175, 97, 219, -59, -129, 47, 29, -97, -79, -59, -70, -202, -16, -288, -111, -141, -156, -25, -211, 243]
5480B43k92j20L58k19o5J97j25j15J45K48l02K61j01p6j21K79k85n1K71j47j39
5501a56J49q5J34P7l67J91K15j09j49pK15j60J64m12J46j2J68o0m9o5O2K45j37
5524bJ71l13K56l6q6J00j26K40j79j78J35J51o7P7O2l13r4J6K1K62j86M1k7j8
5548i3O7Q2Q6j08L13n00J66O6J43j48k45l6M43m0l32K66o5L48m06l08J97kj64
5571b70M11k32j10O9j29L39J57k73K52l40J36j67K10j36J64r4m5r3J22N8J00L
5593A32q0l7j25K80m32J41K54j62J92k95o9M2l4J97J74j13p5k01J08L54j97P7
5615A31K5m33K70J09p3R0l64M10j05K3J96k64r6L8j07L48j48J32J3k70O2J21j32
5638b4J11q9o5p7L17k54J81j93p4L73m49Q3J75pM7p5O6J45q2%Lj24K55k24o4o2
$$ y = [243, -49, -169, 189, -30, -95, 102, -23, -138, 7, 255, -47, 214, 113, 37, -84, 195, -90, -141, 130, -17, -156, -7, -92, 42, 119, -248, -57, 158, 49, -100, -107, 108, -52, 112, -300, -154, -166, 2, -58, -107, -172, -110, 135, -2, 169, -144, 112, 76, -10, 90, -36, 204, 25, -153, -18, 133, 66, 143, 205, -108, -202, -186, -165, 97, -89, -48, -75, -93, -26, 56, 142, 34, 347, -153, 13, 79, 222, 74, -171, -207, 236, 196, -136, 130, 65, 413, 7, -301, -104, -106, -270, 141, -91, -201, -132, -261, 78, 235, -38, 214, -126, 10, -157, 53, -83, 81, -13, -58, -151, -29, 29, 129, 132, 52, 15, -110, 170, -262, -121, 133, -29, 163, -132, -201, -159, -193, 4, 178, 65, -10, -211, -103, 251, 54, 131, 156, -277, -7, 102, 29, 119, -245, 165, 60, 83, 279, 15, -81, -43, -150, 198, 50, 182, 195, -75, -13, 108, -24, 87, -2, -67, -144, 173, -81, 100, -93, -167, 206, -243, -160, 15, 8, 55, -20, 46, 191, 109, 109, 112, -12, 243, 19, -45, -107]
5664a07L37j67J77j21j99K1O6J36j79K00j62J64l83J44p0K9m6K50j6j57K69k64
5686g8l3M77k07l08M9J5J50m8J49j68J9o7J80k9k35K16l30K01J00j29L5PR4l97
5710c37K37J33k0p8r0J86j82K46l69M01j48M5K1k06N25n14K46k78M32n9M4o9m1
5733A25k19J3l0J99Lk51J70L2K11l72K07r8R3O6j94N7p3j81J24M28l34R7k34K33
5757G2Rq4p1qN8M9J89k20mO4J33r5n9j51M43l69m3K5J76o8j25N8J00r2J31k05
5783h7K7J25p0J96k19K3J06j40J43k00R8n8J46r3K33m51J69O4K78k09r7J04j90
5806a02N3k4K11j71Qkk18L93m3Rm0p7N3k9j25J61k68K49j68k26L08L83m61lK92
5831A63m12M12k86L24k48J44m5Kk86K10J43j81k4p2K72K0q0nL5k57J3K10p8l0
$$ y = [-107, 230, 63, 240, 119, -80, -59, 7, 143, -36, 164, 2, 166, -217, -73, -143, -114, -160, 90, 74, -83, 186, -78, -111, 366, 159, -149, -100, -85, 65, 17, 166, -2, 17, -50, 130, 101, -134, 82, -248, -47, 53, -76, -41, -34, 60, -337, -100, 33, 13, -65, -155, 31, -151, 95, -274, 127, -21, 24, 45, -161, 364, -150, 96, -182, 250, 191, 235, 166, 125, -94, -81, -111, 88, 91, -160, 10, 42, 253, -119, 88, -10, 83, 149, -45, 12, -61, -242, -118, 310, -24, 73, -161, 72, 81, -3, -74, -82, -24, 25, 214, -6, -10, 54, 187, 92, 33, -118, 325, -44, -87, -62, 114, 46, -79, -21, 79, -13, 118, -87, -60, 65, -5, 191, -28, -5, 101, -39, 104, -96, 2, -56, 90, -3, 230, -221, -52, 12, 290, 81, -16, 88, -102, -49, -73, 138, -33, -25, -27, -245, 148, 105, 114, 74, -3, 50, 21, -104, 57, -211, 38, -130, -356, -48, 335, -126, -129, 163, -249, 163, -123, 201, -47, 97, 52, 54, -232, -22, 121, -60, -84, -156, 116, 136, 56, 51, 86, -171, -158, 52, -26, -56]
5855e6j1J06RM9k8qj64L86l51R1j86N19l09M7L07n59L00r7m4Q3j14m9j22n0L44
5880I3l4k3l42M45j04p1j39K41J18j58J45r5r1K78j02Q9j11j32K7N6O6m12K64
5903HNJ9j67R1kK75j37k17K53J26K3n46K22K92k72j65M04q6j14o9K36k76k02L98
5927I9l99M29j02j04K09J7k17J0J0J31N5j66J88J3j74p1M4K63l53K14j59L1k7
5950e9l6K6rj82J84K95o7j92q4K84j06j91qQ4j32J95l43J34K57Q8l08J19O2nJ34
5975A40j6j38L7k22J84r7K55k77J4K03l5J01k61J99p1k64J20j3R9j5q8L50k74
5998f9O1j43J07j18P0J77j50R0Klj09K97n35L98l12K99J83k20j36M01j66m06K03
6021g9K24j28j09J90k04NL03j23J98l05n0p9K24j8r5K11j07O4k05K30j11j87J58
$$ y = [-56, -67, 39, 48, 97, 69, 61, -103, 283, -68, 23, -163, 356, 47, 94, 401, -158, 142, 45, 1, 84, -30, -79, -201, -251, 93, 59, 36, -306, 139, 35, -36, -175, 66, 184, 26, 171, 76, -15, 263, 161, 250, 139, 7, 34, 90, 156, -256, 8, 13, 32, -135, -44, -46, 229, 92, -125, 128, 254, 277, -269, -47, 245, -27, -192, 212, 126, 12, -57, 179, -97, -299, 99, -300, 129, 27, -77, 132, 149, -68, -58, -48, 83, 138, -28, 160, 173, -1, -72, -28, 235, -118, 96, -63, -32, -59, -95, -69, -78, -260, -76, 219, 152, -40, -124, 160, 54, -137, -145, -61, -193, 2, -341, -207, 50, 138, -170, -51, 11, 6, 140, 124, -14, 23, -199, -15, -112, 143, -134, -120, 83, 48, 149, -112, 87, 16, -248, -128, -141, -42, -57, -145, 205, -69, -8, -151, -44, -162, -92, 85, -65, 25, 27, 24, -85, 212, -323, 75, -237, 62, 245, 25, -111, 290, 124, -282, -79, 145, 17, -92, 98, -106, -101, 202, 79, 277, -28, -78, -157, 67, 49, -46, 165, 58, 122, -83, 147, 36, -151, 7]
6044GJ3J47k98p9J90m3P9J16r5J01q0l52K20n0J47l25J92M21l98J92j25Jo4j25
6068b08J29K1j89L56%p4j00K39j57L07J3j61l92K79Kj21m8O3j32J32Q4m8N6M9
6092A00J39j82j55k9J33j2r5p9L23j17Q1k8K43m78K71l21K06L6j41J36K22m04
6114a51K42Rnj75k08L59R6l13RJ20m2L1J82l00lj34K83K5k12J64J73k01N8O3q8
6139a8J58j50J86j63J97l41l5K09j47J79k4O2p0o0j17K12j25p8N5o4K47k02k3
6162a12K56j56j95K73k55K22J63j74l9R3k44J13K09l09J92j67J34K6J40j1l18
6183a59N5l01M78j34K45k60K05J2j35n2j38np1K49J89k33K49j07j28J64k67k2
6205a66M27k63m3Q6J82j88j15R0j39K04j78n6J24K93J0l02l5J5P3K91m78j7M1
$$ y = [7, 20, 167, -131, -210, -20, -63, 16, 132, 37, 138, 58, -294, -74, -124, 23, -302, -110, 311, -87, 105, -20, -19, -83, -208, -79, -58, -247, 109, 109, 35, -65, 174, 17, 324, 337, 176, -216, 63, 65, -56, -104, -41, -173, -41, 43, -5, 51, 100, 239, 57, -98, -127, 6, -6, -101, -180, 143, 26, 107, 79, 322, -156, 115, -206, 0, 36, -105, 31, 253, -151, 91, 100, 95, -80, -288, 71, 167, -146, -137, -17, -59, -28, 154, -146, -149, -283, 0, 25, -187, -23, 150, -51, 7, 70, -18, 140, -10, 176, 13, 210, -131, -166, 43, -104, 75, 51, 113, 43, -17, -134, 78, -47, -125, -70, -134, 113, -89, -112, 144, -12, -207, 66, -189, 33, 196, 22, -17, 76, -168, -55, 154, -155, 37, -130, 4, 30, 170, 159, -159, -104, -405, 73, -61, 184, -76, 129, 141, 6, -46, -184, -189, -260, -11, 178, -55, 194, 87, -41, 123, -144, -166, 261, -2, -45, 41, 223, 35, -80, 10, -129, 75, -103, -159, -35, 258, 268, -34, -69, -54, 19, 310, -168, -185, -144]
6228a44J99k26J83K1r2J00p8pj71L25o1O6l6R9k06q1L0K45k54Mj77J53J60qQ6
6253A30l9j30l3j19K70k69J50N2o6J72m93L38J67j70K48r7l40N5J60k40J73j90
6275b71N60l95K58m23L38k46J95m0O5KJ75k60r1K93J97n34K45J49q3j02N2l95
6297c11K56K17k51j53N2R1J43j14L5O4n7j50J03q4J25m8j04L24k09J57l46K78
6319A8R7Q8j35O7j10j93L8J91l30M2L04J03l41K76k47M52k37j24O4l9l6O1J54
6342A63j66j47J46K7k02j63K76j54J06J29q2J15n6r2K0p4J26lP3J01j23K5P9m2
6366H2j48J32J59l27lK21k25j28J72J96k37L51k42K32m20M0M5j19P8K46k44J73
6388C4N8j3j06k33M18M0k81oo2J50pj98J30j63M10l65K49j39J89K0k40r6J95k12
$$ y = [-144, 55, -171, 12, 33, -59, 41, -37, -44, -215, 110, 49, 115, 79, 178, -28, -109, -79, 166, -88, -84, -261, -108, 52, 44, 130, 91, -39, -72, -191, 79, -190, -40, 12, -54, 118, -375, -37, 130, -40, 208, 111, -229, -174, -14, -254, -81, -271, 289, -106, 152, -271, 67, -179, 16, -24, 41, 43, 218, -42, -133, 160, 357, -177, 68, 217, 134, 32, 84, -311, -55, 162, -89, -242, -190, -99, 44, -70, -35, 29, -28, -178, -75, -159, -34, -82, -186, 138, -71, 86, -260, 18, 115, 203, 68, 135, 25, -168, -130, 61, -269, -227, 77, 180, -161, 115, -132, 320, 83, -41, 23, -16, -52, 9, 163, -3, -150, -4, 23, -179, -342, -66, -220, -114, 15, -67, 48, -8, -100, -80, -154, -28, -31, 42, 143, 20, 45, 124, 82, -66, 66, 225, -102, -105, 116, -109, -237, -65, 131, -106, 245, 3, 235, -185, -145, -100, -219, -141, 105, -139, 34, 92, 79, -27, -260, 158, 198, -83, -89, -151, -1, -8, -206, -76, -239, 171, -194, 55, -84, 105, 125, -115, -211, -16, -228]
6412b28J45J91k47J54j47J8J30R4k28K06k8J54m56K46j57lJ02k8K23O9q7M0l29
6435a66J77N3JK91n15M11k8m29M55Oj55J60k82M4j82K4J40j64K88l80J23J2K16
6458A00O8m09M08k43r9K88k91J69L4k22J12J55l07P0J53j93L18Q5j27k21K54k08
6480a06J37N8J05p6p8l09N07l19Q7J02k25J3J61j21K24J48j63J08j97L09m31Q8
6502B2p0J23k74K29p8L05k64m4K65l14J52P8k92L34r6k91K34k69K47j03L48l95
6524a53J23N9k6k9k24M45k55M5Q0k35L08p6j06k16k3M5L27k31Q3K25k54J96k08
6547a00j35J74M1J82k26J08l3R9j25J8R0l13Q4P9P1k9K7O6J93j81l6j46O2j50
6571a80N5K65o4jk5j01n2k93L00L9P5j84L02k32J75j37K07k3j16J15k43J60k4
$$ y = [-228, -83, 108, -139, 15, -132, -114, 16, 110, -118, 88, 60, 214, -242, 4, -153, -156, -54, -82, 141, 210, 123, 163, -166, 11, 64, 65, 356, -159, 252, 224, -205, 250, 256, 101, 261, -21, 23, -159, -135, 5, -159, 129, -251, -128, -116, 100, 168, -241, 167, -76, -175, 113, -178, -9, 25, -197, -85, 70, -237, -167, -14, -207, 111, 196, 69, -152, 102, -106, 31, 89, 194, 118, 40, -269, 238, -81, 6, 108, -117, -104, 57, -64, 160, 308, 145, 253, 56, 365, -66, 22, -48, 75, -199, 30, -48, 257, -7, -51, 214, -100, 52, 130, -162, 172, 76, -215, 19, -250, -3, -106, 242, -153, -30, 29, 3, -26, -250, 195, -60, -15, 65, -170, 138, 62, -44, -260, -283, -238, 89, -142, -59, 166, -88, 108, -100, -235, -61, -20, 162, -64, 44, 11, 110, -15, 3, 93, -220, -136, -57, 14, -15, 12, 78, 271, 90, 54, -92, -30, -180, -125, 140, 76, 75, 50, -51, -103, -396, -96, -57, 18, -166, 136, -96, 79, -58, 149, 126, 10, 125, -118, 42, 18]
6594A8q9K11k30J38j75J11rN3P0j41K70j16o3J63j18o8j10R1J02m8K5j50K19k25
6618g1J03j20K5k8m2L01k58L17j79qj68J75L7m2K04l52J16N7j23J10Lj16J4K05
6642A60o5k05R1Rk12J98J05k32J38R6k69N11k09nO7m59K83P2j61J62q9R8l15K83
6666E2l09K01K12j21r2P1L0L36l76o0J84j44J64j13N9o9k95K20j54J15J10l0K5
6689A6j95J30k4J26p0P6M8j82N16n26J74n2R3n92L25J84J7k36O5J37p6K08j90
6712b8K21q1l00L44p6j59Q1n0k22J60P8%j34K71j77k2J29J6oR6k40K97j76R5K8
6737A45k12J98J22j91J2l92K46K76k03kK02k21J20J6l17N0J84r3N9k51K24J63
6759A35k02j76K8Q4J39j14j73J98P3K07l38J53q2j13J03j07K29m0PJ64k13nJ45
$$ y = [18, -71, 140, -90, 48, -127, -16, -25, 28, 98, -43, 227, 111, 48, 211, 93, 25, -85, 6, 108, 60, 85, -65, 154, -71, 32, -88, -63, -91, -133, 168, -90, 227, 48, 40, -128, 47, 84, 42, 246, -106, 10, 67, -56, 54, 57, -59, -45, 160, 95, -110, -19, -10, -222, -24, 81, -151, -13, 83, -186, 325, 116, 111, 178, -281, 2, 74, -87, 75, -14, 84, -231, 52, -257, -56, 156, 35, -57, 14, 44, 380, 4, -56, 128, -16, 148, 35, 94, 25, -270, -50, -204, -89, 21, -9, 16, -179, -49, -73, 53, -17, 59, 107, -75, 441, -85, 89, 37, 130, -462, -137, 47, 64, -172, -107, 30, -46, 162, -28, 193, 112, -188, 156, 80, -79, 2, -48, -270, -110, -32, -32, -166, 105, -72, -94, 35, 51, 45, 141, -99, 198, 22, 117, 145, -67, 131, 253, 62, 74, -318, -72, 204, 1, -1, 201, -20, 100, 116, -201, -151, 33, -60, -1, -252, -28, 135, -67, -243, -215, -131, 8, -106, -279, -81, -8, 199, -139, 14, -68, -181, -78, -185, 44, 4, 11, 175, -38, -43, 102]
6782A02nn7K5n6K9k70J88J96k18K65q9o6j84L33k76M9J00j22mK52k0l01Q8J53
6806A12j43Mm0J95k89J88J42r5r6rj69K75J34o2N4j35j97J13Pk2K0P4J32J83k34
6831A42k58K8j46N01m7k73j9k68L87k2j37J53n2J24m54K36J36j62K88j7k75K18
6853H3J3k78q6M29j23j00K1L62m22l29K14J50J26o4Q9q3K4J78j23l4K22k35RJ07
6877A50r5o2K72l87K47o7K42q1l83J33J57k52L73l89n0J67J11p0j2o6ol6J73m7
6901B2J78j52J35k71Lm1J99j01K55Lk04M8O6p7j68R4Q5j99k4k74J25L42np0J87
6926A56rj05J55j41ll2j6K6n3l9J90q1p8K71l14o0J39J46j53r3Q7QK12n96N62
6951A79k00j58L57j56J64l85K51M5l59K52J08R7l5pk81j64K8J73K08j79K99m25
$$ y = [102, 97, 40, 65, 9, 38, -232, -44, 152, -66, 199, 110, 44, -140, 193, -83, -34, 66, -56, -60, 192, 172, -129, -41, 112, -31, -27, -67, 128, -161, 27, 169, 74, -22, -31, -200, 75, 209, 147, 201, 66, -131, -18, -11, -33, -13, 61, 193, 376, 142, -116, -88, -234, 267, 220, -53, -72, -340, 47, 25, -112, 41, -11, 113, -341, -105, 31, -131, 157, 140, -135, 83, 96, -182, -268, 161, 38, -62, -41, 321, -101, -430, -216, -66, 60, -4, 85, 2, 26, 204, 81, 47, 269, 34, 43, 150, 55, -7, 265, -122, 125, 58, 300, 219, -164, -31, 126, -126, 247, -142, -192, -25, 86, 16, 4, -62, -68, -104, 69, 22, 200, 48, 183, -88, -85, -126, 73, -28, 227, 230, 26, 74, 140, 63, -105, -11, 74, -125, -149, -423, -298, 44, 39, -31, 156, 147, 42, 197, 56, 53, 21, 5, 31, -22, -61, 129, 48, -30, 241, -73, -133, 6, 152, -1, -94, -7, 1, 213, -383, 179, -21, -179, 178, 22, 186, -199, 52, 97, -262, -10, 98, 195, 160, 153, -128, -292, -264, -91, 117, -62, 237, -188]
6973a88K17k64J78J35j07K03l75M83p2j15j23K89l05J15j60j41J41J55J43j37
6993G2j93J46pR4Qq1Q7j33k6j13J41J98l49J30J09j21Q1k30N4J40j8J81p4j18
7017b2J8o6j03M52j88k06J60k9K96j65j86O2k11J99K25j63n9O2j56J66k37K63
7039A12l5O2o8k11L82j93K6NR4j80k22K25n2k64L19o1J12k53J11K70L79n46k43
7062b31J78M4L3Q6m14N49oj51Nj53M6k05J94J37l59L39j15j20J86Q7k0r4j58K20
7086G8O4j44K6m5M1nj03l3M0n4J26k3J62j03j9k35K94O9M4j26j15%j32n8L71j36
7112a6j73M7P0J02l7j35l1L0K41k08K62k18J29k09J03J82j13k57R0R5K40j71l86
7135c63N09j43J94J01k35k90K81O6j20R2R9p6j85j67P3K54j54j19L48k46J01j64
$$ y = [-188, 29, -235, -57, 78, -29, 174, -201, 282, 210, 95, -28, 261, -44, 71, -89, -230, -89, 66, 209, 72, -121, 25, 18, 112, 120, 39, 126, -7, -33, -146, -5, 193, -156, -26, 83, -38, 43, -187, -133, 7, -11, 170, 96, -22, -4, -70, -173, 279, 91, -115, 45, 16, 312, 147, -39, 23, -188, 11, 236, 73, 14, 76, -80, 86, -151, 112, 77, 139, 71, -140, 242, 49, 75, 80, 174, -6, -228, -3, -55, -319, 0, -61, 51, -202, -91, 179, 558, 12, -231, -53, -9, 24, 110, -304, 245, 239, 88, 93, -60, -14, -219, -25, 112, -247, 92, -23, -143, 43, 130, 110, 16, -142, 78, 142, -2, 24, -21, 20, 15, -88, -121, -81, -135, -9, -32, 130, 27, 8, -227, 67, 136, 180, 54, -61, -61, -193, -251, 120, -16, -189, -142, -72, 30, -7, -142, -173, -143, 98, -110, 152, -66, 63, -146, -43, 139, 26, -231, -141, -46, 194, 23, -363, 146, 3, 197, 298, 63, -227, 54, 120, 0, 92, 191, 115, -70, -237, -164, 90, -64, -183, 165, -81, 20, -144]
7157a44L39J2k02M0J6j51L14j51K1J6J83m69L10j29K9k12J09M7J18P7m7k34Q0
7180b8o4K13j8J13k00j45N1Q9M6j04q5JJ95j87J62k08J38k36N36j62r3k6L7J59
7204A84p5j77J28k57K07J48k16m4Q2m5J8J41j39K91l53K4J98m7n8J73M3p9r4j1
7228D2m8k07j19M33q4L46m2j75j89O6j47J7J30P6r4J25m9k40r5P0j7L80k29K05
7252A55l09P4K79j53l27K90Q6k17J13k18K30j9j11nJ68l0O4J1k57K00Q0l41J23
7275a14J29j57l2K24j10Q9O3j37j15J66J80j97K2K26l17m0j8K25r4k82P9M6J00
7298f4K14k00J10R1k24J9k8O7P1l90L09j12K92l96J15J26K74m17J2O5J52O5l23
7321a72L29j24n3M4P9m23K13M53k39k5k20R9k7J49q0k6lP7j65L74j30r9k02m2
$$ y = [-144, 195, 207, 5, 45, 61, -90, 224, 73, 94, 110, 293, -176, 134, 5, 34, -178, -69, -22, 96, 173, 126, -108, -28, -92, 121, 103, 216, 16, -129, -78, 11, 57, -47, -132, -131, 64, -123, 39, -169, -31, -267, 269, 107, 14, -12, 25, 184, 109, -68, 60, -197, 10, 158, -58, -102, -20, -65, -47, 94, -45, 246, -107, -83, 115, 68, 10, 183, 226, 147, 53, 42, -6, -213, -332, 101, 17, 363, 321, 146, -43, 23, -124, -107, 23, 99, 5, 130, 81, -159, -254, -184, -201, 179, -50, 155, -154, -80, 199, 46, -281, 9, 95, -122, -9, -227, 3, -16, -127, -132, 36, 6, 70, 81, -176, 24, 104, -237, -114, 15, -142, -174, 50, -60, 29, 92, -45, -160, 6, 186, -11, 11, 237, -80, -120, -138, 87, -7, -289, -210, -164, -64, 150, -50, 60, 151, -73, -54, -82, -15, 56, -334, -25, -137, 155, -241, -126, 0, 274, -143, -131, -66, 86, 151, -172, 157, 33, -20, 24, 103, -320, -107, 346, 107, 82, -138, -39, -66, 83, 3, -23, -26, 51, -114, 260, 130, 31, -171, -213]
7345b13K11O2j67o4L08Lk0l38K80j11q2P4J2O7k39O1J38k3K21j40J6p5K36j81
7369C6j4k13K54j04j04Q0J13j97jn6K40k4J33j41j24J75K9r5J59Qm70O9Q8L83
7393B24l98L91k05n3j1m9K50L2P8l30J58j71M3q9Q5j66K10q5J38j38m1j7R8R6
7417E0R8j16r6j44K90j57J91j23k47N1N2Q7j1L9Q6Q8m14M57k4j47j82L85k71n5
7441a13L25l47P6J91j55r2K3L59O5j95j00k33J29K45j01O5k0Qk1K3l13R4N7N9
7465B9J07kk23j6J68l1J64n93M87j3j26J44j17k3o1R7N7K7K41l61Ok1K57j56k57
7490b16N0N36l30n9J67m9l18K3p4J74L08K3m45j33K23L50l20p8Q6Q8N2P9j33q1
7514g7L08k65K69k09j08N9r2J32j11J5j58Q6k36J29K93j47K28r0l87L19j09K72
$$ y = [-213, -2, 60, -107, -171, 137, 140, 120, -218, 62, -49, -131, -57, -45, 22, -217, -156, -18, -41, 180, 40, 56, -19, 217, 36, 22, -191, 63, -41, -145, -65, 48, -149, -150, -206, 34, 10, 143, 2, -122, 53, 82, -13, 146, 154, -316, -247, -159, 224, -174, 217, 12, -41, -52, -101, 149, 181, 259, -71, 87, -84, -41, -130, -45, -211, -1, -86, 52, -86, -127, -144, -46, 50, 148, 32, -64, -208, 82, -75, 116, -7, -254, -203, -151, -64, -75, -36, 50, 138, -276, 181, 157, 10, -172, 213, -58, -113, 212, -135, -59, 132, -23, -115, -92, 267, 332, 137, 37, -196, -67, 178, 77, 142, 122, 130, 109, 132, -181, -87, -30, 29, 136, 134, -89, -105, 63, 32, 196, -397, 90, 77, -49, 95, -22, -45, -106, -9, 48, 75, 316, -45, -39, -60, 197, 41, -216, -166, 370, 40, -19, 148, 99, -219, -196, -270, -96, 212, 235, -210, -343, -120, 230, -90, -168, -82, 6, 58, 137, 4, -77, 231, -34, 235, 26, -82, -23, -115, 17, -94, -79, -237, -151, -387, -258, 35, -112, 116, 26, -361, -42, -151, 121]
7536A21k19j36J19J69J21N1k03l9Q0k18k6J11J64j71L64k70L3j26J44j58m02N69
7558G8n4K8N3q7k24j9J83k02K46K6M8Q6j12l24K71O4k37jJ23K17m40N50m16N6
7582h7L35m93M05J00n39J83L14j79j72L27j35k06K48o0PK03l57K02k6k02K57j33
7604hQ6l10M19l20L0J51j7K24m58J92K94k45K13m61J90n2j55O22r5m01K90k66
7626g7n7K44J07l82j15L09l16L50j34J63j03j3P7j23R9J72q8K9l8j85J99k61M51
7649C08k55lJ28k79J85l35L31J7J05l6O7k35j68K20J24k46Q1nn3l9K72l81K31
7672C4p4l0k23O5L70j52J03k32J57Nr5K1P5K1l7MM0J78rl72Q8K10N2o2j09j09
7698h1J52p4J74j62M5Q4l4J19m3j25J47j92k3r7K59q1M02l53l2o9k64L30r7R9
$$ y = [121, -98, -234, -115, 54, 175, 226, 23, -16, 64, -154, -180, -69, 95, -76, 288, 18, 51, -75, 69, -89, -491, 78, 24, 52, 105, 18, -206, -225, -42, -244, 2, 28, 76, 162, 50, -274, -3, 61, -176, -177, -54, 163, -277, 273, -143, -87, 248, -245, 160, 260, -279, -96, 218, 39, -133, 194, 59, -147, 101, 41, 48, 251, -106, 96, 70, -132, 125, -8, 78, -232, 187, -133, -103, 48, 31, 255, -203, -11, 283, 38, 251, -210, -20, -72, -227, 395, 300, -101, 189, -77, -134, 110, 217, -165, -280, 29, -287, 63, -71, 92, -11, -24, 53, -70, 29, 201, 113, 142, 104, -81, 118, -143, 308, 53, 50, 178, -101, 84, -251, 80, 97, 202, 166, 233, -2, -170, 50, 174, -72, 9, 4, -49, -88, 184, -197, 34, -40, -70, -293, -228, 142, -10, 93, -139, 18, 23, -72, -51, 24, 45, 8, 12, 52, 230, 221, -151, -63, 147, 199, 137, 28, -81, 71, -3, 171, 9, 54, 138, 104, 223, 180, 55, 202, 10, -13, -110, 149, 68, 470, 117, 85, 16, -248, 82, -15, 84]
7722H4n6q6L93l12jK48m09PK29j87J01R2K0j63j33K24k9L69l10k68o7K36j30M6
7746a02K98k20k41M04K5j54j47L20k03po7j3j07J73K5J8j66J86K22k75L9m7R3
7769E4J50j95j77J72k67J34K54N8n1l84N39Q7n22K59J45k51J82n1l36J52J55o2
7791D5R2M6k50N9k54J08J40j98L31N5j46M1q2j76L00nm1j35N7J05k18L20o2j79
7815d7j02q3O5K39n9k65L10K7K32l27Q8N8Pl6J2n9K6Ok0Q0q1O4j16k4n0J72j53
7842c6j7R9k13K55k01J84p7m66M54J23J8l7M2j33l88L47K2j40K32K8k4j95j45
7865b68K84j11J58N0Nk10mK13j31o0p3J7J43q6L48m19N0R6L16m54L4J39r4J8k11
7890b50J36K19j52j23J43N7L08j05po4k42L13ml52J77J50l85J92n0j62K67k18
$$ y = [84, 28, -58, 335, 23, 22, 270, -139, -132, 97, -90, 11, 103, 123, -40, -173, 51, 22, 391, 81, -187, -254, -18, -148, -102, 196, -24, -265, 139, 164, 10, -137, 183, -20, -27, -94, -107, -214, -41, -16, 2, -164, 22, 244, -31, 8, -39, 54, 204, 9, -168, 4, -263, -129, 125, 183, 132, -252, 287, 374, -148, 111, 256, 5, 187, 136, -200, -48, 107, 45, 137, 183, -67, -8, -262, -154, -14, -212, 119, 174, 28, 69, -13, -189, 111, 106, 65, -70, -13, 92, -126, 194, 132, -47, -149, -232, -167, 72, 13, -252, 58, 85, 317, -10, 78, 136, 143, 107, 119, 60, 86, 92, 72, 152, 71, 135, 19, -5, -55, 117, -36, -53, 46, -167, 88, -113, 71, -6, -472, -18, 105, 123, 86, 128, -5, -393, -46, -24, -164, 68, 96, 72, -123, -268, 16, -95, 63, 113, 118, -92, -96, 117, -14, -74, -147, -130, 13, -73, 275, -144, -94, 2, 318, -136, -102, 37, -57, -39, -250, -114, 105, -47, -170, -27, 30, 338, 233, 226, 162, -80, 233, 229, -123, 54, 204, -181, 11, -39, -201, 66, -152]
7912a52K91J01l7j74j69j23N36j67J7k54K04J86k03j09J5J8n7N4l5K81j64j23
7934f4lK40j86N4j23L12l52K32j02Pq8j45P04l28l04J90j03k5J02k32L77j2k87
7957a36k5J22l2oJ99k38j05K93k81N35j11j89j25J89J26k17J42j44o8K08j24J00
7979A13R6k44O4k68J76J01R7j46J49l4k90J13RJ38J04l65K03k89O9K39J21M2k3
8002A75q6q2J4K31k86P0K09l76K60M8K64o59M81j91n1k63L41k0N6l13K40j46p
8025i1K6j69j59O04m99N11j70J43l29K01p4N1J45r9J10Jk97o6M68p9j58l06l9
8048b75L61Pk8j6N5j43o0K92J0k28l28O13n15J36K06j82K33r7j0O3m0K2j68J38
8072D6j75J19n6m5K97m06L65l51M34k52j12k5K54k20Q5j46J68j86K57j62Q3rn0
$$ y = [-152, 139, 240, 203, 29, -140, -263, 273, 106, 123, -131, 73, 259, 56, -53, -38, -20, -77, -23, -58, 223, 59, -64, -67, 173, -13, 41, -82, 230, -122, 110, 8, 15, -73, -218, 486, 158, -146, 44, -59, -84, 18, -214, 163, 151, -136, -161, -39, -71, -77, 122, -116, -221, 72, -209, 326, 215, 26, -99, 90, 216, -1, 141, -3, -71, 137, 13, 113, 209, -35, 29, -239, -63, 38, 135, -11, 138, 104, -186, -73, -64, 74, 178, -187, 16, -273, -204, 35, 156, 198, 175, 89, 7, 21, 252, -34, 36, 245, -131, 129, 177, 441, -218, 263, 72, 21, -242, 99, 79, 135, -178, 62, -84, -91, -65, -234, -393, 211, -288, 223, 53, 196, -133, 68, -6, 45, 190, 91, 201, 202, -95, -161, 307, 228, 70, -236, -275, 86, 93, 65, 49, 104, -39, -99, 193, 203, -25, -353, 260, -255, -119, 87, -95, 138, 41, 31, 94, 54, 76, -92, 46, -129, -10, -66, -111, 186, -220, 145, -206, 228, -24, -136, -161, 93, -127, -42, -188, -20, -206, 51, -111, -28, -37, -87]
8095h7K15k08J44k84l0J06L64k27n1J69k84K37k2k61L61O5j4m12M21m94K77J1
8117dJ91m90M06k41k43M46n6j83L11J43n29J78O2j59r0K76j15j3k20N96k51j18
8139a03K45j1j13J03o7r3M16l85Pl5r0L05l63J75l7J45%J24m42K31qJ0J03l79
8163b62N53k55k79L74k46j21J19K2J1L1J56NN3q2j30K6m6j4P7M9k48J18N8Oq1
8188a06K24l93K58
$$ y = [-87, 128, -80, 64, -220, -250, -144, 220, -7, -58, 111, -173, 64, 42, -219, 142, 207, 193, -219, 202, -292, -15, -4, 187, -303, 103, -138, -381, 65, 9, -174, 137, 280, -249, -71, -9, -168, -258, 18, -97, -110, -330, 266, 15, -103, 142, 131, 18, 121, 54, -39, 377, -8, -1, -36, -126, 179, -184, -9, -46, 99, 99, 223, -219, 12, 4, 14, 117, -262, 291, 36, -243, 131, -115, -236, -117, -95, -84, -53, 103, 108, 161, 79, -51, -25, -71, -85, -8, 41, -207, -89, -31, -25, -106, 118, -275, -17]
8191a7
$$ Imaginary data points
##PAGE= N=2
##DATA TABLE= (X++(I..I)), XYDATA
0@%%%%%%%%%%%oJ4j6J6j6K4l2L2m0M8n6P2q8J04j20J36j60J84k08K40k74L14l56
34a88M01m53N09n70O39p16P97q85R82j089J206j332J471j624J791j973K172k392
52a254K636k908L211l550L936m377M888n486O195p056Q130r510J1354j3965J7982
67A0226k5019M0947j47446Q670K00435l7281O8024M1311r7282j09207J2026n1345
79h5941l3881N7220M6936J7845J09036L3142r9852m1944J6046j01538o5729Q1312
91f7348N3037J036J01352P1450p9920q0169k5320p0697k4063P9900M5953K126
103G337N6761K6364m7520j2042j0530q8008l7555N5328J5938R367R1858M5273
115A12571n8045k5753p090q1422n3067M6081M2333K5469O1377K4444l8476j9984
$$ y = [0, 0, 0, 0, 0, 0, 0, 0, 0, 0, 0, 0, -6, 8, -8, 8, -8, 16, -16, 16, -24, 24, -32, 40, -48, 56, -64, 72, -88, 96, -112, 128, -146, 168, -188, 213, -240, 269, -301, 338, -378, 419, -466, 516, -573, 633, -699, 772, -852, 939, -1034, 1138, -1254, 1382, -1526, 1685, -1865, 2071, -2306, 2582, -2904, 3291, -3765, 4365, -5145, 6209, -7756, 10226, -14793, 26154, -121292, -112622, 87813, 50532, 118556, 159867, 62585, -46622, -34596, -85941, -119822, -62602, -15666, 2179, 111215, 144357, 44505, 2561, 18607, -82931, -148660, -67348, -14311, -13275, 88077, 159527, 79607, -562, -25882, -96579, -120642, -40742, 5211, 7337, 64098, 90462, 42942, 30900, 20370, -67638, -105193, -49865, -33927, -24560, 67298, 112571, 54526, 28773, 21683, -59739, -112806, -66725, -24392, 1077, 62454, 86898, 48422, 28438]
127B8438k1411n7026j6758K4524p554J6016Q1106L5985k9579o573j5841p5973
139d4646m3034K7375K1261J9612N6385L7611j0124j8592l4100n2434k1406Q041
151e4051M341L1515N7515J7789j1225M808j8498o1581l4473R401O768J8605N2996
164B3910L9466j533j6906k8190m0181k6635o421P897L1560L9886J8611O035N565
177E3064k4999m8561k5183j356j516J6849M4906L4612L657q362j7003l2299l2967
190c9158j5334O768K5596L0522K4011J6997P39k6349l4760j9385r741o056J5134
203c1016L5338K8151R256L64j0882k9982l2894j3729O197J5024K0529K5986J9929
216D2271N82j7769k2515k0496j8909q134J4602K8843K2326J1838P102n755k6086
$$ y = [28438, 7027, -49999, -66757, -42233, -49787, -33771, 47335, 83320, 53741, 47168, 31327, -44646, -87680, -60305, -39044, -19432, 36953, 74564, 64440, 45848, 11748, -40686, -62092, -54051, -49710, -18195, 39320, 57109, 45884, 50692, 32194, -29387, -63860, -54459, -47691, -29086, 23910, 63376, 61843, 44937, 16747, -23434, -50069, -56490, -48593, -17033, 22853, 41464, 47499, 53064, 28065, -20496, -45679, -47035, -48551, -31702, 13204, 47816, 51473, 43111, 26108, -6191, -39158, -54492, -47724, -22128, 8394, 32405, 49402, 50141, 23792, -10968, -30353, -40094, -46150, -31016, 4322, 32473, 41729, 42093, 31211, 1229, -31665, -45394, -39197, -24173, -3644, 22342, 42271, 42853, 25084, 2569, -17927, -36836, -44970, -30368, -1525, 20801, 32639, 39741, 33986, 7900]
229G900k9307j3723j990N764J9296K9206K0179P11j1751j6476k0641k1175q073
242d0080J1074K0321J8416J6881J2279n205k3116k3251j3036p487K62J7196K6038
255A0292J7402M500k790j1823k2493k2276p718O901J3614J6878J9418J2724l779
268C0850j6951j7851j4940j2582j425J6296K1397J4951Q244K173j0870k1565j8650
281b0923p220J694Q160J6500J9906J1396k889j0542j3372j6133j4249j358J2514
294a6516J5766J2728J0931N704q855j7984j5411q053l567M050J5084J9236J0221
307B3334N55m972j0898j7026j4449j672P797J0317J3269J4230N690p091j3161
320E923j2823j0465o552L341J3140J4862R364M583q24r658j6457j2369l046K774
$$ y = [7900, -21407, -35130, -37120, -31356, -12060, 17146, 37325, 38036, 26285, 9809, -10832, -32007, -40080, -29006, -8685, 9731, 26612, 38891, 33686, 10570, -12681, -25717, -33204, -32942, -15746, 10292, 27694, 32194, 29404, 17581, -4912, -27188, -34906, -28005, -14391, 2487, 21905, 34629, 30850, 13899, -3952, -18892, -31474, -32899, -16603, 4794, 19745, 27989, 30162, 19292, -2273, -20923, -28143, -26449, -18289, -1789, 18117, 29513, 26624, 16082, 2710, -13423, -27672, -29030, -16516, -750, 11978, 22909, 28613, 19758, 1774, -13637, -21690, -25257, -21207, -6123, 13113, 23334, 23889, 18917, 8019, -9007, -23456, -25128, -17331, -7014, 6255, 20485, 26175, 19084, 5923, -6900, -17365, -23917, -20576, -7436, 7426, 16790, 21373, 20549, 10891, -5566, -17935, -20981, -18207]
334a8207P321J2885J4593N444m135q036j0221j2834r432J982J1035J1500R993
347A1888P793J618r524j3941j0155n440j711N434J3830J3906N442j447m832j0089
361B772j4158q651J603P185Q626J0953R702K413p774j1842r296o599l994L957
375a5103J2848J1256N766J822j523r620j4100p804J8L012P877J1410R744K138
389A7741m540q680r168q643m870L682J0588R566N574M809l29j0394j1014n628
403a1306l070m92P552J1448Q049K749j879o248q988p988n466J810Q042O949O583
418G745P278M85r281q660m649n901j991O755R193O120N296K044n308q781q165
433g820n670n5O222N710P220P711O46p082n643m855q550l430P583P757M675O006
$$ y = [-18207, -10886, 1999, 16592, 22036, 17901, 9865, -356, -13190, -22622, -20640, -9605, 1895, 11888, 19681, 21299, 11775, -2166, -12321, -17761, -19472, -14038, -208, 13698, 19140, 17693, 12861, 2772, -11386, -20037, -18434, -11249, -2623, 8330, 18032, 20445, 12671, 829, -8467, -15066, -19060, -15103, -2255, 9001, 14767, 16589, 15066, 5446, -8654, -16458, -16440, -13428, -5551, 5859, 15603, 17741, 13201, 4521, -4647, -13290, -18160, -14478, -3890, 5676, 11250, 16059, 15730, 5336, -5678, -11306, -14376, -14868, -7316, 4132, 12181, 14930, 13051, 6803, -2185, -10173, -15639, -13829, -5787, 1162, 7745, 15023, 15508, 6227, -2433, -7082, -12983, -14974, -8219, 974, 7094, 12390, 14434, 9126, 345, -7820, -13490, -13545, -7323, -1613, 5607, 13318, 13964, 6882, 1239, -3616, -12166, -15596, -8013, -256, 4419, 10425]
449A0425L155m311o971o348o360k054L349M909Q263Q052O96n549l869n149r045
464a0807k089N403L783M477Q576M354m112n946n784p192k759K687M660O536P320
479I107J593j962j978p051r893j712L946K819M992Q941K276l509k402l999p418
494f250m170P03K970O434P524K516n14k304o830p556q85J038j05N332Q573L149
510I625j344r97n129p670l648M76K660M507N289L248K234q97o260o511k806j739
526h962O27O555P160J883l20J33m149n998l686j047N14L567N991M626K144j498
542G540m776m695l422k920K98M771N024L106K781R10m697o490l615r98N58K656
558c969M741M159K139n50k274l691m778l974M75L942M342L609L256J12l491m540
$$ y = [10425, 13580, 9269, 2298, -4050, -10410, -12464, -9115, -4206, 4057, 12109, 12805, 7256, 3387, -1762, -10807, -12896, -7493, -3710, 767, 9343, 13697, 9585, 3639, -2145, -9337, -12096, -9409, -4749, 1787, 9107, 10700, 8738, 6760, -291, -10184, -11896, -7950, -5131, -139, 8802, 11078, 7569, 5167, 1168, -6250, -10420, -9717, -6747, -313, 7211, 9727, 9213, 6909, 79, -7477, -8362, -7324, -7429, -2097, 6476, 9625, 8281, 7284, 2155, -5515, -9163, -8687, -6027, -1520, 3769, 7017, 9251, 8354, 2094, -4417, -7223, -8962, -8335, -1780, 5380, 7263, 6943, 7076, 2927, -3071, -6757, -7804, -7290, -3723, 2268, 6894, 9038, 7540, 2764, -1931, -5353, -8273, -7975, -3204, 1820, 4926, 7707, 8617, 3920, -2570, -6185, -7183, -6625, -3969, 772, 4931, 7070, 6520, 4246, 555, -4223, -8197, -7722, -3780, 562, 4171, 7427, 7539, 4048, -492]
574d92l078k260j309J783M664N187K145l57j786l925m521k317K98J586K205M662
590B485L976R88k044l885m582k868j024J682M482L735J838O62K74l354m937k472
606e044p18K5L113M990L089J14p86k549l897k535j682L3K984M004L046K004K62
623F453m437m460j369p30j092K855L745K698J063P46j589m316l388j887M47K515
639b746L183K365K152R94l070l110k061k626j446L225M157J526J942R91j867l445
655A64k412j891j171J647K780K805K902J106k773k680j520l461p51K195K485J371
671G96K637K135j418l027k648k323j130J095K573K427K875N83j126j336k724l420
687d031j435K004J609J958L553J141j536j924j756k368j591N81J609K569K514
$$ y = [-492, -3570, -5830, -7139, -5356, -692, 4495, 6640, 6283, 4497, 572, -3949, -6266, -5968, -4382, -2177, 2485, 6461, 7449, 5405, 1520, -3062, -5930, -6954, -5272, -790, 2945, 4783, 5445, 5719, 2365, -2572, -5044, -5762, -5737, -2624, 2366, 5455, 5569, 4783, 2234, -1663, -4198, -5880, -5847, -2863, 1141, 4187, 6191, 6453, 2016, -2444, -3813, -4543, -5635, -2780, 965, 3663, 4726, 5472, 3883, -433, -3821, -5708, -5261, -2746, 437, 2802, 4954, 5948, 2878, -232, -2293, -4919, -6365, -3140, 1017, 2543, 4485, 5476, 3609, 164, -2248, -4139, -5310, -3663, -883, 1922, 4824, 5930, 3157, 477, -1043, -4504, -5255, -3060, -575, 796, 3433, 5568, 4150, 1123, -1525, -3848, -4978, -3883, -1310, 1117, 3992, 4575, 3449, 2113, -611, -4031, -5466, -3462, -1853, 105, 3658, 4799, 3263, 1339, -417, -2785, -4376, -3795, -2186, 383, 2897]
702B897J232j50j590k759k824q00O02R48J943L274J573q14r97k081k930j789L50
719c915J453K370K255J375J84p96k358k638j417j16L24K350L034J410l99k94j682
736A140l021j639r1Q67J697K347K136L93q55k204k136j331n66j68K232K263J377
753B441P70j37j359k904j861k23K25J700K247J837P21n43j619j946j468j254K85
770c088J733J785J956P45J55j426k135j965l80m05J025K215J980P17l3j133j623
787A23j690j487j16J404J515J351J827K96j277j798j517j183n75R17J755J920
803A465J261J28n58j922j711j283j04N30J553J430J995J66q42j165j474j562p70
820b863N02J708J054J294Q92j63j442j889r00q44J64J126J822J589J10K6p36j447
$$ y = [2897, 4129, 3979, 2389, -370, -3194, -3994, -3392, -2444, -501, 2773, 4346, 3532, 2535, 454, -2476, -4265, -3915, -2462, -92, 2163, 3538, 3722, 2926, 568, -2070, -3487, -3603, -3279, -929, 2105, 3515, 3116, 2822, 1140, -1881, -3520, -3611, -2744, -1047, 1300, 3436, 3829, 2974, 770, -1366, -2697, -3263, -3431, -1199, 1064, 2441, 3211, 3074, 1715, -1189, -3050, -3273, -3048, -1348, 899, 2736, 3457, 2914, 1295, -651, -2119, -3373, -3088, -1355, 430, 2386, 3131, 3286, 1860, -275, -2240, -2620, -3025, -2000, 215, 2195, 2912, 2879, 1746, 123, -1567, -3054, -3170, -1766, -251, 1100, 2927, 3223, 1946, 148, -1369, -2552, -3127, -2210, -455, 1465, 2726, 2854, 2296, 374, -1337, -2620, -2724, -2194, -641, 789, 2784, 2950, 2108, 943, -531, -2093, -2863, -2361, -653, 401, 1695, 2587, 2424, 982, -907, -1807, -2651, -2487, -1361, 461, 2050, 2160, 2186, 1450, 3]
838Cj762q07M13R49J235J270J359l86r55j661j252n65n45J322J589J075P05L42
856B329m35j420j935r33M60N00J202J695M69M92r81j241j303j094j08P15J379
873b09J330P75M27j95j842j099j060l40J16J293J760J067P2m02j059j072j510
890a948l97Q74O69J148J230O68l63j445q52r56p75J81J291J155J021M06M3n69
908A381j781j122n31M02P29J120J214N99j91p68j344q59p17j39P85J171Q65O73
926A487N61q26j103r51o50l12O59Q01J407O67k74m97n05j157r45l25N16J069R50
945E72Q66J88l11o33j403k95q59QJ174J397M33K23J86j054j216o71j76K48M37
964h86J050J296K51m31o24j150q00k92M15M14J105N86K39P81r04j116q37n66k28
$$ y = [3, -1759, -2566, -2153, -1204, 31, 1301, 2660, 2274, 1319, -342, -1594, -2159, -2704, -1382, 207, 1282, 1987, 2329, 1894, 474, -1461, -2394, -1934, -1434, -232, 1463, 1932, 2424, 1443, 202, -1101, -2195, -2303, -1588, -209, 1121, 1896, 2323, 2128, 286, -813, -1873, -2213, -2097, -804, 956, 2023, 2095, 1693, 634, -438, -1948, -2345, -1471, -802, 346, 1576, 2244, 1881, 436, -416, -1372, -2147, -1966, -675, 480, 1501, 1907, 1950, 1381, -400, -1522, -2053, -1651, -922, 198, 1412, 2011, 1820, 1052, -292, -1151, -1868, -2007, -1222, -51, 814, 1487, 2048, 1222, 119, -832, -1482, -1794, -1135, -334, 1073, 1740, 1466, 969, 464, -693, -1638, -1963, -1447, -378, 572, 1438, 1626, 1315, 682, -721, -1016, -1875, -1867, -693, 704, 1137, 1360, 1546, 492, -724, -1395, -1571, -1323, -886, 164, 1460, 1711, 1280, 656, -494, -1294, -1586, -1171, -757, 348, 934, 1173, 1954, 1050, -66, -903, -1469, -1697]
983a697P65J028J150K5ln43q22o79n43m37R73P14N54O94N51n71j268o44j83n79
1003a515M46P48R84K95P11j85j196r05p79m4L67P07O81R00J31k40n58j044n10
1022a006o07M83Q60M69P80M72k57o71o14r11k08j55N09P69J363K72m27o10n41
1041c0o67o42M7O30M28Q88O78j20m03q11n92p78M69K72N31J089K80l22J32n19
1061E60j411j88p8J45O06J186L27j41m45l30r41l82j12j01R95Q12M98Q9P8j032
1081A35q01k12q1j05P37N99P37p0J18m82j186l81O4N8L13P91K15N09K93q31o10
1102a90p84J24m08O04Q92L76J90J1O4j273j64j29m71M65N51O52O08Q4n80q32l74
1123e84j87j37J83N18M76N63J24m02m53n30m75j29M44M95N38L37Q2j07m38l39
$$ y = [-1697, -932, 96, 1246, 1271, 1268, 725, -97, -776, -1319, -1756, -783, -69, 485, 1179, 1730, 1159, -109, -753, -936, -1515, -1069, -321, 663, 958, 1669, 1484, 288, -617, -1396, -1440, -1073, -366, 315, 1215, 1346, 1106, 548, -496, -1006, -1613, -1130, -270, 199, 979, 1451, 1194, 523, -91, -1002, -1210, -1365, -856, -87, 1276, 1548, 1121, 511, -30, -697, -1339, -1292, -662, -234, 654, 1332, 1212, 809, -2, -594, -1372, -903, -631, -100, 989, 1269, 947, 1079, 560, -851, -1039, -1117, -972, -366, 820, 1147, 1006, 561, 231, -710, -1092, -1204, -1305, -310, 502, 1000, 1089, 1167, 135, -666, -878, -959, -1064, -327, 272, 1009, 939, 1057, 575, -611, -992, -928, -870, -557, 234, 449, 958, 1251, 420, -190, -974, -850, -1258, -654, 238, 614, 804, 815, 879, -394, -558, -687, -1158, -693, -142, 510, 1118, 1202, 622, -210, -584, -771, -908, -725, -207, 269, 832, 956, 554, 101, -429, -904, -1033, -589, -94, 444, 781, 863, 756, 318, -21]
1143b1r11k51P48L04N40O00j25k1p50m09k00n34L39L82N74O39M5l36n16j08q21
1164h32j22N02J22L35P73Q8n4n92l07n06k70K73L32M01O01K6k29k30j87n55k52
1185f83ML92L65N79K8n6j73l05n83k90R6J6N84K79M86O5j56p84j53l46j6l5Q15
1208A29K76P5M06k67o63k08m97n2K89K47N32J77M2K23m88n16k17k68K17M73N80
1229D90j17K71j49n57j1l29l29L16K12J21O97J41k48k27n18p7l47J25K57K76K68
1250B65N51q5l79m74k14l47L47K2M07J48K28J39m41K9k87o60M53K9J50L89L16
1271E86m7k24j27m49m32O0K11J47N81K97k29k7k29k20m85N5j48M81O4P58j92k34
1293A97mj98l86l00J08O09rM29J53K93m08p47k53o8L69l7M26J39J34K5p4l45l74
$$ y = [-21, -932, -1183, -435, -131, 409, 1009, 884, 863, 113, -296, -496, -1030, -691, -309, 265, 904, 949, 613, 97, -11, -832, -954, -452, -330, 5, 778, 866, 812, 220, -87, -593, -863, -590, -258, 143, 744, 770, 541, 311, 124, -431, -683, -679, -287, 78, 657, 685, 629, 456, 151, -432, -722, -626, -610, -26, 253, 739, 804, 648, -136, -289, -635, -651, -686, 129, 405, 480, 886, 619, -44, -252, -749, -801, -512, -265, 267, 444, 486, 709, 221, -295, -512, -780, -563, -90, 490, 373, 644, 495, -62, -73, -402, -731, -415, -203, -82, 615, 756, 508, 281, -237, -314, -661, -536, -279, -3, 265, 816, 731, 352, -122, -336, -683, -336, -314, 93, 241, 469, 608, 167, 196, -91, -751, -298, -269, -119, 270, 586, 539, 315, 188, -261, -693, -633, -422, -275, 306, 603, 374, 347, 118, -102, -587, -532, -680, -199, -135, 623, 431, 197, 193, -5, -391, -691, -583, 26, 17, 446, 599, 892, 484, -263, -516, -584, -215, -252, 174, 313, 447, 472, 398, 53, -321]
1316c21J29k09K91m1O14J9J08m39l04N9j78m65N32J68M40p3Q7R9l55m63j59Q0
1338c81O3J97M40J30%l05j85p9N3j9j75j36K96P51k68J83n11J19n78%Q0O3L86
1361A24PJ99J4k24l28m27J64Q4M8N30PJ73p4k19k1m36J15m1lM41K07Q1J09k43
1385B87p9r8n82L84N1K9K34L4M5J00m51J59l62p9K44n6N19k09J48j04j27l39j49
1408d01J1N60j75K24J22j46K85m62j93k05J51r3M9N59k1M26l77k13j89k56J3k1
1430c52K00L98j12K14L1j12l98L2l60J70P6nM60M6Q0j02m12Kl61J91J18L11JJ30
1454B46J17mn46R9l73Q0J48K10K48J07K37j57n38l7k31K26o6K26J33J75K70k02
1476C68m46K35m79j68j01O70j6L12k99K13j33j76L3m64L65k4K31N6P1L7j47k48
$$ y = [-321, -192, -401, -110, -151, 463, 482, 590, 151, -153, -94, -272, -737, -205, -37, 403, 330, 417, 516, 161, -302, -461, -381, -318, -121, 319, 449, 449, 144, -41, -120, -67, -86, -261, -397, -101, 650, 382, 565, 54, 173, -405, -405, -325, -262, 124, 131, 330, 344, 120, -208, -635, -471, -387, -339, 191, 198, 371, 297, 78, 57, -379, -264, -305, -308, 133, 340, 421, 530, 287, 208, 110, -472, -88, -37, -8, 226, 260, 305, 405, -46, 113, -249, -328, -84, -140, 379, 170, 318, 214, 87, -252, -401, -390, 170, -5, 219, 341, 195, 480, 18, -175, -380, -229, -322, -273, 286, 265, 691, 314, 101, -88, -344, -331, -352, -152, 246, 134, 348, 379, 267, -131, -99, -459, -289, -213, -218, 242, 288, 368, 266, -146, -144, -505, -314, -196, 115, 116, 246, 363, 359, -187, -88, -461, -381, -233, -23, 225, 332, 569, 412, -126, -163, -394, -168, -234, -8, 125, 300, 570, 368, -78, 157, -322, -490, -591, 79, 63, 375, 76, 289, 156, -20, 13, -451, -86, -110, 121, 177, 248, 285, 138, -110]
1498a10j36J29k31K93K84K7J49r9k93j38k93l7L16P3J08L96k16l3k8N7q6n80J89
1521b59Q6J55N09J37m11Q6k64j59l01MM66k34K54M94k82J18m59p7m70L13K9L89
1543A24J7J73K19k88l6m94Q4k00L16o8J23L26K5k84K34n52L30k21k15L97K26J21
1565C57j80o5L71n97j67J08j90J36L80J19K09l39k20J19q8jj38J1J34L54K83k97
1587B99m05J38l54j02K1K88J16J44K19J22l88k68o7j25L38M0R1J83jJ25n55L4
1609a07o7Q6j90j44M10J85J98J38l88j38j23k96L46r6R2l1N51k72j6j63r1k42
1631c58L75m0j99J79J5J89K2N4l06q4k08K97J30m2J64j60R3j27k22j12j7P9p9
1654c57M34N1J13P9r6m40o5M2L70j58O3L37k36q5r7J05k49J16k10J79Q5K07l61
$$ y = [-110, -246, -117, -348, -55, 229, 256, 405, 306, 13, -125, -418, -455, -139, -66, 42, 438, 222, 189, 161, 218, 132, -448, -259, -173, -18, 491, 628, 217, 303, 39, -120, -421, -417, 49, -185, 69, 563, 281, 399, -60, -137, -607, -294, -265, 124, 141, 314, 533, 245, 209, -285, -201, -401, -85, -153, -30, 296, 321, 37, 271, -281, 49, -172, -387, 10, 236, 357, 177, 112, 483, -114, -281, -173, -363, -227, 153, 272, 481, 142, -78, 41, -47, -48, -186, -175, -41, 313, 596, 299, -106, 32, -322, -424, -403, -115, 1, 145, 364, 486, 98, -170, -237, -362, -24, 16, 107, 290, 289, 414, -141, -107, -174, -88, -278, -422, -12, 173, 371, 509, 121, -17, -140, -436, -90, -186, -94, -125, 426, 154, 138, -25, -116, -358, 17, -23, -222, -43, -28, 161, 183, 237, -69, -153, -361, -64, 66, 24, 188, 28, 121, -6, -228, -340, -357, -278, -357, 77, 128, 241, 320, 224, -216, -281, -239, 131, -27, 36, 373, 137, 52, -45, 60, -189, -73, -283, -104, -19, 188, -173]
1677a73K18j9O1k2q9k20q7L42J11k46P9K30q8m02J56%J14O5q7K54j0j99J94j94
1701a2j16P3j54OK89q3L09K7j41j81r7m44M83K08k37L13J7o6j8k13j92n9M2L21
1725G5J36k53J67J72j62k80k68J32K33O5l3Q5K69m11K64j95j4Q8k82L00j19J53
1747A22PN7k3k74j27j76K22K63p7M1K44k92L66k93l77Q3OJ15L12j15K59k85J02
1770A60k07o8Ko1Q1j4J05j5J25j07K05l64k7m5m2J97n6L07K55l36l0l37L5J84
1794e3l40M49p3J67J24p4M6j63l68Q9O5k74L90j35K95J02Q0m03j86k9K30J25J84
1817B48j53K72j09k09r5r4J8lK15oR1l07M21Pl89P2m20R5K44R5K19o5J62p5k98
1842f4Q0O9k04o8j20K22Q5J71J16k35k36J33l34J04K80j46O00k11j61J36k45j43
$$ y = [-173, 45, 26, 87, 65, -24, -244, -331, 11, 122, -124, -45, 185, 97, -305, -149, -149, -35, 30, -57, 197, 187, -12, 182, -12, -128, -55, -209, -203, 86, 3, 312, 339, 198, 17, -80, -524, -41, 167, -70, 243, 260, 194, 176, -37, -229, -288, -246, 75, 211, -42, 125, 297, 135, -145, -413, -281, -48, 17, -16, 69, 338, -73, 191, -4, -18, 70, -212, 88, -31, 122, 129, 186, 163, -111, -238, -414, -192, 71, -6, 35, 279, -13, 353, 60, -317, -234, -228, -113, 199, 84, 343, 58, 160, -47, -115, -113, -174, -93, -107, -2, -17, 108, 1, 206, -158, -185, -230, -272, -75, -131, 176, 431, 95, 65, -272, -237, -53, -393, 56, -17, 150, 274, 200, 246, 83, -285, -196, -131, -405, -15, -150, 145, 247, 327, -76, -262, -291, -61, 64, 248, 95, 367, 258, 49, -46, -140, -122, -125, 90, 84, 175, -132, 289, 296, -93, -21, -441, -346, -102, -7, 212, 147, 309, 234, -64, 16, 85, -119, -187, -307, -85, 0, 171, 287, 52, -184, -51, -385, -281, -1, -147, 453, 242, 81, 217, -28, -171]
1864a71j8k6J5K5J48M98j23l83m80L03RK2K33L15k79N3P3l54rj04P3J66q8O1L50
1889C09j79M1J01k47j10R7p8o0L97l3k63K93l19j3K49j33l54n5N23j30K53k26
1911F3K07j81l72m5N7J86n4P4M14k73J09k29J80j00n31L47J51N7J29q5J5m1j78
1934a00j00J3mK81k2J56k8k48J63P1m06k06J06L95J22r8P8L6k01j4p2j92K57l86
1958c99M19k4j2p6K99l81j51Q0J27P7L96k08J98k0k99L00m51J14k46M15j34Q1
1980A05Q0q7m6l0k67J6l0L21j4J31K16l21L32l86q2k28n8J85J04j30R6K09K9j09
2004C6P5k90r3M43l80K87q8j81M74n2k41l2j61K4N2Q5K13j20J50j67l25R3J0N4
2028a34j75N81qN3k52j29J60k40L35l54N0J11J21j45L25k19kk61j54N6j2J67J51
$$ y = [-171, -189, -215, -200, -175, -27, 471, 348, -35, -515, -212, -203, -181, 52, 367, 88, 141, 214, -140, -149, -253, -180, -14, -102, -41, 309, 130, 171, 272, 25, -85, 12, -66, -126, 271, 238, -25, 268, -51, -64, 185, 52, -302, -357, 166, 36, 289, 63, 270, 89, -283, -328, -271, -85, -139, -65, 349, 76, 185, -44, 136, 36, -495, -148, 3, 60, 189, 104, 119, 78, -100, -200, -187, -191, 90, 68, 224, 196, -52, 111, 182, -224, -430, -324, 71, 193, 95, 173, 209, 8, -6, -78, -270, -13, -399, 20, -4, -16, -92, 207, -174, -325, -245, -118, -41, 355, 147, 345, 325, 26, 326, -125, -11, -257, 158, 24, 105, 185, 98, 52, 22, -245, -229, -259, 62, 48, 179, 395, 74, 406, 20, -62, -290, -348, -163, -59, -189, -93, 116, 145, 36, 111, -179, -272, 171, -209, 78, -10, -191, 283, 231, -10, -42, -203, -179, -127, -42, 171, 51, 201, 34, -291, -198, -188, -134, -309, 272, 264, 317, 65, -64, 96, -144, 191, -163, -113, -2, 119, -26, 299, 80, 78, -183, -337, -281, -293, -126, 25]
2051B5K82j29j81J76l03J34l73N47j5m6J33l4n4k98J53J63m49K76q7P8M17l50
2073F5Ll48J60l66M09o4J09J06p0K40k93J05j48k51L5o6M27PJ44k9Kj17j52q3
2097a75j9P7L40k29k6M7J30J08j68j75k6p3J08J12M5M18m86K12p9j57j23K26n94
2120e07O24m4o2M3q9K13k31m7j65K87p6Q1K36p1K9M0j52k66k0QJ44m3K7n4K32
2145A37Q5k31r7oJ1J93j77J37K67l22K30l41J27O0l87K69o0P3k3J57j20Nj10J09
2169a4n6M4Qj38O82j32l97N2j38K8j52J32J24J29K9j01O3j65Om52K52K54K6P3
2193A57R7k08J41nm04Q6l01K97L50Ok44L56l83J86r7j01o0J05J86j11j12K06l5
2216A12K74o18qJ38Q9j24P5J26k17J61n0k3K57l07J3L13l5k58K59mKj09L1m05
$$ y = [25, 307, 178, -3, 173, -130, 4, -369, 178, 163, 117, 250, 216, 162, -136, 17, 180, -269, 7, -80, -2, 415, 65, 68, -280, -120, -486, -77, -141, -32, 74, 4, 244, -49, 56, -92, -343, -308, -374, 53, 60, 204, 175, 177, 60, -92, -175, -194, -117, 223, -6, -32, 15, 145, 253, 85, -90, -116, -189, -81, 31, 76, 494, 8, 220, 141, -16, -139, 87, -507, 117, 73, 11, 54, -35, 178, -53, -100, -265, 22, -54, 27, 263, 192, 221, 261, 109, -157, -177, -169, -25, -68, -41, -95, 137, 222, -9, -106, -112, -101, 92, -85, 52, 319, -3, 227, -114, 13, 73, -314, -45, -105, -32, -55, 102, -18, -13, -123, -14, -70, -26, -18, -156, 526, 394, -3, 49, -89, -61, -213, -81, 43, 172, 201, 100, 163, -2, 4, -448, -196, 58, 84, 157, 254, 46, 187, 182, -222, -136, -437, -140, 210, 216, -28, 328, -55, 131, 34, -67, -127, -22, 164, 53, -59, 147, 112, 386, -232, -240, -102, -13, -137, -62, 64, -153, 8, -42, -65, 192, -115, -102, 211, 176, -82, 177, 173, 175, 66, 97, -308]
2240c08J09K56J37j48K69j97J24k19k31J67m1K4m7r2J78K00j83K6k33J16J24J95
2262B26q7q6J94k50LN9j07k25j16M51J15P0k73k7J57Pr7k17L99k34J47j14K27
2285B22j27N5l16j75J19P9K58l43K14k07K15j7P8Q8l67R6K21m19N50l8j02j67
2307h3L9J42J47j43Lj24k1K26j49o6J66j24n8r3J05Q0J67j51q6J98J0k82J60j57
2331i4j21k64O30r4J43j18j36L37m91K68j66K22j8K9j51J38q9r6j4j32K89j56
2353h4l78M81j28L34j25m5j07j6j48l2j8K92N3R3k27j77L84l33J32J48MP6j95
2376a6J36j47J60k05J8O7k53K48P2j05J41J9R4k96J47j88K06j19J64J00l15j21
2398a93L57R9l31R1k2K1K54k94k61N11k4k06L4k06L13Qk71J65o9J44l35Q2K74
$$ y = [-308, -199, 57, 194, 46, 315, 118, 242, 23, -208, -41, -82, -58, -105, -197, -19, 181, -2, 24, -209, -93, 31, 226, 139, 53, 247, -3, 0, 59, -48, -273, -389, 62, 177, 247, -26, -53, 104, 111, 14, -203, 196, -38, 109, -5, 222, 95, 150, -166, -341, -222, -143, 115, -228, -14, -221, -6, -23, 55, 143, -224, -128, 93, -326, 224, 186, 84, -83, -44, 98, 245, 102, 105, -19, -40, 186, 37, -29, 137, 13, -45, -138, -33, 47, 214, 63, -23, 175, 185, -97, 63, -94, -215, -479, 151, 57, 200, 82, -54, 283, -208, 60, -106, 116, 98, 127, -24, 114, 25, -71, -85, -217, 72, -84, -462, 19, -109, 225, 100, 55, -52, -68, -216, -248, -266, 26, 79, 172, -55, -232, 152, -181, -49, 99, 103, 179, -16, 120, -27, 133, -72, -54, 13, -240, 8, 80, -25, 116, 135, 229, -67, 80, -108, 98, -21, 143, 243, -72, -193, 164, 263, -68, 23, 1, 22, 276, -18, -279, 232, 208, 2, 36, -170, 143, 151, -120, 45, -24, 120, -215, -133, 141]
2421A41j04l42P8K62j66J94j71J31J85K6j69K03m21Q5k10M69R1p3l05j11K61J8
2443G2j40o0l7K19m5J2r8J0M9l71K37J09R6j94K60n2Ml6q2p5Q1O1k2J48q7J15
2469A74K5k85L21n21L02l6P2J88l64L18k67m0K14l7j54O0L05j73l20K24J65k34
2491f3K2p9k7O2K59j82L02p8k92K4O5l09L29P5l60J08J89M3N0r4J51j29l18K76
2515B4k3j05L22k77nK64k16l16K40J06K60l94j06M59m18Q1J27R3j07J70j8j14
2537D7j13O1K53j50JQ9l7R7k08n4p3N7K27j28oo3K80l96Q8Nj7o8L77O7l00L04
2563C40j88l94M10l17J77J56k11R4j0J09m7j61J59k78j89L34J29p4p4R1j77K47
2585A26j81J18K02q8q0K27j97j68l02K90J92J48k34J12Qm3l33L12j15P7j66J73
$$ y = [141, 37, -305, -227, 35, -131, 63, -108, 23, 208, 234, 65, 268, -153, -68, -278, 191, 282, 209, -96, -207, 54, 72, -68, -128, -165, 54, 9, 21, -77, -67, -18, -389, -152, -43, 53, -141, 119, 67, 71, 35, -47, -122, -41, 20, -2, 146, 59, 174, 199, -86, 235, -286, 16, -20, 52, 240, -124, 194, -73, -113, 101, 64, -90, -30, 275, 102, -218, 6, 171, -63, -41, -120, -147, -85, 174, -8, 294, 216, -76, -52, 13, -296, 33, 108, -252, -144, 45, 88, 138, 44, 195, 66, -252, 24, 1, -104, 218, -59, -64, 200, -16, -332, -92, 14, 274, -120, -226, 233, -185, -104, 23, 116, 9, 179, 161, 47, -66, -5, 248, 98, 99, 188, 151, 248, 40, -14, -87, -30, 197, 69, 63, 0, 280, -116, -28, -23, -40, -108, 269, 336, 36, 340, 152, -242, 168, -149, 28, 184, -27, 67, 57, 166, 119, -42, 117, -161, -350, -16, 113, 39, -35, 56, -121, 126, -55, 63, 265, 177, 97, 324, 127, -41, -343, -53, 139, 287, 53, 165, 173, 130, -203, 109, -6, 71, -95, 78]
2607G8j62n7n2L8M09l04q7J18J03m25O01j10l45J33L32l77J15j71L45k60q7J77
2629A2K7q5J4J80j59R5R0k79J48k02M05j28k4J0p8J87m44K04O1J38j57Q3m7j51
2653a00N5J13J14m03L29k36M32m00N2j72K61j07K14j68j99K04O8Q3k70J14O8Q4
2675A36l78J43J6P6J81k47N7J91j30k46m7J52K71M1k22l2P5K28k66J44O7q5m31
2698c06L87j16j79J91K80r5k49J54j55n1J78j33L44j96m81L96K19m23K97k10K22
2719G4j11p6n2L9J67j88R6R1n1N8l1L40m09M2K16j25j71k9K35r4J41l50O2P3K5
2744b8k57L11J95k38J0K8j33P2j9J04j72j06J65R7R6n2J05j99j61J69k42J44K00
2767H9J96j67mK47m16K20q3k33J82o7k67K91r7J76l22M27k14J15K78m33N2P6J1
$$ y = [78, -84, -141, -193, -155, 254, -50, -137, -19, 84, -341, 260, 150, -195, -62, 270, -107, 8, -163, 182, -78, -165, 12, 39, -46, -32, 148, -11, 84, 174, -105, 43, -159, 246, 118, 94, 104, 26, 213, -231, -27, 34, 172, 15, 98, 51, -100, -45, 68, 182, -221, 108, -128, 304, -96, -44, -216, 45, -62, 152, -16, -215, -11, 57, 140, -130, -16, 52, 136, -242, -99, -83, -7, 174, -73, -16, 175, 45, -201, -248, -96, 175, 216, -6, -38, 37, 265, -1, 143, 210, 125, -306, 81, -35, -214, -23, 257, 162, -87, 67, -88, -139, 39, -94, 250, 54, -427, -31, 188, -235, 62, -148, 74, -37, -113, -165, -126, 41, -147, -51, 40, -11, 47, 16, 356, -53, -11, 205, 80, -91, -120, 115, 21, 162, -188, -126, -53, -28, -285, 26, 221, -17, -7, 21, -112, -40, -59, 45, -127, -233, -68, 29, 125, 73, 178, -21, -182, -13, -255, -111, 89, 285, 118, 114, 361, -55, 165, 82, -151, 31, -36, -303, -12, -109, 67, -255, 172, -42, 73, 351, -82, -30, 46, 57]
2790E7P5o8j47j11J88q8l7L45r2j56J7OQ9j7j22Q7j23j52J12J20p0J64j29K12
2814A60k06j04R0j58Q7JP3L4J15kk03J89k23L61r2Q0n39M76j11l40L53K4q2O7
2838E0J12qM0m3q3r9K04j45j60p8R3K38j38k25J07K09p9j18L6M2N5l2j92K24R
2863A9N6j00N8Q9j93Q5K66k47k9J11j67j9l7Nj47M17j44Q9P0m62L43m9k16J91
2887a1N1N8k92K30k64M11k33j09K13j53J83j8k84L92J4j91l2J38r0n6N3j23j7
2910a30M20l85M2K05j86L2j19L22k14J69j90j87K73j31k47L58L6J5k35J47J31
2931A26k57K94q7k08J48j88L6K15j76q7J41Q0L05m16K98j45j66O6k25L15j01K31
2953A99j95j44K20mq3j79K13K14j58k13P0j84Q7O0J01q8K98j88oj45l4J64NL08
$$ y = [57, 132, 64, -83, -194, -6, -94, -131, 214, 122, -34, -17, -11, 78, 61, -61, 26, -97, -249, -137, -17, -87, 77, -52, 160, -46, -150, -60, -218, -131, -130, -57, -23, 92, 90, -113, 76, -147, 214, 122, 202, -337, 139, 28, -312, 41, 65, -17, 50, 162, 154, 194, 151, 68, -31, 173, 28, -132, -210, -117, 121, -17, -242, -135, 74, -5, -123, -87, -45, 10, -22, -214, 10, 19, 75, -25, 33, 122, -71, 14, 280, 33, 4, 115, -52, -71, -108, -103, -250, 167, 23, 112, 182, -280, 63, 14, -202, -11, 40, 98, -194, 36, -228, 183, -50, -159, 54, -99, 84, 66, -218, 174, 188, -3, -35, 103, 13, -43, 10, -113, -130, 290, -95, -53, 152, -34, -2, -121, 201, -13, 156, -34, -221, 52, -79, -326, 32, 68, 83, -152, -5, 126, -131, 163, 76, -132, 16, -172, -136, 79, -97, -184, -43, 37, 342, -74, 224, 79, -87, -21, -246, 69, -32, 199, 4, -140, 80, 76, -7, -186, 27, 241, 83, -130, -60, -244, -157, -97, 4, -84, 214, 26, 20, -125, -159, 5, 10, 318]
2977C18l59n2K87l69K03j43J08K73l18n8J15J03o8k32K05J38o8k55K7PJ14j5L02
3000B63l97J18p7O9N9j37K94K0k03J35l03K89j19K99k05J18l71J79P1k28J99J4
3022H7j74j34M19j77j23O8N4j79K76O6l08O1oK23l26j03L18k52L14j62L13l60
3044a05K60J23k17R4j79J36l3J35l65M72j4j12j22p7K20j51k52J06K96m96R2K67
3066G8r2l2Rj0k4L47o34M41J77o26N43j95J9j17l4K52J89m44N7K18n9k54M14j15
3090A08j02l5L5L30k00k76J36K18l07J03j82L89l53K44O6n4k04M0P8J14j25m8
3112b5p5O1N8JJ77k08K77l2k52J22L2n38K79J20J01j26j07L51j75j09J79k37L5
3135i1Lj50J0N7R2J81j54K3L29j07j43l04L3J05K4P6j38K29j10j91J90m6J17P7
$$ y = [318, -41, -93, 194, -175, 28, -115, -7, 266, -52, -110, 5, 108, 40, -192, 13, 151, 83, -172, -145, -138, -24, -39, 263, -134, -16, -93, -24, 35, -102, 192, 212, 9, 144, -159, 130, 11, 310, 105, 223, -148, 31, 102, -126, 73, 87, -87, -221, 198, 21, -102, -34, 20, -159, 117, 183, -125, -64, -70, 153, -173, -276, 42, -210, 104, -58, 255, -105, 155, 278, 61, 155, -24, 112, 79, 214, -151, 321, 307, 195, 73, -4, 216, 65, -187, -81, 215, -281, -189, 78, -14, -46, -37, -47, -71, 276, -358, 83, 260, -366, 177, -18, 1, -116, -150, 102, 291, -153, -96, 122, 63, -191, 223, 108, 6, -29, 6, 336, 136, -140, -4, 214, -93, 10, -172, 217, -136, 108, 174, 120, -84, -44, 34, 148, 23, -25, -100, -39, 19, 20, 197, -11, 266, 234, -18, 104, 136, -402, -123, -3, 98, -28, -135, 216, 41, -68, 111, -126, -91, -88, -238, -228, -171, -79, 102, -52, -29, 300, 193, 50, -254, -221, -116, -92, -16, -154, 75, -35, -226, -36, -82, 35, 112]
3159A12j17o4N8o3J72P4j84k28K3K74o1J53N4j20j51J16j71L0o7J45m0k1o6L28
3183A86k67L7k10L32q6j76M2N1L15J51k18k78M86k87k60J22J22K97l97O1J65n53
3205c65L97q5O3J25K9k21J03K37k45N9j35o0o4L15K10k98j7L18j09l80K23n2o8
3228b0mJ33j57Q2J99O1m11J84j88nL62k45J41r0o5r3J18J18Rj89o2J57J33k52
3252h4j8JM5L89l39j62j51K54M4j88J05Q2J41k06OK3N5j43N0j98M95m52M80j65
3276F4M8qj59K8p2K35j19j86K19j11Nm4J79j08j59N34m78K39J2k08K7q4L87k77
3300c6N9j73M3K14j57J37J88n49L99j18q5P8O7o3J23j55K59l12J04l12K43M3o7
3323g0J04j0L7j84k9RK57m38L97j59K68k0k34J12lq6O0j20n1Q4K54p7L02m91N9
$$ y = [112, -5, -69, -11, -74, 98, 172, -12, -240, -217, 57, -4, 149, 203, 83, -68, 48, -123, -93, -160, -15, -55, -76, -142, 186, -81, -44, -254, 78, -8, -184, -142, -91, 224, 375, 157, -121, 365, 78, -182, -60, 62, 359, -38, 23, 188, -365, 32, -53, 10, 135, 164, -57, 46, 283, 38, 97, -38, -98, -162, 153, 363, 65, 48, 366, 257, -123, 100, 48, -20, -24, 109, -48, 34, 233, 294, -117, 67, -121, -126, 236, -9, 132, 42, -23, -116, 2, 120, 129, -60, -122, 35, 168, -84, -102, -101, -56, 333, -6, -168, -319, -65, -21, -209, -104, -22, 119, -87, -81, -58, -3, -146, -96, -294, 201, -251, 229, 64, 112, 104, -55, -27, -99, 136, 17, -169, 50, -61, -56, -100, 79, -29, -188, 346, -132, 107, 119, -89, -62, -146, 241, -36, 23, -150, -107, 107, -50, 87, 275, -274, 125, 7, -78, 0, 67, 4, 127, -28, 231, -81, 23, -289, -46, -3, -70, 34, 24, 61, -123, -152, -143, 114, -324, 73, -86, 182, 162, -72, 40, 37, -49, 11, -109, -160, -76, 178, 101, 403, -88, -29]
3348b9n5O6K51k85L13j57J15l13J1J25J46k88O5L32l83m8L53j66q0j3l8J98q4
3371C6K7MJ1pk66k5R3K20l33K70p2P9j43j2J46j14P4K15k03l3J24j10l52L54o0
3396g7J59l8j31q5m7K9J12K31j62K72m58J85j4K26j97OQ0p4L34j67j83J76j24
3419E3j80J56k24J95k8j00K36j75QJ92k24L72k88J79P3r4j81J2J04J26j23k43
3441a54K82K23j95l47L39j01j74L60r6m36K42j10J35J22k4j14K95l22k00K41J6
3462a8k08KJ69j6N7J04K5j94K79j22q0k19L22k17L77j15l43K01K91n55L89k6L24
3485D27k92lK6l3J09k65J48l9j90K58n0j11j4r5m7O5L80k88m0Q4Q6k16j1O7j03
3510a47r0L38oR0m78K35n4J0L8J73j52J34L1P4k55j02J82Q8K8q1J15L5k02m4J46
$$ y = [-29, -84, -18, 233, -52, 261, 104, 219, -94, -83, 42, 188, -100, -35, 297, -86, -134, 219, 53, -27, -40, -78, 120, 36, 63, 67, 78, 71, -195, -220, -127, 93, -240, 30, -42, 37, -106, -118, 28, -86, -12, 203, 0, -33, 91, -19, -371, -17, -77, 82, 44, -87, -172, -219, -190, -78, 153, -9, 263, -195, -10, -24, 202, 5, 11, 91, 17, 351, 184, 1, 177, 53, -127, 29, -195, 0, -28, -128, 108, -67, -59, 133, -91, 281, -7, 172, 245, 151, -30, -18, 86, 212, 89, -154, 128, 351, 156, -191, 148, 47, -127, 233, 137, -299, -57, -167, -32, 90, 66, -48, 247, -75, -275, -34, -18, -226, -224, -55, -71, -14, 90, 115, -79, 200, 78, -2, -221, 101, -116, 261, 146, -197, 4, 295, -260, 129, 103, 427, 135, 132, 158, 125, 234, -31, 117, 78, -112, 146, 96, -15, -29, -124, -171, -106, 274, -14, -54, 30, 116, -100, -111, -44, -147, -237, 101, 95, 185, -293, -58, -112, -102, -64, 109, -43, 91, 122, 196, -59, -161, 21, 109, 137, 56, 171, 206, 4, -40, 106]
3535A06O0k06OR0j06j90J43O1j87J70o6L32o2o1k35J17K1mj61R7J38Pj75K59O6
3560B20j09p5O1J56j78q6N5o4R9p9O8r7K82j20k0j18j65K94K5K0m06L16J21k98
3584i8m9K85l29L73k36O0o6j67L99j47j59MJ31K36j18P3k20P3L4L6k33P1L15k52
3608A6j40MJ09j65k9J85k98L31J34j45N6k95J20R8L99l78o8j97K60p8L49m62j08
3631c02M77l39j94N97j05k10nK35P6j59k6r1K4rJ11J6k95L78k30K00m3pm08K77
3655c2j31N9J14k21K60L8p9k61J93J91j89J2q7L02Pj04k16p6J34RN4J92k0qr2
3680D9K8mp4J9J50j80p8J21J6p5J48q3j99R1m3j18K37rO5k97N32k84o6j92K35
3705a1p1Q3M12k62k26k1K4m7O0l9L50k62J11k9J38l77o2N53k7l66j07j1r3L60
$$ y = [106, 166, -40, -34, 56, -50, -240, -97, -36, -223, -53, -119, 213, 151, 90, -145, -28, -7, -11, -172, -75, 63, 70, -105, 154, 220, 111, 36, 97, 253, 75, -11, 44, -20, 79, 0, 68, -29, 253, 133, 113, -5, -170, 124, 149, 169, -237, 79, 200, -98, -147, 138, -191, 182, -54, 6, -60, -227, 172, 25, -134, -130, 1, 237, 119, 192, -28, 45, 79, 115, -118, -47, 268, 16, -124, -120, -11, -176, -205, -20, -318, 13, 147, 2, 58, -237, -117, -19, 380, 2, -66, -263, -3, -81, 268, -194, -302, 175, -164, -358, 239, 134, -76, -81, 154, 230, 71, 45, -46, -22, -31, 80, 96, -199, 179, -51, 149, 106, 99, -309, -32, -163, -104, 10, -211, 49, 87, 8, -253, -60, 131, -58, -46, -133, 169, 176, 72, -144, -220, -86, -77, -23, 169, 149, 141, 49, 77, 73, -1, 18, 168, -12, -90, 31, 47, -28, 120, 37, -162, -71, -114, -232, 5, -4, 61, -236, 296, 12, -54, -246, -11, -82, 1, 413, 151, -75, -96, -72, -119, -59, -98, 252, -10, 101, 72, 210, -167, -229, 324, 297, -69, -176, -187, -280, 80]
3729H0J3lj95K9K18j4p5r1K40j04q1o4K11j35nJ20j40k62M03K9k44j00L9J39J26
3754A34n3R4p3n03N33k62J57J03K3m16M22j46Q4k28K64n7j53K73k66K4J37j75
3776h4n0K90n7k65J83r6M2j80M00k13J95j7j39q2J08j03M1J98k81J09k06k5M51
3799B19j04l65L87k21O8PL57l30K13l73R8K1kJ95m10J12P7q9N7J90ll39J40Mj8
3824a09J61J29j47k06M47l65k35J67L10j61k05J23K32P4l26N5rj62M9J57J31l06
3846a96L08k8j25K21k57O2R7rK07k64j23n5M47m16P0K96l44K3J85l11K10J02k96
3869a96K08k62K38m7o4K09j38P3K28k16k11K79j33k4j50K04j78K59l69K61j55
3890a84L12O5m69N2J77J95nj75n8MJ07l9O3j1j50J75k93J30P2RK87k57J8O5j04
$$ y = [80, 93, 90, -105, -76, 142, 128, 53, -38, 202, 98, 17, -47, 164, 29, 24, 144, 4, -258, 145, 174, -70, -170, -131, 8, 134, 81, 175, 102, -401, 132, -130, 27, 130, 153, -263, 159, 13, 97, -131, 133, 76, -77, 196, -70, -46, 91, -84, -134, 156, 99, -166, 17, -79, -37, -217, 183, -30, 165, 148, 9, -73, 35, -68, -27, 171, -110, -1, -207, -232, 219, 115, -250, 137, -84, -16, -9, 348, 18, 231, -142, -44, -23, -25, 170, -240, -128, -51, -140, -83, 107, 104, -235, -95, -91, -109, 52, 181, 34, -172, 275, -90, -325, -158, 152, -9, -214, -91, 141, 215, -111, -56, -65, -227, -178, -21, 110, -196, 112, 84, -41, 180, -77, -15, 82, 73, 280, 16, -107, -162, 285, -131, -61, 235, -109, -86, 99, -212, -2, 100, -196, 12, -250, -12, -59, -123, 86, -52, 21, 249, 33, -178, 101, -32, -56, -206, -2, -180, 79, -290, -29, -184, 128, 193, -276, -224, -47, 148, 143, -32, -90, -86, 21, -18, 45, 34, -116, 59, -234, -104, -32, -23, 264, 7, 25, 90, -14]
3915a4J75o4k09L81j24k76J38Jn3K80l93j99L43K5N5k73K90j3j27L9J27Pl23L13
3939A06k68J38J41k49J69j60M5M12l25J44j54r5R0J75k55j27L47k50%J20k34M15
3961A85k58Or3j63L27M9J39j89j0P2l04L20j49L4J61k94J25j18L5J81j46J04o2
3984d8MO8r4LQ2M7j87j93L83J95j03k91K71k25j03M47m77K92j05j21J02J72j13
4007Fq8o5K9j10J65N7l3J62p9k05R6K30j19o5N5j02K80k62l3O0K10M0k83pN2J1
4033BN9j81j40K96j44O1P5j50J64j13k3J2m9L1J32q9k33K15M0J8J21k49J10j78
4057b13K13J70q3k41K31o5m9J16k82Q9L26j85p8Q9j67J51q5k32K63J95P6m11L15
4080A43k33r3P2J74j46N5L7o1L74l65j30J35J21j04k61J69J30J32q1Ok07L00k17
$$ y = [-14, 161, 97, -112, 269, 145, -131, 7, 8, -45, 235, -158, -357, -14, 11, 66, -207, 83, 70, -57, -18, 109, 116, -207, 106, -162, -24, 117, -132, 37, -123, -78, 334, 9, 153, -1, -96, -6, 169, -86, -213, 134, -116, -116, 4, -230, 185, -73, -67, -160, -323, 4, 53, 192, 3, -7, 65, -239, 81, -68, -34, 127, -167, -42, -160, -125, 56, -90, 14, -48, -44, 24, -70, -67, 15, 62, -125, -318, 65, 260, 157, -134, 137, -88, -191, 256, -221, 71, -34, -155, -53, 119, 6, -82, -147, -118, -228, -63, -6, -39, 123, 44, -161, -65, 165, 46, -19, 36, -66, 214, -48, -81, -21, 189, 229, -54, -61, -9, 2, 61, -120, -260, 36, -108, -47, 28, -122, 42, -71, -94, -82, -131, -100, 32, -57, -290, -75, -35, -17, 104, -145, -35, -213, 0, 170, 87, -154, 77, 12, -37, 79, -203, -114, 212, 27, -51, 38, -129, 22, -63, -295, -32, 163, 239, -172, 143, -90, -183, -111, 63, -83, -28, 9, -52, 322, -43, -173, -38, 83, -21, -282, -113, 17, 149, 68, 74, -133, 167, -50]
4103e0q4j06L5L87q9l06K66J2M9k34n1q4N03j12m32K26j82J72K00o4Lj33M1K01
4127A68r6l9K02k3k89K94k97L46m93J52K15J5j17k42J96mJ02k19J64J7R5k04J65
4150A08j95r5J16K49l35P1J7K37j94jL82k68n8j09K89n1k1k92K15l7j9j8k9j9
4174e7K9K73n32L61M2J18k44l24K44J21p6j68K66K1j5j64N8K30m11N2K99L2k29
4197g4J03P2Qm83N17j47j79R1l33M46j27Q7O7l24L79O8j62K9l23L24l41L78k03
4220a27q9kK81l75M51j34j64N6K12j74o6J22J6m8J3o3j1Q9l09J64K66J03k95q3
4244a67L21n0k44J2L45l74p9PjJJ64J18k0q7J17O1l31P2M49l76J87k07R2J89k79
4269h0M9M20l52n2K9j04J65m9j05J83ql55K97O2j70j15L37k10K2m2K20kj41m1
$$ y = [-50, -134, -240, -205, 182, 93, -213, 53, 65, 114, -120, -171, -255, 248, 136, -296, -70, -252, -80, 120, 56, 59, -74, -33, 168, 72, 33, 235, 212, -77, 217, -80, 266, -227, -75, 140, 155, 38, -204, -8, -12, 90, -129, 35, 52, 147, -57, 108, -87, -182, -66, 183, -152, -81, -64, 173, -21, -22, 360, 92, 34, -75, 214, 163, 142, -150, 65, 28, 9, -9, -38, -57, -28, 245, -287, 74, 116, 234, -10, -334, -90, 31, -45, -213, 53, 74, 59, -105, -47, 183, -228, -176, 123, 155, -74, 29, 101, 109, -374, 143, -4, -183, -92, -425, 21, -106, -19, 48, -276, 103, 171, 9, 38, -285, 39, -302, 76, -127, -216, -218, 63, -312, 139, 5, -159, -103, 109, -65, -131, -9, 7, -41, -28, -91, -102, -13, -322, -158, 108, 211, -84, -167, 154, 104, -140, -128, 217, -157, -236, -229, -230, -229, -65, 53, 33, -54, 63, 124, -207, -135, 314, -62, 125, -82, 10, 199, -80, -31, 389, 37, -15, 14, -90, 75, 26, -79, 104, 96, -259, 38, 100, -70, -185, 152, -58, -36, -78, 142, 140, -1, -42]
4293d2R5q0Q7q1m5J05j45j00K27o8N9k79M08j69j10J51o7N5k4j73K49n8L67k20
4317A42k44n3j15K43R5l15K1L02k5k91J92J07j56K30j83O0o5j06L78j02m5j58
4339h8p6L54n6n3j21J80k14J6Q3R4K43k28m22M28l23J48J4j15L49k36J73k42j17
4362b09L50l12J6L19m3l95K02J63j29q3K69j99L20j75j05K28k41j56N0O1J44m8
4384B7Jj56J61J02k69K20k60K36q4M4J08j09r6KK24j30J68R4l59l0j00K14J12
4407A20k06J10j10O9j18J26k02J22J45NJ6j59J30j9j83K83l17j17J75P6q4j00
4429b38K38p9k9K89o8k46L31l25Q7J16p3K65k97ML53j44j4j22r9R0J50k59K65
4452A95l60M4J46p7K15k64k7J73k0M8M9l2Ok82L47k98K18j09j01R0N7K44k02j90
$$ y = [-42, 53, -27, 60, -21, -66, 39, -106, -206, 21, -47, 12, -267, 141, -28, -138, 13, -54, 1, -23, -196, 53, -5, 362, 142, -102, -155, -270, -27, 68, -247, -226, 76, 51, -240, -48, 59, -97, 133, -50, 10, -55, -161, 217, 115, 70, -88, -164, 190, 134, 81, -40, 140, -74, -58, 25, 119, 362, 134, -288, 140, -183, -35, -21, -136, 213, -23, 150, -92, -209, 141, -171, -155, 164, 121, -274, -72, 91, -38, -121, 148, -51, 269, 94, -11, 217, -24, -180, -130, -69, 75, 27, 28, -128, 33, 135, -134, 86, -174, 62, -22, 22, 130, 21, -75, -73, 151, 21, 189, 283, -76, -106, -206, 8, 120, -86, 24, -86, -17, -135, -9, -211, -89, 56, 61, 77, -82, 48, 29, -154, 129, -188, -305, -130, -54, -138, -238, 0, -79, -108, 181, 113, -133, 198, -127, -40, 76, 3, 268, -29, -25, 328, 184, 170, 48, -51, 39, 189, -70, 195, -165, -121, 25, -52, 163, -101, -128, 45, 25, 73, 122, 90, 96, -186, 161, -137, 81, -28, -129, -39, 18, 262, 60, -130]
4476a30o8K79Q9k73p0L39m69K40k4Q3l4P7J14j72J47r1K0j10L4jj8P1k5k9mj50
4502a75J20L6L3Jn1j36K1Q3K45k85K57J4P1j97j60L02k4k83K18p4k81J47J61l81
4526c38L81L9K9l48J65K57k50P7l7O0j05l8J31Q6j06Q4k1J57N8m08J79J31k69
4549h6K4M0p1m6L38J07k84p9J88q9J36L3j35K55j32m3k45K56l50J7N24k01k62
4572a05L9J68k64K77k15L27k19J10r3K02m84NK62j17N9J13j68J62n4l14M54k27
4594h2K17j55K56k97M80l56R8M0k93L17n14N03k70J36mj97P8J6PK10j40j60K21
4617A11o4j13L4l0K4Q2j41K6l89M40j00N02k91j72L00l04R0K3K9J32k93K37m12
4640b79K88N4l2k0k13K84k4l3m8r8K32J7j27L60j16l28J35K62m03J84O6j42N0
$$ y = [-130, -198, 81, 170, -103, -173, 166, -303, -63, -87, -4, -38, 39, 153, -19, 128, 37, 57, -53, -19, -20, -38, 33, 8, -21, -25, -175, -55, -19, 14, 15, -36, -172, -151, -68, 177, -108, 149, 163, 234, 37, -123, 179, 155, -128, 90, 16, -265, -118, 43, -338, 43, 82, 111, -237, -72, 185, -65, 12, -25, 35, -70, -108, 23, 109, 3, 87, 66, 223, 281, -127, 52, 183, -86, -62, -22, -93, -139, 199, 306, 22, -57, 131, 42, 178, 211, 76, 331, 199, 156, -89, 167, -183, -166, 358, 157, -105, -66, 102, -162, 115, -100, 227, 8, 118, 25, 227, -257, -252, 10, -107, -48, 65, -103, 59, 5, -309, 145, -82, 135, -20, 236, -61, 419, 63, 161, 201, -92, 225, -289, 214, -56, 80, 76, -121, -43, -27, -20, 190, 50, -110, 111, 47, -66, -32, -62, -38, 44, -97, -71, -460, -20, -120, 382, 91, -81, 219, -85, 5, 28, 57, 189, -104, 133, -279, 9, 63, 31, 11, -202, 82, 58, 25, -23, -121, 111, 128, 1, 361, 245, -83, 52, 314, -89, 95, 161, 19, 69]
4663F9J8j2p1QJ51k96j53K68P1l3l3j26J05L2J72k24j3R7j18q2M2R4j4j9R4K1
4689D8K8k96O0o6J2K38K98l92j57O06k78J3Nj44J29r0O9j10k86K3L19k66L77r8
4713D2K15j51P6m02K25n6KQ5k17L11j35j2j61L27j30j08K5r3k04K04K14o7K72
4736B62k77K14k57k47M90j52j49O6j19K11J8K0k90M9K99k84p8L51j75j5r7J65
4758EK8r6Q0j67j60J45J77K9o7K20j21j17o3P9Jj51J02J26r8jJ61l9k08k03L52
4783A4Q2o9L2q0j7K53l83J66k51K08L7K8N1m2q7L7J57j75l34K79K5k87L65O7k78
4808b02Q4P8l3j53J46l42L40j79J63J22J40l0j23l97K64K26k10L6M3j09K0j80
4830b96L8K28K4o0j4J35O%j79L36l36P5K00m62L40p9M1l7p7K55r0k50J72J77j32
$$ y = [69, 87, 75, 4, 12, 163, -133, -286, -18, 53, 20, -13, -139, -34, -2, 170, -54, -67, 30, -88, -170, -128, -34, -48, -67, 27, 48, 76, -220, -160, -226, -214, 24, 322, -70, -227, 379, 101, 114, 119, -25, 104, 14, 83, -27, -313, -290, 29, -237, 140, 42, 257, 106, 182, -220, 5, -51, -49, 36, -181, 130, -5, -17, -178, 149, 19, -89, -64, -157, -361, -157, 57, -10, 262, -15, 199, -58, -305, 185, 33, -116, -50, -169, 42, 60, 80, -210, -161, 138, -146, -224, 127, -48, -63, -160, 5, 33, -63, 17, -150, -310, -165, 12, 41, -26, 194, 73, -44, -107, -28, -27, -178, -76, 50, -48, -49, 112, 73, -135, -338, 14, 96, 27, 59, -21, -38, 215, -168, -2, -253, -45, -8, 20, 71, 29, -58, -21, 136, -39, -373, -94, -69, -356, 9, 76, -202, -118, -40, -73, -226, -80, -422, -82, -261, -98, 24, 164, 134, 11, -386, -122, 104, -106, -70, -27, -136, -116, -296, -258, -30, -6, -66, -80, 55, 61, 61, -118, 218, -118, -43, 157, -305, 35, -44, -3, -40, -117, 138, 48, -202, -30, 147, 15]
4855A5J04M3k14j40M06k78k9R2l72N18p3l35L65OK12m92l0Q7K56j47J07q2m2j47
4879a70J55j01J93q1n8J58k87N23k34k09K14J39k26J21l08J73p5J23J07k32Q2
4900GN9j13R7k47L31j24K43k26J7n2K47k73J36J63l01j1rO2J69k15j81K69j41
4923i3O4p7m4J52l22L16k9K01l68Qo7M38O6n32K66Rp4J75o9R2l28K43j1q2R8m5
4949a3J2j33j45M37j02m1J20J78j12k91J04J2K62j12k29K89r3j79jq2J37j01J78
4972I5k03l1J99j67J60L2p7k00J6N39k43j47J25k31R4k81N8L48l15L35n3J31j53
4995C1q8k4O8l9M8o1K6kP8J2r6Q4l30K52mJ93k9k57J62p4j9O1M2j25P9L9j09k02
5023b84L22J28M0m83J14K05J67j19j02k7R4J91o3k23N8j09K40J83l51RK46j77
$$ y = [15, 119, 162, -52, -192, 214, -64, -93, -1, -373, 145, 72, -263, 102, 108, 320, -172, -202, -115, 141, -6, 101, 19, -23, -170, -15, -116, 77, -4, -62, 96, -191, 332, 98, -111, 103, 242, 16, 137, -171, 2, -73, 50, 157, -75, 7, 66, -47, 50, -197, 134, 10, 253, 27, 44, -8, 239, -34, 102, 265, -36, -47, -56, 6, 175, -40, -221, 48, -93, -29, -106, -150, 2, -320, -4, -33, 168, -200, -192, -259, 179, 245, -287, -21, -12, -86, 89, 20, 112, -216, 27, 16, -66, 32, -13, -1, -134, -279, 158, 56, 15, 135, 313, 201, -90, 14, 26, 288, 176, -53, 236, 143, -36, -37, -119, 18, -83, 95, -108, -139, 60, -107, 53, 85, 8, -192, -176, 363, 120, -27, 98, -133, -39, -320, -262, 86, -229, 106, 53, 184, 31, -57, -81, -13, -52, -4, -65, -39, -41, 37, 49, -47, 37, -293, -41, -45, 148, 119, -138, 24, -50, -69, -8, 34, -91, -12, 27, -82, -284, 38, 166, 206, -277, -163, 42, 209, 90, -12, -39, 55, 246, 183, -40, 18, -91, 149, 332, -19, -10, 236, 59]
5045E9J00p9q7r6M5J47k2N6R4l96Q3J4J76l09K23J04k45L0P4J17j56N5K25k27
5069a5M8P5m18M5N10o6R4l49R7k26K48Qm48M48k56L0K06k8O5m6J11j15k15K46
5093D9k80J12J16j0K16k97j06J16K11l37K27j31j7J79l2P1p6J62kP8l90q3K00
5116b4j77K03J41k33J30k44L39j28o2j5j40m4L24J13k9m01K84j29jJ47j88M61
5138C27m32p4J26J8q6J93j23J03k63M12k62l1k6N2L62o96L65j2K20l0j24J32J16
5161B67j32k79j07M37j22RK67q72P81m66L56k61lJ83q8N5J62k42r6j50M40j74
5183c5L4L19n35L48j82N9O0j01J3p7J25K64n06J02J02q9J30J72j56J02k02J72
5205A19j55J15k06RM08j13J5k76K99j62j05K11jj89J06l16J54M00j83j2l3k4j21
$$ y = [59, 159, 80, -7, -103, -58, 89, 67, 123, 217, -179, -96, -82, 94, -215, 8, 112, -133, -103, -29, 88, -68, -13, 212, -15, 33, 108, -310, -265, 245, 179, 273, -76, 21, -205, 43, 51, -397, 51, -205, -175, 31, 3, 68, 22, 133, 18, -197, 49, -231, -119, -3, -13, 203, -94, -200, -84, 127, -210, 17, -114, -131, 48, 16, 87, 11, 173, 171, 249, -141, -224, -24, -201, 2, 143, -90, 40, -204, 135, 7, -55, -70, -210, -254, 70, 183, 154, -247, 37, -92, -93, 54, -134, 327, -105, -179, -53, -35, -121, 72, -51, 52, -211, 201, -61, -92, -118, -66, 296, -400, -35, -47, 173, 143, 19, 151, 267, 135, -144, -251, 186, 64, 73, 340, -532, 249, -217, 139, -122, -125, 58, -30, 25, 187, -55, -151, -301, 139, -35, -1, 318, -217, 131, -51, 8, 68, -33, -20, -97, 28, 292, -214, -112, -10, -99, 31, 203, 47, 149, -53, 119, -36, 79, -127, -118, 290, 177, 192, -84, 215, 53, -52, 159, 158, -31, 75, -241, -87, 313, 130, 118, 85, 61, -60]
5228f0q5J59J87k85K35k19o3K7n0L17J6q2K1j4j21K05J2j78J78k25j88J81k19
5251b51K44R2m3j29k7J16P1j91M2K54k31MK51o0m65K9L93j23P6k7P8J18j13kj27
5276b1l8P1j76K12J81k88J40o2j56J89L0k20K45k32L05k99K62k72K14j1J00j67
5298Gk20K84qj38j65J37P6L23j77J1J04j34k47K91m29J05K15p2rJ0MJ19n8j22
5322i3J30r6M4rK25m40P6L68l84N5J01r3K73k20K30l07K2L11m0k01J52N4R4j03
5346A49j89m2k65K56R5j5j11K83j02l6P6k29J03P8k24J61j36J88k3j30J47P8J47
5369B59m40L47j11M5j15j43K46j05K5r4mL65m56n0L79m7k5j19J0o4kj13K93L9
5393A20l12QL9L49j29j05J27k70J02J48k44J79J07j56J14k21qQ4p9L37o0N7k34
$$ y = [-60, -145, 14, 201, -84, 151, -68, -131, -104, -154, 163, 179, 97, 118, 104, -17, 188, 200, 22, 200, -25, -213, -32, -251, -7, 85, 42, -87, -114, 2, 73, -118, -76, 178, -53, -49, 202, 142, -323, -294, 99, -24, 52, 25, 103, 221, 108, 106, -21, -59, 12, -164, 48, 229, -59, 81, 19, -137, 52, 82, -138, 107, -125, 180, -119, 143, -129, 85, 74, 174, 7, -213, 71, 63, -75, -240, -103, -27, 296, 119, 130, 234, 100, -147, 144, -285, -180, 35, -37, -46, -36, -32, 87, 29, -93, 37, -59, -15, -24, 201, -239, -163, 205, -179, -124, -23, -116, 157, -63, 167, -140, -118, 193, 153, -48, 104, 158, 252, 149, -40, -82, -347, -91, 4, -11, -122, 161, 59, 23, 99, -130, -27, 51, -173, -12, -148, 40, 17, -113, 34, 112, 259, -181, 166, 55, 100, -15, -158, 88, -17, 8, -86, -90, 275, -181, -231, 148, 101, 76, -43, -33, -97, -99, -212, 81, 120, -192, -184, -145, 204, 75, -30, 97, -173, -71, 77, -167, 12, 119, -37, 77, -144, -152, -68, -147, 190, 130, 187, -47]
5416d7J52j38J8p4K4J34k57K43j33L18k87J64k90P0m7j85K84l0m0J93j14R8J12
5439A68l31J18N0m0K52j95J32k09Q0p5p3o7J61J8j01L22Lj6m7q6k16K56j65L55
5463B94k74r1pj46J8J49J0P6K58k14K88n40J73J16J39m0L9l02l4m3K60k57L0l1
5487a29M1J84n5J30N8l40j6m3K61m31M04J23l53K14p6n3J0K44j70k37J82MK28
5510A80j18q3J77j94q7j16J51k09L73k27J86J87j79k36K57P4k76R2R4nP1K1p8
5533E5J64k22k9j37J94j44J95j46qJ52J73j14M7l28L61j65j74K91l41L14O5rl45
5556a51K31k66L5O8m7K54j73R4m31O09j42l94L28m4J32j85J70k15R9k4K15j25
5578C8l65M84l05M4L5J93p4J46q0N3j53r8p4K5K07L6L0j43q5Q6Q4j23O5k12J73
$$ y = [-47, 105, -33, -15, -89, -65, 69, -188, 55, -78, 240, -47, 117, -173, -103, -150, -335, -51, -81, -121, 72, -42, 56, 168, -163, -45, 5, -35, 217, 22, 154, -55, 25, -50, -123, -190, -29, -11, -112, 210, 213, 197, 150, 64, -152, 104, -61, 294, 20, -71, -78, -224, -206, -57, -47, 29, 287, 73, 361, -179, -6, 110, 249, 209, 248, -54, -88, -131, 129, -128, -98, -129, -88, 96, 41, 171, 229, -111, -127, -170, 91, -340, 64, 187, -166, 48, -28, -81, -71, 173, 3, -234, -52, -48, 180, 62, -21, 156, -38, -125, -241, -90, -299, 74, -153, 33, 220, 41, -195, 62, 136, -140, -48, 46, 41, 112, 133, 55, 219, -3, -32, -169, 25, -119, 76, -70, -78, 74, 247, 133, 180, -148, 213, 48, -126, 165, -176, 138, 203, 194, -151, 80, -186, -151, -83, -130, 124, -49, 45, -386, 223, 81, -313, 15, -29, 103, -82, 88, -127, -28, -52, 163, 38, -327, 157, -148, -104, -69, 124, 50, 196, 116, 169, 16, -82, -156, -131, 76, 112, 142, -1, -86, 0, 84, -39, 26, -186, -13]
5603a3K79k62j4J32j4n15M69J36n8k50j7K13k64n9K86j40K6J45j00L89k76l65
5625b72K26K47k76LJ06j31J91K8k15J22j25N7J52j92rK94l9j01j07Q3m73M81k27
5648a77L39l9k98K94k19J20N9L8Q4k61k45J81L54m12K64r0J14q8m3J67N2j02k9
5671F3J50k81K22k53L3J10J77l45J8L50k47j8Q6L0j12O1l04O86o12J9P6P0L28
5694C07k58m3L3M43m17J91j37l76K17l98O15j5l26K00q7n4L2L6kn2j5KK40l49
5718b13J72L9J03j23j76J54N4j88L01k10k33N01m51O55j77m94L37L2o4mj61M81
5740C35l27J26m09J79J50j76j4L35l38k88L37j62K98j56J22j93J87k1J15k26J18
5761hJ37k57j42J82R6l5m1J61j30j77J63J91j83L14j49J4L6k16k54L06n1N5n4
$$ y = [-13, 266, 4, -10, 122, 108, -407, 62, 198, 140, -110, -127, 86, -178, -237, 49, -91, -65, 80, -20, 369, 93, -272, -46, 201, -75, -72, 34, -97, 94, 122, -93, 29, -96, -39, 113, -79, -88, 206, 167, 66, -41, 42, -431, 50, -177, 162, 123, -175, 119, -100, 20, 79, 117, 201, -60, -305, -124, 230, -182, 82, -8, 106, 18, -25, 142, 194, 92, 63, 213, -68, 154, -99, -66, 44, 221, -124, -106, 244, -3, -21, 65, 95, -17, 44, -260, 426, -186, -167, -91, -21, 307, 49, 6, 39, 482, 65, 256, 119, -257, -40, -438, 177, 162, -164, 36, -51, -105, -73, -37, -39, -91, -106, -104, 136, -213, -41, -2, 101, -22, -198, -44, 10, -178, 123, -87, -320, 181, -270, 385, 208, -286, 51, 83, 19, 15, -146, 335, 8, 134, -275, -96, 54, -122, -136, 199, -139, -427, -90, -252, 46, -110, 12, -181, 6, -15, 100, -126, -8, 129, -128, -270, -88, 8, -27, -68, 93, -37, -214, -51, 140, -43, 271, 122, 136, 172, -44, -298, 8, -43, 12, -42]
5784d2R9J13n71L65l25L56R1J03j11L3r5J20L4j68j96K13j19j9n1L29k26J20m5
5807Hk97K68k97N27k35j29J61M8k47J27J01N2p8j81J35R0k4J0k99M12j93K7K3
5830IN7k17p7N6J22K44k72J07o3q8J22L65l29L5j07j15j47K02p1J63q2k60M89
5853A43j66J03j74J78j66p6K21k4o6kk4K9J02k35K93r6n8J00j89j50J85K99k26
5876Aj40P7o1M09l22J52j46p1k90N04j76N5j31J36k26M10k75j68J10r5L79m39
5898c07J49N19j88k44m3L22j19J7J21l65j35J81r9o2M30k0k09mJ0J71q9R3j60
5921c1J42j29J27k0L4P0m30N1R8R6k65L38o7k59K61O9k73L51j71k1M5J33k13j76
5945b40L49k47K57l16P5K87j52J97q3N2k02J24k13Q8q0J94j58J19k09J82j99J76
$$ y = [-42, 57, 170, -401, -36, -361, -5, 86, 189, 78, 111, 16, 136, 170, 2, -194, 19, -100, -119, -170, 159, -67, 53, 8, -289, -21, -318, 209, -26, -155, 6, 54, -193, -66, 35, 87, 9, -172, -37, 53, 29, 39, -260, 152, -41, -14, 9, 66, -151, -228, -172, -50, 194, -78, 29, -34, -122, 0, 365, 36, 71, -36, -151, -298, -96, -167, -4, -86, -346, 143, -23, 80, -94, 84, -82, -158, 63, 39, -27, -29, -53, -24, 78, -157, 136, 40, -18, 82, -107, -257, -72, 227, 1, -139, -62, -123, 286, -36, 116, -30, -101, -391, 113, -63, -8, -139, -3, -229, 181, -94, -262, -152, -247, 132, -307, -158, 361, 173, -71, -114, 208, 89, 106, 227, -138, -273, -92, -191, -253, 177, 157, -52, -56, -46, 125, 36, 129, -31, 111, -18, 109, 89, 123, 193, -237, -186, -88, 8, -257, 81, 14, -245, 16, 85, -188, 163, -8, -29, 16, 149, -64, -240, 109, -138, 119, -197, -122, 165, 13, 210, 127, 179, -23, 101, -112, -24, -104, 90, -68, 51, -158, 24, -175, 1]
5967AL2p8K9L08l44k6K23N8l34K02J76j16j03j86J70OJ01k23M2j0J19J31k63P0
5991a5j01K51j78n8Q3j71J59p1M34l23M04m00j11J73j35O9j39J95j96K8J01N7
6013E6j46L97m71O2P7p8K44m13J25K02j29j82K35k32L50ql43L87j5m14K91o5k59
6036c29M63m26K92o5m4M3N1J08Rl25K18l17K72O9k0p5kJ1M59m40k05K52J44J32
6060B75l28K71l06K1j51n4Q3L08l06L0K74l48K44Q7j69o7R1K26k36r1J22k3j5
6083f2L91l11J87j74J33Jj00q9N8J6J47k37j08K60j94%J06j65j15O70m50pP8Q7
6107A22l06L00j40q3J91j71j40J38j22K30N0j29L08j1k31j77K75k04M12n22L40
6128A30l77K10J36j76j74O3L60k48j71kJ97P5j76L4k0L63l34J63K38l25K70k05
$$ y = [1, 33, -45, -16, 292, -52, -78, 145, 203, -131, 71, 247, 131, 28, -158, 12, 18, 119, -104, -62, -72, 47, 178, -85, -15, -116, 135, -43, -101, -18, -189, -30, -101, 333, 10, 414, 14, -97, 76, -59, 10, -129, 66, -130, -102, -1, 56, -90, 307, -164, -102, -25, -103, 141, -272, -147, 55, -74, -256, -21, -253, 97, 89, -254, 133, 118, -296, -5, -70, -329, 134, -292, 0, -65, -109, -66, -15, 93, 102, -223, -5, -322, -50, 19, -1, -76, -78, -67, 392, -48, -253, -1, 143, 275, -53, 218, -88, -67, -218, -272, -189, 119, -187, -157, 117, -231, 13, 100, -69, -136, -45, 181, -55, -146, -24, -47, -62, 329, 18, 205, 31, 164, 165, 65, -24, 34, 50, 197, -40, -148, 112, -82, -82, 24, -141, -256, 414, -36, -43, 35, 122, -184, 116, -24, -107, 84, -87, -227, -89, -211, 19, 69, -60, 248, 237, 6, -171, 104, -100, 312, -210, 130, -247, -37, 99, -77, -251, -188, 172, -76, -247, -249, -52, 23, -153, -119, -139, 224, -110, 53, 291, -34, 236, 31]
6150C1J83k28J8r1J93j15J66j09j59L11k34n1j39J75K30k29k2j2N0m6O5J32m3
$$ y = [31, 214, -14, 4, -87, 106, -9, 157, 48, -111, 200, -34, -85, -224, -49, 181, -48, -70, -82, -32, -78, -13, 119, 76]
$$ [...]
8191a04
##END NTUPLES=NMR FID
##END=
