##TITLE=1H_DE-80WM
 200.13MHz, D2O,
 8 sc
 
 28.1.2025
##JCAMPDX= 6.0         $$ Bruker NMR JCAMP-DX V2.0
##DATA TYPE= NMR FID
##DATA CLASS= NTUPLES
##ORIGIN= UXNMR, Bruker Analytische Messtechnik GmbH
##OWNER= pz
$$ XWIN-NMR		Version 3.5
$$ Tue Jan 28 13:44:03 2025 Russian Standard Time (UT+4h)  she@DPX200
##.OBSERVE FREQUENCY= 200.1313
##.OBSERVE NUCLEUS= ^1H
##.DELAY= (6, 6)
##.ACQUISITION MODE= SIMULTANEOUS
##.ACQUISITION SCHEME= undefined
##.AVERAGES= 8
##.DIGITISER RES= 18
##SPECTROMETER/DATA SYSTEM= spect
##.PULSE SEQUENCE= zg30
##.SOLVENT NAME= D2O
##.SHIFT REFERENCE= (INTERNAL, D2O, 0, 14.3821)
##AUDIT TRAIL= $$ (NUMBER, WHEN, WHO, WHERE, WHAT)
$$ ##TITLE= Audit trail, XWIN-NMR		Version 3.5
$$ ##JCAMPDX= 5.01
$$ ##ORIGIN= Bruker BioSpin GmbH
$$ ##OWNER= she
$$ F:/spectra/data/she/nmr/H-C/1/audita.txt
$$ ##AUDIT TRAIL=  $$ (NUMBER, WHEN, WHO, WHERE, WHAT)
(   1,<2025-01-28 13:43:10.64 +0400>,<she>,<DPX200>,
      <created by zg, POWCHK disabled, PULCHK disabled
       configuration hash MD5:
       00 E9 B6 7A A2 85 ED C7 34 08 36 98 17 FE 4E 26
       data hash MD5: 16K
       C1 AB E5 DB C2 81 70 44 82 18 59 7D 00 F0 C7 4E>)
$$ ##END=
$$ 
$$ hash MD5
$$ F8 B2 F1 A3 8E DF EF 37 39 0B E8 CE CE 85 5D 3F
##$RELAX= 
##$RELAX= 
##$RELAX= 
##$RELAX= 
##$RELAX= 
##$RELAX= 
$$ Bruker specific parameters
$$ --------------------------
##$DU= <F:/spectra>
##$EXPNO= 1
##$NAME= <H-C>
##$PROCNO= 1
##$TYPE= <nmr>
##$USER= <she>
##$AMP= (0..31)
100 100 100 100 100 100 100 100 100 100 100 100 100 100 100 100 100 100 
100 100 100 100 100 100 100 100 100 100 100 100 100 100 
##$AQSEQ= 0
##$AQ_mod= 1
##$AUNM= <au_zg>
##$AUTOPOS= <>
##$BF1= 200.13
##$BF2= 200.13
##$BF3= 200.13
##$BF4= 200.13
##$BF5= 200.13
##$BF6= 200.13
##$BF7= 200.13
##$BF8= 200.13
##$BYTORDA= 1
##$CFDGTYP= 0
##$CFRGTYP= 5
##$CHEMSTR= <none>
##$CNST= (0..31)
1 1 145 1 1 1 1 1 1 1 1 1 1 1 1 1 1 1 1 1 1 1 1 1 1 1 1 1 1 1 1 1 
##$CPDPRG= <>
##$CPDPRG1= <>
##$CPDPRG2= <>
##$CPDPRG3= <>
##$CPDPRG4= <mlev>
##$CPDPRG5= <mlev>
##$CPDPRG6= <mlev>
##$CPDPRG7= <mlev>
##$CPDPRG8= <mlev>
##$CPDPRGB= <>
##$CPDPRGT= <>
##$D= (0..31)
0 0.7 0 0 0 0 0 0 0 0 0 0.03 0 0 0 0 0 0 0 0 0 0 0 0 0 0 0 0 0 0 0 0 
##$DATE= 1738057389
##$DBL= (0..7)
120 120 120 120 120 120 120 120 
##$DBP= (0..7)
150 150 150 150 150 150 150 150 
##$DBP07= 0
##$DBPNAM0= <>
##$DBPNAM1= <>
##$DBPNAM2= <>
##$DBPNAM3= <>
##$DBPNAM4= <>
##$DBPNAM5= <>
##$DBPNAM6= <>
##$DBPNAM7= <>
##$DBPOAL= (0..7)
0.5 0.5 0.5 0.5 0.5 0.5 0.5 0.5 
##$DBPOFFS= (0..7)
0 0 0 0 0 0 0 0 
##$DE= 6
##$DECBNUC= <off>
##$DECIM= 32
##$DECNUC= <off>
##$DECSTAT= 4
##$DIGMOD= 1
##$DIGTYP= 9
##$DL= (0..7)
0 120 120 120 120 120 120 120 
##$DP= (0..7)
150 150 150 150 150 150 150 150 
##$DP07= 0
##$DPNAME0= <>
##$DPNAME1= <>
##$DPNAME2= <>
##$DPNAME3= <>
##$DPNAME4= <>
##$DPNAME5= <>
##$DPNAME6= <>
##$DPNAME7= <>
##$DPOAL= (0..7)
0.5 0.5 0.5 0.5 0.5 0.5 0.5 0.5 
##$DPOFFS= (0..7)
0 0 0 0 0 0 0 0 
##$DQDMODE= 0
##$DR= 18
##$DS= 0
##$DSLIST= <SSSSSSSSSSSSSSS>
##$DSPFIRM= 0
$$ [...]
##$SUBNAM0= <"">
##$SUBNAM1= <"">
##$SUBNAM2= <"">
##$SUBNAM3= <"">
##$SUBNAM4= <"">
##$SUBNAM5= <"">
##$SUBNAM6= <"">
##$SUBNAM7= <"">
##$SUBNAM8= <"">
##$SUBNAM9= <"">
##$SW= 18.0517328524113
##$SWIBOX= (0..15)
0 0 2 0 0 0 0 0 0 0 0 0 0 0 0 0 
##$SW_h= 3612.71676300578
##$TD= 16384
##$TD0= 1
##$TE= 0
##$TE2= 300
##$TE3= 300
##$TEG= 300
##$TL= (0..7)
0 120 120 120 120 120 120 120 
##$TP= (0..7)
150 150 150 150 150 150 150 150 
##$TP07= 0
##$TPNAME0= <>
##$TPNAME1= <>
##$TPNAME2= <>
##$TPNAME3= <>
##$TPNAME4= <>
##$TPNAME5= <>
##$TPNAME6= <>
##$TPNAME7= <>
##$TPOAL= (0..7)
0.5 0.5 0.5 0.5 0.5 0.5 0.5 0.5 
##$TPOFFS= (0..7)
0 0 0 0 0 0 0 0 
##$TUNHIN= 0
##$TUNHOUT= 0
##$TUNXOUT= 0
##$USERA1= <user>
##$USERA2= <user>
##$USERA3= <user>
##$USERA4= <user>
##$USERA5= <user>
##$V9= 5
##$VALIST= <valist>
##$VCLIST= <CCCCCCCCCCCCCCC>
##$VD= 0
##$VDLIST= <DDDDDDDDDDDDDDD>
##$VPLIST= <PPPPPPPPPPPPPPP>
##$VTLIST= <TTTTTTTTTTTTTTT>
##$WBST= 1024
##$WBSW= 4
##$XGAIN= (0..3)
0 0 0 0 
##$XL= 0
##$YL= 0
##$YMAX_a= 37099
##$YMIN_a= -30620
##$ZGOPTNS= <>
##$ZL1= 120
##$ZL2= 120
##$ZL3= 120
##$ZL4= 120
##$ABSF1= 10
##$ABSF2= 0
##$ABSG= 5
##$ABSL= 3
##$ALPHA= 0
##$AQORDER= 0
##$ASSFAC= 0
##$ASSFACI= 0
##$ASSFACX= 0
##$ASSWID= 0
##$AUNMP= <proc_1d>
##$AZFE= 0.1
##$AZFW= 0.1
##$BCFW= 1
##$BC_mod= 2
##$BYTORDP= 1
##$COROFFS= 0
##$CY= -3
##$DATMOD= 1
##$DC= 2
##$DFILT= <>
##$DTYPP= 0
##$F1P= 0
##$F2P= 0
##$FCOR= 0.5
##$FTSIZE= 0
##$FT_mod= 4
##$GAMMA= 1
##$GB= 0.15
##$INTBC= 1
##$INTSCL= 1
##$ISEN= 128
##$LB= 0.25
##$LEV0= 0
##$LPBIN= 0
##$MAXI= 10000
##$MC2= 0
##$MEAN= 0
##$ME_mod= 0
##$MI= 1.114404
##$NCOEF= 0
##$NC_proc= 0
##$NLEV= 6
##$NOISF1= 3.799351
##$NOISF2= 2.8
##$NSP= 1
##$NTH_PI= 0
##$NZP= 0
##$OFFSET= 14.38212
##$PC= 1
##$PHC0= 79.27728
##$PHC1= 28.79223
##$PH_mod= 1
##$PKNL= yes
##$PPARMOD= 0
##$PSCAL= 0
##$PSIGN= 0
##$REVERSE= no
##$SF= 200.129724274929
##$SI= 16384
##$SIGF1= 3
##$SIGF2= 2
##$SINO= 400
##$SIOLD= 16384
##$SREGLST= <1H.CDCl3>
##$SSB= 0
##$STSI= 0
##$STSR= 0
##$SW_p= 3205.1282051282
##$SYMM= 0
##$S_DEV= 0
##$TDeff= 0
##$TDoff= 0
##$TI= <>
##$TILT= no
##$TM1= 0
##$TM2= 0
##$TOPLEV= 0
##$USERP1= <user>
##$USERP2= <user>
##$USERP3= <user>
##$USERP4= <user>
##$USERP5= <user>
##$WDW= 1
##$XDIM= 8192
##$YMAX_p= 0
##$YMIN_p= 0
$$ End of Bruker specific parameters
$$ ---------------------------------
##NTUPLES= NMR FID
##VAR_NAME=  TIME,          FID/REAL,        FID/IMAG
##SYMBOL=    X,             R,               I
##VAR_TYPE=  INDEPENDENT,   DEPENDENT,       DEPENDENT
##VAR_FORM=  AFFN,          ASDF,            ASDF
##VAR_DIM=   8192,          8192,            8192
##UNITS=     SECONDS,       ARBITRARY UNITS, ARBITRARY UNITS
##FACTOR=    0.0002768,     1,               1
##FIRST=     0,             0,               0
##LAST=      2.2672688,     0,               0
##MIN=       0,             -30620,          0
##MAX=       2.2672688,     37099,           0
$$ Real data points
##PAGE= N=1
##DATA TABLE= (X++(R..R)), XYDATA
0@%%%%%%%%%%%%%%%%%%%%%%%%%%%%%%%kQj4J6j6J6j6J6j6J8k4L0l2L2l4M0m6M9
49B5n4N9o4P2p9Q7r7J07j18J30j44J61j79K03k33K65l06L57m07L88M85K6756L257
72C0671j0216J450j6002k4423n076N172J501J1685J4610N360N485K314j6768j6371
86a0608q03m885p842J3493K0069M450L409N836j2765k0793o320l08l52J1680J4601
101H862L221J362J940q799j0997l503n576m209R910J1549K534O187O677r223j3786
116c851l976m865n880Q397J4811N660K274J519p012r514m068m438k747O119P356
131b15L576P662N426p637r616l127n854o039N766J0437M669M703M665m386r391
146F39o445m891j921M967O386M601O161L115m987n595l538o917n382M677P720
$$ y = [0, 0, 0, 0, 0, 0, 0, 0, 0, 0, 0, 0, 0, 0, 0, 0, 0, 0, 0, 0, 0, 0, 0, 0, 0, 0, 0, 0, 0, 0, 0, 0, -2, 6, -8, 8, -8, 8, -8, 8, -8, 10, -14, 16, -16, 16, -18, 22, -24, 25, -29, 30, -34, 38, -41, 46, -51, 56, -62, 68, -76, 85, -94, 109, -124, 141, -165, 192, -215, 173, 658, 27414, 30671, 20455, 21905, 5903, -18520, -23596, -18424, -16923, -5238, 9372, 14732, 20217, 22531, 5763, -10608, -11411, -16296, -24138, -10645, 9424, 13874, 17283, 23119, 10354, -10439, -16759, -17067, -17419, -5739, 8862, 12083, 13445, 15385, 6586, -4411, -7914, -13490, -17699, -7789, 3760, 6294, 12481, 19158, 9935, -3851, -7827, -12692, -18572, -10175, 4636, 10296, 12570, 14089, 7077, -2437, -6505, -10943, -13690, -7571, -215, 3361, 11023, 16449, 8812, -804, -3931, -9785, -15824, -10058, 379, 5048, 9751, 14416, 10030, 639, -5806, -10697, -12618, -7651, -1265, 3336, 9497, 12612, 7625, 2030, -1508, -8425, -13807, -9130, -1410]
161a410L986N291M816l319p487n270m539l129K369N650N753N686K170l237m044
176C286m089o408l733L233M514L388N977M908k304n793m331m467l719J031M579
191c928N209M799K649r86l126m955n968k654K014K909L484N605L764j544l420
206C852l290m697m087L02L822M274M053K824K99k558m469m600k324P6J386L637
222a500N527L028n76j942k771m797l899l1K543L169L829L525J043k198l993l887
238b930k478r75J107L590M557K528L86p64k601m602l407l96J468K258L643L588
254D972J255j487k879l198k929j724P78L088L672K518J293k05k411m054k864r80
270e155M02J909L525L467J198q45j965k873l265j779P00K382K806K563J851L6
$$ y = [-1410, 2576, 7867, 12683, 9364, 1877, -3393, -7932, -11061, -8692, -3042, 2711, 8397, 10567, 7330, 3286, -803, -7211, -10944, -7711, -3197, 191, 6168, 11076, 8772, 2979, -1352, -5819, -9538, -8507, -3928, 1281, 6080, 8729, 7743, 4617, -338, -6306, -8960, -6946, -4037, -553, 5052, 8816, 7272, 3852, 562, -4135, -8222, -7920, -4098, 176, 4229, 7053, 7352, 4794, 325, -4275, -6599, -6523, -5137, -1500, 4027, 7055, 6479, 4537, 1766, -3031, -6930, -6961, -4418, -1249, 2580, 6105, 7148, 4950, 957, -2930, -5408, -6383, -5276, -1686, 2871, 5399, 5785, 5021, 2420, -2182, -5589, -5985, -4517, -2259, 1384, 4972, 6227, 4740, 1861, -1337, -4266, -5990, -5212, -2124, 1548, 4066, 5359, 5154, 2743, -1311, -4175, -5155, -4753, -2844, 681, 4148, 5346, 4501, 2536, -337, -3602, -5381, -4681, -2299, 507, 3070, 4921, 4957]
286D957k370l211k379j319m00J641L244K980J200j60j208k567l121j770L34J461
302b688K146K690K174K56j856k459k215j885o98J358K813K453J466N88q50k507
318G86k765j635j50P32J980K560K072K83j064j744k152k227p69J097K065J982
334A051J793J037n82k105k339j480q50J96J726K563J794N88m22j294k210k237
350b771p86O95J303J900K024J346n36j693j899j703j204M5J587K196J599P77J59
367C039r88k190k066q59L04R46J622K038J304l66j079j438j728j489j44J277J673
384a44J564J212L00q69j809j731j063j51O20J539J949J250n0p67j152j852j400
401b554j00Q51J162J473J446N08q15j401j473j090m50L59J340J628J044L43k23
$$ y = [4957, 2587, -624, -3003, -4322, -4722, -3081, 163, 3143, 4343, 4183, 2975, 408, -2713, -4483, -4149, -2688, -542, 2148, 4322, 4578, 2722, 263, -1952, -3837, -4535, -3177, -364, 2089, 3555, 4143, 3293, 786, -1979, -3614, -3764, -3032, -1052, 1508, 3580, 3863, 2799, 1055, -1097, -3324, -4093, -2996, -931, 1051, 2844, 3881, 3299, 1194, -1145, -2625, -3475, -3279, -1553, 1010, 2804, 3392, 2970, 1676, -534, -2771, -3557, -2862, -1559, 341, 2365, 3711, 3175, 1482, -417, -2120, -3324, -3279, -1692, 504, 2103, 2880, 3039, 2051, -139, -2205, -3064, -2760, -1814, -192, 1846, 3150, 2784, 1705, 267, -1461, -2950, -3094, -1817, -144, 1420, 2632, 2932, 2063, 254, -1477, -2540, -2691, -2071, -532, 1417, 2667, 2617, 1850, 698, -1154, -2554, -2654, -1803, -641, 832, 2278, 2786, 1971, 570, -903, -1993, -2443, -2084, -744, 884, 1928, 2271, 2048]
418B048j035j744j324k07M29P93J379J541N11m83r13j150j436p06J79J127J376
435C85J092N65l7q40j538j149l74J8N56J409J437M29k08n06j165j359p53K10O29
454a199J100J145P48J68o98j326r98m85k91M95J203J199M87J72k66j120j342n71
472a579p9K73R96J204O95K43l98j059r90o90m02L78J137J141L48L03r9j000j135
491g13n33k31Q4P80J113P20L94k94q37q04q31n06L13Q45Q16O11O12j17q52r75
511d05m63m49j53Q60R24O10L94L9n98r01p38n47R5O85P18O48O75m6q05o86m55
532e98o36j64O89Q37L99N48J88n07p31o29m86p3M12N39P40O74L8n00n31n96o69
553a056j94N72N59M51O42K48l87o94n16m82l08K85O12O29N68J65l08m94n62p16
$$ y = [2048, 1013, -731, -2055, -2262, -1833, -1040, 339, 1880, 2391, 1908, 995, -155, -1591, -2297, -2118, -991, 385, 1477, 2042, 2005, 1165, -373, -1522, -1896, -1878, -1322, 87, 1524, 1953, 1745, 1239, 74, -1285, -2038, -1828, -1199, -99, 1046, 1794, 1962, 1264, -62, -1060, -1545, -1836, -1341, -138, 1061, 1548, 1720, 1454, 334, -1008, -1579, -1658, -1385, -389, 815, 1510, 1753, 1355, 296, -694, -1384, -1786, -1408, -271, 870, 1218, 1521, 1422, 422, -713, -1246, -1477, -1393, -613, 500, 1220, 1614, 1320, 483, -321, -1152, -1658, -1345, -500, 316, 927, 1539, 1422, 570, -405, -868, -1317, -1470, -610, 314, 924, 1318, 1357, 759, -142, -880, -1427, -1332, -647, 71, 719, 1394, 1348, 543, -143, -598, -1234, -1398, -709, 128, 527, 1075, 1263, 756, 25, -604, -1090, -1163, -751, -212, 528, 1202, 1240, 740, 209, -387, -1056, -1250, -678, -119, 332, 974, 1222, 835, 141, -375, -857, -1165, -880, -268, 361, 929, 1094, 786, 292, -270, -986]
573i86j49M14M13N00O25K66l61m76m13n54k95J93M95N66M00L52j41l68n72o38
593g29k06J19L25N70N63L65k81l82l73n60l83J91M21L76M74M04j24l37m76m60
613e03k62N6J92M26N90K77j05j54m18n64l26R6K87L12M79L83n5k71l29m36l23
634f48n4J88L85N29K11N3j05l49n76k65M5J01K62M81L60j1j79j91m47l30j63K25
656d78K72L84L22J59j27l49l74k54m8o5K63M13L48R9j07j58l43l81j61J11J91
677b83L73K92J94K1k57l94k67j49j7K39L36K51N8P8j41k93m37q7J8J37L34K66
699B72K65m7k56j82l55j59j17K85K49K42J85J10j16l35k86j29q0J67K08K63K07
720C91M8j34k28k21k44p6J25K49K03K17J08j51k18k29j13r9j8L22J93J39J23K3
$$ y = [-986, -1135, -721, -308, 192, 817, 1083, 722, 246, -167, -721, -1016, -823, -328, 238, 638, 990, 849, 481, -91, -729, -935, -816, -491, 79, 642, 1007, 726, 344, -29, -589, -972, -781, -360, 16, 490, 894, 770, 433, -43, -503, -765, -709, -517, -91, 499, 776, 671, 517, 99, -465, -791, -695, -408, -96, 383, 766, 711, 440, 111, -325, -648, -702, -514, -129, 400, 611, 664, 559, 210, -366, -631, -586, -485, -223, 258, 618, 607, 428, 237, -210, -540, -703, -478, -206, 178, 500, 659, 532, 183, -191, -445, -493, -558, -295, 118, 466, 565, 458, 300, -43, -424, -585, -474, -283, 90, 382, 576, 597, 340, -54, -321, -470, -487, -248, 88, 339, 397, 475, 334, 41, -396, -483, -465, -328, 6, 272, 537, 490, 234, 52, -303, -462, -579, -294, -45, 197, 382, 492, 376, 41, -245, -374, -454, -287, -79, 184, 391, 439, 305, 77, -144, -388, -464, -339, -90, 113, 330, 438, 287, 69, -160, -273, -372, -390, -68, 125, 264, 387, 410]
742D10k44k28k23n8M0K13J63J94J58r0j85k29j54j55P0J39K56J77J05m6j52k17
764e6j33j11j1J26K51J65Q1M6j88j38k14j35PJ28J78J11J63L8j23j26k67k9q6
787c23J04K11J56N1J31j08j59j80j25j3P0J19J66J50J4q9j00j92m0j20J07O2K13
810A05J03O3m9j17j57r8r8N5J51M6K07Nl8r5j56n9j39K8J28J63P3R8k0p9j25j55
836a60j3n2R3J17K11K6p6M0j71j23m6j7Q4O0J36P6K2p2j82k2p6m9P8J06J23J1
862A24M0jj44j90L3J6K4jJ99O1K6q6o1o0j54j0j4J56J12O8Qk2j01o9q3k4l1J47
890c7P6R1N2l7nj40q5k3k3L8P8J44l4Ko1o1j12Nn0R0J05K9N2M6n4q7j02M8k0K6
920d9J02%R7k5n0q1lj23M2j5R5R8K6k7J5q4q7J3r1Q0K3R5M3Nk1n6q0rm5O4pP7
$$ y = [410, 166, -62, -285, -343, -303, -90, 73, 267, 425, 335, 150, -79, -233, -388, -318, -179, 77, 254, 359, 313, 161, -56, -189, -300, -311, -185, 66, 231, 312, 358, 170, 32, -182, -317, -310, -182, -4, 107, 270, 308, 185, 59, -208, -237, -323, -219, -8, 148, 199, 330, 222, 63, -117, -242, -255, -185, -66, 100, 250, 264, 175, 75, -117, -157, -277, -170, -108, 105, 208, 271, 222, 105, -52, -150, -248, -193, -42, 4, 211, 216, 178, 83, -73, -132, -271, -243, -115, 48, 121, 219, 199, 120, -5, -160, -173, -225, -132, -15, 196, 222, 146, 186, 15, -108, -154, -171, -87, -27, 109, 185, 207, 135, -47, -69, -145, -194, -116, -10, 113, 124, 164, 163, 19, -171, -138, -122, -98, -99, 100, 161, 187, 101, 40, -20, -174, -184, -198, -42, 70, 138, 146, 124, 23, -46, -129, -153, -184, -37, 39, 130, 182, 145, 140, 0, -85, -108, -131, -93, -15, 129, 95, 97, 36, -25, -137, -132, -182, -92, 13, 42, 94, 140, 86, -1, -103, -55, -75, -49, 53, 53, 150, 125, 75, -6, -9, -132, -90, -105, -10, 88, 114, 87, 102, 18, -69, -56, -147, -67, -44, 51, 94, 99, 78, 22, -58, -67, -112, -48, -55, 22]
952B2O5Rn4k7m3n7J5L2J9R3q1Q3Rk2o6j28Q2l9M6O7M5Kl7l1k8p4nN0M8J7M7J3
984G2M2j07l6J0n1k7M7P1K1j1Jq4Pk5O8m9M3K8l2O4M5o5l1j4p0K9mN3j7Q1m3J
1016A7lnj15Q8m0L6j8J30q5O2q4m7K6j1J0j1O7OJ9j1m3l2M5nj9K7%k3L0K1J9j02
1048e1QJ2M1j5P5o0k6L7Nk0p3RQ1k7M8L0K3j04m2N8M8m0n7J01rl2lOm5N6Qm6q
1081a2LK2L3n8Q7r2K9J3k4Jk9M6mj3QO9r9L0k0q0J11nJ1J2L1p1Nj7M9k9K5oLr
1115B0j6L1r0N6k2M3L0k6l2Kj9K5j5qJ6L7k6J0l1K0K4q9P1k0j1oN0M9p2L8j8k6
1147ek4M1j7r0Q8M5o3L9n5L6J3j4M5l9J3Kj2j0%N4q8M0j0j7kJ1JJ3KL8o3rj8J25
1181G0r0N3M0j7p9J0mj6Q4j8Nl1L1ll1j3K4k4mO3j9l2J6qJ7p9L4%Mm0N5PK6k6
$$ y = [22, 87, 96, 42, 15, -28, -85, -70, -38, -19, 74, -7, 76, 85, 63, -3, -131, -49, -88, -42, 25, 70, 72, 35, 4, -24, -98, -103, -53, -5, 12, 59, 72, 114, 7, -29, -19, -70, -97, -50, 21, 42, 31, 32, -52, -45, -70, -2, -51, -8, 20, -12, 52, 97, 32, 1, -13, -83, -54, -58, -5, -22, 59, 16, 17, 14, 9, -106, -18, -58, -22, -40, 90, 5, 67, -17, -64, -38, -49, -39, -50, 17, 23, 42, 31, -12, -44, 1, -4, -23, 4, 4, -19, 11, 32, 51, -51, -43, -31, 10, -5, 70, 10, -16, 21, 26, 6, -67, -58, 23, -4, 44, 74, 97, -7, -49, 9, 57, 17, -40, 61, 52, 20, 17, 23, -22, 34, 42, -4, -12, -9, 13, 46, -12, 75, -17, 12, 25, 1, 2, -27, 19, 15, 2, 10, 79, -20, 10, -10, -90, 21, 16, 27, 39, 70, -1, 4, -13, 36, 7, 32, 26, 29, 20, 4, 35, -55, 1, -21, 22, 52, 26, -6, -4, -23, 2, -13, -21, -5, 32, 6, 16, -15, 5, 29, -60, 11, -9, -20, -26, 24, 73, 1, 39, 21, -5, -29, 12, -5, -95, -7, 38, -25, 14, -41, -5, 8, -6, 39, 0, 13, 15, 3, -7, -7, 47, -41, -1, -11, -28, -30, -19, -18, -5, -3, 35, -28, -37, -55, 70, -20, 33, 73, 56, -23, -13, -17, -33, 51, 33, 38, 7, 38, 35, 4, -9, 15, -9, -13, 50, 31, -1, 15, 7, 24, -55, -21, -21, -17, -57, -2, 5, 31, 5]
1215EJ0p1K4ML6k2M0K0m5Nm7L0r3Q9J6n1J48o2l4Jl2Lk6M9K5k1nO2m0pm2qN8n8
1249c9K5j4M1k8M1k8j6J9j00N2K7K9J3K1j4J6k9n6J6pN4o1Q4lj9M3l9o3M3k1k5
1280c8K0j6K5K3l2L7o1j0oM7J4kK0Pj8j0k3JL2j8j3K4L2k7K7j2ml1L8n5l5L6O4
1313C6L1j1k0k2p3K9j2M7M2J5l6J1J9o7n7M1K6pL2%M9l0j1j04L3l6L9K1L1%K6
1344D2n1Q7n0m1m6j4O1K5j4O4l3mm0Nm0K9k2O2OK0ljj5q6JL8mM6qN9lq1K1l5%
1379b5jj8J0O7j6j4L2m0k2K9%n0K8Q0n8OM9r2O8m4j9L3l0L7M5J5q5J0K3n5j2j8
1411f7L4M3J8j4p9L9L9m8O3j4l3N0k5N8k0L6n7j3Kl9qO2m0P0J2m8J5o3jN2Ok7
1443CJ0K3J3m0nn1L1mk9N8L2J8J4p9j9m4M7J5k3l9J00K2m1J1k5n0O3m2k7K1K6
$$ y = [5, 15, -56, -32, -28, 8, -14, 26, 46, 1, 6, -41, -11, -104, -15, 1, -50, 98, 36, 2, 3, -29, -26, -52, -3, 22, 1, -4, 58, 18, 11, -31, -39, 19, -39, -14, -28, 13, -15, 26, -2, -18, 1, -99, -47, -20, 9, 22, 43, 29, 45, 16, -40, -24, -31, 23, -38, 46, 43, 24, 67, 28, -35, 8, -13, -38, -18, -34, -9, 14, -18, 19, -42, -52, -58, -11, 3, 1, 21, 28, 10, 0, -23, -22, 10, -8, -21, 3, 35, 8, 35, 23, 19, -12, 26, -29, -64, -28, 36, 67, 56, 36, 14, -59, -30, -42, 5, 47, 62, 26, 37, 56, -11, -68, -27, -1, -8, 24, 24, 73, 43, 32, -72, -39, -75, -36, -15, 16, 16, 42, -9, 78, 28, -13, -59, -73, -12, 13, -1, 63, 30, 26, -14, -9, -49, -20, -42, 20, 26, 46, 43, 42, 27, -59, -58, -20, -24, 22, 14, 73, 70, -11, 10, -25, -25, -26, -44, -34, 33, 17, 3, 35, -5, -27, 2, 2, -48, -20, 60, 2, 8, 57, -35, 33, -11, -30, 3, -27, 10, 55, 70, -15, -5, 18, -37, -49, -67, -33, 10, 28, 14, -65, -26, 13, -35, 28, 14, -19, 31, 6, 64, 44, 80, 23, 10, 12, -27, -35, 27, -13, 57, 69, 21, 36, -27, -28, 24, 30, 3, 13, 36, 49, 9, 4, -47, -16, -20, -49, 9, 41, 59, 73, -6, -25, -69, -22, -7, -30, -69, 31, 53, 12, 23, -2, -52, 11, -31, -58, -37, -11]
1474a1Lj7N6l8N3o7j1K7k2L7j0N6pL2l7k9p4L5j5M9j2N4l5K9Lk5n6N3l3l2Q2p
1506C1L6n5k5j2nK4n5O4K5J7Qp4L2l2Ll2L9q4N3Q5jNm0j1o2L8k9M0N1o5K8K0p4
1539e7P4j07KO7j0P9m9L8pj7m0J9J0Qj3JJ8L8j5rn0k0K3J1nO0Nk5k6M4n6mrk0
1573d2m9P3J4OJ1Lj1j3lj9lJ1P7k7k6M1k0m3qk1n7P2L6J7J2k3l4j4L8m1L5J4n
1606AP2m5%mj2o4k1P3o8J06m5N4j2Om3Oj31Q9K9J8J9K1o0Q1p2%po2R8m0N2Km3
1639bJ5J3n7l0J0Q4k5K9oN3o8Qq0M7%J8o1N8ON6m3p0K9NK8k7NJ01n1k3m3M0J2
1672C1l5LJ3RK7m9N9nl0l2L4l1N4m4K3m6N3m7K6Rl8j3J6K8J1k9M2J6l9k0%JM3
1705D0p5N6n7J09r6K2m3K1J2mNK2M9K7n6m7J0k4k6O1m5M7P3r3QM6k7m6j8N0J3
$$ y = [-11, -8, -25, 31, -7, 46, -21, -32, -5, -27, 10, 0, 56, 49, 81, 44, 15, -59, -24, -39, 10, -2, 52, 17, 46, 49, 24, -32, 21, -12, -44, 38, 31, 67, 12, -13, -25, -30, -6, -61, 3, 28, 45, 53, -21, 11, -21, -18, -50, -11, -95, -42, 43, 42, 47, 7, -4, -66, -28, -57, -17, 34, -31, -3, 17, -57, 17, -90, -88, -21, -31, 48, -1, 37, 30, 13, -27, -8, 2, 10, -3, -2, 16, 54, 39, 30, -20, -40, -17, -6, -11, 49, 54, 29, 3, 47, -9, -13, -22, -42, -91, -18, -4, 2, 13, 16, 5, -8, -11, -30, -33, -22, 55, 28, 2, 43, 23, -20, -28, -49, -106, -34, 2, 19, 31, 8, -26, -40, -2, -43, -8, 6, 1, 73, 28, 28, 24, 12, -52, -73, 0, -68, 38, -7, 47, 35, 41, -2, 4, -127, -38, -9, 9, 28, 49, -11, 70, -2, -2, -9, -71, 27, -13, 39, 41, -2, 13, 26, -31, -61, -51, 33, 8, 37, 31, 84, 16, 24, -56, -9, -9, 9, -52, 6, 12, 68, 25, -45, -16, -11, 17, -10, -5, 96, 45, 22, -21, 19, 31, -4, -1, 12, 21, 48, -1, 58, 53, 23, -9, 25, -6, 48, 4, 27, -19, 34, -13, 13, 22, -16, -29, -13, 15, 26, -3, 39, 55, 16, -4, -4, -3, 40, -35, 21, -36, 73, -23, -1, -44, -23, -11, -15, -10, 12, 61, 88, 32, -15, -5, -29, -55, 6, -39, 8, 81, -12, -4, 42, 15, -31, -49, 1, 14]
1736A4OM1m5nL1K1o7k6L1n8O3NL5o1Jnk0k8L3%M7J8j5L3m6k9JJ2qJ6MM6l1K0r
1771B5k4l5L5n8P2km2kJ03n1l1J0j3m8QL0N1J9n8N8n2J1J3Mlm4ML0j8M7j3o3O4
1804B7k8k7j9N0l8Q2p0P3j9o3P4o6k4P5l7M1j2l1ql7Q0q6kP0J4RL5o2K8o3j0p2
1836a16J12J04j20Q3k2m3Pl2J2l0M4L4l0M0n8J3j7Q6l7rm6K4J4L9rn0JJ7j7m5
1866e1O7k2k2K9L9l3k5j3L2RL0q0L1J3kL3r0J5P2k6j1%PO2m3j7J7J0l6KJ2J1l3
1899a3O3K3jj15L0N9q9NK2K0L3n0P1r7J17r8L6jm6K7j5Q3k5m6kk4nK3nJ5LMK1
1932B3M2n8n4K5L3l2Q7o9M6k0JJ5m4k2J5K2l7nK8J7JnKm7MN7K7m5%m2J05Nr8L3
1966A0j7j3l9M9O2p9nk6Q7n6O1kn1K3oJ9N2m3pl8K%kKK9J3q0Q0j1l2j4N4j03R1
$$ y = [14, 20, 61, 16, 11, 42, 63, -4, -30, 1, -57, 6, 11, 46, -15, -14, -19, -39, -67, -34, -34, 13, 31, 16, 49, 3, -26, -25, -13, -21, -5, -1, 45, 14, 34, 25, 1, -34, 1, -57, 15, 13, -29, -31, 72, 21, -10, 0, -13, -61, -53, -23, 28, 47, -11, 47, -5, 6, 19, 23, 20, -24, -20, 10, -8, 39, 26, -37, 27, -1, -28, -47, 3, -35, 47, -23, 50, 31, -32, 42, -24, -48, 27, -10, 31, 19, -12, -20, -57, 23, -63, -65, 5, 19, 28, 63, 1, 29, -34, -44, -116, -4, 100, -20, 63, 41, -2, 5, -27, -15, -45, -1, 33, 3, 43, -15, -2, -19, 67, 30, 21, -25, -1, 13, 52, 43, -7, -6, 11, -6, -51, 16, -6, -28, 1, 40, 7, -18, -31, 1, 10, 40, -40, -9, 4, 2, 35, -55, -40, 32, 6, -5, -5, 2, 64, 21, 4, 21, 31, -5, -3, 9, 20, -13, 50, 73, 72, -43, -13, 46, -43, -38, -16, 4, 37, -13, 58, -39, 78, -20, 16, 15, -31, -4, -19, 64, 39, -7, -9, -33, -38, -15, -20, -5, -2, 2, 23, 65, 7, -47, -22, 11, -21, 66, -3, 43, 23, 24, 39, -5, -27, -12, 10, -27, -32, -4, 13, 14, 9, 11, -36, -32, 25, 52, 7, 7, -35, 70, 75, -23, 10, -7, -20, -59, -10, 52, -27, -32, -58, 29, -27, 34, 32, -19, 4, -2, 17, 69, 26, 19, -19, -17, -17, -19, -17, 12, 25, -55, 25, 14, -18, -32, 22, -81, 10]
2000A0%l5k0K7M3m7LoM8%p1O5j5Pm7N8L7k0l7M1j5L4m3j9Q7j01J0N1l2Rn5Q1q4
2033c6K0j1oL8k3l3L5J9q8J23j6r0Q4rJ5m4K1L2l3jj5L1m0M1j2J3m7P7p0QK6j4
2065em2R9m7N8p8M0lQqj9m5J3M5qj7nM5o3L0J0l1L1Mj1n3N0K4L0j8o8rk6R2o3
2099d0O2k7jN3n0k8J2NN3nm1M2m3J2J6n4O0l4j5MN8m8j3j4N6kq6L2J6J7j7O4q2
2132c8O6k3Ok5K2m7kO7qr%j0p3N5K9Rm8K0nNLK2k0kJ6l9J8J3k2j1k9Q2m1no2J34
2168D8n8RQj5j6o4J12nn2J9%N7k9m4R9j16L1J5J6rj4J2j7k6jRnL9k7L8m1k9N2
2201dj9K2N9p6K0m5K1L5%j0K0N7j10K0ok5Q7m8K1j0N9n9j3N5p3j2O1oN4p5jKK
2234Cl7J6mQQ0p7PKQ3j06N5N8r1K2m3j8K8M4knl3Nl6J3Rk4O0L5m6j2QpK2K2k4
$$ y = [10, 10, -25, -45, -18, 25, -22, -19, -25, 23, 23, -48, 17, 2, 9, -38, 20, 57, 37, 0, 41, 26, 60, 17, -2, 85, -16, -6, 45, 13, 22, -33, 48, -36, -16, -27, -33, 5, -18, -51, -16, 3, -85, 38, 22, -68, 16, 7, 22, -22, -1, 31, -2, -3, -18, 13, -27, 14, 2, 15, -32, 45, -25, -17, 9, -5, -47, 52, 5, 63, -15, 25, 22, 30, 22, 3, -42, -29, 16, 8, -9, -14, 31, -32, -2, 8, -23, 8, 12, 1, -52, -2, 22, 52, 34, -34, -43, -69, 23, -40, 22, -5, -6, 47, -3, -31, -19, -14, 39, 34, -7, 35, -8, 4, 20, -34, 26, -8, -23, -19, 39, -9, -22, -36, 20, 18, -68, -36, -20, -3, -20, 44, -38, 28, 5, 11, -14, 8, -39, -41, 26, 18, 9, 9, -1, -74, -19, 10, 19, -29, -9, -14, -9, -6, 16, -4, -6, 10, -29, -11, 2, -20, -31, -60, 22, -19, -24, -86, 48, -10, -1, 7, -8, -24, -88, 24, 19, -33, -14, -14, 43, 14, -30, 69, -47, -16, -1, 15, 6, -8, 4, -13, -39, -40, -31, -36, 3, -24, 14, -27, -56, -4, -23, -1, 58, -18, 2, -43, -22, 13, 13, 3, 23, 80, -30, -10, -16, -41, 46, -2, 19, 9, 68, 9, -4, 51, -22, -34, 27, 21, 75, 0, -1, 1, 3, -34, -18, -22, -14, 66, -11, -4, -2, 81, -25, 30, 88, -3, 19, -24, -42, -14, 30, 28, 23, -10, -5, -41, -28, -19, -43, 17, 52, 6, -6, 2, -5, 17, 39, 15]
2269A5k0J9J5l4K3N9p0n4N7JJ9Qj8Rj0n4J4J4M2l3JJ0k1K4J5k1Kmn9N1j7nQL2
2303A8l4PM3j8rml3J3O4Qo9KL3Oj8l7M4k4jl6L9K8ol2K5jj4K4oJ0j6K1%r3Q6r0
2339g0P3l3k0K8ol2N6L6o0M9k9L0jl6O7n6n2M3j1OM1o6Q2m9L8Ro9%p0J24m1J9
2371@MN3q8PK7r%j5L8k0KM4qn5KQ8r2N3NonNKl2J1o3KK1M4o1P0QJ0rm0qLj8L5
2410El7M5K9l2K8o5j3R5Pp2l6kpN2j9N8K4p6j8J5L7J3K4k8J2m0J6J1L5j10M5o0
2442f4O2J0J0m1L1l7P5j0n9rK0K0K4L4o2m5L9%J8j3L1K6n8O9p6rJ7Rm1j9N2O1
2474F5m5l1m0O1n1N2j6K1o3M6O4Jo8Pl0O1k4m9L8M3j0j9jm0N7l0j2m6M9QoOk1
2507b3k7P4k5j9M3k7l0J0L2Ok4JJ7rl7J2L7MK3n5LMJ5k0L7l1K6j1J4Jk5K5L3j02
$$ y = [15, -5, 14, 29, -5, 18, 77, 7, -47, 10, 11, 30, 38, 20, 29, 19, -35, -21, -7, 35, 2, 3, 13, -8, 16, 31, 10, 12, 8, -51, 0, -17, -22, -14, 18, -16, -9, 34, 16, 7, 3, -30, -17, 47, 55, -14, -12, 21, 27, 9, -28, 16, -8, -9, -45, -6, 22, 16, -16, 9, 8, -6, 18, 12, 22, 6, 27, 27, -66, 20, -70, 3, -30, -50, -22, -28, -60, -4, 32, -28, 21, -8, 22, 21, -15, 52, -4, -56, -13, -24, -18, 23, -43, 39, -10, 28, 37, -32, -32, -102, 22, -19, 0, 4, 57, -31, -24, 3, -6, -6, -21, 17, -3, -1, 43, 35, -20, -18, 70, -22, 31, 36, 30, 25, 30, 32, 0, 11, -52, -50, -29, 15, -46, 24, 32, 42, 33, -7, -15, -12, -30, 5, -32, 13, 42, 10, 38, -27, -40, 55, 62, -10, -46, -48, -55, -3, -22, 36, 60, -16, -34, -19, 18, 31, 55, 27, 39, -1, 15, 26, 61, -49, -4, -64, -2, 8, 18, -23, 8, -29, 46, 36, -23, -32, -12, 8, 32, 66, 4, -41, -2, -2, 16, 3, 34, 60, 2, 71, -5, -14, 3, 12, -29, -48, 4, 65, 20, -11, -51, 10, -41, 11, -5, 16, -47, -1, 63, 64, -4, 3, -27, 34, 10, -39, -1, 42, 32, 13, 12, -28, 29, -1, -13, -59, -10, -2, -8, -2, -23, -50, 24, -1, -20, 23, -4, -34, -24, 8, 14, -10, -9, 8, -1, -38, -26, 11, 15, 38, -17, -14, -10, 5, -15, 22, -9, 17, 6, 20, 21, -4, 21, 54, -48]
2541d8O8J2l0%M8n8O0q1j7k5J04n5M5lJ3l9m4L2m8N4P3q5J8P4k5j4j0m4K7nn5
2572e8Q6m7J7jjK2k8kN2Nl6Nl4%j3nM3j7O2l6M8m7k5J2J2Lm6K5j3J4L8l9Ol8Q6
2607E0%l2K9k2Ml5J1N3p3mN9j8L5p2qK1oj2nL7ok3N7q8J3M8j1o1J00m0onm1MO9
2642B2k6L5J3q9P2r9Q3RkL9n2k0K5l8N4j5k3K0K4l6j0KM2l4l3K7j9L7LnJ0n1J6
2675a9J7j3K3M6m8L0o8%O2J6m7PJ0l8M7Jmn0N9%JJ0k5J6n5OL9l6O8k2m7J7L4j9
2709A8m1OpJ9M4q9M8l6M0m0M1n3M1P5n9k4l9R7q0MN9oL4rro2O7J2k8k1k0K2m1
2742c7j7O6l0R7r2PN8n1K6l7nkM7J0q1O0rj4j0m2J6J9mN8k5LJMK0No9K6Lk1QL8
2778B6j0k8Q0n8ln0K3m6L6%J5k5qO9m9M6o9J9k1M9l1L8m5L6k5M7k8O8n1PQn6M8
$$ y = [-48, 20, 32, 2, 2, 50, -8, 52, -29, -46, -71, 33, -22, 23, 20, 33, -6, -50, -18, -66, -12, 61, -24, -6, 68, 43, 29, 19, -25, 2, -3, -58, 28, -19, -2, -3, -4, 18, -10, -12, 40, 45, 9, 14, -20, -20, -33, -38, 5, -12, 50, 14, 62, 15, -10, 2, 14, 17, -29, -4, -17, -3, 35, -4, 2, -36, 50, 50, 18, 47, 25, 29, -6, 5, 58, -15, -19, 40, 22, 57, -15, -23, -2, -8, -20, -25, 12, 6, -17, 40, -48, -35, 13, 2, -59, 41, 1, -5, -10, -51, -47, 22, -4, 31, 44, -45, 27, -72, 11, 20, 18, 57, 5, -15, 10, -28, 26, 11, -12, 8, 32, -4, -14, -12, 30, -4, -37, -10, -29, 8, 11, 6, 16, -35, -19, -2, -15, 8, 54, 6, 36, -32, -32, 30, 46, -1, 6, 16, -22, 25, 26, 22, -28, 31, 31, 32, 42, 17, 33, -22, -16, 23, -13, 55, 33, -14, 3, 37, 18, -23, -17, -24, -5, 39, -50, -2, -38, 2, -38, 3, -50, -9, 66, 7, -17, -56, 41, -39, -35, 24, 18, 52, 43, 34, -28, 39, 51, 23, 2, -18, 4, -37, -54, 12, -18, 79, -13, -6, 52, 1, 27, -10, -15, -17, 30, 40, -41, 19, 10, -4, -14, -56, -40, -21, -25, 33, 8, 11, 12, 16, 36, 41, -28, -2, 1, -20, -12, 26, 16, -12, 68, 10, 7, -43, -20, -66, -30, -30, -15, -40, -48, 21, -28, 18, -51, -32, -53, -4, -35, 3, -42, -6, -31, 16, -12, 56, 5, 12, 20, -36, 12]
2811A2j1kj4M3J3%q0P0L1pn3Rrl1PP3o5l2J5K4pPK9n3L3j3N8j05M0k9j8R1kj2
2845A2K8J6m6K3m8K8r2Q0K5k9l8N6J0l3M9o5N5J6q1OJ09j02oO9nl8J6k6PO0o3
2876gj7ll4K8N6j9rJ6p1N4l4J6O3m8j2O6L5j00%J4j2K6k5N6n8N7l9j5K1M6j6o2
2908b7OL5kj3l4K5K3l1J4Pm6O9k0K8p4P4o0l2R6l8K7l9Ll4K6J4pk8N9j2J3N3o7
2941HJ6p3Q0J4o3M5k2j6J9j5RK1jo5J7L0K1n6k0M3Pj8M2o5J9PL7l4N0J5q3L7j0
2974dJ4J6n8O0K6k7o5L1lLoM2l4M5o3Jl8Q5Nj19J41l6q2O5pO0o8nlpn2P0L4k9
3008hok4N1k3M1l3j9k6M3M8n2J3j0K7k1m6M8J9Jk5NK9n5L0J1l6KM1l7l0K6J8l5
3041c3L4M4qq4P6n3K6o2N7l9L7PK1J3k1k1lO0p0l6J17q3J6lj6N7m8N4J2o5Jm4
$$ y = [12, 1, -1, -15, 28, 41, 41, -39, 31, 62, 55, 2, 11, 2, -29, -22, 51, -14, -46, -31, -7, -14, -7, 22, -31, 2, -11, 47, -58, -18, -47, -65, 26, 24, 12, 40, 56, 10, 33, -15, 13, -79, 1, 26, -3, -41, 15, 25, -8, 41, -24, 31, 47, -34, -28, 81, -21, -27, 42, 37, -1, 15, -11, -4, 56, -7, -24, -27, -61, -33, 23, 4, -5, 11, -60, -6, -40, -24, 39, -9, -21, 45, 80, -20, -20, -6, -18, 8, -17, 39, -19, 38, -1, -16, 5, 51, 35, -27, -21, 14, 12, -1, -35, -10, 13, -18, -4, 3, -43, 26, 6, 34, -40, 34, -26, -58, 38, 0, 27, -12, -9, -43, -17, -3, -10, -38, 21, 9, 22, 75, 8, 24, -49, 31, 45, -18, 27, 5, -11, 8, -7, 2, 23, 22, -43, -26, 4, 25, -31, -51, -8, -1, -19, 23, -42, -23, -16, 21, -13, 37, 52, -31, 6, -4, 10, 26, -32, 28, 54, 27, -38, -7, -10, -7, -13, 29, -5, 40, -23, -22, -60, 25, 30, -89, 52, 16, -66, -1, -8, 52, -16, -21, -24, -31, -83, -13, 21, -8, -14, -38, 13, -10, 31, -2, -21, -47, -4, 44, -8, 5, -5, 22, 1, -45, 3, 22, 23, -2, 3, 32, -23, 7, 18, -18, -16, 25, -12, -42, -16, 2, -33, 1, 45, 37, -47, 29, -24, 2, -60, -3, -42, -5, 2, 23, 36, 15, -6, -9, 51, -19, -55, 62, -21, -5, -8, -24, 33, -15, 39, 51, -14, -13, -57]
3073e7Q1J8j10J5K3jN9k7p6J14n6J6k8N3l4n5R0j9L1J9l3j1l2J6l7N7j7Rol8M5
3104ImqM2m4N3n2k0N7n4J4PK6QJ3l4Rj3j7J3k5K3J3m9Q9r8O1n2j5K9K7m6O3m3
3137a8jm8J00l6MJ9j5j3ml5P1J1m9J4k4O8k6l5L1j0N6o8P4n2Kl5%K2L7m4j0m0
3169e4L3P1l5Oj00Q1mo3NM7L0l3L8l3o4mk0J60mJ6r1k4N0k6PK1pj4K8Mk0o0K1
3202c8K3O9m4k1kJJ0m2M3KK1m9Mj1L1l0J6L3p5P0k6l2O2m1j9N0K5kk9J2o8N9J8
3235B0l8J9L8Mj9j2L2n9J4J8l8K6m2Q5m1L5k9Kl5l8Q1l3M4k6m9P7l2n2K4L1K5
3266C2o9N9j2m5M2K3l5l5L5n6M9L8o0M2J1l2NP2m6kjkl6N0n9L7n9M2L0m9M1Mm3
3299b9L7k9k9N4JQn4oRM0K2J1m1K3p0K2K2L5lq2MR3pk8k9L8K9m4J0rjk2M1OKo9
$$ y = [-57, 24, 42, -68, -53, -30, -31, 28, 1, -75, 39, -17, -1, -29, 24, -10, -65, 25, 6, 37, 56, 23, 12, -20, -4, -41, 16, -1, 8, 2, -36, 9, 5, -3, 39, -5, 48, -4, -24, 33, -21, -7, 0, 26, 34, 47, 13, 22, 9, -8, 5, -20, 3, 16, -33, 56, -42, 19, -33, -48, -19, 8, -38, 25, -18, -19, -67, 33, -3, 1, 20, 5, -8, -12, -47, 24, 35, -14, 0, -24, 44, 18, -17, 14, 4, 60, -8, 66, 14, 16, -19, -19, 3, 40, -4, -14, -54, -21, 50, 15, 21, -79, 2, -2, -65, -60, -13, 17, -16, 22, -11, -75, -79, -99, 61, 57, 73, -18, -42, 8, -18, -11, 10, 3, -11, 17, 21, 1, -59, -38, -15, 54, 10, -11, -13, -12, -2, -44, -1, 1, 22, -27, -23, -34, -3, -33, -17, 16, -59, 11, -15, -47, 15, -26, -45, 5, 30, 28, -1, 11, -57, 2, 20, -18, 1, 39, 43, 24, 12, 44, -15, -1, 17, -21, 5, -37, 48, 7, 42, 13, 15, -20, -58, 23, -10, 34, 8, -41, 36, 4, -48, -24, 7, 32, -37, 22, 10, -35, 7, 30, -5, -40, -5, -61, -12, 26, -34, 8, 19, -13, -8, 64, 18, 16, 15, 13, -23, 27, -32, 5, -54, -12, 18, -31, 10, 14, -29, 8, -21, -50, 4, 5, 13, -41, -47, -38, 2, 24, 35, -6, 17, -53, -31, -9, 26, 23, -59, -55, 38, 31, 3, -26, 12, 41, -3, 7, -2, -3, -25, 16, 22, 24, -45]
3335d5N6m9j7M1K2o7P5r3M3L0n4P6Jm5LmQ0n8MJ7j1Rj2L0n6O7k2j4Nj6K1jK2m2
3369dM0l1j0nk6jL1L3j3k6olN8n4M1l8Jj2N2%lp3L0PN2l7KK6j2k6n2R7o6P0l3
3404IJ9o1j3J2K5N4m2q2R0k7M2j1Ko3K5L0p1Q6j7k6NkOO3j13P7j5jrm7L0QJ1m
3438a0M8o5N3n3Rrrj9N7J1l7L6Oo8J8L2n9J13p2LK5m5R8j6p3K6M2j22K4R3o3K7
3470Al2RK8n2K8l1M8j9M4j9l4K6l2O1L1p9j3O4o4N2k4N1p5O8k8j5M0n3M4l3Pk4
3502b5J4l2L1O7k3j2k1l2nJ3L1o9O8k5k2N4j8l8L0L6M9m2k6J1oJ5J3k7Ll8K8N
3534Gnl2L3k5M3K4j0n9j1J4M8k4j9j5M7poJ9k6mnj4J6j9jN0l6k9L8L0M2m6j3K
3568Gj3M4j5K4j8m4M3m4LM4J9o2K9K3k1j9L8o3K4RL1n3J6k1O3m3M7l0r8L0M4L
$$ y = [-45, 11, -38, -55, -14, 8, -59, 16, -77, -34, -4, -58, 18, 19, -26, -23, -27, 53, -5, -1, 16, 5, 14, 2, 32, -24, 43, 21, 7, 12, -4, 17, 16, 38, -4, 36, 5, -5, -10, -36, -37, -6, 27, 14, -12, -18, -21, 37, -17, 24, -14, -13, -25, 27, 27, 24, -49, -19, -12, 40, 3, 5, 31, 19, -7, -59, 38, -28, 42, 9, 28, -33, -46, -34, -9, 45, 3, -79, 11, -16, 26, 15, 17, -46, -21, 9, -62, 24, 7, -19, -14, -16, -10, 53, -60, 17, 2, 1, -8, -55, -25, -17, -6, -10, 38, -27, 26, -27, -18, -27, -36, -55, 2, 13, -24, 12, 18, -50, -32, 0, -59, 54, -18, -15, 10, -35, 63, 47, -26, 0, 42, -80, -56, 37, -26, 1, -31, -22, 6, -46, -18, -49, -1, -20, 24, 5, -29, -3, -35, 26, 57, -22, -35, 29, -35, 17, -7, 44, -31, 37, 9, -6, 34, -19, 25, -8, -1, -25, -11, -43, -12, 55, 32, 20, -1, -33, -38, -25, 6, -63, 5, -20, -42, 12, -6, -44, -14, 22, 71, 29, 3, 14, 8, 23, 36, 9, 12, -26, 2, 7, 2, -30, 3, -22, 21, 45, 35, -24, -35, -21, 27, 3, -16, -31, 16, 9, 3, 22, -4, -8, -13, -27, -11, -30, -31, 19, -17, -46, -8, 22, 64, 18, 5, 7, -6, 38, 23, 47, 29, -15, 28, -16, -13, 31, 50, -12, 17, 40, 19, 0, 38, -25, -1, 8, 39, -14, 2, -19, 44, 1, 48, 18, -80, -50, -6, -3]
3600cqJj0M5r1P1k2Q6o9J1j8K0qlq0J30j7Pl8K3l7P4k2l8J9n5M7n1N9J8j6KPn2
3634a8L3K0m8L5M9m6m9m8N4j0K8j7M2M6p6L4kmj3K3n0K8J0o3R3J4n2J7l4N0l3
3665A3j6l1M9K0L2j11L7K3k6nML6n8J8J7j0N6n8M8l7k6j4O5ML2j10J2M7J9n1K4
3696CK1m1P0m9lj5QojL2l3N1l5l2k9M9K6r1P0j9ON3n9K1L0l9O8%m3k8K3l4M6n3
3730c3m1K1P0k6P7p7nOl5O1J7m3K4L1o3Q1n6k2N8n7Ol1P1o1M0j6J7k0n5O6krk6
3763c2K7M7k9J4m2o5R8oj2j3l7Q2l2M2J5q9N4K1m5J6m3JK1M3k6J6p2L7Q6r3N0
3794C4L7j7m3j6L9j8LnJ9l6lQ9q3N4m9J5o1P3L2Poj10J21r7j4J04n8m5P6n8j8
3825c4N9MLm8L3jm6L6l6L1m7M6k7K1m7O2kj2j3m0M6j0N5n7P8l3m5J0J0N8m7J3
$$ y = [-3, -11, -10, -20, 25, -66, 5, -17, 69, 0, 11, -7, 13, 5, 2, -78, 52, 35, 42, 4, 27, -10, 64, 42, 4, 23, -32, 15, -36, 23, 41, 25, 27, 34, -18, 15, 35, -13, 22, 71, 25, -24, -72, -18, -28, 0, -17, 25, 71, -5, 29, 27, 23, 10, 33, -17, 11, 21, -42, 51, 65, 13, 30, -4, 46, 13, -3, -34, 15, 35, 67, -44, -7, 16, -10, -15, -11, 25, -33, -15, 2, -8, 48, -10, 38, 1, -25, -39, 26, 30, 62, -48, -36, 11, 30, -21, 3, 24, -17, 53, 4, 1, -14, -6, -12, -13, 19, -14, 37, 2, -30, -59, -10, 16, -75, -5, -24, -18, 35, -24, -3, 27, -12, 56, 56, 13, -15, 8, -26, 20, -33, -74, -53, 17, -9, 68, -9, -14, -8, -43, 18, 35, -8, 16, 47, -16, 65, 9, -13, 45, -12, -6, -37, 34, -27, 13, -3, 14, -6, -61, 5, 3, -6, -32, -5, 42, 13, 27, -15, -80, 18, 12, 0, -13, -50, 32, 0, 42, 57, -32, 22, 43, -2, 14, -29, -28, -7, 36, 10, 26, -46, -9, 77, -16, 34, 71, 54, 11, -5, 34, 16, 19, 14, 33, -3, -6, 83, 0, 54, 5, 20, -41, 32, 64, 71, 65, -45, 76, -21, -35, 69, 11, -34, 42, -16, -34, 25, 29, 32, -16, 17, 16, -30, 6, -30, 1, -46, 0, -27, -6, -53, 9, 7, -5, -18, -58, -12, -22, 33, -24, 54, 21, -24, -14, -4, 54, 7, 20]
3857B0l4M4o0K1J0J9L9l4l0j3k1N3K1n5M0m5L3kmk8N0r2Q1nL4n9n1Q0l4M2K3n0
3889gK2p1M1K6j1pL2j1j4K4nrJ2j4j6k1O6o8pO6j1Nl2Pm9P6Qn6M0k3k8O8M3q1
3923ejK5m5R5q6J8J7l0jJ4Rm1L4j6kMN2l1l2M3j0n0J6O9n5L3J3n1Opk5M5K9K1
3957E5n7j0J4J7n0JPK5Pj6j9J7Pm7J7O7p8K8K7m8N9J4j4ql0mMk7L1L8J9j9l4J8
3991A1n8P6l2L4j6o4O7j3j8M7m0m8P5l9L2L9n3o6O0m8l0M3J3N8l5m2O0Mpk9J17
4022I8j34R2q1O6o3K2J7j4k0M9Pk3%l4QK0Ml4L2oJ4J4KK6m5n4L7j0M5m2n5K2O7
4055B7m5J8L2p2O1m3j3N4l2LN1q0RL3m3N4M8q3m4N5L5Qk0n1M9J1k2OM5r8RK4K8
4088A4L5K1q6J6L2m7R1o8K2n5N5l3l8P6K9o5J1KJ4j2l9M0L4o3N9o4J4J9l0J7Q
$$ y = [20, -14, 30, -30, -9, 1, 20, 59, 25, -5, -18, -39, 14, 35, -20, 20, -25, 8, 6, 2, -26, 24, -68, 13, 8, 42, -17, -68, 12, -22, 20, 43, -7, 15, -56, -15, 11, 0, -7, 25, 14, 0, 24, 19, 10, 22, 8, -8, -29, 37, -31, -38, 28, 17, 22, -10, -3, -52, 24, 32, -24, 16, -7, -35, 33, 76, -5, -6, 19, -26, 69, -17, 1, 18, -12, -13, 1, 10, -31, 3, -13, -15, -11, 41, 10, -22, 21, 11, -39, -23, 46, -9, 24, 37, -14, -8, -15, -40, 5, 34, 55, -2, -12, 2, 19, -31, -30, -23, 2, 9, -7, -26, -9, -2, -49, -32, 35, -43, -15, 12, -36, 23, 37, 23, 15, -15, -19, -15, -42, -11, 27, 46, 27, -7, 11, -47, 29, -3, 31, 15, -49, 18, 5, -13, 34, -6, -54, 21, -18, 14, 53, 0, -66, -6, -54, -84, -41, -28, 30, -5, -47, 13, 17, 10, -19, 98, -36, 56, -25, 41, -22, 0, 17, 3, -17, 32, 39, 16, 16, -18, -10, 10, 14, -20, 12, 6, 20, 34, 36, 62, 17, -37, 0, -10, 35, -7, -62, -40, 27, -18, 0, 32, -40, 21, -22, -35, 19, -13, -10, 41, -39, -30, 3, -40, 14, 62, -21, -65, -10, 25, 33, 13, -38, 11, 22, 0, 6, 51, -47, -38, -14, 14, 49, 70, -16, 0, 32, -15, 76, 8, 30, -25, 30, -3, -41, 35, 64, -1, 10, 12, 26, 14, -25, 15, 49, -14, 45, -19, -5, 14, -16, 1, 9]
4119IK5j5M5q7M3n2K0j3K5Jn1N8K0m0JJ9j1k4k6P5K2l6Jo7N1J7KK5k9P4p6M3p4
4152b5K3J2p2N8N8p2R7p2M3k5p4M1rJ8oOqL5J5m0m0M3M4j4q8N6l8%MK9l3M8j8
4185dk5L1m5P3l7%qQ7p2K2k8K2l4P2k6p1M9kK2n0J2mN7p7mO9n1OM5l2oJ6kOj2
4220an2P0k2K2k3Rnm7N0j8j8J9j4N2Qk9l2J9LJ0JJ7Qk1MN7o6K4J3o9L2K2L6p5
4254a6J7j6P3m7o9J8Jj1K5L3k0KJ4OJ3rj0k6l1N2J0j7J4J4Kl7J0J0k7P8m7k6J
4287a6j6KoM8Ml1M7r0M4O0j4m2L3K3p1O3j1l4Qrj6K1OlK0J3q2N2J5J8m0l5M3N2
4321E6n4mn3N0J7M2p0PLJ8J5j3ml2J3QN4n5K4q4J15p6K9l6M4j3M5l4o1P6omp6
4354e9J34k0l3Lp9R6J2mk9j7j0m1j8P4Nk0p%J5M5j1pm1j9Q5p3L5p2O9m2M2l0j0
$$ y = [9, 34, 19, 64, -23, 20, -32, -12, -25, 0, 1, -50, 8, 28, -12, -11, 8, -3, -27, -53, 22, 44, 8, 9, -58, -7, 10, 12, 37, 8, 82, 6, 49, -25, -2, 10, -62, -4, 54, -18, 79, 7, 50, 25, -49, -8, -17, 1, -5, 1, -7, 28, 43, 3, -37, 6, 50, 36, -52, 4, -34, -34, -30, -1, -34, 14, -4, -29, 2, -43, 30, -7, -7, -15, 72, 0, 22, -6, 16, -18, 54, 28, -43, 6, 4, 26, -24, -12, -16, 41, -36, -40, 29, -22, -16, 29, -3, -9, 7, 5, 11, -1, -53, 17, -5, 17, -6, 3, -2, -49, 1, -17, -35, -16, -30, 22, 30, 1, -31, -12, -9, 1, 2, 19, 27, 6, 10, 67, 1, 25, 38, -31, 1, 23, 59, -16, 1, -15, 58, 11, -58, -40, -39, -50, -25, 8, -12, -10, 4, 10, 23, 14, 4, -22, -53, -1, 9, -8, 6, 20, 22, -15, -5, 5, -22, 56, 9, -17, -16, -32, -30, -36, 12, 16, -15, 32, -58, -14, 46, 32, -10, 23, 46, -25, 38, 27, -7, 1, -8, -24, -3, 3, 0, 20, 33, -49, 3, 18, 36, -4, -39, 4, 56, 2, -2, -55, -5, 12, 54, -16, -9, -6, 12, 27, 14, 10, -22, -9, -1, 53, -2, 22, -62, 53, -23, 6, -30, 14, 1, 46, 12, -49, 27, 21, 17, -59, 75, 55, 22, 25, -54, 42, 54, 50, 21, 4, -6, -47, -65, 9, 14, -6, -13, -13, 2, 47, 36, 29, -12, -31, 54, -19, 16, -56, 13, -29, 13, -17, -27]
4387b7%jL1j1K6J0j4m5O0q3K5KJ9j5kRL6k2QM8j3k5l0L4M3q9N8m1M9ol9l2J0M7
4421B0j0K9m2KN2r3P0m3j2N9p3M3k8J0L7o8Q0l9K4kq4M4jM8j9N9p2J1lJK2n1P
4454b2j3L3j4K5k7MM2L4k0k1k2lK2l1p3P9O6l3j2J9Rl8Mm7L5m8O2J4n6nN6%j0
4487IL6Ml4j5K6Kj6On0M4J6pn4P6p4L6p1N5J5l4qL2M2m8J7L0k8l2O8rL2l3k0m6
4521c3K4m2O5JJ4r1nN9JL6M2Qp8QL7mk0m8J6K1L5m4K7mn1j8P5j9K8n4K5o2K8O3
4555D0k4k8J9L1K2l3pM2p5j5Pm1P0rK3mj9k2M8l5NN6n5k5J5k1O9j6l4L8Ok6k1
4588a9nL2l6L9oqOOk3K3j1K8J7l1m6N7j6Nr7P9N6m3Pl6N3j4Nj2M1o4O5n2j0OJ5
4623A1k9N3jJ1r7P9ll0m2K4P4n0J0j8J4K3l3k6J2J3N7n8j6J15q0k4l9Q6k9J6j4
$$ y = [-27, -27, -28, 3, -8, 18, 28, 14, -31, 29, -54, -29, -27, -8, -23, -25, -16, 20, -2, 6, 54, 41, 16, -14, 20, 63, -26, 32, -9, 40, 34, -5, -37, -27, 20, 10, 39, -3, -1, 51, -42, 28, -15, -27, 32, -41, 2, -26, -16, 21, -47, 33, -6, 18, 16, -68, -24, -25, 23, 4, 63, -9, 2, -1, 0, 22, -29, -22, -35, -2, -16, 9, -18, -14, 28, 62, 42, 21, -1, -4, 18, -13, -86, -7, 59, 26, 14, 33, 42, 4, 8, -39, -4, -52, 10, 24, -32, -37, 19, 19, 9, 45, 49, 15, 0, 26, 28, 12, 18, -32, 12, 28, 21, -33, 43, -31, 5, -66, -11, 4, -30, -38, -6, 36, -12, 5, 35, 7, -25, 43, 34, 66, 33, 13, -33, -9, -51, 14, 15, 29, -62, -67, -8, -7, 29, 71, 79, 1, 9, 46, 42, 22, -26, -10, 11, 46, 2, 29, 25, -26, -44, 31, 12, 40, -14, 11, -51, -23, 40, 16, -12, 7, 38, 60, 27, 20, 62, -13, -28, -21, -62, 8, -1, 22, 18, -1, -23, 25, -10, -5, 51, -4, -29, -14, -35, 34, 18, -16, 22, 28, 2, -19, -24, 8, -28, 11, 5, -3, 3, 9, -14, 9, -2, 26, 43, 12, -34, 23, 7, 12, -85, -6, 50, 7, 14, -22, 31, 17, 22, 10, 51, -13, 52, 0, -10, -4, 11, -18, 35, 34, 45, -52, 27, 24, -6, -48, -24, 50, 0, 10, -8, 6, 29, -4, -30, -18, -5, 52, -6, -22, 93, 13, -11, -50, 36, 7, 23, 9]
4654IK2o%l3L9j6rn0N3L2o4K1n8M3M6l8j0M8j9pm7J7N3j3l3j0M9k4J2j8l4R8l1
4687B2k0QLmj2LNL6J4r5P9%l6J7J9q6OL0J2K1k7LnM2k6o3K8rJ1RlK4p0O3m2K2
4723b1k8LM5J7m6J9L3Kj3L6n4jj9R8m3k2MJ8J3p5M3j0K7l4J8J1k3rj7P3n9N3K
4756D1n6J4nK7k7K1nK4Qj4l4L1NJ5k4k1lK0J3p9N3m5P1kk0j0m0Q2k4j1m8Q1l9
4789alOL3m2k3K7j7K7ml2M2k0Rj3lJ8Jqn9J00ko0L0l6QJ8K2Kj5m2J9L6kN9m2l8
4825el4N7l2j5N2Jk6L8m4k9K5J3j4m8N0lmOK2K3m1qN4n3L8K2K8p6KqJ5M0o7k2
4859d3N0o5J8L6k7P1j4j7J3k0QQ6o0k6QM2j00lMN1j4L1l8LN0k7o5L0O7lp5K1L1
4892B3j7L1l7m3M4oM3J1l4k4k4O3n9L7L6j4k8l0N5Pj1%rk5rN7j9m7K1J6n1K9P5
$$ y = [9, 31, 25, 25, -8, 31, 15, 6, -44, 9, 41, -23, -2, -60, -17, 29, -9, -19, 29, 10, 3, -44, -27, 26, 13, -20, -30, 19, -5, 7, -11, -45, 53, 22, 2, 10, 13, 9, -3, 0, 5, 41, 55, -40, 39, 39, 3, 20, 39, -47, -41, -11, 1, 22, -5, -2, -7, 35, 9, -54, -26, -35, -24, -15, -18, 6, -64, -1, -43, -21, -49, -46, -1, 16, -30, -11, 22, 24, 11, 47, -7, -8, -27, 71, 28, 6, 10, 28, 41, -34, 9, -1, 26, -8, 10, 21, -2, -11, -28, 45, -14, 39, 41, -15, -1, -6, 21, -6, 15, 10, 34, 42, 28, -6, 25, 30, 45, 21, 0, -3, 17, 30, -49, 4, -41, 30, 28, 8, -2, -42, 40, 16, 5, -43, 38, -1, -4, 2, 35, -7, -30, -3, -20, 7, 3, -29, 13, -7, 2, -11, -14, 4, 5, -3, -62, 38, 36, -24, 6, -30, -22, -4, 18, 20, 5, -37, -18, 18, 16, 75, 33, -5, -39, 18, -14, -29, 23, 24, -2, 36, -8, -37, -12, 1, -13, -61, -11, -14, -18, -12, 10, 33, -8, -16, 38, -15, 23, 45, 73, -3, -1, -9, 6, 46, -21, -43, 7, -58, -40, -4, -31, 40, 26, 9, 22, 2, 10, 96, 36, 10, 18, 60, -40, -43, -39, 12, -2, 29, -9, -6, 44, 17, -48, -18, 49, 46, -29, -8, 23, 6, 37, 0, -43, 1, -5, 38, 49, 15, -9, -33, 30, -29, 8, 44, 30, 2, -28, 27, 34, 23, 23, 14, -11, -20, 37, 18, -29, -8, 8, -43, -14, 61]
4925F1k0m9O7j04L0o0P0o4J04m7nL4j3O4n5j1M5o8L8K7Qp2pQ9q5L5k7M1k0O4m3
4956B7j0j5K5Ql0k2L6o3K5l8J11n2M2o%p3N9k2pMl1N2J3q0nK9N0n1J5k9J1O8p1
4989c0J2j5P8m1k1J7k4l6N2J8%j0K8n4No9P9R2j10O5j4rml5L0j8J8Pl4L7j2kN
5022EL0l0J6O2j12R3m9Qk1l4K7l7K1r0J05O6q2%N2l9J9K0m4L2j6KmNrj7mM7o0
5055c8M0K8qj4j0J2K4j8N1n9Q8l3j10J21q6K7K0j4n4Q2o9K1P3ml6n8k1O4%rm2
5086c2nL4K9J4n7J6M7m6QnJ3J0k7J9l6K0K4Kq4M7M6J4m6K3k6J8J7m7M3rk2M3J
5119D6k9J3Pp0J5M8p2N5O3q6J0k4K1L9n6OM5m3L1pk6L4qm6K0K3QJ2l2lMmK3o2
5153d5J01o4K1Kj1j1Rq%Ol2M3m2L3l7N8K1k7k5N8m1M8q7O2Jn4NKK5k8L8p2N9M
$$ y = [61, 41, -8, 59, -45, -15, -75, -5, -69, 35, -12, -17, 17, 4, 68, 13, 2, 47, -21, 17, 44, 52, -20, -27, 62, -23, 12, -15, 26, 6, 70, 27, 17, 2, 27, 35, 5, -17, 19, -44, -19, -57, 54, 2, 44, 38, 38, -35, 24, 2, -5, -1, -32, 20, 33, -47, -52, -23, 27, -24, -9, -38, -27, 41, -30, -18, -33, 45, 4, -17, 0, -24, -60, -8, 10, 10, 0, 28, -26, -21, -90, -11, 81, -29, 36, 22, 13, 9, -26, 4, -14, 4, 11, -23, 14, 2, 0, 5, 35, 5, 21, 83, -29, 64, 15, 23, 2, -32, -5, -42, -21, -111, -6, 60, -22, -22, 30, -9, 10, 30, -14, 18, 2, 4, 0, 5, -4, -21, -25, 22, -38, 2, 30, 22, 8, -2, 10, 34, 16, 67, 8, 96, 63, -47, 74, -12, 15, 35, 21, -33, 49, -20, 1, 74, 70, 34, -24, -45, 19, 19, 10, -32, -37, -3, 26, 40, -17, -1, 46, 0, 8, 3, 16, 26, -1, 18, -18, 2, 26, 28, -56, -9, 37, 51, 5, 28, 2, 20, 37, -10, 33, 24, 2, 45, 46, 17, 30, 37, -33, -18, 30, -42, 13, 76, -10, 0, -24, -3, 36, -20, -14, 31, -12, 19, 12, -14, 20, 12, -34, -14, 9, 17, 29, -3, -6, -2, -6, 17, -45, 56, -8, 13, 15, 4, -7, 2, -6, -6, 0, -32, 11, -31, 2, -35, 23, 44, 17, -8, 50, 9, 57, -30, 32, 33, -21, -16, -14, 11, -17, 21, -51, 8, 12]
5187A2K2Op4j6O4L7o7L3l4K5J6L8q2Jm6N4K2J8j2K1n1O5o6K2Kk6jk5O1j1L3n7
5219a6m3J07o2joJ5K4L3k2K1l8J9j5l0pN4k0J0K3m6L4l2pok5lK2K1k9M1l9lL2
5252Flkj2M3k0j1L6n1k3N9k3L1l4p8Q5oj4m1M7lO1p9M0J6m6L9j8J6oJ5J2p4N8
5285B0mn8L8J5l2L9Jj7N8Mk1n9lOj5K4l0N4k4J2LJ1m2jrP5l8rj4L4j4k7L3JM0
5320E1kj6k5n7J9K6P6kl7l4NN7p4J9J6o7J05n9nqL5l2m8Q7o9O2j8k5J4N6j7j8
5352A5nj5k5jL0J8Pk4oM2LK1l1k6KM3n0M3k4k3K7l2OK2n5J9j5O7n4J7KlPm5O2
5387A9r0Q8jPm1N0p4L7L7m2pK8ol9QM5OK6Lp9K9J1L3l3Lk5j9K1MPK9n2K7J4l6
5422a2%L8l0k0J1N2n6j1K5k0J6nl1O3mk3L1n6M8LJn3L7ok3O9j2o4J2N9r7K7L3
$$ y = [12, 34, 40, -34, -50, 14, 51, -16, 17, -17, 8, 24, 62, -20, -19, -65, -11, 11, 29, 17, 38, -13, 52, -14, 8, 10, -16, -17, -42, 19, 8, 41, -16, -59, 48, -14, -15, -21, -6, 18, 51, 29, 50, 12, 31, 16, -14, -21, 33, 13, 23, 46, 0, 34, 2, -5, -11, -36, -39, -17, 4, -25, 16, -23, -26, 6, 3, 1, -11, 32, 12, 1, 37, -14, -37, 22, -1, 30, -4, -82, 3, -3, -17, -58, -11, -14, 47, -32, 8, 24, -22, 17, -1, 15, 9, 24, 36, -38, 20, 16, -42, -4, 11, -21, 18, 19, 2, 60, 64, 43, -16, -19, -13, -28, -4, -34, 20, -4, 8, 11, 22, -20, -21, -30, 45, 7, -2, -16, 18, 4, -23, 10, 11, 51, 49, 33, 8, -49, -30, -4, 72, 70, 33, -1, 4, 61, -13, 6, 22, -45, 60, 1, -4, -12, 23, -9, -57, 30, -39, 23, 5, -20, -6, 50, 33, 15, 10, -5, -30, -31, -1, 17, 24, 0, -6, 36, 39, 60, 29, 3, 5, 48, -2, 41, 17, -6, 21, -11, -5, 17, -38, -19, -34, 33, -21, -4, -2, -5, 2, -43, 19, -71, 17, 16, 23, -18, 32, -42, -5, 32, -10, -17, 11, 5, -34, -26, 19, 25, 51, 54, -25, 4, 15, 48, 15, 18, -7, -26, -5, -1, 6, 35, -17, 10, 24, -12, -12, 26, -4, -24, -13, 39, -17, -28, -3, -23, -7, -12, -43, 20, 16, -7, 24, -32, 16, 19, 20, -33, 4, -2, -25, 44, 32, -32, -20, 39, -58, -31, 2]
5455BKN2J1q5L2Pk0J0nl3K4%j1O3j1L2m2m6P4j9n0LMOJ6l2R4r8j4L3qk1L6Kl1
5490b3L2Qn1L8J4L2m5nL6J7k5M3o5N3l5j6m8M6l7P8l9l3M9n1J0m4M2L5%K6m3m3
5522d4L5L1j2rJ2mK5kl6j1J0K0j4Ln4J5K2N4j9j1qL4l2kkJ2J4k4J2lrk8jM8K3
5557D5k7l7O3r0L6K4m1M4q3J08%L9r7K6nk5K5pL9o6Qj2O0K9q5LOK6J3k1j3j9N3
5590A9j6j1Nj6l6NP1k3pPj4N6n9L6m7J9J1j2m4R%P3qmkmJ5o5Q2q2L7jK7pnK5l1
5627CN1n2J1m7P5j7m2M0rk7k6L6nM7n5k5OL1l1K7M8J8p7L6j5K8n5J8M5J0l4j3
5659@roR0m7K2ro8N6Oo1L9RJ9J7o2l8Q8qj7Njj6l8K5L7J0l8k4M6p9O3K3J4k4K5
5694D9n9K2l5O6m1qO8n4lj2j9O3l4k6%K0P2o1j7L2l9qJ0R2j26L6L0j4j3O7q6N2
$$ y = [2, 4, 56, 67, -18, 14, 21, 1, 11, 6, -27, -3, -3, -14, 49, 38, 70, 28, -18, 56, 37, -13, -10, -6, 0, 16, -16, 78, -20, -34, -1, -9, -30, 6, 8, -23, 9, 17, -34, 4, 18, 50, 5, 0, 36, 53, 28, 71, 6, 59, 24, 8, -40, 6, -31, 47, 8, -25, 24, -27, -17, -61, -19, 16, 16, 42, -1, -44, -9, 22, 10, 1, 13, 9, 34, 32, -4, -15, -5, 15, 1, 4, -50, -35, -13, 41, 22, 11, 3, 37, 5, 3, 1, 13, 27, 3, 15, 12, 3, -25, -26, 22, 45, 18, -19, 44, -46, -10, 14, -27, 17, -66, 42, 42, 81, -16, 10, 5, -20, 5, -2, 37, -29, -21, -33, 27, 56, -29, -26, -20, 6, 19, -2, -15, -34, 19, 3, -8, -3, -19, -55, -50, 21, -2, -9, -2, -16, 40, -19, 17, -30, -11, 0, -12, -56, -47, -47, 26, 18, 14, 12, 8, 23, -42, 40, -42, -5, -6, 21, 14, 9, 34, 3, 54, 2, 13, -34, 41, 24, -18, 22, 13, -14, -40, -4, -9, 38, -17, -42, -36, -5, -36, -9, 39, 57, -20, 16, 1, 29, -26, -8, 37, 47, 13, 0, -9, -15, 75, 28, 50, 41, -27, 29, 35, -26, 13, 22, 41, 58, -4, -42, 46, 38, 21, 26, 25, 9, -29, -4, 33, 43, 5, -19, 27, -52, 11, 34, 48, 24, 49, -10, 12, -23, 43, 2, -6, 62, 8, 5, -7, -26, 37, 3, -23, -23, -3, 69, 8, -9, 23, -16, -24, -14, 78, -48, -12, 18, 4, -9, 58, -28, 24]
5726B4n6L1L2j7l8R0q6OP8p2LJ9j0oRj8J0o1QP0k8N1j5r6O2J5l4j9L7O0k3PJ6
5759D9k1l1K8K8r9K8MJ2rJ9k9j8N2n5M8P8m8o2O7o2K1J9k3K6k6Q0n8m5M7L4j12
5790e8K2Q7k6j7l2L8j6Ql1P7k3p3j4M9M6k6%lNJ1r6J17o2K0m1J6O2no1P4l0l1
5822a3J5QqNlJ5n1J07n0r6P4K4Rqj2l6L8LMj7%k7pJ2L6j1l0J5MpJ2RQl8M6k2K2
5859C0l5k0O6m3k1RQP5m9o4L2j8pM7J0%LM9r0J4LK6pl5M7o1M9lL4p4J2K4l1M3
5893B3nk8nJoJj3L5J1k0Qj0K7j7j0J3O4q2rK4K6k8J9p4J8J0k0N9m2JO8j5J7m0
5927Aj6MkJj6L4n0lL8Q4p0L6on9MR3q3M0L1j7k0l8qk0P6o6P9j12O2J4j5l8P6l6
5961bMRk1N0q7M2k0L6o2L1L0o5J9N9k2K7%o9P2j8J8o1P4o1PM2k1j1KPJ9J6m3K1
$$ y = [24, -32, -1, 31, 14, -24, 66, -20, -14, 64, -8, -5, 14, 4, -2, 7, -11, -1, -62, -54, 16, -12, 39, 24, -72, -10, 5, -29, -48, -11, 49, 26, 33, 49, 28, -3, 25, 53, -46, -18, -14, -2, -11, 8, -21, -39, 13, -42, 6, 84, 36, -26, 41, -21, 0, 19, -4, 22, -4, 76, 18, -27, 20, 54, -58, -36, 51, 25, 8, -24, 14, -2, 6, -25, 52, 29, -44, -58, -9, 37, 11, 11, 8, 13, 24, -72, 45, -17, 3, -38, -22, 40, 35, -26, 48, 18, -13, 2, 10, 2, 7, 4, 19, -32, 75, 25, -71, 3, 27, 36, 28, 16, -20, 18, 21, 25, 8, 8, -19, -26, -14, 22, 11, -19, -4, 0, -7, 5, 14, 22, -16, 30, 8, 30, -5, -25, 41, -2, -23, -14, -6, 69, 20, -44, -12, -30, -37, 10, 20, 20, 23, 72, -18, -4, -1, 25, 18, -17, 30, -31, 18, 15, 49, -25, -13, 11, -20, 23, 18, -10, -15, -14, -20, -19, -32, 3, 14, -6, 2, -8, 19, 2, -8, 5, 69, -13, -22, 2, 28, 0, 19, -55, -37, -27, -47, 12, -30, -29, 39, 24, 41, 1, -15, -11, -13, -12, -28, 6, -44, -47, -9, 75, 5, 41, 35, -24, -20, 73, -10, 30, 61, 44, 24, -14, -22, -42, 34, -32, 47, -65, -3, 11, -4, -42, 34, -2, 2, 11, -10, 40, -47, -5, -25, 11, -51, -20, 10, -55, -36, 23, 1, 28, 28, -41, 31, 13, 31, -30, 44, -17, -10, 32, 11, 0, 2, 9, 28, 44, 1, 22]
5995B2l4JJ1m3K5L7k0N5n4J8p0O8k3K2J1jN4q1pM0k6m4K5M5Ok9l7j6N1K0k9J0
6027G%J0n2J03k9J4o4N3o4N8l2M1m6J0n1N7%lo0J2P7J0n5J4k1JJ6K4l4k9PL5k2
6060a3Rj4kLj9L4J3l0K7l2J1pm5O1J6J4m7K6j3L5p3L6OJ5J9j2K3q0M5K0k9l6M1
6093Bj7k3P6nl3l4L5QKM%l8o5R5Jj3Oj2K5k1j0N5Mo7%K9J9J0l0m5R8mo0jk1kL2
6130@L1ok9M9k4J0Rk3k2j9OO5o3J23q9l6NJ8L9j9o2L8L8Jo4J1j8O9n7Pj5n9J16
6163C0J0j9m5N6l6k2O2Ql3jK0o6J4O1n7%lJ1Ll0J7OpL3k9J8%l3J9O3j03N8j4K0
6197A1l0J08q2j8N1nj1K1m1OPJ5J7n2K8j7k7k8K9M0j3j3M0m3K6j3l6O0Oo1jJ0
6229a6nN8Mp1N9k0j7oK4J8m1k4O6J2o9N4L5r7M9J1k9nk7L9L4o4L6l0K2j9j6Q0
$$ y = [22, -12, -11, 0, -43, -18, 19, -1, 54, 0, 18, -52, 16, -7, 15, 26, 25, 79, -2, -9, 31, 5, -39, -14, 31, 37, 8, -29, -45, 6, 26, -3, 7, 7, 17, -35, 68, 39, 53, -11, 42, -22, 36, 4, 45, -1, 9, -42, 15, 15, 12, -48, -36, 41, 51, -4, 10, -11, -10, 6, 30, -4, -33, -26, 9, -13, -4, -18, -20, -17, -36, -2, 11, -19, 8, -24, -13, -20, -65, -4, 12, 26, -21, 5, -8, 27, -46, -10, -4, 11, 30, 18, 41, -39, 6, 26, -3, -39, 2, -15, -38, 38, 33, 0, -34, 1, 9, 11, 15, 15, -23, -88, 7, 8, -5, 1, -11, 14, -7, -17, 38, 42, -25, -25, 4, 23, 33, 3, -42, 56, 52, -8, -9, -30, -32, 0, 31, 25, -4, 45, 21, 31, 40, 17, -5, -24, -18, 47, -16, 107, 18, -18, -13, 5, 44, 25, -37, 1, 39, 40, -24, -13, -31, 38, -19, -12, -27, -86, 30, 40, 21, -24, 32, -4, -26, 36, 44, 11, 10, 30, -36, -22, 39, -18, -18, -21, -10, -7, -37, -20, -14, -21, 12, -17, 1, 1, -32, -13, 50, -53, 5, -9, 11, -19, 89, 7, -11, 40, 35, 24, 45, 4, 10, 17, 32, 49, -3, 25, 8, -19, -47, -18, 22, 9, -4, 36, -7, 19, 6, -30, 30, 36, -25, -26, -16, -21, 37, 41, -30, 29, 9, -8, -14, 10, 28, -13, -37, 29, 41, -28, 26, 61, -36, 13, 24, -5, -10, -37, 2, 36, -28, 8, -22, 0, -19, -35, 45]
6261D5j7q0R9n6L9m4K3o0M7M7o5K9k8M5J0n2JO1p2M9Jj1m1K4RrJoML3n2M9l3j6
6295b6K0L3m3K4l0R7Op7N4j17L9L8m0lN6j9j5k1LK3k3N9O0o7j8Oj7K5k7q3Q1O9
6327F7q9L3n3N1l4M8pj5j1k5Q3p4K9K2j1K9rl5j2L3j3k8poK0j0j3P1k0mRkn9M7
6361EJ3n3K0KK9l7R8j07J3MM1n9M1p6J06n5P0m7qL3o0K6j5L7o1K6OL0k4O9j05
6392c8K7K5oj7M8l8k3K0L5oo8J05l4l8j8N0l3k4L6L8k5j3n1J03k1Rm7M0m8J4J11
6423A13j19L4n1M7q0K3O7m1oL3qPk6j2M5l3Pj7J4j2LO3n6L9km2j1kM3k7J08j38
6455c7M3%l8K1LL3MPo4J9j5M3O2o3l8J8J9j3l3L1l4K3m8N5p5P2K1l9L6n4k8L9
6487c0M2J0q2O9rL3m0K3nj6J9l5M2k2K5n0N4K7m8Nm7N1J1m9RnL6n3K1J2pJ0n2
$$ y = [45, 28, -52, 47, -9, 30, -14, 9, -51, -4, 43, -22, 7, -21, 24, 34, -18, -17, 44, -28, 21, 22, 11, -30, -6, 3, -6, -5, -11, -7, 26, -26, 23, -10, -26, -6, 27, -16, 8, -22, 75, 81, 4, 58, -59, -20, 18, -22, -25, 31, 12, -3, -24, -21, 2, -21, 38, 98, 31, 13, 19, 2, 27, 0, -83, -2, 67, -22, 11, -42, 9, -25, 23, 16, 1, -10, -35, 48, -26, 3, 25, 14, 43, 34, -1, -13, 20, 7, -21, -28, -34, -14, -24, -37, 34, 14, 10, 19, 17, -42, 5, 18, -35, -15, -13, 16, -21, 77, -30, -17, -13, 28, -31, 10, -66, 40, -15, 55, 8, 0, 33, -27, -1, -16, 21, -40, -14, -8, 22, -2, 67, -38, -11, 14, 8, -9, 39, 1, -22, -2, 33, 27, -41, 64, 30, -8, -26, 24, -9, -33, 3, 41, 16, 3, -48, 55, 34, 43, -4, 36, -12, 2, 113, -6, 28, -23, 24, -56, -33, 34, -7, -13, 20, 12, 19, -7, -19, 26, -7, 0, -17, -3, -15, -12, 51, -5, 34, 32, -10, -21, -23, 20, -7, 101, -37, 6, 6, -32, -11, -8, 25, 29, 36, -28, -9, -24, 19, 81, 18, -20, -2, 17, 4, -29, 2, -32, -9, -57, -2, -77, -5, 16, -23, 13, -41, -69, -30, 12, 22, -60, 9, 0, 33, -7, 16, 11, -5, 14, -21, 21, -1, 24, -26, 28, 55, 7, 12, -35, 16, 27, -22, -13, -18, 18, -35, -14, -2, -9, 1, -51]
6520e1Q3J8o5JL5j7m3M1j7K9l8J6J1L6n4J3k2J1M9k4jjL5m3j6N1m9K6pmqnk5K5
6554a0k8O0n9L9m1N1l7Nj8K3kL4rp0P0k9J5l2O3jQo3K0K4Lj2j5j2N5No2J4QrJ2
6589@M2k3N1m8n2L3kl9pj7N3l5N2qN5l9Qk0j8JM5m7Nj9RO0l4ok9M9m1k4N2k0K3
6624A0j2L8j5j3P8o4p5M6M6Lm5l2oJ13j29J5O5l0k1L4J6k2k8rO5l3k5L3j2K1l2
6655b0J1J6pk7Q0o2L8k6Mr1N9Q4p1K1%K9l8J9j9L4p1N4j4l0j5O1kmm9J4K1l5N2
6688A6K5n5L9k6Oj0l2N8k7j5K4l5K3L6l9J8l3l4O1m7P1J1m6J9k6K4klK3k0K8j3
6720A9l6O4m6lm3N1M0l4Lm7L1J8k3j8K3N9j13L8MKj3M8m0O0j03J04m3j6RlK2J7
6752C1m4K4LL0m9L5nj9k0K7j0j7L0%k2L0m7L9l1O2q0mj9O0L5o1M4k6M5k1k2mj7
$$ y = [-51, 32, 50, -15, -14, 21, 4, -39, 2, -15, 14, -24, -8, 3, 39, -15, -2, -24, -13, 36, 12, 11, 10, 45, 2, -14, 37, -12, 14, 7, 3, -5, -10, -35, -10, -38, 22, -37, 2, -39, 12, -25, -20, -38, -15, -17, 17, 8, -62, 8, -21, -6, -38, 25, 24, 32, -31, -11, 13, 16, 4, -11, -23, 32, 37, -25, -11, -3, -12, 0, 42, 19, 70, 22, -30, 3, 1, -38, -45, -62, -9, -44, 8, 0, 55, 16, 24, 4, -14, -13, 32, -15, -10, -29, -20, 40, 6, 0, -29, 20, -21, -45, 7, -13, 10, -2, 36, 21, 8, 86, 22, -53, -7, 39, 42, -3, -35, -41, 72, -57, -42, 23, -7, -28, 6, 22, 0, -28, -37, 28, -5, -30, 3, -9, 12, -20, -9, 7, 0, -27, 53, -9, 29, 3, 7, -84, -25, 59, -12, 9, 9, 38, 0, 19, 0, 34, -37, 17, 3, -27, -42, 19, 17, 13, -36, -22, -1, -36, 16, 41, -14, 25, -1, 5, -5, -37, 21, -6, -21, 3, -32, -9, 27, -12, 6, -27, -61, 0, -47, 24, 35, -11, 8, -18, 6, 4, 1, 24, 4, 32, 19, -17, 47, 1, -2, -45, 6, 46, 12, 15, -32, -1, 17, -6, -24, -1, 58, -55, -17, -13, -11, -24, 24, -16, 44, -59, 45, 2, -14, -5, -8, 14, 31, -13, 11, 14, 44, -5, 30, 25, 6, -14, 13, 3, -14, 16, 16, -6, 24, -23, 16, -15, 47, -33, -37, -56, 4, 39, -22, 22, -4, 41, 20, -2, -6, -23]
6785b3N9Rq1L7j6l4P6k6m5P1n1K7L0ll4M0K1l1j4Jrk6j5K7K9Rl0k7K2j9O2j9p
6818A0j0pqj3J7Kj4J6L2n2Lk8O5K7pLo1P9m2mj9J1J3qjJ2n1L2j0n2J6L3J4O3o1
6853@l4Q0n3K6m0K8o2L3rK2Mk8K7N1m5l5K9KL2k8L7o2K4O1r3J9M9k0L5j14M8L0
6885A4k9l3K3J8pN4m7M2n2lL0l0nJ6j7K4NK4ko8M6JpPOJ9J4J8m4K3m4p8P4Kk0
6920b6j6N1NK7k4J6m0O2l7k3K0oL1n2n9R5J2l0M4l8onk0PP0n8Qk5Pk1K1Ojrn2
6955f6J10o3N5l5K9K0k6l6Q5m4j2j1J4m2l2L0k1L0K2o0L9JJ5j6j1M8k0j3M5n3
6985a8P9q8J3k2nNK3Oj1J0L7J4o3KM2k7Pk1k3M8l9L7n4O2lM4q2jL6pk5O8m8J4
7019A0J1j3m9k9M5j5J0OJ4J5m4J21r2RJ0Mk2j3l4J08k2n1N3j0mJ3n5K1K8J6m0
$$ y = [-23, 36, 45, -36, 1, -15, -49, 27, 1, -44, 27, -24, 3, 33, 30, -4, 36, 57, 26, 12, 13, 4, -22, -37, -10, 19, 28, -2, -29, -7, -26, 36, 17, 10, 0, -7, -15, -28, -11, -9, -23, -7, 25, -27, -24, -52, 13, 40, 33, 36, -25, 54, 12, 8, -11, 0, 13, 5, 4, 16, -35, -3, -13, -65, -49, -16, -2, 61, 0, -34, 46, -7, 19, -21, 7, -55, -22, -31, -9, -5, -33, -6, 45, 0, -35, -6, -4, 28, 0, 37, -25, -1, 60, -33, -14, 35, 15, 50, -64, -16, 14, -15, -48, -25, -7, -14, 40, -7, 35, -17, -20, 10, -20, -25, -9, -26, -2, 3, 27, 25, -43, 3, 4, -3, 4, 10, 29, 43, 61, 17, 40, -4, -82, -8, -6, -26, -42, 9, 14, 41, 17, 33, -7, 55, 18, -5, 15, 9, 40, -12, -71, 24, 36, 6, 50, 12, 6, 1, -19, -12, 58, 0, 8, -17, -10, -31, -10, -4, -5, -14, -66, 44, -19, 36, 1, 30, 50, 24, -12, 73, 29, 17, 6, 20, -22, -54, -24, -45, -15, 7, -53, -14, -13, 2, -14, -25, 23, 3, -10, 35, -18, 61, -27, -14, -36, -41, -36, -13, -7, -18, -8, 29, 43, -20, -18, 24, -3, 4, -17, -40, 8, -31, 6, -48, 14, 11, 55, -27, -28, 8, 1, -24, 44, -4, 10, 21, 8, -41, -70, -25, -40, -30, -24, -10, 5, -39, 82, -10, -1, 9, 13, -9, -22, -56, 52, 30, -21, 32, 22, 18, 31, -24, -3, 25, 41, 1]
7050Aj0M3j8M7m8o4L4k2K4P6j8n0j0M0m0ok1M3L1o5L6L7m9k1J0l8P6l4R0o5l4
7081b5L6L7r7M7m6O8k9oJ5n7O6j2jJ8mm5N0l6oO7l5K0K1p3J0L6k7K3j7M3k9m8
7113c6J25j14K2J7L4n0J1N1m0L8q5N4j1n8PNM2l8KK3l5J03n5J0o0K4K6k9M6l0
7143an5MP7o5K5POLL4q8J01j33Q2J0n8R4j5m1m8Q0ml3k2PRKL3o5M4J8Qj8n6OR4
7178D2o7J5Qk9k4O1o2M2j3nK4K4j8j7rL1J3m6L7o2P2n7N9J9j3k3o2J04p5M9J5
7209C3J7K1r4M0oJ6Pkm3Lnk9J1m9R5N3j8p0N9l5j8J4NJ2p9O1n8N8pk4M7l5M5j1
7243A4o7M5J8p4O3k0J7k1NM0m0j7R5q9M6J4Km8NJ2RJ8p4K6J7m4kO7k2pk3P9Nk6
7277B3K5k9k7PKJ5L7m2J5m9Q6k8k2Rm0J9QJ0nk5lN9o6LL0k0Q1q7N8mjm0J8l2N5
$$ y = [1, -9, 34, 16, 63, 15, -49, -15, -37, -13, 63, 45, -5, -15, 25, -15, -21, -42, 1, 32, -33, 3, 40, -9, -30, -20, -58, 18, -16, 74, 9, -25, 11, 48, -49, -2, -48, 20, -9, -15, 0, -57, 9, -3, -4, 14, 10, -35, 15, -21, -27, 40, 5, 25, 46, -27, -17, 19, -8, 15, -2, 41, 12, -36, 89, -25, -3, 14, 48, -2, 9, 60, 20, 58, -27, 27, 16, -42, -35, -30, 12, -26, -24, -1, -36, 67, 12, 22, -38, -14, 12, -17, 29, -1, -56, -52, 25, -40, -15, -8, -2, 1, 35, -53, 48, -85, -3, 7, -51, 43, 28, -13, -61, 19, 15, -18, -40, -33, -24, -22, 11, -54, -10, 8, 16, -2, -58, -52, 42, -25, -10, -2, -31, -55, 6, -56, -14, -27, -32, -8, 16, -2, -19, -28, 3, 16, -30, 7, -55, 17, -40, 19, 38, 25, 2, -60, 44, -31, 18, 33, 50, 71, -23, 17, 11, 27, 34, 32, -11, -8, -13, -42, -31, -80, 15, 68, 50, -20, 39, 4, -14, 0, 5, 17, -62, -1, -59, -1, -8, -32, 15, -20, 25, 14, -53, -8, 10, -64, -1, -21, -4, -25, -20, 20, -20, -37, 58, -31, 15, 29, 31, -17, -12, 0, 9, 27, -47, -21, -4, -48, -50, 17, -5, -12, -35, 44, 49, 23, 48, 19, -8, -1, 1, 16, 53, 11, 26, -23, 63, 35, 13, 22, -18, 1, 9, 19, 14, -11, -14, 45, -21, -18, 12, -8, 73, -14, 44, 40, 39, -1, 17, -15, 40]
7312D0k6l4j%L2o1M6L8j0k9P3m5j4l1L8o9N3pl3J2PPJ8L2m3j3O0l8j5j2k6M0K0
7345INm3K6k2Q6j5r7J3L6%O0l8j7l3M6k4N8k4n1J2M1L3l3k7K1q4kM8K6l8N3j7
7377Hl8L3j5oP0n6J6J8o1RNN9p9L3k0mK3m0J9J9k2n1R0l7P9m1p7P0J7N1p3j6j9
7410c6N7rm2J9OL1npl0J5M6J6l9Pk9J1Kro1qP6LJ9k6m2k4M9J9Ll2M4m4kN1l9j1
7446b1l2J6P4k5J5M0n5J7pL3J9j05rL9J8o1Q7l4j7n0P2o9N7L6j9l1m4M9N1n6L2
7477B0k8N1q6L4k8K7lL0m9J8k8N3L3r5N1L8k4K7k2K5q0M2L9n5M9l1n0O2m1J7L5
7508C1o8L0k1m2N4m6N5o7K6Ll4K0RP2l4pL5j6k1k9P8K0m7K6j3o5N3k6O1k4j2n
7540dn3M6j3R1m9k1m7J00k4m5K6L4n5lJ0K3On9P9k6k5l7J3P9l3j4oJ6jon3J7K9
$$ y = [40, 14, -20, -21, -21, 11, -50, -4, 34, 24, -5, 68, 23, 9, -22, 16, -53, 0, -7, -40, -28, -21, -14, 4, 36, -7, -20, 40, 2, -13, -25, -51, -11, 9, 14, -29, -3, -25, 61, 46, -51, -38, -2, -2, 58, 20, 3, -30, 16, -8, 50, 26, -25, -13, 28, 61, 28, 1, 22, -62, -64, -16, 10, -28, 25, 8, -30, 3, -12, -18, 52, -4, 12, 30, -31, -22, -17, 42, -37, -4, -24, -28, -5, -45, -26, -7, -29, -80, 10, -27, 52, 11, -66, 4, 21, 72, -1, -17, -36, 21, 12, -30, -11, -5, 26, 21, 14, -16, -1, 45, 61, 22, 29, 0, 11, 13, 4, -57, -65, 11, 14, 33, 7, -35, -59, -10, 9, 12, -20, 24, -20, -22, 29, -10, -21, -53, -37, 37, 12, 27, 67, 12, 29, 22, 55, 74, -31, -40, -1, 17, -44, 43, 9, -8, -58, 14, -55, 2, 38, 19, -12, -56, -7, 44, -12, 20, -8, 43, -43, -9, -37, -10, -13, 17, -32, -14, -42, 11, 44, -51, 0, 38, 14, 41, 19, 44, -36, 6, 45, -10, 39, 8, -42, 20, -21, -4, 31, -37, -7, -28, -70, -16, -62, -7, -74, -48, -45, -79, -59, -50, 22, -12, -19, 16, 0, -21, -50, 28, 48, 1, 27, 14, -51, 2, -24, 37, 13, 1, -4, -57, -11, -24, 67, 18, -3, -50, 50, 26, -19, 7, 41, -14, -17, -7, 16, 22, -37, 42, 16, -9, -46, -33, 46, 13, -1, -7, 9, 8, 2, -51, -34, -5]
7573eJ2n6O6k1rOMK3K6o5K6qjL5m5M8m2NNl1Q4j5o2M2M9n8mj2M6m6k5m2K2O9l5
7608a4J4j4K0l0N3K5q1L8J3q1O7n5J7LK2Qk4jQ7m5J8pm9K2L3m9nL3k2L2l7j6J1
7641a4O4m3m5j7Q9J6p6N1o5j6J16r4M9m5L7l1r%lL7n2%J8Q3r0J3l0Q1J5K2q3L7
7673A5mn1k0P3jj7oOK4qo6Pl5M5N0k6J9K7J6q6J2M4l5N3o2M5n7N2p9R3k5o1L4
7706b4O3o8M3J5n6K7J1m4N3lRk3K5k4J5Lj5j5m2Q0o7N9q7J4P1J8o2L9m0K4j9k8
7738d8J11r2O4q2K5K2K1n6j1L4Opm4N1j2N7qo0Q5j18O9M6k9P2j07L8j3k6j0k3
7768d5kL9Mk2O1q5O0k1K7m4qK3l4M2j3P7j11Q1k7M6q7O6o8Q6p4J7j2j8M8%Lj6
7800gk1j2M5M0o2M7K5o3N3J5j01L4ll1J0k5K1N0j3L0j01O6k3R6j1r3L8m5L5Rl5
$$ y = [-5, 7, -49, 17, -4, -13, -7, -3, 20, 46, -19, 7, -1, -2, 33, -12, 36, -6, -1, 4, -27, 57, 42, -20, 22, 71, 13, 9, -3, 43, -3, -28, -70, -48, 21, -14, 0, -14, 6, -24, 29, 54, -27, 11, 24, -57, 10, -45, -28, -25, -3, 5, -19, -20, 67, 22, 40, 33, -16, 6, 39, -10, -15, 18, -4, 28, -9, -25, -14, 50, 7, -38, -55, 34, 50, -26, 25, -40, -56, 60, -34, 15, -30, 7, -24, -33, -33, -36, 1, -51, -51, -33, 50, -40, -27, -57, 24, 39, 61, -22, 15, 11, -40, -60, 13, 12, -5, -11, -5, 19, 11, -55, -48, -83, -38, 12, -14, 5, 32, 48, -38, -26, 18, -17, 36, -26, 19, -38, 14, -65, 28, 3, -58, -24, 39, -29, 14, 29, -27, 0, 11, -33, 20, 17, 26, 3, 28, 4, 19, 22, 7, -8, -50, 30, -37, 22, -65, -51, 20, 38, -24, 15, -25, -1, -20, -48, 63, -29, 35, -47, -22, 0, 21, -35, -46, -12, -6, -13, -57, -6, -18, 39, 31, -29, 56, -62, 7, 53, 24, 96, -11, 27, 14, -12, -22, -45, -47, -8, -4, -26, 35, -50, 10, -11, 16, -28, -36, -13, -47, -5, -18, 59, -52, 29, 2, 48, -39, 27, -41, 45, -29, -12, -24, -42, 6, 6, 9, -7, -28, -40, 5, 45, -17, 30, 55, -8, 45, 60, -41, -7, -10, -41, -31, -56, -35, 15, 2, 32, -69, -3, -26, 70, 59, -34, 4, -41, -6, 3, -32]
7831c2J9Q5q1m3oR9Pl5mn4N1m6O4m0l7OL9K0k2L0nm0K9j4l5j4R3l1m4K6J3j1L4
7864B1L5n9RJ6mJ6m9k1K2kl9O5l5M5n7Q7ml3J1j5J0k6%n9O1m4J33m3r6L5l6M7
7896iL8j03R1j8j5Ro7R6k3PK4m9rJ4M7k9J6n5P4p7N1k2m8J8M9J9j4nJ6n4j6L2
7928a2o1N4O8n9J3knn6j6Q5K3n0L6k4k8J0K2K4Oj7k0K9KJ4q1L2LP3o4K5l9j4j7
7961d6P6j2k5M8j1l7M7q0O1m5P9o6j9M0l7kP1n9M1n2M7l0mP3p6Oj7J8k6K4l0K9
7993a4J1km8RO2K9m1jL0o4M3J5j3j6KL5JJ8k2n4L3J8j2JJj5j5R6n7o2O8Qj02L4
8027b4j1L9Kj8o4R9k8L6n7J8j3K9pL2Jm8j3lKQ7m3m1J9J6o2R2j04L6l6Q3pm7P4
8060C9l1l5J0Qj5L5jno6K6J7N7Oo9J7M7k6o5kP9n2M0l9L9OlL4n0RPp1LM8k0Nk0
$$ y = [-32, -13, 72, -9, -52, -58, 41, 48, 13, 9, -45, 6, -40, 24, -16, -53, -47, -8, 12, -10, 20, 15, -25, 4, -10, -45, -59, 34, 3, -41, -15, -2, -13, 21, 56, -3, 6, 22, 18, 34, -15, -36, -14, -16, -55, 10, -25, 20, -37, 50, 46, 13, 24, 9, 19, -7, -7, -66, -5, -49, 84, 41, -55, -20, -56, -9, 29, -74, 17, -1, -16, -7, -74, 22, -1, 6, 30, -19, -28, -14, 33, 4, 20, -35, 39, -38, 13, -9, -57, -39, 10, 29, 15, 10, 26, -28, -44, -12, -73, -19, 49, -10, 3, 1, -4, -60, -76, 9, 32, -18, 18, -6, -34, -24, -2, 22, 28, 11, -9, 20, 22, 36, -45, -13, -10, 63, -1, 24, -15, -29, -46, 30, 18, -7, 41, 30, -7, 40, -40, 21, -24, 55, -11, -30, 10, -27, -29, 42, -17, 24, -28, 19, -11, -15, 58, -18, -12, -29, -11, -37, -13, -43, -14, -3, -5, -53, -44, 18, 47, 6, 5, 35, -29, 14, 29, 16, 0, 2, 37, 38, 56, 34, -20, 13, 31, 19, 20, 21, 6, -9, 87, 30, -32, 36, 44, -58, -24, -35, 4, 6, -12, -76, 23, -5, 31, -26, -8, -21, 8, 1, 33, 34, -14, -27, -30, -28, 59, 16, -25, -6, 10, -52, 40, -64, -28, -64, 19, 12, -35, 39, 8, -27, -17, -9, -24, 11, 10, 5, -61, -35, -18, 39, 45, -24, -7, 40, 14, -51, -53, 26, -26, 14, -25, 14, 20, 17, 51, 1, 10, 17, -54, -51, -3, -23, -18, -38]
8096c8O7j3qL6p9Q7l5l0L3j3j9LK5J0j03P7k0l3O4o8OM7K2l1L0j8l3Q5p0L1LK7
8128D2J9k2q5pJ13m9J4n9K8n6Q3M7K5j08K7j6k7Q3l7m5NPN9K4p5p8P9j6l8N4K0
8159A1o5P1l3k3L7k2N7K6m8m5J02o1l3J03p2L6m4j7O1m6j7m5N2NOJ3L2q9N1m4
8189d1J2N
$$ y = [-38, 29, 16, 8, 44, -35, 52, 17, -13, 20, 7, -12, -9, 16, 26, -77, 0, -20, -53, 11, -57, -51, -4, 18, -13, 17, -1, -34, 51, -19, 12, 15, 42, 61, 39, -46, -53, 60, 11, 25, -34, -6, -62, 21, 68, 93, -15, 12, -4, -31, 52, 15, -30, -25, -18, 41, 65, -10, -88, -9, -25, -63, -9, 11, -54, 17, -16, -39, -2, -24, 33, 59, 11, -34, 68, 7, -26, 77, 5, 41, -3, -20, 41, -5, -22, -67, -15, -10, -4, 9, 41, -48, 3, -41, -29, -24]
8191b4
$$ Imaginary data points
##PAGE= N=2
##DATA TABLE= (X++(I..I)), XYDATA
0@%%%%%%%%%%%%%%%%%%%Qj6J6j6J6j6J6k4L2l2M0m8M8n6O4p2Q4r2J04j20J34j48
41g8J64j82K00k20K44k70K98l28L61l96M37m83N31n87O50p20Q02q95J005j137
61f04J296j496J753k097K590l351M708p863L0077J2086l7684l208j3290j3537
75c0620N022K1614P327R953Q704k835r051n492j7012j2352P384R370N17J4857
89G386J7534l780j1497l771j3822j7019K977J3528P338J0949J0417m194r312m122
103B612r210r334K311M534K738J1584J1098k770m269r53j1816j3729J587N979
117i638K143J0929J3750n71p832m977q453q514P94L763L033Q563P936j50m86j381
133H909j0948j0615P83K517P73R226J1416R59l424k198p839j0182k436K731M416
$$ y = [0, 0, 0, 0, 0, 0, 0, 0, 0, 0, 0, 0, 0, 0, 0, 0, 0, 0, 0, 0, 8, -8, 8, -8, 8, -8, 8, -16, 16, -16, 24, -24, 24, -32, 32, -40, 44, -48, 56, -64, 70, -78, 86, -96, 104, -116, 128, -142, 156, -172, 189, -207, 230, -253, 278, -309, 341, -379, 423, -472, 533, -604, 692, -804, 949, -1148, 1442, -1909, 2799, -5064, 25013, 37099, -585, -3793, -17083, -30620, -25598, -3984, 3343, 13296, 22000, 19165, 10114, 4622, -12390, -24742, -17358, -7988, -7471, 7386, 24920, 21140, 9643, 5872, -7950, -24969, -21992, -8464, -1126, 9823, 20240, 16046, 6734, 2612, -6598, -15932, -13621, -9087, -6349, 5235, 16333, 13563, 9294, 8341, -3475, -17204, -15617, -9638, -7495, 3434, 17184, 16613, 8781, 3804, -4649, -13163, -12369, -8606, -5573, 2990, 10926, 10776, 10290, 8909, -2039, -12654, -11871, -9354, -8581, 645, 12061, 13020, 9596, 7398, -441, -10623, -13059, -10328, -5912]
148e912Q045O945J060m63k599q334p054p32n64O78Q712R421J264j384j251p029
164H03q876k677J546K558O154P027L167L6l119o915n617j862j378J418P074O500
180E839J722J033k38o501p801k654J59J465M892O526L662O25k151m980n125l569
196g096j894K031N766M927K340J901n41n337n719k512j282K49M197O127L488Q07
212G452j295l452m669l892j754J531L827L703L327K775o51m392m410k653k165
227f718k14L623M988L190J515j11k564m606m016j725Q92K574L391L792K617n86
243F042l145l214l002k749l39L031L901K876J978P02k101l952l604j732j66J536
259c938L208L895K422k18j825k591l460k785l14K093K887K832K566R15j739l328
$$ y = [-5912, 2133, 9078, 10138, 9675, 7076, -1258, -8312, -9044, -9608, -8930, -218, 9203, 10467, 9083, 7832, 803, -8073, -10750, -9204, -6646, -492, 6535, 9702, 9738, 6619, -296, -5913, -7775, -9153, -7735, -661, 5839, 7561, 8594, 8356, 1855, -5946, -8600, -8441, -6976, -2084, 4442, 8104, 8729, 6578, 1598, -3527, -7096, -8990, -6959, -1193, 3734, 6074, 7975, 7434, 2097, -3622, -6134, -7416, -7167, -2970, 3157, 6645, 7452, 6157, 2705, -1964, -5856, -7610, -6079, -2252, 1451, 4778, 7553, 6902, 2510, -1900, -4553, -6718, -6932, -3309, 1679, 4869, 6384, 6273, 3709, -897, -4913, -6638, -5746, -3172, 219, 4011, 6628, 6042, 2897, -317, -3319, -6068, -6407, -3376, 525, 3401, 5379, 6081, 3980, 28, -3576, -5308, -5474, -3938, -730, 3165, 5587, 5369, 3544, 953, -2507, -5292, -5606, -3513, -626, 2206, 4772, 5687, 3948, 620]
275F20l027j918r43J086L138L473K028L61r66k288l528k520l30J294K091K816
291A387K769R01j339k557k464k155j328P58K577K827J900R94j82k066l186k384
307c548n60M59J560K757K728Q88p35j653k325k490j463N91K039K275K022J373
323C918nj867k535j931j112j33J222K596K374R96j35j074k081k466j442K64J242
340b169J747K183J885J01j465k005j832j591n74J149K262K015J114N45o32k020
356G13k442j321j00O71J545K244J730K89j011j423j840j815p12R21J895J667J350
373B361P77l30j883j974j278m68J05J390K221J532L91m41j109j852j649p54N56
390b405J256J494J603J007l32j512j687j185q56l1J296J858J192O92K2r02j812
$$ y = [620, -2407, -4325, -5268, -4182, -1044, 2429, 4457, 4818, 3852, 1564, -1964, -4484, -4814, -3520, -1429, 1387, 4156, 5057, 3718, 1161, -1303, -3458, -4786, -4028, -1451, 1376, 3276, 4270, 4088, 2022, -1164, -3548, -4108, -3649, -2089, 668, 3396, 4284, 3549, 1896, -429, -2919, -4382, -3791, -1752, 523, 2545, 3918, 3913, 2046, -489, -2420, -3532, -3665, -2443, 153, 2527, 3523, 3388, 2314, 233, -2233, -3675, -3411, -2169, -422, 1761, 3646, 3747, 2282, 277, -1555, -3146, -3720, -2571, -309, 1706, 2820, 3365, 2733, 713, -1729, -3050, -3150, -2479, -934, 1310, 3040, 3329, 2318, 895, -945, -2760, -3472, -2551, -656, 1011, 2361, 3138, 2808, 925, -1049, -2327, -2795, -2690, -1300, 921, 2453, 2844, 2403, 1294, -558, -2207, -2961, -2405, -1149, 345, 1948, 2955, 2623, 1111, -576, -1761, -2617, -2648, -1352, 506, 1698, 2390, 2412, 1510, -302]
407c02j502o79J68R02J381J532J005j13j088j206j287j103k08J121J441J010R33
424B005L46p83j446j192q37l30N52J246J603R39J18p16j074j199j233k72Q71R79
442d23J071J109N27p10j243r64q58n37L24J178J184Q84L92l56p72j320j104l76
460a994N40P98Q78J267O08o17q35p79j079p62K88J009Q56J023O07j58q04j029
478a83j078n01K50N14J031J208N82m18n93p58j092p37L12O97O06R69P63ko93p96
498H1r63o15N7L53R36J090N44j21l49o75j139o93K10L39N46J032P30Pm58n62p96
519d46q10j70L18Q20R14N60J13k25o21j070n63M4J12M57R79P81j1k51l92q25p77
540a063j61K49M45P53P02K04l2m84r85n48j00n5M46R29O17Q0k3k57p88p75j95
$$ y = [-302, -1804, -2483, -2315, -1413, -32, 1500, 2505, 2392, 1304, 98, -1189, -2292, -2500, -1379, 62, 1072, 2005, 2351, 1568, 122, -1070, -1907, -2237, -1685, -439, 1164, 2103, 2221, 1505, 431, -768, -2001, -2273, -1402, -423, 648, 1757, 2284, 1574, 331, -633, -1491, -2028, -1704, -526, 658, 1542, 1934, 1578, 806, -514, -1618, -1994, -1454, -656, 222, 1489, 2097, 1480, 645, -134, -1213, -1975, -1687, -678, 178, 1201, 1808, 1650, 846, -183, -1261, -1762, -1512, -998, 33, 1241, 1823, 1405, 812, 54, -1038, -1775, -1463, -766, -160, 809, 1572, 1570, 877, 81, -882, -1497, -1440, -1087, -151, 939, 1483, 1362, 1013, 338, -801, -1494, -1284, -945, -399, 633, 1363, 1370, 912, 350, -446, -1256, -1426, -1108, -288, 626, 1186, 1299, 1074, 453, -617, -1180, -1136, -1024, -567, 412, 1193, 1182, 931, 539, -286, -1063, -1224, -975, -530, 223, 925, 1129, 1097, 613, -372, -920, -1020, -1075, -629, 300, 917, 997, 974, 717, -71, -846, -1041]
561a041J24K89O96N58M06J9m44p48n18l10r9L47Q44N70J37J66l05o82o27j94p2
582h84K03N37O74L04J03k84m53o16l63j76K79N90N44K90K42j83p20n28k47j91
602h79J23N57O28K38J40j43m37m99l97k54K40L91M53M57K86k13m80m69k51l01
622h10P0M67N58K26J79l9l99l98l97j32O3K64M32L87K41l8l98l68k90l16jM28
644b71L56L37K95nm10l92l19j18n8J69L73M03K55o5j75k93m14k96N3K21K53L42
666B41L41O2k75k90l08k96J3J10L30L47K65M9j98k19l90l48L2J40K24L49L02O1
688E42j48k34k86l43q1J31K73K77K05J00l0k33l31k21l9lK21L16K56P9j25j49
710A77k17l31j51J76J65K29L44N7j3j99k72k30j40kJ67L09K08J16l5j40k19l08
$$ y = [-1041, -917, -628, 68, 626, 1032, 1051, 607, -141, -659, -969, -1068, -721, 123, 693, 830, 996, 691, 9, -618, -812, -884, -681, -144, 530, 834, 937, 653, 200, -416, -779, -955, -676, -86, 458, 748, 990, 807, 87, -441, -688, -879, -756, -199, 429, 667, 807, 664, 227, -272, -669, -923, -683, -292, 161, 618, 904, 691, 211, -258, -509, -810, -740, -273, 285, 511, 690, 651, 252, -146, -543, -675, -612, -348, 84, 471, 712, 674, 276, -92, -382, -698, -699, -271, 85, 422, 717, 712, 302, -90, -409, -527, -585, -416, -43, 360, 615, 550, 375, 82, -332, -628, -575, -354, -101, 241, 582, 644, 369, 79, -229, -525, -512, -402, -72, 275, 540, 589, 391, 172, -218, -566, -534, -394, -170, 179, 481, 542, 394, 160, -126, -469, -550, -419, -146, 131, 336, 436, 406, 173, -158, -379, -418, -421, -200, 116, 372, 451, 326, 177, -40, -371, -522, -346, -181, 48, 392, 449, 436, 237, -35, -265, -405, -407, -240, 69, 277, 393, 358, 218, -1, -309]
732c09p4R4N5J89K42J56j8r9k83j93j28j4J37J94J79J49J7l0k52k17p9m0O6J65
756i3K37K06k6o1j57k32j99m1J54J47K42O6R9p3k01j44j89q1J5J34K99P0J19j
780B90j42k02k68KQ6P5J89J95J3K7j47j73j40j02rJ70J87J40P8J5j32k17p0j20
804b55M6L5J57K32L7j8o0j37j73j16j0J38R1J22J24L1j05j35o7j43k0Q1J25J30
828A10R5%j8k10j50n9K5Q7R7R9J51L9q4j07m9j92m5R5M9J38J06N9pj11j40j19
854a41mNL1J58R3N1j16k8r8k7j47P2O4J10O4P9L8r3n2j52r0J8N9R7J56lLl1j02
883A4n5j27K6jJ42O6R8ml2j42o8mr5M7P4J38K9O6j12j04j9n0Jl8J83j3J06J2r3
912D5no6n6q0L2J32J6Q6Q0n5j10m1o6L1k3L1N0J12j8m2n1n2J0o2j2J34k6J01n
$$ y = [-309, -383, -289, -234, -45, 197, 353, 335, 236, -47, -240, -368, -382, -245, -51, 128, 277, 294, 264, 12, -205, -284, -324, -258, -93, 144, 350, 324, 263, 106, -126, -325, -366, -212, -65, 177, 243, 342, 269, 68, -76, -265, -346, -331, -197, 102, 172, 291, 290, 148, -54, -322, -320, -234, -159, 30, 225, 238, 265, 118, -55, -195, -297, -306, -136, 51, 191, 269, 284, 152, -65, -135, -255, -209, -174, -17, 215, 252, 234, 174, 37, -136, -252, -262, -124, -33, 89, 213, 244, 139, 4, -63, -206, -226, -145, -20, 110, 205, 205, 187, -23, -173, -232, -207, -120, -23, 76, 227, 266, 182, 75, 26, -166, -211, -116, -67, 71, 177, 236, 229, 118, -22, -141, -145, -140, -109, 49, 142, 193, 77, 49, -49, -76, -223, -151, -87, 23, 87, 166, 204, 111, 59, -93, -183, -165, -106, -9, 147, 144, 147, 116, 14, -41, -168, -142, -143, -1, 65, 163, 159, 127, -15, -83, -87, -182, -135, -61, 77, 106, 172, 60, -44, -63, -113, -112, -150, 33, 20, 126, 138, 45, 40, -26, -82, -162, -130, 2, 18, 104, 184, 129, 19, -22, -88, -57, -80, -49, 1, 113, 95, 53, 2, -50, -40, -102, -114, 20, -6, 95, 90]
941I0n0mrj03l6LJ22m1Q2O6l1n5k4r2l4J5O7L4M1J7o3K4k8l1k3JL0J01lj1N2k5
973H2r6J0n0j3M4J5N3N4l5n7k4k7q0J12j42J34PP3M2q9k5J2l4LJ0L3J0L1L2o4
1003B1j8j1l9KrQ8J3K7m0mpJqp7K7N2j9M4K7n7M9n6lm7L0k7Q9K9r0L7o5P1j11
1036h1nJ25o9Q8l0nj3K3n7k0L1j0j0R0j4J6n4O6m9l0k3P1l7J8LkK1l3r4O2o5O7
1068b0k8K5M0N4o1m7N4n1k0JP7j2M0j7j5K6q1P1r0K2M5P5n4k9M7j0m6k1L3pqk8
1100c5N1n1J14o9LL5m9j4qkO9k2j8J4Kn3j6OoK7K5K9q9K1M1j7j1J9M7JNl0J5q
1134B6k4LK4k6k2J0K8M4n0r6O7k8N4j0j2J9k2l7%KK1l4J07r7M0M7q2L2K5j54J49
1165DM7p6k5O9Rpk9oK7l2J8J3j5K0KM2K3K1q6k1j6QL7k5N0q1L8k4Pm9L3K5Lk6
$$ y = [90, 40, 36, 27, -76, -112, -109, 13, -28, 54, 120, 89, 34, 10, -82, -116, -101, -34, 0, 41, 58, -5, 19, -9, -40, -63, -62, -32, 69, 66, 55, 107, 82, -14, -4, -54, -67, -23, -8, 45, 99, 64, 7, -17, -44, -124, -12, -154, -20, -13, 60, 102, 13, -12, 0, -34, -31, -21, 12, 22, 53, 85, 21, 3, -8, -47, -45, -54, 34, 47, 74, 34, 30, 23, 24, 16, -61, -34, 18, -1, 43, 70, 13, 62, 6, 3, -44, -14, -41, 48, 77, -13, 24, -41, 30, -81, -86, 39, -30, 58, 28, 23, 10, 33, -24, -44, -13, -23, -33, 57, 43, 59, 5, 71, 22, -8, -31, 40, 3, 21, 24, 22, 43, 10, -84, -22, -87, -20, -48, -23, 17, 71, 10, -37, 17, -34, -54, -53, 24, 12, 52, 35, 20, 46, -35, 36, -54, -32, 13, 88, 34, 5, 52, 42, -4, -25, 8, 1, -7, -35, 16, -35, 79, 10, 13, 48, -1, -15, -23, -25, 44, 22, 4, 18, 20, -33, -49, -43, -49, -22, 3, 32, -57, -36, 5, -12, -23, -4, 43, 44, 49, 19, 34, 26, 2, 5, 29, 3, -19, -9, 19, 63, 13, -83, -16, -44, 10, 0, -12, 7, -15, -52, -52, -50, -29, -63, 44, -53, -13, 34, -48, -16, 9, -145, 4, 51, -25, -50, 19, 28, 21, -8, -14, 13, -19, -1, 12, -3, 17, 19, 61, 84, 105, 19, -2, -18, -10, 27, 2, 52, -29, 9, -15, -8, -57, -24, 1, 4, -22]
1199b2lmP6po3l0M3O2q8O9J4j2J5pm0n7j4K8M6l9P8Nk5O5q5n7K1K3KJ9J9k2pL4
1233C7r5K4Kl2R9k7j4M0j5k9o3N9k6KN1N0n3J2K6q7M0Qj2mK6oN2K4n4k4n8J7O4
1266C4k5l5M4m3M0Mk6OQp1qP0j3L2L0k0qn7K6pj2k9M0L1j1l6P0l3k1o0N9l2J23
1299G0m5K6M9m9j6p9L3l3k7O9O2j9J1k3k7J3m6J6qkR3o3M5p1j7k3j7j9L9J01l0
1330A3K3n0J8K3q0R1o4OJ9MJ8K9o4Q2r1p9O0oP4%KJ0pMl4p2P2m7l4M2J28o9M8
1363F9n9j02L2Kj1R1k1P7m7ko4L4p9Q5l8J6K4K3J2m7n2L3K9j8m6O8l5K4P3r5J05
1394H1k9k6r9P2Q1j25J9L7l2M5%m5np4N6K0LP1K0n0j8pk9k3J7K3L2L3L4qj16O8
1426B6Ko2J9k2M7L2L5K4j37k0j1l2P2K6J3M0j3j5k7k0q2N8n4N1NQ3K8j5k6J6o7
$$ y = [-22, -25, -29, 47, 40, -23, -53, -10, 52, -36, 33, 47, 35, 50, 43, 3, -54, -68, -40, 6, -33, 45, 50, 25, 90, 5, -52, -31, -8, -6, 13, 32, 10, 3, 37, -58, -34, -32, -64, 35, 8, -6, 34, 19, -10, -73, -14, -40, -38, 13, 63, 10, 22, 48, -39, 1, 9, -3, -7, 19, 13, 65, 89, 35, 11, -47, -30, 34, 9, -26, 18, -25, 15, 19, -7, -1, 7, -64, -72, -2, -15, 17, 47, 27, 19, -38, -12, -19, -31, -60, -20, 11, 0, -36, 34, 1, -20, -80, -21, -53, 70, 25, 51, 100, 51, 35, -44, -11, -44, -71, -2, 60, 41, 52, 29, 2, 15, -31, -15, -23, -25, 68, 5, 50, -21, -38, -61, -78, -97, -58, 43, 13, 36, -14, 4, 27, -53, 38, -26, -20, -1, 3, 21, 50, -14, 68, -23, -102, -42, -48, 26, 26, 28, 38, 31, 35, 1, -71, 1, -46, -80, -38, 90, 21, 69, 10, -92, -60, -58, -69, 22, 1, 78, 31, 29, -35, -1, -80, 5, -33, -17, 7, 30, 42, -5, -57, -24, 5, -13, -59, 9, -26, -2, 71, -24, 81, 52, 26, -73, -1, 80, -45, -26, 11, -21, 24, 24, -21, -26, -100, -44, -24, -21, 50, 70, 20, 2, -5, -34, -57, -40, -17, 15, 48, 82, 74, -42, 26, 28, -34, -15, -37, 10, 42, 77, 101, -36, -56, -67, -99, -27, -1, 12, 52, 39, 24, -3, -23, -105, -47, -101, -50, -45, 38, 66, 51, 25, 41, -26]
1457b6rJ3l5m7J61o6LJ03r3L1r0O5kJ1K6K0k9J5n2LJ5Qr0M6K6J4k8L0n3pM0j8
1489a5qj2J2QM2k2K0m2r9J37Jn6L4L1mPl6o0KN0K5J1j3K3K4j5j0l1m3l8P8J2l2
1522a9J02q2K5J2m8K1l6m0N5K0L6l9Qjm2j4Pj7J6K0M4Op4L5joj2L6l3M8L0n7L9
1555C9j5m8OL4l7l0K1Q6j6l3l4rM2k2l9M0L7j8o2R2L4r4j0j0m9N8K7K1K5l3K8
1586C1%j4m4lJ6j0l5N2R2l4n5j9Qo9O9n7M3N1m5N7j10Q8rm2l7M0M1Pm0P6m8m2
1618d2Np5Q3k9J8Q1j1rK5m4n5J06q4M3pN5ll3J0J8l5l2K0n3N9lM7Qmn9j2l3LJ4
1652b8jmP8o2O3o7K5o5L1P2j00O2L4l1P8o8m4j6pJ9M7J5K6rk4K7n8j0kK5K1J2
1684C9l2Pm3Q0p1P0n2n0rR5mJ6Nm9l4Mj6K8j6K7NP6r1J6j0j3j4L1l3N7K0jk9M0
$$ y = [-26, -35, -22, -57, -104, 57, -9, -6, 97, 4, 35, -55, 10, 8, 19, 45, 65, 36, 51, -1, 2, 17, 25, -65, -19, 7, 21, -7, 23, -30, -37, 3, -15, -23, -35, -23, -15, 27, 5, 25, -17, -116, 21, 22, -34, 0, 31, 27, 34, -2, -62, -60, -10, 15, 26, 13, 36, 60, 45, 35, 4, -39, -77, 1, 13, -19, 83, 1, 26, 38, -10, 11, -25, -65, -10, 10, 46, 7, 15, 14, -28, -42, -35, -52, -36, -16, 28, 34, -40, -5, -6, -12, -24, 12, -21, 27, 57, 0, 39, 24, -24, -18, 16, -21, -51, -30, 56, 40, 7, -27, -36, 6, -16, -55, -15, 22, 4, -58, 34, 68, -26, -36, -46, -95, -37, -10, 11, 36, 3, 31, 31, 17, -27, -30, -14, -24, -59, -7, 85, 51, -4, -23, -15, -84, -15, -72, -29, 22, -23, 34, -76, 12, 3, -39, -76, -36, 5, 12, -28, 48, 0, -42, -37, -112, -29, -58, -40, 41, 30, 21, 46, 2, -53, 53, -31, 12, 5, 60, 57, 24, 34, 52, 17, -15, 5, -48, 11, 8, 55, 63, 59, 0, -12, -45, -42, -28, -29, -33, 45, -17, 46, -21, 4, -61, -30, 42, -58, 4, 38, 7, 85, 17, -27, -43, -50, -31, 16, 31, 57, 48, 24, 51, -7, -17, -19, 6, 27, 39, 7, 14, -29, 51, -20, 50, -2, -52, -61, 34, 30, 46, 51, 2, -32, -28, -44, -16, -32, -5, 0, 76, -15, 1, -9, -22, -36, -5, -38, 19, 39, 38, 9, 49]
1718D9n5l6J8J9Oj8K4LM4n5K9Rq3L0L9o1L6pO1p2N1o7Qm3J8J8P9l8L0m7l4P0L9
1751F4r1k2KN0L8n6K5%rK7Jo2QK9K7lQ0j13J2J7rol6M7J0QqOq0J2N7Qk8J5K4p3
1787b9M9Mj22J11N4p8J3K1p2N4j7K6J2pl2nK6%l9P8m5L0n6L8j8j4M7l2M3K1k5
1818C6q6O8m1pl1K8L9k5J8rL6p7Q5n3M9J8p2k4Q8o7P0l2k7K7j6J6l5Q4m2l6P0
1849E2j17J35j03J5K4Oj5K0Rk6J3k8nl0L5m0M6k0K5L4ok0j7k9M3jJ3n0KP1k8k7
1881a9K9m6lJ8M0Lm7P6m7L7n1O4l6j6rk6M2RJ5J9o9k8L1O5p9M4l5nL1Ol3qL5l5
1915b8J1Ql7K8%j0N4%m1pml6J03k9J0J6Jp1j7K0RP0o9j0Q0mp6K3l8M2p7O8J1L1
1949C1nn4K9N%%K8j4K0k8qqk2L5k3RL5l5K0mJ7k9l9M4J5n9K2l4P6K7l8j8LJ0j
$$ y = [49, -6, -42, -24, -5, 1, -17, 7, 10, 54, -1, 28, 37, -46, -16, 23, -38, -2, -9, 52, -20, 31, -36, -28, -71, -53, -35, 44, 6, 36, -11, -45, 25, 64, -27, -49, -47, 3, 41, -15, 10, 10, 1, 28, 29, -33, -25, 4, 31, 28, 108, -5, 7, 24, 15, 9, -27, 20, 30, 38, 30, 36, -44, -32, 25, 33, 5, 20, 44, -29, 20, 24, -98, 13, 67, -11, 2, 23, -49, 5, -12, 14, 26, 19, -13, -18, 8, 8, -31, 47, 2, 32, -24, 14, -4, -18, 29, -3, 40, 61, 36, -50, 18, -23, -30, -61, -33, 6, -19, -1, -10, 26, -51, 34, -19, 30, 48, -24, -48, 40, -27, 43, 11, -16, 11, -5, 11, -24, 60, 18, -18, 52, -65, 70, -33, -18, 6, 12, -3, 17, 26, 0, 13, -15, -20, -50, -15, -55, -9, -29, -4, 30, 24, 4, -13, -42, 1, 0, 13, -37, -35, 36, 8, -19, 10, -36, -39, -21, 19, 22, -25, 51, 4, 41, -10, 54, 18, 2, -7, -33, 9, 18, 33, 52, -17, -45, -14, 51, -28, 16, -19, -24, 7, 13, -20, -28, 7, -28, -17, -9, -46, -18, -18, -28, 26, 26, -15, -22, -26, -62, 41, 12, 22, 38, 39, -32, -49, -29, -20, 50, -19, -29, 51, 47, -29, -6, -44, -2, -79, -11, 0, 31, 26, -28, 1, 6, 6, 6, 34, 20, 40, 12, 4, -4, -26, 9, -14, -5, 30, -5, 15, 11, 28, -1, -40, 4, 19, -40, -18, -52, 24, 51, 13, -5, -2, 8, 7]
1984GL3j3m0n4P8k7k1M4o7K1RR4m3p4N8k2K3oJk6kRL5n4R1l1j4m5J08j11N6j9
2016bJ0L1l0j5Q1j3o2j5l4M7L5m5j9P9p0M8rk8Rk0m7J0Q3o0O6n5j1OlK8o0qP6
2049Cj3QP6l9j9K0pj9JMj6j4M3n1Q9k8m2K1q2R2L1o1n0N0l2L0m3K2K2K2l3J3L
2082AJ0k5L2k3l4L2nM8k5l7k5N2N0k1n1O6q2K0J5j9K2J2k4mJ5j7O4n5%Mj9J3l0
2115d0O7l8m7M9K3m8N8o3Q0m4K2q6P5o3L2L6j9K0j5LOO2k6l8RJ7m9K4k7M4l5K0
2147IjJ5o5J6pJ9M6j00P1j3kqNORn4O5j3Ol0L3k6K2%l0K0l1O8j3M8m3j0J1M9K9
2182A01j0q7J1J4j1l6L2l9O8n5N7m2LQj1k7j8K6K9l0J5k1J0J8K4l4j3M1n8JpQ
2214c3N5m4%K0Rl0j4L9m2mN0M8m1m1jP1l4m1K8l0QQlK5m7R8j18N9lM7l7l5k0R0
$$ y = [7, 40, 27, -13, -67, 11, -16, -37, 7, -60, -39, -30, 64, 21, -53, 5, -17, 6, 0, 1, -25, -27, -18, 17, -37, 54, 23, 9, -36, 72, -39, 17, -2, 8, 39, 9, -6, 75, 62, 0, -15, -49, -2, 33, -12, -31, 48, -22, 26, 17, -11, -2, -22, -69, -59, 24, -36, 30, -25, -36, -30, -33, -5, -65, -73, 3, -10, -2, 74, 35, 16, 36, 29, 10, 11, 15, -1, -15, 28, -23, 66, 38, -4, 17, -65, 27, 58, -3, -53, -3, -35, -5, -48, -26, -4, 18, -15, -2, 1, 11, -14, 18, -5, -39, -7, -12, 36, 11, -26, -51, 1, 51, 30, -21, 45, -37, -17, -2, -21, 1, 13, -11, -15, 0, -17, 47, -8, -8, -4, -23, -10, -40, 27, -11, -58, -9, 14, -34, 24, -39, 41, -3, 19, -67, 8, -55, -23, 13, -6, 14, -1, 2, 8, 70, 44, 6, 15, 32, -17, 7, -20, 24, -11, 9, 8, 23, -42, -26, -33, -14, 32, -68, 3, -10, -12, -20, -15, -9, 0, -54, 11, -2, 4, -26, 7, -19, 3, 3, -27, -7, -38, 30, 17, 65, 22, 12, 23, 72, 101, 91, 4, 15, 29, 18, -18, 14, -25, 43, -12, 45, 3, 6, 14, 3, -24, -42, -16, 13, -17, -2, -23, -13, 5, 29, -5, -18, 23, -35, -34, -41, -33, 22, -22, -22, -2, 7, -23, -37, 2, -40, -44, 6, 54, 13, -28, -29, 42, 8, -33, -5, -35, -27, -19, -22, 3, -44, 54, -64, -5, -8, 39, 2, -33, -53, 37]
2248C7n1q6N0R7m4oL0l6J8j0j7j8K8J7k0l6Q5k4o6L2M0M8p1jNJ2KJ2n4Q1q0N6
2280C0r3P8j4n4P1J7p6j8M8n5N8J9ORk6oj5l3L1L3L3p5O4o6O2J7o6N8N0o5L6m3
2312A5K2l9mL7l5o1O9k8k9O4J5Po0M6l7l2Q6j25R3qn6RQJ7m5L3L8J5j6J5m2M2
2344A4%k2m2P5mL0Qq0jpnJ1J7j0L7k2K6ro3ML3k1K3JL2%n8pj4K8N2k3l8M6k9R
2380iN8j2k9k7Pj9rN0n4L7qL7n7M6oL6k2j8J8m2nlOL5j7k2qN5j3kJ2k2J1p3L7
2415c2P4n5n6O9j3LL7o8P2l8%k0J3j4M9jk5QL9j9L0j05K1M3j3J9J8j10P3l5N5
2446A9m7N1n6O7o8qK5j8J6N8o8N1k4j3LRk0J0L2jK6l7p5J03m7K8rJ4Ln3O4o9K3
2479a1M6J8r4Q2n8j8M5k8K5k7Lk5K2QOk8m%QLKL5J6o5l5M3K8lP6j3o6M2Kj7M0
$$ y = [37, -14, -100, -50, 47, 3, -3, 27, -9, 9, -1, -18, -36, -8, 9, -11, -47, 38, 14, -52, -20, 20, 68, -3, -4, 1, 13, 15, 27, -27, 54, -26, 30, -63, 15, 1, -53, 18, 35, -41, -59, -11, -66, -8, 11, 17, 26, 0, -6, -21, -54, -23, 10, 43, -32, 32, -34, 28, 45, -21, 37, 87, 22, 58, 15, 37, -2, -6, 31, -4, -65, 4, -24, -53, 11, 26, 33, -27, 19, -18, -50, 36, -89, 4, -4, -60, -51, -43, -26, -71, -38, 0, 15, -1, 14, -28, 14, 14, -8, -50, 25, 21, 51, 59, -21, -22, -29, -34, -23, -6, -16, 21, -1, 25, 16, -47, -43, -10, -31, -8, -7, 25, 25, -33, -40, -54, -26, 26, 3, -35, 11, -18, -9, 49, 37, 8, -19, -12, -31, -40, 10, -44, -7, -15, 22, -35, 11, 5, 41, 19, 1, 19, -23, -28, -31, -25, 10, -7, -29, -37, 18, 5, 3, 15, -7, 4, -69, -32, 42, -13, -69, 0, -13, -10, 27, -41, 31, -7, -7, -27, -14, -28, 21, 20, -5, 3, 42, 23, 53, -52, -31, 12, -1, 18, 36, -74, -1, -36, 19, -28, 23, -33, 34, -34, -42, -17, -35, -19, 39, -29, 22, -2, -15, -12, -3, -23, -13, 19, 18, 44, 7, -68, 35, -12, 16, 7, 21, 24, -29, 35, -34, -11, 35, 53, -41, 41, -17, -35, 10, -18, 7, -20, -17, -42, -20, -12, -6, -34, -38, -38, -30, -27, -25, 10, 26, -39, -74, -31, -3, -6, 70, 57, -9, 33, 35, 18, 58]
2514E8j00R3m2%m5N9l0j0J7n4N5k3J6m9N9qJ3J9j8l7K8l8N9nLo4L8KK3Ln5K2q
2547a9K0L6n7j0KM2Mp5Q8k6j1L1k2M2pm3M1o0j0M8j0l1L8j1L8J4j4m5m2O6j9j8
2579b0QlL1k4n9L9J6L2Nmj5K6p4N6M7p6J4J1j7L4L1j6l5j9K4kk2L6j8K1L5o9K3
2612A6l9J0P7n1n0K9m5OM5rk6j9L2M0n0K0J9O0j02K7J6Rk4k7J4J3K4k7N1k2J5
2643C2%orK0Nk1l4JN3k4kRj5l7PK7l2J4J1K6N1r0K1p3J2J08n6K2K2Pk0pL2m0j0
2678DJ7j0j5L8%K8k9j9%Oj7l8N9Pj8J4k3K1o2L2l0M2o1J0K6rJ0K0L2n3J0K8nn
2712A0r8J16n8N7o4J9j2j6R6m7O9j12qL8LK9l6ML8n0J2QN4m6J9m7P4q8M5m9j4
2743e4J0M5k1K5l9J5M6q0P4l1mJ0m2K2k4O2Qm2Jl0N4j0L7k0k9Rl3M1N1o9JJ0K5
$$ y = [58, -42, 51, 9, 9, -36, 23, -7, -17, 0, -54, 1, -22, -6, -55, 4, -4, 9, 28, 10, -27, 1, -37, 22, 17, 20, -44, -6, -4, 19, 22, -33, -11, -19, 1, 37, -20, -30, -28, 14, 18, -57, 31, 5, -6, 25, 3, 45, 38, -5, 36, -24, -34, 14, 4, -27, 11, 0, 38, 52, 38, -7, -49, 17, -2, -20, -12, -15, 16, -8, -67, -28, -12, 20, 25, 21, 6, 32, -42, 14, 61, -15, -1, 10, -7, 27, 58, 42, 7, -12, 12, 10, -12, 24, 6, 27, 62, -7, 16, -23, -13, 64, 13, -37, -8, -53, -47, -2, -11, -37, -56, -24, 16, -34, -14, 5, 65, -37, -10, 6, 15, -9, -36, -22, -9, 15, -12, 39, 17, 32, 32, 26, 17, 37, 42, 21, -13, -12, 41, 17, 15, 24, 9, -28, -21, 6, -26, -12, -1, 25, 76, -14, 7, -66, -54, 54, -2, 20, 42, 49, 29, 22, 54, 14, 4, 21, 11, -4, 34, 34, 62, 33, 14, 14, 20, 3, -35, 24, 31, 13, 27, 4, 25, -37, -5, -35, 7, -54, -44, -18, -27, -17, 3, 35, -18, -8, 20, 15, 10, -88, 28, -30, 27, -37, -18, -30, -46, 50, 3, 72, -40, -48, -10, -7, 22, -14, -10, 28, -22, -10, -2, 52, 6, 25, -22, 52, -36, 9, -40, -54, -44, 1, -20, 5, -34, -19, 27, -53, 21, -10, -14, -4, -46, -24, -48, 14, 22, -20, -19, -49, 5, -5, 32, 12, -17, -8, -41, 0, 51, -18, -17, -7, 18]
2776A8k9J0M1n0L1k4k1lJ4N1q3K8J8j1o4K6L8j8O4Nn9J4J9O0o1m2RQ4m6mJ7o7
2808c5N8m1N7n4L1j1M1o0k0L4o5N3j5L2L9m4l7K6M2l7j2RJ3k5j3m5Q1KJ7J8n6
2839a7pl8R3p7L3L3J0k6j0L5m6L7rL0%k1omKrK4K0n0K2k4P1j6p5qj1N2l2JQ3p9
2874a9Jj0M7q6Q0o1K3Jj5KoJ39j24M9J6k8j0K8j5Oj4M6j17J02q2M6J6j5L5m7L8
2905B6L5q3K6j5K0L3m9K3K7Rm6j1NK4k6p0N1mL1l6J2M2k1N3r2K7J1lL9p2M8j4
2937@L5o7Q1ko6oN0J7j9K2j7n0M2l9P1o7K6o2R5q3Oo3Q4j3K0m8L7j5L1Qk8N5l4
2970AK7j1J8m5M1K1L0j16PK4L5j9l2L8j3k4k0PO5ok3j5P5p1k7J2J2J3J9Kk3M2
3002D4o1O8n9kj5l3M8L0n9L3ML4n1kP0m4J1nj6l9M3kL2k4J0m2K9k7L7n7N9l0L
$$ y = [18, -11, -1, 40, -10, 21, -3, -24, -27, -13, 38, -45, -17, 1, -10, -74, -48, -10, -28, 36, 41, -18, -4, 15, 75, 14, -28, -19, 65, 19, 15, 32, -35, 23, -18, 39, -15, 16, 5, 46, -14, -34, 0, -65, -12, -27, 5, 44, 0, -37, -11, 31, -6, -18, -9, 4, -21, -34, -79, 2, 4, 21, 39, -17, -24, -62, 31, -46, -13, 20, 30, 4, -6, 29, -17, 20, 11, 41, 41, 20, 14, 10, 12, 3, 27, 47, -3, 19, -5, 66, 50, -25, -33, -44, 8, -24, -23, 60, -19, -18, -28, 19, -67, 13, -48, -25, -24, -39, -37, -43, 96, -28, 21, 37, 9, -1, 27, 12, 18, 4, 50, -67, 35, -47, -1, 15, 0, 35, -12, 26, 61, -22, 4, -11, 9, 42, -7, 16, 43, 52, 6, -5, 0, 24, -2, -72, -21, -25, 6, -30, -18, 24, 3, 56, -36, -9, 2, -1, 38, -34, 14, 0, 35, -32, 49, 47, -19, -25, 25, 42, 23, 45, 28, -22, 20, -19, 52, -15, 11, -51, 44, -39, -33, -96, -12, -25, -5, -53, -16, -31, 0, 8, -20, 35, 1, 28, 17, 35, -10, 31, 52, 82, -34, -27, -3, 32, 13, -19, 19, 6, -18, -38, -31, 34, 28, 5, -10, 65, -6, -33, -21, -9, 4, 23, 25, 2, 44, -17, 51, -8, -10, -25, -58, -10, 20, -39, -6, -2, 32, -19, -21, 49, 5, 16, 11, -5, -44, -1, -3, 29, 5, 15, -27, 2, -25, 12, -45, 14, -16, -13]
3035a3K0jj1N0m7l5pK4O4m3%k8J9J3m9K7K7k8N2m0m0R9j2M0o2l5l3L7O4k7n8N7
3067B4l7K9J4o9O5p4M1pJJ2P0n4o7K2J5M1j9m4M2m0QO6m8l5M8lO0r8O6J8k7ln4
3100c7Q9o9J8Q6k5J0o3No4J06l4j9J8l7K1J3l0l5K7J0M6p3%Mk8PP3m0L4l4L4o5
3132e2N0P4l3j3J8K2n7j1QJ1n3pO0m4J9nM8n4Q2m8k8L1o7M1Mj2%P9r2P8n3K4m9
3165b9J3L5n9l1P8ro1N9j2L2Jp7P4jm8J4M5j0M1n0OK6j4Qm1jP6j59P2L6j7J2j5
3198fM4q0R4m7Mm6K3J6K0j8L3q1N4o1O0l0K2j4K5kOqJl3O1Q0j12jK2M5j11K0N8
3231C8l0k4N6n7L8m2O7k5J2n3L4j9K0jk6K9j10J35p1K6J9l4l9O0l0L6m4N6jL6
3261E6j8q5N7oj8J6QLn3Q9j9j0l1j9N5n7nK8j6N3j6L3n8k6L4k9M6j6k7oNQ0j1
$$ y = [-13, 7, 6, -5, 45, -2, -37, -44, -20, 44, 1, 1, -27, -8, 5, -44, -17, 10, -18, 34, -6, -46, 53, 41, 81, 19, -16, -49, -12, 52, 25, -33, 24, -13, 16, 30, -39, 26, -48, -7, -14, -13, -1, 69, 15, -52, -30, -15, 26, 7, -37, 5, -35, -27, 39, -9, -44, 4, 1, 61, -37, 29, 47, 20, 17, -37, 52, -17, 1, 87, 62, 72, 9, 14, -50, 56, 22, 3, 21, -16, 5, 18, -12, -47, -20, -10, 36, -37, -37, -33, -61, -54, 19, -21, 13, -21, 13, -52, -2, 72, 39, 26, 44, 66, 9, -2, 6, 17, -36, -43, 17, -27, -8, -13, 35, -19, 63, 15, -13, 18, -49, -8, -4, -16, -16, 63, -29, 49, -4, 20, -29, -16, 19, -40, -71, 7, -2, -63, -4, -16, 16, 17, -60, 14, 13, -35, -21, 24, 14, 55, 5, 11, 37, 23, 31, -10, -11, 65, -94, -22, 14, -3, 9, -6, 38, -42, 52, 5, 9, -37, -14, 2, 22, 4, 37, -44, 10, -51, 9, -21, 1, -13, 12, 10, 16, 8, 9, -24, 37, 117, 5, 4, 26, 71, -40, -20, 38, 8, -16, 40, -17, 21, -21, 46, 21, 33, -20, 14, -5, 15, 14, -12, 17, -93, 42, -29, -3, 16, -18, -57, 3, -27, 9, -35, 21, 20, 56, 38, -47, 10, 4, -14, 2, 10, 13, -40, 49, 30, 20, -11, -30, 25, -32, -37, -9, -25, 28, 12, 45, -13, -39, -5, -34, 12, -4, -31, -37, -32, 48, 37]
3294C7n5lN3o2n7L6J05q1M0j6L6o3O9l7L0j5K2j3q9O6j3Rk1RN8J3n0o6K9J23q7
3325Gj5pL3Kk7n0j9M3J03j02P3r8J3L2K1K7n8NL8n9L3k5M3l4l7O4J3J1j3l0O2
3356D9j0m4M4mK7j06L6lJ0k1l4J1R2n4m3O8m1M1j2k3KL7o6L4O1l2j6J2Pq9P3J6
3388B2n3M4oLl1J4L4k9J9Qp2N1k9JO3nn1J1Ll2k6R2l9N9k4oJ2l3j2m1K0M2o4N3
3422bn7O0J0K7j4j0oRj5PJj6L8l7JK9K3p0N9l0J7K6p2M9l0m3M5l4k6L2N0l9kK7
3456Gnqk1M3o6O9k4J2J9J0j3K3ll6m6L8K0Kk1O7m5n4N0o5P4l9J4N4k3m0RM0q2
3489d0K9k0kJ4K1lo9O3J4K4l7j5L9o3O8pRjn0N2L9p1K1oJ2l0j8QM0o5oP4k2K%
3524Dk4O6j8lk6N%jm1l7K6J12j02l3P8k3J4Qk1j0J3j9M9k9n7O3Mj9K1l3N2k6N2
$$ y = [37, -18, -21, 32, -30, -87, -51, 54, -27, 13, -3, 33, -30, 39, 2, 32, 17, 39, 26, -63, 3, -10, -1, -22, -13, 45, 58, 8, -58, -29, 94, 7, -8, -15, 18, 20, -7, -57, -76, -33, 70, -32, 41, -57, -44, -12, 9, 36, -22, -17, 21, -38, -5, -30, 13, -21, -58, 6, 19, 30, 17, -13, 49, 39, -5, 39, 35, 62, -44, -8, -11, -1, -22, -56, -45, 47, -7, -50, 18, -23, 18, 6, -17, -15, 22, -44, -10, 51, 19, 3, 15, 22, -67, 6, 22, -31, 13, 7, 10, -21, -7, 27, -2, 17, 25, -47, 4, -25, -24, 39, 34, -17, -6, -3, -35, -61, 31, -8, 51, 27, 21, 33, 0, -12, -53, -33, 9, -55, -2, -59, 1, 11, 38, 24, 14, 8, 17, 2, 9, 10, -6, 32, -5, -4, 25, 48, -22, 37, 7, 24, 50, -22, 27, -3, -46, -1, -35, -61, -29, 21, -18, -20, 7, 2, -6, -27, 16, -50, 19, -5, 7, 26, 36, 23, 46, 43, 7, -39, -1, 19, 21, 0, 67, 22, -32, 18, -47, 27, -12, 2, 56, 33, -7, 2, 42, -40, -11, -31, -33, -19, 2, -1, -70, -7, 7, 31, -6, -21, 18, -45, 23, 16, 25, 24, -26, 26, 65, -6, 15, 9, 21, -9, -27, -19, 21, -44, -50, 24, 2, 4, 4, -20, 46, 28, 25, -1, 4, 4, 3, -38, -75, -49, 63, -39, -72, 6, -17, -3, 5, -16, -26, -13, -32, 17, -12, -69, -6, -2, -21, 0, -33, 19, -7, 45]
3557D5mJ3m3J1nkok1J3N2K0q1j6j7O9Pn9M3om4K5pJ8k0J7l4ML7L0o4N0m5lj0o0
3592i3J03K4o7K4L7l2L1j4N5j26M1NN4n7MN6k2n9O7j4j7J3m8J5j3OM2k7j5l7P4
3623A0l1M6l6Ll0L9o4RP2l5L2K6m4KJ1j0l5K2K1l2j0N1m2N7m1M0k5L3q2Q7k7r
3655HN8j6ml5J4lm7k2N3J2k8pPJk1KK0J2j1pK5n2L2K5Qqk9J2jJ3l2j8O5j6K4J4
3691D8J8q2J5J5L1j6n3Rk1J8KN6l6j2k1L8l8jN9o3N9om0Rj2LM2Lm3JJ2J3Mk1L5
3726B5Nm4L9PQk3K9pp4L1pL9m2%J5%o3M6J2lk9P0o6L%J7J1l9M8L0o6O3j0k9ll4
3762d1Q3r0M5k3MR1m6n9PMM0j0J6M3l8%l1N1oq1oJ08n3nok5L8m8k8K2Mm9J0J02
3796B3n3nLO4K1q6K2J5j3n3O3J2m9L6N8p8JQ0j1l4N3o2m2P5J4m0J3p0mM6mK4n1
$$ y = [45, 41, 54, 11, 22, 17, 15, 9, -12, 1, 53, 73, -8, -24, -41, 28, 35, -24, 19, 13, -31, -6, -13, 5, -15, 2, -32, -28, 9, 39, -25, 25, -20, -23, -33, -93, 10, 34, -33, -9, 28, -4, 27, 13, 68, -58, -17, -12, 42, -15, -11, 45, 23, -36, 31, 17, 0, 13, -35, -20, -33, -27, 15, -12, -27, -64, 10, -21, 25, -11, -8, -38, 1, -63, -54, 18, -17, 15, 41, -3, -1, 10, 0, -35, -13, 8, -24, -34, 17, -25, 32, -9, 31, 6, 39, -43, 44, 17, 8, 66, 50, 46, 11, 25, 22, -25, -47, 6, 18, -10, -17, -10, -9, -30, -28, -8, 4, -7, -14, 11, -41, -9, 16, 24, 16, -13, -1, -2, 11, -21, -39, 26, 10, 34, 48, 66, -16, -1, 14, 45, 29, -24, -15, -36, -18, -16, 40, 4, -8, -29, 9, -29, -30, 29, -34, 25, 19, -21, -12, -24, -21, 21, 24, -19, -18, -6, 7, 11, -10, 25, 30, -14, 25, 32, 40, 17, 46, 39, -35, -4, -11, 28, -14, -14, 1, 1, -62, -16, -4, -7, -36, 34, -32, -29, -29, -12, -1, -40, 8, 38, -28, 35, 25, -4, -7, -41, 42, -48, -3, -26, -22, 69, 23, -36, -29, -25, 15, 5, 21, 64, 26, 26, -5, 46, 40, -41, -47, 61, 8, 3, -3, -28, 10, -38, -66, -44, -40, -89, -79, 23, -30, -35, -32, 32, 53, -33, -11, 4, -9, -62, 1, 13, -36, 0, 58, -20, -19, 61, 50, 16, 69, 7, -35, 40, 54, 14, 27, -43, -47, -1, -5, 19, -32]
3829c2P8n2J0j6N8o6lL5l5J8K7p2L6n1J12m1k9RL8m4K9oM3m2k0N5m1O7o5m9M1
3860hK6m4L3m0J2K4Rm5M1Ql5m1L0lK6k1j2KJ10r8Q3n1j9M3m0J7j5M0k4n5P2j8
3892GL2ok3J5l5L7K8k2J9k7j3J8l7K9k6J8m7k5O6Mj0K3k9nlk5JN3n3K8K4k7J9
3925Hm4O4o4L5j2K4J2k1jP0k9o4N4qn0L4j3Nj9J9K5n8O6M1q5J5j7o4M4Jk5J23
3957F6p6%j2K2nJ8Qo5k4M3m8L6K3M2J8j9ol7k1O7K3n7J7m9N2J3j8Qlm4N4Qn2M0
3991B2j8Oqn0P3m3L7l1J6p2%N0j8K1K5Lo9K1Q1n7L0n7L9K0q1L7M3m2K9Ok3j8r
4024c7N5pn0%L6L7j4k9J3m1N0n9M3l6J6N7m1QJ7k6L9pMj3Qo0lN9l0k2M6k9j0l
4058b9P6olj9k3NlM7m0N9m6l7N9m4m1O8M7o6j8J2L1l5o3Q4k2J5l7qM0l4P0Nn6
$$ y = [-32, 46, -6, 4, -12, 46, -20, -23, 12, -23, -5, 22, -50, -14, -65, 47, 6, -23, -14, 24, -20, 9, 3, 46, 4, -16, 39, -2, 65, 0, -49, -8, 18, -26, 7, -33, -21, 3, 12, -33, 8, 16, -19, -60, -30, -33, -7, -28, -40, -38, 72, -26, 57, 6, -13, 30, -10, 7, -8, 32, 8, -47, 25, 7, 39, 33, 10, 25, -10, 27, 55, 33, 52, 25, 12, 30, -7, 22, -4, 14, -33, -58, 8, 12, 2, 25, -4, -9, -12, -37, -36, 17, -36, -8, 16, -11, 8, -36, 28, -36, -1, -13, 11, 23, 2, 1, 71, 42, -22, 32, 24, -26, 8, -5, 0, -19, 0, 25, -33, 33, 74, -11, 4, -13, -77, -33, -32, -57, 66, -10, -10, -22, 0, -5, 13, 21, -44, -68, -25, -73, -37, -14, 28, 46, 27, 21, -16, -37, 30, 53, -4, 13, -36, 16, 29, 11, 19, 16, -28, 26, 34, -18, 22, 4, 10, 2, -48, 25, -18, 19, -12, 4, -68, -68, -18, -36, -15, 10, 13, -56, -35, 46, -11, 19, -38, 1, 21, -60, -23, 20, -22, 7, 13, -10, -28, -37, 18, 11, -39, -39, -3, 34, 20, -9, 4, -37, 13, -46, -3, -39, -23, 34, -7, 1, 18, -8, 31, 24, 28, 15, 23, -37, -40, 19, -11, -33, 13, -16, -26, -29, 47, 41, 38, 19, -4, 1, -2, 45, 5, 64, 18, -19, 40, -4, -45, 23, 70, 4, -14, -2, 29, -6, -69, 15, -7, 8, -29, -37, 3, -31, 39, 44, -12]
4091a2J7n6O2L6l8mJ7n5N9k0K5N7p6M0j3o2L4k2jk4P2m2K9J5pl1j4poL0K4%k6
4124Aq5O5K2j0m7L0L3kM9m7j9K5k5J0L8qo5QQN0j2j0POk4N8j11R0j6m4M2Kj9k8
4158b8j2R1j9q0P5q3K1k4M6Nk1L4m6K2N9k6n4M8j3qM6p2QP7j8k3k2P7l6o0M0k8
4190b4J0K7j2j0N7n2L4n3lK7J4o1R0m9K3l5rJ0l9J7L5M2m0POom4M1J9Kmj9J5K1
4224C7j5j2o4L2l4O4k1L3mk8M4nKjn7N9l5k7M4K7n6MJ1K9j7l9M0o8J9M9Qk2J0
4257Go1J7L8K6q0O1l5po7J33n5J2L5Jn7M2k8l1P8jKJ2j7Lp0L1M4rM8k7M0j04J1
4290hl0j4N1QN5m0MJn6K5o5N0K9nJ3o6K9j0N1l6N9j6m0lJ4l6Q6p2L9J6M4m8l2
4323cqpM9k4J3j2m4k2J01k3J8qj5nj8N7j5o7J4K2oN4p4O4n1k7N7n4j6L6k3N0L5
$$ y = [-12, 5, -51, 11, 47, 9, 5, 22, -33, 26, 6, 31, 88, 12, 52, 39, -23, 11, -11, -12, -36, 36, -6, 23, 38, 31, 0, -14, -21, -27, 3, 27, 27, 1, -84, -19, 3, -7, -54, -24, 9, 7, 56, 9, -10, 15, -10, 0, 38, 30, -35, -27, -19, 31, 19, 9, 16, 22, -2, 56, -55, 35, 19, -25, 17, 19, 0, -28, -40, 51, 32, -48, 27, -56, -35, -59, -13, -8, -29, 5, -41, -19, 40, 14, -40, 8, -5, -13, 33, -39, -31, 46, 28, 5, -17, 60, 24, -36, 4, -24, -14, 13, 1, -9, 48, -4, 30, -23, -26, 1, 15, -46, 44, -5, 18, -17, -26, -16, -55, -38, -3, 39, -1, 6, 12, 6, -38, 3, 22, 24, 20, 1, 16, 37, 22, 10, -54, -22, -56, 8, -13, 20, 16, -12, 32, 27, 29, 28, -29, 30, -5, -32, 12, 39, -17, -13, -2, 27, 10, -29, 11, -57, -38, 11, 19, -3, 7, -54, -37, 1, 27, -53, 8, -27, -34, -101, 32, -23, -11, 24, 25, -32, 10, -18, -49, 29, 28, 30, 42, 25, 28, -42, -11, 33, 24, 72, 45, 85, -19, -8, -38, -52, -1, 7, 62, 22, 26, 27, -29, -4, -69, -19, 10, 5, 18, -48, -19, -29, 22, -14, 45, 29, -11, -14, 0, -36, 50, -22, 17, 33, 77, 29, -3, -11, -18, 31, 7, 20, 8, -36, -58, 43, 20, 38, 30, 15, 10, -8, 49, 34, -33, -19, 3, -3, 51, -23, 41, -10, -37, 20, -34, -50, -14, -37, 13, 48]
4356D8ql0L3m1mmj2NJ0J9Jm6R3o0L4p0J5k0O1n3P8n2L2n9Mj9K1MQM1Poj8J2o8
4391d4M6lN0mpp4K5L8m5l9N2J0mK1J1l7j2J4j2QMP1j03M0l5Pk2k2L1M4k6P7o9
4424iRn5M9K3N1p6L8J0p9PM3j2J7k7L4M7k1l5n0PqO0oo8J6M1k7N7m5ML6j1l2M3
4458C1q8L9P9m7k5mn0J12l4M6j2n9jl0P5j0l7M3k3L7ONj2k0l0M8mn4O6l4n1O7
4490B9Qn7l3P5k6K7K6p9O3n9J3m7L4M8k4K1l8OKKn2M5Q5p1PMnn5K2M9N0o1l8P8
4524D9Ml7J2L2j06R6l6Rm9jL1O2n0m4R0q0K5j2RL4o6%Q2o3J5n4N6j2oq0J17k7
4556@J7j3m8M3K5k0Pj6J0LK7M5j09k2L6M6n4K7J6m9M2m3J5M0K4q1P3o2M4m6M4
4587B1o6k4N1k6K5k5L4L0J8j00%J8P8k7l1M7o9M7k4J0nK4J0R5j15L5o9Q8n9K1
$$ y = [48, 40, 10, 43, 2, -2, -6, -18, -13, -3, 16, 17, -29, 64, 4, 38, -32, -17, -37, 24, -29, 49, -3, 29, -30, -26, -45, -24, -20, -12, 29, 36, 30, 12, 24, -44, 2, -1, 49, 45, 38, -36, -11, 27, -18, -57, -5, 5, 1, 22, 33, -4, -16, -2, -14, -6, -2, 69, -34, 6, -29, -22, -44, -66, -35, 9, -17, 60, -9, 0, -55, -6, 17, 68, -8, 30, 40, -39, -32, 11, -1, 16, -11, 23, 70, 49, 14, -36, -29, -37, 23, 17, -51, -35, 6, -21, 36, -9, -5, 31, 20, -12, 31, -57, -18, 61, 14, -11, -15, -65, 47, 13, 59, 47, -12, -13, -43, 32, 22, -15, 28, 5, 42, 48, 53, 41, 21, -9, 39, 35, -19, 47, 13, -38, 29, 37, -20, -53, 22, -4, 23, 49, -30, 33, -26, -13, -60, -26, 22, -2, 19, -19, -13, -11, -9, -61, -16, 69, -2, 5, 9, 4, -51, -29, 20, 70, 9, -29, 49, 53, 16, 28, 60, -46, 50, 14, 23, -26, -27, 4, 66, 16, -28, 62, -18, 7, -5, 4, 38, -28, -28, 54, -9, 6, -48, 8, -4, -10, -90, 27, 0, 17, 4, -44, -1, 24, 4, 11, -5, 5, 8, 35, 80, -29, -51, -15, 31, -23, 4, 20, -29, 13, -30, -15, 25, 49, -32, 41, -21, 23, -23, 21, -45, -69, -18, -44, -19, -44, -10, 20, 38, -62, -62, -44, 34, 7, -24, 23, -46, 1, -23, -13, -18, 6, 16, 111, -4, 31, -38, 50, -9, 12]
4617A2J4n6M0j4J4K8j7Lk4j3JL6J5p9j1M1qN4p7K6J3l8LN4k5n0O9k1LL4J9j06
4649f0M2QK1j0K5Jj7K3Oo2N1K1m2MJ5l9K0k4J7j5O4Lm9j3m5P1L6o2k9j1J2J1n4
4682h1J06j4l1NJ9k1lM8o1M0LN6jk4k3k9K6J4l2K2L7oQr1J7J7J5Rl9K9m1M7o4
4715d3m7N4pM7om2M3JK8m4K6k1LL9m7O8m2o6N0O0k6j9KL3o4J1K6oJ0J8o5O1m2
4748gJ3j0k3N1m4j2L2N5j20O7l0rL3nj9P1m1Kk5N6m5L0l8J8R1n7l8J9k6M1%K3
4780E3l6K0m6N5k4K7o6l9O1j0lJj2K1k3O2k2m0M1Pj8n8K6jL4K3j1o6M6k7K2JJ6
4813A4k6Rk9K9L0qm3J3M5k5J5r0P6JrJ5jl3oM9mJ2Omm9k8k2Q3Jq0R1J2r6L9l8
4848e1P0j6L4n4n1P9J1%l6K8Mpj2j6J0J6o1N0J1m9L1JL5o1M7M3o3L6k2j7m2J1
$$ y = [12, 26, -30, 10, -4, 10, 38, 21, 24, 0, -13, -12, 24, 39, -40, -51, -10, -18, 36, -41, -15, -2, -40, -37, 17, -8, -58, 11, -10, -7, 27, 46, -60, -18, -10, 11, 1, 26, 27, 10, 33, 39, -23, 28, 49, 7, 11, 26, -13, 7, -17, 0, -15, 49, 52, 3, -10, -55, 16, 52, -10, -39, -50, -38, -27, -81, 25, 11, -20, -15, 4, -17, -20, 28, -33, 7, 10, 66, 65, 41, 18, -11, 15, 29, -3, 19, 56, 50, 58, -33, -16, 1, 16, 25, -14, 15, -26, 21, -43, -90, -36, -43, 4, -2, -44, -1, 0, 28, -16, 10, -11, -8, 31, -16, 52, 10, -56, -6, 54, 28, 9, 11, 44, -20, -9, 17, 11, 21, 39, -26, 35, -7, 6, -4, -27, 24, -20, -32, 0, 55, -65, 2, -28, -37, -4, -9, -28, 43, 2, 4, -21, 35, -10, 20, -18, 0, 91, 34, -4, 15, -11, 30, 30, 53, 17, 37, -9, 46, 22, 49, -17, -56, 5, -5, -8, -7, -19, 2, -21, 41, 19, -21, 20, 27, 9, -49, -23, -24, 10, 33, 22, -44, 2, -25, -3, -2, 14, -12, -3, -32, -3, 27, 19, -24, -11, 34, 9, 24, -66, 10, 11, 2, 17, 16, -17, -23, 26, 22, 34, 40, 36, -13, -41, -63, 20, 21, -59, 32, 44, -52, -13, -51, 19, 3, 37, -17, -68, 11, 22, 22, -14, 14, 18, 11, -1, -17, -7, 9, -52, -2, 9, -40, -9, -8, 27, -34, 13, 56, -7, 29, 7, -10, -52, -41]
4880d1O0n6L5m3L2Kl7K9oj4P7j06N3O2m7K1j5rK7j1oM4J4m7q6R6l4NKO8m3j3M6
4913E9m4MNm2K5M2o1LO6n1j8K2M6o6Pn0M6k0L7k7K7M0j7k4K8n7L5p0J25o5K2Q
4945C5n5K7p0P7j5K9j1kJ8k9Jqj9K5m7K8l3N2j5qkqM0j9JJ4J3l5P6p4k5L4l5J00
4979F0j05N2l5L9j0L5m7J4j1J4M4n9j7J2J5MM4j4l8J8k3j3mNRL1jp7M5l4Q6j4
5011B5p9qJ03m9N0m0l6j5N6K2m8L6k5O4k4l1L7n7rk1Q1K1m4L3J0Qn7j5J0k9M9
5042A8l6j3R2j08P7Jj7l1j2K8k3J3J2o7N5k4j6K7J6n0L5K1j6L2j9M3Nn9N9Mm4
5073Cm4P0k0m2Q4j7K0J5q9K8rl3L6k5O3J3r4K1K6km6M3l3K4l5L1Mk3L9PQn1L9
5106A1k7nJ2koR7q7K6n1N4J1L2K8q5K1O7q5m8KJ3MpQJ7k8N2l8L7n2M6Lj28J05
$$ y = [-41, 19, -37, -2, -45, -13, -11, -48, -19, -25, -39, 38, -68, -15, 47, 0, 21, 6, -3, 24, 13, 7, 51, 65, 18, -68, 28, -6, -1, 1, 69, 26, 13, 59, 15, 19, 24, -18, 7, 49, -12, -9, 57, 6, -12, 10, 56, -10, -3, -53, -7, -27, 10, -17, 10, 50, 33, 9, 37, -20, 15, -55, 70, 5, 27, 35, -20, 7, -63, 14, -1, 28, 17, 15, 33, 4, 5, -3, -22, 3, -44, -16, -49, 3, -12, -20, -22, -30, 10, -9, -8, 6, 19, -16, 60, -14, -39, -5, -40, 60, -45, 7, -28, 11, 1, 36, -11, 3, -8, 6, 50, -9, -26, -14, 1, 5, 49, 35, -3, 15, -8, -21, -25, -20, -11, 20, 19, -58, -13, -47, 39, 25, -54, -62, 41, -8, 42, 2, -34, -49, 7, 29, -19, 17, -8, 56, 32, 1, 38, -19, -28, -49, 32, 53, 9, 42, 52, 60, 3, -12, -2, -31, 18, -18, -31, 61, -47, 30, 31, 14, -17, -29, -1, -24, -11, 1, -66, -11, -35, -51, -24, -8, -58, -23, -2, -18, 14, -5, 38, 43, -16, 43, 47, 3, -41, 29, 9, -33, 51, 34, 54, 69, -20, 8, -1, -34, 2, -23, 40, 53, -41, -20, 6, 4, -42, 1, -32, -8, -43, -12, -8, -31, 8, 15, 23, -28, 11, -16, -21, -9, -11, -17, 80, -7, 19, -32, 22, 33, 65, 93, 8, 29, 96, 11, -37, -35, -22, -18, -25, -17, 0, -28, 24, -14, 23, -29, 17, 20, -108, -3]
5139ck0K5K8mm9N0m3qJm7N0J8L9k1J1j7Q2q3LLLo2K9Q0r6Rj1j3P1m1k9Q2o8k7
5173e8K6K1J7Po5M7PlJ6n9L9k0L0M0j15R5Q2j15K6Ql6J3J9k4L5l6lN7k0J6m5k9
5205b7QJ03k9q1L9n2K7K4p4J6L2k6M4rP7r8K4k0MK1Jk0N2q1N6j4j0K8LO%j7K9
5238C6n0mL2j7k0JK4rpPrK7l4K0J4mp1K4N4N9o1n9N3K9q4J7N2n4n6N8L7O7j9j04
5272e1P0o6jM6K4K5k0l3L6n0L6p0QP5Ml0n4L6J9PqJ6o9M8L9p4OL4L0k4l9K2QM
5306Dn5M2K2l5j3M0l1L9K7n5J6L7nn6O1n6M9mN1m7m6K5K1M3r1j3J5O0n8N8Rn4
5338@K6p8O4Lm2J3MJ7rJ6jj7l0jM9l9J7M1j6k2J7qNm7N3JQJ3k2k7K8j9L2M8n8
5373A9L3n1O1o4m6M7K7n0N8qk5J2%M6o4J7Om3O3m9k3L5K6q2R8k3oQk6N7k7Kk0
$$ y = [-3, -23, 2, 30, 26, -23, 27, -16, -24, -23, -70, -20, -2, 37, 16, 27, 10, 92, 9, 12, 15, 18, -44, -15, 65, -31, -22, -33, -46, 25, -16, -45, 37, -31, -58, -32, -11, 6, 13, -52, -5, 2, -1, 15, -44, -5, -25, 5, 45, -70, 25, 107, -8, 18, 26, -10, 3, 22, -2, 33, -3, -6, 51, 31, 47, 2, -27, -19, 84, 55, -26, 13, -39, -12, 12, -62, -46, -14, -40, 4, -5, 72, -26, -2, -22, -18, 3, 4, -16, 36, -45, 11, -3, -13, 15, 18, 24, 24, 7, 36, -14, -18, 14, -3, -23, -22, 2, -7, -14, -7, -16, 11, -23, -3, 11, 7, -64, -40, 14, 73, 12, -47, 6, 35, -49, -32, 20, -34, -90, -32, 5, 72, 53, -51, 19, -47, -48, -2, 22, 47, 27, -6, 30, -20, 16, -54, -46, 29, 33, 3, -51, -15, 4, 11, 3, 19, -50, -2, 37, -37, -31, 3, 33, 9, -30, -8, 0, 4, -51, -9, 13, -22, -35, 5, -26, 13, 40, -15, 1, 38, 33, -23, 38, -18, 31, 27, 78, 31, -15, 10, 31, 74, -17, -30, -15, 45, -13, 45, 54, 0, 26, -52, 12, 15, -27, -14, -10, 7, -2, 14, 13, -4, -34, -35, 14, -25, -8, 33, 17, -5, 12, 4, 9, -38, 15, 16, 24, 37, 15, -12, 16, -3, 29, 77, 19, 52, 1, 62, -2, -48, -1, 26, -24, 34, 26, 1, 13, 13, 59, -5, 12, 18, -25, 38, -11, -34, 1, 27, -55, 43, 20, 14, 22, -4, 53, 26, 28, 8]
5406HK7pKl4oJ8j2ll9L0pO3Pj03R7k6j1J1K2o6L2o3Q5Nk5J2j7mK4m4K1JJ0k7L0
5441A1k5m8M5K7Kl2J9K2mnK2no0rP3n3J8Jk8oM5Lk6m7M8PJ1oM7m5L0L6q7kL5k2
5477hj8P6m4j8k4K6J4L2J4r6J9J00m1k0J8K1k5K1Oq0N8j9k8M3q8M0M7J7ko1J2
5508hoj3MK2l6J02m7n9J3M2L2k7l4J8l4M3l0J5L4l7J8L0L8n1m4K8N6o9M3l7L2
5539C8k2j1m3Q4m9L9p5JJ7Lj6N5l7qO6j44J34m2PN1o4L3Nm1j0O0l4K5lnL6j7o7
5572c4O5lm1L0j3J7l1N9q9N3qJ0k4qL5j1k2J5j2K1l7O3m9J4k9Qk9L6k4J6kP9r7
5605d2L1l3M7M9j7J1l1J6l6N2k4l9J4L4j0L5p8J9KJ4j7K4l8N0o1Mrk4k8P9l8j6
5637f0N2J4Oj3Nmj0j3l8P2J9j8J4m2M6k8j9K9L8k5l2L6l7K2L%j3K4m0J5l9Om2
$$ y = [8, 35, 28, 30, -4, -10, 8, -4, -7, -46, -16, -23, 40, 47, -56, 41, 15, 4, 15, 37, -29, 3, -60, 25, 30, 5, 17, 0, -4, 20, -24, -3, -2, 8, -19, 11, -14, -62, -17, 10, 12, -20, -1, 21, 17, 12, 34, 29, -31, -40, 33, -20, -2, -1, -29, -35, 10, 13, -13, -60, -12, -5, 6, 0, 47, 2, 32, 68, -19, -21, 14, -8, -26, 50, 6, -12, -36, -10, 4, 36, 50, -46, -27, 73, 32, 12, 30, 51, 26, 47, 53, -27, 31, 12, -16, 27, -61, -21, 26, 43, 41, -20, -8, -14, -27, -23, -1, -37, 65, 18, -41, -28, 14, 46, 19, -15, 3, -31, 12, -18, -3, 31, -6, 12, 42, 80, 29, -15, 13, 69, 0, 43, 6, 38, 16, 5, -38, 46, -3, 36, -39, -38, -21, -18, -34, 21, -16, -24, 42, -102, 32, -10, -3, 48, -16, 17, 22, -19, -29, 31, -3, 22, 19, 14, 50, 33, -34, 31, 28, -13, 17, 4, 21, -10, 49, -40, 13, 5, 15, -9, -17, 18, 7, -15, 0, -12, 9, -28, 35, -14, 0, -29, -21, -50, -14, -38, -22, -24, 55, -42, -11, -44, 3, 52, 35, 46, 15, 31, -5, 47, 23, -16, -2, 32, 22, 57, -21, -2, 0, 14, -3, 21, -17, 33, -28, -24, -33, -57, -85, -6, -44, -60, -8, 6, 12, -1, 4, 0, -10, -23, -61, 11, 30, 12, 26, -16, 30, 2, -17, 12, 50, 25, -7, 29, -8, 14, 17, 17, 4, 28, -12, 3, -36, -30, -72]
5670g2Q1m3P9m2M1m2J6l9P5l9p5O4n1NJ9qN5k2l0L5K2J7k7J1J0Om4J1qLj4P3m7
5703B0qpn2J0J2O1o0J6J6k7OPLK4p0O0j6J0l9N6j9L6m3k6M1l5J6J9ol0NQ7r5K4
5737dKP5o0l4j8J7N5k0j5K7k1Nj2mj0N9o2lKM0l1qQ4j9j00O8ln5M5M8On1k9l8
5771f4Q1n0Pj8kN4k4K4L0o7M3LL7l8m0K3j8k9K3K4M0o4mj0O1o0J9JK3j7klL5o0
5805d2Q8r3N0K0n2j4J9L6K2k5j4l7J9K4l7L8opjO5m2k0K4J0l8J0l2M2L0m8j9P1
5837D1l0p1N4k3l1M7RL7k4K1J4m9J9k3QPm0L9k0O8q7l3M3K2K2jJ5l2j2L6j1K0
5869C5j0j7J6L4q0N9p3P4J2r5R5m5Oj3oN9j01P9j09L3oO0k5K6k4L8k6K0k8QjO
5901AJ5qN2j6m7K8K2q6M5J7L9j4k3o2L2m5N7L3m0N1k5k8o1P2Mj5m2K9J7o1L6K
$$ y = [-72, 9, -34, 45, 3, 44, 2, 18, -21, 54, 15, -60, 4, -47, -42, -23, -31, 24, 2, -28, 7, 29, 46, 19, 30, 40, 46, 2, 13, 5, 8, -6, 67, 20, 12, 5, -47, -37, -25, 36, -24, -8, 8, -19, -13, -6, -3, 21, -49, 11, -5, 5, -34, 22, 3, 39, -4, -30, 11, -24, -8, 11, 5, -25, -20, 67, -28, -4, -2, 73, 13, -21, -39, -22, 33, 13, -2, 25, 4, 9, -3, -7, -17, 42, -20, -23, -21, 19, -12, -20, 64, 45, -55, 13, 10, -45, 0, 48, 54, 3, -26, -64, 17, -33, -26, -44, -46, 8, -16, 8, 38, -29, 14, 17, 54, 16, -24, -1, -19, -48, -25, -1, 39, -25, -29, -39, 22, -38, -19, -18, 5, -12, -14, -17, 18, -42, 46, -47, 3, 23, -29, -43, -24, 12, 34, 9, -5, -42, -23, 1, -36, 2, -4, -11, -12, 53, 11, -9, 15, 25, -13, -3, -35, 7, 37, -11, -30, 41, 11, -60, -6, -29, -60, -13, -4, 33, 9, 30, 44, -5, 14, -9, -1, 6, -34, 5, -15, 53, -34, -67, -24, -2, 20, 19, 34, 2, -10, 26, 15, 35, 25, 8, 24, 58, -22, 37, -36, 38, 50, -45, 50, 5, 11, -2, -8, 51, -50, 29, -80, -47, -53, 7, -18, 8, -16, 22, -4, 16, -12, -4, -5, 1, 16, 8, 60, 44, -3, 25, 47, -39, 6, 23, 62, 48, 25, -37, -5, -50, 7, 40, 0, 51, 26, -2, -63, 9, 13, -2, -44, -15, 2, -59, -23, -21]
5933b1K5j7J6m4K6N5p1lO7l9KjK8n4M3kL4n1oP8o8J8K1m7L4J7J9p3J7K8j3n2L6
5966Bj0j0M1j9L8n7j3L4m7K8L0K9p5P7n8n6Q8k8K9NJ9l7nlj6N8l2n0R0k1o1mO3
5999B9p1%K7J9k0k3M5Nk7K3k3rM2j1j7m5M8K6l9j4pk9Q9N7j07N9j2K0J5o8L4k4
6031hJ1M1j7po3MO9o0P3m5k9N2o8Ol1Q6l8N3n7K6j5J8k6Rm6Q3L2o9j0Rk1J2K2
6064dk6RK1M8qq0PO6J8J6o1k4k0R4r9R6n8P8m5j4Ll3jNQ7j32O7o3J9M8k0pnO6
6098D8q8M3Mpj3k5K5Jjj1L0J4J0l6l5M6J4n9J5L4l5O3o5O7l3pM6n4KM5o3M0mN7
6132F8k6l9J7j4%m3kK5l2J5J5M1n0K5K3L0n9l8M7l7O5l8PM7p2L5qJ1J8k7M3n0
6164cK6oj1N8l5k5l7O9p6KL3m8O2n8Q0K7l9l6mJ2j9M5L3o0N9m7J2n9O6Km8M3O
$$ y = [-21, 4, -13, 3, -41, -15, 40, -31, -34, 33, -6, -4, -5, 23, -31, 12, 10, 44, -7, -13, 65, -3, 15, 36, -11, 23, 40, 59, -14, 3, 31, 18, -34, 2, -8, -18, 23, 4, 42, -15, -28, 6, -41, -13, 17, 46, -29, 48, -10, -66, 22, -6, 23, 28, 47, 10, 5, 2, -14, 44, 12, -38, 52, 31, -30, -34, 29, -42, -42, -15, 4, -16, -39, 6, 11, -16, 7, -16, -25, 17, 6, -11, -56, -8, 18, -21, -35, -42, -71, 18, 75, -32, 27, 15, 35, 50, -18, 16, -8, 3, 44, 27, 20, -43, -39, 30, -30, 43, -2, -31, 21, -47, -41, -72, 14, -24, 29, -28, -2, -17, 1, -25, -16, -62, 21, 53, -16, -26, -17, -38, -26, -4, -30, -21, 0, 48, 40, -40, -33, 33, 51, 67, 6, -18, -38, 56, -43, 53, -5, 73, 28, 14, 17, -16, -17, -12, 75, -57, 10, -53, -34, 14, -6, -13, -18, 48, -40, 3, 7, 0, -13, -38, -13, -12, -13, -24, 6, 20, 30, -6, -41, 5, 19, -40, -25, 9, -26, 37, -28, 39, 6, -1, 45, -9, -7, 38, -25, 15, 11, 68, 42, 3, 20, 6, 6, -37, -39, -14, -46, -31, -16, 25, -25, 0, 23, 53, -6, -44, 3, -34, 31, -7, 0, 47, -25, 10, 2, 13, 31, 4, 47, -3, 23, 17, 6, 64, 29, 4, -33, 36, -40, -38, -5, -53, 9, -49, 31, 58, 19, -17, -21, -9, -28, 17, 50, -10, 49, 2, 14, -45, 21, 23, -25, 18, 24]
6197B4J0pk1l8Q6p7M5p0O5p1ON7nj3L7J1o1J1OL8m5J2j2nN7m0j7l8N5Om6KJ2J9
6231gNj9L5J2Jn8Q1o2J2M9k9k2M1j8l9J8M0PK6m6L9p2L3pK1j4RJ8j21J03q0J04
6263F0q1L4k7l5L8m0P1o8L1lL5m6O5o2JJL5k3J8K5l9NlO6M1j02K1l8LJ1N5p3J0
6296a4K5l3J6PL5l8J4l0L5o9N4l8K7J9oj2P9j27Q7j7m7M8K1j02R1j7n6K3M7k1
6326Aj5M7p9O2m2J5J2K8k8Ol6O0J0n7N7n9O2k8Lk5j3JJ6POj3JQqNK3L7q7K6OL1
6362D0q5L3k9R7J7k2m0M4j6p8M2M6k8mQm2J2J7J4n4O4n6pj4j0J8L6PK1k5pPm1
6395c5P7rl3K1K0q5J8rM4L1m0kM6Kjm2L3k2roL1nQJ4n3QQk7l7M9Rj3P8n3J9J7
6431E2n4L3l4j1%Rk4rM9K9m0l2K7KJ0K3q3P1m5KK3NJ7Mpn8L6rJ3K6nj8o1L1N8
$$ y = [24, 34, 27, 6, -32, 54, -23, 22, -48, 17, -54, -48, 9, 4, -9, 28, 39, -22, -11, -5, 33, -12, 0, -12, -17, 40, 0, -17, -55, 0, 6, -40, -38, -26, -7, -2, -21, 14, 26, 27, -31, 50, -12, 0, 49, 20, -2, 39, 21, -18, 0, 40, 47, 73, 27, 66, -6, 27, 20, 41, 27, 36, 54, -67, 36, -44, 60, -21, 13, -14, -49, -11, -51, 20, -48, -17, -20, 15, -31, 34, -28, -27, -26, 9, -14, 4, 29, -10, -5, -8, 58, 99, -3, 18, -20, -17, -6, 49, -24, -14, 11, -22, -6, 1, 36, -2, 12, -18, 17, -52, 2, -36, -9, 10, 4, -8, 71, -56, 31, 14, -33, 15, 36, -66, 25, 8, -48, -25, 22, 1, -14, 33, -46, 16, -26, -11, 1, 29, 1, 7, -29, 31, 41, -16, 41, -18, 44, 16, 19, -6, -19, -18, -2, 5, 11, -2, -1, 7, -1, 4, 27, 64, -23, 3, 9, 40, -45, -12, -41, 56, 73, 51, 11, 55, 39, -39, 3, 49, 21, 17, 25, -17, -5, 12, 26, -28, 36, -20, -27, -41, -51, -33, 3, 10, 31, 6, -1, 6, -35, 42, 33, 0, 21, 41, -44, -26, -35, 9, 40, 0, -2, 44, 46, 45, 3, 36, 14, 5, -1, 30, 25, 33, 47, -6, 2, 10, -17, -54, -5, 4, -9, 69, 16, 35, 52, -2, 31, -3, -14, -14, -5, -29, -38, 11, 40, 0, -32, -5, -3, 7, 30, -53, 18, -27, -25, -2, 3, 20, 24, 17, -41, -5, -14, -1, 25, 20, 2, -59, -28, 30]
6466C0q5L7LM1nr4L1P9n7j6J6MjM6n2L8k0j0L9j3Mk0j3K2nj2K4J5l7J8rj1J0j9
6500b2J1j4J5K6qj9J2m1L6m5O6o7O7Kk0K2J7m7J7J2n1O3o1K1Rl1K1J2l1j9Q9k1
6532B1j4qJ7K8p0R4r5L0l6L3L2j6P1kj7q9M6L2p0m0K5M4m2Q9o4m7Q4m7m7P0K8
6563D0Ml4J0j4k0L2m8L9pJ2j5N4q8L7K7j6kJ8n1K6k3J6L1l0j3L1l1PMk3P0Lp3
6596b7M2m0N6j8m5R1o8K7l5P7j00M2J7mL2r1J2O9n3L0nolPk3nj2J4J1K7pJ6k9
6629aM2q7L4Lj0Oj5P3r2O6N8r4M0k0J0q1J2Q9n4nM7n1m5O4j6K2p6O9JO7j3l7M
6662A0pok2J8M4nJ4mk4k0j1l1N5m6O0j6n5O7o0O2l8J3l9K8J3jJ0o8L1N3Ok5l5
6695b9jN9q8kL6M5L8j03L5Pj5O5k3Om0K2mK0J7m2j5N0k5j1N1r1KJ7L0l0L3k1j2
$$ y = [30, -55, -18, -15, 26, 21, -73, -42, 37, -20, -36, -20, -16, -17, 29, -23, 15, -5, -15, 24, 11, 15, -5, -18, 4, -1, -13, 11, 26, -11, 7, -2, -13, -3, -22, -11, -25, -10, 16, 8, -11, 1, -40, -4, -49, 17, -50, 17, 19, -1, 21, 38, -9, 8, 20, -31, 32, -29, -8, 1, -30, -9, 3, -28, -47, 42, 21, 7, -1, 16, 44, -26, 68, -27, 3, -33, 0, 32, 16, 87, 85, 68, -21, 25, 57, -13, -53, -28, 16, -26, 63, -1, -48, 36, -11, -58, 12, 40, 44, 10, 20, 6, -14, 18, -30, 9, 2, 14, -1, 53, -35, 2, 29, 13, 11, 29, -22, 4, -19, -3, 28, -2, -15, 16, -15, -8, -4, -27, 43, 46, -27, 15, -25, 31, 13, -32, 59, -9, 18, -17, 60, -40, 2, 19, 15, 47, -44, -32, 37, -16, 14, 9, 3, 0, 7, -16, -21, -33, -19, -8, 19, 12, 28, -1, 41, -46, -12, -9, -19, -13, -28, 45, -47, 19, 77, -17, 23, 3, 13, -68, -56, 33, -21, -26, 21, -30, -75, -11, -27, -5, -81, -12, -11, 56, 43, 6, 10, 3, -3, -25, -7, 37, 32, 46, 42, 18, -2, -13, -44, 11, -35, 25, 9, -46, 21, -39, 23, -15, -2, -41, -13, 0, -1, 9, -59, -28, 25, 31, 6, -29, -30, 29, -59, -61, -25, 20, 58, -45, -10, -3, -18, 47, 24, 30, -10, 12, 8, 28, 45, 3, -12, 38, 13, 2, 53, -38, -36, -19, 11, -19, 14, -7, -19]
6728a9PJ2RJ1l7k3K0NN0l3k4J0O9p5j9M1N5j7j6o9K7L8m1M9k5L1o3J5KPK3m0k0
6761d0J2L1j9mn1N5j5J6j7j9L3J3J5RL3n1k1k5N4lOo5M8M1K8j3r3M1RJ1p2P4m4
6794b3O7l1l6M3k5l9N1QNk5K4k7Jk6L7nL5nk9Rl0O5l9J6m2N1m7J00j21NM8l6Q
6827a3L4K1n7K1llL6k1j6L2kK5%m5j6K5k2L5L8j48R9k3j5M4q3O9l3K8m0Q1o8L0
6859A0J7j8j4l4R8k4lo0K9QO2j3k9k2J8m0J5J3m7P7j3n1N9l5L0j1K3l9j5K8k3
6890dk9L7j0k5%J9M1l9NJ3q5P3l9M2pj0mO1l2m6J2k4O7nM9m4MK2k4k8j5P6l5j
6924A5K4j3j4j8J5l8P3l7L8q1N6q7M6R6p9K1M6o4m1P1qrjM0k2m4O9p2O9n9M1m8
6956a5Rk6Q6p5J9J6j6K0k2K7Np4O5On1rNk4N7n1J8L5m8NK2L1jo0j5J6K0lj6N4
$$ y = [-19, -12, 0, 9, 20, -17, -40, -20, -15, 35, 2, -22, -12, 57, -18, -37, 4, 59, 42, 26, -43, -16, 22, -19, 30, 5, 36, -27, -12, -10, -3, 20, -20, -40, -28, 3, -16, -20, -71, -16, -31, -15, -32, -51, -18, -5, 10, 19, 52, 1, -20, -45, 9, 6, 12, -53, -5, 36, 64, 51, -42, -1, 8, 19, -53, 21, -23, 44, 13, -23, 20, -5, -44, 7, 15, 20, -5, 19, -8, -7, -33, 4, -1, 34, 29, 0, 9, -21, 44, 5, 21, -21, 30, -17, 83, -38, -33, 15, -21, -13, 21, 42, -15, 6, 3, 0, 36, 15, -1, 31, 29, 54, 54, 9, -7, 18, -4, 31, 69, -79, 20, -3, -18, 26, -57, 12, -21, 7, -33, 48, -20, 10, 27, 9, -5, -39, 59, 35, 32, -28, 1, 9, 71, 58, 29, 7, 25, -15, 0, 13, -34, 43, 30, -21, 38, 3, 33, 22, 45, 6, -9, 19, -4, -33, 4, -6, -31, -31, -12, 29, -10, -5, 8, -77, -4, -43, -1, -8, -18, -22, 39, 7, -39, -27, -51, 16, 11, 60, 16, 20, 42, 18, -10, -25, 51, 16, 15, 39, 26, 12, -6, 9, -29, 44, 7, 45, -36, 20, -67, -21, 75, -4, 17, 63, -1, -42, 29, 21, 12, 11, 51, 29, -15, 54, -18, 51, -8, 33, -15, -6, -32, 54, -21, -2, 14, -2, 18, -4, 23, 28, -46, 19, 25, -26, -35, -30, -54, 3, -48, -30, 5, -43, -38, -16, 15, 14, -46, -61, -45, -25, -28, -44, 10]
6990A0m0O9k2J6l6ol7O8oJ4l1K7M6m1l6j9L0j3K4J2o6j1Q8p4N1m7OMj8RM5jm1
7023b6P6m6lJ0J1J2r5Q6j6K0kk0nj9L0J4l5L1Qj0k0PL3j3Jj2l6N1l9oL1l8J9r
7057a0L0n2K3j1PK1l6j8N7M7o2O2r6J3Lk8M1lJ8Kn4N0O1o5K7o5J24p6k9N6Jj0
7089B8k6M0j5o4%j1P5J5j19N3L6j0K6n6k6P6o7N0j7lj8J1J7n8M7PK6j1PN0j00
7120c7J5P8n2J8m4N9l9J9m6M6K7o1N0k4k4L7k1j7k7N9l8J5N8k7m8m3M5O3m9J4
7150Fj0K3L4l9K8m2K4m0L0ml1J9M9m2K9l4nO5k6p2L1O0j4o7Nk0O1n5N5j0o3L0
7182b5O9k2j4j0k4jpP3J2j01O8J8l1L4n8M0omJ4j5jm8K2L3l1P6j02Q6m2K3qnm5
7215c2M2m8P4J4k3nj3n7K1J3J0K0k3LPn6M5O1p5j7O7k8m4J2nK3N6j3o6j0P0m5
$$ y = [10, -30, 39, 17, 33, -3, -9, -46, 22, 16, 30, -1, 26, 72, 31, -5, -24, 6, -7, 17, 29, -37, -48, 40, -34, 17, -30, -24, -20, -38, -29, 16, 15, -26, 50, 4, 1, 11, 22, 34, -61, 25, 9, 29, 27, 7, 2, -17, 13, 27, -8, 23, 31, 21, 1, 8, 41, 28, 29, 17, -19, 32, -7, -13, 18, -20, -1, -10, 20, -32, -9, -20, -13, 8, -28, -46, 11, 58, -4, 58, -38, -25, -22, -50, -9, -12, 6, 8, -46, 4, 65, 0, 27, -38, 86, 10, -19, 37, 38, 28, 2, 42, 27, -37, -37, -48, 27, 42, -77, -24, 12, 2, 28, -28, -54, 22, -45, 5, -12, -15, -33, -22, -5, -63, -16, -9, 17, 6, 13, 63, -37, -22, 56, 4, 22, -22, 37, -2, 17, -29, 17, 44, -17, 33, 9, -15, 22, 1, -16, -43, 16, -22, -7, 51, 24, -24, -67, -22, 41, -8, 6, -4, 19, 53, 14, 42, 0, 24, -16, 14, 10, -21, -2, 47, 5, 34, 0, -5, 60, 34, -38, -7, 53, 39, -28, -23, -43, 18, -37, 18, 8, -55, -25, 44, 22, 8, -2, -26, -27, -34, 39, 51, -50, 18, 36, 5, 39, -19, 21, 15, 11, 25, 10, 9, -39, -17, 16, -15, 61, -41, 45, 3, 26, 18, 13, -32, 10, -38, 36, 50, 27, 22, 9, -48, -27, -14, -4, 16, -7, -4, 3, -53, -8, 53, -22, -39, 28, 0, -44, -32, -37, -14, 42, 29, -37, -47, 23, -22]
7247b2L9k0J6J7L6k5j1l5Rk2M5k6K2J6kj01O7K6l1L0rL1o4J0k4J2k9K2k3Q0n0
7278a6M7m7N3qm3Oj3N4n1N7p2M7K3n2k1M2M3r7O1nKK3Pm6K1R8q2l7M5j6Rk6j6
7311a0l3JN2m9J3K5qO4p8O4o5O6Jo2L5J4qn4kN8%n7L0L9l4K7Mn1R6r6PrO8l1n4
7346c7J3O7l2mM2l5k6L5n6K3M6j18RR1Nm6N7k2K2J5r7R8j6k0lj3j4J3nL3J5rn5
7379b4L5K6j6l2K1J5J7pjr4O1J2k7j4Kj9L4L3Jr6O3J7Qk9j1M1n8L7lK7l0l7K2
7412b6N5l7j4J6P0m9j8J1k%J4oKj9nl2R2m7Rj5qOnlk3nL7qJ5m2P0k8p9R1o0N1
7448HL2k2rK5m3K9m3N2Ok2n0N3K7l8l0O5oo5kk0O1k5K6j9LpP3l7j9Ql5Q1p7M1
7482B1%m9j2L4k9oR4p2M5m4K2Rk0L5o0N7n3J13o0r9N1N2n1J3L1qj6K5l0J2o3K9
$$ y = [-22, 17, -3, 13, 30, 66, 41, 30, -5, 4, -18, 27, 1, 23, 39, 37, -64, 3, 29, -2, 28, 19, 50, -14, -4, -28, -16, -45, -23, -46, 34, -16, 31, -16, 37, 29, -14, -8, -21, 33, -18, 39, -33, 14, 37, -15, -36, 6, 49, -48, 13, 8, 10, 33, 40, -6, 15, 113, 31, -6, 39, 23, 32, 6, -10, -43, -42, 10, -39, -26, -1, -9, 55, -23, 41, -24, 42, 43, -19, 16, 30, 22, -32, -34, 24, 24, -33, -3, 36, 2, 29, 33, -18, 78, -18, -11, -20, 48, 17, -37, -24, 43, 11, 7, 49, 14, -12, 23, -33, -10, 36, -82, -73, 18, 23, -23, 34, 12, 34, 49, -48, 50, 34, 14, 11, -2, -16, -3, -8, 25, 40, 31, -24, 11, 37, 21, -11, 10, 25, 42, 35, 34, -60, 1, 13, -14, -28, -26, -45, -11, 22, 23, -73, -10, 7, 15, -14, -25, 16, -42, -5, -8, 19, -11, -48, -26, 29, -8, -22, -6, 64, 15, -3, 8, 6, 6, 20, 14, 16, -3, -8, -40, 52, 5, 14, -1, -9, -3, -8, -11, -34, -39, -2, -10, 5, -37, 33, 5, -74, 17, -43, 8, 40, 18, 9, 34, -9, 20, -23, 29, 35, 13, -37, 16, 43, 5, -25, 40, 34, -31, -33, -53, 8, -17, 9, -10, -7, -14, 59, 22, 3, 11, -24, 57, -20, 21, 21, -28, -40, -6, -35, -41, 53, -19, 26, -18, 4, 13, -7, 28, -32, 25, -28, 85, 25, -74, -23, 29, -22, -9, 22, 14, -2, 23, -7, 5, -58, -29]
7514b9K7j4j%M6k1k7J6k7PjkJ3oL2J1j9l6L1l7L0l2O8Lj3J5nm3K2n1L2K5k1LO5
7549F1k7Ll4j5pM8j1o1L1M4MKr4J4L1l5N3m5M8l9J8j7N1j58J19P2j8om8J9Jj7
7581a3J1jJ4km0J09q2NK2k0l6J4j7L0J1pL4l9k6K7P%j0j8K4oK2l0J1J3l9M0l4
7614b6K8k5J9j7Q0l2o8N7l0kM3J6l3j1L3l0L1m9M3J1l7J0L1l9M5K7q8QK2L6n4
7645aJ4%om9kN3k9Jj3K2k6jK5N0j3o2L8j3L7k9j3K8Nj3O0o1l6P5l6l6J27m6p2
$$ y = [-29, -2, -16, -17, -17, 29, 8, -19, -3, -30, -23, -24, -26, -13, -19, 13, 24, 5, -31, 0, -37, -7, -39, 29, 32, 19, 34, 29, -14, 8, -43, -11, 14, -7, -4, 61, 34, 37, 3, -12, -19, 29, 18, -43, -12, 32, 36, 38, -56, -42, -11, -46, 7, -38, 10, -29, -11, -28, 23, -135, -16, 56, 38, 32, -16, 3, 4, -13, -2, -3, 11, 9, -31, 78, -4, 1, 23, 3, -33, -19, -36, -6, 5, -2, 32, -7, -33, -6, 1, 1, -9, -27, -3, -9, 13, -17, -6, 7, -32, 8, -26, 2, -23, -4, -21, 59, 27, -41, 16, -14, -16, 27, 43, 10, -1, 32, 2, 33, -16, 27, 38, 1, 11, 42, 3, 48, 75, -13, -5, 17, 53, -1, 13, 13, 7, -42, -44, 9, -20, -19, -32, -10, -36, -37, -12, 38, 25, -37, 1, -12, 25, -4, -17, 11, 16, 3, 63, 2, -34, 41, 5, -31, 96, 50, -22]
$$ [...]
8191b6
##END NTUPLES=NMR FID
##END=
