##TITLE=1H_DE-80W
 200.13MHz, D2O,
 8 sc
 
 23.1.2025
##JCAMPDX= 6.0         $$ Bruker NMR JCAMP-DX V2.0
##DATA TYPE= NMR FID
##DATA CLASS= NTUPLES
##ORIGIN= UXNMR, Bruker Analytische Messtechnik GmbH
##OWNER= pz
$$ XWIN-NMR		Version 3.5
$$ Thu Jan 23 14:06:02 2025 Russian Standard Time (UT+4h)  she@DPX200
##.OBSERVE FREQUENCY= 200.1313
##.OBSERVE NUCLEUS= ^1H
##.DELAY= (6, 6)
##.ACQUISITION MODE= SIMULTANEOUS
##.ACQUISITION SCHEME= undefined
##.AVERAGES= 8
##.DIGITISER RES= 18
##SPECTROMETER/DATA SYSTEM= spect
##.PULSE SEQUENCE= zg30
##.SOLVENT NAME= D2O
##.SHIFT REFERENCE= (INTERNAL, D2O, 0, 14.3821)
##AUDIT TRAIL= $$ (NUMBER, WHEN, WHO, WHERE, WHAT)
$$ ##TITLE= Audit trail, XWIN-NMR		Version 3.5
$$ ##JCAMPDX= 5.01
$$ ##ORIGIN= Bruker BioSpin GmbH
$$ ##OWNER= she
$$ F:/spectra/data/she/nmr/H-C/1/audita.txt
$$ ##AUDIT TRAIL=  $$ (NUMBER, WHEN, WHO, WHERE, WHAT)
(   1,<2025-01-23 14:04:34.14 +0400>,<she>,<DPX200>,
      <created by zg, POWCHK disabled, PULCHK disabled
       configuration hash MD5:
       00 E9 B6 7A A2 85 ED C7 34 08 36 98 17 FE 4E 26
       data hash MD5: 16K
       5A AC 8C B5 E8 30 EF C2 D5 F1 14 8D 9A 92 87 8D>)
$$ ##END=
$$ 
$$ hash MD5
$$ 63 0F C2 76 AC 1D 79 AC 9F 54 D0 ED 3F A9 34 1E
##$RELAX= 
##$RELAX= 
##$RELAX= 
##$RELAX= 
##$RELAX= 
##$RELAX= 
$$ Bruker specific parameters
$$ --------------------------
##$DU= <F:/spectra>
##$EXPNO= 1
##$NAME= <H-C>
##$PROCNO= 1
##$TYPE= <nmr>
##$USER= <she>
##$AMP= (0..31)
100 100 100 100 100 100 100 100 100 100 100 100 100 100 100 100 100 100 
100 100 100 100 100 100 100 100 100 100 100 100 100 100 
##$AQSEQ= 0
##$AQ_mod= 1
##$AUNM= <au_zg>
##$AUTOPOS= <>
##$BF1= 200.13
##$BF2= 200.13
##$BF3= 200.13
##$BF4= 200.13
##$BF5= 200.13
##$BF6= 200.13
##$BF7= 200.13
##$BF8= 200.13
##$BYTORDA= 1
##$CFDGTYP= 0
##$CFRGTYP= 5
##$CHEMSTR= <none>
##$CNST= (0..31)
1 1 145 1 1 1 1 1 1 1 1 1 1 1 1 1 1 1 1 1 1 1 1 1 1 1 1 1 1 1 1 1 
##$CPDPRG= <>
##$CPDPRG1= <>
##$CPDPRG2= <>
##$CPDPRG3= <>
##$CPDPRG4= <mlev>
##$CPDPRG5= <mlev>
##$CPDPRG6= <mlev>
##$CPDPRG7= <mlev>
##$CPDPRG8= <mlev>
##$CPDPRGB= <>
##$CPDPRGT= <>
##$D= (0..31)
0 0.7 0 0 0 0 0 0 0 0 0 0.03 0 0 0 0 0 0 0 0 0 0 0 0 0 0 0 0 0 0 0 0 
##$DATE= 1737626673
##$DBL= (0..7)
120 120 120 120 120 120 120 120 
##$DBP= (0..7)
150 150 150 150 150 150 150 150 
##$DBP07= 0
##$DBPNAM0= <>
##$DBPNAM1= <>
##$DBPNAM2= <>
##$DBPNAM3= <>
##$DBPNAM4= <>
##$DBPNAM5= <>
##$DBPNAM6= <>
##$DBPNAM7= <>
##$DBPOAL= (0..7)
0.5 0.5 0.5 0.5 0.5 0.5 0.5 0.5 
##$DBPOFFS= (0..7)
0 0 0 0 0 0 0 0 
##$DE= 6
##$DECBNUC= <off>
##$DECIM= 32
##$DECNUC= <off>
##$DECSTAT= 4
##$DIGMOD= 1
##$DIGTYP= 9
##$DL= (0..7)
0 120 120 120 120 120 120 120 
##$DP= (0..7)
150 150 150 150 150 150 150 150 
##$DP07= 0
##$DPNAME0= <>
##$DPNAME1= <>
##$DPNAME2= <>
##$DPNAME3= <>
##$DPNAME4= <>
##$DPNAME5= <>
##$DPNAME6= <>
##$DPNAME7= <>
##$DPOAL= (0..7)
0.5 0.5 0.5 0.5 0.5 0.5 0.5 0.5 
##$DPOFFS= (0..7)
0 0 0 0 0 0 0 0 
##$DQDMODE= 0
##$DR= 18
##$DS= 0
##$DSLIST= <SSSSSSSSSSSSSSS>
##$DSPFIRM= 0
$$ [...]
##$SUBNAM0= <"">
##$SUBNAM1= <"">
##$SUBNAM2= <"">
##$SUBNAM3= <"">
##$SUBNAM4= <"">
##$SUBNAM5= <"">
##$SUBNAM6= <"">
##$SUBNAM7= <"">
##$SUBNAM8= <"">
##$SUBNAM9= <"">
##$SW= 18.0517328524113
##$SWIBOX= (0..15)
0 0 2 0 0 0 0 0 0 0 0 0 0 0 0 0 
##$SW_h= 3612.71676300578
##$TD= 16384
##$TD0= 1
##$TE= 0
##$TE2= 300
##$TE3= 300
##$TEG= 300
##$TL= (0..7)
0 120 120 120 120 120 120 120 
##$TP= (0..7)
150 150 150 150 150 150 150 150 
##$TP07= 0
##$TPNAME0= <>
##$TPNAME1= <>
##$TPNAME2= <>
##$TPNAME3= <>
##$TPNAME4= <>
##$TPNAME5= <>
##$TPNAME6= <>
##$TPNAME7= <>
##$TPOAL= (0..7)
0.5 0.5 0.5 0.5 0.5 0.5 0.5 0.5 
##$TPOFFS= (0..7)
0 0 0 0 0 0 0 0 
##$TUNHIN= 0
##$TUNHOUT= 0
##$TUNXOUT= 0
##$USERA1= <user>
##$USERA2= <user>
##$USERA3= <user>
##$USERA4= <user>
##$USERA5= <user>
##$V9= 5
##$VALIST= <valist>
##$VCLIST= <CCCCCCCCCCCCCCC>
##$VD= 0
##$VDLIST= <DDDDDDDDDDDDDDD>
##$VPLIST= <PPPPPPPPPPPPPPP>
##$VTLIST= <TTTTTTTTTTTTTTT>
##$WBST= 1024
##$WBSW= 4
##$XGAIN= (0..3)
0 0 0 0 
##$XL= 0
##$YL= 0
##$YMAX_a= 216362
##$YMIN_a= -295465
##$ZGOPTNS= <>
##$ZL1= 120
##$ZL2= 120
##$ZL3= 120
##$ZL4= 120
##$ABSF1= 10
##$ABSF2= 0
##$ABSG= 5
##$ABSL= 3
##$ALPHA= 0
##$AQORDER= 0
##$ASSFAC= 0
##$ASSFACI= 0
##$ASSFACX= 0
##$ASSWID= 0
##$AUNMP= <proc_1d>
##$AZFE= 0.1
##$AZFW= 0.1
##$BCFW= 1
##$BC_mod= 2
##$BYTORDP= 1
##$COROFFS= 0
##$CY= -3
##$DATMOD= 1
##$DC= 2
##$DFILT= <>
##$DTYPP= 0
##$F1P= 0
##$F2P= 0
##$FCOR= 0.5
##$FTSIZE= 0
##$FT_mod= 4
##$GAMMA= 1
##$GB= 0.15
##$INTBC= 1
##$INTSCL= 1
##$ISEN= 128
##$LB= 0.25
##$LEV0= 0
##$LPBIN= 0
##$MAXI= 10000
##$MC2= 0
##$MEAN= 0
##$ME_mod= 0
##$MI= 1.114404
##$NCOEF= 0
##$NC_proc= 0
##$NLEV= 6
##$NOISF1= 3.799351
##$NOISF2= 2.8
##$NSP= 1
##$NTH_PI= 0
##$NZP= 0
##$OFFSET= 14.38212
##$PC= 1
##$PHC0= 237.2721
##$PHC1= 27.3922
##$PH_mod= 1
##$PKNL= yes
##$PPARMOD= 0
##$PSCAL= 0
##$PSIGN= 0
##$REVERSE= no
##$SF= 200.129724274929
##$SI= 16384
##$SIGF1= 3
##$SIGF2= 2
##$SINO= 400
##$SIOLD= 16384
##$SREGLST= <1H.CDCl3>
##$SSB= 0
##$STSI= 0
##$STSR= 0
##$SW_p= 3205.1282051282
##$SYMM= 0
##$S_DEV= 0
##$TDeff= 0
##$TDoff= 0
##$TI= <>
##$TILT= no
##$TM1= 0
##$TM2= 0
##$TOPLEV= 0
##$USERP1= <user>
##$USERP2= <user>
##$USERP3= <user>
##$USERP4= <user>
##$USERP5= <user>
##$WDW= 1
##$XDIM= 8192
##$YMAX_p= 0
##$YMIN_p= 0
$$ End of Bruker specific parameters
$$ ---------------------------------
##NTUPLES= NMR FID
##VAR_NAME=  TIME,          FID/REAL,        FID/IMAG
##SYMBOL=    X,             R,               I
##VAR_TYPE=  INDEPENDENT,   DEPENDENT,       DEPENDENT
##VAR_FORM=  AFFN,          ASDF,            ASDF
##VAR_DIM=   8192,          8192,            8192
##UNITS=     SECONDS,       ARBITRARY UNITS, ARBITRARY UNITS
##FACTOR=    0.0002768,     1,               1
##FIRST=     0,             0,               0
##LAST=      2.2672688,     0,               0
##MIN=       0,             -295465,         0
##MAX=       2.2672688,     216362,          0
$$ Real data points
##PAGE= N=1
##DATA TABLE= (X++(R..R)), XYDATA
0@%%%%%%%%%%%%%%%%Qj6J6j6J6j7K4l1L2l7M5n2O0o8P7q8R9j12J28j44J61j78
38i3J97k20K46k72K99l33L69m05M46m92N43n96O55p23P98q84R77j081J203j343
58g09J509j707J947k245K626l137L852m922O700j0148J9167q6960k21438J31554
72a63911R4160j9611J38577J48362o9297o7081n603q5393o2656J7429n3038L165
84a24897J68010P0553o3263O6070M9730j71971j23822M1134l8740k9425J72641
95A6020J36922m1088j1438p874j31875p2910N1927q130j6882Q5235M4935n645
107C9197P2717J2453j23588m7505J3905r2550k8293J49992P6580k8944O5616L8869
119A48449j33853j01304J6171j5758l478Q2599M2401j571M9017R667o3825j5040
$$ y = [0, 0, 0, 0, 0, 0, 0, 0, 0, 0, 0, 0, 0, 0, 0, 0, 0, 8, -8, 8, -8, 8, -9, 15, -16, 16, -21, 24, -28, 32, -36, 41, -47, 52, -60, 68, -76, 85, -93, 104, -116, 130, -142, 157, -176, 193, -212, 234, -258, 285, -311, 344, -379, 419, -465, 512, -569, 634, -709, 800, -907, 1040, -1205, 1421, -1716, 2136, -2786, 3914, -6234, 12933, -74027, -295465, -163911, -69751, -89362, 49215, 197577, 128280, 61199, 55596, -29797, -92453, -75024, -128062, -124897, 43113, 113666, 50403, 116473, 166203, -5768, -129590, -88456, -127196, -156621, 16020, 152942, 111854, 100416, 92542, -39333, -112243, -60316, -68446, -85328, -93, 44842, 39197, 111914, 124367, 779, -46726, -32821, -125371, -153664, -3672, 72908, 43964, 109580, 148449, 14596, -86708, -70537, -86295, -89773, -7174, 35227, 33656, 82673, 92340, 28515, 13475]
131A3475k3847j11840k0598J12333M5768P816R3133K7525j12726o3207Q14n9003
143i0357l3410P3985O6454L0235M6772K004n5990l0441l7761o9830M097N8562
155c5680P083L1500J03171J9929q1825l8476k1215p7567k6020P0703N2589K1003
167B5195M6249J9444l2509l6434m6656n4152n77K7778J1673M9824P5756J238m1671
180D5158m879l3492q6767k4314N0206L0459K7336O0364K7519k9581l7151l6456
192a1598l9685j6645K063J6827N5381N5279M243r237k215m8447o9089q943K3936
205d8130L166K6063O3363L2430j5971k1793k7692m3181l3580n033K3788M2931
217c639L4669J6784J7856j301n0103n4104j3049m426n288L8170O2394K4626p660
$$ y = [13475, -10372, -122212, -142810, -30477, 15291, 23107, 116240, 143765, 31039, -32168, -31354, -90357, -123767, -49782, 16672, 46907, 93679, 95683, 39693, 9252, -28509, -98339, -94242, -35680, -28597, 2903, 106074, 126003, 44178, 5702, -15513, -93080, -119100, -48397, 4192, 25195, 71444, 90888, 58379, 21945, -24711, -78863, -79440, -51662, -39989, 9835, 85591, 86829, 45158, 40279, 6787, -79980, -104294, -54088, -23629, 3707, 64071, 91590, 62009, 24858, -11598, -51283, -67928, -65865, -49038, 6343, 61622, 65865, 56628, 54413, 5966, -63123, -72066, -48130, -44964, -18901, 44462, 76892, 60921, 39128, 11436, -31745, -65325, -70358, -46570, -3639, 31030, 47814, 65670, 64369, 14266, -39838, -52887, -57313, -62601, -24431, 37963, 62589, 54929]
230E4929o372k2716m7230l7339n320J6927K8434L1842L2263K2975j0924m1124
242A6345l3151j8754k4335o396L8750M8278J9874J1081R671k3013n1497l5409
254d8556o395N023J4108L3930M3441K2703j1071k5839k3492l2004l4344j339L5151
267b8684L3220K0039K4266J4654k3253m3224k7834j3042r098Q767L5654M0001
279C1466J6944k010p830k0950l8678l0586K13J7189J7423K6913L5054J3851j9212
292C9787k7782k2178k5369k1816P520L4679L2284J7039J3127L660k4673m1288
304a5010k6115m088K443J1941L4962L8436R334j3060j4598k0935l4145k4146Q233
317d6748K5054K1304K3023K5477O148k5179l3364k1107j4334r494J1316L5096
$$ y = [54929, 48557, 25841, -21389, -58728, -64048, -47121, -18687, 13155, 45418, 68393, 57469, 16345, -16806, -35560, -59895, -66291, -27541, 20737, 40611, 51692, 61363, 38350, -13147, -48556, -54951, -49928, -35820, -1890, 41551, 64254, 53183, 27344, 3852, -28152, -62496, -63835, -28684, 4536, 24575, 48841, 63495, 40242, -2982, -30816, -43858, -52956, -44189, -8535, 31466, 48410, 46400, 38570, 17620, -21058, -51644, -51431, -34242, -16819, 10094, 45148, 58999, 39787, 12005, -10173, -35542, -57358, -49838, -15159, 17125, 34164, 47291, 50951, 26278, -15010, -41125, -45213, -42770, -30829, 4133, 42569, 51903, 38843, 24245, 3310, -30835, -54981, -46748, -21694, -390, 22633, 48110, 54258, 29079, -4285, -25392, -39726, -49220, -37904, -2808]
329b808L2227J2443J366n886k5020l8387k2409M531J4301J7215K9132K8903L956
342D9564j9307k2103k1312k4635j3777J4821L0746K2885J4990J2383l886k7798
354A2571l0684j4178n385q76J7818L3344K4588K209p315j1660k3795k8964j2343
367d4670J0480J7969J6200K2711K2301j250k6019k4703j3893j5453q008J8704
379b5631L2167J8500O976O077o976k8679k9300j0607L274R281J6822K5953K1022
392C8879n33j6569j4150j6385k5271j1628J8043K4372J4383J6130J5145q995k6975
405F446k0527j1899r902J179J9067K7679K0535M085p835j2128k1457k7657q213
418d0627J3611J3730J2708K6220J8539j1189k1909j4972j8192j6901L921K0831
$$ y = [-2808, 29419, 41862, 43228, 37342, 12322, -26065, -48474, -43943, -29642, -12427, 16705, 45608, 49564, 30257, 8154, -13158, -37793, -51570, -36749, -6003, 16882, 31872, 44255, 40369, 12571, -18113, -32291, -37676, -38552, -20734, 12610, 37198, 39407, 32092, 20432, -3363, -32327, -44670, -34190, -16221, -21, 22690, 44991, 43741, 17722, -6981, -20874, -36327, -44335, -25631, 6536, 25036, 32012, 38089, 31113, 2434, -26866, -37473, -34199, -24918, -8096, 17857, 38879, 38346, 21777, 7627, -8758, -34029, -45657, -27614, -3242, 11141, 27271, 42416, 33421, 6446, -14081, -25980, -35882, -34703, -15636, 12043, 32578, 36663, 28828, 16700, -4757, -32414, -40627, -27016, -13286, -578, 25642, 44181, 32992, 11083, -3889, -22081, -38982, -35061, -14230]
430a4230K0349J4967J0190J510r852k2978k5495q274N755N164J5791L0893J4863
443C8653j1057r591q115k5040k3720L937J6519J3898J8577J8260K685j1554j9605
456C847k0560r474k081j129J6881L0596J2530m824j76r160l1041j8609O467O541
470b0192N278K1116K1563L245o570j1893j8982j5103p389o96J5718K3418R474
483A8987L835R382r699l0858j5959N33n241N583K8627K0787m1j177n561j9130
497F8j8296r082j805J1128J8938J2183J1294R247j2848k5174q571n425j4484N336
511b7491K8771J5418K835R232j658k3704j9223o219m062M746J4313J3493J4667
524B1118J0923r240j7684q510j4817j7691R236K4866Q748O927J7707k044k3717
$$ y = [-14230, 6119, 21086, 31276, 32786, 22934, -44, -25539, -33813, -28058, -22894, -7103, 23790, 38653, 27596, 18005, 9890, -15150, -38870, -34933, -18414, -4516, 14061, 32321, 35006, 23452, 3847, -16713, -26187, -28268, -29397, -12516, 18080, 30610, 25786, 25610, 16450, -14591, -33200, -26733, -20192, -14914, 6202, 27765, 31010, 24440, 12547, -6435, -21538, -28927, -29623, -13905, 9513, 18987, 22822, 32204, 22505, -8353, -24312, -23779, -29020, -23437, 5190, 25977, 25936, 24759, 19198, 68, -18228, -27310, -29115, -17987, 951, 13134, 24428, 33675, 20827, -4347, -12918, -18343, -32827, -27491, 1280, 16698, 19533, 28765, 27107, 3403, -15820, -22039, -26101, -21355, -7042, 6451, 21118, 32041, 22801, 5117, -3393, -18210, -35901, -26665, -1799, 6949, 13876, 31583, 29539, 5822]
537E822j4945p130j0900R47J6318J5686J2299Q361o068r363p881j7804j6351P311
551b3698J4486M519J5481K2133m443k0732p778q505j8165j831J5300J2812J1377
564A0956J2561Q80p556j1060j7999j3628M705O106L724J9380K0800m052j1573
577A3244k778j5212k2801p71J4760P870J0333J5879M669p249j0107j3880j1934
590a7977k075K73N322J9964J5885k331j601J31j7854k2482r06P048J816J3507
604a280K0732O280o411q039j2514j3669n826r10O983J6556J2463K584M299k083
618A9165j9282j6787q69m38j078J5488J9790L759j879j516j0682j6756r030q41
632b0956O075J1702J0501P812P246l009j6536j1078m176q196k220J6085J7090
$$ y = [5822, -9123, -16253, -27153, -26206, -9888, 5798, 18097, 26458, 20390, 11027, 3146, -14658, -31009, -23698, -9212, -4693, 10788, 32921, 28478, 7746, -32, -8537, -26702, -28533, -13233, -421, 10956, 23517, 24397, 16841, 5781, -12218, -25846, -21141, -15035, -11311, 8069, 28869, 24817, 13244, 10466, -4746, -27547, -28318, -13558, -5688, 4645, 20524, 25193, 17944, 7837, -6043, -17977, -20052, -19779, -14457, 5507, 21392, 19061, 17460, 17591, -263, -22745, -23651, -16603, -14787, -1280, 19452, 25732, 19321, 11282, -1232, -14901, -20727, -21637, -14654, 1902, 14365, 16949, 21248, 19165, -117, -16904, -17773, -18211, -19289, -3801, 15989, 19748, 17869, 16353, 5671, -11085, -20115, -20956, -14881, -3179, 7322, 15134, 22380, 19371, 2835, -8243, -12419, -20615, -22835, -6750, 10340]
645A0340M259L476K544j1120j7287q864k343J522Q664J2202J1010P097l928j1205
659F367q104p952j0972k34J3526J0630M842R456M751j0789j4519p493n645l544
673a9680O134J3012J1808P064p30n871p827j2660j1535J300R257O380Q218J3346
687A8216L834j0184j0324o720r543o605O167J2425J0432O876L041k500q805j2793
701f483r568o11L824M675J0760J3321K912o652n226o943j2551p108M537Q762P820
716A469R153P227l79q927j1561q379l924r10N127J2283J1283K846j710k288r404
731A906j3545n486L259M679O021J1258Q986p31p138p433p980p878l003N195J0740
746a150Q401M596L311p13j0411j2006n126l76k77O799J2557Q753P89l451m681
$$ y = [10340, 14599, 18075, 20619, 9499, -7788, -16652, -18995, -17473, -8809, 3393, 14403, 21500, 17572, 6367, -1737, -9689, -20661, -20895, -7369, 3261, 8103, 17559, 22310, 11521, -2998, -10491, -16136, -19680, -13546, -534, 11274, 18338, 17608, 11737, 3910, -8750, -20285, -18985, -9728, -3348, 4870, 18216, 22050, 11866, 1542, -5178, -14721, -21326, -15159, -2734, 7698, 14574, 17615, 15115, 6310, -6483, -16051, -16662, -12838, -8163, 2597, 15918, 18830, 12178, 6952, 9, -12542, -19650, -15113, -6351, 1469, 10622, 17849, 17470, 8543, -3018, -11397, -15321, -16231, -11104, 1179, 12462, 15308, 13598, 11310, 1906, -11639, -17125, -13866, -9187, -3166, 8092, 17078, 16347, 9209, 1776, -6204, -14082, -17085, -11890, -1150, 7251, 11847, 15158, 14445, 4034, -7972, -13098, -13474, -13751, -6952, 5605, 14358, 15147, 11696, 7015]
761G015r563j0961l699M595P749P395P999N982j664r640r281n221m567j504P046
776h319J1423P372K353K37l459j0120r912l779J886L601O716J0067P237r24o599
791G780o367p549p815j834O678Q840O317N608L424l524j0143q783m327j691J732
806a1654P892J0492O211j94l123m767q949q604j406M742N630O214P748M785l386
821A1631q178o279n272n033K78P183Q876N592K827P62m375r918p932k297P21L751
837g663O999R400M903k084m935n493q286o225L17O299O966N282N756K060m694
852H602q253o664l781k040K246P877Q731M071J31j559n568q427o872o29L301M744
868d090P218P626K626l795o540o028n857m203J670P578P755M627K841l01n894
$$ y = [7015, -2548, -13509, -17208, -12613, -4864, 2531, 10530, 16512, 14848, 5208, -4073, -9294, -13861, -15365, -8319, 3104, 10476, 12829, 13066, 9607, -513, -10425, -14204, -12318, -8717, -2001, 8066, 15303, 14379, 7780, 1413, -6136, -13951, -15785, -9107, -267, 6050, 11658, 15082, 11558, 1415, -7368, -11695, -13386, -11654, -3762, 6730, 12941, 12747, 9624, 4857, -4092, -12696, -14102, -9360, -3730, 2484, 10232, 15017, 11631, 3453, -2826, -8098, -13131, -12853, -5670, 3206, 8798, 11625, 12387, 8012, -1906, -9838, -12135, -11414, -7663, -664, 8736, 13639, 11555, 6620, 1127, -7159, -13384, -13067, -6768, 198, 5480, 11236, 13296, 8602, 349, -6315, -10096, -12136, -9890, -2013, 6718, 10789, 10920, 9361, 3793, -4634, -11506, -12135, -8834, -4090, 3128, 10754, 13380, 9585, 3045, -2983, -8840, -13043, -11373, -3795, 3960, 8587, 11428, 11127, 5233]
883E233r038n561j269P17L733P632P638K365j926l818n447p387m981J549N363
898e197N523N281M725J374m839p309n336l670j885K739P989P235K913N02j688
913H357o230p643m539J08K342M613P026O236J087m207m959n030n890k881L068
928h542O439N343M118L235r93o034p084l961j909L83L934P269O051J617j497l003
944E366n353p070m067K361M604M140N642N249o04n561n611m401m457q28M267O881
960E58N526K560M33k150n864p150k775K96K372L974O643N384n27l688l261n248
976b917n761j492L712M903M570M142K780j692n680o167l456j339K18M186P111
991C118M737M88q88k647o306o547j309K146L150N451N370K692j453m654m764l919
$$ y = [5233, -3805, -9366, -10635, -9918, -6185, 1447, 9085, 11450, 9524, 5706, 259, -7128, -12109, -10560, -5197, 326, 5607, 10332, 11706, 6867, -442, -5778, -9448, -11333, -8594, -605, 6630, 9543, 10045, 8357, 2127, -5516, -10055, -9947, -7605, -2992, 4034, 10270, 11357, 7150, 2191, -2839, -8729, -11610, -8542, -2103, 3240, 7358, 10593, 9600, 3566, -3518, -7479, -9388, -9005, -5071, 2198, 8249, 9866, 8369, 5366, 13, -7057, -11124, -8763, -4159, -19, 5623, 10872, 10268, 4707, -904, -5305, -9762, -10590, -6323, 558, 6084, 8644, 9077, 6927, 1063, -6087, -8862, -8566, -6194, -2220, 4423, 9807, 9280, 5592, 2331, -2917, -8678, -10170, -6458, -1555, 3015, 7157, 9937, 8245, 2565, -3602, -7058, -8397, -8179, -3993, 3118, 7855, 8343, 7455, 4808, -1498, -8045, -9354, -7208, -4058, 1393, 6763, 9455, 8002, 3348, -1416, -5335]
1007e335k955n22L970O336L609J989J342k425o299n123j896n49J268N330O605
1022E345K866j29k466l742n811m646n48L912M459L549L953K259k107o008m484
1037c598k097k586N29N540N643K826J163m81l615n696m599r97J810L290L777N308
1053F217K360k103m068l111m007m001P75N064M108K916L207J289m089n783l790
1068e016j964m91K450N132N294K237o90k601l224n255m324J111L785K816L332
1083B592M415J087l290m320l024l357j743J859M522M397K940P82p34l410n482
1098b766l902j94J619K220M626N155O45k673k220l110m924k306K075L397L270
1113I12L767K371j06m005m452l416j155j77J825N142M883L96p84j104l248n578
$$ y = [-5335, -8290, -8812, -4842, 1494, 5103, 7092, 8434, 6009, -290, -5413, -7309, -7858, -6590, -1260, 5345, 8211, 8082, 5616, 1874, -3937, -8583, -9131, -5219, -760, 2789, 6742, 9001, 6894, 886, -3598, -5695, -8281, -7752, -2212, 3431, 6257, 7420, 6939, 3324, -2372, -6971, -7968, -6158, -2868, 909, 6217, 8577, 6474, 2406, -705, -4712, -8713, -7938, -2874, 1234, 4150, 7357, 8646, 4557, -1226, -5016, -6980, -7471, -5021, 111, 5405, 7642, 6952, 4351, 1127, -4128, -8452, -7341, -3556, -740, 2592, 7007, 8094, 4804, 484, -2540, -5897, -7640, -5781, -1259, 3138, 6078, 6860, 6126, 2716, -2766, -6668, -6862, -5243, -3023, 1603, 6758, 7403, 4730, 2510, -600, -5524, -7830, -5755, -2358, 912, 4679, 7050, 6944, 2939, -1513, -4929, -6084, -6261, -4436, 706, 5589, 5985, 5201, 4097, 849, -4729]
1129d729k114J399J869K661M092L399K06k513l492l679k699j602J967M694M006
1144C465J808J068o62m326m902k123m9P62K799M798L253L84j725k151l909l832
1160e342j396J511L421K926L029K071l33l725l935k350j475o11K912M786K940
1175D429J093j42j098m554m018j572M51K109L000L932K715l29k983k961k923k729
1191e580j082L018L971K065K228J087q54m210l950j394q56R43K862M170K928J33
1207E479j460k266l181l496j023J713K718K968K522K140j031l489k968k543j724
1222e641L30K760M128K336J358k54k248l433l714j280J038K171K493L413K041
1237E498q68k245k243l004k407q5K705K564K414K350P64j647l590k941j502r17
$$ y = [-4729, -6843, -5444, -3575, -914, 3178, 6577, 6783, 4270, 778, -2901, -5600, -7202, -5235, -541, 3465, 5273, 6341, 5679, 1353, -3549, -5672, -5721, -4959, -2160, 2638, 5891, 6275, 4550, 2399, -1510, -5342, -6738, -5227, -1806, 1120, 4149, 6220, 5887, 2162, -1773, -4123, -5598, -6209, -3297, 1489, 4429, 5522, 5380, 4282, -272, -4290, -5862, -5411, -3302, -302, 3630, 6345, 6016, 3033, 72, -2851, -5580, -6662, -3644, 327, 2392, 4620, 5707, 4853, 643, -3307, -4701, -5557, -4614, -1752, 2418, 5346, 5479, 4019, 1753, -1428, -4924, -5947, -4234, -1516, 1452, 3974, 6114, 5083, 1594, -1374, -3917, -5641, -5311, -2551, 1577, 3913, 5271, 5017, 2769, -664, -4378, -5658, -4620, -2449, 44, 3457, 5498, 4630, 2385, 142, -2862, -5269, -5354, -2649, -85, 2329, 4679, 5443, 3796, 206, -2735, -4237, -5154]
1253e154J171K987L667J864K57j163k207l308k826n37J718K094K856K781J558
1268E758j846k762k295k185j821Q56K752L062K266N38K71k355l318k604o66K22
1284d127J371K884L521J292j016j569k007l146k186N52K058K528K278K137N51
1299E121k480k670k659j632m13J265L092L131J399k70o61k416l204k036L1J346
1315c056J831K801K268P04j109k508k162k170j577J017K796K809J874Q86j37k466
1331A801l197k051p09K10J712L069K803M44l33j506k328l076j795J027J981K209
1347B61J950K200q5j909k565k462j114m44J404K874K411Q63O00r51k344l046j525
1364c882PJ103K029K121K424K36j318k040k062k291r32J299K325K543J453J060
$$ y = [-5154, -3983, -996, 2671, 4535, 4792, 3629, 1422, -1886, -4712, -5249, -3531, -1437, 1419, 4200, 5758, 3912, 1150, -1145, -3330, -5151, -4295, -1543, 1519, 3785, 4323, 4594, 2239, -1079, -3683, -4349, -4127, -2756, 128, 3649, 4941, 3925, 2356, 349, -2797, -4983, -4431, -2373, 155, 2433, 4570, 5121, 2641, -29, -2688, -4320, -4733, -3468, -376, 2755, 4154, 3884, 3223, 807, -2397, -4433, -4402, -3056, -1225, 1576, 3844, 4548, 3439, 931, -1231, -3401, -4978, -3961, -1165, 1644, 3518, 4404, 4267, 1801, -1396, -3447, -4156, -3946, -2234, 835, 3638, 4082, 3749, 2243, -85, -3161, -4956, -3929, -1948, 261, 2211, 4411, 4326, 2417, -148, -2610, -3724, -4168, -2764, 110, 2521, 3384, 3984, 3033, 689, -2357, -3882, -3875, -2772, -743, 1378, 3802, 4038, 2720, 680, -1382, -3673, -4605, -3306, -981, 1562, 3015, 4075]
1380D075m24k477k752j489p64L99J812K708K281O07p83j385k312k513j122R87
1396c152J691J680K323J795o36k154j864j747j621l02J853K366K127Q23N99j125
1412B656k647k449j327L54J114J771K698J768m37j283j806j966j842p87J488K281
1428d14K101Q52J260q31k188k312j496l33K16J742K554J897K34k84j323k441k115
1445b881o03P29J211J516K494J530p84k079j719j551j027K3J455K377J728Q83
1461C302J9j303k371j921r51K89O67K244K127J282k63j147j598k042j319o41J445
1478b181J656J825J378J062j358j997j942r89q91O66K022J980J466M25k48j780
1494A094k316j784j45P03J318J813K042O62p09j789j355j346j154J23J863J629
$$ y = [4075, 3651, 1174, -1578, -3067, -3831, -3432, -1620, 1088, 3369, 3976, 3193, 1808, -504, -3017, -4139, -3152, -1461, 219, 2542, 4337, 3701, 1547, -317, -2064, -3685, -3987, -2134, 232, 2359, 3182, 3781, 2656, 9, -2440, -3767, -3413, -2299, -528, 2170, 3938, 3501, 2218, 412, -1554, -3396, -4183, -2695, -414, 1687, 2539, 3799, 2968, 780, -1532, -3028, -3361, -3145, -1403, 1151, 3048, 3282, 2998, 1675, -766, -2881, -3484, -2755, -1544, -28, 2466, 3996, 3212, 1133, -586, -2137, -3164, -3141, -1686, 691, 2419, 3302, 3321, 2018, -353, -2274, -3225, -2936, -2269, -25, 2102, 3384, 3121, 1974, 376, -1666, -2985, -3626, -2181, -525, 1300, 2678, 3740, 2382, 385, -1557, -2546, -3437, -2771, -749, 1231, 2697, 3122, 2874, 1094, -1222, -3006, -3151, -2448, -1130, 683, 2725, 3387, 2678, 889, -466, -1812, -2966, -2843, -980, 649]
1510F49J272J125N4j491j788k058n00J02P83J961J849Q56k10o87j734j810j684
1527c311N13R48J674J312J649M49j231j931j098j809m57J060J925J531J194M19
1543B837k80j923j887j382R5M79J271J761J452M95q13j219j167j982q70Q13J292
1560a028J274J669J026j79j476k193j251o37P9J022J983J979J24J8n99j865j817
1577a871j259P61R75J379J465J492j73j365j646j269j062k23Q91J767J595R59
1593B416P4j28j676k260o01n57M96J282K167J182K59o65j112j690j573l52O40
1610b098J371J512J034O73l37j533j489j144m48K04R78J957J141L09K81r58k003
1627e50j469m48J80R94J563J147J129l05j320j056p49j369l96J307J581O31R94
$$ y = [649, 1921, 3046, 3100, 1609, -179, -2237, -2737, -2635, -1852, 109, 1958, 2814, 2604, 1917, 183, -1627, -3311, -2798, -1850, -176, 1136, 2785, 3234, 2003, 72, -1026, -2835, -3292, -2232, -307, 1224, 2418, 2837, 2557, 634, -1253, -2635, -2540, -2061, -790, 971, 2423, 2918, 2105, 886, -281, -2263, -3133, -2320, -1028, 246, 1915, 2941, 2762, 1286, -907, -2158, -2795, -2716, -1694, 289, 2268, 2392, 2410, 1811, -54, -1871, -3130, -2369, -1394, -15, 1450, 2942, 2769, 1404, -242, -1511, -2573, -2796, -1905, -138, 1457, 2416, 2490, 2362, 686, -1574, -2175, -2732, -2236, -954, 1213, 2395, 2654, 1989, 877, -813, -2386, -2738, -2098, -727, 785, 1819, 2492, 2155, 622, -867, -2011, -2459, -2255, -1277, 680, 1821, 2130, 2411, 1453, -550, -2019, -2467, -2287, -1293, 270, 1417, 2546, 2241, 921, -135, -884, -2253, -2649, -1342, 239, 870, 1864]
1644A864Q31m44k260j461r26k30Q88J071J797R11J41o32r33j319j481m59J020
1661a622J102J094J340P08p27j481q92j325n70J48J640J305J059L89q5r47j612
1678d76j322o40O47N37J277J618R87o01j041p79j584r86J1J157J187J421N00J83
1696B096n25j747r84m17l62N08J274J362O20k14n8q79j683j219L06M43Q89J114
1714E24J103O55n47j317j088p94o96K83J492J323O21M46o4j073j628r61l47J61
1732a907Q70J278J258O83m54r25r80j381n66K46J160N99J038R42K00j091j219
1749b49r43m24m09O13J235J367M67J57k98j342j323q96L70L36R57J144P91M24
1767A977n56j121p75j211l09N15J218R11N12P72l70j191q71r31k43M9N74J380
$$ y = [1864, 2695, 2251, -9, -1470, -2396, -2626, -1738, -667, 1130, 2041, 2182, 1550, 617, -702, -2183, -2642, -1622, -520, 574, 1914, 2622, 1895, 414, -478, -1803, -2373, -2225, -585, 720, 1779, 2168, 2083, 1136, -476, -1798, -2438, -1791, -1254, 23, 1641, 2628, 2027, 986, 207, -1377, -2363, -2352, -1195, -8, 1413, 1913, 2096, 1571, -176, -1160, -1577, -1939, -1431, -157, 1205, 1825, 1611, 1553, 674, -1009, -2228, -1922, -1479, -590, 524, 1627, 2282, 1735, 418, -670, -1464, -2160, -1877, -385, 938, 1559, 2005, 1941, 868, -760, -1721, -2068, -1907, -1037, 241, 1499, 2182, 1728, 803, -177, -1558, -2124, -1878, -718, -119, 919, 1861, 2061, 970, -249, -1192, -1616, -2025, -1412, -177, 1190, 1657, 1814, 1516, 174, -1149, -2045, -1675, -1339, -382, 762, 1553, 1977, 1421, 300, -475, -1686, -1995, -1480, -262, 649, 1161, 1933, 1563, 372, -499, -1430, -1673, -1624, -1050, 330]
1785C30J274K20k30r90p20j406p50P33J017Q38N76J081j23j011j018r98m33l08
1803a918R32J058J113M92J98m45j333j283m61J11L46P31J706O23j11p97q16j000
1821h54o61m82O59J209O90Q47M80l91j201j298l46k49j53R75J390R06J81j21j178
1840D03m27j391m92N57O52P39J279N45j24r08r91p28o84j50J095R24O66K98M20
1859A683m21j735n31m63K89p0J273J203L68J14r38l06j266j047J30M81J180O46
1877E90M66N97k78j342r62l91l32K14J150J308K72K36j08j074q12p97k98M69P18
1896c74O78O40P42m04o56q50o45p59M4P97J273M63K95K59l77j564q13k27L01K66
1916i11R24P08Q11j21q22l02j079n24K8P05O31O89K71M01p40o41o11l81m96R7
$$ y = [330, 1604, 1824, 1594, 604, -116, -1522, -2272, -1539, -522, 316, 892, 1973, 1850, 839, -179, -1177, -1610, -1918, -986, 72, 1185, 1677, 1875, 1430, 97, -1186, -1647, -1536, -1190, -459, 1247, 1870, 1759, 962, 146, -854, -1515, -1997, -1338, -129, 561, 1408, 1888, 1497, 296, -1002, -1348, -1597, -1750, -775, 615, 1521, 1702, 1581, 403, -24, -1415, -1907, -1350, -698, 41, 1320, 1865, 1741, 833, -158, -886, -1570, -1720, -625, 299, 965, 1263, 1683, 1262, -473, -1004, -1467, -1178, -1248, 25, 1228, 1596, 1710, 772, 466, -800, -1847, -1717, -1236, -56, 590, 1056, 1653, 1375, 33, -929, -1320, -1652, -1438, -288, 1020, 1292, 1528, 1420, 346, -466, -1263, -1561, -1092, -374, 304, 944, 1686, 1282, 626, -224, -869, -1628, -1584, -787, 486, 949, 1244, 1503, 1126, -438, -1251, -1478, -1177, -911, 13, 721, 1532, 1411, 589, 287, -792, -1316, -1288, -583, 48, 737, 1008, 1409, 669, 28, -583, -964, -1460, -1363]
1936a363J109P91O53J39j35p52j016p93j87M16L48R75J044K45n03k95j045p40
1954a109n85K98R35P50O89J37M70j036q14q97j65Q1M83J090O92K96k96l14o26
1973G9q31q20L35Q08K57O51Q00J59o24p98p86k93n87L98J322M69L40K17q0p94
1993B22q53o16J65j9Q12P33Q72k88j02n87q76q4r63L40J207M78M79L96l54o47
2013C15o20l92n40j69Q39R69L88L81N0l63p37j052n87N34L13Q81N81K06J69o46
2033E20l86r34n29l9P51P01N26K34P04p03p96m83p25j37N57L26Q41Q74j51k50
2053I01o20l15r14j8K06K36N93P44M38m81n24l89o14m33J55M73P47P02O1j46O
2074H08j037p90k82P40l62Q82Q11N09l55n92j23q88n98lP09N10R02K04J16j94
$$ y = [-1363, -254, 537, 1190, 1329, 1194, 442, -574, -1367, -1554, -1138, -790, 185, 1229, 1474, 971, 676, -369, -1109, -1694, -1396, -461, 289, 978, 1115, 1585, 549, -265, -1162, -1327, -1246, -763, 327, 1019, 1315, 1019, 705, 79, -752, -1572, -1237, -429, -172, 479, 1279, 1438, 814, 16, -770, -1063, -1650, -1252, 70, 539, 879, 1096, 1016, 222, -631, -1247, -1082, -1101, -289, 444, 1316, 1028, 926, 339, -537, -621, -1584, -1244, -37, 441, 920, 1316, 962, 315, -305, -697, -1237, -1406, -567, 402, 790, 1171, 1221, 858, 121, -931, -1518, -984, -671, 210, 791, 997, 1166, 520, 134, -800, -1329, -1368, -617, 84, 610, 844, 1548, 845, 49, -434, -1159, -1296, -739, -413, 428, 1302, 1151, 901, 281, -34, -948, -966, -760, -524, 69, 813, 1251, 770, 246, -143, -757, -1190, -1035, -562, 185, 887, 948, 802, 808, -229, -1019, -1301, -561, -923, -41, 770, 1279, 924, 332, 209, -679, -1277, -1280, -571, -61, 841, 1045, 1161, 967]
2094I67j078n20l87k8K27O50P27L58k9m15M4r20n24R5R2N87L48P62K36l17m80
2115C95p94l08n94J17Q99O55M88k3J23o51n30n31l9J47J63N62N65K55Q3m41m49
2136I2q12l91J87Q57p8P37M33k25j32q73k62k06n85L76Q63Q10K77m9l42o56o72
2157f51l00R4J18P43L58N78J30n43m44k81m41o06M97Q83J66L84L17q4p90n75n53
2178a000PK10K69L48J045mq2n83k52l72n07R0N66M44M38K66O1l62n49p46n8R3
2200f78J50O01L78L64k05J96p74o91q7J59M4L29P64L40J03n77k98m32o12k8L41
2221f13O87K57K31L80Np65o30k66j95K67J86P87K97N36n17m64k24o22r9K01K76
2242b85M41L48J02K54n54m59k08n73O6O41K47Q01j02K80m69o92m25j25N6L5K48
$$ y = [967, -111, -631, -1018, -1046, -819, -169, 558, 916, 887, 472, 516, -404, -928, -833, -741, -154, 194, 956, 1192, 875, 395, -399, -707, -1301, -1184, -285, 370, 858, 835, 958, 307, -223, -754, -793, -646, -483, 79, 644, 899, 982, 541, 92, -720, -1111, -924, -67, -145, 592, 1025, 800, 668, -205, -467, -673, -1258, -882, -19, 791, 1068, 1019, 677, 21, -651, -951, -857, -739, 4, 362, 940, 1070, 527, 83, -198, -639, -1245, -748, 135, 301, 685, 1002, 918, 128, -447, -1000, -993, -783, -514, -166, 879, 875, 793, 210, -42, -414, -921, -831, -265, 179, 617, 883, 944, 582, 33, -713, -771, -678, -528, 73, 451, 815, 610, 806, 32, -659, -746, -587, -543, -214, 550, 890, 993, 416, 118, -314, -926, -954, -613, 74, 331, 562, 942, 947, 182, -448, -714, -909, -642, -456, 331, 628, 1164, 647, 183, -41, -663, -762, -561, -285, 156, 504, 606, 860, 306, -153, -361, -934, -868, -227, 20, 821, 719, 999, 530, -162, -587, -712, -656, -621, -373]
2263c73J029J61J77n75m01k18n82m6K88N98M4N53J13m47m05k37k22k16K0N30P27
2284E18K55J47l54l09r03k59P7M7O26L12K42N84j17m85o88j25k39J6N82L91P1
2305C89K95K13o65m71n56P0j1J20N12M15N12k90j93k66n40j69RK41L89L04N26
2326H34R8n48l93m31K03l37k05Q48N34J63O0k96m18o90Rl09M65K86J36O19J07
2347G35m88l30J2n13j59K72K90M60O4M50k57k83n12m26Q8j96L14Q59j0J67J85
2368G22k59k49p54j84J85K32Q3Q14K59n6o26k33l59l4j36J83N04L33K2N9j11j79
2390B16p66o1k31L06K63N18N80m05j72j01k50n74j11J05M90L83K62L72n10lp48
2411d37Oj36j00M03N69n9K70k19j46n12n4k28J07L00L65M58jJ90l42m81j67m44
$$ y = [-373, 656, 817, 994, 419, 18, -200, -782, -828, -540, 58, 102, 655, 768, 321, -84, -321, -543, -759, -739, -209, 518, 773, 920, 566, 257, -646, -905, -828, -781, -155, 157, 399, 983, 866, 381, -307, -432, -671, -655, -73, 318, 389, 684, 897, 232, -239, -795, -725, -736, -616, -104, 311, 823, 533, 340, 74, -466, -635, -626, -385, 4, 308, 834, 932, 384, -9, -440, -237, -574, -779, 69, 603, 766, 826, 530, 112, -578, -569, -878, -413, -127, 9, 628, 735, 247, -83, -71, -584, -743, -471, -181, 279, 343, 793, 536, 253, -259, -685, -597, -793, -479, 380, 370, 537, 722, 463, 214, -540, -724, -539, -307, -224, 590, 849, 793, 167, -66, -425, -459, -595, -412, 92, 425, 447, 506, 395, 216, -550, -611, -842, -536, -273, 245, 825, 420, 248, 147, -103, -677, -788, -683, -193, 190, 452, 824, 314, 311, -437, -431, -567, -667, -264, 305, 246, 516, 297, 151, -361, -415, -643, -536, -236, 129, 587, 586, 776, 434, -47, -214, -658]
2433f58P8K63L07K74L05K02k14m53m05n5j74K05K26M98J01K7k27M2o12l31J52
2454d49Q8J86L71J78J1p2l25j70l91k52M60K71M37L16k38J20m04l70j38k8L17
2475h2n67O03L26L02l54K71k84o56j27J51L1M37K01L01J65j69o23l6k52k43J8
2496e87L33N08K21L9l50j16l92J14n56N68o4O55M33l02k14n42ol10j33K94K9O16
2518B38L9K38j32k06o39r3J20R6JL64L14j7K63m98k44n7k64n6M12L35k0N3K80
2541E27k60j24n50J27j0j74M47M67J52j33l82j22k16q6k46L56oM77K76J25o26
2562A9k3j91j20k79J11N26Q6K32%lj55m10j21k52o5O09Q1J48K13m49J86j50j68
2585a75n04L58K35J33N09O0n38J53m47m08J31r3L00K75M08J53Pj38l55n66j91
$$ y = [-658, -580, -317, -10, 264, 569, 771, 557, 104, -301, -356, -530, -325, -99, 399, 500, 527, 300, 342, -270, -601, -449, -361, -175, 196, 374, 385, 313, -12, -182, -573, -825, -365, -94, 343, 659, 421, 541, 137, -233, -371, -399, -82, -649, -46, 280, 582, 228, 499, 215, -441, -568, -417, -386, 51, 252, 553, 718, 549, -74, -110, -362, -605, -587, -254, 254, 475, 514, 164, 48, -344, -230, -786, -218, -282, 373, 806, 504, 290, -252, -258, -568, -701, -407, -378, 238, 277, 515, 383, 177, -462, -555, -435, -339, -338, 26, 340, 323, 586, 88, -156, -213, -477, -533, -121, 214, 194, 247, 527, 267, 143, -407, -280, -290, -464, -17, 450, 602, 469, 87, -35, -251, -337, -583, -227, -233, 244, 520, 645, 19, -4, -195, -315, -594, -483, 43, 129, 361, 361, 358, 203, -207, -328, -580, -645, -36, 45, 193, 406, -43, 143, -7, -175, -679, -321, -86, 47, 556, 616, 78, 231, -216, -624, -493, -586, -286, -11, 397, 550, 557, 419, 64, -502, -693]
2606f93K91K98K08J63J51N4j55o8m24k08J19k1L08r1N64j24l3o4l47l52K29k86
2628d81K99M87J95k71J30k74k45l98l8J80J76J45L86L74k42k42l16m38J39O6L11
2649e7M42q6J10P7j41k95n11K3J67j04L22J05N84p2k94l89j30q0k91L46L9K38
2671CL62p4k19R3j38o13L25J83j19M19J08q6p0j66k41k26j78O07P2r9L72K15j03
2694D27k44k32m6m18K05j9N45j21L34L6k83l33l96J3j5M22L48L4J85j82Q1k88
2716E3k21j68J73K01j76K82J40J05N4k48j55j73j68K89j81N60j73K05j49m5o21
2737d16L12l11K31J66j4K60J72p3k72n8j23o27K21N47K1J57p5M39n99n34J29L17
2759a30r8P4J91K66j68Q0M9Ol72j07q5J42K22J79j44N3q7l7k57j89J61L1M18M2
$$ y = [-693, -402, -104, 104, 267, 418, 472, 317, 249, -175, -383, -264, -285, 23, -68, 496, 372, 339, 275, -72, -424, -195, -481, -182, 305, 500, 229, 359, 85, -160, -558, -596, -416, -240, -95, 291, 665, 423, 181, -135, -573, -434, -368, -57, 385, 299, 409, 486, 345, 50, -461, -438, -271, -375, -53, 52, 636, 564, 270, -119, -249, -329, -620, -274, -235, 3, 365, 291, 72, 165, 27, -586, -261, -78, -197, 222, 330, 244, 174, 8, -233, -459, -637, -30, 42, -57, 315, 530, 427, 183, -49, -95, -513, -308, -327, 218, 97, 431, 467, 184, -149, -545, -532, -547, -125, 223, 257, 442, 260, 341, 53, -168, -336, -163, 38, -138, 144, 284, 389, 443, 195, 40, -133, -301, -12, -193, 367, 194, 399, 250, 205, -416, -104, -415, -184, -18, -32, 228, 400, 327, 55, -3, -126, -753, -532, 15, 36, 193, 118, 557, -42, -576, -447, -130, -228, -154, 37, 303, 135, 215, 264, 270, -102, -209, -294, -152, 70, 249, 105, 158, 71, 34, -223, -412, -251, -220, 198, 240]
2783B40J71q5M1jn10m9k34k4K76K46L73k11J9j96r9q7r2J53L16k16K82q2J68l31
2807F8j31k21j22P0J49K82j1J04q3N5k90k76k38N36J6r2K96L54j39%m26J51k49
2830a97P2M9R2n7L13K13l28n6n1m00K20p6j07M79N31k25k81q4k88j78k76M32K24
2853B1r6J47L88j87J79m95k31k5j37Q6L31L34J40j38j79R4k38l27K38j75J77L19
2875B26K48l06p0p8k74l7j41J45L64J34m4N21l40m10k34j95K86n8K66N06j70j92
2897A47Nj27j93j79J39J52k5L36M4J19l46k8j98k64RJ68J99k2M01k49L47k78k93
2920a36k51O6QK28J87M60l33r6j04J37m66k12K27O6K63j6K56M81l61l77n29L40
2942a62Rk87P05j30J78J07Qk00m21l11J63J50K03j26N73j55o0k66Q5k14k7J44
$$ y = [240, 411, 326, 367, 366, -144, -193, -427, -451, -175, 71, 444, 233, 252, 56, -43, -130, -222, -69, 247, 31, 313, 231, 399, 68, -63, -284, -406, -336, -187, 95, 84, 188, 105, 160, -130, -406, -644, -108, -92, -184, 112, 466, 327, 327, -99, 52, -197, -125, -76, 16, -41, 272, 485, 157, 101, 50, -350, -130, -206, -313, 166, 697, 472, 191, 107, -181, -359, -635, -203, 21, -75, 72, 460, 273, 452, -43, -274, -299, -436, -350, -19, 315, 455, 317, 138, 232, -6, -333, -95, -270, -93, 226, 474, 168, 98, 20, -254, -291, -432, -287, 77, 211, 167, 688, 348, -62, -296, -491, -205, -263, 3, 509, 339, 147, 152, 25, -168, -347, -208, -56, -81, 255, 299, 418, 72, 44, -154, -418, -409, -241, -42, -64, 337, 88, 435, 157, -136, -387, -321, -313, -85, 102, 562, 229, 133, 29, 166, -300, -512, -285, -219, 44, 28, 284, 765, 404, 27, -502, -162, -153, -440, 265, 135, 313, 420, 428, 228, -193, -504, -341, -191, 12, -114, 459, 304, 244, -22, 63, -151, -178, -34]
2964c4L4K69j07%j42L70p70L7K4K43k71K39M98j70j59J77k17n98M29j39M9K35
2986cJ85K15j47n2n71j58J67K49K8N6K98n7k16J32k23l1M8k02K03r9ON88k62J85
3010C39l13J00m13J18k67L02L68j96J02P3M1l51j62J64Q9j94K55L25j92j70K04
3031B22k71j00l19K92l8M63j79K56P8m41Lk53J03J0qK08lK99l61Q0l8J0l08L63
3055F8k37K25K96k8k83k3o3k72L06m9R2J22l33M02j5l6l09J29j02k12K55J48L55
3078D36m35J39j86K65m59l2O9L39q8j58N30l36J92k28k27J9J31l39Q9L19L3K42
3100C15j77k6k39k37mL20Jk00O56k7j10Km74J2k0J14n1M32k30M5K44K1k64o9j88
3125a54k66L32J44j38R5R3p2J56n11N2q3L28k88L97J78J82l32J52m71N4k36J22
$$ y = [-34, 0, 269, 162, 162, 20, 390, -380, -343, -319, -76, -347, -108, 390, 220, 61, 238, 21, -577, -148, -287, -238, -3, 182, 397, 250, 198, -373, -531, -364, -115, -87, -31, 267, 210, -6, 126, -97, -128, -80, -282, -79, -178, -172, 416, 154, 339, 26, 126, -287, -169, -436, -134, 234, 38, 140, 213, 254, -97, -259, -95, -6, -200, 55, 380, 188, 18, 222, -49, -149, -468, -176, -214, 249, 70, 326, 404, -37, -34, -287, -184, -174, -182, 26, 23, 322, -39, 41, 3, 13, -295, 68, -169, 56, 352, 324, 41, 18, -45, -317, -11, -60, 32, 154, -179, 223, 208, 172, -137, -8, -110, -322, -67, 81, 436, 1, 140, -46, 219, -240, -272, -203, 136, 48, -110, 420, 84, 276, 48, -179, -160, -29, -368, -279, 40, 73, 315, 138, 112, -127, -364, -368, -48, -47, -247, 409, 382, 272, 274, -200, -188, -208, -94, -145, 287, 57, 102, 346, 367, 103, 34, -154, -420, -88, 56, -82, 13, 106, 34, 190, -321, -269, -352, -24, -312, 85, 263, 445, 113, 265, -206, -152, -388, -266]
3147b66N3L46n2J17K22l07k44n2K71m89L05K54k15L53j9j27j6m88K90k61L27k35
3169b33L59J88K5j00k70k4j18r2j5L78j44K11Q7k5m22k16K41J85R3O0j99J36r6
3192IK15j86k95J07m58M45n9K61j22J53J42k9k12Mj82M1K74N2J08l7J59n04J20
3215FO6l54r8K70P7J44O6j02n0J51k43j02k50J61M09J02QK4P8k0m43j30K08P9
3239E7n5K18o0N6j50j19L9k70K25j99J38J13L22J1l02J67l51L5p6k08J88M50j47
3262H2J03Kk76j90N3J11K6j09M95j8l15L7O4k90J85O7k29N4J73M7J21O9k17j14
3286f9Kj0j9k8K07Q3j3K64j70o5k28K72l37J68o5O3M01j33k99o0J9l9p3K93l58
3311a94K30L01j49l24N26m96J38j35J69j81J52J23q7J12r3l5j01j80K68m9r8k
$$ y = [-266, -213, 133, 81, 198, 420, 113, -131, -183, 88, -401, -96, 158, -57, 296, 277, 150, 134, -354, -64, -325, 2, -233, 126, 314, 339, 239, -31, -55, -173, -265, -280, 98, -46, 165, 252, 227, -195, -411, -170, 15, 108, 168, -31, 105, 9, 224, 38, -257, -150, -608, -163, -222, 39, -83, 70, 212, 183, -29, -25, -207, -166, 108, 160, 268, 231, 390, -114, 6, 72, -282, -380, -110, -33, 111, 177, 75, 25, 176, -67, -169, -419, -258, 151, 253, 261, 285, 363, 343, -100, -230, -22, 57, 2, 220, 160, 216, 66, -53, -14, -284, -59, -258, -120, -7, 315, 326, 24, 191, -160, -125, -201, -409, -221, 229, 82, 185, 187, -89, -279, -226, -115, -89, -198, 297, 279, -36, 1, 65, -225, -40, 27, -202, -148, 25, 72, 193, 262, 45, -69, -67, -77, -96, -124, 83, 166, 153, 417, 247, 182, -46, 226, -111, 57, -8, 55, 456, 323, 24, -36, -17, -56, -129, 164, -194, 36, 337, 188, -136, 390, -106, 32, -103, 66, -115, 37, 160, 73, 185, 92, 57, -44, -224, 44, -5, -103, -105]
3333a05K69rk4k16k12L92L1j65K44k96K77l36%K92k67L6k22J39R5J21J3J68r3
3356A32o9k38M5p1k14J52N90P7j80J32l38k78K98j33k01K00J60M00L0k13l51J1
3378e9l1R1p1J87k60L78j92J24l3J5l40n3M6K76k3p7M9K80j41o1j34J95l47K20
3402C9K10k89K52j56L8mj62n0k57L07K60m0j63K31N7l06J53l3m18R0J13l8J18
3425d8K65J8j53Qj77mN3o2J43J06j55L41k96m35L67j28p8J09J8L14l5J40l50%
3449c9k68J88q9K65j64L21r9K77n19N5K7m8l05J37L59n0J64j96J24q2L2m3o5j95
3473b13M14l18K80o0P0j27o8j61n3L61k39K47K22o6j30L8m00P5J25j90k6L48P0
3496A99j94L0J11m17L89j41Kk7j1M58n6j66l63J07J27q4M9J77k10jL46J25k18
$$ y = [-105, 164, 155, 131, -85, -297, 95, 126, -39, 205, -91, 186, -150, -150, 142, -125, -89, -311, -172, -77, 44, 57, 225, 132, 63, -175, -130, -201, -415, -263, 327, 404, 224, 356, 18, -260, 38, -95, -296, -96, 64, 464, 494, 281, -70, -59, -90, 1, -70, 117, -143, 235, 43, 167, 134, 149, -191, -244, -198, 78, 55, -22, 27, 307, 166, 105, -29, 166, -181, 39, 249, -40, 212, 56, 94, 90, -72, -122, -379, -72, 188, 148, -15, 216, 273, -33, 120, 87, -331, -241, -128, -166, -48, 217, 235, 82, 90, -87, -91, -38, -100, 43, 149, -6, 335, 39, -396, -29, -157, -235, -126, -108, 206, 171, 311, -39, -39, -307, -119, -208, 57, -107, 214, 115, 392, -127, -72, -45, -93, -398, -261, 98, 48, 212, 16, 140, 58, 90, 47, -18, -213, 201, -117, 163, 103, 173, 46, -22, -183, -236, 125, -114, 133, 355, 289, 159, 197, -203, -128, -3, -193, -219, 129, 199, 5, 35, 146, -271, 118, -23, -21, -48, -59, 399, 343, 177, -186, -79, 48, -36, 13, 190, -20, -21, 325, 450, 232]
3519B32j30k85j3K16j7L9K40o0k08O2r5N7n6j31j80N29j67MJ60P7k63j91K03k41
3543b18j8J01L39k5k80L89k96R3k87O4K42r2R2J89j90J66k79J14k37M4K01j78
3565f6J15j91K06j06K54k18l15k6M16j07K88j92k04J92m6p2Q1M6j74L15l00M03
3587B99j62J82l36j77K38k29j19K05L8N4J93j45R7M7j13k54l46M00J11k9K97k32
3609A9J03M9o6l90J95k2K64l8j13J07R9k03k09J78j84J71k8J11RJ34j6k07J17
3632H0n7j11j56P3J62n7J67R5L0j35j71K9k13PL29k11J20J9P8j91K0J06k16J21
3656h2J13j25l3K46J6j10O2o01M40L45m71J80m0K58m9l16L62k20j14N0K0K86j62
3679E5J66j83m5J14k23k89J29M33Q5Q8q0j08j00J54k66l17L10P8J93l5P8Q6m45
$$ y = [232, 102, -183, -196, 20, 3, 42, 282, 222, 14, 76, -19, 38, -18, -149, -329, 200, 33, 37, 197, 274, 11, -180, 23, -218, -236, -135, 204, 179, -101, 288, -8, 85, -202, -138, 104, 12, 104, 293, 103, 269, -10, 104, -133, -89, 112, -66, 49, -142, 64, -42, 212, -6, -321, -347, 69, -38, 250, 58, -146, 46, 0, -72, 9, 55, -119, 196, -104, 299, 137, 319, -17, -194, 44, -185, -304, -99, -61, -7, 186, 41, 138, 185, 72, -182, -528, -128, -17, -46, 251, 19, 122, 171, 105, -285, -90, -112, 152, 114, 1, 108, 207, 4, -205, -27, -211, -40, -68, 43, 52, 186, 170, -37, 80, 23, -88, -244, -171, -9, -66, 101, 196, 226, 91, -80, -51, -264, -257, 72, -139, -19, 0, 78, -113, -93, 13, -203, -82, 31, -94, -127, 119, 135, 25, 87, -514, -74, 271, -200, -20, -60, 198, 149, -167, 195, -25, -139, -89, -69, 217, 55, 221, 38, -7, 107, -116, -405, -276, 157, 242, 330, 250, 142, 42, 196, -70, -387, -77, 1, 194, 159, 237, 323, -122]
3702a22K94j93j19k8j20R8J57J7J0j8L94j75n14K30j66O2J51K53J24j38k00nJ18
3725A10k02l48K74M33l75R9KJ78j49k7l46J88J26L7m1m4Q7OK1j26J58o3n2Q7o
3750B7N7K7j93L16j35k58J94lk68M14k24J96k9k04L4K95q8j67J40k23K08j89J43
3773G0j13M7j68J33j64J15j09K63m3j04oo0j5J26j45n0J90J63K34m65K02Qk04
3796i5n5L74p0n2M2j09K90k37j05J59l08K53m6O0n2k3Pk7Nm8q0l12K51K84k64
3821a58M01J2l22J55l19K06m0K8pj96L45p5J49M2r4k29J53j26K30l36M05n4j61
3844IL6J37j74P7p9j55j33K96j32K4j02m0J54M2j56K27j00J15J02K58j94l25J01
3867a2j86P8j48J73j06N39k18l83L34n5J09j85K6P5K08l9k76l5j66L53p1J10l7
$$ y = [-122, 172, -21, -140, -168, -288, -190, -33, -16, -6, -24, 370, 195, -319, -89, -255, -193, -42, 211, 335, 197, -3, -8, 110, -92, -440, -166, 267, -108, -9, -7, 171, 22, -5, -351, -163, -37, 0, -41, -85, 2, 8, 29, -97, 61, -2, -54, 33, 27, 84, 111, -82, 234, 99, -159, 35, 32, -236, 178, -46, 150, 121, -83, -49, 246, 158, -9, 131, -92, 116, -73, 70, -43, 4, -164, -31, -195, -80, -189, 74, 31, -73, -79, -139, -154, -28, -173, -223, -33, 130, 364, -101, 101, 109, -95, -150, 224, 154, 102, 144, 35, 325, 88, -17, 142, -166, 87, 41, 101, 49, 26, 33, 6, 11, -37, -117, -429, -178, 106, -158, 243, 255, -67, 88, -231, -25, -65, -37, -44, -240, 105, 30, 179, 221, 127, -102, 51, -75, 155, -181, 224, 170, 9, 45, 182, 8, 85, 6, -149, -282, 14, -118, -94, -196, -236, -82, -40, -196, 31, -69, 46, 148, 406, 212, -113, -12, -198, -120, -268, -95, -201, 338, 120, -263, 71, 16, 125, -60, -34, 41, 249, 210, -66, -101, -267, 86, 15, 125, 88]
3890H8j04Q9R4K6L2j05l75J5k14L31j5J08J16q7jN2r7K32k71o4J45j28Q9J91J14
3915B61k65N3r8J4K0k22L85k26LKN1q2l3J70m5k40J06K93l6j43J38J48j66k8l43
3940b83L65j33K44l54N36l13k9l76K45P8n3J59l89L78O9J60j81k16K2N0q5J42
3962C6L7k39L79J36m17J59j6j61J25j41j27L55j96L21m90M18k24k53q9N84l32
3983a35j15K20K72j00l39J39K82l72J54M5KM47m59R3j54k13K43k7kK34m0J1k05
4006a9N1P9R7j80r0P7k24K28N3j22K46k8j14o8k1m8J13q2R1J85m18K13m2k39J77
4031h5P9j18J3K14J8J9J06q6L4j52k67k2L16J70j98l5l3jk57M48l44J10K00p0
4055E9J2J08r1pJ04k33k70N61k40J83J66l90j01J30k59J5J45j91J64j4J22q3J95
$$ y = [88, -16, 73, 167, 193, 225, 120, -255, -240, -454, -123, -138, -30, 86, -1, -2, 50, -47, 185, -86, -150, -5, -133, -44, 147, 261, -4, 49, -49, -35, -15, -237, 148, -78, -75, -73, -22, -104, -137, 33, -12, -252, -146, 147, 111, -32, 106, 254, 88, 60, -283, 82, -51, 193, -161, 375, 62, 33, -343, -98, -20, -73, 86, -303, 75, 144, 304, 123, -93, -71, -21, -106, 36, 73, -166, 213, 349, -68, 91, 75, -86, 39, -102, -229, 126, -70, 251, -239, 179, -45, -298, -387, 197, -135, -250, -30, 242, 142, -197, -58, 224, -148, 6, 51, 53, 500, 41, 134, -20, -233, 10, -17, -19, 215, 175, 186, -19, 32, 111, 208, 28, -62, 15, -209, 19, 72, -50, 196, 168, 54, -14, -35, -83, 30, -52, 39, 224, -194, 19, -23, -262, -85, -6, -124, -111, 103, 121, 140, 246, 160, 194, 42, -225, -247, 69, 239, 41, 6, -27, -28, -285, 163, -181, -71, 129, 59, 71, 179, 88, 81, 185, -48, -318, 243, 3, 186, 352, -38, -139, -9, -268, -253, -108, -299, -135, -149, -27, -110, 85]
4078H5O6l30N7j96J89Q8O9M1j68K54m74L96l1m60L81l0K00J26M3Nl80k0p7l0J1
4103a85K10L28n69J66J47R7l56L89r7l06J48R4k38L46j61J44j6l54J57J37q1n2
4125e2M70o39L59j78j0L6j06J46j72PK22k21L38o1k57K45k52J92Q9k92M00j82
4147H2k64K19M2j86o0J46M6rK51j35l27J34L15Kn50J27j08N18k61J23N8k54L05
4170B14j39k9Q1l31j42L01L73l19J71Q2j89n1j3J2j43R0o8J08J31J9L6j79j40
4193a25L4q8J2L22k13J32M1K3k48J69J17k52J24j06J38J21l48L7K15l61K20J72
4215A36r3n9J97k50K40l18K16l7k36J70J20o6K12k97Q7R7j15j3r4J87L9j82J91
4238A32j15Mk38n2N3J66l6m48O04j43L3O2l2j7K11l37J37p7l1J95j65K51k34J59
$$ y = [85, 151, -179, -122, -318, -129, -41, 28, 69, -99, 155, -319, 77, 46, -414, -33, -63, 137, 263, 306, 311, -69, -89, -166, -196, -185, 25, 353, -216, -50, 97, 194, -162, 227, 130, -176, -28, 66, -172, 174, 13, 157, 141, -213, -56, 81, 0, -52, 418, -221, 138, -40, -50, -14, -120, 26, -146, -139, 83, -138, 200, 139, -118, 127, -125, 67, 156, -136, 264, 82, -182, 37, 79, -107, -167, -21, 25, 16, 267, 132, -195, -61, 254, 256, -294, -167, -275, 243, -18, 105, 163, -91, 214, 75, 46, 127, -204, -346, -45, 328, 9, 180, 262, 73, 22, 9, 21, -122, -32, -100, 8, 139, 158, 194, 15, -125, -91, -179, -167, 155, -58, 74, 115, 138, -110, 59, 176, -76, 48, -58, 80, 201, -147, -110, 105, -256, -36, 136, 43, -16, 181, -69, 171, -147, 69, 32, -204, -34, 86, 20, 232, -65, 22, 119, 4, -9, -103, 84, 123, -59, 132, 17, 21, -217, -269, -216, -50, -86, -534, 70, -73, -40, 22, -10, -27, 184, -153, -16, -93, -124, 71, -94, 157, -77, 82]
4262H2L5k58J47O5k89L32k27J97J46p4o4k59K25k82M5L51j84j60M42j64j03k2
4284a9k21L70m06J81J05L9j40K73J6k83n6QL0j6K66N2k37P4J80l06K02l29m0L01
4308D4k5r2K39j50o6l6N6j19j39J64Q8n3M66l43k84L28j36N3j15K7J57o6j16o
4332a24J40L8J09k65j48O5K21M9j73J74J12m40N02m11Q5J35J8J00l6r2L27n45
4354a59L89k72O0L2j50J57j79l3J36k1k41J22L38k63K88l19l8L07K01l97K75k19
4376A4o6%n9L37j56k24K15R3k22K4r2L2J09j77J32J20%k34L73j31j67rk21R2N87
4401C70l92L7j09J53J4J28%r7k13L06j06m0R6k11J71l4k2J2j70KnK52j46J7R4
4426A07k45J34l32L02M40n56m9J42K42l9j74K29R2l21K0j81L6qK86j35o2P3r5
$$ y = [82, 117, -141, 6, 71, -218, 114, -113, 84, 230, 156, 92, -167, 58, -224, -179, 172, -12, -172, 270, 106, 3, -19, -240, 130, -276, -95, 10, 49, -91, 182, 198, -85, -141, -133, -103, -119, 147, 199, -38, 36, 216, -90, 112, -217, -257, 44, 19, -73, 166, 16, -50, -86, -30, -149, -288, -124, -36, -89, 377, 34, -250, 78, -58, -5, -120, -93, 64, -2, -118, -124, 16, 54, 163, -102, -250, -185, 36, 85, -88, 86, 198, -242, 260, -151, -66, 69, 87, 187, 151, 59, 386, -159, 230, -42, 18, 50, -100, 57, -122, -155, -19, -40, -281, -159, 179, -84, 204, -115, -153, 154, 355, -42, 233, 14, -52, -52, -111, 226, 70, -154, 61, 154, -68, -44, -136, -104, 5, -172, -40, 80, 80, -154, 219, 88, -79, -88, -309, -217, 370, -22, 15, -94, 59, 73, 201, 201, 104, -109, 197, 91, 51, 147, -64, 107, 73, 51, 63, -107, -105, -110, 142, -4, 13, 107, -138, -4, -336, -34, 406, -150, -199, -57, 185, 146, -28, 201, 293, -28, -8, -189, -153, -161, 125, -10, -72, 1, -94]
4449i4L4j31J57K25j10J48m67J81J36j16k40K0M59j45l36J85J21R7k31m9p7K50
4471A7J95k52K09k06N9Q9r3O4l35K74j58J21Q5J34k82q1K49j46O1j78J57K9j20
4494a08J16j13n0K92j37Po8k17R2L75k08J09Q4l01L0K25j36m3J98N9m3o4RJ03
4518B11q4p1Q5q3k1K6j5ko1k88K01J16l85L75QJ2J55j63J5K17l24l4l3o2K13l55
4544c47N01j77J85j3l80K07J43j41M4J62k68o6k49L28j17L3J65J0K30k03K63k92
4566A8J21L1k90J38j39J67J66K15m85J7K74l70k63K80J8j16L62j51r0m7K67r7
4588B6O6j25p7J92k13J42j57J56J44K60n48J30J65l81M24k83O2R3L50l81j5P7
4610A07j19pj03L8J76j3j9m00K23O4J20j29N8j02LK50j30K6n4j04J43j40j07J90
$$ y = [-94, -60, -191, -34, 191, 81, 229, -238, -57, 79, -37, -277, -257, 202, 57, -279, -94, 27, 124, -107, -156, -233, 17, 212, -40, 169, -37, 22, 111, 18, 82, -253, 21, -137, -16, 69, 203, -79, -160, 89, -57, 4, -174, -17, 12, -108, 8, -105, -155, 137, 0, 7, -61, -278, -186, 189, -19, 90, 174, -127, -97, 128, -8, -51, 147, 206, 163, 99, 108, 211, 127, 56, 141, 58, 37, 63, 48, 46, -15, -303, -102, 14, -371, 4, 12, 24, 179, 16, 31, 248, -76, -110, -143, -205, 8, -347, 154, -23, 162, 149, -231, -24, 119, -22, 22, 184, -84, -150, -399, -71, -188, -155, 10, 20, 250, 47, 310, 18, 139, 170, -120, 18, -121, 46, 212, 427, -58, -41, 233, -137, -400, -120, -102, -218, 144, -7, -97, -144, 123, 26, 92, -33, -110, 82, -131, 11, -146, 10, 154, 414, -134, -4, 161, -220, 204, -79, -17, 76, 426, 45, 30, 107, -12, -19, -122, -84, 92, 79, 60, -340, -117, -53, 67, -62, -4, -106, -103, 147, 17, 43, -11, -115, 28, -112, -219, -29]
4634b9M9l2k23M29j82r2K99k52J77k11N2O7m8j8o1K03Lm66K83q5K05j02K0m9k57
4659c20J11K04P3K3Qj64K28KO9j09j76o3RJM33k01k0k08K49j53J6j8O8j19q9K11
4685F5j97L08j42j48j32J94K0Q0k78J02J66p9J72r6M7Q1n1j42M5M5j05J76j17
4708A4J41k24m5L21k46M4l7K1J47l01n5L74M1P2m05J9O1J52J26p3j92j7j20N9
4732a23O6M9L92o76J52R7J36j05J18j29r7n8O8J92O4r8p9L42m15N8j30J62j52
4755a66K78k59K49k28K18k45J48m0%l0J56j77M18k85J9R9q7j06P8j10l37N58P6
4778B27k81q3K35m4j88K2j94J91j79M15M1n8k49P5J25k29R1R1j75L05j83qM6j99
4802b06m1K93O3j22q2k39N37j43k18M00j35k55J66K90l46J49q1n9l8o9L43P1j17
$$ y = [-29, 20, -12, -235, 194, 12, -80, 219, -33, 144, -67, -15, 52, 4, -14, -75, 128, 131, -335, -52, -137, 68, -34, -14, -63, -320, -209, -5, 68, 91, 99, -65, 163, 165, 234, 125, -51, -114, -105, -104, 329, 128, 108, -100, 149, -4, 12, -6, 62, -57, -146, 65, -132, 176, 34, -114, -246, -52, -32, 48, -230, -128, 38, -41, 131, 35, 82, 163, 112, -30, 15, 60, -45, 131, 14, 155, -69, -114, 207, -39, 5, -32, -11, 136, -165, -220, 154, 195, 267, -138, -119, -58, 94, 220, 147, -45, -62, -182, -123, -57, -8, 384, -292, -140, -43, 93, -12, 106, -23, -120, -178, -110, 82, 146, 48, -31, 311, -104, -46, -176, -14, -166, 112, -147, 102, -126, 92, -153, -5, -45, -45, -75, 81, -96, 322, 37, 56, 155, 68, -38, 40, -70, -407, 151, 227, -54, -137, 98, 54, -134, -112, -306, -115, -294, 121, 162, 104, -145, -70, 55, -174, -83, 8, -167, 138, -45, -53, -7, -206, -247, 46, 109, -13, -95, -334, 203, 60, -158, 242, 107, -148, 18, 308, -38, 111, 30, -29, -67, -136, 207, 278, 161]
4825A61k46J2J44l2J2l06M20j63J33ql32K12j77K86q9r8J5k11L58l08K25M55m96
4848c3K38r4l5k65J92o7R6j83J31J21r1J8J51m23N63n45J30K21n7N7MP0o4m8k6
4873F1j59Q0K14j47j68M1J51j24K79l75K34j19Q4k11r9J60P8K36l76n5K3J66l61
4896c87N91l64L11k13J26j97K77k08J81R8l22K52Ko4J41j63k37J86j94K52J00
4917A68l4k34J40MK9j03J73l09L27k34j26J48L24n4l5l09J77j69J81M8n2o5J26
4940A21o6J73l54J74j68N0P7N6K0k81L32K1l69K62Qq5K75l32R5j7J10r3j72K93
4964A30j85j28K57O9j51j26N2N4J9O1o2j6J45k64K0n3K18J17K08l00j09R0k51
4987b05j35J25Q8J11Pq0K44k84N30k52l55J24N77m48n1j10K1q6J49J07l3J27k35
$$ y = [161, -85, -73, 71, 39, 51, -255, 165, 2, 135, 127, -205, 7, -170, 116, 27, -71, -56, -267, 91, -217, 8, 463, -33, 205, 111, 76, -189, 3, -64, 32, -151, -20, 101, 10, 28, 179, -244, 319, -226, -96, 125, 68, 125, 129, 199, 135, 87, 61, -98, -18, 196, 49, -119, -78, 73, -51, 228, -147, 87, -32, 52, -159, -258, -98, -20, 216, -160, -215, -192, -26, -387, 204, -160, 151, -62, 64, -133, 144, -64, 117, 215, -107, 145, 147, 83, 224, 61, -176, 10, -184, 68, 168, 134, -100, 40, 44, 73, -30, 143, -166, 161, -73, -199, -51, 273, 219, 184, -125, 52, -117, 64, 112, 60, -5, 121, 55, 228, -126, 48, -120, -70, 7, 63, 83, -198, 134, 155, -214, 48, 56, -29, 246, -86, 9, -8, 102, 9, -163, 130, -55, -183, 74, 143, -8, -134, -82, -28, -9, 52, -10, -26, 119, -145, -125, -178, 40, 157, 365, 65, -44, 46, -205, -340, -215, -127, -16, -9, -89, 155, -129, 401, 149, -206, -82, 495, 47, -4, -114, -93, -179, -30, 77, 44, 171, -64]
5010f4k2L6Q1P7k17J73k35J58k23K17P7j68K40j97J46k42N24l84n8Q9o7KoJ96
5034A33o3j00p0k0K52r1j29J32l4NQ2M3j3J55k38P9J40k25L6N1k34j5M4Q7p8%
5060g1K2K84j94J17J06k50k2J25l1r5l6q7L11j06J2l34M18L3l2j13P6k19r7K29
5084D6l68K95J38l12L64l65m7K44k9j86K39J29k34J56k91K99L5j31J49R7k40j41
5106a53P6n1J58L4J70l16j4j41J77K50L1l40m1J16K0k27K11K01k06k90N76m02
5128a61k8K85Kj93J10k1Q8M7Q2J78m19N7m1q4l4O7J60J65j77l76L34j20k58K07
5152a30L89j81j12M2k29L26k6j35J56j81J42J72m42L50j32p3J85j36J7K6j03N1
5174b4Q8L34l11q8%j03n7J06J61k93M01R7k78nr7J35j97L3L5K4j50K35L1L2j06
$$ y = [-64, -86, -50, 31, 108, -109, 64, -171, -13, -236, -19, 58, -110, 130, -67, 79, -163, 361, -23, -81, 8, -59, -57, -63, 133, 70, -30, -100, -120, 132, 41, -88, 44, 10, 15, 97, 140, 127, 282, 44, 123, 263, 38, 74, 125, -109, -124, -80, 7, -71, -71, -49, 235, 41, 158, 264, 14, -8, 117, 86, -9, -45, -132, 179, 73, 85, -249, 169, 202, 170, 57, 133, -86, -183, 46, -322, -27, 111, -201, 163, -202, -249, -5, -34, -220, 19, 148, -86, 70, -221, 78, 113, -18, 131, 228, -12, -153, -77, -128, 30, 64, 234, -82, -96, -237, -60, 190, 221, -119, -160, -44, -24, -251, -40, 161, -45, -335, 241, -161, -189, 96, 98, -95, 15, -6, 82, 129, 211, 389, -30, 27, -14, -98, -132, -65, 95, 260, 83, -293, 41, -79, -337, -130, 259, 78, -34, 8, -221, 105, 79, -56, 100, -81, 61, 233, -209, 141, 9, -64, 121, -15, 2, 28, -75, -24, 64, 398, 87, -1, -1, -104, -161, -55, 106, -187, 214, 311, 33, 28, -69, 66, -131, -98, -63, -39, -189, 46, 77, 109, 3]
5199CP2km53K35L07j20O5J12k3l88K56j45J2J09P9K11l67q4J57J44l85K99k27
5222a33K59l18O1K67o8q6o5M20m92P8oL03j27k88j19K71J28j2j11R6j74K33j57
5245d0K62j87O2j58J41k9O4q6j48L55k01k51M19j83r4J02j73J50k1n2L28k88O2
5268C4J54K5j68l5RJ44k76N0r0p1J25k13M04q5Q0P3l47L41k59L29n6j18j48j57
5292b55L09k83j2K66m0n5J09j5J9m4O1j03J51J30l35J42k02L10P3j95K8j60P2
5315b9j34M5J59N9O0m33M58p3m5j75j53L98P8j58m28J35K72k14J68J74k59J43
5337D8L3j42J11O4j41l6p6K0K40l4j46J70j89J41j10L9p7K45k07K40j13k23N13
5360C70k78k32oK14q9R7n8kKOr0K75K52n60M2j25K29q4j36J07k2L93n59L67j75
$$ y = [3, 75, 73, -380, -145, 162, 42, 107, 219, 196, -192, 64, -81, -69, 40, 119, 330, -37, -121, 36, 180, -205, 94, -133, 126, -192, -131, 136, 68, -18, -83, 337, -155, -77, -83, 220, 93, -195, -314, -43, 85, 73, -38, 58, -116, 117, -40, 222, 35, 97, -61, 80, 51, 115, 29, -119, 236, 35, -216, 203, 20, -74, 28, -145, 5, -16, -68, 260, -28, 34, 188, 213, 45, 10, 19, 163, -113, -63, -153, -224, -99, -312, 92, 7, 87, 160, -187, 154, -105, 224, 168, 50, -98, -255, 54, -229, -241, 25, -15, -70, 39, 24, 43, -1, 60, -43, 108, 238, -97, 45, -157, 153, 226, 31, 59, -101, -29, -163, -118, 41, 100, 160, -273, 185, 112, 67, -108, -261, 137, 215, 57, -371, -236, 36, -178, -10, 164, -95, 48, 81, -61, 50, 114, -27, -63, -139, -119, 121, 87, -59, 111, -78, 63, -47, -8, -85, 160, -47, 193, 80, -143, 370, 92, -140, -146, 68, -21, 76, 18, 16, 18, 24, -66, 209, 461, -99, -57, -182, 47, -37, -173, -66, -88, 305, -254, 113, -62]
5385f2P2k24K23k36J34j04L61k07L69l58k3J68j05l8J94k32R4k9N4l26L71K0O7
5408A83k64Q0N3l11J32K59j12k7L2L8j11J37k51j61L05Q7j41om9J02j01j54P8
5431b02K19J27j40j10L6N8j70L20o2k7j9M0N2k22M2J24j98j4N93l61j02j13L81
5454B52k4j34l6r4J24ol31N31k9k9l34QL06k56k70L66J14k13K46k77K43j89M9
5477A7p4R4k76J89N3L1j15J69o0J28k63K3R0m8J70j90o6J05P3K42q1k72K05m97
5501c53N42k12J1m1j03Q6L54k60r5N0P4k34J42J08%j31J35j49J85O4j49M5n4k6
5525a1QK42j26k82K8J60K12j85K33l30J32j39J32m2l20K36PL0rj27J5k7O1R9k6
5550b9J66k16N3n2J47j91O9K93k48k8o9k4K2K62M9l66N0J10j20J13J50j62L14
$$ y = [-62, 10, -214, 9, -227, -93, -197, 164, -43, 326, -32, -55, 113, 8, -30, 164, -68, 26, -3, 51, -275, 96, 116, 183, -81, -1, 52, -259, -127, 132, 20, -7, 25, 63, -48, 89, -162, -323, -18, 69, -72, -78, -127, -25, -126, -280, -202, 17, 144, 4, -106, -70, -12, -182, 138, 76, 49, 30, 70, 122, -100, -58, 66, -132, -146, 447, 86, -16, -129, 252, 228, 94, 58, -36, 88, 82, -249, 282, 253, 224, -110, -102, 204, -52, -322, 44, 158, -55, 191, -86, 157, -32, 17, -57, 37, -239, -50, 3, 34, -81, 88, 28, 156, -107, -84, 6, -42, 128, -62, -128, -23, 50, 292, 211, -61, 144, -353, 189, -23, -12, -53, -156, -70, 284, 24, -71, -21, 53, -181, -39, 69, 69, -62, 73, -76, 109, 173, 24, 69, 15, -11, -3, 239, 113, -169, -141, 19, 231, 46, 279, -51, 81, -58, 74, 32, -288, -52, -45, -15, -24, -151, -136, -163, -102, -3, -29, 137, -79, -26, -78, 69, -122, -53, 240, -8, -36, -105, -129, -107, 155, 204, -162, -112, -2, -122, -9, 141, -21, 293]
5573B93j35k27P4j11L38l66K14k6K2K64l81q5J99l71r9M35J08j09q7K38j12J10
5595A86q2q2k00L31k80J26j61J31l8pJ30j62m8K33j00k3K27Q9n17PJ31k5K51m3
5619G4J28l17o8M61n25J84l3Q3J02q6L47l15j20K58nk35j92K62r0l0ko8J99J35
5643A47l45L00P3k36J73l48J01K36m9k2m9P5J42n65L13m9K00L4j36Q4k63p1K67
5666A2J29j78K79j16k50r1N1M31k72j65L11j28j44K61r4J63K8m59J79j65J46N7
5688a5M6J51m2q1KO3m8K5m8j85L13k84N6J48o04K70J32M7j94J16J94j69JM3K00
5713A37l9r4j93K99K9r4K0o7j18P3p4J46QJK97l07j23o6J24J3L0J41m9j67Q3J73
5739A83j63j00NJ40J68k62K00PO5Kl66J63J07m0k68K57j7k72o2M95l63L94j14
$$ y = [293, 158, -69, 5, -106, 232, -134, 80, 54, 76, 340, -41, -126, 73, -298, -397, 38, 146, 37, -50, 188, 76, 186, 104, 22, -178, 153, -127, -1, -162, -31, -69, -76, 54, -108, -156, 77, -23, -46, 181, 270, -247, -240, -109, -134, 117, 74, 202, -115, -183, 278, -247, -63, -96, -13, 89, 3, 350, 35, -85, 173, 168, -67, -259, 3, -87, -117, -119, -187, 12, 147, -198, 102, 175, -61, 112, -236, -135, 101, 52, 30, -19, 56, 198, -367, -54, -103, 97, 131, -5, 79, -184, -255, 12, 141, -37, 242, 126, -124, -215, -164, 267, -5, -170, 141, 13, -131, 130, 36, 199, 227, -232, -53, -218, -72, -15, 31, 182, 140, 59, 61, 124, 76, 101, 53, -132, 181, -103, -47, 101, -503, -233, -101, -54, -248, -132, 62, -107, -106, -63, 137, 98, 4, -189, 110, 139, 45, 65, -2, -120, -47, -121, 25, 33, 34, 331, 24, -99, -165, -41, -28, 2, 143, 94, -73, 10, 183, 20, -80, -75, 65, 233, -29, 171, 178, 243, 245, -121, 42, 149, 109, -159, 98, 81, -191, -253, 242, -121, 273, 159]
5762A59m48K47K57l27m7P6j1K62j10j4j08J83p5n7j01N0J16N4q9Q5j6j57j3K31
5786A47l51J42M7mj04R2j70N00l86p8K21N1j92j56J64L04oj57o3P8m5m3J58K78
5810D27n62m2J04J43n7J35nj7j40lK03Ql42L36k37j73J74J9J43L2m30J94J66L4
5834A10j67k21J73N4j46L12j31J24j49J61k26K27j35j23J40O9p5J26k04m3R9J72
5856A47J74l48N9L0j12o2K85Q0l50p4K54j84L6J98j81J73J04j74j81J2K10j54
5878e8j00J28Q3L3r8O1J5Q0j93j7J34J81k34l9j74K15j1k25L14l07J86J79q8O6
5902A31k06J16m6K34k70l6J1K22N1j89R0k22J03J23J9J42j25o13O63o9k03L37
5924B63k44n6Q6J93J02n2l98j35J94Q3j29N0J39K68n72J97J60o6Oj21n4Q9q4J70
$$ y = [159, -289, -42, 215, -112, -159, -83, -94, 168, 58, 44, -64, 119, 44, -13, -114, -64, 52, 106, 17, 102, 86, -71, -84, 147, -204, -62, -15, -19, -123, -31, -201, 299, -87, -165, 56, 107, -85, -241, -77, 227, 221, 64, 1, 79, 34, -9, 149, 427, -135, -177, -73, 70, 13, 148, 143, 126, -14, -17, 186, 194, -148, 188, -49, -222, -48, -29, 114, 146, -284, -90, 76, 110, -57, -278, -105, -51, -197, 115, -16, 108, -41, 120, -106, 121, -14, -137, 3, 72, -3, 123, -81, -124, -25, 147, 321, -27, 32, 62, -50, -112, 173, 253, -97, -171, 83, -101, -65, 133, -48, 125, 229, 55, -126, -114, 96, -58, -158, -30, 53, 86, -12, 49, 64, 144, -49, -66, 68, 249, 15, -24, -198, 17, 6, -219, 95, -212, -26, 153, 65, 131, -75, 41, -5, 229, -41, -77, -66, 156, 207, 18, 108, -114, -11, 112, 131, 273, 148, -465, 198, 129, -74, 263, 19, -37, 49, 242, 344, 292, -106, -241, -47, 36, -93, -43, 96, 364, -208, -11, 149, 83, 89, -32, -86, 3, -81, 89]
5948H9j96P4J40N8j65j24K7J63nq1J40k78L3j08L32q1j67R2q2K36k23K66j42J42
5972A40q4R4j16j24J21LJ33k52lJ65O1n2j25J57jj4k71L67k05j16J59j95j35N09
5996B16p3k00J42k39R8J7J35k58k57M00k22L11j66L85k19k64K42j30N2k2J6O3
6018B7r4J69J03l92J11OJ14j48J3J7j0M1r1L33l84J94J31j78m7P4J52r9R0O4q1
6043A15J49j67m2j57J29Q0m7j64k65M14L1j08j82K18J94m07R6mO4O0M8j35N4l2
6067e8j39N4K13k53J35j45P7M5l4K05j78K09j6j71j45K94k74N3L0k67M17j53J11
6090A0J13nk34k0K22k94K21P6k25O9K3J80q3K02m30R5L70m11J92R2k15%K88k36
6114@q6J58r9J22M6l47N7K67M0l18N7J57K1m77J90L74m21K80j58M5K35j46P1r7
$$ y = [89, -107, -33, 107, 165, 0, -124, -97, 66, 61, -20, 120, -158, -125, -233, 99, 18, -149, -57, -139, 97, -126, 140, -2, 140, 56, 150, 34, -90, 31, 34, 167, -85, -88, 77, 138, 86, -39, 118, 117, 103, -168, 199, -6, -122, 37, -158, -293, 216, 143, -57, 85, -154, -56, -39, 96, -162, -419, -19, -241, 70, -96, 289, 70, -194, 48, -82, -30, -52, -36, 27, -67, 102, 205, -187, -76, -70, 44, -104, -91, -74, -84, -43, -134, 199, -185, 9, 140, -38, -85, -11, 141, 42, 132, 196, 115, 264, 97, 55, -102, 27, 107, 60, -104, -369, 45, 76, -32, -214, 4, 198, -209, -113, -117, -53, 7, 55, -80, -26, -58, -197, -143, 70, -183, -48, -193, -116, -71, -105, 100, -78, 131, 115, -56, -201, 93, -181, -128, -98, -365, 52, -101, 10, 123, 118, -116, -136, 86, -208, 13, 89, -136, -67, -44, 136, 53, 255, -175, -80, 290, -121, 71, 163, -52, -52, 236, 0, -86, 72, -27, 95, 141, -206, -149, 118, 158, -160, -103, 54, 75, -402, -212, 162, -259, 21, -137, -92, 143, -3, 68, -29]
6138b9j37RO2J1m2K53l33J12J86k63O8R1J44j60ol52N77r6%Kk30P0P7o2J36J73
6164B61k68R6p7KJ0J26j00j01k40K47L4N8p6O3R0P7j95q4K7k0L28l70o4L2M50
6189C06J8n70K15J08q3P6Nr4k05J43J70r2k93L98l14L58j44O0J49j93L02l25k7
6212c2M3k05J55m1j77J56J06l03K93O6j69K13k3kM6J84m89R9K43j27Q3j89K29
6235A59k46K40k4j57J23j99j21J56K35p6l01L34K36l57j41J68Q8k51M41k53Q6
6256A40j11q6Q3K14l01j80L24l9n2oK08l25J70l79L98k9O4r1J21k55M44j36k45
6279f9Q8j63L07l92J13L68j01j55J38j26j09L64j39n10L79J70r2Q8k5J0l3k61
6301a50L36j92M4k21K54J62m66L87l1j86P1k79J98K33m8K13n74J72N33l85j67
$$ y = [-29, -166, -157, -95, -84, -126, 127, -206, -94, 92, -171, -103, -12, 132, -28, -34, -386, 191, 95, 95, 97, -133, -63, 14, -48, 88, 261, -7, 89, 12, 14, 24, 150, 50, -51, -291, -44, -10, 48, -28, 35, 125, 202, 7, -77, -50, -70, 258, -112, -176, -144, 306, 324, -246, -31, 77, -6, 70, 75, -19, -224, -81, 89, -3, -296, 102, -212, 146, 2, 62, 211, 18, 320, -5, -32, 11, -194, -39, -80, -257, -101, 5, -298, -5, 61, -108, 105, 82, 80, 126, 310, -179, -80, 163, 36, 119, -70, 159, -87, 153, 129, -28, 95, -104, -225, -69, 166, 90, -211, 123, 359, 2, -139, 29, 117, -134, 307, 54, 140, 29, -57, 26, 240, -61, -241, 83, 44, -8, -14, 194, -131, 39, -340, 58, 29, 93, 2, 123, -132, 312, 176, -69, 19, -144, 163, -229, -116, 252, 151, -4, 134, 8, -101, 263, 124, -386, -7, 163, 71, 159, 134, 144, 111, -150, 186, -6, 38, -183, 71, 233, -233, 154, 123, -63, 8, -271, -73, 160, 112, 325, -249, -77, 456, 71, -96]
6322i6j72J96J98j59Q8k45K34K3L3j02J14k94J17J01P4k35K78J1p0J60k28J27
6344A53k19o8oL92k96J15r9o2J05O1N8l49K26L51N3l62K2n1q6n3L37l07J42j12
6368e5P9j49J47k5r2m6J91k64K29j15k0R9N6j05R1M39m74j98L10M2K0j54q4K1
6392e7k1J39J67l47J63r5m4K20k23L7J16K10k18k05R1K20l80K13k2M2k87L08O8
6415I5O0k59l5J16K43j71K2l27R9J08R4q3j5K59k89K52m13K34J15J3l68J7K33
6438@Q4j16p7K19J02Qo7j17k34k5L54j93PR5j67J06j24j74L76J1k09k01M01K7
6462H6k41M95m90P8L2Q6p1K0m2J66j67j13J90j74M7J24J49l48K68j09p4J44j21
6485f5QQ6K1r2J80jj57K33k33j77L27l78K6N18n85L18k7O4K7k7j75J45%j12J6
$$ y = [-96, -268, -72, 126, -33, 55, -190, 44, 67, 100, -2, 112, -182, -65, 36, 110, -125, 153, 164, 94, 254, 26, 153, -66, -134, -140, 252, -44, 71, -28, -90, 15, 76, 134, -215, 11, 362, 415, 53, 75, 24, -62, -115, 222, -85, 57, -55, 24, -125, 22, -3, -95, -141, 50, -214, 15, -100, -120, -21, 35, -70, 21, 460, -14, -212, 98, 140, 160, 6, -78, -57, -78, 61, 228, -119, 44, -51, -95, 125, -98, -61, 55, 265, 47, -158, -67, 153, -227, -14, -36, 6, -281, 27, 95, 155, -104, -139, -23, 220, 49, 71, -256, -157, -49, 45, -38, -53, 206, -83, 169, -244, -10, 105, 118, -250, -233, 0, 84, -32, -109, 110, 212, 220, 153, 36, -198, -223, 131, -62, -55, 40, -127, -21, -145, -319, 57, 68, -141, -342, 59, 86, -155, 340, -150, -72, -40, 46, -25, -5, -47, 119, -48, -161, 29, -145, -98, 26, 175, -173, 95, -14, -88, 56, -65, -57, 29, 50, -42, 138, 137, -20, 213, -20, -197, 130, -248, -222, 296, -289, 29, 2, 66, 93, 66, -109, 36, 36, -76, -60]
6510f0J39nk27J50q0R4l4K5K5k58J54L68l49J26j13P0nj67q0K24L31l11M8J1m9
6535B7J28j71k36L05lk71l3L30M0j96J6oOj55K61L0J50o6j99J07r1n8M52n26O8
6560i1J59l10L30L89o13K27J75j71k1j85L05j06m7rK06n59RK90N6j53r6K39O4
6583H8K54r8k30n4L63l01M3r3K15Pj70L63n19Q3k19J63J76J00m00K33j42J37p1
6606g2P8J37j88m0J82K97m89j58L21o3j31M3J00k37j27Q9K50R9m4j26K90j65l8
6629HJ04r4N6J68k11j83J48m3n2r3KO5J14n1j97L54k00j14o8R9J67O3n2k8J55
6654A17l04J42J9r5J36J38k27q5J88r7r1J17Q1k05P6J31q7Q4j6P6j8q4q2J05j63
6679a44J18j10J59J01j40l6J30K1r2O2q9L4j47N7j91K94l0J05r9j98L35r0m%p1
$$ y = [-60, 79, 74, -153, -3, -83, 11, -23, 2, 27, -231, -77, 291, -58, 68, -45, 25, 20, -147, -227, -3, 328, 17, 65, 76, 27, 155, -16, -252, 53, 50, -221, -254, 76, 116, -80, -64, -70, -64, -219, 42, 72, 222, 156, -43, 64, -27, -85, 367, -159, -91, 68, -242, 88, 477, -136, 91, 266, 95, 74, -111, 194, 88, 41, 32, 238, -321, -312, -22, 34, -119, -215, 24, 88, 342, 244, 14, -40, 323, 22, 65, -28, 187, 194, 24, 387, -132, -49, -268, -105, 71, 171, -229, 4, -138, -1, -72, 6, 143, -45, -85, 97, 394, -95, -253, 68, 5, -126, -83, 17, -220, -347, -258, -8, 91, 47, -79, 211, 46, 8, 112, 18, 74, 242, 31, -152, -4, -47, -99, -192, -190, -125, -11, -62, -259, 95, -105, -219, -287, -188, -21, 42, -10, -38, 117, -187, -45, -26, -121, 15, 153, -74, -159, 29, -68, -159, -42, 39, -166, -90, 41, -46, 38, 22, 98, 80, -4, -86, 19, -144, -26, -136, 23, 124, -16, -52, 78, 99, 7, 69, -20, 14, -133, -76, -267, 27, -3, 102, 3, -195, 140, 50, 46, 46, -25]
6704b5J69l26J87J21j33m13M46K5n5R6N2o5p5J78k18K38l4j20J39k05K65N7l64
6727f0L90j61Q5k19N8n5k79J77K55j53K4j11n7K69m64M61n53L98J44k87J54j97
6749a81M42m13q9K23j6N0k72K79Q5Nk7k20K36k07J04k05L44j18J02j00PlP0K31
6773C27l82R9N4k08J44j31J14R4l37N1L0J80j01M2N8l60K25J92n2J4J19j64j49
6796a41M19k15j74K16j97K05k67K59L8J33l66J92M8j95R8J82l76J75j10K20j66
6817b2J76j87k22J61j18K43j57M3M1O0K69l45k2J7J62r1K25j89k71M32j21k37
6839a53K29L13l01j24P5L5K27r4l08M35l17n5n1J06K1l97L70q2K25K8P9Q8n10
6862a61J00J31r3j3J08Q8j27o4J37j08k36L11o6J59k49m3J55n4M4O9k8J7k9k89
$$ y = [-25, 144, -182, 5, 126, -7, -420, 26, 51, -4, 92, 144, 79, 4, 182, -36, 202, 168, 48, 187, -18, 247, 304, -60, 330, 169, 254, 35, 93, 38, -241, -64, 191, 38, 62, -49, -106, 163, -301, 160, -393, 5, 149, -138, 16, -181, 261, -152, -241, -18, -34, 16, -256, 23, 108, 113, 86, -134, 102, -105, -1, -206, 138, 20, 122, 22, 29, 26, 96, 327, -55, 44, 98, -110, 34, -97, 17, 111, -226, -175, -145, 35, -66, -24, 34, -326, -101, 91, 39, 53, 172, 8, -141, 278, 63, -111, 105, -92, 113, -154, 105, 143, 276, -90, 102, 150, -45, 53, 235, -141, 34, -76, 144, -22, 154, -33, -255, -94, -212, 31, -126, -83, -42, 18, 287, -58, -80, -63, 99, 8, 233, 44, -227, 205, 84, -153, 76, 389, 88, -36, 39, 74, 301, 207, -101, 334, 17, -38, -89, 17, 38, -359, 11, -71, 154, 182, 261, 349, -161, -61, 70, -23, -36, 72, 160, 33, -31, 106, -2, -238, 73, 7, 166, -83, -126, 29, -25, 19, 88, 60, 77, 48, -241]
6886b41M05k06j1M7R7m10L75j73K52q0j96K06j59K93l02l5K15k10J90k71N12k94
6908DJ24L4j28k38L0J42J06J4o2K9K7o5k89L38R1j74j38L05j44J69j97k0m7J74
6932H5k03k9K44m2j55Q1l46J46R9k4J56J16J03l25J27J5q6j7p3N5nQ2L20j64j46
6957A4o7j02j1L56j69n7j06K30j74J85J00k72J51j49K69n23M51k60j3J50K74j63
6979A14l63K17J04j86J41k3O6l53L55j08J39Q3k38L70j97n5l41M49k98P0lj52
7001b09K71k03k04L60j90J79k35R5pP4N1R9j38m6rK90j44j42o3J78J03nj08j69
7025a72R4nQ9L8k05K01n9m9o8J21P3o5r5K15j00j81Q6J40O3p0l67L29K40j24J49
7050B78K2m11k36L08J34j5J2J71j78k8M3j17r1J04j03K24r3n7Q9k97M21m74L24
$$ y = [-241, 164, -42, -53, -6, 91, -319, 56, -117, 135, 55, -141, 65, -94, 199, -103, -138, 77, -133, 57, -214, 298, 4, 128, 162, 34, -204, -174, -32, 74, 88, 26, 55, 82, 17, -272, 66, 157, -17, -155, 150, 6, 175, -22, -42, -89, 85, -118, -147, 97, 55, -100, -19, -365, -219, -120, -144, 12, 128, 231, -94, 33, 48, -38, -55, -128, -73, -78, 4, 324, 160, 14, -53, -155, -166, 190, 21, -36, -142, 88, -86, 99, 199, -73, 78, -71, 198, -325, 126, -134, -147, 3, 277, 114, -249, -32, 72, -114, 27, 4, 70, -283, 72, -36, 103, 186, -52, 318, 121, 66, -275, 174, -124, -54, -57, -209, 62, -141, -345, 15, -175, 4, -231, -136, -143, -69, -18, 81, -57, -103, -112, 178, 34, -108, -171, 7, 110, 105, -3, -172, -78, -83, 6, 44, -161, 40, -19, -68, -136, -15, 58, -7, -102, 113, 13, -168, -82, 58, 121, 51, -316, 13, 253, 129, 278, 300, -111, -347, -39, 95, 80, 92, 263, 85, 57, 100, -17, -108, -4, -107, 117, 24, -33, 56, -241, 180, -294, 30]
7073C0j55O4K12j99P9J36j10j88J21P3k28L0K4J87l67l2M28k34N3l2P4j88K68
7096D6J6J72m12J43j30K8N4K05r1l6J87m21L25j52j77j03M36l50L83o3j8K1j40
7119g7j25R9L00j26J82l59J23j54K9n8L5J34k4n9KJ2J09j95p7K26n2J71J14k78
7143d8j2J05p7lQ6n0q1K23J9m4L2l44K56j31L5K06j41q3p3J82p1j49R5J05J02
7168A39L38n54r1L20j45k22N6L27j78o0K2R5k9j47m7P9M5%lj23J36j7J90l15J97
7193A3j12J97k42J50k9n1J3PJ58l42K45K54l88N6J16M0P5k1J6l41K56j00P3L9
7217H2j65J71N3j31K94k16l07K31L1J18N1l47J30l3Q8l3k69K19J64J55j33p4n1
7240B8L3j22J14M3o3k44M6R4J7K67j50q3j07P0Q3p6J40k01O2K31k41R5J97k67
$$ y = [30, -125, -61, 151, -48, 31, 167, 57, -131, -10, 63, -165, -135, -111, 76, -291, -323, 105, -129, -76, -108, -34, -222, 46, 62, 234, -178, -35, -165, -137, -83, 122, 31, -5, 182, -239, 86, -66, -243, -346, 90, -260, 123, 60, 42, 63, -77, -202, -103, 197, 71, 253, -106, 17, -137, -108, -166, -131, 3, -21, -80, -78, -66, 43, -152, -229, -3, -55, 116, 230, -48, -60, 45, -32, -35, 51, 1, -80, 143, 162, 118, 150, -194, 62, -69, -34, 172, 31, -52, -125, 57, -14, -163, -68, 37, 139, 477, -77, -168, 152, 7, -215, -159, 168, -10, -70, -48, 47, 18, -129, -176, -97, -52, -52, -55, -178, -42, -59, 131, -184, 13, -99, 98, -144, 6, -23, -74, -61, -54, 104, -238, 7, 261, -127, -71, 45, 85, 160, 139, 155, -186, 70, -30, 43, 82, -83, 88, 141, 10, 304, 88, -219, 12, 43, 161, 212, -135, -5, -38, 50, 17, -252, -33, 131, 286, 153, 79, 28, 61, -61, 53, 96, 33, -211, -165, -71, -54, 213, 63, -20, -127, -57, 26, -50, 90, -111, -49, 182, -59, 36, 233, -34]
7264c4M9K04k12J79q5j23J10j33j31p2L96k49J4j52K45j17K26j24j82K28K80m75
7286a58k61O02l55K86k9j99j96M88%j52j0l10L13L2Nj42J55qJ03j04l4nLj30j76
7311b82K97j10m1L6J44J25k68o0K36k99K65J91k88L6rj25L24m06M35j29k74K43
7333D1j45N2l7J13j54L37q5k80K73j8Q6j3j74L71k37j95J45j78n1L75M2l9k53
7356b4j49J28K16P0l90m2K48O4j88L8J11PK4n0j7k10J50k40K53q8k7O1r4P0Q6
7381GP3l8J72k47j82L65o1l03L95k68j4J32J39P4l86K53k76K18j78L51m20M34
7403B40r2J4m90M10j07r0J67q7p9j88L41j50R6j77M16J07l38J20m7j31j87n9K20
7426i1P0K31j30j44J56j17J62o4l31K00J89k3j37K5q5J19N7j29j76L05M0l71L44
$$ y = [-34, 15, 219, 7, 186, 101, -22, 88, -45, -176, -248, 148, -101, -87, -239, 6, -111, 115, -9, -191, 37, 317, -158, -419, 183, -172, 114, 85, -114, -310, 178, 178, 26, 16, -294, 19, 51, 56, -86, 69, 61, 164, 60, 26, 21, 24, -106, -282, 15, -95, -136, -100, 44, 169, -99, -159, 77, -222, 43, 234, -54, -18, -27, -152, 172, -234, 201, 72, -202, 41, -104, -52, -89, 24, -130, 207, 122, -158, 115, 97, 183, 170, -4, 367, 130, -65, 80, -98, -149, 226, 268, 229, -24, -173, -45, 171, 241, -149, -191, 57, 121, -67, -29, 82, 89, 113, 63, 46, -164, -14, -254, -1, -89, -116, -55, -149, -79, 7, 80, 42, 214, -33, -215, 150, 89, -214, 181, -87, -101, 31, 170, 244, -142, 111, -165, 53, -125, 226, -194, 240, 148, 162, -328, 82, -25, -115, 52, -35, -114, -302, 39, -111, -15, -192, 224, 331, -7, 113, 66, -65, -252, -311, -91, -21, 210, 80, -64, 92, -25, 137, 73, -258, -58, 131, 108, -29, -4, -89, 30, 87, -42, -218, 87, 127, -244, 100]
7449A00j38J10R6j98K34K11j78k82m1m3L48k01J43j69j85J92P3Jj91k50L11q9
7471a46Q9J64M1m58L37J15j21P1K9j88o2K79j42n5j41J38k4J93l14J43P9j04q8
7494a65N0J87P8l9l74oK82K36l92K60j85j99L28k24o8L94k20RM9nJ31l10K96R5
7518B08p0Q1q1k88O2RK2K90k94K2K9k44M03j66n2j2j98K55K2J2k42L00j82P4r5
7543a35K02m14K25K32R0Q5l00J69l87K08J30K39l73J04j90K87j70j27O8J55j73
7564g5oK6m7k7J44%j36j53K64k65l6L26j80K15K0k50J86J61j69j39r4M46k51J16
7588G6N3j41R7k05P5K30j68J63k89J23k45K03r3K56o8J8k29L51q2J47k57J14Q8
7611B17k07R5kJ40o99M75O3j61L2l8L7j42J18J58k67R3K12l56K22Q8N3j01J85
$$ y = [100, -38, 72, 168, -30, 204, 415, 237, -45, -86, -129, 219, 18, 161, -8, -193, -1, 72, 73, -118, -368, -57, -146, -57, 107, 148, -310, 27, 142, 21, 92, 121, -67, -129, 150, 8, -47, -188, -50, -74, 119, -195, -52, 27, -77, -165, -115, 72, 150, 111, -263, -269, 13, 249, -143, 117, -68, -267, 61, -163, -231, 163, -57, -48, 1, -4, 127, -183, 113, 208, 138, 219, 138, -150, -88, -79, -57, 233, -61, -39, -10, -254, 149, -17, -69, -81, -279, -24, -2, 10, -232, 68, -114, -40, -135, 67, -347, -122, 110, 200, 285, -15, 154, -233, -25, 105, 344, -29, 75, -115, 172, 2, -125, -57, 98, -75, -81, -55, -102, -129, 15, 15, -121, -274, -10, -275, -311, 15, -165, 50, 70, -180, 6, 167, -2, -141, -235, 211, -40, 76, 129, -12, 85, -120, -45, 185, 17, 180, -109, 14, -231, -28, -121, 135, 67, 85, -144, 207, 125, 272, 15, 129, 217, 10, 105, 103, 243, -456, 19, 82, -79, -47, -85, -48, -190, -72, 86, -181, -88, 124, -232, -10, 78, 131, 30, 215]
7634B15j11N1k74K67j70K50l21o3N33m95J87j91M8q6J01L30k93r4j5K5R9J6pj47
7658a45k0J41M5p0Q6P3k44o7L41J02m62M72j40j72O7R8j24j36J53J40k13K34j35
7681B4J23R3m42J05J44K77j92m8k03J93j9l7m9P3O4j84L46l88j19J67k2R2j07
7704a09J82m54L07L17l28j9jJ89j31J9n6L41j80j13J89k73J87J01Q7m87K3m5K40
7727a4M1j27J69o2Kq7n8k6K50m3K93m68J56n1p5J20n8r7L38k44K8L6n7%L3k50
7753b51M22l54L20r4j06L01k61L1L1j94L14Q8k21J28k97%J60L3k03Q8M6P4p9j06
7777a30K93j93MJ79j88O3p8Q6k31nK82K0n1q1p1J44k71J45j13K07k56K14p2R9
7801dL7On8l5M3k1K02j92K2m3J55k92J24M1L98m01k68K68l4L12j47k06M3oK21
$$ y = [215, 104, 155, -119, 148, -22, 228, -93, -156, 377, -118, 69, -122, -74, -160, -59, 271, -22, -116, -131, -106, -7, 9, 2, -145, -165, -24, 21, -49, 37, 110, -134, -201, 140, 242, -220, 252, 112, -60, 7, 105, -19, -155, -2, 138, -75, 159, 24, 147, 240, -202, -97, 47, 324, 132, 84, -119, 74, 55, 18, -31, 42, 106, -78, 268, -120, -239, -72, -94, -2, -109, 73, -381, -74, 243, -85, -104, -105, 84, -47, -28, -84, 257, 77, -36, 153, -120, 67, 168, 255, -232, -209, -254, -14, 27, -100, 69, 7, 9, -78, -136, -162, 88, 45, 338, -130, 26, -25, -100, 20, -38, -135, 203, -41, -13, 23, -34, -34, -1, -251, 171, -183, 137, 43, -63, 238, -23, 8, 39, -155, 159, 247, 26, 154, -143, -143, 17, 50, -153, -65, -19, 55, -24, -130, 163, -30, -26, 153, -35, 28, -50, 36, -195, -200, 82, 102, 51, -30, -101, 43, -228, -83, -196, 11, -245, -31, -103, -4, 33, 39, -19, -54, -11, -32, 170, -22, 0, -43, 112, -180, -56, -15, 383, -18, -286, -18, -52, 260, 113, -93, -50, -56, 165]
7826A65k15L04k72Q4K10l69Q7p8J1K91l13J17K2k90K55j1P6j4j79J52j66m2J47
7849b8l23L78l11K99J16k92J85j55p5r5O8M00k87M03k9k28k06R9k1k1l3J41l24
7872c39K89r7J83k26L93j29j0k97L48q5j99L38K0l04J34j55P6K05o3Q0j60J87
7894A89l13JJ68J0k19K10j97p0K85r8O1O9k04M6J70l9K5J53j38j05l6r7J57M0
7918F8k7m4P4j50J33j35N0q2K04K15l39j69k38M16L02m04K06l49J26J79j95J95
7940C6J6k44K51M2j15J67k17J46k0O0J68k19J74m74J21J47O2p8L10k42j51j06
7962a66K97M0m1j76k1N7r2j2J8K20j13K2J28k77J07o1j70J81N4k27L78j59l1l9
7986h3K9K10l48J62p7n4K19j37M7l4P4q0k2J04L4j38J37l12J97J25l8j19q5K49
$$ y = [165, -50, 254, -18, 66, 276, -93, -6, -84, -73, 218, -95, 22, 44, -246, 9, -2, 74, 60, -119, 33, -133, -175, -28, -351, 27, -284, 15, 131, -161, 24, -131, -206, -301, -233, 167, -120, 283, 254, 26, -180, -81, -102, -123, -156, -15, -339, -50, -147, 36, -190, 203, 74, 64, -233, 115, 30, -169, 169, 189, -115, 19, -136, -60, 145, 82, 162, 2, 189, -124, -123, 45, 55, -164, 46, -151, -221, 64, -34, 27, 96, -108, -62, 108, 69, 94, 247, 109, 4, -32, -129, 28, 68, 41, -3, 71, -79, 54, -81, -31, -113, 91, 306, -33, -202, -440, -24, 278, -126, 80, -269, -143, 36, -159, 36, 52, -192, 59, 101, -14, 153, -64, 82, 62, 122, 290, 71, 245, -229, -108, 39, 101, 23, 333, 91, -60, -166, 131, 171, 130, -46, -67, -10, -102, -114, -96, 124, 11, 33, 161, -116, -9, -70, -240, -59, -5, -232, 146, -13, -44, -83, -54, 156, -192, -30, -107, -161, 58, -79, -32, -66, 8, -72, -94, 10, 44, -94, 43, -269, -72, 53, 15, -104, -189, 60]
8010F0j18J9k53P8J36L6K4J13N9l46L3J0J16R8p9J57k02P6n4J03l23P3L68l34
8034a50L98l28P9j58j0K21k43j66L46N02o69J34j13J17j04K03q8p8J49l9J11m2
8056G2k84L00m1J37k3q0k04l2J94k97M78k13p5%k3K4m0K42p2j67J89%j68K13m4
8081H6l18O9K90M9j74k1N7n5k50K62j22n3J33J41l32k5K95k16J99P7n6M9l2j8
8105C5r8P0J44k80K29j28k25J67K3j14JJ46Kl1J23j67J48j79K81j43m5K07Jl2
8129A35l08L57k01Q3J81k88J18mk59K16L45k53k31K16k12J22l05L14j18J90j2
8150H6n0k13J65K0J14k11J49K21l66J50O4q6k75L31o1R5k58q4J17J79o6n4J43
8173A10r1J4j4%j47J17j60P2P5o8K29l28M01k36q1J68j02K40
$$ y = [60, -58, -39, -292, -214, -78, -42, -18, 95, 154, -192, -159, -149, -33, 65, -14, 143, -59, 17, -37, 66, -257, -184, 184, -150, 248, -80, -1, -159, -169, 52, -191, -357, -11, 491, -178, -44, -157, -40, -144, 59, -29, -107, 42, 3, 114, 72, -212, 88, 47, 184, 161, 81, -123, -155, 39, -258, 220, 7, -68, -68, -91, -67, -107, 135, 63, -104, 85, 85, -83, 130, 86, -232, -163, 127, 176, 2, -19, 38, -17, -267, -5, -127, -180, -47, 94, -238, -263, 32, -184, 15, 92, 36, 85, 53, 35, -63, 7, 151, -129, 100, -28, -253, -86, -63, -177, -176, -30, -28, -59, 64, -103, 45, -134, 147, 4, -41, 166, 167, 135, -173, 184, -17, 66, 247, -41, 77, 73, -186, 30, 375, 122, -109, 107, -105, 17, -288, 26, -92, 98, 86, 36, -177, -12, 8, 122, -89, 60, 281, -85, 65, 129, 43, -232, 99, 38, 133, -125, -209, -92, 87, 21, -33, 110, 19, 33, 19, 19, -128, -11, -171, -99, -24, -92, 137, -191, 210, -26, -107, 61, -41, 199]
8191A99
$$ Imaginary data points
##PAGE= N=2
##DATA TABLE= (X++(I..I)), XYDATA
0@%%%%%%%%%%%qJ6j6J6k4L2l9M7n6O6p4Q8j11J35j52J76k08K40k76L16l60M10
33B18m65N26n93O68p50Q39r37J044j161J289j429J581j746J928k129K346k584
50a355K846l134L455l811M209m657N162n740O409p190Q121r252J0657j2462J4880
65H138j8303K3560l2762N3537j90275J7078K70228o6851P4164O4383j21404j57142
77g5649J4301m0792k4942O4165L8947J3637J43438M2055j25816l2403L0210j55041
89a07890r9843J17063P2843l040J42589R4640j23555j06448j3472q8197l7828
100a53138J07891N5460j3984P0130M1498n1639j107j1673j26322m7436P1065p560
112f6815L516J52811P1454r2598k2435P678j30893q6633Q0808N9533J3410P4766
$$ y = [0, 0, 0, 0, 0, 0, 0, 0, 0, 0, 0, 0, -8, 8, -8, 8, -16, 16, -23, 24, -32, 34, -40, 48, -63, 72, -80, 96, -112, 128, -148, 168, -192, 218, -247, 279, -314, 354, -396, 443, -494, 550, -611, 678, -751, 830, -916, 1012, -1117, 1229, -1355, 1491, -1643, 1812, -1999, 2210, -2447, 2715, -3025, 3384, -3806, 4315, -4937, 5720, -6742, 8138, -10165, 13395, -19367, 34170, -156105, -139027, 131201, 64350, 138514, 202897, 81493, -75649, -61348, -102140, -127082, -62917, -23970, -10333, 133105, 175160, 49344, 16941, 47151, -107890, -207733, -90670, -17827, -20867, 121722, 216362, 92807, -13641, -27113, -115310, -153138, -45247, 10213, -3771, 66359, 107857, 56218, 55111, 43438, -82884, -130320, -59255, -66815, -63299, 89512, 160966, 68368, 45933, 53611, -77282, -163915, -83107, -23574, -10164, 64602]
124F4602L6148m4896o865j1113q0699l0170J4364m3499K0416J41889N6572m6520
136G0229J6215j1544j33648o7086N2395J0251L270R5012O9714j6832j5883l3300
148C8793p7553l5402K841j5885L7245Q8586K2057l698M6441k1520j18760n1607
160h8462J9903j7018J4966R9995N9395j5785n607j5921o2403m7163j6662r079
172h3841L5829O2959K5274K2754L3705l5962p9422k3234r177m4076J6121Q9391
184A0321M7916K245J7308j0836o5080n1192j6138m798J8991L8367L5483M0175
196F2762K4388l2888m9182k1631l4133l9386K6316O2712K3371J5661L6888j901
208G2977n4526m4016k1448j7868R53L2779M5518L8790J4276j5987k0709k5405
$$ y = [64602, 100750, 55854, 48989, 37876, -42823, -72993, -58629, -102128, -81712, 60177, 116749, 70229, 86444, 74900, -58748, -125834, -73439, -63188, -59918, 35094, 104808, 87976, 72093, 38793, -38760, -74162, -71321, -87206, -49961, 38625, 60682, 56984, 103425, 81905, -36855, -88462, -68559, -85577, -70611, 29384, 88779, 72994, 67387, 51466, -10937, -58100, -74762, -83841, -48012, 14947, 40221, 62975, 96680, 60718, -18704, -41938, -51115, -95191, -79070, 10321, 58237, 60482, 77790, 66954, 1874, -49318, -65456, -70254, -51263, -12896, 22587, 62762, 87150, 54262, 5080, -16551, -50684, -90070, -63754, -1042, 22329, 37990, 74878, 72977, 18451, -25565, -47013, -64881, -63928, -31149, 14369, 53159, 67435, 51448, 30739, 5334]
220E334n0058l5934K0702L6572K0426L7757M3459q429m6440l1485k3659k9541
232f1296o445L0683M2700L2151J7468K522j3436l6489m7457k1887R952J2318K0649
245a8567M6874L8690p275k5417j9069l3107m2218r091K9581L3126K5570K6673
257D5770J8215j1039m0255l9448j8645p744k93K7568M9908K9943k954q646j3996
270B8384l8470m1505p575J8314K0155K4882L5017K1512j1560l1113k5782k1817
282b9558k2303l421K8008L7094K1596J2320Q423j4717m0054l3483r848O67P596
295c7680K9517M1240K0624p467j6397j9184l1657l1689k772K5501K6005K0601
307A6642K5951J5377j8293l6840k5140j3526j3144L541L2062L7262J6369L125
$$ y = [5334, -44724, -80658, -59956, -23384, -2958, 34799, 78258, 69829, 23389, -8096, -31755, -61296, -67741, -37058, 5642, 37793, 55261, 57783, 44347, 7858, -39599, -61486, -51534, -39216, -18567, 28307, 66997, 59722, 34305, 15236, -17871, -60089, -69180, -39599, -6473, 19097, 45770, 63985, 52946, 12691, -26757, -45402, -53146, -53439, -25871, 24037, 53980, 51026, 42380, 28384, -10086, -51591, -59166, -40852, -20697, 4185, 39202, 60714, 49154, 18041, -7741, -29558, -51861, -55282, -27274, 9820, 31416, 43736, 52159, 37442, -2612, -36095, -45943, -45276, -37680, -8163, 33077, 53701, 46234, 29837, 10653, -21004, -52693, -55465, -29964, -3959, 16642, 42593, 57970, 39677, 2837, -22303, -35829, -48973, -45432, -13370, 23892, 40261, 43386]
319D3386j928j9125l8283k9866k535J3134J5648K5115L2990J5902j4096k4597
331A5745k1505k4552k1905L601L0582L0146J8232J2616L812k0546l5854k3906
343c3534p118m78J1287L1325L3328J0320q214j3034j9976l0706j9998O704J8792
356b1302J7457K1986K4231M397k1558k5842j7482j5537j0110J0574K9371K5238
368B1423J0907M753j564k0940l4814k0201L572Q479J1712K7789K8303K908j5342
381B6985j4615j7502k5994j4913J1766K4359J9961J5516J2242r4k0503k8224j5491
394b6507n018m124Q614L1767K6921L577n027n757k1893l0496j0946P630J1026
407b0233J5587K3566J9401J270j7130k3398j7684j3005q274J1286K9746K0430
$$ y = [43386, 41458, 22333, -15950, -45816, -48351, -35217, -19569, 5546, 38536, 54438, 40342, 15745, -5760, -30312, -52217, -48616, -18034, 12112, 30344, 42960, 46772, 26226, -9628, -33534, -40652, -41130, -29843, 1482, 34810, 45130, 36916, 23882, 3906, -26800, -46798, -40094, -21302, -3845, 18141, 42372, 46769, 25211, -631, -18113, -33650, -43760, -33186, -3815, 21423, 32330, 37083, 35519, 14579, -20235, -40436, -36864, -28385, -16673, 11116, 39419, 42327, 26985, 12370, -5132, -31126, -46039, -34273, -9914, 10047, 25563, 37805, 37711, 17208, -11016, -26507, -31525, -35649, -27035, 4732, 31653, 35230, 30203, 24446, 2553, -27943, -38889, -31259, -20233, -4646, 18920, 38321, 39591, 22461, -937, -18621, -31626, -39900, -28614, 1132, 21562]
419B1562O013P449j438k7566l0183p942J13L442J9569K8214J4196p56q800j4491
433I382j9035j8759j0642R948K3343J5993J1839J6252k984k8266k1093n689j1568
446c1279n733K1469K8761J2435M659R40j4358k3708j8845q143N918J5355J2410
459a19J6794K0237k340k3266j4929r480k0075m614K3968K0859O118J2478Q415
472C4046j3874k0996j4993j1642k555J0220J4105J8827J7754j412j3603o577j4480
485e180k6389n031J8936J2051J0063K4063R395j7835j7647j0089j4914q672P820
498b3429J4093J7330J6936L363o257o879j9491k3971j284J2114K281J2254K9128
511B6188Q350j4313q132r598k3802j1944R726J2305J2062J6279Q139m36n024j8712
$$ y = [21562, 27575, 35024, 33586, 6020, -24163, -32105, -31992, -28550, -8981, 19233, 33429, 32673, 23873, 9382, -9653, -28412, -39054, -29106, -5763, 10230, 22069, 38321, 35337, 7071, -14022, -19711, -31279, -37012, -15543, 13218, 25653, 30312, 31252, 16894, -6814, -25659, -33802, -27884, -12529, -119, 16675, 36912, 34572, 11306, -3623, -13103, -33178, -37792, -13824, 7035, 13153, 25631, 34046, 20172, -824, -15817, -27459, -30014, -19794, -5689, 13138, 30892, 29480, 15877, 9300, -5180, -31569, -36600, -17664, -5613, 4450, 28513, 37908, 20073, 2426, -7663, -22577, -31249, -23429, -9336, 7994, 24930, 28293, 22036, 15157, -4334, -28305, -29589, -17475, -15194, -2940, 26188, 34538, 20225, 12093, 2495, -21307, -33251, -23525, -11220, 842, 17121, 25260, 24824, 19800, 1088]
525A088k1487l826J358r71J8688K9158L881q435N99j1112k8261j0767P860N433
539a6794J0213K1101J1684j727o507j4659j5396n923n248k578J8339K2455L586
552A8546K277P075j5643k8530o701L683l011Q687K3272J2693L12j316j0211j6886
566e753j1273p710p61J6018J6307N336R469Q736j6396k2779n263n067r884J1241
580a7779K5522R868J406M011p146j7027j3162o644j875R600J1178R729J3919O085
594B7685j3698j4352m538j2577j2786J1051K0299P423P807J0921o497j8721j2627
607a0610p896m500N704J1536J1867J3453M363q872q615p943j6501r922J1486J2662
621c788M696J3067J3196p411j4829q263r431r945J688J1696J3210J1121N044k625
$$ y = [1088, -20399, -24225, -22867, -23838, -5150, 24008, 27889, 19454, 20053, 8941, -19320, -30087, -22227, -16794, -6581, 14520, 26204, 24477, 17970, 3311, -12085, -18008, -23256, -25834, -7495, 14960, 18546, 20823, 27898, 12255, -16275, -22976, -19293, -22304, -13617, 9655, 22348, 22660, 21344, 11133, -5753, -17026, -24736, -25497, -9479, 6828, 12164, 21633, 30369, 13973, -8806, -14069, -19136, -29020, -17779, 7743, 17611, 19017, 23028, 15882, -1145, -14307, -20951, -22826, -13226, -2048, 7681, 21600, 27685, 13987, -365, -4903, -17480, -30266, -19215, 1084, 8507, 16314, 27235, 20738, 2017, -10610, -18506, -23006, -17302, -5766, 6101, 19554, 23917, 15045, 6430, -1513, -18014, -27936, -16450, -3788, 908, 13975, 27171, 19760, 4931, -3332, -12763, -22708, -21020, -9324, 3886, 15007, 20051, 17426]
635A7426n292j0316j7215p094O365M555N905J7865J2925n944r642n811j2745j3801
649b2819J154J0098J0251J0538R036J803n163j1987j4223n878Q46P84Q065J7349
663I854R026l057k172l981j5055j4244N08O066N796J0721J2733M622m491j0119
677F207j1148q395m941p31J0153J5533P054J794K428n539j6693j1643m46P02L371
692a2294J2858J3816M506l194o368r203j0261q223l05R179J0969O821O568M244
706A9113o133j4019q673l187m332K220J2962J2199M554Q27k251q448j2610q535
720a6313p37N235P844Q459J0261M350o204r972p244p562o672L645J1604Q850N346
735A0890M892Q1r090j2254o704k426R33N084J0913J0673L175l698n191o551j0356
$$ y = [17426, 12134, 1818, -15397, -22491, -16126, -11571, -5666, 12199, 25124, 19180, 9538, 3727, -9018, -22819, -21665, -11567, -1316, 9222, 18258, 20061, 14898, 2911, -11312, -17190, -16344, -15560, -7495, 9854, 18880, 15823, 13651, 9670, -5385, -19629, -19121, -13055, -7259, 3462, 16195, 20817, 16326, 6207, -4941, -13336, -18277, -19008, -8855, 6678, 13732, 15526, 17954, 12415, -4278, -15921, -16367, -15665, -12294, 564, 14380, 18886, 15692, 9324, 121, -10140, -18363, -18668, -9489, 1480, 8301, 14869, 19113, 12980, -1039, -9712, -12899, -17231, -15011, -2049, 10150, 14704, 15531, 13280, 4832, -7778, -16313, -17050, -11815, -3971, 4488, 14749, 19099, 12895, 2923, -4321, -11883, -18555, -14910, -3306, 5544, 10890, 15782, 15863, 6773, -5481, -12185, -14611, -13678, -8594, 2319, 12992, 16167, 12469, 7278, 727, -9629]
750i629p750K481Q528O588P002Q774J188q596j0040o484n568k847M637J1403J0011
765I698M055J22k692p922j2085o169J592L889N407R523R147Q82n899o244p138
780c834q294m339M467R335P195N519M350p46q352j0783n533k045j26N934J0833
795C581Q857J141k560l613q339j0207m598L721O073O661Q091O020j096p890p765
810a923n856m609j798N854J0057O995K792Q58k683q894r525l681J011K495O023
825b884R102P227o59m467n568o898p711k343M747P441O243N701L796k205q616
840B906p943m817k680Q86O925R623N732R33j770l948q130q379k197L267M262O373
856A043P644M775k247o631n874n383n140j149O668Q041N541L562J450m318q843
$$ y = [-9629, -17379, -14898, -6370, 218, 7220, 15994, 17182, 8586, -1454, -7938, -13506, -16353, -11716, -313, 9698, 13753, 13875, 11183, 3261, -8824, -14993, -13401, -9512, -4105, 5418, 14565, 15447, 9548, 3304, -3834, -12128, -16467, -12000, -2665, 4530, 10049, 14399, 13653, 5301, -5482, -11015, -13060, -13186, -7252, 3581, 12438, 13579, 11019, 7406, -933, -11140, -15738, -12017, -5944, 717, 8808, 14828, 13732, 5842, -1923, -7779, -12388, -14186, -8332, 1725, 8720, 11512, 12370, 9687, 793, -8732, -12413, -11402, -8907, -2884, 6218, 13445, 12786, 8319, 2751, -4147, -11858, -14201, -9454, -2013, 4230, 9931, 13727, 11522, 2906, -5037, -9854, -12534, -11648, -4723, 4900, 10632, 11565, 9795, 5847, -2283, -10662, -12859, -9592, -5330, 1043, 8687, 13462, 11215, 4584, -1290, -6673, -11813, -12962, -6294, 1747, 7288, 10850, 12300, 7982, -861]
871h61p314l118O67K790O621Q680M996j562m148m973p254o659k51N731N994N015
887D354N482K643m157p361n829l773k471J482O758P834M327P92j452l981p878
902c230o523j140K653L260O462P590K816l012m913n506n746m033J100N820O334
917A932M865L410L58m697p454o060j868M2K792O723P331K415q38k608m782p762
933f201m902J364L975M712N186N480J356m063o461m642l872k605J947O975P092
948E341L053Q19n49n178q020m627j57J667L960O689O138J252k927m552m816n259
964g166l139J862N516N070L740L330N06n343o747l938j984n65L417O846N539J743
980H687p59k354n515o083l113P20L860L736N194M822M07m647m619l946m833j975
$$ y = [-861, -8175, -11293, -10626, -7836, -1215, 7465, 12461, 10899, 6751, 1778, -5476, -12135, -12386, -6655, -661, 4354, 9836, 12479, 8322, 961, -4868, -8641, -11112, -9630, -2872, 4962, 9289, 10081, 8629, 4648, -3230, -9753, -10893, -8240, -4980, 1482, 9072, 11888, 8876, 3963, -1543, -7289, -11322, -10222, -4402, 1932, 6797, 10207, 10565, 5868, -1586, -7646, -9514, -9472, -6680, 43, 7374, 9789, 8951, 6343, 1561, -6201, -11103, -9739, -5764, -1052, 4134, 9614, 10970, 6907, 446, -4196, -8068, -10673, -8726, -1751, 5341, 8394, 9213, 8664, 3486, -4534, -9161, -9318, -7651, -3691, 2998, 9136, 10388, 7461, 2909, -1907, -7166, -10305, -8443, -2927, 2143, 5883, 9213, 9719, 4376, -2371, -6309, -8293, -8858, -5441, 1405, 6944, 8687, 7928, 5574, 59, -6024, -9137, -8417, -4557, -821, 4373, 9195, 9602, 4955, 336, -3610, -8443, -10418]
996a0418M150N977M691L102J766k200o044n835k993l41J981L457O044M826M37
1011H600k971k930m164n798k095K846M068L566N059L195j180n396m599l999k752
1026h550M90L943N717M747J582j042k039n416n702k042J700K292L560O113L603
1041H956j540l384l603m403l867k03L035N311M170K382Q93j777n318n456k172
1056f976J71P26L554O738L141p18j056k725n735m804j63K163L066M810M385J607
1072H184j689m759m561k620k155M60M407N628K707L57Q16k696o015m081m61N17
1088e961J905M202N212K228j026k856l924l780l610J86L676M383K945K651J688
1103G919l177n342l447j645j330J438N120M649J782O62j658l406m860l374l57
$$ y = [-10418, -6268, -291, 4400, 7502, 9268, 7068, 1024, -4811, -7804, -8145, -6164, -2707, 3337, 8163, 8600, 5629, 2699, -1465, -7263, -9358, -6512, -2444, 1122, 6181, 9376, 8196, 2800, -1799, -5798, -8550, -8060, -4117, 1600, 6347, 7929, 6887, 4848, -568, -6270, -8312, -6612, -4320, -760, 5353, 8956, 7416, 4032, 429, -3974, -7841, -8044, -5009, 302, 4472, 6854, 7747, 5970, 652, -4804, -6976, -6805, -6079, -2525, 4213, 7354, 6636, 5580, 2855, -2880, -7684, -7847, -5684, -2618, 2192, 6577, 8184, 6495, 1736, -2825, -5445, -7600, -7140, -2733, 2895, 5602, 5959, 6775, 4079, -1936, -6017, -6478, -5961, -4056, 146, 5358, 7586, 6560, 3704, -220, -4000, -7610, -7424, -3748, 635, 3580, 6231, 7919, 4742, -600, -4047, -5692, -7022, -5584, -464, 4185, 5967, 6629, 4971, 1565, -3295, -6669, -7026]
1118g026K404L025L578M000J746k641m306k810k690k746J464M503L991K183J527
1133F202P0l573m129l654j164M12K260M345M537J889j765k601k838m193k837P46
1149f293L930K634L380K679K99l169l899k821k434n89J966M017M314J765m04q63
1165D512l180m772k580M97J875J934M180L529K54k399k997k466l297j836J647
1180e099M040L343K110J729o36l279m523k424n09N54J712M594L677L07j432j559
1196B605l180l953j506J013K691K772K946K306j74k801l509k391j871n54K128
1211c478L922L172J377K34j005l659m099j671J14J292K680L757L041Jj937l029
1227G12k741l100m68J826L094K734J977J651j020l523l515j773m01j2K454L861
$$ y = [-7026, -4622, -1597, 1981, 5981, 7727, 5086, 780, -2030, -4720, -7466, -6002, -1499, 2492, 4675, 6202, 6272, 2699, -1430, -5084, -6248, -5836, -3576, 769, 5306, 7195, 5430, 2829, -9, -4202, -7039, -6293, -2363, 271, 3651, 6330, 6629, 3460, -439, -3260, -5694, -6283, -4317, -300, 4014, 5779, 5375, 4512, 1332, -3440, -6020, -5523, -3648, -1714, 2466, 5995, 6249, 3850, 853, -1613, -4910, -6746, -5099, -1059, 2284, 4394, 6123, 5487, 2208, -2315, -4739, -5248, -4694, -2982, 1612, 5289, 5596, 4164, 2605, -575, -4528, -6034, -5021, -2330, 442, 3388, 5694, 5520, 2719, -790, -3181, -5052, -5606, -3478, 444, 3616, 4993, 5227, 4222, 563, -3536, -5207, -5093, -3801, -1121, 2636, 5677, 5678, 3741, 712, -2029, -5129, -5597, -3771, -677, 2057, 4034, 5685, 4665, 1142, -2373, -4146, -4547, -4559, -2105, 1756]
1243A756K442O53n47j771l672l152j049J143J949K632L081K200p07k966k613k707
1259c328j588j59K340L807K328J172L37j496l603l068j356L49J016K751L468K297
1275E267o55j752k575k244k914l38K220K506K533J509J630j103l009l078j943
1290c946o64L56K686L873J681N68q32j678l409l037p26J320K088K423K867J522
1306E092j019k701k076k224j859O07K437K632K205R79K11j711l145k742r09j44
1322d367J648K521L158J751n09j417k080l106k302M6J992K131K331K154R75k019
1338B907k502k470j396j113R78K881K884J540j4k52k113l152j955k06P53K066
1354a164K065K606R72r90k213k053k196j300P39K055K279J642J523j31j849k739
$$ y = [1756, 4198, 4851, 4304, 2533, -1139, -4291, -5340, -4197, -2248, 384, 3465, 5665, 4958, 1992, -621, -3328, -4916, -5075, -2735, 1072, 3400, 4572, 4909, 3413, -190, -3258, -4614, -4265, -3249, -498, 2970, 5267, 4612, 2860, 285, -1959, -4873, -5211, -2991, -485, 2048, 3557, 5187, 4084, 1075, -2003, -3946, -4610, -4254, -1568, 2305, 3986, 4554, 3722, 2044, -1365, -4402, -5128, -3808, -1720, 703, 3570, 5092, 4073, 1372, -704, -2928, -4787, -4180, -1743, 889, 3094, 4073, 4284, 2573, -572, -3314, -4223, -4367, -2719, -198, 2960, 4711, 4202, 2785, 705, -2401, -4703, -4657, -2665, -534, 1797, 3951, 4926, 2907, 405, -2065, -3461, -4574, -3596, -715, 2169, 3709, 3695, 3443, 1330, -1822, -3777, -3983, -3230, -1164, 901, 3507, 4479, 3489, 1276, -777, -2973, -4273, -3534, -1479, 800, 2442, 3965, 3834, 1985, -754]
1370g54j992j219N0J440K471K938J184n80j299j934l074j294L71J488K042K110
1386A948K011J64j482k658j902j473p40J243K563K437J040P47p64k142k620j929
1402c557k47P90J599K618J979P66j141j469k107k347j248J149K023K385J351J172
1418C716l19j914k660j654p84M47Q58K966J816R29j99r58k410k332j168M17J427
1435a822J696K164J471J69j855j877j690j442o96J403K407K105J073N53r54k146
1451E59k549j181k1K19K038K651J474J06j023j458j608k262p17J229J834J670
1467I61J596R16r32j645j714j511q00j18J839K425J493M86j81j099k130j905p63
1484c082L04R31J825K102J513p81j367j377j942j539N9J499J596J912J226M1n19
$$ y = [-754, -2746, -3965, -3915, -2475, -4, 2934, 4118, 3538, 2239, 305, -2769, -4063, -3692, -2204, -162, 1948, 3959, 4123, 2641, -17, -1919, -3392, -4132, -2889, -326, 2111, 3151, 3898, 3134, 992, -1628, -3557, -3804, -3014, -1415, 1203, 3182, 3948, 2807, 1338, -769, -3116, -4364, -3215, -1192, 1193, 2544, 3716, 3397, 1483, -1177, -2831, -3615, -3168, -2310, 656, 2472, 3401, 3202, 2244, -166, -2498, -3666, -3249, -1822, -126, 2038, 3509, 3678, 1823, -54, -1744, -3186, -3882, -2479, -72, 2033, 3106, 3659, 2705, 559, -1990, -3171, -3192, -2973, -935, 1716, 3190, 3296, 2273, 815, -793, -3055, -3772, -2543, -709, 961, 2557, 3473, 2541, 896, -818, -2329, -3129, -3247, -1408, 1017, 2510, 2996, 2815, 1716, -414, -2319, -3082, -2778, -1847, -22, 2080, 3593, 2812, 1445, 68, -1874, -3413, -3354, -1855, -259, 1653, 2879, 2920, 2401]
1501B401k282j950q83n0O53J416K561J125k67q59r52k083k019J85Q63J292J700
1518H51J743J010r73j661j932j286q86L96J508K178J470M41n9j326k299j650m69
1535b944L96J239J577K310J95l92p17j859j754j140L93J375J524J525Q29K28j064
1552A721j948j453o52k41K77K367J632Q65L48j069j279k099j123k58J103J266
1568e43J917J222N02j145j607j224j273o92K62K286J459Q73Q11l01j675j893j132
1585b153p27L81J052J999J615O55n46j193j044j672j179N53J233J079J603J137
1601B793L5j467j765j363o60n11J179K013J438P55q6q40j147k073r91L93J104
1618a193O61J505J590j9p79j207j510j095p54R07J292J859P69L26p3j652j506
$$ y = [2401, 119, -1831, -2714, -2764, -2111, -695, 1866, 2991, 2724, 1865, 913, -1170, -3189, -3004, -2141, -849, 851, 2594, 3604, 2631, 970, -962, -2248, -3134, -2738, -1230, 948, 2418, 2859, 2800, 1474, -825, -2475, -2944, -2548, -1309, 268, 2578, 2773, 2381, 1664, -195, -1949, -3089, -2696, -1321, 203, 1728, 2557, 2785, 1721, -227, -1680, -2332, -2573, -2296, 71, 1703, 2568, 2916, 1847, 568, -1531, -2654, -2912, -1809, -543, 1374, 2596, 3098, 1953, 346, -878, -2151, -2843, -2581, -295, 1164, 2037, 2848, 2547, 872, -1021, -2153, -2880, -2499, -1447, 552, 2167, 2822, 2276, 1083, 39, -1633, -2812, -2259, -1026, 53, 1656, 2793, 2828, 1361, -404, -1767, -2427, -2938, -1759, 254, 1692, 2447, 2361, 1521, 374, -1699, -2690, -2297, -1193, -532, 973, 2563, 2544, 1765, 558, -952, -2047, -2801, -1894, -602, 1257, 2026, 2352, 2279, 627, -879]
1635h79j251j75M07N96K183J251M0n5r85j816j281o01L40J283J343J111R75j84
1653B302j164j809q57p19k1P44J911R73M63L82m89j765j591k40k8O46R97J592
1671A327J022K53j341r55j263j062p08J049J761P26R25P40n21j704j282o68j07
1688a808k75J577J682J050j00m38p85j340j510l10P22R82Q47J387P01m63j076
1705H43j191r67q56j8J314J148J331L69K4n83j571j423p49N45N62R37J748Q90
1723B353l66p11j125j071j153o6R98J058R94J087N17j230j281r08p28j52K68J301
1741b15J456M93k7k60o49j744q56j61M97N57J026J792K33n39j286o37o47j184
1759b151J23J641P64R59M59M35j311j341j004l37K85K70J564J339k0lm76j044
$$ y = [-879, -2130, -2305, -1898, -1302, 881, 2132, 2172, 2117, 1132, -684, -1965, -2566, -2226, -943, 400, 1511, 2486, 2302, 1138, -671, -1528, -2247, -2268, -1524, 387, 1360, 1823, 2205, 1716, -49, -1640, -1880, -1908, -1262, -265, 1327, 2349, 2602, 1261, 306, -957, -2019, -2727, -1678, 83, 809, 1734, 2474, 1953, 249, -1033, -1701, -1808, -2083, -506, 1176, 2226, 2126, 1688, 903, -437, -1947, -2257, -1535, -553, 294, 1681, 2382, 1919, 843, -348, -1315, -2171, -2189, -875, 273, 1604, 1973, 1997, 1414, -157, -1580, -2329, -1784, -1222, -285, 1463, 2353, 1987, 1276, 151, -920, -2073, -2139, -1141, -83, 911, 1998, 2515, 1285, 4, -904, -1632, -1784, -1516, -215, 1241, 1734, 1707, 1447, 798, -946, -1802, -1963, -1466, -909, 117, 1909, 2142, 1603, 317, -320, -967, -2151, -2028, -387, 377, 1336, 1795, 2230, 919, -422, -1426, -1763, -1478, -1208, 356, 1695, 1675, 1672, 1196, 152]
1777A52j328m37j06J004N69J145Q48J81p98j328o87n56m26J83J354J391O61k72
1795A550m18n66j526j015K7O43Q54Q33J353J28n56q66p36r22o88L89J326P25P72
1814A307L31j06q42j251q95j78L29N10J148J157J91l62m61n78j354p13m2R37P23
1833a49J053Q01N8p95j008p41r74j52O83J189R62M74L72o38r83j067o26Q4L01
1852a156L93J098J528J1r51o50n98j025n24L47J094O55J008M63k24p65r98r86
1870a280k84K26O15J278P00J00q1l65j363j027k35M77O77M27J022Q66l05p18j031
1889c01m93n29k25N14J172P50L60J53j97r32j318k52j91K99O43J286O32l0k94
1908A047q70o01j226o9O36P24Q50J187k75k57r05q36n69j69J56R93N26Q15J49
$$ y = [152, -1176, -1613, -1719, -715, -146, 999, 1847, 2028, 1230, -98, -785, -1341, -1767, -1584, -230, 1161, 1822, 1550, 1132, 566, -960, -1975, -1948, -1305, -451, 382, 1735, 1863, 1307, 441, -295, -1217, -1905, -1516, -190, 535, 1307, 1638, 1532, 690, -561, -1456, -1634, -1305, -795, 353, 1510, 1701, 1339, 878, 300, -1054, -1767, -1809, -872, -149, 904, 1705, 1763, 968, -40, -781, -1755, -1907, -1224, -35, 927, 1401, 1773, 1135, 152, -915, -1541, -1457, -1156, -763, 335, 1863, 1874, 923, 273, -325, -1350, -1874, -1527, -433, 222, 1230, 1693, 1469, 704, -294, -1280, -1564, -1338, -723, 555, 1255, 1355, 1274, 909, -454, -1481, -1716, -1239, -562, -135, 887, 1753, 1448, 730, -301, -794, -1323, -1548, -1034, 138, 888, 1248, 1401, 1204, 272, -1046, -1298, -1489, -1190, -547, 739, 1371, 1341, 1047, 177, -424, -1650, -1719, -1083, -359, 491, 1678, 1403, 1146, 241, -595, -1164, -1333, -1177, -184, 342, 1157, 1306]
1927A306j81m51r09r19k31K29L88Q77Q52M69l09o62o46p03q32K41P32J022O09
1946H82L60L1j59r57j162j30qlJ095R60K14L07p94m91j048l94M7O56N13N15R15
1967A349J19p69o74o30m25o01P62O55R32L23M79Rr57j200k69p61O98L04P98R50
1987A092N82o49l84n63q82l29k26P04P00Q37M41J06m16j151o57n21kP12N04Q49
2007G47M24P4o21m50q72m98p0P78j08Q72J030j75l57q72l44p07l5K17N77J028
2027F38L46j12L09q03r75o71K30p0O16M64J157L08l54n18r62l44n67L42K75Q18
2047A27O39K15j56k34q97o41J3m70O94J091K07M86mm5j128p18n4k07M29N22P40
2068F09N15R1p92n40m57n46nJ97J108N52j12M80J33j291m59k28l13N0M39J133
$$ y = [1306, 1125, 674, -235, -1154, -1385, -1156, -768, 109, 961, 1430, 1121, 459, -187, -890, -1722, -1481, -749, 273, 882, 1242, 1273, 1114, 157, -1005, -1135, -1143, -1146, -51, 909, 1123, 1430, 636, 145, -903, -1297, -1250, -594, -81, 434, 1349, 1468, 699, 25, -605, -1030, -1631, -869, -214, 718, 1041, 1520, 1529, 572, -628, -897, -1658, -960, -656, 142, 1092, 1674, 1025, 641, 78, -804, -1133, -1359, -655, 45, 882, 1323, 1429, 1013, -138, -795, -1316, -1318, -606, -102, 747, 1171, 1245, 624, 174, -698, -1196, -1266, -488, -596, 276, 1306, 1131, 774, -98, -442, -1149, -1184, -967, -390, 638, 984, 872, 1181, 378, -597, -1268, -1038, -1108, -492, -28, 1129, 1437, 1083, 565, -397, -741, -1308, -966, -691, 127, 766, 981, 825, 591, -306, -947, -934, -1404, -710, 381, 588, 1074, 1070, 1025, -103, -821, -875, -1082, -653, -131, 609, 1124, 1215, 423, -117, -574, -1120, -1125, -928, 180, 732, 620, 1100, 1233, -58, -517, -745, -1058, -1008, -569, 564]
2088E64M46K33l90m41j045p7q72P43O75L32N77O25l49j018j53m76j71n03Q08N53
2108F1N60N76K8p16m06p12n16J17N61N78N50N73l58p09k30k97o42l20O38R01k58
2129b1Q97L05n35n67q39jn17O50L21P81L53K34l60m42n64o47o3L59M81K93J023
2150A141k00k81o02l92m87k52R1O01L31M89M96P9k70j178k20m7j87K92O39O73
2170G16K24N5l90o02n19m36K54N0P77L77L32K22n37n98l46k52m35O23K43Q04L15
2191H77Rk34n83m11n71K63K81NN15O31K83o94k56k61o86k22K46Q45K77J40N67
2212A021J43n99p76l62j63j94K78P19O65L26k52m48m61r15Q3%M16K71M71N21J04
2233H48m95m84m9m84m23L36P70J23M85O2l03j49q96j74N4O19k13P82O77l35l36
$$ y = [564, 1010, 1243, 853, 412, -633, -710, -1582, -839, -164, 168, 745, 1370, 1021, 3, -150, -626, -797, -1300, -492, 61, 621, 1197, 1225, 509, 103, -609, -1125, -1008, -447, 131, 681, 1254, 896, 187, -43, -340, -982, -1302, -664, 237, -21, 876, 1181, 646, 79, -760, -761, -1278, -628, -307, 474, 827, 1061, 701, 259, -305, -952, -1015, -656, -175, 118, 1141, 941, 660, 58, -334, -821, -1073, -982, -381, -50, 439, 935, 1014, 744, -434, -654, -701, -888, -596, 43, 716, 940, 995, 605, 3, -516, -952, -698, -648, 129, 506, 838, 1060, 523, -75, -421, -673, -1108, -485, -242, 562, 877, 886, 652, 69, -342, -913, -650, -369, -364, 151, 782, 1065, 371, 115, -146, -832, -1054, -808, 37, 314, 454, 1021, 1164, 565, -211, -573, -736, -930, -652, 67, 732, 1058, 806, 358, -103, -1018, -935, -935, -519, -248, 223, 744, 848, 353, -131, -180, -664, -1087, -751, 19, 142, 627, 689, 386, 237, -659, -833, -779, -160, -373, 409, 1086, 751, 415]
2254D15j77k63n45r7L14J90P29L7K95k17l48m92o54J10k3N51N64M17j7k49k20
2275C20n47l18j44J69J61J29O81L82N4m11l80n92K2l60L34O77K47J55L8P5o33
2296E9o21qJ01j9M47L50N14j30k55k34o46k38j4J69M31O0P48J42k41n04l66l85
2318f40l80L74K00P26L52o0J76m09n24j51k68J37L3N06L02M08p5m06l93m70l00
2339h62J63N19L76Q7M97R4m64l65l36m42L8L48M26M22J33J32k85l42m72l31O5
2360e99o9M92L40M89ml18j99o18N8k42J51L77L49L32L59l74j96o38n48Q0J85L37
2382b56M63K14M09l35l95j21j48l87L10J36K72K69K84k68r2m07m98J27k86J45
2402e64L99P85j62k5r2k76l76n52J69O36Q8J58L65j26j81m6l90o10L71k08N84
$$ y = [415, 238, -25, -570, -667, -353, -163, 566, 603, 898, 681, 333, -159, -813, -703, -726, -175, 389, 806, 789, 540, 320, -227, -545, -689, -520, -359, -230, 451, 833, 887, 476, 96, -496, -474, -834, -500, 177, 424, 579, 617, 692, 59, -562, -570, -469, -488, -41, 309, 823, 693, 438, 204, -442, -680, -694, -525, -94, -34, 714, 856, 615, 111, -255, -640, -1020, -646, -446, 280, 632, 572, 748, 339, -185, -336, -604, -467, -434, 72, 374, 782, 707, 301, -92, -562, -862, -699, -180, 196, 283, 780, 874, 410, 45, -291, -733, -695, -347, 79, 501, 634, 766, 481, 139, -333, -664, -599, -668, -176, 164, 653, 649, 331, 132, -486, -428, -670, -519, -142, 207, 539, 898, 524, 328, -310, -858, -778, -593, -256, 207, 421, 830, 495, 100, -21, -169, -556, -246, -110, 162, 431, 715, 447, 355, -52, -550, -423, -709, -564, -165, 620, 458, 433, 341, 65, -311, -863, -694, -58, 30, 188, 553, 427, 246, 200, -190, -800, -429, -637, -53]
2423e3P78l15R8K7j13j009m8j7J53K55K78O80j26j97j60n01l26j29O04J8J47O95
2445G39k29j94L5k55m07l1k86K27O08J25K42J4j73k78n97l11M20R4J54L63L07
2466E67Kl31j40k14k47p8p7N17K41J86L20j52n50m72p9n0J10L70N37p0K70k14
2488D46k02n09k79j39M85J96J80L19j96J49l42m59n6j47J91J42L46L40K22k72
2508D15j01k34m69l1j17K07K30M07M78r9l12l47l46l16J11J24L21L10J14K03k47
2529C01j74l78L2No1J14N07J73N4j40m81j3n52j04L03M89j02N10l02K23k35k71
2551a02j44k33J39n5K93K92M24k35l59j04j11l01J55p7N51K60M4j8k88o7n71j41
2573f48J41L06J06K36J24L80l99j69l17l03K14l2K35N23j41Q3k49j72J81l36j70
$$ y = [-53, 725, 410, 508, 535, 422, -587, -635, -652, -499, -244, 34, 714, 588, 391, 231, -270, -596, -725, -121, -103, 44, 739, 510, 316, 351, 96, -311, -342, -628, -401, 207, 332, 574, 588, 415, 137, -460, -771, -351, -257, -103, 260, 567, 569, 238, 98, -116, -363, -441, -518, -1, 240, 426, 746, 594, 44, -428, -507, -557, -447, -77, 460, 390, 660, 446, 244, -265, -544, -683, -198, -2, 178, 497, 301, 450, 108, -351, -407, -554, -363, -221, 125, 465, 687, 415, 314, 80, -389, -420, -537, -330, -100, 307, 785, 686, 374, 27, -319, -635, -524, -400, -79, 231, 345, 548, 301, 127, -251, -219, -214, -275, -161, 346, 519, 573, 433, -48, -61, -613, -717, -414, 75, -27, 483, 181, 404, 169, -102, -246, -479, -340, -395, -102, 190, 614, 379, 20, -84, -195, -496, -341, -418, 133, 393, 437, 419, 131, 64, -507, -648, -507, -201, -95, 141, 265, 645, 246, 77, -240, -543, -329, -361, -126, 397, 256, 339, 90, -82, 99, -237, -407]
2594d07K12J71L09k2L23j14l53m25r9j22L6L42L77J77qj49O6m14k26j79l6L34
2616b07K32L77q8k0k16m82p3M6o0M32J92J61j0K74n21Rk39k79L18k20L42N01k35
2639B34K05k24jl95l25J16K1M40K46j59K28p0j76m39k20K11N7J38K84J78K08l28
$$ y = [-407, -195, -24, 285, 263, 586, 472, 119, -306, -405, -527, -491, -149, 228, 405, 397, 248, 314, -100, -326, -505, -541, -207, 25, 402, 314, 294, 78, -404, -477, -431, -491, -59, 133, 294, 284, 558, 37, 46, -193, -472, -154, -374, -32, 469, 234, 439, 215, 214, -181, -506, -390, -369, 71, 317, 158, 386, 316, 140, -299, -519, -308, -251, -113, 171, 349, 557, 229]
$$ [...]
8191a89
##END NTUPLES=NMR FID
##END=
